##TITLE=1H_L3L30-SeO2-f7(mix)
 CDCl3,32 sc, 
 5.02.2021
##JCAMPDX= 6.0         $$ Bruker NMR JCAMP-DX V2.0
##DATA TYPE= NMR FID
##DATA CLASS= NTUPLES
##ORIGIN= UXNMR, Bruker Analytische Messtechnik GmbH
##OWNER= root
$$ XWIN-NMR		Version 3.5
$$ Fri Feb  5 10:46:41 2021 Russian Standard Time (UT+4h)  she@DPX200
##.OBSERVE FREQUENCY= 200.1315066352
##.OBSERVE NUCLEUS= ^1H
##.DELAY= (6, 6)
##.ACQUISITION MODE= SIMULTANEOUS
##.ACQUISITION SCHEME= undefined
##.AVERAGES= 8
##.DIGITISER RES= 18
##SPECTROMETER/DATA SYSTEM= spect
##.PULSE SEQUENCE= zg30
##.SOLVENT NAME= CDCl3
##.SHIFT REFERENCE= (INTERNAL, CDCl3, 0, 15.7039)
##AUDIT TRAIL= $$ (NUMBER, WHEN, WHO, WHERE, WHAT)
$$ ##TITLE= Audit trail, XWIN-NMR		Version 3.5
$$ ##JCAMPDX= 5.01
$$ ##ORIGIN= Bruker BioSpin GmbH
$$ ##OWNER= she
$$ F:/spectra/data/she/nmr/H-F/1/audita.txt
$$ ##AUDIT TRAIL=  $$ (NUMBER, WHEN, WHO, WHERE, WHAT)
(   1,<2021-02-05 10:45:33.25 +0400>,<she>,<DPX200>,
      <created by zg, POWCHK disabled, PULCHK disabled
       configuration hash MD5:
       00 E9 B6 7A A2 85 ED C7 34 08 36 98 17 FE 4E 26
       data hash MD5: 16K
       07 FA 17 C2 2B F6 41 17 12 6D 2C 65 EA 0B F1 CD>)
$$ ##END=
$$ 
$$ hash MD5
$$ 4C 1B 31 9F 43 6E 22 E6 E1 FF 2C C6 E8 7F FC 56
##$RELAX= 
##$RELAX= 
##$RELAX= 
##$RELAX= 
##$RELAX= 
##$RELAX= 
$$ Bruker specific parameters
$$ --------------------------
##$DU= <F:/spectra>
##$EXPNO= 1
##$NAME= <H-F>
##$PROCNO= 1
##$TYPE= <nmr>
##$USER= <she>
##$AMP= (0..31)
100 100 100 100 100 100 100 100 100 100 100 100 100 100 100 100 100 100 
100 100 100 100 100 100 100 100 100 100 100 100 100 100 
##$AQSEQ= 0
##$AQ_mod= 1
##$AUNM= <au_zg>
##$AUTOPOS= <>
##$BF1= 200.13
##$BF2= 200.13
##$BF3= 200.13
##$BF4= 200.13
##$BF5= 200.13
##$BF6= 200.13
##$BF7= 200.13
##$BF8= 200.13
##$BYTORDA= 1
##$CFDGTYP= 0
##$CFRGTYP= 5
##$CHEMSTR= <none>
##$CNST= (0..31)
1 1 145 1 1 1 1 1 1 1 1 1 1 1 1 1 1 1 1 1 1 1 1 1 1 1 1 1 1 1 1 1 
##$CPDPRG= <>
##$CPDPRG1= <>
##$CPDPRG2= <>
##$CPDPRG3= <>
##$CPDPRG4= <mlev>
##$CPDPRG5= <mlev>
##$CPDPRG6= <mlev>
##$CPDPRG7= <mlev>
##$CPDPRG8= <mlev>
##$CPDPRGB= <>
##$CPDPRGT= <>
##$D= (0..31)
0 1.2 0 0 0 0 0 0 0 0.06 0 0.03 0 0 0 0 0.0002 0 0 0 0 0 0 0 0 0 0 0 0 
0 0 0 
##$DATE= 1612507532
##$DBL= (0..7)
120 120 120 120 120 120 120 120 
##$DBP= (0..7)
150 150 150 150 150 150 150 150 
##$DBP07= 0
##$DBPNAM0= <>
##$DBPNAM1= <>
##$DBPNAM2= <>
##$DBPNAM3= <>
##$DBPNAM4= <>
##$DBPNAM5= <>
##$DBPNAM6= <>
##$DBPNAM7= <>
##$DBPOAL= (0..7)
0.5 0.5 0.5 0.5 0.5 0.5 0.5 0.5 
##$DBPOFFS= (0..7)
0 0 0 0 0 0 0 0 
##$DE= 6
##$DECBNUC= <off>
##$DECIM= 32
##$DECNUC= <off>
##$DECSTAT= 4
##$DIGMOD= 1
##$DIGTYP= 9
##$DL= (0..7)
0 120 120 120 120 120 120 120 
##$DP= (0..7)
150 150 150 150 150 150 150 150 
##$DP07= 0
##$DPNAME0= <>
##$DPNAME1= <>
##$DPNAME2= <>
##$DPNAME3= <>
##$DPNAME4= <>
##$DPNAME5= <>
##$DPNAME6= <>
##$DPNAME7= <>
##$DPOAL= (0..7)
0.5 0.5 0.5 0.5 0.5 0.5 0.5 0.5 
##$DPOFFS= (0..7)
0 0 0 0 0 0 0 0 
##$DQDMODE= 0
##$DR= 18
##$DS= 0
$$ [...]
##$SUBNAM2= <"">
##$SUBNAM3= <"">
##$SUBNAM4= <"">
##$SUBNAM5= <"">
##$SUBNAM6= <"">
##$SUBNAM7= <"">
##$SUBNAM8= <"">
##$SUBNAM9= <"">
##$SW= 16.9725356469052
##$SWIBOX= (0..15)
0 0 2 0 0 0 0 0 0 0 0 0 0 0 0 0 
##$SW_h= 3396.73913043478
##$TD= 16384
##$TD0= 1
##$TE= 0
##$TE2= 300
##$TE3= 300
##$TEG= 300
##$TL= (0..7)
0 120 120 120 120 120 120 120 
##$TP= (0..7)
150 150 150 150 150 150 150 150 
##$TP07= 0
##$TPNAME0= <>
##$TPNAME1= <>
##$TPNAME2= <>
##$TPNAME3= <>
##$TPNAME4= <>
##$TPNAME5= <>
##$TPNAME6= <>
##$TPNAME7= <>
##$TPOAL= (0..7)
0.5 0.5 0.5 0.5 0.5 0.5 0.5 0.5 
##$TPOFFS= (0..7)
0 0 0 0 0 0 0 0 
##$TUNHIN= 0
##$TUNHOUT= 0
##$TUNXOUT= 0
##$USERA1= <user>
##$USERA2= <user>
##$USERA3= <user>
##$USERA4= <user>
##$USERA5= <user>
##$V9= 5
##$VALIST= <valist>
##$VCLIST= <CCCCCCCCCCCCCCC>
##$VD= 0
##$VDLIST= <DDDDDDDDDDDDDDD>
##$VPLIST= <PPPPPPPPPPPPPPP>
##$VTLIST= <TTTTTTTTTTTTTTT>
##$WBST= 1024
##$WBSW= 4
##$XGAIN= (0..3)
0 0 0 0 
##$XL= 0
##$YL= 0
##$YMAX_a= 137882
##$YMIN_a= -161591
##$ZGOPTNS= <>
##$ZL1= 120
##$ZL2= 120
##$ZL3= 120
##$ZL4= 120
##$ABSF1= 10
##$ABSF2= 0
##$ABSG= 5
##$ABSL= 3
##$ALPHA= 0
##$AQORDER= 0
##$ASSFAC= 0
##$ASSFACI= 0
##$ASSFACX= 0
##$ASSWID= 0
##$AUNMP= <proc_1d>
##$AZFE= 0.1
##$AZFW= 0.1
##$BCFW= 1
##$BC_mod= 2
##$BYTORDP= 1
##$COROFFS= 0
##$CY= 11.3945322036743
##$DATMOD= 1
##$DC= 2
##$DFILT= <>
##$DTYPP= 0
##$F1P= 15.9154993809931
##$F2P= -4.1035820241983
##$FCOR= 0.5
##$FTSIZE= 0
##$FT_mod= 4
##$GAMMA= 1
##$GB= 0.15
##$INTBC= 1
##$INTSCL= 1
##$ISEN= 128
##$LB= 0.24
##$LEV0= 0
##$LPBIN= 0
##$MAXI= 10000
##$MC2= 0
##$MEAN= 0
##$ME_mod= 0
##$MI= 1.114404
##$NCOEF= 0
##$NC_proc= 0
##$NLEV= 6
##$NOISF1= 3.799351
##$NOISF2= 2.8
##$NSP= 1
##$NTH_PI= 0
##$NZP= 0
##$OFFSET= 15.70392
##$PC= 1
##$PHC0= -10777.89
##$PHC1= 34.60094
##$PH_mod= 1
##$PKNL= yes
##$PPARMOD= 0
##$PSCAL= 0
##$PSIGN= 0
##$REVERSE= no
##$SF= 200.130013532006
##$SI= 16384
##$SIGF1= 3
##$SIGF2= 2
##$SINO= 400
##$SIOLD= 16384
##$SREGLST= <1H.CDCl3>
##$SSB= 0
##$STSI= 0
##$STSR= 0
##$SW_p= 3612.71676300578
##$SYMM= 0
##$S_DEV= 0
##$TDeff= 0
##$TDoff= 0
##$TI= <>
##$TILT= no
##$TM1= 0
##$TM2= 0
##$TOPLEV= 0
##$USERP1= <user>
##$USERP2= <user>
##$USERP3= <user>
##$USERP4= <user>
##$USERP5= <user>
##$WDW= 1
##$XDIM= 8192
##$YMAX_p= 0
##$YMIN_p= 0
$$ End of Bruker specific parameters
$$ ---------------------------------
##NTUPLES= NMR FID
##VAR_NAME=  TIME,          FID/REAL,        FID/IMAG
##SYMBOL=    X,             R,               I
##VAR_TYPE=  INDEPENDENT,   DEPENDENT,       DEPENDENT
##VAR_FORM=  AFFN,          ASDF,            ASDF
##VAR_DIM=   8192,          8192,            8192
##UNITS=     SECONDS,       ARBITRARY UNITS, ARBITRARY UNITS
##FACTOR=    0.0002944,     1,               1
##FIRST=     0,             0,               0
##LAST=      2.4114304,     0,               0
##MIN=       0,             -161591,         0
##MAX=       2.4114304,     137882,          0
$$ Real data points
##PAGE= N=1
##DATA TABLE= (X++(R..R)), XYDATA
$$ [...]
1981c23n25K89l5l53L26j84p5P17k84l6J56p14M32j08k59R58n99j00Q03r00K81
2002e33N16p27O09J27l63Q70m14l36N11m96J41K63J08L60j26K00K12p63M09Q3
2022F51l39O03o8m35O94m47k8R9l30N06k43j60N02k07k66K47n57M7J55k21L75
2043E78q9l5L3m78rQ3n37N56j36o6L00n05L34m8n01N32k29l82M82j04k12J90l48
2066e91K37J9m73O37o9k01K48r4k7J62m10M21J37m42O75q23J61O86p20O58p4o67
2088e50P71J77r26R64k73j01L96p28M34J74k72O01j25k55O92q57J34R2n27N91
2108D12l13j89O78l75l8L96q39N70j61n43O36n72j15M93o36L27L07p44P45k07
2128a68k65L31n47M07J63o16M70j44k59J81n6L50J79m94L56j41m11K44j76J64
$$ y = [-323, -848, -559, -594, -947, -621, -805, -880, -163, -447, -483, -327, -1041, -609, -717, -976, -18, -617, -717, 86, -814, -533, -17, -744, -135, -8, -371, 499, 85, -251, 260, -236, -95, 168, 276, 636, 510, 710, 922, 159, 568, 651, 312, 915, 847, 412, 1106, 659, 631, 730, 400, 906, 663, 503, 1005, 798, 532, 779, 222, 269, 424, 203, 578, 489, 454, 487, 9, 0, 83, -454, 102, -34, -100, 200, -305, 29, -19, -520, 12, -217, -599, -117, -221, -433, -243, -591, -354, -335, -808, -171, -240, -441, -193, -287, -314, -152, -562, -141, -4, -446, 229, -594, -433, 253, -467, 191, 117, -550, 221, 398, -528, 436, 163, 62, 458, -270, 164, 338, 66, 667, 542, 287, 979, 122, 256, 348, -179, 412, 99, -90, 588, 213, 175, 571, -268, 302, 141, -402, 234, -338, -453, 40, -596, -269, 38, -706, 39, -168, -433, -102, -649, -242, -79, -695, -225, -369, -628, -447, -503, -153, 26, -468, -112, -253, -664, -420, -596, -432]
2148d32M56k95q1M36o24O67j04n09Q83l42l36N38k5l64N02j72K18m8O6M11n30
2169C15R9K62j56j16J70l20N05k64j54N70o33J05K49l66k1L90m38O58n46o3M36
2190F82n86n4K28l9R8l65J58M8k04k37L0m07K29L39l47K96j43j62J92l24L94m86
2212f60j63M22k09L8J98j68k74L14j35K05l6J7O7J21L9j09l28J76M5K81j60M12
2234I3m0k98k0Q5L43J2l15J78K22k54j97M13n4J49l35L40j00O5J22l4r4L06l76
2257B11J11P0k72M68l32n5J90k92m0J20K11m79N5L03j57j26R3k80J76j78n8L03
2279D2r5n5R3o2k28J6m19M97N6j09J96j79m9L32m18K86k72Q8M30m95K45J55l13
2302b58L87l00M37k50p6K27L29o93L90l9p9N07j74q8K38j80K02j60j2J05j58q0
$$ y = [-432, 24, -271, -352, 84, -540, 127, 23, -486, 397, 55, -281, 257, 232, -132, 370, 198, 416, 368, 434, 845, 315, 414, 676, 520, 404, 574, 254, 759, 495, 341, 911, 278, 383, 632, 266, 245, 635, 197, 855, 309, 246, 682, 96, 42, 270, 231, 329, -36, 122, 170, -34, -271, -241, -648, -419, -80, -427, -131, -274, -436, -244, -568, -174, -660, -823, -401, -610, -572, -374, -542, -816, -502, -637, -432, -468, -451, -384, -263, -224, -333, -661, -485, -440, -159, -319, 93, 53, -245, -265, -180, 163, 175, -140, 38, 260, 6, -191, 222, 168, 317, -18, 322, 222, 287, 409, 375, 281, 587, 211, 322, 392, 120, 588, 256, 201, 391, 99, 59, 179, 390, -89, -34, 269, 112, -14, 79, -201, -25, -203, -261, 42, -53, -108, -15, -77, -305, -289, -708, -211, -155, -264, -68, -247, -296, 36, -382, -96, -368, -280, 150, -345, -100, 55, -258, 129, -171, 266, 16, -60, 167, 496, -197, 193, 154, 75, 582, 408, 320, 558, 378, 580, 420, 408, 513, 355, 275]
2324B75K69m32M05j34o1O21o87J91Q3l61%R0k28R6L4N2l0k33K27j33k15j4j75
2347c60L01k12n7M3k26R7j28R7O7n4R3O4K03l46l1j55j29M8m6K41j73L45j38K00
2371b56j47J47o4l13K60J75M4l45M07k90J97P4K11l5K07m03L07j03n9O8K31j33
2393A80N8l6m9J70K12k41K19j42J31J72j44N8j2k79L40l39l1M20k17n3K52j32
2415E37l90L32j96j14L1r1J4J43j85K62l26R9p2k30K65m30Q0K21l33J69j52J95
2437a71r3o4J82m3Q8k45K00j55J20N3k80L60k0k53L54jR9j93k9J60M1l67K57L34
2461C34j85jO8K5N3m00J78J55P5L5p7m4K89l47K90j2o40M75R3j17L26k46l36M76
2485D67o38L57J08n35M13l65n6N26n92J90K56l70J44Q9n60N69j55m44Q24p21N99
$$ y = [275, 544, 112, 517, 383, 322, 943, 256, 447, 530, 169, 169, 259, 31, 127, 161, 213, 183, -50, 177, 44, -171, -185, -360, -59, -271, -328, -285, -511, -414, -542, -445, -378, -432, -339, -275, -72, -418, -449, -604, -733, -685, -731, -490, -663, -318, -456, -256, -403, -256, -320, -633, -373, -198, -154, -499, -92, -382, -185, -111, 100, 65, 272, -131, 176, 73, 14, 82, 313, 180, 238, 202, 153, 323, 535, 294, 513, 371, 502, 674, 530, 588, 576, 297, 637, 298, 267, 687, 470, 417, 669, 537, 147, 479, 283, 169, 200, 109, 123, 266, 81, 343, 17, 116, 44, -186, 79, -351, -271, -50, -383, -214, -366, -171, -264, -328, -146, -189, -101, -346, -146, -301, -181, -128, -408, -48, -68, -321, 33, 32, 131, -62, -91, 69, 110, -257, 0, 334, 149, 148, 216, 241, 294, -106, 72, 227, 302, 337, 260, 216, 505, 158, 448, 436, -204, 271, 364, 247, 573, 327, -9, 467, -171, 186, 294, -241, 172, -193, -249, 277, -315, -125, 131, -239, -95, -6, -566, 3, -152, -596, 228, -493, 106]
2506A06l27k44K85k56j92L93m92J24M79p80N99Q2l77L68k40rN81n75M1L13k82
2527d03O0K46j04N84k14k58K82j40K22P1j61J29j78J07K88k19K44j75r4K99K01
2548G87n80L96mk23K89k20N1J35J6m8R0n68L46p2n9O3kj11J76k03q2J23j76l16
2572a92K57m7Q8r3J8P8o61M75k65j29N43m19n2N41n14J70L9m90N33l03j8L66m82
2595e57M58j27l37N26Pm10L77p6j33M9r0J67j85m9L63k22J14J12j73L82O5n27
2617b66M39p1p6N37n61L9K54n6R2k82j40O04l07M34l11m15L33n29J69Q88n91l69
2639a85r1k65O17m04j91P50O7r75P27l22L0L91n24K44K56o58L06R8k83K57o1j33
2661c49M50m60j1K62l32L90l78J06M51m17J21R2l12L00R5k18K88k73K19K80p24
$$ y = [106, -221, -465, -180, -436, -628, -235, -727, -603, -124, -904, -305, -223, -600, -232, -472, -481, 100, -475, -434, -121, -403, -343, -97, -201, 383, 169, -89, 193, 53, 275, 346, 185, 314, 136, 243, 531, 312, 556, 381, 287, 586, 787, 207, 603, 599, 376, 665, 445, 496, 631, 647, 599, 689, 121, 467, 395, 336, 399, 397, 286, 462, 259, 177, 300, 124, -192, 65, 18, 106, 13, 31, 109, -552, -77, -342, -471, 72, -347, -399, 142, -372, -202, -163, -653, -120, -423, -441, -75, -557, -99, -226, -563, -37, -30, -440, -63, -139, -272, -223, -313, -146, -331, -380, -17, -239, -125, -13, -186, 196, 261, -266, 173, 102, 26, 563, 2, 41, 295, 239, 331, 49, -91, 513, 206, 640, 329, -86, 247, -282, -113, 775, 184, -185, -276, -541, 76, -328, -519, 231, 298, -677, 50, -272, -242, 149, -375, -131, 125, -533, -227, -129, -412, -155, -216, -349, 101, -359, -370, -108, -440, -50, -428, -322, 129, -288, -167, -75, -387, -87, 8, -210, 78, -195, 24, 304, -420]
2682d20R42k31j70L20l84J91K27j99J9J60J02J6k44J5J3O0J68o1k10M9l2j56L28
2705E03k02N1L04m36M25l35j89M78m79l45P34m10N10l07m32L85n18K26k41R3j47
2726c32M33m32P6J61l97J52p4k82M87k57j90N25q31O86k45k83L87l10J37O07n48
2747e30J42L61o53M64j2n68Q45m67K88L66n57J43L59n81O77l60l34Q32p88L90
2767A7L57p88R04j42n48O24k32j28M28o18O55j77n02P26j57k90M55n65L6O28p84
2788a01N24o8n16P67p04P6J47k97K33K57n78N99l88l78Q92q85P3M70n00K64Jk61
2810c73M48l51J15M60q25N07K19n84L26j17l22O62l87M54k76l26N26j69k30J57
2830h6JRJ34k56K20J42l14P50l58m26Q49p80K12K43m98O04m6l35M04k35k63P08
$$ y = [-420, 522, 291, 121, 441, 57, 248, 475, 276, 295, 455, 557, 573, 329, 344, 357, 417, 585, 524, 314, 363, 331, 175, 503, 301, 352, 656, 220, 645, 310, 121, 599, 120, -225, 509, 99, 609, 302, -130, 255, -263, -37, -278, -185, -332, 101, -331, -255, -94, -491, -339, -413, -695, -208, -465, -655, -130, -961, -275, -520, -803, -416, -726, -589, 18, -530, -388, -27, -680, -216, -228, -796, 49, -418, -130, 236, -321, -178, 181, -400, 277, -83, -417, 415, -373, 17, 374, -414, 490, 348, -200, 424, 192, 64, 492, -126, 529, 352, -150, 576, 419, 129, 584, 19, 55, 683, -101, 423, 355, -161, 606, -98, -22, 125, -172, 61, 318, -260, 339, -49, -427, 465, -420, -347, 123, -377, -113, -112, -373, 75, -276, -161, 299, -526, -19, 200, -384, -58, -175, -497, 165, -222, 232, -44, -370, 156, -13, -243, -86, -85, -76, 58, -198, 22, 164, -150, 600, 242, -184, 665, -115, 97, 340, -158, 446, 400, 65, 469, 234, -29, 679]
2852F79m84j38J04j85N77m18j19N43m02j43J87m32L43j09j52M38m27M09p3l04
2872a06M4J03m46K53k75j65P83q32J65K65n09J62M25l21K81l03j5M97o99L55J77
2893a61m25N75m18j23L97k39O2L69n92M89M5p45R58j92nK87m26L74J10m13M72
2914C99j78n95R38m14L4L87p43N15q5k66O29m73j0N58o37L34K49o92L78J5l03
2935D0N06k40K0L08o22M00op15N33j78k21N95n63R9M03p63K56R0k74O58l96k5
2957i5J12m06K80J50p53P22k84j31N10p16K51N64p10O97j55n22P45o66K00L77
2977A70k73k9J41j35M28j25k25J48l19K96L24o23L42K26m47L20r6L4N55n93J30
2998B49l3j91N30n07k75M09j21j7M44l46J44j89j98L16j88j57M50m38J15J38l70
$$ y = [679, 195, 57, 161, -24, 553, 135, 16, 559, 157, 14, 201, -231, 112, 3, -149, 289, -138, 271, 198, -106, -62, 41, -405, -152, -427, -592, 191, -641, -476, -211, -720, -558, -133, -454, -173, -476, -491, 6, -693, -338, -161, -586, -11, -429, -552, -155, -394, -332, 37, -555, -66, -21, -766, 192, 0, -5, 282, -144, 230, 340, -73, 399, 221, -374, 564, 150, 184, 571, -172, 343, 258, -8, 621, 148, 138, 696, 59, 393, 642, -50, 328, 343, 40, 546, 306, 326, 634, 12, 412, 406, -309, 224, 46, -175, 420, -143, -44, 359, -404, -148, -58, -332, 326, -70, -95, 17, -389, -109, 41, -712, 10, -274, -405, 105, -611, -360, 204, -506, 191, 36, -486, 259, -407, -207, 170, -103, -132, 9, -126, 302, 177, -48, 100, -219, 77, 401, -222, 120, 346, -101, 219, 123, 157, 712, 119, 249, 216, 25, 555, 48, -227, 182, 61, 44, 488, 142, 286, 97, -101, 215, 27, -130, 320, -118, -3, 135, -235]
3019b35J80M6k46K34p1o4K35m90J29m8pL69j56n21N66m47L61J36n31M85j17j08
3041c00L39k93j92L84k13J80J79l65K90k14j17M96m02K23M9p9L17j86q0N49m14
3062A51m0K36j70J66K13m24J87j06j11M43l32N6K20r7l1J55k56p9J89N9M1k20
3084B50J14M4k34J48j04j78M39m16n5L01m08J0R7L0Oj30n1L23k89j11J65l48J70
3107b27j02j39J07K5M6M0j64J74j25Q0J99l31K7J29j23J8J25j23O2j76k02Q75
3129A95m80R8K48j42K24k84Q6J47j72K22j6j4J44J3l99L16q9r3J89j20PJ41j26
3152I5J47M1k32L21l72J92J66j99K63m19l67N99m42K66K38m03M1J43l52L14o0
3173b0j08N6j29R7LKO3l17K7L27j62O3J44k40J52j36r5K76j91j47K12K4J04n1
$$ y = [-235, -55, -9, -255, -21, -92, -156, 79, -411, -282, -330, -337, 32, -124, -645, -79, -526, -165, -29, -560, -75, -192, -300, 39, -254, -446, -62, -275, -95, 84, -281, 9, -205, -322, 174, -228, -5, 44, -35, 282, 96, 16, 565, 151, 111, 347, 177, 343, 556, 132, 319, 213, 102, 545, 213, 269, 489, 392, 361, 516, 260, 181, 370, 429, 470, 250, 364, 408, 174, 322, 218, 40, 479, 63, 8, 309, -99, -89, 8, 38, 44, -86, -137, 186, -103, -214, -49, -397, -227, -329, -468, -361, -336, -290, -250, -414, -240, -365, -285, -86, -417, -390, -261, -384, -366, -241, -364, -302, -478, -680, 195, -285, -187, 61, -81, 143, -141, -55, 92, -80, 142, 126, 112, 256, 269, -130, 186, 97, 4, 193, 73, 80, 221, 95, 242, 283, 51, 372, 0, 192, 358, 159, 422, 3, -364, 235, -207, 59, 297, -106, -65, 78, -274, 40, -20, -128, -72, -201, -104, -101, -99, -36, -353, -326, 1, -161, -98, 46, -194, -42, -178, -273, 3, -188, -335, -123, -99, 5, -46]
3197d6j85K15l9L4P6j49K97J14m31L72n1k35M34r7o7M5l71L41q7J54J77l37K10
3220C74j11j28J24J97r8n2K5k39K65P4j79O2l27K11l9mr3R4j54J04k46L64k15
3243IJ4j23r9j8J82q6J8j09N4Q3j55q1L48l94J28j4k34L75l98J67k1J73k65J33
3267c13j8k5R4J7j61K08j43k6R6M4J33j85J48R6r3jJ69k07K14Jj48J75k50L49
3291A74k18LM83k62n9J56j84J4K24j64p5l2P4M26n10K93k01K8Jj90K66J30m67
3314i0L38k74LJ34l7j41J58Q2j02J40m47J93OP3qr7q6K33l27L27j27l60K95R8
3338a6l29M64k21r0l4q6M14j45j72L98m5k02J07j02n1L14j73N4r2j18K57r2K18
3361B58J09k96Q0Qk27L39j0j94R7j92J38K30Q7k98K11k56J93j49p8L67l34j23
$$ y = [-46, -231, -16, -55, -21, 55, -94, 203, 317, -114, 258, 207, -28, 406, 309, 242, 287, -84, 257, 170, 324, 501, 164, 374, 263, 135, 259, 456, 358, 306, 331, 92, 357, 431, 252, 314, -13, 198, 159, 155, 62, 156, 2, 106, -140, 224, 9, 23, -100, -199, -217, -35, -121, -103, -212, -158, -75, -230, -311, 37, -357, -229, -243, -477, -102, -500, -333, -354, -181, -446, -313, -331, -356, -262, -245, -406, -198, -341, -367, -271, -227, -94, -279, -131, -35, -128, -129, 40, -167, 47, 48, -100, 75, -175, 174, -44, -41, 442, 180, 121, 277, 93, 107, 331, 167, 92, 60, 134, 560, 50, 343, 142, 170, 171, -19, 247, 377, -90, 248, -26, -23, 111, 74, -67, 91, 173, 71, 211, -236, -43, -37, 36, 28, -69, -155, 78, -249, 78, -49, -409, -114, -16, -345, 119, -102, -192, -226, -312, 102, -43, -215, 183, 138, -64, 43, -59, -110, 204, 31, 85, -7, -125, 132, 40, 258, 367, 71, 151, 159, -68, 271, 261, 67, 164, -28, 110, 340, 427, 129, 340, 84, 277, 128, 50, 417, 83, -40]
3383d0K29j0k1mn6n4p0l8R0l71L62J28k32r2J12j70J91k44M4J65l08L97k60Q0
3407a72j19k98J29K31Q3P8k38L32l65O90j099P3K59M21k72P07j93m59M3K59m68
3428c78l07J95j16N84k06J08N5N15p17L19R7q9J90n2O7l0J0O3m4N5K10k02jJ80
3452E06q3l5r4j03K40l74K30J86q1r7k01P8p6j4kL1k46M63Mj96n8j63J48j97q1
3477b15L28L2n49L27k4j60L13j14j25J26O6J36k20o1J50j73J72J01m82L41J99
3498A68k57J54m20L70K47m40J40K13l36K87j14j82K30l4%j07J24R4r2k42L14j13
3520DM2N4J25l2J58j01m9M7l38P7m5Q7K10k86J65p6m4L76m90J81j52n8j73M62
3544A44l58L00kl45J56j88j2J40j85K71j74l8P8m2J32j10nQ4Q9l55K29j4j23J31
$$ y = [-40, 189, 179, 158, 154, 98, 44, -26, -64, 26, -345, 17, 145, -87, -179, -67, -237, -46, -290, -246, -81, -389, 8, -252, -172, -291, -589, -460, -229, -146, -68, -306, 26, -339, 351, -748, -675, -416, 5, -267, 440, 247, -212, -169, 90, -378, -685, -490, -606, -22, -228, -120, -65, 450, -267, 52, 149, 60, 250, 198, 265, 235, 245, 308, 264, 319, 529, 327, 326, 506, 423, 388, 294, 191, 431, 57, 287, 473, 392, 295, 94, 172, 96, 82, 80, 111, -135, 328, 332, 136, 78, -85, 63, -134, -215, 113, 145, -404, -77, -101, -261, 52, -62, -187, -61, 5, 141, -79, -140, 10, -163, 9, 110, -372, -31, 168, -89, 65, -355, 15, 262, -178, -38, 175, -161, 126, 12, -170, 60, 26, 26, -81, 43, 137, 45, -197, 117, 4, 46, 100, 225, 193, 351, 250, 201, 248, -90, -13, -58, 29, 239, -47, 118, 42, -2, 374, -116, 65, -87, -145, -318, 144, -214, 86, 84, -261, -105, -293, -305, -165, -350, -79, -253, -291, -213, -255, -123, -233, -238, -154, -65, -420, -191, -205, -328, -197]
3568a97p0p1K62o5M6J55m30N30k38M7K04l63Q1J73J60q7k03K34l2ll27L38K4O0
3592B28J01nl0J14l39J78L5k48R7J38Q3mj65O0J24k05R2P5p4K1l7j23O4k66K31
3617A45o6j30J83k62J30Q0j88l1k4o6K19nJ0j10j60J63J18k74K50j24k28K82l08
3640c96lK05j99K28j26J78k60K19N9N9j10M4J38k89K5J29k10K49m5J99N1l61q4
3663c00L25o6L6J32J9j2k48K55Jk76J80J45j89M23k69k94K92k6r6M6j36K11jo4
3687H8O7k34J55j06j44J70J69l01j3L00j03o6J40k68l9j06K94j3l79K77Mn0R2
3710f6M5k22K57j86J1J71q9L28k00L9k49N1J27j33j3J27J21j90J13j47K95o4j12
3733A4J50n5J33k25K80p8Mk65K86R7l50K11m8k2r6J32Q5j20j10K63J2q0l9N0j66
$$ y = [-197, -267, -338, -76, -141, -95, 60, -370, 160, -78, -31, 173, -190, -109, 64, 224, 137, -66, 168, 136, 133, -194, 144, 168, 228, 329, 324, 294, 408, 69, 247, 282, 34, 131, 269, 352, 348, 183, 243, 367, 162, 254, 329, 255, 276, 239, 116, 180, -86, 145, 79, -51, 132, -130, 0, 80, -108, -139, -163, -229, -10, -15, -5, -115, -275, -112, 6, -268, -18, -142, -370, -88, -396, -399, -194, -393, -165, -291, -113, -373, -154, -95, -36, -146, -102, 36, -253, -228, -99, -309, -60, -105, 94, 145, -216, -300, 25, -41, -5, 127, 146, 134, -114, 141, 142, -134, 46, 191, 2, 425, 156, -138, 154, 128, 32, 78, -58, 153, 152, 88, 155, -79, 76, -30, -174, -4, 165, -136, -149, 151, 48, -18, 122, -146, -185, -291, 3, -10, -389, -112, -108, -158, -66, -21, -243, 14, -172, -161, 10, -79, 249, 49, 88, -161, -110, 17, -116, -129, -2, 119, -71, 42, -105, 190, 126, 14, 164, 109, 242, 17, 297, 219, 223, -42, 244, 341, -9, 202, 154, 132, 36, 168, 253, 133, 23, 286, 298, 218, 179, 229, 63]
3758F3K97l93M6L0rK22j08j92J87j93j25L71p6j81K1q9k9J99l70M06k11q5Jj19
3782c37K90J53m04L4M3p7j8k60N27q2R2k76J13k4Nj17J11K59j15r4J74J37j50
3805a6j06QP4J53j85L95l00m2K24p7q6k9K1J14J92l62J73R7k27k2O6K5J59j38
3829A11p9L65Oj97k02K74k77J35J16kk36m0J05j63R6k5K2J42l07M83l29k22J22
3852a02j49K42Nl4m9n1k44K84n8J27j70J85rk9J85k68R1j83O3J66m8L1J43k25
3876i7J55k26J41K07l93M55j63j11K23k27K4O1j02J66J17j96K74m43Q7M18j34
3897B36j77J46k3Q7j50l4Lj18m4K99o7o4ok18M11k91L0j97P6K87k47o6J13k20
3921b34J94j70J12j03J66j0j11K04j02m00J47P8O8j23J48j8K1k57o6K70q0J78
$$ y = [63, 360, -33, 13, 43, 34, 256, 148, -44, 143, -50, -175, 196, 120, -61, -40, -129, -158, 41, -329, 77, -134, -219, -218, -337, -47, 106, -298, -264, -221, -298, -316, -576, -49, -131, -39, -315, -202, -226, -221, -338, -227, 32, -83, -177, -3, 134, -16, -122, -114, -40, 113, -72, 323, 23, -19, 205, 128, 42, 13, 34, 148, 340, -22, 151, 248, 21, -1, 65, 90, 249, 111, 32, 397, 403, 206, 4, 278, 1, 136, 252, 250, 14, -26, 79, -84, 12, -13, 9, 151, -156, 327, -2, -224, -102, -251, -9, -4, -38, -87, -138, -382, -98, -156, -29, -199, -14, -23, -52, 133, -135, -44, -227, -164, 2, -46, -15, 128, -97, 58, -168, -27, 180, -213, 242, 79, -32, 191, -36, -12, 49, -53, 113, 230, 34, 308, -135, -48, 370, 236, 59, 205, 182, 269, 119, 85, 88, -30, -74, 225, 158, 94, 88, -130, 281, -10, 20, -177, -101, 186, -61, -127, -14, -234, -40, -210, -98, -201, -35, -45, -156, 48, -54, -454, -307, -229, -161, -284, -136, -154, -133, -390, -456, -186, -266, -88]
3943h8l8n7J78k01J93n2n8J26k7J59k62J2j38M83j87J4mJ56r0j82J75j99L82L2
3967C27l34K87R9r3J1rk5K34l98K54q2l11L75k35P0j0m1M5K07l92P0R8KJ55l21
3992a7k36L30j47J55P8j60R0M4J00j19j81k82M73l73K37j98LR7k31J58JJ65j04
4015a17N9j97J66K62m18J54q1k29L40j69l7K02l08J59j37K02L0m0j45K82M53o20
4037a89m3l7P88q21P62m69J32j8l88L49J54l07L10m39P8j53O42m33K4K95k45K21
4059B13j24l1J66l08J15k9n3J02n1j35J26J86m0r9l36L65k47r4r5L59q4j69O5
4082a98nK82j72K83k88j68J45r2j39L57k31M3K8oL72k69j22J49J7O8O9r5K75k58
4106D5k90M10k04J5M63l20J98j01j50K16j14k18J89m2J01o1MNk25K13K54l73P7
$$ y = [-88, -126, -183, -5, -206, -13, -65, -123, 3, -24, 135, -127, -115, -253, 230, 43, 57, 53, 209, 119, -63, 112, -87, 295, 327, -7, 280, 379, 286, 297, 288, 263, 497, 99, 353, 271, -40, 335, 100, 170, 160, 119, 164, 371, -21, 49, 147, 149, 304, -17, -253, 77, -70, 85, 163, 3, 93, 137, 237, 118, -63, -345, 128, -245, -8, -206, -203, -106, -337, -179, -178, -13, -117, -58, -255, -89, 173, -245, -91, -172, -401, -61, -230, -267, -65, -373, -214, -351, -149, -119, -159, -304, -22, 431, -189, -232, -269, 519, -302, 460, -9, 123, 105, -283, 66, 220, -87, 223, -216, -138, -291, 351, -82, -58, 237, -8, 213, 89, 58, 224, -84, 31, 2, -51, 51, 0, -135, -9, 177, 137, 38, -298, 67, -180, -274, -369, -10, -94, -263, -198, -203, 79, -93, 190, -98, -266, -121, -213, -352, 5, -226, -183, -155, -161, 211, -58, -180, -31, -14, 54, 123, 28, 303, 45, -245, 165, -39, -24, 439, 119, 317, 216, 66, 282, 168, -50, 139, 97, 198, 137, 141, 146, -79, 134, 388, 15, 92]
4129I2K50k72L0K01j98L63l75k0K86l48k48L84k29L36l2j24k26Q7J99k96J14k61
4151b87L23j92O3M3j19L8k4P7m9l42M33k41J62J63k16J25J77l87kj26j2K58j09
4174b44K0K86k13J53o4j64J35j55J58J36n33K83K47o6K01j82Q1J40j27k0K08n07
4196b27K93Q4k39J28M1j28J35q3J30rk46K40k1k84K96op6j20kl2Q6j5K79k62k17
4221b55L07k49J04J33j57l0LJ46l1j49j44L15n7j8J08L5k61J62n8L3j01k42N17
4244A11m09L47L7l8M3O1L3Q1j99J35m1l9q3K6Q5j5r0k0J62k22K43j59k80J24R
4269i8O3J30j64K00J30j69MK21m01L32j34j57L57k15j60J22m0p0R9k31M67l81
4291i5nN5j9N1l26j05J82L84m28L49k12j49L08k16m0J34l4J3j93j02M26O1k00
$$ y = [92, 342, 70, 100, 301, 103, 466, 91, 71, 357, 9, -239, 145, -84, 252, 220, 96, -130, -43, 156, -140, -26, -287, 36, -156, -93, -50, -169, -131, -155, -78, -127, -469, -36, -277, -115, 48, -168, -43, 134, -253, -255, -381, -393, -135, -244, -224, 62, -151, 2, -62, -226, -91, -246, -88, 48, -485, -202, 45, -21, 180, -2, 79, 219, 92, 72, 280, -227, 66, 150, -89, 39, 80, -48, 87, 4, 134, 125, -121, 119, 98, -186, 110, 104, 28, -92, -94, -126, -40, -55, 224, -38, -255, 52, -197, -93, 40, -117, -147, -144, 2, -29, -178, -322, -7, -64, -82, 26, 61, -200, -38, -96, -63, -164, -406, 111, -298, 49, 86, 48, 91, 152, 185, 266, 67, 202, 161, 122, 39, 65, 150, 135, 45, 25, 187, -35, 208, 49, -231, -107, -98, -35, 95, -69, 131, 261, 92, 96, 317, -84, 248, 114, -43, 314, 99, -61, 61, 21, -49, 50, -181, 286, -95, -100, -45, -64, -13, -339, -444, -262, 122, -306, 43, -169, -318, -10, -226, -266, -132, -166, -153, -346, -448, -22, 39, -161]
4314a61j8J35n2J24k80K84l93L24j53J17j21J01j07N2L35k91J19k80M17k67K27
4335A12k06J15q1o6K79j46K3nj5J55p5j75J30K47O0k81M1K18m14J71K13k07o3
4358C0K63j66j08K72o7j39N6l50L65m3P7k30m9N0r4J88j11j1O8j04J75O6l33J89
4382fqj66P5J15l77L51k5L4M5j48o7K74N0k68k9P0K17k29M73j92j88K18k75J76
4406A20j52L55m27J93N9pJ7k42K02K00k29J11j78j43oo1L74rj68L6K46l11K15
4429A95K0l29K79J24k68K5q6l2P8K6q2J20j90q3J12M9k20K29k11K06j57j51N0
4452b96L72j2l61J65k16L30L8j91J19N7m5j46J69J44k09j68J75J4L2j00J49q6
4474f6M3k32L43k28O8r7J63OJ58j01j46K89j36r9J26RO8L9j78L39k86J51k14L5
$$ y = [-161, -179, -44, -96, 28, -252, 32, -361, -37, -190, -73, -194, -93, -200, -148, 187, -104, 15, -265, 152, -115, 112, -94, 21, -60, -126, 153, 7, 30, 25, 10, 165, 90, -85, 45, 292, 352, 71, 112, 330, -84, 87, 300, 93, 30, 293, 127, 19, 291, 224, 85, 141, -209, 156, 113, 190, -40, -89, -39, -133, 55, -56, -67, 1, -103, 72, 138, -195, -6, -14, -180, -105, 10, -367, -16, -41, -7, 38, -110, -177, 97, 147, -121, -150, -80, 137, -92, 381, 189, 1, 219, -56, 120, -32, 323, -104, 89, 148, 141, 158, -84, 118, 318, 89, 200, 22, -121, -127, -188, 186, 177, 9, 45, 291, -20, 195, 215, -114, 165, 289, 21, 46, -40, -72, 6, 32, -50, 70, -120, -203, -91, -42, -262, -33, -244, -38, -195, -346, -296, 76, 64, -297, -132, -348, -18, 20, -171, -52, 5, -40, -186, -17, 127, -82, -250, -75, -61, -29, -129, 20, -66, -23, -255, 88, -140, -72, -169, -6, 0, 158, 57, -89, 200, 64, -35, 91, 100, 168, 207, 29, 368, 82, 233, 19, 54]
4498E4K71K4j67j15M2K6k5n9Q3J1o8OKj15K19Q3k54k37L22K5%m5P4J23k70J32
4524A42k69J34j09k25K74P7K3j78K42k14j28L27j58J02J18m89J25J98j11r8J3
4545b04k1qL30j38L4j57J39j36J61m8o1K43j11k86L92k16J62J50j01M1r0M6p7
4568D4K2K8M2J1k40L05qk73Q6J06k65J29N7n9O1m3J3K4L7j57kK34Jk18J67k05
4594a03J02r0J44K37l04l02L18rj80r0K17P0k00L42l78K29n8Rl5n4Qk9J03n9K70
4619A58k18r3J11K3j88K85k32K93j32J88j88l04M41p6J28j56R9j98L50k09K9P5
4641A86N8J1l38K62L0j17L3n3Q2m4j32R3K28j48j43J08N0j76J01LR6o0k19K53
4665A64k19Q8P0k27R0J10j32Jj1p4L10l95J74j25L6No4P2J81k86J30J29j92J23
$$ y = [54, 325, 349, 182, 67, 109, 135, 110, 51, 134, 145, 77, 83, 85, -30, 189, 272, 18, -219, 103, 128, 128, 83, 157, 280, 10, 142, -127, 7, -102, -327, -53, 24, 47, -131, 111, -103, -231, 96, -62, 40, 158, -331, -206, -8, -119, -217, -204, -225, -233, 97, -41, -7, -164, -25, -161, 0, -48, -109, 134, 23, -263, 129, -87, 75, 225, 124, 165, 75, 121, 44, 66, 94, 136, 147, -93, 212, 204, -69, 17, 123, -142, -13, 44, -15, 46, 3, 16, 40, 77, -80, -82, 152, 153, -65, 102, -103, -1, -91, 53, 290, -14, -316, 2, -7, -187, -277, -60, 10, -190, 152, -226, 3, -55, -46, -81, -135, -127, -156, -53, -112, 158, -60, -153, -42, -19, -207, 78, -154, 139, 7, 195, 7, -297, 144, 68, 196, 40, 139, -59, 291, 82, 111, 186, 244, 255, -83, 179, 209, 92, 125, 72, 154, 110, -22, 71, 299, 151, 8, 116, 166, -10, 91, 94, 190, 130, -89, 164, -55, 33, 103, -124, -34, 76, -56, -55, -66, -140, 170, -225, -51, -176, -140, -135, -199, -127, 54, -232, -102, 27, -165, -42]
4689d2q9J03j99J65L2Q0j45j3K03l37J7o4L12J4k58K46m62N72N0j43j27J93K5
4712A33j12n4j35J56K0L57n03J74j63L15n0p4J28r5J42j76J70k52j14K31l4j34
4734g0J02j16J81k17J39j97O9q5O7R9O0j84J96p4MK77j91j12j13L30l80J70j44
4757a89KL01k18K24j54j32K68r2J7j07J01l8qm4j50M41l90K58L0k54J67j02J35
4780F6J9j44J46j05J04Q0j48m2J96j78m1J24K7k30L27j01K60l89m1L71k22R5J5
4803A89k55R1q9J76k24J80j75J99j29J7K70k37j42J19J04J74l22J34l20K42j17
4824a15J1J12l20j62M64J45o80M67J29j89L2J62k87N58o69L15m52M65JO1l20J8
4846b54k39L53J44J05k38j28M81m15r2L8N85j20l49M17l33J15j75K10P9k39j81
$$ y = [-42, -131, -28, -227, -62, -30, 50, -95, -108, 95, -242, -225, -289, 23, 37, -221, 25, -437, 135, 185, 42, -85, 108, 133, 21, -33, -168, -12, 8, 365, -138, 36, -127, 188, 138, 64, 192, 97, 239, 63, 233, -19, -133, 98, 64, -70, 32, -84, 97, -120, 19, -178, -109, -194, -127, -28, 32, -152, 44, -30, -26, 251, 60, -52, -165, 165, -215, -45, -189, -187, 114, -104, 120, -34, -166, 102, 10, 27, -80, 21, -17, -25, -69, -219, 222, -168, 90, 120, -134, 33, -69, 66, 85, -59, 87, -18, 86, 166, 18, -24, 172, -6, -47, 77, 104, -126, 201, 100, 360, -29, -70, 301, 79, 174, 189, -66, 25, -64, 112, -112, 68, -107, 92, -37, -20, 250, 13, -129, -10, 94, 268, -54, 80, -240, 2, -115, -104, 8, -312, -474, -10, 135, -545, -78, 51, -138, -106, 56, -231, 327, -342, -27, -479, -14, -13, 48, -272, -254, -493, -140, 4, 109, -129, -257, 224, -191, -283, -245, 340, 220, -129, 288, -45, 70, -105, 105, 184, -55, -236]
4867b36M9M15o70K78N65k56p0J39K66J05o40O88j192R37m9n65K08l03N34K2m51
4888b26j82N61L1k07j65R3j22J13K14l79J73J01k42P13o38K66k71L48k68l07M59
4909F5m37J35k8M26m45l9K53J30k95J71P0n2k46L15j22J87J34j80j24O5RR7k36
4932a47L29k05K11k07J84j0j64L8J96l29j89O97j71K03l13r1q8n5J68L27m90K93
4954A87K0l51J92p4O6K3j95K46j98J15k72J27J68k5n06K45K2p8N58L1m20J23M6
4977E0k57kL51k35J38o4n8l3N2J2J29n3k5J81j26j73n3J04J98n7J03lj94M2n0
5002b3J13j82P3K72l4j60J94j57k5J26j40J50L0l21L23r5j08L17l25m6K28Q5k52
5025D3R0K07k02J05J64k79r4n0K82l20J0o9%j25J01N2n3N8m3L93m32J83j8m2J14
$$ y = [-236, -187, 228, -442, -164, 401, 145, 75, 214, 480, 585, -55, 633, -559, 378, 329, -236, -28, -331, 203, 225, -226, -408, 153, 184, -23, -188, -95, -217, -104, 110, -269, -96, 5, -237, 476, -162, 104, -167, 181, -87, -394, 65, -372, -237, -265, 161, -284, -323, -70, 60, -235, -64, 6, -46, -292, 23, -99, 88, 222, 42, -82, -17, -8, 89, -147, 182, -23, 188, -19, 165, 155, -9, 29, 225, -104, -293, 404, 233, 436, 123, 32, -56, -111, 57, 384, -106, 187, 207, -144, 48, -26, 40, 63, -132, 114, -84, 31, -241, -114, 54, 29, -477, -232, -210, -288, 270, 301, -119, 4, 50, -207, -209, 142, -93, 45, -19, -77, -110, -58, -46, 83, 30, 5, 186, 60, -113, -166, -62, 136, 79, 182, 179, -15, 27, -23, 90, -92, -19, 253, 219, 59, 253, 96, 71, 197, 57, 207, 237, -84, 239, 144, 36, 353, 28, -18, 210, 295, 43, 133, 340, 138, 243, 407, 128, 34, -16, 266, -54, -44, -113, -113, -238, -137, -85, -138, -80, -123, 270, -162, 21, 3, -39, 75]
5050G5K6r8K0p0l3J83k93J84l22M17j15o1oJ83M6l02n8j29M34m02O7J91J39j35
5074e9J3k6N4l2Lr4J92j48k3L10j63j31J75j26N5P7j76J92j61pq8L58J7j84j34
5099a06J61k30K90q6j90J00l3J66K38k16j06K13p4M7k05l1N0k09K50P5k91K05
5121A8j42O1m5j8j58K95J56l6k81L5k73R3J79J95K9q2j79K91j76j75K38l36J88
5144a23j25K64J68n8J45n0l86L99n7k27K08n4J20j28p9N1j1J3M2o6P1j43p0L54
5168B58k02nm3l9L11j95J5J59l32J29K06j58N0l9q0kj12j06L29k72J82J58k54
5191d2J28k14qJ32J5J85k03J54r6k37K54j77J22j98J32j14K51k3j45Qq1J07J97
5214A47k88p2K50j58j05K15jj61K87o9L5j71O6J7j65J26k8Q2k2J01Q4k47J46k30
$$ y = [75, 101, 3, 23, -47, -80, 103, -190, -6, -328, 89, -26, -87, -93, 90, 136, -166, -224, -353, 81, -321, -254, -63, 76, -59, -46, -72, -18, -50, -47, -141, 51, -97, -120, 190, 27, -104, 71, -55, 0, 77, -99, 93, -68, -75, -163, 195, 212, 28, -106, 55, -175, 115, 29, -161, -61, -94, 72, 310, 94, -12, 201, 127, 174, -31, -62, -12, -221, 29, 104, -187, 18, -124, -63, -108, -126, -284, 11, 167, 131, -150, -115, -388, -295, -116, 79, 108, 26, -153, 138, -38, -213, 25, -311, -123, -248, 16, 184, 126, 271, 221, -165, 234, 177, -50, 158, 104, 224, 96, 17, 68, 57, 70, 112, 46, 117, -26, -96, 258, 56, 51, 8, -31, 280, 85, 100, 259, -73, 56, 262, 104, 154, 115, 35, 33, -79, -185, 144, -128, 54, 212, -42, 86, -128, -136, -4, 11, 196, -7, 147, 51, -186, 68, -109, 13, -185, -53, -167, 84, 61, -84, -76, -157, -50, 147, -141, -213, 37, -121, -226, -11, -12, -173, 114, 45, 80, -91, -25, -8, -173, -47, -75, 7, -15, 86, 170, -77, 69, -161]
5238a61N12k55n3N8j31L7M6J85k16K6L5O3k29J22pp5K36k30R8O0j53KnQ7Q8K2
5264A62j9j85m4J05N7o6k1j32K57j49K22n3q9o0p6N2km9j1J50l18L78k6l44K67
5289Fj18P1j15J88j7k07K05L4J37l61J63J94J01q8j99L96m09J4ok6q2M10m34K53
5313A10j76OJ52P9k18J33o0j4k19K56n9J30j71J34j28k6J37j6k86K72k9L3j06
5336f6o1J62o0k5Pj40J56J63j03m5n8l6M7n8N6m8K87k91l5J19J8k7O2j61Q8n8
5362a07j11L90l62j7R5J72j17k19K33J47J22l10O3j01l6J43j45K83j27j7j15L15
5384A79q1Q3j19J24l26N8J78N8J70j52k85J84n6M4K53k03j21N4O9m4j40K04k2
5407A09j03J52r9j14J42k44p1q7M11j36j16J87j4Qk46J22J55J64l42o0J01J19
$$ y = [-161, 351, 96, 43, 101, -30, 7, 53, 238, 22, 48, 83, 146, -83, 39, 32, -43, 193, -37, 61, 121, -32, -30, -35, 52, 140, 162, 143, -42, -86, 19, 76, 10, -11, -143, 114, -35, 187, 134, 45, -15, -91, -39, -41, -90, -101, 49, -269, 109, 83, -261, 6, -112, -41, -156, 32, 15, -192, 13, 47, 184, -177, -14, 180, 281, 193, -6, 390, -19, -5, -11, -37, -119, 291, -143, 110, -66, -60, 92, 171, -47, 86, 26, 12, -207, 49, -10, 120, -51, 83, -45, -71, 66, 50, -236, 36, 7, 40, -66, -127, 35, -25, -50, -43, -183, -27, 136, 33, -12, -70, -106, -59, -117, -61, -109, 178, -113, -148, -29, -11, -38, 24, -137, -49, -107, -218, 172, -190, -207, -112, 60, -57, -276, -43, 104, 226, -84, -21, -122, -158, -15, -160, 123, -4, -21, -136, 179, 98, 181, 62, 186, -140, -82, 96, 154, 324, 172, -113, 71, 15, 59, 312, 109, -12, 42, 111, 67, -73, 131, 109, 6, 158, 59, -55, 87, -157, -228, -315, 96, -40, -156, 31, 17, 25, -221, -99, 56, 220, -122, -182, -81, 38]
5429C8k14n4J80N5j43J59j80K01k70J11J65L6j01j30K28m9J63j97J71k96J11M0
5451B4J9q3J39l72M17k98J39l3p9M3J69Q8j52Pm1L0oJ37J17l75J35L44m22l7J23
5476C3p8O9j37O6L8R1j01Q6L2j12M3Ok36r8M07k85K21m3j37O5J33J36j48j27J65
5501H9j34J07k96K11p8k08K15m0K9J60N7o4j27K8Q1j47J14j05m4Q8J8J23J9j8
5525G8m0k00K85r7k0j79J98O1j17L88l52R9N2p3K2N5j91J18l9pK04k70K80R0l58
5550a3J63j34N2k8k1qJ38j88r7K87j22j60L19k95J83q4o9O3L7Nr6J1J05m0Jr4
5576h5K18l12M68k51o6L9J49l84J20K15m64q8M21r6L60k66L30L14m75Q1l94K24
5598E8j21m85K40N47l46K45k19L64m6j52J28q46L2N52l08M95k95j80L60k26J88
$$ y = [38, -176, -230, -50, 5, -138, 21, -159, 42, -228, -117, 48, 84, -17, -147, 81, 32, 195, -2, 169, -127, -16, 24, 43, -40, 99, -273, 144, -154, -15, -48, -127, -84, 85, 173, 21, 28, -13, 17, 11, 148, 265, -110, 25, 369, -53, -90, 33, -45, 24, -113, -47, -9, 82, -19, 67, 99, -13, 30, 36, -200, -298, 109, -176, 45, 2, -135, -70, 63, 199, 51, -76, 89, -45, 62, -234, -23, -101, -309, -94, -134, -105, 55, 112, 48, -79, -51, 30, -117, -3, -108, -152, -64, -46, 77, 96, 78, 38, -162, 123, 26, 6, -173, 25, 86, -31, 357, 5, 104, 156, 83, 105, 160, -31, 87, 48, 41, 245, -25, 255, 345, -13, 150, 16, 68, 40, 19, 11, 149, -39, -136, 151, 29, -131, 188, -107, 76, -8, -77, -14, 23, 28, -68, -57, 48, 8, 9, -85, 133, -179, 289, 38, -28, 11, 160, -224, -104, 111, -353, -441, -20, -116, 244, -22, 308, 622, 147, 228, -166, 58, -63, -548, -308, 239, -107, 138, -81, 283, 237, 85, 213, -633, -601, -49, -357, 138, -157, -337, 23, -203, -15]
5619a5P5j82l8Q9M7K17n22M20Q4m36l41R03j72j86K78o1p26N4N16J18N26m33j54
5642F1J88n61P5K61k10L52k77r28J404l62k00O00j090Q66j26j70O1j61M92o70
5662c95j46l3K10K67N5M4r3o59L03L6N04K90o24n34N25r1k17M69K42j26m72L90
5684e5k01L24l48N85l96p04R90K75j298J077l30j3o12M60O48q61J250o67l66K45
5704CP3o07L10J63k96J88J49q6L9j12N86l82k33J73k27O76m12q05N32O5M93o00
5726c10O8K62l73L88L03k60k70n04O69N26K96j125N62n79N03O61r52K94K17J16
5746D92m65n5N41K4q01Q60j867Q01j0L27n83N30J30L27m20M49j97m36L53k11n96
5767h07J165m91K55M72l35n71O3N99M6j071J203o20L9l10j59M9Q93l14L36p00
$$ y = [-15, 60, -122, -160, -71, -24, 193, -329, 91, 175, -261, -602, 301, 129, -57, 221, 160, -566, -512, 4, 122, 648, 215, 61, 249, -312, -237, 24, -186, 166, -111, -1039, 365, 3, -197, 403, -687, 179, 53, -117, -56, -217, 275, -395, -541, -574, -364, -97, -42, 2, -91, -750, -447, -411, 93, 383, -241, -775, -250, -341, -558, -89, 153, 27, -445, -55, -256, 68, -280, 305, -91, -795, 195, 470, -828, 249, -81, -94, -706, -246, 402, -459, 791, 124, -242, 3, 76, -531, -221, -58, -354, -166, -17, -103, -64, -176, 410, 28, -205, -32, -259, 417, 5, -800, -268, -203, 290, -310, -242, 20, -353, 35, 338, 78, -192, -696, -27, 499, 795, -330, 232, -347, 156, 817, -135, 159, 376, 492, 27, -28, 513, 537, -264, 596, -1271, -470, -480, -153, -736, -206, -76, 251, -169, 280, 83, -353, 0, -211, -807, 358, -133, 122, 594, 259, -312, -249, 350, 396, -675, 528, -92, -53, -363, -522, -473, 420, 106, 442, -258]
5787b58k35N04j02K1J96q07R21k41P8K3n31N89K33m21j51j48k6N39p49K10l67
5808g22M74J55o1j09r9K38R6O09p21J62M01k65p94O46J73K3q3J83m75J06M32r9
5830B70P5l09k51j24J49O12j73k62J24mM5m05Q0N66q60L41J21j2m6oK96l53l8
5853a64J91oL0J29J28p3n19R1J8P7K09p07N93l25Q75q76K74P5k9n3l49J97Nm45
5877f54O46m09P6N83j38L14r79L57L63r3j6k03k0Q50q54J12M41j10n62J70j70
5898b96N44j43K4J90o31L42l91J10p9l4N34K90l23m09N30n24l84Q36l70L19j87
5919e2N5R5k89k8K58l71K42M15j42j70P5m55Q84o68j16m14P50l34K23L14k69J05
5941A08l43l77O87l79M96m36M20L34m01q1J25k12k51J98K7k43L28j79K0l04P23
$$ y = [-258, -493, 11, -91, -70, 126, -681, 240, -1, 77, 100, -431, 158, 391, -30, -181, -329, -355, 184, -565, -355, -722, -248, -93, -154, -263, -362, -124, -28, 581, -140, 22, 423, 158, -636, 10, 183, 206, 123, 306, -169, -63, 369, 270, 345, 36, -215, -339, -190, 422, 249, -13, 111, 107, 152, -253, -173, 393, -467, -126, -5, -17, -63, -69, 227, -126, -164, 27, 21, 51, 180, 308, 235, -284, -193, -175, -98, 111, -596, -3, -328, 547, -329, -55, 20, -9, -62, -411, -214, -209, -654, -8, -417, -341, 242, 104, 418, -561, -204, 159, 66, 50, -153, -173, 677, -177, -65, 376, 266, -296, -126, -296, 248, 105, 129, 319, -312, 30, -361, -251, -330, -364, 170, 460, 137, -272, 258, -266, -650, 186, -184, 135, -52, 3, 98, -191, -219, 39, -332, -90, 325, 183, 13, 88, -367, 517, -151, -267, -681, 69, -265, -42, 272, 3, 108, -235, -612, 75, -304, 192, -244, 176, 510, 109, 28, 153, -59, -310, -112, -85, -328, 0, -179, -159, -463, 260]
5962B60k96m63O00n49k9M58L70n43M41J19q47J257j055m1K27J60q4l78K12NL87
5983B11J71Q0r47P14n06K0K67J99k76l16R87l13m92K03k30q1J131j257J52K38
6003d5L78p21P9M91p19J18N29k46L8P3J55j64l8o8k77M8L0j59J89Q82o03j50P0
6026a10K76O4k94k80j01O01l66o2J54n01M11L48q1j91k43O99k57R9Q5n52K27J73
6048I9O4qJ01k48M64l74j10L22p79P75j74L26n09m93M50q1n0N34m47K94j8j42
6070dP4n79P20k63k17M23k09K40m30R58q53K43L31k65k75M88o20L5J63n55P94
6091A99k04L7O21p99K48J4j59L58o44K84P9m05O00k53k23KJ42J37J82m2p83M82
6113a27j40J32j48r0K81j78k8M82K34m05K47K8l93o28Q38j08o5k19N90l0l05m36
$$ y = [260, -36, -499, 101, -448, -477, -19, 351, -192, 249, 368, -479, 778, -277, -318, -91, 69, -15, -393, -181, -176, 211, 382, 462, -485, 229, -277, -257, 10, 209, -67, -383, 604, 291, -201, 2, -228, -309, 822, -435, -283, -45, 333, -388, -309, 182, -537, -419, 110, -136, -98, -25, 130, -34, -72, -140, -417, -369, -339, -498, -309, 573, -30, -180, -110, 166, 230, -64, -344, -445, 156, -210, -272, -118, -619, -208, 140, 59, -132, -375, 324, 67, 166, 251, -301, -74, 99, 163, 155, 256, 8, 472, 98, -12, 310, -469, 306, 132, 458, -51, -544, -94, -175, -225, 309, -138, 156, 138, -4, 70, -509, 211, -52, -269, 154, -55, 185, -245, 713, -140, 103, 434, 169, -106, 382, -238, -203, -40, -595, 199, -5, 32, 653, -146, 102, 116, -43, 315, -329, -45, 34, -371, 229, -24, -247, -245, -103, 34, 216, 174, -609, -127, -267, -135, -283, -373, -92, -270, -298, 184, 418, 13, 260, 288, -105, -733, 105, -3, -68, -287, 303, 273, -32, -468]
6135d68M8O07j11nk65K55L6M76m26n17Q01k41l36O38j028N03j05L36j56j11k43
6156c12k40R48O15p22p65K23J7K46M78p87M53p23J151r80R68p8m59j49j77j07
6176d00M57L92r51M31q2K59N24l7k88j03j64J271j417J56K87k87j89R94p36n22
6196d05P24o55M04j177O49N38J143j625L84m88R49l39l96P63R4o92j1O53k64K49
6216D98j86K84q71J161o67l70m00J53m0M67n1K81n64K05j16L00n22M90k67L63
6236A48n38K5L24K48l10j35J83q3J18J06j39k82p2L00k49N47n44J24K28j02O0
6257d3J41l8j15j71K41o2Q0q3L4m83O57k34J00ok88M52j73p7M3R0o1J50k55J67
6281F6j49K06k59J13l3J55m7J65m82J85K78r1k9K36o7j19j36Q5o7j57J18j1jO2
$$ y = [-468, -420, 187, 76, 71, -194, 61, 97, 573, 147, -370, 431, 190, -146, 492, -536, -33, -138, 198, 42, -69, -312, -552, 396, 1011, 289, -476, -253, -236, 10, 488, -299, 154, -569, 582, -398, 570, 492, 33, -116, -293, -400, 57, 449, -502, -71, -153, 106, 630, 593, 305, 202, 38, 1309, -108, 48, 335, 48, -141, 853, 117, -405, 319, -336, 68, -1109, -460, 78, 1221, -404, -20, -508, 441, 102, -294, 469, 563, -129, -140, 513, 249, 498, 312, 596, -275, 886, 219, -151, -551, -398, -438, 29, -22, 259, -305, -100, -216, 84, -438, 52, -215, 148, -390, -365, -41, 207, -103, -238, -55, -138, -20, 86, -53, -335, -407, -107, -356, 191, -353, -229, -1, -103, -43, 98, 60, -55, -226, 15, -47, 33, -50, -16, -499, 158, -76, 24, 18, -270, 182, 9, -68, -25, 65, 4, 154, -101, 66, -83, 123, -136, -23, -56, 99, 52, 217, -265, -80, 198, 107, 78, 314, 247, 128, -8, 77, 10, -147, -29, -40, -41, 21]
6305B1j02K09j37J12m01K24R5j60J86n8mK52j12m8N0l64M46k30Q1k09JJ42L4K5
6329E3j95N3K37Rl9k9J46q2j18j85m8K72J38k43j26Q1K1J87m0j71R7J57j14L6
6353I7l6k33K43J96k57K5j21O7J37K53o77K78O5n09q7M51j3J3L71j046J044m88
6375b27P7m02L29J63K09j23j00p0K08p3p9O9p5j93L43r4M0rj77K30k10J84Nk3
6399Bj73O1K72k47j02L55k56N5K20r4l4j69K11k15J86j76J83j61%j08R4K6N2n
6423b3J85m8K9k76K56o7n5J70o1m6Nl2L2j50L10o6L2m81L02P7j98M7P3o0o4J35
6449B6j21R6J37o7L7J06j37k09K1J22Q1m92M50p0JK80l58q3J7M41k65j7J05l00
6473a99J68M6k04K7K75p9j53q1M06k70J15k36J81L0k4Lm0l7Q3p3o6J70Q4k06L8
$$ y = [21, -81, 128, -9, 103, -298, -74, 21, -139, 47, -11, -15, 237, 125, 77, 127, -237, 209, -21, 60, -149, -148, -6, 28, 53, -142, -89, 148, 157, 118, 89, 235, 153, 35, -150, -198, 74, 212, -31, -157, -76, -55, 132, 92, -79, 18, 175, 61, 97, 61, -172, 71, 267, 10, 35, -86, -19, 118, 371, -306, -28, 37, -472, -559, -108, -121, -108, 263, -783, 261, -227, -150, -552, -223, -60, 149, 26, -74, -144, 64, -9, -88, -19, -94, -287, 56, -38, 2, -7, -184, 46, -164, 20, 25, 2, -171, -110, 162, -85, -187, 168, -88, -33, 187, 93, 59, -110, 101, -114, 72, -104, 79, -82, -82, -190, -96, -70, -18, -23, 162, 114, 143, -133, 123, 56, 1, 171, 110, 64, 69, 37, 69, -81, 229, 163, 195, -286, 16, 93, -105, -58, 15, -45, -109, 26, -95, 1, 138, 71, 108, 214, 77, -132, -111, 11, 92, -400, 50, -20, -19, 261, -97, -180, -163, 278, 13, -4, 101, -199, -31, 15, -189, -162, 113, 34, -119, -200, 206, -64, 51, -185, -4, 26, 2, 5, -35, -72, 11, -62, -128, 42, 126, -80, -42]
6498d2K33k19m7J98k30J52p2n7K33K6k12o6J42j34k1L80j21k38J75k02O2L3j21
6521a48J29j6K41k46J85q8o4j33J52o4o6R9M5j0j08q3K51o1j8l6m0JN3K66k78
6546c7K8k27P5R7J50K5j09J45k35M4j15j6J23Q7o3K38l08j55M22j89J0m4R9J13
6570A58k59R0m7P4m3j28K34J73j54N2j28K82p0k69Q5R9lK0q9L30l41l64L64m03
6594c37O25j71M3K41L2k59m46L50j14J4K68J83r94r8M97P7Q95j198O01n70R52
6615E91p81M07o27O70p7p86O38l95M50j98j98L67o52J198m65k23j10L76o93K87
6635b21L78k61O7J93l0j78J05o5J09J33J16m55P1J22j07K6K07j70J03j50j2J2
6657gK78l26J15j29n4J10j9K3K7J97l46M33j67j10J9q4j38L11J07k01l8N8k12
$$ y = [-42, 191, -28, -75, 123, -107, 45, -27, -84, 149, 175, -37, -103, 39, -95, -116, 264, 143, -95, 80, -122, -60, -27, -148, -19, -35, 206, -40, 145, 57, -7, -140, 12, -52, -118, -19, 26, 16, -92, -175, 76, 15, -3, -39, -79, -78, -25, 241, -37, -9, -236, -161, -64, 86, 111, 2, 147, -88, -44, -159, -175, -52, 35, -28, 210, -98, -253, 169, -20, -10, -54, 45, 158, -101, -11, -58, 16, -27, -155, 79, 252, 98, 150, 22, 304, 234, -35, 50, 149, 146, 166, 77, 407, 66, -298, 66, -337, 288, 117, 160, 401, 433, 174, -272, 78, -36, -22, 246, 429, -565, -663, -166, -89, 806, -392, 209, -361, 591, -190, 217, -410, 260, 183, -603, 35, -360, 90, -108, -306, 61, -591, 607, 142, -81, -191, 185, -508, -221, 157, -104, -37, 156, 126, -52, 53, -12, 97, 230, 346, -109, -38, 84, -23, 3, 210, 40, 143, -7, -19, -7, 271, -55, 60, -69, -123, -13, -32, -9, 18, 215, -131, 302, 135, 25, 44, -40, -178, 133, 240, 39, 1, 59, -153]
6680a53J03m5n6LJ3K66r8M5k43J83k48L05k94L98j72J1K9j35J35N8j93P6m3J13
6704E8l9N7j02k23L05k6j13j12L43j26k43J38J34j13J5K2J64k54L80k36l6J30
6726A23j60J30o1N2ko9O6j00Q8k48K25j17J2o2J16K06k06J06j15nj19J43J58k43
6750h2K11j56K93m22j48L45P2k32K14j46K29j86r8N6k82M78j60NJ22k23N2J74
6772A16l0j35j07K40j63j52J65O2j83K00k18J80J13j25m1p3J39J86j33J50k36
6793d5J96k18p7K48J93l86R4q8K36j4lj7m7o3o0j1K50k29R6J20j80J07j63J77
6817A16K2l65mK68l7k8k86L61M3M6m7k38J21j5Q9N2k79J19P9p2J90j98J2j74L90
6842A65m42J39L09j59O9r8j7K36l64L71j84m8L3r1J27L6j16j34L5K11o3J3L4j59
$$ y = [-153, -50, -95, -151, -148, -135, 131, 33, 78, -165, 18, -230, 75, -219, 179, 7, 18, 47, -88, 47, 105, -88, -12, -55, 58, 19, 76, -26, -249, 56, 30, -83, -195, 148, 22, -221, -83, 51, -62, -47, -25, 139, -115, 265, 29, -7, 123, -37, 93, 32, 84, 82, 13, 79, -21, 67, -181, 44, -73, -61, -123, -7, 199, -7, 99, -16, -21, -140, 3, 161, -82, 129, -27, 266, -156, -304, 41, 113, -119, 95, -51, 178, -8, -106, -50, -332, 146, -14, -9, 113, -110, -58, 116, 86, -49, -156, 84, -79, -231, -66, -4, -187, 13, -205, -25, 88, -37, -78, -151, -12, 174, 41, 191, -45, 151, -67, -144, 104, 297, -89, 5, -83, 153, 139, 136, 119, 72, 9, -51, -62, 188, -41, 55, 175, -5, 102, -61, 116, 138, -227, -231, 37, 0, -28, -314, 47, 90, 136, 89, -149, -28, -43, 46, 98, -181, -62, 17, -55, 135, -63, -51, -225, 165, -277, -138, 171, 12, 81, -17, -34, 202, -162, 209, 25, -23, 10, -81, 46, 82, -34, -168, -133, 78, 15, 28, 62, -97]
6866i7rn3J38k16Q6J89l0J10l1Q5j27j3j40L4J31M9J25j50p5j50J56o7j34Q6k6
6891a29M7k22M16j9qj3p9j05J14j06O0J2Q9j77m5L9R5k1R3P6k87O3J0Q7rj58M7
6918a30J88l02j40L91J91k11n8R8M7l33L88j33j44k3J49k41M22n8J04j46m3j18
6940a02k4K14j56J38j1o9l34M27o4j29j12K18R9K7l38J42L16J25n14J87K9j63
6962i4M8J12K56k39Q4j13l0R3j52O2J16jj43k33K79J36q2j6j16M6j72J98K9lj11
6987d6K8lJ14j95lo2K01J34m07P4J73k9Qk5M6l0k07J74J05j97J45m6J29o5O5K2
7013A03j65K33O9j50j73m5K86m0J01J93m39Q9N5q5LO0K5j72k30L36m3p2L52k53
7037C8O8p2k90M83k60J02rj28P4k58P6K83Q6P9j56m8k9R7l72L54j93k7J22j05
$$ y = [-97, -106, -159, -21, -237, -151, 38, 8, 118, 87, 172, 45, 32, -108, -74, 57, 106, 231, 81, 6, -144, 12, -55, -189, -103, -129, -82, -304, 112, 93, 85, 72, -7, -112, 2, -104, -44, -32, 57, -120, -165, -126, -31, -52, 41, 117, -170, -107, -97, -10, -19, -177, -130, 58, -244, -384, 7, 198, -13, -71, 27, 74, -259, 129, -4, -148, -171, -22, -263, 159, 101, 205, 59, 16, -102, -126, 88, -68, 70, 59, -10, -344, 83, 19, -110, -222, -4, 95, 122, -216, -74, 242, 367, -147, 40, 69, -94, -46, 66, 322, 83, 167, 54, 24, 117, -35, 27, 143, 142, -1, -234, 45, 181, 99, 83, -33, 13, -159, 39, 68, 65, -46, -18, -21, 93, -102, -105, -167, 34, 168, -239, -165, 8, -21, -13, -38, 8, -22, -229, -55, 50, -147, -2, -48, 81, 16, 81, 103, -62, 171, 240, 90, -83, -128, 158, 118, 219, 412, -27, 62, 117, 32, 35, 95, 120, -52, -282, 54, 11, -61, 291, 38, 106, 34, -256, 227, -33, 69, 60, -68, 6, -252, -176, 107, 193, 272, 116, 68, 39, 136, -236, 118, -75, -102, 20, -85]
7061h5L8j13P1r7J96J53j96R7q0K0P8j31K0J19q8K36k45j61K08q5L8K1n5J2j42
7086a71n1L58k31J22m0J67r6P5Jq5j62J17k7J97p8J2j88M8l71M31J27j14K19n1
7110B09k74J03J77k18p0J85k13Q6j06J05J05k77L03k06K72k65m0q3J70q0J72L4
7132H9L5m7q7J03l2L4J4J46j46l12J06q0J38L6Qj96J82J1N6j64K11Q4j68j61J19
7157b1R6j6L5j35M4j1J23K7p6m5m1J91k06j7K18j30J45j06r2ml6LmP3M1j61l6
7184a41K59j23L11k33j30k3qM8L7j9K93k49k24O9J84P6q0J7k36nR6N91n69J35
7208G6j5m44O28k00k10K09j00K2k98K55J06n4K26J30k96j01k31j61M50j63K19
7229D8j18J8J3l8k79J47l3M08J98r24O23K64k75J83p60J035p53Q47q48L46j69
$$ y = [-85, -47, -160, -89, -186, 10, 163, -33, 64, -16, 4, 82, -49, -29, 90, 2, 238, -7, -168, 40, -45, -7, 14, -41, -29, -171, -222, 136, -95, 27, -13, 154, 58, 133, 134, 49, -113, 4, -23, 174, 96, 108, -80, -32, -403, 28, 155, 41, 260, 209, -65, 38, 215, -3, -73, 112, -101, -15, -121, -16, 89, -188, 115, -91, 181, -84, -124, -207, -37, -117, 55, 89, 124, 77, -10, 93, 61, 95, 109, 255, 109, -203, -97, -177, -39, -3, 5, -191, -9, 2, 58, -106, 105, 189, 21, -140, -21, 75, 59, 94, -41, 3, -8, 115, 142, 66, 21, -20, 171, -35, -52, 166, 36, 181, 75, -17, -21, -57, -54, -58, 15, 56, -105, -141, 118, -5, 306, 73, -57, -80, -88, -40, -3, -22, 271, 22, -202, -133, 51, 127, 47, 64, -172, -177, -81, 510, -59, 76, 61, -383, 245, 45, -165, 44, -56, -34, -332, -77, 29, -25, 201, 331, 35, -66, -297, -458, -8, -171, 48, -70, -52, -39, -77, -356, -209, -242, 166, 364, -560, 63, 327, 52, 235, -525, 510, -243, 604, -244, 102, -67]
7250f7m48Q95n68Q58l25m77j6J61m37J49P0M69r40J080o36O8J45j33m1O57j12
7271C52o5j19j98j21M26r0p40M18K58n4p1j74j35M09M1l38L01N9k23K3N7j88J82
7294A0o9K15k30J3m4N6K49k66K9J7J66j87J90N8m37K07m7K37j73K68m01J46K23
7317B30j40k6R4j48P0N0l7j87K20j0Op1j7p6K36k70J67k02J47j27O8p4q2J56J15
7342I2k03QQ8p9pJ64J4jn2k11K23PJ44k96J50Op5p7n0N6M10k90J19p8J6j08j63
7369a93L94q0J08l12R0j51O6J01K01j65lo6j8J63K4m95K94L2k4Q5o4o7j78K66
7393HJ27m41P1K62l52Q29n05L99j59m37K09N97p25R2M3j46n2j56n2n7Q00p17N0
7416c12O05k64R9k90L30k14Q4K04n8l22J21LJ76j35j1k8K69l44J09q6R4j03J11
$$ y = [-67, -515, 380, -188, 670, 345, -132, -148, 13, -424, -275, -205, 264, -676, 404, -232, -164, -19, -152, -193, 464, 352, 287, 168, -30, -151, 275, 185, -555, -137, 121, 67, -4, -178, -313, 96, 137, -201, 100, 159, -64, -41, 16, -172, 10, -59, 156, -74, -61, -105, -49, 200, -66, -37, -20, 146, -41, 149, 207, -230, -23, -70, 167, -6, 262, -139, 7, 230, 90, 64, 158, 10, 80, 130, 93, -94, 126, 116, 122, 51, 34, -42, 194, -76, 91, -111, 36, -91, -23, -97, -179, -23, 92, -111, -103, -15, -94, -101, 63, 77, 76, 24, -187, 36, 43, 187, -109, 41, 47, -28, -105, -155, -99, 311, 21, 140, 62, 78, -30, -193, 201, 121, 229, -83, 7, -144, -78, 23, 224, 59, 56, -10, -28, 135, 159, -336, -42, -10, -34, 51, -13, -80, -258, 8, 135, -306, -235, 27, -325, 504, -1, 398, 239, -198, 11, 608, -117, -25, 18, -128, -180, -336, -388, -445, 355, -362, -312, 293, 29, 128, -162, 168, -46, 38, 242, 184, -138, -17, -14, 162, 27, 16, -12, 257, -87, 22, -64, 30, -73, 38]
7439C8k03N73l60k28P8o6K53J8k1J4j23J2J1J02j09j40J70p5j58J48R5l2L6j2
7463B1m1KJ24j29kJ00k13j11L76k30J3r3J05N6j45K35j19J62j92O4K18j04K7j90
7487f6N8PJ39l60J76L20k70m5J46p2P0k79p1K28N2k76K67j52K37O0kk52j78L90
7511A27l51O7M27k53o6j89J30J52O8r9O2m6qo0K66l33P5R3m5k44J49m9J36r5L6
7536e0K20k30j91K20J94j28r7l8K2K43j08l47K61q6J98R8M2k55J85k03J29j24
7558d5r5r2K85Q2m9J31j66j94M27k1m00J16J3p1r6K87N6r7j32l2M2j74K58k26
7582a93j03K68J92k81J69q0Nl27K32NP2Pk3k36M02k17j93K30L01l21M4J79m60
7605c28M47n25N69m24O0L36k5n7o0J21P0k48J83j08k1j07J25P9O5P6l66j93J60
$$ y = [38, -165, 408, 48, -180, -102, -168, 85, 103, 82, 96, -27, -15, -4, 98, -11, -151, 19, -56, -214, -66, 29, -3, 33, 21, -20, -18, 106, -23, -25, 75, -138, -249, 127, -103, -90, -183, -78, -22, -167, 68, -51, 111, -81, -17, 201, 97, 124, -66, -8, -1, 138, -222, -46, 274, 4, -41, 105, 33, 103, -176, -247, -19, 33, -243, 24, -128, 109, 169, 167, -85, -263, 127, -224, -157, 270, 17, -49, -238, -108, 44, 112, 13, 75, 29, 21, -39, 227, -106, -31, 62, 17, -227, -78, -127, 9, -86, -50, 170, -60, -251, -31, 163, 35, -62, -100, -78, 165, 57, -290, -29, -115, 83, 181, 223, -32, 153, -50, 79, -45, -140, -232, 53, 135, 86, 217, 51, -143, 284, 263, -137, -21, -8, -79, -175, 112, 168, 71, -61, -93, -51, -225, 33, -193, -296, -28, 164, -117, 52, -28, -23, -350, -118, -113, -41, -34, -57, -293, 109, -108, -301, -71, 230, -91, -47, 132, -328, 119, -406, 163, -261, -201, 135, 110, 53, -7, 114, 184, -64, 119, 11, -10, -117, 8, 87, 152, 228, -138, -331, -171]
7628a71Q9K13k91K91j19K3M0k09J48j64J49j76j5K05q7J38j87K63r0j37K47j16
7650D4q6J6O1oK2o2P1k52L1J3K41KJ23l36j33P1K13j09j02J93K06q5l5K03l10
7675fo1J07j57J87k73L00j48Q4L7j72O1j15J21j72J26j31K58k13J29J37q9N6j41
7698g5j5O1qM25m15N7L69k97J3l11J89L10l38J85j12j77J66r4K00l7j14N0J25
7721A57m09L50j29j07J4L8J60p5j53J47l02M16k01j1K28k5j16l8K69k52J22l94
7743c11l2L42J72J06j82k6k44J42J06O8n3L1p6Kj69J04o6r7K13k60P8J21NQ0j8
7768C6rNj72K26j4J58j38l54L67jp3j49J14N1o9Q3Q9k85J09N3p0q3J19r4o9K75
7794A05k26J11q9R3J55j80l4jm8K04j69J06K02k51j09k6P5J87n1r3j18J07j12
$$ y = [-171, -82, 131, -160, 131, 12, 35, 75, -134, 14, -150, -1, -177, -192, 13, -74, 64, -123, 140, 50, -87, 160, 44, -42, -26, 35, 29, 51, -11, 60, -192, -161, -148, 93, 95, 218, -118, -251, -180, 33, -76, -178, 15, 221, 136, 101, 304, -6, -67, 40, -117, 70, -203, 97, -51, 33, 70, -102, -41, -156, -35, -207, -81, -212, 46, -167, -38, 99, 10, 66, -75, -90, -29, -37, 388, -27, 30, 399, 102, 115, -196, -7, 303, -35, 150, 38, -139, 27, -67, 133, 96, -18, 32, 157, -252, 98, -31, -138, -124, -86, 74, -1, -154, -7, -309, 107, -94, -105, 123, 98, -18, -56, 213, -39, 83, -311, -343, -1, 171, 277, 95, 69, -175, -33, 73, 141, 88, 119, 43, 45, -124, -20, -86, -183, 30, -230, -152, -31, -26, 54, 36, 27, 32, -140, 86, 72, 230, 92, -262, 105, 104, 31, -118, -4, 47, -22, 61, 150, -135, -26, 27, -43, -126, -7, -101, -170, 105, -121, -10, -99, -6, 149, -31, -65, -66, -114, 90, -79, 27, 229, -22, -131, -157, -82, 105, 54, -39, -157, -50, -162]
7817a62j91N02j9j75k00J43K52j88J02Q5p6J17J03k76l6O1NK45l81K82k44J66
7839A15qm74N91m6k23qJ15j43N1K03l09J62J14l19L80l97O8K75j20j38KOK83j74
7863Fj71QJ24K2m2m2K04l53K50j45O9R1j62P3O8L04l81K6p0J32j95J87R6j17k51
7888b69K63J77k1k49l7R1J73j35J66k47K72k67m5J21k7K76m30L09j92K15l47j14
7910c17L40o7o6L18J7k56J55K70l54j34J62lJ3k34J66mK14k53j26L58l18K18l04
7933b05M82m13K12M3k21l49R45o96J22N01o46J78k25K09N8J43K65k56j54Mj89
7954a92m0L22K55o99M88l85N90l2l34j24j0j09K02K34J56k83o01M55l46K98J85
7975C0l67P7M53j68N72j047Q17p63R40r48P19l30m54P35Lj72o40L22J08J93k86
$$ y = [-162, -353, 149, 130, -45, -245, -102, 150, -38, 64, 149, 73, 190, 293, 17, -19, 42, 47, 292, -89, 193, -51, 115, 107, -367, 224, 178, -45, -53, 62, -81, -30, 173, -136, 26, 140, -179, 201, -196, -128, 147, 27, -111, -109, -103, 180, 6, -165, -157, -33, -11, -53, -95, 109, -244, 6, -139, -70, 21, -141, -68, 0, 304, -77, -51, -121, 11, -184, 3, 99, -18, -269, -6, 171, 150, -99, -136, -45, 128, -7, 159, -88, 184, -83, -128, -7, -34, 242, -188, 121, -71, 144, -203, -317, 23, -44, -110, 208, 225, -31, 124, 394, 40, -94, 68, 65, 78, -156, 10, 6, 220, -33, -159, 199, -119, 99, -205, 277, -136, 76, 119, -102, -451, 494, -202, -80, 421, -225, -47, -272, -63, -5, 138, 403, 147, -7, -3, -192, -232, 90, 345, -354, 134, -251, 339, 307, -27, -151, -161, -270, -68, 166, 322, 39, -562, -107, -453, -155, 30, -337, -260, 193, 25, 597, -450, 367, -396, 544, -404, 315, -15, -469, 266, 269, 97, -543, -221, -113, 80, -206]
7996b06N32p7l73N58k74j33J43N4l61J91J67k78O75o23n9L88o5J43m23m17L16
8017a22P47r00k13O66j11k95k6m4L24J0L54q58M06M6m5j74j7O43k10j47L64m18
8039b0k07K63l2j37J57J31L5M7j19m24O72n86K28qO3K32m1J95l70k15O9M27J03
8062D63n27l36P06r62P82l64K34M16j92k16J21K4n67M23k45K13n09N11M1o0N0
8083FM82j24p05L62L46k87l8M19p34Q62l76l81J56k03R0k03K00P8J95K09q4j32
8105A38j6n35J64L70n24M85k07J85k1oJ92n76J52k40Q72K29o05J28p05P32j48
8126F4l57K47k34K59M06m43n5K62J97j75j338R61L03J94o74Q46l58O2k90l7M57
8147B97o49P69O4m1o08L1N21l92K81L24j110O55J81j75J76n93Q37q40N77l59J45
$$ y = [-206, 326, 249, -124, 434, 160, 27, 170, 224, -137, 54, 221, -57, 618, -5, -64, 324, 259, 402, -21, -438, -122, 625, -275, -488, 178, 67, -228, -254, -298, 26, 36, 390, -468, -62, -16, -61, -235, -252, 391, 181, 34, 398, -20, -227, 36, 4, -133, 24, 155, 190, 237, 118, -306, 366, -220, 8, 0, 63, 295, 254, 449, 79, -136, -67, 360, 463, -64, -400, 306, -656, 126, -238, -4, 412, 220, 4, 125, 149, -418, 5, -240, -27, -536, -25, 16, -44, 6, 488, 364, -341, 21, 367, 80, 42, 461, -273, 589, 213, -168, -12, -215, -125, -328, -128, -50, 145, 354, 270, 138, 122, -413, -249, 121, -403, 82, -125, 60, 39, 33, 225, -351, -199, -439, 433, 662, 57, 185, -520, 212, 64, -293, -46, -280, -21, 385, -58, -113, 149, 346, 171, -1167, -206, 97, 291, -383, 463, 105, 167, -123, -160, 297, -352, 417, 481, 440, -168, -137, 384, -8, 273, 597, -513, 142, 323, 148, 324, -269, 568, -272, 305, -54, 91]
8168I1j20q0M31M0j180M31m6j65J070k9j99j227Q98L93k03K6M4M80n55K20j42
8189A78J6j61
$$ y = [91, -29, -109, 322, 362, -818, -387, -433, -598, 472, 443, 244, -983, -85, 308, 105, 131, 175, 655, 100, 320, 178, 194, 33]
8191C3
$$ Imaginary data points
##PAGE= N=2
##DATA TABLE= (X++(I..I)), XYDATA
0@%%%%%%%%%%%%pJ5j6J6k3L1l3M1n5O3p1Q6j02J20j43J67j92K22k55K92l33L77
34B00m29M85n46O17o90P71q63R59j065J181j308J447j599J766j946K145k364K603
52A364k869L162l487L852m260M723n256N872o592P451q500R809j1494J3760j6991
67i456K2041l1466Q2257k09825J56509R1504k60657K50447p9072q8866J65419
78H8835j10037m006P7817r1160N6031k4089r427L9197m5130L7543j4870m5688
90d4984O7810n0175J1323M7535o7794N1574J3320p3413O7582k9004m4652P6478
102B5600m6426j3779P0670n8516P819M4885n5676K2938J4345m3947L7349n89j9075
115a4402L0105k7508o086K5482j7125J0544J740m610J9464k2584N175J3441l3886
$$ y = [0, 0, 0, 0, 0, 0, 0, 0, 0, 0, 0, 0, 0, -7, 8, -8, 8, -15, 16, -17, 24, -31, 32, -39, 47, -55, 65, -78, 89, -103, 119, -136, 156, -177, 200, -229, 256, -290, 327, -363, 408, -455, 504, -561, 620, -688, 759, -840, 926, -1020, 1125, -1239, 1364, -1505, 1657, -1830, 2022, -2238, 2485, -2771, 3101, -3491, 3960, -4540, 5269, -6225, 7535, -9456, 12585, -18881, 63376, -146449, 10060, 101564, -159093, 91354, 12282, -76584, 88835, -21202, -25208, 52609, -38551, 17480, -6609, -16036, 23161, -21969, 15574, 704, -44984, 22826, -27349, -16026, 31509, -36285, 15289, 28609, -44804, 22778, -6226, -50878, 25600, -20826, -34605, 36065, -22451, -14632, 30253, -25423, -2485, 11860, -32087, 5262, 4673, -14402, 15703, -11805, -17891, 7591, -9534, 1010, 2750, -1860, 17604, -4980, 195, 13636, -20250]
128b0250K2176L60k1012M6090k2903j6513M3736m5924P537L8648n5565K8589K0249
141B5218m7451L8335j1746k5140M1976k7889K678K4685l0846J9395n141j5554
153a1480K5481k3178O136Q541k3981L0004j0775r946K8835l4803J1906J8769l6983
166b1474K9517m893k6343L7784k1051r205L1139k7084N369J6244k1902J6459J797
179F357j5480J1167p083j495P839p837Q127J252l252P562j1962M462Q567j4744
193f520J1466J633j3856J6649q200r632K0462j2333j358J8023j6813N783R186
206A4490j9917R396K481j2525J5998m670p404J3186j1190O80Q681j1272P960k59
220E635q429R406p796J26N600j0817Q918k393n273J4278j3482K631J1418k0837
$$ y = [-20250, 1926, 2286, -18726, 27364, 4461, -12052, 31684, -14240, -6703, 31945, -23620, 4969, 25218, -22233, 16102, 4356, -20784, 21192, -6697, -4019, 20666, -10180, 9215, 4074, -11480, 14001, -9177, -3041, 5500, -18481, 11523, 748, -9198, 19637, -15166, -3260, 15509, -21474, 8043, 3150, -23193, 14591, -6460, -15665, 15474, -11610, -6241, 10003, -11899, 4560, 6357, -9123, 2044, -5039, -6534, 1305, -6532, 1595, 2847, -405, 7157, -4805, -343, 8224, -6520, 4946, 6579, -7277, 9372, 1172, -8460, 12002, -331, -1689, 16334, -479, 5304, 14490, -5427, 3969, 6450, -6075, 9923, 5253, -2151, 11035, -155, 525, 9206, -2066, 5894, 5635, -2794, 6612, -1184, -1058, 4542, -6275, 2643, 250, -5023, 9255, -4227, -1596, 9822, -11015]
234a1015J0959J291j6513K0275q974o525J8163j6650N482O694j6352J3208l947
247c904n908J3917j2569N159M931j6233J2287k621n480J5166r468K400P150j4193
261i366P578k01q121J2500n229j564J0507q534J015M553o656M581J345l159M182
276C431q79J74q53k625M465l301j196O462m254J863N790q477K124L804q968M529
292B089J745n674Q163j658m256O600o618n32N790q514M884L860p865O350j915
307B449o175N777m252n93M736k407L493k554j258K217o973M262R53o405R708l803
323h25m515R053q144P52O917r134N559K507p302O767k604l266O398n027k91M754
339A599k400J433R69j286J133k35r06m08m7J921j160n78M111l045q71M725n680
$$ y = [-11015, -56, 1235, -15278, 4997, -3977, -10502, 7661, -8989, -3507, 3187, -13165, 43, -3904, -9812, 4105, -8464, -3305, 1626, -14607, -2320, -4941, -10421, 4745, -4723, -2323, 4827, -9366, -1788, -1989, -10110, 2390, -2839, -4403, 6104, -2430, -1415, 3138, -3518, 1063, 2408, -751, 3431, 2552, 2726, 1873, -752, 3713, 412, -784, 5678, 1424, 3287, 9077, 600, 2724, 6528, -2440, 2089, 3834, -1840, 6323, 4665, 409, 7009, 391, -141, 5649, -2865, 2019, 5879, -1986, 4364, 2449, -3726, 2051, -2201, -2794, 1942, -465, 3028, 474, -784, 1433, -5540, -1278, -325, -6730, 2978, -825, -5340, 3713, -4431, -3679, 3238, -5896, -337, 2170, -5132, 1635, -969, -4235, 2163, -2864, -3155, 1599, -801, 632, 1601, 315, 1448, 1213, 307, -101, -148, 1773, 613, 35, 4146, 1101, 230, 4955, -725]
356g25R58O492q138K962M769r772O338J120q500R504k388n251R084o228m23M652
372D454o767K649O19l236L531k281L43q0j698M060m408J886L131q116N319n49
388a143p274R017l503m052Q847o214l64N413o721M085R68m476L407j023r45J164
404b814j274K114j383J287K160k652M049r58l771M672l501j149N267m726K404
419b75L978m921L115J357l329K532o7k213K395J030k536J117J178k770J692J680
435C963k359K899O84k793K726j431l039J585L19k104J536K417k849J206K502n505
451b43J936J638n431M319K87m829M733j898l168L993k715M2K485k082J009m49
467c73n12l12j825N35j043P34K239k378L069l00l686M287k302k863N546l214j393
$$ y = [-725, 233, 6725, -1413, 1549, 6318, -3454, 2884, 4004, -4496, 5008, 2620, -2631, 6453, 225, -198, 4454, -2313, 336, 955, -2281, 1250, -1031, -688, -768, -2466, 1594, -2814, -928, 2203, -5913, -594, -1143, -8417, 600, -2903, -6955, 1892, -4322, -4686, 727, -5994, -1909, -941, -5417, -2010, -3033, -3978, -2814, -4088, -1974, -3357, -2070, 90, -2562, 1487, 529, -3242, 1430, -2071, -3220, 2047, -2679, -275, 3703, -1218, 1897, 3254, -75, 2457, 2390, 177, 2572, 3602, 1066, 2183, 3361, 591, 2283, 3963, 1604, 4503, 5187, 2394, 5120, 3689, 650, 2235, 2554, 450, 1986, 4403, 1554, 2760, 5262, -243, 1693, 3331, -2100, 2219, 2506, -2323, 2410, 512, -2656, 1337, -1378, -1336, 1149, -933, 76, -373, -885, -1197, -3022, -2487, -3530, -2796, -557, -2935, 134, -166, -3852, 435, -1867, -4730, 816, -2398, -3791]
484c791N392m030o67L760l554J085L460l516P22L502l347K18K247l654J090K414
500A331l197K292K031j836J611o62q68J271k136O17Q19r03J343j736K040j24l355
517a462M733j906k781N508n102P74M253p936M567N22o331Q158l120k535O749o271
533b180J063K103n278M745k650j354M800m851K183P34k719M449m167J095L617
548A590p192M814J099n747P179l791k830P145n467J173M631n327L339J332m103
563b155K318L36j502M25R94J477j068O87J016k171K062l28j039K050j722K8K409
580C817k517N68J523k135J739J121j693M64K70j102rR15j823N00J282l180K198
597A938J272l752K517J146m332L220j420k692L566k497k61K609k417K4L43n49
$$ y = [-3791, 1601, -2429, -3096, 664, -2890, -1805, 1655, -1861, -1139, 2363, -984, -766, 1481, -2173, -1083, 1331, -1866, 426, 2457, 621, 2232, 1570, 702, 1973, -163, 454, 1273, 370, 1713, -23, 2017, 1893, -1462, 3271, 1365, -1416, 4092, -1010, -236, 4017, -3919, 648, 1170, -5161, 2997, -123, -2658, 4091, -2180, -1117, 986, -4292, 453, -2197, -3551, 1249, -3602, -1419, -685, -3404, 1045, -3122, -2027, 1590, -5602, -788, 311, -5436, 1743, -2048, -4878, 2267, -3200, -2027, 2604, -2723, 616, 1948, -2155, 163, 499, -1003, -578, 416, 1893, 825, 1512, 2528, 357, 2419, 2091, 1052, 3102, 1380, 1408, 3817, 1300, 1868, 3391, 1256, 2995, 4116, 2423, 2887, 3157, 2055, 2046, 2961, 1138, 1638, 2920, -260, 1938, 3210, -542, 1975, 3121, -1211, 2009, 589, -2103, 1463, -1034, -1295, 1314, -1103, -1079, -736, -1285]
613a285m78R64J070l491J799J212m212L388o53l541N192k308r20L315k971P54
629b165J210k103R87j80J34n37L45K015k282J251J312k900L791j069k305L980
645A484k730K02L381l838J822J093l262L000J77j048K014j440J30N39j203O74
661I95n01Q64N55j037J565j330p54J391j329N25J302k003Q48K46j730J137r5j125
679d76Q34K36q17M95J81j286P81N54j924Q33J48j799J952m10p15J243j055L43
697h82R8o09Q69j415J197Q14j796K373j919m25K639l430K408J929l879M260k107
714A25j911M520m142K080J812m229M851j753k099M368l586J611J675m018L334
729B638j278j898L838l114J943J132l656L241j683q44L047l247J554R86l048K397
$$ y = [-1285, -1763, -799, 271, -3220, -1421, -209, -4421, -1033, -1686, -5227, -35, -2343, -3263, 52, -2919, -2165, -955, -3058, -2071, -2251, -2117, -2654, -2309, -294, -2576, -1325, -13, -2913, 878, -191, -2496, 1484, -1246, -1044, 2337, -1501, 321, 1414, -1848, 1152, 1329, 281, 2295, 855, 985, 1524, 321, 995, 494, 1358, 1913, 876, 2441, 1111, 357, 1748, 419, 944, 2246, 243, 1091, 1337, -393, 744, 649, -476, 358, 594, -223, 272, 453, -833, -52, 502, -1422, -589, -441, -2240, -288, -698, -1413, -170, -1225, -882, -784, -1393, -524, -1939, -742, 72, -1724, 649, -1270, -1695, 944, -2486, -78, 1851, -2028, 2232, 125, -1786, 2734, -1408, 672, 2484, -1745, 3106, 1353, -746, 3622, 36, 1647, 3322, -696, 2638, 1360, -538, 3300, 186, 2129, 3261, -395, 2846, 1163, 319, 3366, 119, 1673, 2659, -389, 2008]
745B008j414j370K616k464P80J438k310J689j085j130J198j112j15J041j247K80
761a197Q09j633J35M22q08P09L59j005N73k89o24K27M49n34P01l36j6K64j61M83
781a472j97k52N12o53N10N50k84J017j50m75Q95q79N7P28k07J470k86m72P32j184
801d0P12M05p45J606n13J6Q89j577Q74m35m06J704j400R34M10j787J885j406n76
820E50K014k319J218P05k320K090j025r66J772j845J017K52j849J884j618L4J775
837A369k952J523O74k619K354j043r08K328j672J14P82k108J608k76k02N76l84
854h36J70Q9m40j16K29J072l43k74L14n59Q73k64m97P93o71L38J179j309J302
873A050j67o49J357j069M72J91q32Q98j64j742L313l131J380J212l085K727j099
$$ y = [2008, 594, -776, 1840, -624, 156, 1594, -716, 973, -112, -1242, -44, -1156, -1271, -230, -1477, -1197, -388, -2021, -1886, -1464, -2272, -1563, -1204, -2209, -1636, -1925, -2549, -2322, -1873, -2407, -1706, -2042, -2058, -1794, -1955, -1472, -1669, -1921, -1409, -2062, -1552, -1002, -1286, -269, -419, -894, 1, -878, -821, -93, -300, 1170, 884, 412, 1144, -40, 672, 1077, 332, 1938, 1425, 1441, 2330, 753, 1627, 1192, 786, 2490, 1090, 2024, 2434, 647, 2532, 1126, 550, 2564, 245, 1463, 2168, -152, 1938, 913, -53, 1719, -126, 891, 1143, -706, 1178, -440, -406, 1369, -1583, -60, 614, -2005, 349, -694, -1602, 726, -946, -832, -50, -2158, -550, -826, -1028, -452, -836, -666, -577, -1017, -1133, -904, 168, -175, -449, -135, -694, 179, -85, -582, 211, -460, -122, 1057, -252, 1050, 883, 234, 1591, 522, 994, 1185, 353, 1251, 1087, -655, 2658, -473, 907, 2119, -966, 1761, 662]
890F62j375L336k381l77K645m608K831l16j770L062k015j72J211k602J839j52
906a82k043L292k749n25K884l379J519Q29k389K218n15j76J646l467J919J462
922C44l220K351j240j052J964j212M69J058j139O09N71K03p52J099j012Q78M36
939C55r16L1J065o09J0J537q84L60p2Q7L84l83L91J89o82P92l27J79J00p95J673
960B485p21m01R98j238J171M75k242J505m72q95J411p51L64j86j416J564j338
977C13n61J600j536J036r6j405J369j624J324M65k563J681j39k131K971j847q19
994a962J636j513J216n2p46J122j265l12J076j292J621n42n62J236j608J203O98
1011d6j833J970j114o23J870j004L88J137j708J247P6j348J447j29j23M20q51
$$ y = [662, -713, 2623, 242, -135, 2510, -2098, 733, 417, -1353, 1709, -306, -478, 733, -1869, -30, -182, -2225, 1067, -1682, -2207, 677, -2702, -1183, -354, -2743, -525, -1040, -1216, 430, -3037, -1118, 344, -2876, -525, -1765, -2817, -853, -2065, -1596, -538, -1677, -1068, -497, -294, -1046, 53, -959, -81, 355, -561, -530, 535, -74, -64, 1473, 589, 949, 877, 964, 1348, 965, 1356, 1545, 863, 1655, 1328, 1507, 1607, 812, 2485, 1764, 1363, 2361, 1123, 2294, 2769, 527, 2032, 1560, 665, 2076, 1325, 1689, 1503, 87, 1651, 313, -248, 1352, -184, 852, 756, -649, 720, -904, 420, 885, -1678, 3, -136, -2267, 704, -1143, -1962, -326, -1839, -623, -675, -1421, -299, -1564, -1876, -800, -2092, -471, -1013, -1575, -339, -1947, -744, -46, -1879, 91, -1023, -1646, 224, -780, -392, 745, -963, 284, 360, -988, 459, 330, 207, 627, -224]
1028b24K60O68j53Kj27M33p64N97L66r95Q33m6q04J146o07P5k16j33L75j008Q08
1049D86o3j014J295r89m80J616k181J249P13k212K269j142j191K615k767Q84J336
1066D24l075K703q21j145K728k477L75J491k370K552r55j534K695k364P84J899
1082I10k872K942j396j086L437k761O81J914k824J953N0j945L200j828k83K118
1098B210k593J744Q53k057K072o83j110J500j522O07R34j232J139l59o23J157
1114B037j043K17O87j836R95K98j683J651n55j003J633j096j35P13j105O42J04
1131E21j884J607r44l21J158j232L22O91j817J528p66o38J187o69m86Q63j042
1148a922Q06N2j034J514p69J17J310j927O04Q69k297K248k80j222K105j379J08
$$ y = [-224, 36, 704, 551, 553, 426, 859, 95, 692, 1058, 63, 896, 850, 46, 1192, 585, 660, 444, 311, 686, -322, 486, 423, -591, 704, -285, -765, 851, -1330, -81, 632, -1580, 689, -453, -1644, 971, -1796, -912, 424, -2651, 52, -769, -1914, 814, -1663, -1288, 203, -2167, 385, -570, -2104, 591, -1773, -989, 910, -1962, 980, -416, -1502, 1935, -826, -145, 1769, -1055, 898, 948, -997, 2203, 375, 92, 2210, -383, 1361, 2214, 157, 2229, 1546, 436, 1936, 414, 1021, 1955, 723, 1862, 1503, 880, 2037, 994, 1211, 1898, 62, 1057, 1355, -328, 1323, 768, -235, 1398, 302, 167, 880, -225, 417, 521, -1363, 244, -700, -1021, 137, -1095, -773, -82, -1899, -371, -1137, -1775, -588, -1257, -1743, -880, -1922, -1116, -1064, -2098, -584, -1353, -1236, 74, -1853, -1249, -380, -2677, -429, -709, -1931, 174, -1205, -1097]
1165a097J667j533J163j08r48J658q98l25J624k169J044N33j023J686m18j44P98
1182A510r92Q4R3o31J319p76n09J525q78J3J153j687Q29J76j110O73n00j83J145
1201A254j398M53K23j155J264l68o46J138q55n17P09r27M22j79l47O66k49j4J074
1220E48j209O87q3j242J269m57j039J831r10k55J278j193J122l2r48J550j184
1237b67n32J977k040O06J535k488K120K38j857K616j072n21J657k316J100N98
1253A354j913K029q48r07K922k411R30J188k559J652l61j712K360j238j059J940
1269A367k192J265O32k312J917o26r04K960k868j9K023l215J603Q14k350K121
1285B16n92q45J784k642J425P93l292L120j386j333K910k050j27K521l687J994
$$ y = [-1097, 570, -963, 200, 92, -856, 802, -96, -421, 1203, -966, 78, 611, -412, 1274, 856, 712, 1510, 518, 602, 695, 64, 1383, 607, 98, 1623, 745, 758, 1911, 224, 1053, 1229, 119, 792, 292, 109, 1254, -144, 309, 532, -623, 641, 273, -373, 765, -90, -607, 102, -825, -403, -582, -929, -263, -512, -526, 548, -661, 26, -57, -1299, -30, -487, -1526, 305, -605, -860, 418, -775, 347, 315, -633, 917, -267, -799, 1178, -862, -256, 1279, -1209, 911, 1149, -708, 1908, 836, 315, 1972, -344, 756, 1354, -559, 1470, 622, -285, 2637, 226, 1156, 2344, -215, 1437, 1076, -636, 1724, 486, -573, 1367, -825, 440, 1072, -1240, 677, 51, -853, 2107, -761, -780, 1243, -1972, -369, 445, -1905, 216, -376, -1221, 563, -2079, -654, 139, -3153, -33, -1419, -2752, 158, -1892, -2019, 502, -3185, -1191]
1301a191J178k869L783j778j174K897k870P39J798l239K923k73j728L122j803
1316d85j31J977k119J613l4j737J937m39j003K952k333P15J311k734K818m53j677
1333A78K188j849q0J950k501J793kj833K407q01j503K257j809m22J401j273L73
1350D74R38k112J839o42n37J087j311K42J082k181J210J87j780K292j272q23J923
1367F16j896J008O00k339L041k468jK720k999J200J347k712K351j62j702K282
1383H86j652k43J999k674K284n86j518K752j766K99J684k352R02J308j785J321
1399H59l09j041K060j552L54j79j051J992o16o40K237j964k25J430k008J083N45
1416I75j331J440p85n21J179j807R95L92j551J893m60j301K023j709k97K008k191
$$ y = [-1191, -13, -2882, 901, -877, -2051, 846, -2024, -1285, 513, -2726, 197, -76, -1804, 1318, -485, -616, 1361, -758, 855, 821, -916, 1021, 582, -421, 2531, 198, 913, 2224, -510, 2308, 1855, 178, 2366, 517, 437, 2387, -114, 1679, 1677, -156, 2251, 1450, -53, 2204, 395, -27, 1374, 101, 474, 1412, -700, 1139, 497, -40, 1047, -264, -22, 1060, -1121, 89, 276, -1504, 788, -484, -1307, 616, -1280, -272, 328, -2011, 1030, -1438, -1439, 1281, -1718, -518, 829, -1883, 468, 306, -1396, 886, -766, -1009, 990, -1684, 600, 14, -1504, 1248, -518, -219, 1465, -887, 15, 1323, -462, 859, 550, -491, 1569, 17, 371, 192, -859, 1133, 517, -123, 2114, 150, -75, 1355, -653, 430, 975, -356, 1084, 299, -222, 957, -850, 145, 537, -1014, 879, 419, -882, 1141, -568, -865, 1143, -1048]
1433a048Q1O83p16O69o05l61J320r82p02J970k167J657N53k152J581p71q49J876
1451C7j819J519Q99j781K190j191n13J741k626O34K259l141K070M59j561K087
1467A263j166LJ207k217J444M75j889K636j022j57J072j871Q35J273k047J433
1483A272m62l25J709k238J157K24j266K428j544l24J674j308L5jj041O40M70j174
1501g4J162j107M9M92o10j99M29p03J019n58J87L89j096L91j57l98p59R36q0M51
1521b36P20q67J51l4j470J424q20k95J110j324J146L36r45J174j33r27J419j544
1539a115J67J433j619J322j88j484K377j314r4J481j714J510L66k073J728n15
1555B68j084K398k215L84J373k253K416o58p38J158j666N88J873l196J402N59
$$ y = [-1048, -967, -284, -1000, -331, -936, -1297, 23, -959, -1661, 309, -1858, -201, 352, -1800, -219, -990, -1839, 37, -1782, -263, 636, -1145, 1045, -146, -659, 1082, -1544, -910, 1349, -1792, 278, 737, -824, 1263, 97, 100, 1307, -910, 534, 1009, -880, 1756, 734, 577, 1649, -222, 613, 1886, -161, 1272, 810, 485, 2194, -44, 1113, 1337, 71, 2499, 955, 631, 2305, 997, 1032, 1031, -10, 630, 1100, -74, 1088, -19, 30, 522, -88, -287, 142, -561, 458, -100, 87, 476, -620, -229, -386, -784, -1543, -607, -687, -236, 484, -383, -232, -266, -1736, -312, -1132, -1427, -317, -1641, -495, -159, -1104, 70, -63, -990, 429, -1115, -948, 485, -1134, 188, 0, -1484, 893, -421, -515, 966, -748, 762, 1128, -945, 783, 268, -816, 1582, -633, -249, 1124, -1129, 1287, 629, -109, 1049, -617, -29, 1844, -1352, 50, 609]
1571F09j735K217k463Q79J869k216J324j19k303K395k13m43P41m86m52Q94j308
1588h10P94l76O33k09l26l91J11k88l42L97o59J528k97j072J132P49m92N16j322
1607g24K78P30j107J79J399o53P11j349J526J32o45m2j138M44M67K61o82N29r17
1626f01J036R78j271R17n81r64J775r06L58R38j836J625r94k38J259j948P67J348
1644A662k215J878O03j870N82p62j27R69j272J23J080k055J437m28o45R05o42
1661g77J19K8j171K083j235K4L87r10J035j68n14J119k80j538J442o07j89L26
1679h26p64O24Q10j690J270O70j475M38O66o14K37m15P95j33k7M85m80j16N97
1698E2O06p30J454j176O4M78j175J277q50k50J597p29K17R35j752R02o4j620K273
$$ y = [609, -1126, 1091, -1372, -493, 1376, -840, 484, 365, -1938, 457, 244, -199, 542, 56, -396, 498, -810, -16, -392, 241, 32, -294, -685, -574, -862, -1204, -807, -1466, 62, -235, -1307, -175, 574, 82, 598, -724, -446, 284, -823, -644, 755, 102, 813, -536, 990, 1122, 477, 435, -703, -259, 208, 469, -213, 316, -601, 435, 1413, 142, 1059, 478, -486, 1289, 383, 741, 1679, -157, 1468, 474, 236, 1495, -453, 314, 1662, -553, 1325, 1928, 58, 640, -122, -249, 720, -552, -429, 651, -1404, 33, -395, -1040, -135, -777, -658, -630, -1801, 282, -953, -929, -542, -1452, -417, -585, -1099, 20, -260, -1798, -356, -963, -1152, -826, -1590, -966, -156, -1846, -576, 94, -1381, -943, -277, -891, -654, -1069, -274, -407, -434, 51, -429, -545, 52, 658, -72, 1382, 206, 270, 748, -427, 850, 0, -250, 1347, 618, 835, 1770, 18, 920, 856, -764, 1509]
1717A509r47q75K224j466j48P52j139J087p65o14J324p88J26M51j055N90p50p32
1735a216J946r13N7Q78j139P32m2j928J947j172j35J806j632j25J984j722N50
1752a24l70j138J705l93o14J601j493P28m75K01R54o00n09O19J26P9J207j651
1770a47K76L08m17R5M09r78J625j375O45J431j319P66o98o64J921j633p28J148
1788F65p43N23N37j292L21j29n20J604l38n65Nl52Q24o03m7R53j176j5R24j205
1808f29L56J87j275J059J65q78O11p80P2N62l61K78N51j024P48n82R5M69k69j15
1828g60J29l07K18l4K52M62j22j42L09l59q1J74k36R99q53L05N30k45k22N97m67
1849A47M12j20K34K98l37P4j2k80J84K90k49N1K97j98Q5Ol37j89j55K26j25K25
$$ y = [1509, 562, -313, 1911, 445, 297, 1049, -90, 997, 232, -382, 942, 154, 280, 731, -324, 266, -484, -1216, 730, -183, -126, 752, -387, 345, 303, -1625, 322, -850, -985, 821, -811, -936, 1048, -674, -124, -494, -1632, 73, -320, -934, 667, -826, -98, -573, -372, 582, -18, -527, 92, 218, 297, 1504, -147, 129, 437, 20, 115, 524, -454, 1171, -204, 441, 1872, 553, 1319, 621, -43, 1878, 245, -483, 665, -78, 445, 982, -310, 11, -118, -638, 966, 628, 63, 68, -284, 540, -63, -110, 843, -333, -348, 576, -629, -273, -86, -1361, -302, -137, -1015, -404, -1184, -1112, -550, -911, -633, -82, -1106, -358, -940, -845, -376, -645, -760, -631, -938, -720, -754, -502, -40, -162, -304, 5, -354, -435, -261, -497, 502, -351, -46, 484, 239, 17, 614, 147, 559, 439, 673, 971, 634, 708, 696, 416, 600, 890, 641, 692, 989, 791, 876, 882, 545, 356, 201, 427, 302, 527]
1871E27N50q05q0O15n83K96N4q01Q48l58m64N53q57J40M21l48J22n7j79N12m20
1892c14J57k02o46O81j83m21R29o02l3O80p96L95K32n83Q40o00j66P92r41P06
1912g5N1n79P96l84k3M45n42K51L11n67P15k62k82O76o96N06O1l59L81p7k06L71
1934E12o36N29M43q15o9L26q94Q92k53l98J118p40J51n01K50L29n73K87J46k32
1954a28k35O82j157R18j28n22K61p57N33k00P8k7J112o03p14J139q40M59j135
1973a264O17R58j295Q00K60o75L26l47Q2O42o34L27L96m19P09j71l27N31m55k29
1993a68N99m59O82K07n76L97l80J4N69l08J85L92q50O24m9o08N96k25Q4J49l34
2014E41J3K69l61K69m92j50O73p13L17J12l80L58k14k28L68o37L48J93o96L04
$$ y = [527, 1077, 272, 192, 807, 224, 520, 574, -227, 621, 263, -201, 352, -505, -365, 56, -292, -170, -227, -406, 106, -314, -157, -359, -1005, -324, -507, -928, 1, -601, -634, 46, -750, -355, -123, -706, 134, -466, -632, 160, -781, -75, -24, -603, 193, -191, -214, 231, -311, -60, 251, -316, 399, 137, -145, 531, -165, 341, 402, 43, 424, 347, 141, 512, -124, 405, 848, 33, -36, 290, -604, 288, 35, -363, 755, 15, 166, -335, -85, 244, -329, -42, 104, -128, -363, 319, -838, 80, -48, -570, -309, -1066, -533, -733, -655, -682, 430, -173, -887, 252, -588, -129, -1264, -647, 311, -984, -184, 76, -599, -273, -620, -538, 104, -530, -203, 193, -226, 483, 312, -15, 516, 61, -168, 431, -28, 654, 861, 285, 682, 302, 316, 885, 577, 762, 1154, 304, 928, 879, 271, 867, 642, 726, 875, 541, 554, 823, 462, 731, 239, 89, 762, 49, 366, 478, 98, 456, 242, 14, 382, -255, 93, 286, -410, -106]
2034a06n1o92O04m89K38L09n95L73J15l09K94m55l04M57l83K50R0J40L94l38k26
2055f84K74p0k47N71k24L67p4l01L03r0l06M49k17K51P7m7J58m24N0O10p23K05
2077i2M66l42N08J21m18K19j93j44N92o23J85L84j022R78On84M11k92r9M46p23
2098b16O18j08l57L01n55M9K32m20J82L88o59O80n1n18M40m43oL08m67O77j59
2119h4l57O65p18j03P85r11K99O51p52N55j19l59M81j81P0p2j45O50j82k52N60
2140D81m08J41L36n17K06J94l73O97j58k00P62q65k2L63m47M16J19m96N13k37
2160E05k09L51k93p3L79k96j04L5j93k8o0J01om54L68J74j39J38l06k54L77n84
2182e71K35R5k52L66k80m44N14l13k16L89l33Q6L23l66M2M31n67J49K52p1q9K18
$$ y = [-106, -157, -849, -245, -734, -496, -187, -782, -409, -294, -603, -309, -764, -1068, -611, -994, -744, -654, -514, -120, -458, -684, -410, -480, -727, -156, -380, -13, -87, -388, -85, -175, -481, -32, -249, 2, 79, 32, 190, -234, -184, 426, -297, -92, 374, 32, 540, 661, 243, 462, 269, 125, 717, 94, 279, 663, -359, 619, 625, 41, 452, 160, 61, 507, -216, 402, 294, -63, 238, -317, -268, -36, -456, -274, 114, -545, 135, 84, -434, 6, -437, -443, -135, -602, 75, -84, -441, 224, -494, -597, 188, -723, -424, 227, -525, 30, -89, -448, 33, -148, -78, -150, -295, 355, 173, -79, 481, 73, 214, 550, 33, 239, 433, 60, 757, 599, 399, 1161, 296, 274, 637, 190, 606, 725, 229, 742, 505, 296, 647, 354, 281, 660, 364, 260, 295, 102, 74, 14, 115, 109, -345, 23, 197, 58, 196, -110, -364, 13, -571, -336, -241, -493, -127, -407, -851, -337, -650, -866, -477, -810, -724, -401, -767, -725, -294, -861, -712, -460, -531, -620, -402]
2204d02J35n5j85R3k70J52K87r2M25p9j93m3N6j97K80K61j40N27k74l85L26j33
2226I4L8K26j31R8K14L6j62K23k16R9j7j8l6L1j24K20L3K1n96R0L33p0r0J83l22
2251A57N8k21K13o4l62J91J17j11j18K66m29L45j48k31P0K05j48k61M59j49RL4
2273a18O7l04J90P7O6j87j64K86p9k01L97j44K19j07L4j3J6k1L15k70J12J63l77
2296d3L95l6l4K21n20K22M44o28J91J22o0K96l06q2J22k32L11j27k66P44o13P
2318A28J07k40Q5N0k54L45k39Q2j39j22O4k9k01J61k12nJ60l73N10l67J43k29
2340e75J64j73J44k98L56o8j61K05j83J1L9j45K38L85r1l0pl8K05l25K44mj46
2363b53K37J60L9R8k29J77o9m3j8L58L5k53K01J65k49J9K52l38J16K91o1j97O2
$$ y = [-402, -267, -322, -507, -414, -684, -532, -245, -337, 88, 9, -184, -227, -171, -368, -88, 173, 33, 560, 286, -99, 227, 94, 132, 358, 227, 325, 539, 575, 413, 636, 420, 519, 502, 484, 448, 479, 355, 575, 608, 629, 33, 123, 456, 386, 296, 479, 157, 215, -6, 207, 143, -219, -28, 89, -22, -140, 126, -303, 42, -106, -337, -267, -62, -210, -471, -12, -161, -152, -118, -51, -355, -165, -88, -22, -209, -373, -87, -166, -367, 30, -114, 105, -2, 32, 19, 35, 14, 329, 59, 171, 334, -43, 352, 316, 282, 503, -17, 205, 649, 21, 212, 334, 274, 570, 264, 182, 304, 72, 383, 256, -10, 734, 121, 128, 235, -5, 80, 130, -124, 221, -18, 64, -75, -197, -133, -162, -363, -202, -414, -419, -259, -632, -122, -489, -346, -575, -411, -584, -440, -738, -382, -450, -611, -406, -589, -578, -539, -684, -446, -61, -152, -182, -189, -227, -22, -347, -103, -107, -253, -16, 144, 183, 281, 52, 229, 160, 117, 99, 457, 492, 239, 440, 605, 356, 375, 627, 289, 405, 696, 635, 438, 500]
2386E00Nm3J12k79J89J69q8J17r6k78K15m0k73L64l28M0l13l8Q7k28K8J42p9K9
2410h6J51k95L42k42k58L57l10k10J81oj41M83l14M0j02m3M09m59J60J82k21K08
2432a74q8p2K34j09P3J97j77M0O3j09L46l78j68M19o9n1K86k01L8K30l43J53Q2
2455B22j46L20n54M74Jk46J35j29l34K53KO9M9J30k58R5k14J66r2k22O02m27K24
2478A20r9m14L32k7l34K61r0k58M45l34n5L48n15N36r9m61N06k33Q4J81m60M25
2500a41J6m13N20k15j26O28n37M28k23m86N13M3j31L23j84p0O83n85K10J1j95
2521F9L81j13j96N01m46N7M17l51M39j05l43L85q5j43j24J41j53P2J8J55j31j69
2543B76K34k71jO6j13r2M73o90L43k21k70L05j9l49J84q9k38N79o35M24J92n67
$$ y = [500, 505, 462, 574, 295, 484, 653, 565, 682, 586, 308, 523, 483, 210, 574, 246, 286, -27, -65, 22, -206, -178, -36, -115, -86, 65, -230, 112, -130, -388, -31, -341, -551, -370, -376, -517, -34, -348, -308, -410, -453, -44, -503, -343, -161, -382, -174, -262, -334, -100, -209, -136, 61, -116, -76, -13, -122, 224, -154, -322, 97, 28, -23, 263, 62, 100, 330, -13, 140, 222, 76, 396, -158, 316, 317, 71, 206, 77, -257, -4, -2, 67, 116, 246, -12, 83, -131, 35, -57, -279, 323, -104, 120, 21, -393, -61, -88, -422, -161, -251, -509, -64, -398, -453, -105, -620, -84, -183, -644, -138, -371, -287, -106, -566, -141, -125, -538, -18, -233, -359, 269, -268, 160, -63, -549, -36, 7, -124, 199, 15, -55, 628, 43, 253, 264, 69, 450, 337, 141, 642, 196, 253, 670, 319, 758, 653, 310, 695, 610, 467, 343, 484, 331, 403, 421, 576, 445, 276, 510, 239, 238, 304, 191, 99, 572, -118, 225, 4, -266, 39, 20, -329, -145, -234, -472, 107, -528, -104, 88, -479]
2565d79K71l00LM55n17J16L03k65K06k58R3p6l14M19P7m05O26m15j25O38o76J25
2587d98O24o75K48L58k29Q3K31j10J60k92j53L70o7K58j84j01J95q0k4J32k82
2608c6K98j20K1L31m07j9K64l74J34N45o26K23Ol17J87k41n8M78k18l22N76n04
2630a79N4P5J10m45N0r2M81m77O45n27M46K1k14m17L11m20P4O16m36J53j45n2
2652c68M05o02M45L81n98K47L29n20L18r9q6N20l68K86J22l43L52j78n3K77l63
2673A04K63j54J00L15k10r9N18o70L25K61p98M93n4k40L98l75k40K54l47L47K35
2694D26m35K97j51k30J99m19M8L29l98K24m2j19P7l52L50o4m24M26k7l54L63k28
2716e04j08M57l86J35n1l8J19l5k57L98j35J25K7l08K75k0k25K12J70k11M81m59
$$ y = [-479, -208, -508, -505, -50, -567, -451, -148, -413, -207, -465, -372, -448, -762, -343, -266, -671, -45, -460, -585, 53, -623, -498, 126, -549, -301, 57, -172, -89, 142, 32, 192, -100, -253, 117, 50, 308, 124, 23, 218, 138, 114, 246, -36, 262, 142, 163, 494, 87, 68, 332, -42, 92, 637, 11, 234, 240, -77, 110, -131, -189, 289, 71, -251, 325, -179, -125, -50, 60, -385, -335, -427, 54, -423, 222, -305, 141, 162, -52, -469, -158, -578, -504, 112, -324, -171, -316, -368, 37, -565, -120, 261, -337, -90, 239, -281, 37, -62, -148, 372, 4, 290, 412, 69, 421, 243, 190, 467, 104, 367, 213, 313, 628, 418, 319, 837, 167, 492, 753, -45, 448, 394, 154, 552, 177, -63, 191, -156, 191, 426, -9, 288, 137, -93, 106, -313, -265, 64, -334, -110, -152, -271, -194, -546, -196, -260, -684, -258, -285, -639, -276, -504, -612, -155, -541, -406, -457, -495, -376, -411, -668, -270, -405, -280, -253, -561, -286, -306, -531, -319, -149, -360, 121, -338]
2738c38J27K97j39K51K10o66O04j96k45N23n89N50M1n19M30Rl50P97p66J35M01
2759E67l63K01J51o58P79l09j61M98p19R0N13n23L78qo43Q11q33Q1Q23q51K40
2780F4O5m06N70l86j11O08q05J47O36q03M93l05m83R96n34j70L90m71M82j2m14
2801d49P08j74l72L99l51o9K61j90J64L9k06L67k59k03P22o22J34K96l99O09l13
2822I2k20O25l04l9J52m03K86j15oK33l82J23N33p15K21K25l10K40k07m33Q34
2843D30o62n5N68l56R5Q6n59P43k70n7J9l01J97O5o11O26l01j86M25m68K69J31
2865a72m71N64j68l64M13l61J20K20l66J50K50l80N79m15k25Q29o46L50L66n57
2885b84J67K87l38M62k16k20O64n16N7K77m55N51J12m80M25l81L60L05p48P21
$$ y = [-338, -211, 86, -53, 198, 408, -258, 346, 150, -95, 428, -161, 389, 430, -89, 341, 350, 0, 797, 31, 166, 567, 204, 405, 556, -102, 677, 368, 207, 705, -14, 76, 589, 66, 444, 436, -207, 604, -229, -148, 675, -176, 64, 129, -277, 293, -93, -204, 404, -401, -254, 382, -421, 72, -233, -716, 280, -254, -424, -34, -505, -23, -35, -449, 259, 85, -287, 112, -239, -308, -47, -237, -73, -34, -240, 127, -132, -335, 387, -235, -101, 195, -204, 405, 92, -128, 497, 193, 154, 306, -97, 189, 74, 68, 301, -81, 42, 575, -140, 81, 306, -4, 236, 29, -404, 430, -232, -287, 281, -75, 20, 106, -453, 290, 20, -37, -18, -319, -122, -57, -668, -42, -343, -529, -104, -572, -303, -172, -643, -79, -247, -611, -198, -559, -439, -219, -585, -435, -185, -565, 14, -401, -626, 203, -443, -93, 273, -284, -117, 170, -168, 294, 78, -142, 522, 6, 63, 340, -115, 436, 548, 68, 493, 112, 472, 777, 29, 750]
2905G50m10k85O30l24j74P07n10j83L00l72K77j48k26P51m62k48K48m03L65J56
2925D39l90L35l71k28M28o11M76R6n32M68m50j72O20j87m72P51p81N23J31n81
2945e08K98k69j98P42n81k7N38p23M94J49l56L54l03L64K06o09N66q7l55N67l66
2966a04K7N87p25K2M41o55O16k76m7O70q88L16N91q27N10n3n05M98j11j1K84l33
2988B7J38J33p23N14j8l60Q19m96j47M85m85L7k1j63M05j95k29M29l82p8K93j39
3010a56j17L66o97M52o6k76O84n93J26L36o66L29J87m39P46l95j33M45l27P2K81
3031A59l12N40l39l33N72l44J74J05k50L62j9m80O31q5l02M70n18M23k3j32K9
3052C28J70j67K63l21m9Q0k4J24j03k2P0j53p8K28j35j93K27k41L72l47k19L43
$$ y = [750, 340, 55, 685, 361, 187, 894, 384, 201, 501, 129, 406, 258, 32, 783, 321, 73, 321, -82, 283, 439, 49, 384, 13, -215, 213, -398, 78, 174, -358, 110, -340, -512, 108, -79, -551, 200, -581, -58, 73, -508, -210, -479, -677, 65, -516, -543, -5, -728, -234, -85, -441, -87, -390, -26, 180, -429, 137, 50, -305, 262, -104, -77, 510, -215, -193, 248, -407, 209, -67, -114, 556, -332, -16, 575, -252, 258, 205, -300, 198, 87, 76, 360, 27, 165, 298, -425, 89, 71, -289, 530, 34, -113, 372, -113, -76, -97, -260, 145, -50, -279, 150, -232, -310, -17, -156, -273, 93, -604, -152, -218, -494, 190, -403, -277, 59, -607, -278, -91, -530, 216, -179, -312, 133, -194, -122, 159, -153, 387, 48, -285, 287, -57, 117, 222, -28, 334, 315, -165, 466, 381, 79, 549, 31, 454, 431, 299, 328, 498, 331, 594, 273, 224, 304, 280, 404, 301, 279, 349, 196, 118, 346, 211, 18, 245, 4, 376, 29, -190, 153]
3074A53l16O0K25k04R7j27k04J42K7R0M8j19k37L16k65J15k20n1L70l68P2J23
3096b73k12L70k93J2L28l82n0L32k50K21L09m88L41p6l81M64k23L11N3l18K37
3117C2O6j38P0l9j24L91l25M99l72m0M60l16J47j24q4j5J99q2J60k57k4K06l61
3140g1M0J89j58L06l07P9L7n1J45j15k22K53l7j86J23k05J51O3r5q8k7J33l5J05
3164B7l13J28R5kN0k61jL71k70K01k96Q3K0J42j1J59r2J17n6j60J48k8j17M04
3188C38l70J28K98n58O00l83J83j3r4Q6R4j88k0M54m36K3K1J55j23j01j7Q8j61
3211DJ40Ro5Q0l29M3Q4O7L9p1J1q4J45j77K90j88r8P3m25J84Q2j41K53j92n3J98
3237a21l36K83M8m4k29K34l51M82k28m7K31j94J09Jqj22J3k22M75j0k94J02J91
$$ y = [153, -163, -103, 122, -82, 15, -112, -316, -174, -147, -57, -9, -128, -365, -49, -314, -199, -419, -470, -100, -468, -396, -273, -485, -115, -408, -396, -68, -450, -500, -168, -418, -197, 112, -376, -35, -111, -492, -28, -251, 60, 113, -205, 32, 98, -40, 30, -9, -133, 258, -67, 432, 60, 20, 480, 164, 311, 187, 103, 88, 287, 205, 365, 108, 84, 290, -71, -31, 158, 0, 306, -1, 78, 115, 64, 209, 94, -128, 125, 88, -98, 25, -180, -29, 34, -61, -149, -176, -43, -78, 27, -286, -158, -63, -65, -15, -276, -277, 94, -176, 25, -271, -188, -168, -26, -37, 122, 30, 147, 91, -69, 79, 51, -66, 338, -32, 96, 394, -164, 436, 53, 236, 223, 129, 215, 309, 121, 101, 555, 119, 142, 163, 318, 195, 94, 77, 165, 4, 144, 153, 88, 168, -161, -118, -34, 33, 72, 1, 12, -72, 73, -104, 186, -2, -100, -27, -452, -268, -186, -327, -74, -266, -319, -121, -457, -174, -126, -170, -399, -165, -516, -34, -262, -309, -78, -272, -163, -162, -170, -292, -279, -501, -26, -36, -330, -228, -37]
3260c7q3j12L42N6k72L54p7r4J45q3l44N48k03oJ37j2O4J00J5j59R0l41K7K65
3284C20o3J88p8J02l34P8J66j56J19j06J8j05r6J37k7j11L6r0q7L81j94k06K27
3307A19l16K7K26l14K32K8rk50J06n0K43k70N5l1j4L89l69J5O5j62l6M06k64P5
3331i9J56m32L55j00j26K95oJ35j91j3J71k58L2M98l20j05O2j90J71J18m5M8j04
3354E2K34j55J60j5j6k14j27K82k43L07j49oR3l33O6M3m5L31j99l06J39mjj92
3378b98J44P7j87J03r4j20K39n9j98K91k44k2L16k95j42L33M0k69o3J65o2K70
3400g5k46K79R3L17j75n28O66o38k08O42k17J56M54J18k73L78q55J41P11k69J70
3421F41J49j84l26K2q6P6l64O47p8J21r3MJ0j68j62J26k80J50Q5k38L87m64j94
$$ y = [-37, -120, -232, 110, 166, -106, 248, 171, 77, 222, 139, -205, 343, 140, 134, 271, 259, 323, 423, 438, 279, 369, 28, 55, 320, 257, 445, 367, 469, 135, 213, 379, 223, 342, 236, 254, 149, 53, 190, 163, 52, 88, -2, -89, 292, 98, -108, 119, -197, -170, 56, -258, -26, 2, -7, -257, -151, -201, 42, -228, -173, -204, -218, 171, -198, -183, -118, -280, -316, 90, -174, -99, 57, -375, -20, -120, -246, 49, 43, 178, -13, -26, 145, -113, -81, 417, 97, -8, 54, -136, 35, 153, 108, 156, 52, 286, 131, 291, 276, 260, 46, -81, 201, -42, 265, 116, 110, 203, -130, -64, -21, -66, 265, 66, -240, -101, -105, -106, -298, -154, -77, -264, -161, -255, -375, -136, -195, -393, -102, -346, -368, -52, -347, -489, -156, -116, -385, -448, -283, -345, -75, -321, -42, 51, 368, 193, -335, 331, -307, -515, 127, -90, 66, 520, 638, 365, 743, -112, 29, 740, 471, 641, 790, 606, 280, 302, 216, 292, -72, 575, 497, 618, 525, 529, 539, 371, 209, 335, 55, 205, 290, 52, 439, -25, -219]
3444b19K13O6m6K17l75J61K96l38J29j28J07K0k39J92j26J94k69L7j41L4p8j61
3466d54N74k84K00o3j68j40j6Q1J85j10j52K18j73p2M59m13K70J8K4m4o7lJ07
3489b3k62K79P2q2L9j59M2K05n7j8n3j80L46j35J52M9n3L0k36m4N37m46j83L43
3513A63k49Ll4K72N0k15J82l5k04j02K59j44Q9m5q4j64J82j4L1R6m13M13l74Q3
3537b54L4p8O4J7J23M8k48K28N1j46J80k53L31q4j72J25J28k41K2Q1k0Q5j7J58
3561A62J6p1N1J71k09o7J44j25J40jJ87j65j22o1K83n7J4l8j1J16l8j72J94j71
3585A70Q8jj44L3p2M2J86j73j03J38K6l20L35k05R2o6j03M20n49j34L46K0j06
3608h0M5k57K17k20q5J41j50o8L34l00K15l2p5L63m50M1J35k1J86j7o9k8o4K1
$$ y = [-219, -6, 60, 14, 231, -144, 17, 313, -25, 104, -24, 83, 103, -136, 56, -70, 124, -145, -108, -249, -215, -293, -454, 120, -164, 36, -27, -195, -335, -351, -270, -85, -195, -347, -129, -302, -374, 85, -328, -58, -40, -16, -60, -127, -130, -23, -285, -6, 66, -16, 23, -136, -94, 111, 54, 36, -17, -197, 149, 14, 166, 215, 162, 192, -44, -88, 449, 3, -180, 163, -86, -83, -117, 155, 205, -10, 172, 137, -67, -169, 90, -54, 35, -10, -94, -258, -76, -90, -59, 37, -376, 37, -337, -254, -220, -298, -234, -217, -94, -46, -294, -66, -15, -161, 19, -234, 97, 13, -159, -34, 94, -147, -125, -44, -64, 21, 4, 162, 178, 107, 158, 329, 120, 53, 197, 72, 212, 211, 398, 233, 111, 50, 333, 276, 290, 252, 241, 357, 319, 147, 341, 170, 258, 257, 113, 146, 74, 116, 302, 129, 26, 164, 190, -130, 205, 0, 92, 26, -77, 343, -206, -340, 6, 26, -80, -35, -292, -75, -295, -380, -239, -389, -457, -123, -423, -208, -240, -315, 48, -402, -361, -226, -247, -61, -78, -147, -175, -239, -218]
3632b18K2k01K65j10N5L78%m95K96J51j53K81j35o2OJ24M5j34q6N5J17j71J96
3655B26k21K29q6J31j21J25k22K38n6k04K66l86R2Q2qK20l19J16n4R3K93n31J31
3678C4k76J82r8O3k6J0k15J14K60k35J2j23L13j33J29%j33R8k84L41K2j51K22
3701A26o8N0k55J15J86j05j99J51r0R9j4K05j43j41J25J2o4JJ29p2l5J24K3q1
3725G9J31l2o1K45l63K74J9k95L83l82J4K86l00J26M9lQ0l51O8L25l26O2J9j48
3749a01Q7k63K64j46m4L61l15K42l05RNk0J1J55l72N9K16k91L66j45M8PP9j34
3773b27J21Q6l00K51j33J8J24j14N9m1L43k04j16K29p3P5j33O4J66J0l40K82j81
3796c4J18P8J25j93K27q1jj4K9n7j29M95m51J8P7J79j53k57K0O8R6m1j15o4K85
$$ y = [-218, -196, -397, -132, -242, -187, 191, 191, -304, -8, 143, -10, 271, 136, 74, 80, 204, 249, 115, 29, 84, 201, 30, 226, 5, 234, 148, 279, 158, 283, 61, 299, 243, 39, 305, -81, 11, 93, 85, 305, -14, 102, 48, 141, 434, -97, 34, -242, -60, -158, -95, -121, -111, -326, -212, 48, -187, -175, -298, 15, -118, 11, 11, -122, -24, -308, 33, 55, -96, 126, 58, 108, -147, -32, 154, 49, -150, 1, -89, 10, -4, 201, 58, -83, 42, 54, -10, -9, 120, 48, 13, 137, 160, 79, 210, 178, 117, 362, -1, 273, 292, -3, 380, -2, 12, 298, -2, 124, 173, 170, 250, -101, -33, 292, -34, 28, 47, -101, -14, -277, -13, -159, -203, 158, -157, 85, -220, -211, -206, -226, -215, -60, -432, -373, -157, -448, -82, -227, -179, -172, -93, -227, -106, -20, -320, -69, -202, -184, -60, -174, -115, -156, 187, -17, -133, 96, 23, 98, -35, 29, 195, 205, -135, 147, -34, 84, 162, 287, 94, 321, 240, 239, 225, 254, 197, 68, 563, 112, 130, 207, 386, 233, -24, -4, 64, 160, 119, 4, -60, 225]
3821B25j59K2k48M73k84J5l3k39K56lJ3l4j53Q6Q0m7N9l02K50r4L6J16j65P2k07
3846b65o0J05K64m03L75k77j1P5J27O8L0m7J14l05J45q9N0l1L15Kk71L30m11J36
3870c4q4J00K13o9Q7j30J28k61l3K03Rj45K14j32J98l28L38j63p6J8r0K20j71
3893A2k69L75k70J10k93L93j26m9j30J00J08j85J12k05K54k01j69J40K80l07K87
3914c3n5k23K61j78K82l37J70J12k28R8J43n7j72LJ33J17n0K59l94j29J34J43
3936aJ19M8j06m4K39k85J17O8JO3o8j8k6K42k0L2j16j90p3L37k03K27J37l69J44
3961B55PRk71J97n3r4K08j43k56J54k1k00K27R8p3J99l64J89P8k00j36Q3m1R1
3985e7O4j96L60l29m5K25k62R7J75j33J17k91%K47m1j10j67j38L35O1n4pk3j71
$$ y = [225, 66, 88, -160, 313, 29, 44, 11, -228, 28, 25, 38, 4, -149, -63, 17, -30, 29, -273, -23, -117, -81, 35, -130, -58, -265, -325, -220, 44, -359, 16, -261, -272, -197, -70, -2, 28, -19, 95, -210, -65, -154, -104, -135, 180, 182, -89, 241, -170, -34, -118, -18, 195, 126, 213, 83, 211, -50, -83, 120, 129, -16, 198, 66, 264, -64, 274, 111, 35, 53, -37, 183, 12, -257, 118, -152, -42, -335, 58, -68, -117, -247, -147, -39, -224, -112, -317, -63, -264, -433, -293, -13, -320, -33, -88, -311, -50, -228, 54, -283, -113, -1, -229, -131, 12, -45, -217, -214, -81, 36, -14, 245, -149, -278, -144, -1, 118, 166, 60, 16, 255, -30, 87, 155, 156, 219, 151, 133, 107, 349, 329, 361, 245, 55, -18, 319, 116, 343, 480, 111, 255, 262, 271, 0, 197, 144, 50, 258, 115, -141, 13, -8, -208, 19, 117, 44, 243, -121, 68, 146, -54, -190, -107, -148, -57, 7, -189, 171, -158, -203, 22, -240, -143, 32, -101, 16, -275, -275, -28, -69, -179, -346, -484, -149, -88, -142, -149, -172, -343]
4009c43M82l21J49P8l06O37m79j6J26K2l4j92L26p9J24J12j98m83M60L0k60K68
4031A03j70K31Q0k77J000r75O34k58J7Q25j061L62j24J26m36j76k98l5L69l0K32
4052A39k45k9l15M22j2J72j89j18J43Q6j86Rk63L13J12j42K17l57j22M21j01J9
4074b6J03l68J14P1J5j17J64K46j24j30J79N3j98K46l76L45j44M2l8k03M13j76
4096I1J2r8N50o26K66o8K08j21m7j32Q4Q8j25K81j77J53p7j64N2p6k86K28p8Q0
4120A8m5k98M04Qn30N08o1j68L9K1J79o6r3R9j24k70K39J04P1o6J0M1k17j68K01
4145a64k33L35M84p31L35J18o70L53J07k16J79k3rK36m56K78J63l08J91K25j15
4166G9j46K6q6L23k86K2J45j09K69j92k5J34j65O6K74k69K47k45m9L16k09K27
$$ y = [-343, 139, -182, -33, 45, -261, 376, -103, -119, 7, 29, -5, -197, 129, 50, 174, 286, 88, -395, 65, 95, -165, 103, -67, 164, 244, -33, 967, -8, 626, 368, 385, 1210, 149, 511, 387, 513, 77, -99, -397, -432, -63, -93, 139, -106, -135, -450, -28, -40, 132, -57, -175, -32, 54, -132, -123, -386, -73, 39, -103, 114, -243, -365, 56, -45, -26, 77, -291, -177, -106, -91, -208, -44, 202, 78, -52, 127, 180, -18, 228, -148, 197, 53, 95, 57, -146, 267, 91, 103, 5, 555, -71, 195, 127, 335, 214, 167, 35, 119, 207, 82, 363, 186, 339, 262, 98, 150, 74, -212, 16, -62, 18, -27, -325, 79, 87, -443, 65, 4, -164, -125, -104, 75, 9, -84, 15, -109, -379, -140, -36, 35, -31, -21, 20, -197, -365, -164, -397, -62, 422, -309, 26, 144, -526, -173, -66, -282, -103, -126, -135, 101, -355, -77, 86, -222, -31, 194, 79, -67, -41, -127, 196, -90, -68, 77, -32, 237, 45, 20, 154, -11, 55, 329, 60, 307, 62, 13, 329, 120, 347]
4188C47l3k52J49q7n0k2J44k87O1o1J86j50Q8M2q9o1K8j29K52K3j21k77K96r2
4212i5L62k74j62M07j53K8j6l04O2L55o01M38l70L82L4l64K22K92l89L91k48n1
4234e4J14r1j58J40L6Q7L4Q6k00Q9J6J26l59K84o5k82L21n2k33M83k14J41k24
4257B5p9JK57j29O0j91q3L69k61p2Q7k42K71L44n35L10k97n6L52n23R8L08k58
4280b44J94n4%oJ0m0K47l48PO6j3n0j78K79k6Q0k31R7r4K04N4j91J1J30j95N16
4306B25k39J9m0r7o7J77Q9L17k95k09L42l11J15Q6j20K08k66K42j46m6K59j62
4328H1l2O5o1J3J80J83l32j0n9J44j38k0L11l26J33k0k8j72J75P7ok96m4K08R3
4353A19r2j31Q6K80m13J49Q1j98N7R2j76m0J08j06K95k02J35k87q2J76J62j63
$$ y = [347, 314, 62, 211, 124, 74, 52, 196, -91, -30, -91, 95, -55, 33, 75, -14, -75, -47, -176, 76, 99, -22, -299, -3, -95, 267, -7, -169, 238, 85, 113, 97, -207, -145, 210, -391, 47, -323, 59, 93, -271, -49, 243, -146, 245, -3, -54, 60, -31, -189, -49, -13, 74, 108, 194, -6, 83, 99, 225, -134, 150, 85, -197, 124, 72, -161, 322, 108, 249, 25, -54, -53, 204, 75, 135, -56, -139, 230, -31, -103, -16, -258, 13, 357, -178, 132, -165, -221, 131, -392, -294, 14, -244, -50, -104, -104, -110, -100, -140, 107, -241, -234, -168, -181, -231, -409, -130, -156, -76, -307, -210, -304, -100, -46, -237, -226, -96, -291, 225, -14, 5, -35, -132, -199, -22, 67, 384, 89, -120, 222, -89, 26, 112, -8, 200, -66, 176, 30, -16, 243, 81, 49, 114, 53, 66, 246, 429, 97, 87, 28, 172, 34, 14, 325, -1, 132, 112, 84, -88, 87, 164, 158, -138, -182, 26, 119, 27, -104, -18, 262, -151, -2, 79, -119, -62, 30, -146, -186, -78, -184, 111, -91, 44, -243, -325, -149, 13, -150]
4375a50K46k05K13k7k21n0N6J6J79K6j39O6L6Q5m7JP0J24l70M1o4L07j45j9qJ07
4401A28j28j71J56n7L07k07j10n4K94o1j18J45k47R1K52O0l19J56j44j50K61j05
4423b1k94K51j20J3M05l02J07l94M69j58l0j65L19o6j09P7m7K5jj22j32K79k51
4446b67J99j11J77N1k37M7K7J7L80r4j94K5j03P0J87j48J43m5j95K51k6n2K06
4469C08l67j46M50K5R7n69N38Mm38L86p5k00J62j22J98M0k56j86L68j7P0p8J50
4492C42l2j08L6r2j75J12M9l01K77k47K54k27J0K61k33P8q2K31j56q5QRq7QP1
4517g9J34l61L40J44m05M7J03k7l39L05K65j95R2k84J87MJ50j92J74k48J22P5
4539A2J8K28j42j47J61J21l90K09j54j3L74j83j84J00k8K2jj4J89K9K6J6m22J29
$$ y = [-150, 96, -109, 104, 77, -144, -194, -138, -122, 57, 83, -56, 10, 46, 131, 84, 85, 155, 279, -91, -50, -114, 193, 48, 29, 21, 128, 0, -171, -15, -72, 235, 28, -82, -136, 158, 97, -21, 124, -123, -32, 220, 280, -39, 117, -27, -177, 84, -21, -315, -64, -184, -171, 234, -68, 39, -355, 114, -44, -74, -239, 80, 14, -95, -18, -65, -40, -41, -163, -295, -16, -267, -68, -179, -2, 49, -188, -141, -114, -97, 283, 189, -5, 20, -83, -13, 174, 26, 169, 124, -71, 180, 154, 102, 308, -59, -205, 245, 270, 367, -202, 336, 340, -98, 288, 213, 13, 175, 53, 251, 291, 35, -151, 217, 200, 270, 192, 342, 310, 202, 238, 146, -29, 83, 132, -169, 108, -139, 115, -112, -102, 159, -74, 4, -78, 153, -3, -88, -80, -71, -158, -150, -79, 55, -306, 34, 178, -227, -180, -77, -104, -443, -138, 127, -68, 24, -260, -73, -69, 81, -111, 63, -185, -63, 12, 30, 258, 116, -31, 130, 251, -139, 70, -84, -97, 277, 94, -90, 10, -18, 4, 3, -11, 178, 207, 233, 249, -173, -44]
4563d4L9K9J61j07N2J86q7p4m46K42R1J03l02pJ69j35k7J13k1K44l13J19k41J70
4587h6K08k13J04j59J05j0J94k45J3m3J4K03j61j38J65k9R3J04n4J80l59K14J63
4610B63j05j70K73k17L0j18p4J34K48k05O8l65L71J09k62J16K9J5l2R4k3k5l0
4633A24J34l87K18O0o2J6L9l53J46L08j37p0j64N0l0K6J8j02l6J00j29K36j46
4656a41k18K05k36K10k3L5j39K29J3K9l5k04J04k4O3j4J73j75J01j8j36K15j34
4679a20j51K25k9j5K49k18J45k1r5M6J97k05J29M9J17j04k52Q8R9q8K60m08K88
4702A86k46J34j90J30K54k0j27j48K02l71J17K08k04P4J18q4j63J74L6j62J15
4723C3o5n5K19k41J8J39k26K06p2Q1M9p9j90J44j95L40P2l19K23k39J24ML0J68
$$ y = [-44, -5, 24, 185, 78, 130, 316, 229, 155, -291, -49, 42, 145, -157, -164, 5, -130, -157, -44, -65, 179, -134, -15, -256, -86, 122, -91, 13, -146, -41, -51, 143, -102, -89, -132, -118, 85, -76, -214, -49, -78, 15, 119, 65, 245, -114, 100, 263, 158, -12, 261, 44, 74, -44, -118, 16, 264, 59, 127, -238, 133, 242, -20, 96, 125, 140, 108, 202, 179, 154, 124, 258, -129, 89, 149, 87, 103, 142, -211, -65, 243, 106, 36, -128, -78, -108, -82, -64, -166, -202, -102, -231, 5, -141, -359, -154, -390, -180, -203, -168, -307, -78, -65, -36, -71, -275, -171, -195, -132, -146, 27, -148, -47, -65, -201, 14, -120, -271, -46, -75, -90, 159, -59, 86, 65, -30, 16, 213, 8, 137, 186, 303, 199, -53, 35, 134, 46, 306, -102, 186, -60, 74, -116, 14, 268, 248, 121, -27, 175, -196, -79, 129, -75, -1, 117, 33, -130, 44, 80, -82, 33, -32, -87, 132, -109, -91, 48, -178, 28, -44, 37, 86, 7, -183, -39, -234, 106, 178, -141, 82, -157, -33, -29, 1, 169]
4747A69j43k55M1J17J77r2J23k28J92m1Q8j04j06J27O3Jq7N8j23o2j38M91k95
4770b7J1r7J03RK78j66P1j60m5J86q3j6Q8j30L9k29R7K79k89K58j65K04k15N1
4794E2o4N7Pr1k57K51P0j84k19L25r6j6k4J92r9J85k37q4K4J28L2l10K99p3j70
4819c02M07k09K26r6o7Ok67L33k2j48k52J78J07p6J00J38j69K77n95M64j32L74
4841B75l22j19M80j85o7K5K4P6J13k07k12M37j22l03K42p2J11k94N7N29l25l15
4863a74J85K69k02j23k41M35k19l2Q0l9K07q4K81l52Pj39k50M94k20k14K86N34
4885D89q00M91l44k03N53o32L75o6L92k03m8j03r7m6O48o00M56m36L18O9j86K19
4907B46r6j30M70m36m35P63n43J09R4j72L44j56M8k4Q7m79J14M0K05L18k27j9
$$ y = [169, 26, -229, -188, -71, 106, 14, 137, -91, 101, 60, 148, 44, -62, 65, 128, 129, 42, 100, -23, -85, -223, 268, -27, -16, -113, -10, -1, 277, 111, 182, 22, -23, 163, 80, 64, 152, 22, 61, -168, -71, 208, -81, 177, 12, 216, 1, 52, -12, 45, 52, -39, -296, -45, 25, -159, -378, -53, -149, -165, -189, 3, -96, 89, -148, -232, -208, -80, -48, -358, -59, -132, -302, 105, -104, 122, 26, -41, -35, -302, 31, 9, -139, -391, -213, -106, -182, -82, 56, -113, 164, -431, 33, -99, 275, -47, -166, 314, 129, 62, 87, 111, 187, 300, 93, -119, 318, 196, -107, 135, 63, 174, -120, -63, 466, 141, -174, 11, 280, 78, -45, -286, 149, -70, -102, -22, -61, 146, 62, 343, -9, -2, -141, -391, 103, -117, -331, -45, 489, -311, 180, -164, -367, 186, -446, -71, -137, 255, 52, 4, -99, -196, -242, 406, -194, 262, -174, 144, 213, 27, 246, 150, 20, 490, 54, -381, 382, -161, -52, 42, -130, 214, 58, 106, 82, 169, -310, -196, -156, 49, 367, 140, 121]
4929A21m8m0n4k2j10K98l19K70j1q5L0J21k34RK24k52l7J15j09L53o50M02p2L3
4953f7l1o9K9J52j41J91j11k7K17l41o6K06l85K83j41O15l58K16m67m6J60K18
4975C7k97M3K08K62l93K43k18q2M15j66J21n6j62j32M04l00J41n7J37j08j0r8
4997f8J47Q6j47M33m12K02k05L2o0j0J50K3j63J50J71k49L87l92j05M3oK19l07
5020h1j64L25j10K29l04J36m4l78J66K81q1K9L6j91J16r3k39J43o2K3K20M2j27
5043a28J28J6k30J90j11K60k06k80L88N4j03j55P3R2K2J53P7l25L7J72k03j1m1
5066a31J83j9k29P5M10j84Q9j39J14K06k75k87J70M8k2o9nK33r6J21j10J27j75
5089C5j28K02Jp4j78J46L19j53j62q9j7k7l2o7K01j49J74l95L77O9j48j3L3k4
$$ y = [121, 73, 33, -21, -43, -153, 145, -174, 96, 85, 0, 30, 151, -83, -74, 150, -102, -139, -24, -133, 220, -430, -28, -100, -67, -98, -167, -138, 14, -127, 64, -47, -74, 143, -198, -264, -58, -443, -160, -301, 314, -44, 172, -295, -341, -181, 37, -260, -217, -9, 253, -140, 103, -115, -197, 218, 52, 173, 117, -45, -177, 227, -73, 68, 11, 148, 40, 30, -68, 79, 165, 18, 451, 39, 241, 36, 68, 8, -2, 148, 171, 8, 158, 329, 80, 467, 75, -30, 13, 7, 226, -81, -245, 80, -30, 199, -105, 31, -13, -391, -225, 56, -25, 4, 40, -151, -35, -128, -367, -224, -286, -263, -43, -1, -128, 0, 16, -214, -24, -135, 125, -81, -361, 27, 81, -22, -177, -104, -12, 10, 163, 240, -85, -48, 124, -79, -90, -131, 52, 33, -196, -121, 289, 105, 194, 55, 169, 375, 100, -187, -17, 31, 9, -60, -65, 168, 72, 193, 83, 210, 35, -93, 109, 110, 36, -142, 4, 323, 170, 8, -81, -98, -125, -157, -224, -23, -172, 2, -393, -16, 53, -95, -108, -75, -99]
5113i9j60J12k7M14k30o7K33J8l05M19l09j15K7j6N5L9j63J48J56K4j88KN6K70
5137B94l51K50k45j13M37k38J06j69J39m2P5j86J32j54O9Q8J43j35j22j34P6L13
5159B33l18M2N4q0J37k11J6K23J41j94J45k35r2R6j61J95rm8j43J15l5K0N0k07
5183b66J99l7MN7j6o5o1N9J45o9J95k81K1O5j49L17j18M7j08l08N97k57J16j44
5207e7J5J26P7o2j45m1rO0R5J28l0o1Rl9L10k53J4j25P8p6K30j6j75K04k47p1
5233f1JJ32L6J85J39k86m4J6j71P6jJ02j06J90k17L1k05J28K24k57L35k06j78
5256a37K30k57m4K23k2p6j19N22l86k05K16K64k95K58L0k13lJ80kj0N2k42j19
5279a55K44l23K94l17L12K4O9r5l1n7J93j5p6LJ8q1Q2j55K15j05N4o3j69R4L2
$$ y = [-99, -259, -147, -174, 240, 10, -57, 176, 194, -111, 308, -1, -116, -89, -105, -50, -11, -174, -26, 130, 154, -34, -32, 24, 294, -57, 193, -52, -165, 272, 34, 140, -29, 110, 68, 143, -43, 89, -65, 4, 92, 235, 100, -22, -156, -80, 233, -85, -43, 11, -69, 68, -143, -127, 96, 237, 43, 188, -47, -139, -43, -204, -9, -18, -66, -209, -94, -129, -109, -59, -266, -67, -104, -100, -43, -59, -124, -185, -126, 19, -50, 145, -136, -115, -50, -199, 118, 0, 47, -61, -369, 228, -29, 87, -57, -42, 84, 161, 99, -46, -87, -96, -36, 59, 187, 157, 96, 105, 66, 376, 123, 137, 12, 90, 14, 244, 228, 53, 257, 10, -61, -60, 72, 108, 293, 432, 146, 102, 118, -53, 23, 22, 124, 18, 208, -9, 22, -183, -55, 169, -88, 247, 41, -137, 93, -164, -208, 15, -7, -83, -202, 320, -66, -271, -55, 209, -86, 172, 202, -11, -14, 166, 164, 154, 206, -36, -155, 89, -234, 60, -257, 55, 79, 148, 53, 22, -35, 158, 143, 67, 70, 88, 7, 89, -66, 149, 44, 98, 35, -134, -40, -8]
5304hj00K45J66k47j8j05J84K9k16j07K05J11j78m2L6o4j79M00k84J52r2L6%j5
5328i1o6J7n4J0J32k5j37J26J2l2Q0J31j46L56k92j28K03j85J76k63K33k31L77
5351B03l68J71o9J42J32k21n1K73k44J26L3K3m3l19K55J9R3%j36K16j53K11j71
5374A22L3J25l79K51l7j99J78J9j8Q2J48j20j68J67j14k53J81k5J38j06J9j17
5396g3k8j2N9k1Q8k09J7K63k32m9J31K1QJ73k19K12k4q8j85K91k14k6M7p5K38
5421I3j33k7j49k5J84J37O0l49K68k59N4K21l5k80K01K43k84%K05j55J49n3kL3
5445I7k15J91j9j28L40j89l46K70r3J4L2N7j46P6P5N7K8q5k1k67K52J14J70j6
5469B48k78k6M2r3J42Q1j73J0J90m14j03L94k06K63%j11O8K5N9l62j9K85k06J59
$$ y = [-8, -108, 137, 303, 56, 38, -67, 117, 146, -70, -177, 28, 139, -39, -81, -45, -109, -288, 112, -172, -20, -112, -76, -76, -91, -157, -140, -194, -184, -52, -77, -214, -88, -76, -108, -28, 103, -43, 313, 21, -107, 96, -89, 87, -176, 57, -174, 203, -165, 6, -63, 79, 211, -10, -61, 212, -32, 94, 127, 150, 107, -212, 43, 62, 155, 155, 19, 235, 82, 293, 122, 155, 280, -99, 152, 115, -84, 94, 113, 95, 177, 325, 205, 37, 204, 90, -163, 18, -7, 131, 25, 44, -73, -101, -113, -54, -75, 13, -196, -179, 84, -148, -197, -66, -45, -37, 136, -83, 129, 105, 17, -168, 123, -91, -117, -70, -145, 93, -40, -67, -216, -241, -57, 80, 140, -209, 59, -200, -146, 75, 40, -240, -39, 204, -80, -80, 125, -30, 119, 66, 64, 97, -118, 73, 54, -74, 266, 77, -269, 1, -92, -78, -46, 11, -135, -59, 16, 73, 101, 16, -5, -272, -20, 94, 264, 248, -30, -56, -14, -107, 35, 116, -57, -47, 143, -271, -374, 20, -186, 77, 77, -34, 34, 59, 118, -244, -263, 22, -184, -25]
5493b5P2o6K17l76J68j1l37K22l2K40K43k07k68K62j87J37J57J05l84L0o3K18
5515A15j53J27K00r4k92K86k68j11K39J63j26J21j95n6j56J90J38k26L06r5j84
5536g1K19n4M0k29m2R9K33l1k22O1PKp0n7M2m2J30j17K6j22M85k75k15j2J83l
5562c5k50L03j72K38j13j16J09m6m7J75j51p7L79l89K06r1j85n6K30k6n5J5M13
5585B59n47J61K08o9n0K54o7M3j96R7j2J39l5l61k3J4Q38k76k48k82L09J70n04
5608a78p6K00O2J72j86k52N45l30m06J033j167Q57l4p69N87l83j40l22P86J21
5628A20o22L60j43J77J26l74P76k35n43j20M13r2O39j018O99m36m0K90j29n60
5648g12P21j22K8K65j68l6n86M34N54r01R79r03l1M77p7M33m65M74k67p09O19
$$ y = [-25, 47, -19, 198, -178, -10, -21, -358, -136, -168, 72, 315, 108, -160, 102, -85, 52, 209, 314, -70, -40, -103, 115, -38, 89, 289, 195, -97, 189, -79, -190, 49, 212, 86, 207, 12, -44, -200, -10, 128, -98, 208, 113, -71, 148, 94, 134, -95, -137, -38, 195, 164, -58, 3, 10, 12, -58, -115, -73, -115, 15, -102, -76, -198, 287, 12, -203, -215, -32, -35, -285, 18, -154, 84, -29, -145, -36, -82, -129, 46, -105, -182, 197, -192, 14, -77, -262, -318, -88, -114, -169, -154, 259, -288, -127, 81, 12, -38, 216, 149, 192, -4, 93, 81, 220, 185, -176, -199, -185, 653, 377, 129, -153, 156, 326, -178, -254, -54, 8, 180, -6, -258, 287, -43, -449, 584, -583, 274, 240, -529, 58, -325, -465, -787, -1, 120, -502, -142, -285, -108, 18, -356, 420, 185, -358, -478, -65, -157, 482, -536, 163, -273, -313, -23, -152, -712, 9, -113, -85, 180, 12, -24, -610, -176, 378, -523, 456, -447, -478, -1, -78, 355, -110, 364, 97, -612, 7]
5669Gj54O94l03k16R31j160O47k52k63l85P82L7l25r5L07m2k08J62m05p0N45n26
5691b92J73L9N7J112j381P41l94K28K47j816J290q21N62K06J94L85q21j08N21
5710A22K59p01N93l01J88j63l15N42l33l47N75R1l96P1k80R5j47L58l37M94n85
5731e17L19K84k9J52q91N60n25M03m05M33P59k61kJ23j89l24j45M87J74m24K31
5752B13L33r5q93L43J86L04K60q88L28K21L2j61O4n77k67L20L48j017R17J15k54
5773a68J95J02m82K96QL46n66L33P9j70K26J01k28l98N16l74M33k11m37K86J58
5794D5M82n94n96N79l1Q3k87j48L05m7J61J03k07J35Q14q33l91N89n44Q75q09
$$ y = [7, -147, 547, 244, 28, 959, -201, 446, 194, -69, -454, 328, 365, 40, -55, 252, 210, 2, 164, -241, -311, 234, -292, -119, -80, -23, 1089, -292, 449, 55, 283, 530, -1286, 4, -817, -255, -49, 145, 530, -291, -399, 122, 381, -320, 273, -28, 160, -3, -318, 224, -109, -456, 119, 210, -186, -115, -395, -300, -447, -89, -426, 68, -517, -198, 86, 57, 209, -682, -122, -647, -244, -649, -216, 543, 282, 280, 403, 214, -110, -255, 232, 406, -18, 213, 546, 451, -442, -99, 87, 391, 651, -237, 91, 312, 344, 183, 247, -330, -597, -277, 71, -946, -29, 86, -168, 27, 129, -353, -57, -49, 297, -269, 64, 143, -27, 199, 300, 72, -326, 190, -184, 249, 38, -399, -113, 45, 527, -67, -663, -84, -115, -32, -319, -467, -162, -209, -48, 55, -152, -17, 797, -36, -427, 162, -382, 493, -316]
$$ [...]
8191d13
##END NTUPLES=NMR FID
##END=
