##TITLE=1H_L3L30-SeO2-f5
 CDCl3,8 sc, 
 4.02.2021
##JCAMPDX= 6.0         $$ Bruker NMR JCAMP-DX V2.0
##DATA TYPE= NMR FID
##DATA CLASS= NTUPLES
##ORIGIN= UXNMR, Bruker Analytische Messtechnik GmbH
##OWNER= root
$$ XWIN-NMR		Version 3.5
$$ Thu Feb  4 10:57:43 2021 Russian Standard Time (UT+4h)  she@DPX200
##.OBSERVE FREQUENCY= 200.1315066352
##.OBSERVE NUCLEUS= ^1H
##.DELAY= (6, 6)
##.ACQUISITION MODE= SIMULTANEOUS
##.ACQUISITION SCHEME= undefined
##.AVERAGES= 8
##.DIGITISER RES= 18
##SPECTROMETER/DATA SYSTEM= spect
##.PULSE SEQUENCE= zg30
##.SOLVENT NAME= D2O
##.SHIFT REFERENCE= (INTERNAL, D2O, 0, 15.7039)
##AUDIT TRAIL= $$ (NUMBER, WHEN, WHO, WHERE, WHAT)
$$ ##TITLE= Audit trail, XWIN-NMR		Version 3.5
$$ ##JCAMPDX= 5.01
$$ ##ORIGIN= Bruker BioSpin GmbH
$$ ##OWNER= she
$$ F:/spectra/data/she/nmr/H-F/1/audita.txt
$$ ##AUDIT TRAIL=  $$ (NUMBER, WHEN, WHO, WHERE, WHAT)
(   1,<2021-02-04 10:55:50.60 +0400>,<she>,<DPX200>,
      <created by zg, POWCHK disabled, PULCHK disabled
       configuration hash MD5:
       00 E9 B6 7A A2 85 ED C7 34 08 36 98 17 FE 4E 26
       data hash MD5: 16K
       5C E8 3E 4E 0D E4 CA 16 B2 F7 05 B8 A6 61 D4 EB>)
$$ ##END=
$$ 
$$ hash MD5
$$ 13 E0 C3 10 D5 FB B8 3B ED 95 1B 53 18 43 1A 34
##$RELAX= 
##$RELAX= 
##$RELAX= 
##$RELAX= 
##$RELAX= 
##$RELAX= 
$$ Bruker specific parameters
$$ --------------------------
##$DU= <F:/spectra>
##$EXPNO= 1
##$NAME= <H-F>
##$PROCNO= 1
##$TYPE= <nmr>
##$USER= <she>
##$AMP= (0..31)
100 100 100 100 100 100 100 100 100 100 100 100 100 100 100 100 100 100 
100 100 100 100 100 100 100 100 100 100 100 100 100 100 
##$AQSEQ= 0
##$AQ_mod= 1
##$AUNM= <au_zg>
##$AUTOPOS= <>
##$BF1= 200.13
##$BF2= 200.13
##$BF3= 200.13
##$BF4= 200.13
##$BF5= 200.13
##$BF6= 200.13
##$BF7= 200.13
##$BF8= 200.13
##$BYTORDA= 1
##$CFDGTYP= 0
##$CFRGTYP= 5
##$CHEMSTR= <none>
##$CNST= (0..31)
1 1 145 1 1 1 1 1 1 1 1 1 1 1 1 1 1 1 1 1 1 1 1 1 1 1 1 1 1 1 1 1 
##$CPDPRG= <>
##$CPDPRG1= <>
##$CPDPRG2= <>
##$CPDPRG3= <>
##$CPDPRG4= <mlev>
##$CPDPRG5= <mlev>
##$CPDPRG6= <mlev>
##$CPDPRG7= <mlev>
##$CPDPRG8= <mlev>
##$CPDPRGB= <>
##$CPDPRGT= <>
##$D= (0..31)
0 1.2 0 0 0 0 0 0 0 0.06 0 0.03 0 0 0 0 0.0002 0 0 0 0 0 0 0 0 0 0 0 0 
0 0 0 
##$DATE= 1612421750
##$DBL= (0..7)
120 120 120 120 120 120 120 120 
##$DBP= (0..7)
150 150 150 150 150 150 150 150 
##$DBP07= 0
##$DBPNAM0= <>
##$DBPNAM1= <>
##$DBPNAM2= <>
##$DBPNAM3= <>
##$DBPNAM4= <>
##$DBPNAM5= <>
##$DBPNAM6= <>
##$DBPNAM7= <>
##$DBPOAL= (0..7)
0.5 0.5 0.5 0.5 0.5 0.5 0.5 0.5 
##$DBPOFFS= (0..7)
0 0 0 0 0 0 0 0 
##$DE= 6
##$DECBNUC= <off>
##$DECIM= 32
##$DECNUC= <off>
##$DECSTAT= 4
##$DIGMOD= 1
##$DIGTYP= 9
##$DL= (0..7)
0 120 120 120 120 120 120 120 
##$DP= (0..7)
150 150 150 150 150 150 150 150 
##$DP07= 0
##$DPNAME0= <>
##$DPNAME1= <>
##$DPNAME2= <>
##$DPNAME3= <>
##$DPNAME4= <>
##$DPNAME5= <>
##$DPNAME6= <>
##$DPNAME7= <>
##$DPOAL= (0..7)
0.5 0.5 0.5 0.5 0.5 0.5 0.5 0.5 
##$DPOFFS= (0..7)
0 0 0 0 0 0 0 0 
##$DQDMODE= 0
##$DR= 18
##$DS= 0
##$DSLIST= <SSSSSSSSSSSSSSS>
$$ [...]
##$SUBNAM2= <"">
##$SUBNAM3= <"">
##$SUBNAM4= <"">
##$SUBNAM5= <"">
##$SUBNAM6= <"">
##$SUBNAM7= <"">
##$SUBNAM8= <"">
##$SUBNAM9= <"">
##$SW= 16.9725356469052
##$SWIBOX= (0..15)
0 0 2 0 0 0 0 0 0 0 0 0 0 0 0 0 
##$SW_h= 3396.73913043478
##$TD= 16384
##$TD0= 1
##$TE= 0
##$TE2= 300
##$TE3= 300
##$TEG= 300
##$TL= (0..7)
0 120 120 120 120 120 120 120 
##$TP= (0..7)
150 150 150 150 150 150 150 150 
##$TP07= 0
##$TPNAME0= <>
##$TPNAME1= <>
##$TPNAME2= <>
##$TPNAME3= <>
##$TPNAME4= <>
##$TPNAME5= <>
##$TPNAME6= <>
##$TPNAME7= <>
##$TPOAL= (0..7)
0.5 0.5 0.5 0.5 0.5 0.5 0.5 0.5 
##$TPOFFS= (0..7)
0 0 0 0 0 0 0 0 
##$TUNHIN= 0
##$TUNHOUT= 0
##$TUNXOUT= 0
##$USERA1= <user>
##$USERA2= <user>
##$USERA3= <user>
##$USERA4= <user>
##$USERA5= <user>
##$V9= 5
##$VALIST= <valist>
##$VCLIST= <CCCCCCCCCCCCCCC>
##$VD= 0
##$VDLIST= <DDDDDDDDDDDDDDD>
##$VPLIST= <PPPPPPPPPPPPPPP>
##$VTLIST= <TTTTTTTTTTTTTTT>
##$WBST= 1024
##$WBSW= 4
##$XGAIN= (0..3)
0 0 0 0 
##$XL= 0
##$YL= 0
##$YMAX_a= 159672
##$YMIN_a= -195916
##$ZGOPTNS= <>
##$ZL1= 120
##$ZL2= 120
##$ZL3= 120
##$ZL4= 120
##$ABSF1= 10
##$ABSF2= 0
##$ABSG= 5
##$ABSL= 3
##$ALPHA= 0
##$AQORDER= 0
##$ASSFAC= 0
##$ASSFACI= 0
##$ASSFACX= 0
##$ASSWID= 0
##$AUNMP= <proc_1d>
##$AZFE= 0.1
##$AZFW= 0.1
##$BCFW= 1
##$BC_mod= 2
##$BYTORDP= 1
##$COROFFS= 0
##$CY= 11.3945322036743
##$DATMOD= 1
##$DC= 2
##$DFILT= <>
##$DTYPP= 0
##$F1P= 15.9154993809931
##$F2P= -4.1035820241983
##$FCOR= 0.5
##$FTSIZE= 0
##$FT_mod= 4
##$GAMMA= 1
##$GB= 0.15
##$INTBC= 1
##$INTSCL= 1
##$ISEN= 128
##$LB= 0.24
##$LEV0= 0
##$LPBIN= 0
##$MAXI= 10000
##$MC2= 0
##$MEAN= 0
##$ME_mod= 0
##$MI= 1.114404
##$NCOEF= 0
##$NC_proc= 0
##$NLEV= 6
##$NOISF1= 3.799351
##$NOISF2= 2.8
##$NSP= 1
##$NTH_PI= 0
##$NZP= 0
##$OFFSET= 15.70392
##$PC= 1
##$PHC0= -10410.29
##$PHC1= 21.00095
##$PH_mod= 1
##$PKNL= yes
##$PPARMOD= 0
##$PSCAL= 0
##$PSIGN= 0
##$REVERSE= no
##$SF= 200.130013532006
##$SI= 16384
##$SIGF1= 3
##$SIGF2= 2
##$SINO= 400
##$SIOLD= 16384
##$SREGLST= <1H.CDCl3>
##$SSB= 0
##$STSI= 0
##$STSR= 0
##$SW_p= 3612.71676300578
##$SYMM= 0
##$S_DEV= 0
##$TDeff= 0
##$TDoff= 0
##$TI= <>
##$TILT= no
##$TM1= 0
##$TM2= 0
##$TOPLEV= 0
##$USERP1= <user>
##$USERP2= <user>
##$USERP3= <user>
##$USERP4= <user>
##$USERP5= <user>
##$WDW= 1
##$XDIM= 8192
##$YMAX_p= 0
##$YMIN_p= 0
$$ End of Bruker specific parameters
$$ ---------------------------------
##NTUPLES= NMR FID
##VAR_NAME=  TIME,          FID/REAL,        FID/IMAG
##SYMBOL=    X,             R,               I
##VAR_TYPE=  INDEPENDENT,   DEPENDENT,       DEPENDENT
##VAR_FORM=  AFFN,          ASDF,            ASDF
##VAR_DIM=   8192,          8192,            8192
##UNITS=     SECONDS,       ARBITRARY UNITS, ARBITRARY UNITS
##FACTOR=    0.0002944,     1,               1
##FIRST=     0,             0,               0
##LAST=      2.4114304,     0,               0
##MIN=       0,             -195916,         0
##MAX=       2.4114304,     159672,          0
$$ Real data points
##PAGE= N=1
##DATA TABLE= (X++(R..R)), XYDATA
$$ [...]
1948g06J449m62j64J096j219j09P76j416N23J046o73P67k1l58j2m96p4m7K20L16
1968D36k57J032n44m90M28o03q67J159p81L95R96j023L57r9j224P53j8n38J285
1987C97o43k98J249r78l37M28q53L24M32o6O09n66Q5l84l17L63l89N94O12n67
2007c05P76k43r10Q07r42j28J183n80N74L95o71M13l83k17L67n25N22M66Q2k52
2027D29k59M15l66j44N78n23P52K63m97N03j074Q6j63m54O37K88P7M23p27P40
2047I84o22r82J144j143K03R01j288J417k09j342J683j340L30R10j663J144j25
2064Bq39J246j586L85Q89j335J673l06n78J207j466L32M77j655J156m5p18J973
2082H12j190K88K47n53N61k88l35P97p71J27J75l63P32n33K23N02j15N48l05r0
$$ plain form
1948 -706 743 281 117 1213 -6 -115 661 -755 -232 814 141 908 887 529 517 21 -53 -100 120 436
1968 436 179 1211 667 177 605 2 -865 294 -487 -92 904 -119 238 139 -1085 -332 -350 -888 397
1987 397 -246 -544 705 -273 -610 -182 -1035 -711 -279 -345 264 -302 -217 -601 -918 -555 -944 -350 262 -305
2007 -305 471 228 -682 125 -817 -945 238 -342 232 627 -44 369 -14 -231 136 -389 133 599 681 429
2027 429 170 585 219 75 653 130 882 1145 648 1151 77 163 0 -454 183 471 548 971 244 984
2047 984 362 -620 524 -619 -416 485 -803 614 405 -937 746 -594 -264 646 -1017 127 2
2064 2 -837 409 -1177 -792 97 -1238 435 129 -449 758 -708 -376 101 -1554 -398 -443 -1161 812
2082 812 -378 -90 157 -396 165 -123 -458 339 -432 -305 -130 -493 239 -294 -71 431 316 864 559 469
2102D69K30q63j0J64n30Q27j3R4N66l04K30j06j57j86m52M05m96M4M00n92N09
2123B29K41n65P13q3m16J89n25j72J64j37j39J57j28L29L50n10N16k58n8J06n08
2144e05l11L36k30J3J40M0Q02m97J30J87l56K62m80m00J167r53M92O68j055O93
2164A43K85j067J114j20m62R49j132L16J09p89R78l89j8Q15m60J007l59q85R58
2183I93j477K90J169j454J026L09q18J038r62j49M53m09MO31m48K24k82k75J36
2202am04J15K11M19O9k13L9o04P1N8p32O75KJ42L99l48j03l48l36N25l79M20L05
2225a8l79N30o21m20Q77j054M94Q04j053J427r2j180J227j210q9O77o99J241J09
2244E71n26N41o45l7K45p77Q27J4k09J312r35j51O76j568J178k18n38J246p80
$$ plain form
2102 469 699 -164 -174 -10 -540 287 274 368 934 630 860 754 597 411 -41 364 -132 -88 312 -280 229
2123 229 470 -95 618 535 119 308 -217 -389 -225 -362 -501 -344 -472 -143 207 -303 213 -45 -103 3 -505
2144 -505 -816 -480 -710 -697 -557 -517 285 -212 -82 105 -251 11 -469 -869 298 -655 -163 505 -550 143
2164 143 428 -639 475 355 -107 842 -290 26 135 -654 324 -65 -83 732 272 1279 920 35 993
2183 993 -484 -194 975 -479 547 856 38 1076 114 -35 418 9 13 644 196 420 138 -137 -1
2202 -1 -405 -290 -79 340 409 196 235 -369 -298 -240 -972 -297 -295 -153 246 -102 -205 -553 -889 -364 -743 -323 -18
2225 -18 -397 133 -488 -908 -31 -1085 -591 213 -840 587 495 -685 542 -668 -757 -80 -779 462 571
2244 571 45 586 -59 -96 149 -628 199 213 4 1316 381 230 906 -662 516 298 -240 1006 226
2263B26L34M31j100L39Jn40O77Nk49N93o74K75l97m45N48r4M46k49j4K81o94k50
2285e50O13p74O08K29n04N18k76j56J40l42N9m1j02L08l28O47o28K74M99m93j53
2306d52P15o24O53l29k20J86o28M56L55l87M25L14p4Kl99Q9L7m36O32m20j74Q17
2328E38l15K04J76n63O28Np07O78m09m90P89m58k50Q44q20N70R4k01J62l30Oj02
2350D9k50K00o1l24Q98p38K33L14o88O69k78m92L19k57k34O47q21L52L92k62O68
2371C36j72o44M83l15l87K65K84l00P9p3J74q2L57j94K03L79j85k83K71k12l07
2392c23J02m9p8O91l4l8M38k21k89K57o91N06J13o23R32l85R9L90p81J70P59o12
2414C33K18k80R8M3p01J13M8j48P68l89J72Q16j164L83j22j100J212l36j19J003
$$ plain form
2263 226 560 991 -109 230 231 -309 368 373 124 717 43 318 -79 -524 24 -70 376 127 113 394 -300 -550
2285 -550 63 -711 -103 126 -378 140 -136 -292 -152 -494 -435 -476 -578 -270 -598 49 -579 -305 194 -299 -452
2306 -452 263 -361 292 -37 -257 -71 -699 -243 112 -275 150 464 390 392 -7 82 119 -317 315 -105 -279 538
2328 538 223 427 603 40 668 673 -34 644 235 -255 534 76 -174 670 -150 420 514 313 475 145 151 49
2350 49 -201 -1 -62 -386 512 -226 7 321 -367 302 24 -468 -149 -406 -640 7 -814 -462 -70 -332 336
2371 336 164 -480 3 -312 -699 -434 -150 -450 -371 -444 -270 -352 5 -189 14 393 208 -75 196 -16 -323
2392 -323 -221 -270 -348 343 309 271 709 488 199 456 -235 271 384 -239 693 308 407 797 16 186 945 333
2414 333 551 271 369 412 -289 -176 -128 -276 492 103 275 1091 -73 310 188 -912 300 -36 -155 848
2434H48r13k76L32o70J93M93l92P70m74j84R8k50q3J30r0J97l22O68K3j72J65
2455I1k18p68P02m7j65P84m06L01pl46l5K02m81l9R04j002J040l70l51K09L39
2476C37m69M66Q9l95O01J12n31L40j65o73P27l94Q0L29k38K55j99m55K41m57Q66
2497D67m58O5J94p97K33O16j227J306m05m04M43k48m9O37j076M70J27p36Q41n18
2517e19K29O92q19K83j76n42J110q22J43P11o37R4j17l49P15m16M7R10j026R59
2537D70l56o29P99l70J30K47m99J14O23m23j24n1K11J01J4L8J99m93K92l6n1p4
2559A32M23k25L66k68k58N41n27l9J40j84j06N77j015R53k82l47P47q27P3L82
2579B56l67n5L00p15L62j53N54j4m00J04k25k26N91l12J86K65r74N04L41q28M74
$$ plain form
2434 848 -65 -341 -9 -679 -486 7 -385 385 -89 -273 -175 -425 -508 -378 -468 -271 -593 75 98 -74 91
2455 91 -127 -895 -193 -240 -405 379 -27 274 267 -79 -114 88 -393 -432 472 -530 510 140 -211 -2 337
2476 337 -132 334 423 28 629 741 210 550 385 -288 439 45 125 454 216 471 272 -183 58 -399 467
2497 467 9 74 268 -529 -296 320 -907 399 -6 -410 33 -215 -264 373 -703 -233 -106 -842 -1 -519
2517 -519 -290 402 -417 -134 -310 -852 258 -564 -421 290 -347 -253 -370 -719 -4 -420 -373 537 -489 470
2537 470 114 -515 284 -86 44 291 -208 -94 529 106 -18 -69 142 243 257 295 494 1 293 257 206 132
2559 132 555 330 696 428 170 711 184 145 285 101 -5 572 -443 510 228 -119 628 -199 -126 256
2579 256 -111 -166 134 -581 -219 -372 182 168 -232 -128 -353 -579 12 -300 -114 151 -823 -319 22 -806 -332
2600c32M55r00R22m45j97P33o82n4O92p61j40Q82l78M7j6j57M12k17P8K93k92
2621e7J18K29j81L5m94O74J91o76Q59j32o15J392j548O01K41r30O91L2q30Q70
2641D70J18j95J95n03L22k61l37M81l52J22O3k98K55j61q1K69k96KK75l59L03
2662C2k58j69O19m71r1j68M09M4J10J01m28L57n01l41M42oj77M71j13P2N61r66
2684d71P29q0o46Q17o58J87N50o42K90m2l73Q10p31jR06j093O07n0k57Q47q07
2705a08q6R89j182J289K10q67K74m67J06q1j06N09j11l05N55l75M0j04k45J49
2725H4m3j14L94l25j52M15r34J82K96j32J90L13j08l79J1m69N01L60o63M21N5
2746i7m28M45K6m72L0L75n29L27M5M12l16J41J85n95N30j50l80P98n52K25L15
$$ plain form
2600 -332 123 -777 145 -300 -497 236 -446 -500 192 -569 -709 173 -205 -158 -174 -331 81 -136 -58 235 -57
2621 -57 61 290 109 144 -350 324 515 -161 698 566 -49 1343 -205 396 637 -293 398 430 -400 470
2641 470 588 393 588 85 407 146 -191 290 -62 60 123 -175 80 -81 -162 107 -189 -187 88 -271 32
2662 32 -226 -395 224 -247 -338 -506 -97 -53 57 158 -270 87 -414 -755 -313 -319 -496 -25 -138 -66 495 -471
2684 -471 258 178 -468 349 -309 -122 428 -214 76 34 -339 471 -260 -261 645 -448 159 109 -148 699 -108
2705 -108 -194 795 -387 902 1112 245 519 52 158 77 -29 480 369 64 619 244 284 180 -65 84
2725 84 41 -73 321 -4 -156 259 -675 -493 -197 -329 -139 174 66 -313 -302 -771 -270 90 -573 -152 -97
2746 -97 -525 -80 -54 -526 -496 -121 -650 -323 -278 134 -182 -41 144 -451 79 -71 -451 347 -205 20 335
2767C35l82P0J44n59P85j43l24N46l80o5M82o84J25L61l25M94j51p8K10l02J7
2788A76J40l79O47l13k39L77k17Q8k73l90R85k98l01O84n90k33N66q91K95L08
2808A42o36M71J56k08P0n16J82R7J0L4oj02J39j27k05M96n45N75J33n59L51m55
2830e03N57J72o67M63l69j84K12O88q37J88L55k21l6J34N2j29J67oRJ86l09L0
2852d8K38L5J19P0M47m60p20Q90j046J58M5M51K4k57O02L38j195L51P64p86K45
2873B65N4N9L73r65mM40q03N53M0k92O37o22J45L48r27Q30p97J47P44m76j41P88
2895C96j244O70P8o17P55n17q67J205o48J01J182j208O85J97o66P59k44m80J038
2914E75j426O80J087q97m04K37K07Jk65k29L56j2o9K91k02R33q31J72J09m27M11
$$ plain form
2767 335 -47 23 167 -392 393 250 -74 472 92 27 509 -175 -50 311 -14 480 329 251 461 159 176
2788 176 316 -63 584 271 32 409 192 280 7 -383 602 304 3 687 97 -136 430 -461 -166 142
2808 142 -494 -23 133 -75 -5 -521 -339 -242 -232 -198 -204 -306 -167 -294 -499 -3 -548 27 160 -399 -48 -503
2830 -503 54 226 -441 22 -347 -531 -319 369 -468 -280 75 -146 -182 -48 4 -125 42 36 45 231 -78 -48
2852 -48 190 225 344 414 861 401 -319 571 -475 -317 -272 179 203 -54 548 886 -309 42 806 20 265
2873 265 319 378 751 -214 -218 222 -581 -28 12 -280 357 -265 -120 228 -699 131 -666 -519 225 -251 -392 396
2895 396 -848 -178 -100 -717 38 -479 -1346 -141 -789 -688 494 -714 -29 168 -498 261 17 -463 575
2914 575 -851 -171 916 19 -385 -148 59 60 -205 -434 -78 -90 -159 132 -70 863 32 204 313 -114 297
2935B97rm75K01L59Ok99l09p65J686o67j78M17n05N86K52p84m0o9L36m94L13r1
2957b32L36n3k62J64l54P63q82M25N48j251M55j1k85J695j594o94K015j066l83
2976f66J52J50P97k48o02K17N1K19m94K43n5k43k48J201q30O59K78j562J193N58
2996G70r69M23r72M2Q70n14Q60l18p70Q02m05P29Kj71p62N66J46j80J20k92m19
3017d42J51J57M89k14r42J139k28J76M05j177M22R5k1j5q50J185k67j108J047
3036Bk54k6R80p09o67mM80j16L27l66j73M25n39j74K2J149k27k58J75J95m86Q74
3058F30j186N75P08p13J41j3N1p19J44M49q81K04P37K79N21j256M39m47J43Mk24
3079d14P33j297J022L92j97rM8r99J190k80N82k24r16J27r7q08P32q0K66K47m94
$$ plain form
2935 297 288 -187 14 373 379 80 -229 -994 692 25 -153 264 -241 345 597 -187 -227 -296 40 -454 -141 -232
2957 -232 104 51 -211 -47 -401 362 -520 -95 453 -798 -343 -354 -639 1056 -538 -1232 783 -283 -666
2976 -666 -514 -364 433 185 -417 -200 -149 70 -424 -181 -236 -479 -727 474 -356 303 581 -981 212 770
2996 770 -199 224 -748 -706 164 -350 510 192 -578 224 -181 548 550 379 -383 183 329 149 269 -23 -442
3017 -442 -291 -134 355 141 -801 338 110 286 691 -486 -64 31 10 -5 -855 330 63 -1045 2
3036 2 -252 -278 702 -7 -674 -678 -198 -314 13 -353 -526 -101 -640 -814 -792 357 130 -128 47 242 -244 630
3058 630 -556 19 727 14 155 142 193 -526 -382 67 -814 -610 127 406 927 -329 110 -337 -194 -190 -414
3079 -414 319 -978 44 436 239 230 278 -721 469 189 771 547 -369 -242 -339 -1147 -415 -495 -229 18 -476
3100d76J087j494L62J78J95r7K58m72M77l67M75J73q27N65j52m01l0K13m69N85
3120b17k29M52q21O36l87k42O97q85L51J45J6K77L12o85M49q17R64P29j125L46
3140c4N39p50L33p6o8N26j078O13M27o26K47o67L88R78m78L85o44K69L09p82j098
3161a287J816K65j126L52q58J967j538P09N66j089j115J843l23j26L24m64m47
3178e31O14J57M52j095J33J12M95o20K93j35o32J105P6j214rP7L46K34L88n93
3198c47J73M21q35N58kp73J068m58j11L02q20N97J61j65n23O65j05K36J02l42
3218a98N2j09K75k57n16P82N1l39J98k61M37k20L58q8j14J34J27L16r6k10m72
3239a50K31l2j80P71j86k78J16m60k36L99P57r73L37p1l95j1J7l8L63j04lN19
$$ plain form
3100 -476 611 -883 -521 -343 -148 -245 13 -459 18 -349 126 299 -528 37 -115 -516 -546 -333 -802 -217
3120 -217 -446 6 -815 -179 -566 -808 -111 -996 -645 -500 -484 -207 105 -580 -131 -948 16 745 -380 -34
3140 -34 505 -245 88 12 -56 470 -608 5 432 -194 53 -614 -226 752 274 659 15 284 593 -189 -1287
3161 -1287 529 794 -332 20 -838 1129 -409 300 866 -223 -1338 505 182 56 380 -84 -531
3178 -531 83 240 692 -403 -270 -158 337 -283 10 -125 -757 348 424 -790 -799 -722 -376 -142 246 -347
3198 -347 -174 247 -588 -30 -32 -805 263 -195 -306 -4 -824 -227 -66 -231 -754 -89 -194 42 144 -198
3218 -198 -146 -255 20 -237 -753 29 80 -259 -61 -322 115 -105 253 165 51 185 312 628 532 322 -150
3239 -150 81 49 -131 640 454 176 292 -168 -404 -5 752 -221 116 45 -350 -361 -344 -382 -19 -123 -126 393
3261C93m54M09q13M63J64m99K45l54k77M45l40R42m74l61J69K41n6K07P9o36Q8
3282d19J80l49O27k67K34l75J84M1K46o6m12N91L73j91n23j73J48M8k33j93j20
3303f49J044j27P15p36j85M04J82n07k26o09M38O49o73L68n07M77N5J76L2j86
3323A35k87j02k45O68r17K32M68M21j97l11L10r67P98k18k33O57m85n32R10l62
3343b57q7N97j308P01O48o59L79J3k54M52k00q52O04R9L63p28P40M26r70J06p5
3364b62N12j54p98P52q1K95q3m53L38j67K01qJ40l62p59R64O49l2m77m36O31l05
3386A05k9o0m10P91l93Q39j036M17j73K37J9q35Q57j25j010J233m97J09K15q36
3406e82J281o75n46P07r79L92j06K85k66K1J26j23Q02r62K10l42N68l67K89j63
$$ plain form
3261 393 -61 348 -465 -2 162 -337 -92 -446 -723 -278 -618 324 -150 -511 -342 -101 -157 50 129 -507 -419
3282 -419 -239 -588 39 -228 6 -369 -185 -144 102 36 -376 215 588 397 -126 -299 -151 -103 -336 -529 -649
3303 -649 395 268 983 247 62 466 648 141 -85 -694 -256 393 -280 88 -419 58 113 289 321 135
3323 135 -152 -254 -499 169 -748 -516 -48 373 176 -135 175 -792 6 -212 -445 212 -273 -805 105 -257
3343 -257 -344 253 -1055 -354 294 -365 14 27 -227 225 25 -827 -223 -124 239 -489 251 677 -293 -187 -262
3364 -262 250 96 -702 50 -31 264 181 -272 66 -101 100 92 232 -130 -889 75 724 692 215 -221 410 105
3386 105 76 16 -394 397 4 843 -193 224 51 288 307 -528 329 204 -806 427 -70 39 254 -582
3406 -582 699 24 -522 185 -794 -402 -508 -223 -489 -468 -342 -465 337 -625 -415 -757 -189 -556 -267 -430
3426d30M67K7M7o90P27o9p36K92L69l93M51j44K28j22l79J042j39r76Q20n33J32
3447ik49O78L71j211M70M49p68K33K91k84K31L95k18k20r6r7K08j97N30K71q36
3468e8J14M98l1k14m0o21K30K59k46j05k67M18M64m69n99P44k91J92J9k17L05
3489H5j40l03j91N51j65j50K5M82p22M52J38n03M03j35J64k40j05K46rJ37l59
3510c39N71n69M09r5k30K30N19p49L93j88j40O60k55J64j72k96L80P8k79j57J50
3531H5MJ68m0P6l17J04K28j80p2L04l25P1j40j72K73J8J47k91j15N07l29q5M10
3554C29m40QK03l66p2L98j94J50N2Mj01j14L23m43k7J03j1J54N8j27J89n39J74
3577b89K36k5j38K60j29J59k67J69K44k7j85k42K4r0L00J57p1J80o1l95J73P4
$$ plain form
3426 -430 37 64 111 -579 148 79 -657 -365 4 -389 62 -82 146 24 -355 687 548 -428 392 -141 -9
3447 -9 -258 420 791 -420 50 499 -269 -36 255 -29 202 597 379 159 63 -34 174 -23 507 778 -58
3468 -58 56 554 523 309 269 -352 -122 137 -109 -214 -481 -63 401 -68 -667 77 -214 -22 -3 -220 85
3489 85 -55 -358 -549 2 -163 -313 -288 194 -528 -76 62 -441 -38 -173 -9 -249 -354 -108 -117 20 -339
3510 -339 232 -337 72 -23 -253 -23 496 -253 140 -48 -188 472 217 381 209 -87 293 371 92 -65 85
3531 85 89 257 217 293 -24 80 308 128 56 360 35 106 -34 -206 67 85 232 -59 -174 333 4 -81 329
3554 329 -111 -103 100 -266 -338 60 -134 16 68 72 -29 -143 180 -263 -290 -187 -198 -44 14 -113 76 -463 -289
3577 -289 -53 -78 -216 44 -85 74 -193 -24 220 193 8 -234 -210 -300 0 157 86 266 205 -190 -17 57
3599E7qJ34l46J04L32k15M25j43k52J70n1J6o5j14Q7m3j65oK52j18J69K4J48m6
3623C46l75J23l06J28Q2L1r5m3J75K94m69J06J62l75m3J97j17J56l04J86K45l04
3645b00j45L68q4k7r4J37k21R5l30L50j92j91L64K87m11K39J28m73K32L0k3K00
3667C9j72J58J75j84K37l12R9J02M2j22Q6n1Q4k25K7J06l75N21M7k07L23j1j41
3690B46j17l68J53L43m00K81K6k12J88Q8m17M27m74J53J0r8J86p6n3P9j97K27
3712eK39l31N43j00j78J78q41L18P1k42M86k55j83M69m05L16n1l30J16j79J30
3733b34K90p2P1N1k18J39J94l37J19j52K97J01j67j14l2j65K09K37k46J1K55J05
3755C42k58P1j32N3K9o4K08l1j85k5J52j24k7M7J34J3j42R8l05L37j41m11K71
$$ plain form
3599 57 49 183 -163 -59 273 58 483 340 88 258 207 223 158 44 131 88 -77 -83 169 51 220 244 392 346
3623 346 -29 94 -212 -84 -2 29 -66 -109 66 360 -109 -3 159 -216 -259 -62 -179 -23 -327 -141 104 -200
3645 -200 -345 23 -61 -88 -182 -45 -266 -171 -501 -151 -343 -534 -170 117 -294 -55 73 -400 -168 -138 -161 39
3667 39 -133 25 200 16 253 -59 40 142 184 62 148 97 181 -44 -17 89 -286 235 282 75 398 387 246
3690 246 129 -239 -86 257 -143 138 164 -48 140 228 -189 238 -236 -83 -73 -171 15 -61 -114 -35 -232 -5
3712 -5 234 -97 446 346 168 346 -495 -177 -106 -348 138 -117 -300 169 -236 80 29 -301 -185 -364 -234
3733 -234 56 -16 55 106 -112 27 221 -116 3 -149 148 249 82 -32 -64 -229 -20 217 -29 -18 237 342
3755 342 84 155 23 76 105 41 249 218 33 8 160 36 9 56 190 203 61 159 -146 191 50 -361 -90
3778i0j95M17r6j08J99r7l34L73k15n9K94l68K11Q0k41lNj95N55l16L13k13j69
3801b52M16k97n5n9L3n0J41p4J90L0K09k78o7K39k01NO9K69k43l3j5j58N35k48
3825A06j04K74n5m9n4J04j8r5j41J99j34j92M33j60q4K59n2k76P5k3K16%k90J49
3849H8K06j52q4O5O0j11k7J53m45J87K76m82J70j33P8L36l06J56l8k27o6J26O
3872a64K8R2j63J38N1r8LQ3m5o2J22n8J33O1j74J25k42J67N0j2j48K25k36K26
3896A02o6R9j67M5n2k09K05J98j47K67j20J28J51m40J21J33m90L70J27k80K53
3917B28l19K00o0J83k85kJ51J05k21J85p9j55Q6j4k7R8M7J39j94k40J03k86J84
3940a73l02M07r7K97k67Qp9M2K14m08J00M5K06j43R5k83L9L75j72L6J61j66J39
$$ plain form
3778 -90 -285 132 36 -72 127 30 -304 69 -146 -205 89 -279 -68 12 -229 -232 -227 -422 133 -183 130 -83 -252
3801 -252 164 -133 -188 -247 -214 -264 -123 -197 -7 23 232 -46 -113 126 -75 -70 -1 268 25 -8 -23 -181 354 106
3825 106 2 276 221 172 118 222 204 109 -32 167 33 -159 274 114 30 289 237 -39 36 13 229 229 -61 88
3849 88 294 142 58 123 183 72 45 198 -247 -60 216 -266 -96 -229 -151 185 -121 35 -3 -230 -296 -170 -164
3872 -164 -136 -44 -207 -69 -18 -116 -113 -30 -75 -137 -15 -73 60 121 -53 72 -170 -3 47 35 -113 112 -124 102
3896 102 36 135 -32 13 -39 -248 -43 155 8 275 155 283 434 -6 115 248 -242 128 255 -25 228
3917 228 -91 109 49 232 -53 -55 96 201 -20 165 86 -69 17 3 -24 74 121 260 66 -174 -71 -357 -173
3940 -173 -475 -68 -165 132 -135 -127 -206 -164 50 -358 -258 -213 -7 -150 -55 -338 -299 76 -96 -60 101 -65 74
3963G4n5j77K89J24m19K67r4K24Qj99k02L54j41n0m5J4M2J5K07o2N0j51jm7K7
3988E2J69J51k38m4J88l76k4K54k14J46K26l93L14j33j45J44k74J11J55k62J93
4009@J36j53J36m88L65j27RJ3o8J6j57pK26K45k58n9q3J87NK02k19Q4j42j95K54
4034g8K17k29j25P9J22J28l51K79n9k31M88j24l08J97j26qK34o1j47K98k98K13
4056A10j13K68j05J22m0K8k55M1j30J47Oj29L25k49l23M58Jq9Q4j61K28j4k40
4079c0J83j3m14L48k52K20k32J52J80%l18K39k03k45J63rR5R6j30J71j50J27o2
4102h4R0Nj20O1K49k09j53J07l0KO7J32O7r4O9p9J13j88O9j78L46J47n27L47j45
4127F4J5q4L17m08K80j57J08J38n1j83J95j76j38L85k69K09k27q7J61l3L5j43
$$ plain form
3963 74 19 -158 131 255 -164 103 9 233 241 42 -160 194 53 3 -42 -28 14 29 236 174 224 73 72 25 52
3988 52 221 372 134 90 278 -98 -122 132 -82 64 290 -103 211 78 -67 77 -197 -86 69 -193 0
4009 0 136 -17 119 -369 -4 -131 -122 -109 -177 -161 -318 -325 -99 146 -112 -171 -254 -67 -62 140 -79 5 -137 -332 -78
4034 -78 139 -90 -215 -136 -14 114 -237 42 -17 -248 240 116 -192 5 -121 -129 105 44 -103 195 -103 110
4056 110 -3 265 160 282 242 270 15 56 -74 73 79 -50 275 26 -297 161 162 73 157 -4 224 210 -30
4079 -30 153 140 -274 74 -178 42 -190 -38 142 142 -176 63 -140 -385 -222 -231 -136 -40 -170 1 -149 -22 -84
4102 -84 6 11 -109 -48 201 -8 -161 -54 -84 -82 -15 117 184 90 159 80 193 5 74 -104 242 389 -138 209 64
4127 64 79 -5 312 -96 184 27 135 273 222 39 234 58 -80 305 36 245 18 -69 92 59 94 -49
4149d9K33k17J66nj35j25o7J55m3j29L43l57J47kp2M82o42K26J07k66K03q1k28
4172c56K28j45J7J46k15L44N3P7k43N8o4R5j34mO4r2M5L1M8L16k11l11J69J88
4196A04j01m5J00P1o0N0r9k23L98j56J30j7k7k58J89N5p9K55j34k48K53p1j03
4219a6R2j06l11K81j26J00Q7N5j4Q5j20k0k2M0J45J0j90P1j17J02p7j63J85N0
4243B1K2q7j2J55j11j2L7j30J84j35k8L8p3O0k5N6P0n7J2j05J98l83J22Q4R6K39
4269B36l54J29L51m16K54L5k58K83o9j16J9R1j6O1k32m1J08j87K51k59J70k23
4291a83K89k1K23k39m6j70j3p3J83J08m4q5K99j08J13m04Q6J9R2k8j94p8L49m22
4315c47K74J1kj16J07r4J26k51L04j72o8Q6p4OJ14j96M84l09K30k98K11p1n0k99
$$ plain form
4149 -49 184 -33 133 128 -7 -132 -199 -44 -87 -216 127 -230 -83 -85 -157 325 -317 -91 16 -250 -47 -128 -356
4172 -356 -128 -273 -256 -110 -325 19 72 149 -94 -36 -100 -5 -139 -143 -79 -171 -126 -95 -47 269 58 -253 -84 104
4196 104 3 -42 58 129 69 119 20 -203 195 39 169 152 125 -133 56 111 32 287 153 -95 158 87 -16
4219 -16 76 -30 -341 -60 -186 -86 1 56 42 127 7 -13 -35 5 150 160 -30 41 -76 26 -51 -214 -29 21
4243 21 43 -44 -56 99 -12 -24 13 -117 67 -68 -96 -58 -131 -71 -96 -40 30 -27 -15 -120 78 -305 -183 -99 -3 236
4269 236 -118 11 362 -54 200 235 -23 260 191 75 94 185 169 230 -2 -43 65 -122 129 -130 40 -183
4291 -183 106 85 308 69 23 -147 -160 -233 -50 58 14 -71 228 120 233 -171 -85 -66 26 -2 -196 -274 75 -347
4315 -347 -73 -62 -64 -180 -73 -167 -41 -292 12 -160 -228 -142 -216 -210 -96 -292 192 -117 113 -185 26 -45 -95 -394
4339c94L57m1r8O7o9L99k11k25N46k21n1P5J68o3j47M2M7J10k60Q5m2J45k7R0
4363B82k0j66J54j33j01L07k23j61J12O6j07J28k75M14l16oK89k65n4K3J55p1
4385C2J5j5J1j31N9k27Q7K40m11J33N7L6k9O8p9n0Q1k6j31J13j00L09p1R9k79
4410b09J24j25NL64k57p0L22k09J92j93M1q3j16K60k12J62K04j40q7L62l33R3
4432I5P6O6k59J94j49p5P5n9J04k22J34K77m05J71K86l77J85j49j1Jo2K05J9Q3
4456B03m8j2p8k00J2rJ35k51K16R3j60K5Qk07M6J52k29L89k13J34j82P8P5k09
4480b32J04K50k26l6K40k39J80j08O7j27j54K27J28rJ2j38k6L14m97L18K05j37
4502A16j32K71j80k1n4p1J72J48k53K36m36L04M3K2L0k39k5Q4O3J06j46J39L7
$$ plain form
4339 -394 -37 -78 -176 -109 -178 221 10 -215 331 110 59 134 302 239 92 134 181 291 31 116 74 219 192 282
4363 282 262 96 250 117 16 323 100 -61 51 117 10 138 -137 277 -39 -45 244 -21 -75 -52 103 32
4385 32 47 32 43 -88 -29 -256 -169 71 -340 -207 -150 -114 -143 -75 -154 -204 -123 -149 -280 -167 -267 42 -29 70 -209
4410 -209 -85 -210 -205 159 -98 -168 154 -55 137 -56 -15 -98 -214 46 -166 -4 200 60 -27 335 2 95
4432 95 171 237 -22 172 23 -52 23 -36 68 -154 -20 257 -148 23 309 -68 117 -32 -43 -42 -104 101 120 203
4456 203 155 143 65 -135 -123 -132 3 -248 -32 61 -99 -74 -66 -273 -227 -75 -304 85 -128 6 -176 -98 -23 -232
4480 -232 -128 122 -104 -140 100 -139 41 -67 0 -127 -281 -54 74 65 77 -61 -87 227 -270 48 253 116
4502 116 -16 255 75 54 0 -71 101 249 -4 232 -204 100 143 165 195 -44 -69 15 78 184 38 177 214
4525B14k38K01Lj44o0j9j34J62R6j06j02N5k4M4k16L28j60Q6k5L5k45L20k83r
4549b21O4J35L1j39M5j61N7Q2N1L3j10K2o9J31k0K41o0k5j66L03n2j84%j38K38
4574H8K6l77O39k88j36J13j17K47M0k42J17j51K4R4K27k56r9L13j90P7q3K5J34
4597B25q5j16j37K30lj64J04Jj46J97J14k34J64k35J19O1k20P6J78k29K38M4m06
4620b24K54o9Mj7j84K72Lm03L39k38K76j23L0o0J73j73K42J73k86Q6p1N8P5k35
4644i8K75j74m2J87R8k00O4k29J14K78l1J13m41Q1M8J61j73L9K12j87j58J89M4
4667A70K4j47j4o8k8J52k5j12K13j53Q9J14J9j72j76n0K98k43J63j01j93L65j75
4690e0k85K76j53R6K04k37N6k45K89n9m61N37O0k05K30j07j06J22K07k96K42j39
$$ plain form
4525 214 -24 177 180 36 -24 -43 -177 -15 81 -25 -127 -72 -96 -52 -268 60 -100 -14 -39 -4 -249 71 -212 -221
4549 -221 -157 -22 9 -130 -85 -246 -189 -107 -56 -23 -133 -111 -180 -49 -69 172 112 87 -79 224 172 -12 -12 -150 88
4574 88 114 -263 376 88 -48 65 -52 195 235 -7 110 -41 -17 77 304 48 -51 262 72 149 66 91 225
4597 225 140 24 -113 117 114 -50 54 55 -91 106 220 -14 150 -85 34 95 -125 -49 129 -100 138 182 -224
4620 -224 30 -39 -35 -52 -236 36 39 -364 -25 -263 13 -110 -80 -140 33 -140 102 275 -11 75 4 62 137 -98
4644 -98 177 3 -39 148 246 46 110 -119 -5 273 242 355 -86 -5 43 204 31 70 282 95 -63 126 170
4667 170 194 47 33 -35 -63 89 64 -48 165 12 101 215 234 62 -114 -164 134 -109 54 -47 -240 125 -50
4690 -50 -335 -59 -212 -116 88 -149 -93 -338 -49 -108 -569 -32 28 -177 53 -54 -160 -38 169 -127 115 -24
4712b4K47k51l7L18k48J89O9m09J51L9L0Ln7J31j0k26K76q6J56k28L6j29K47j47
4736D0J07m3M1l47K43Q1j06j3O8J62p4Q4l7l3k18J39j45J28K41l65J44n9j12M5
4760b9L5R2k5l15J82J94m20L09q0j77L02k41K09K14j93p2k08j26K61j84K47n3
4782g8m9J03j57JK69l47L70Q2l52K75k22Kl7N5J58pk0n9K3L5J99j71Rj28P6j49
4808a19K15j61K59K41m31RQ8K0KQk34K85N0l87K61k38J73mk81K27k3K31k85K46
4832A52J10l80m0R5j4P6K12l19K90k22j91K74l41K78J88l38J21pj31M2J39j13
4854a19L11m35K18K05k11j2nm9j75L02M4L2j92J13q1q7K70j19l3J16j28K87j74
4877G8q9L57j35j00j10L15k77R7r9J45L7k95K32l6j59J88j28r0J09J4l9J57m13
$$ plain form
4712 -24 223 -28 -65 253 5 194 263 -146 5 44 74 77 20 151 141 -85 191 105 261 33 69 -60 187 40
4736 40 147 104 145 -202 41 122 16 3 71 233 159 243 206 173 -45 94 -51 77 318 -47 97 38 -74 -29
4760 -29 6 98 73 -242 -60 134 -286 23 -57 -234 68 -173 36 250 57 -15 -223 -349 -88 -272 -25 -78
4782 -78 -127 -24 -181 -180 89 -258 112 194 -158 117 -105 -103 -140 -85 73 66 46 -13 10 45 244 73 82 -46 30 -119
4808 -119 96 -65 194 435 4 13 101 121 123 131 -103 182 232 -155 106 -132 41 37 -244 -17 -40 191 -94 152
4832 152 262 -118 -158 -63 -77 -1 211 -108 182 -40 -231 43 -298 -20 168 -170 -49 -56 -187 -145 -6 -119
4854 -119 192 -243 -25 180 -31 -43 -48 -97 -272 30 74 106 -86 27 -54 -141 129 10 -23 93 -35 252 78
4877 78 -11 346 211 111 1 316 39 136 37 182 219 -76 156 120 -39 149 21 -69 40 54 15 172 -241
4900b41P4M0R1N86n44J44o7k5j27K23l07L99m13J01K27l62p3J3L23j24P8N8k87
4923b13L79p29O13j56k75N72q78O36j03L14l91K17n74M45J19k41J91J63O7l46
4943a90J90l30k00O72l54O56o95n56L51J17J57R00m91q8j89M70o07M68l7l90J4
4964a32K56r2K39mm16L68k38rK64k61P0L02j24k03l8M6Kj33K21k0j96K81r2J55
4988B46k84j19J90k75J33K6J53k14K37j44Q2k2l66K39J57o3k53J01J38L4j19K32
5010A09j47k6N9j29Q3j28J70r5K07j45N2K0J22P8k33j04J08J11J3J42j02j02J72
5033B35j50Jk10M98k83j12J48j4NJ25j90j54K51k52j11j94L11K12k40j27L31o15
5055e35K75Q40p55R8j01j67N27j70J92k72J45l05K29m0K74l55K34k95L1q6J72
$$ plain form
4900 -241 -167 -127 -36 550 6 150 83 58 -69 154 -153 246 -167 -66 161 -201 -274 -261 62 -62 16 74 -213
4923 -213 166 -563 50 -106 -381 191 -687 -51 -154 160 -231 -14 -588 -143 -24 -265 -74 89 156 -190
4943 -190 0 -330 -530 142 -212 444 -251 -807 -456 -339 -182 718 227 139 -50 420 -187 281 244 -146 -132
4964 -132 124 32 271 267 -149 219 -19 -28 236 -25 45 347 223 20 -18 28 30 -103 118 98 -98 183 91 246
4988 246 -38 -157 33 -242 -109 -83 70 -144 93 -51 31 9 -357 -118 39 -24 -277 -176 -38 -4 -123 109
5010 109 -38 -64 -5 -134 -51 -179 -9 -104 103 -42 10 30 152 230 -3 -107 1 112 125 267 165 63 235
5033 235 85 86 -124 374 91 -21 127 113 118 243 53 -101 150 -102 -213 -407 -96 116 -124 -251 80 -535
5055 -535 -260 580 -175 -77 -178 -345 182 12 204 -68 77 -228 1 -39 235 -120 114 -181 -150 -236 -64
5076f4M5j93J07k59L44j38J52J90j98J34j25Qj12l1KJ10O8JK44l70J45L0o6J49
5100A73Nk20J92l3L4o5j39K41l19J49K22m02L39K1J6lQ6j32j00N5L4m99K19J96
5124G0P0k67K56j7j5M9l05j05M40l71K10K14m03J36N8q7l8PL9pR4J3k24J01O5
5149a7l36L06J48l59K39n5R3J75k79r3j14J91J71J11k87J8J10j33J50j68Q6N4
5171A1m3NJ62k52k6J94O6M2k46K02k92L9J56n9R2J45j32k18K39m3j34K43j04k31
5195a84L48j8j60L60m15J37k64j17N46k69m5K56k45J91j78jK94l02O6o4p3K2M0
5218g5l8N4j80l60O30m78L47M31m51L66j08Ok11k25JJ02K63j51K99n8l44K69j92
5241a03K02P7l20P66l98j83J57j92j14O01n38o5j54R7L24q0L09N5n17J09l45O04
$$ plain form
5076 -64 -19 -212 -105 -364 -20 -158 -6 184 -14 120 -5 3 -109 -140 -138 -28 40 41 285 -85 60 90 24 173
5100 173 178 -42 150 117 151 86 -53 188 -131 18 240 -162 177 198 214 211 297 165 65 120 154 -345 -126 70
5124 70 140 -127 129 112 97 146 -159 -264 176 -195 15 229 -174 -38 20 -67 -105 -98 -59 -66 28 41 -183 -82 -17
5149 -17 -353 -47 101 -258 -19 -74 19 194 -85 -178 -292 -101 70 181 -106 -88 22 -111 39 -129 -43 11
5171 11 -32 -27 135 -117 -143 51 117 159 -87 115 -177 -138 18 -41 51 196 64 -154 85 42 -92 151 47 -184
5195 -184 164 146 -14 346 -69 68 -196 -313 233 -36 -81 175 -70 121 -57 -58 236 -66 0 -64 -137 -115 -75
5218 -75 -113 -59 -239 -599 31 -447 -100 331 -120 246 138 144 -67 -292 -291 -189 74 -77 222 164 -180 89 -103
5241 -103 99 176 -144 622 224 41 198 6 -108 493 -45 -110 -264 -167 157 77 386 441 -76 33 -312 292
5263B92k83k58K81K44n23L1R0k47P13p33N14P4Km04K92o03K50J48l08M44J97n56
5285c43P91r03R00n76l00K59P0J62q4j71L1l7J09K94m01L88k46Q3k88M93j30p
5307I4k08k65M47l13J66K50k00Jl42M67J91j57k57K21J33l64L21l18K73n7j21
5328c8j96K0K66M0j44K6O3j42M08m14P2K00j6Mj17nP1j23R9O1j78r4Q7r8J15Q6
5354E3l13J57K69l79L42j46p2J63n2J3k42Q3P9Rk75M41j07j28Q3P5j72n0rL82
5378B04p7j39M9j21L04k21k77M34k08J35Q7j75l5K35l82L36j00j38J89K0m29N33
5400B24K4o8O0k13J12J85m50L08l41J67M3j49M9K11k83K37L8j25R3q6L1M7k12
5423i8N4J89N0k14J38k71J10l7j37J33p9M01j48lk29J58j09K09j96j08M59l47
$$ plain form
5263 292 9 -249 32 276 -247 -216 -126 -373 340 -393 121 195 197 -207 85 -518 -268 -120 -428 16 213 -343
5285 -343 448 -455 445 -131 -431 -172 -102 60 -24 -195 -164 -201 -92 202 -199 189 -57 26 -262 231 101 94
5307 94 -114 -379 68 -245 -79 171 -29 -28 -370 97 288 131 -126 95 228 -136 185 -133 140 83 -38
5328 -38 -234 -214 52 92 -52 -26 37 -105 303 -111 -39 161 145 149 32 27 98 -25 74 135 -43 -137 -50 -148 -33 53
5354 53 -260 -103 166 -213 129 -17 -89 74 22 35 -207 -124 -45 -36 -311 130 23 -105 -22 53 -119 -169 -178 204
5378 204 127 -12 37 -84 220 -1 -278 156 -52 83 170 -5 -40 195 -187 149 49 -89 100 120 -309 224
5400 224 248 180 240 27 139 324 -126 182 -159 8 51 -98 -49 162 -121 116 154 29 122 36 67 114 -98
5423 -98 -44 145 195 -19 119 -152 -42 -79 -216 -83 -162 239 91 88 -141 17 -92 117 -79 -187 272 -75
5445g5n1O7N3J25k53L4qNK29l23L4K8J86j52K42k86j37J87j98J62L93l74M5J90
5469A23j20K89k37N9L4j58K14j66M3q0J05J64j67k32L03J04l01O8J10l95K31K28
5491B19j71k32N3j06K57j67K10l14J37K34l12J70j6Q5j30J74j69o2L02l20K92
5512A34j25j06K74k7k66p7J79J44l38L46j85k01K82j97n7P5j06J26R5J3m5m6k5
5535a33L31Pj04j51k51K99k62J23K45l11J95O4p1J67q1l1n1J04J69k10J90o7j17
5558E4J44nj34k20K40j99J50j93N04l44J83k87Q9R0j70K61j01j39K88k22K08j64
5580C3j62RK26k50K52k2j84J34M9j29j85K5K37j08N2Q5Lj54K09j28k44J94OJ05
5604E3p5l7J84q4Q3p0J4J3k32j99M11k40O9K09o8j03L18k69J59l1Q8l2%k42K17
$$ plain form
5445 -75 -126 -59 -6 119 -134 -100 -108 -103 126 -197 -163 -135 51 -101 141 -145 -282 -95 -293 -131 262 -112 -67 123
5469 123 3 292 55 114 148 -10 204 38 81 1 106 270 103 -129 174 278 -23 45 155 -240 -9 219
5491 219 48 -184 -131 -237 20 -147 63 -251 -114 120 -192 -22 -38 47 -83 91 -78 -140 162 -158 134
5512 134 9 -97 177 150 -116 -193 -14 130 -208 138 -47 -248 34 -163 -220 -145 -251 -125 -30 -17 -62 -108 -133
5535 -133 198 205 101 -50 -301 -2 -264 -141 104 -207 -12 52 -19 148 67 36 -15 89 258 48 238 171 54
5558 54 198 193 59 -161 79 -120 30 -163 341 -3 180 -107 -18 72 -98 163 62 -77 211 -11 197 33
5580 33 -129 -120 106 -144 108 86 -98 36 85 -44 -229 -204 33 -75 -23 62 65 -89 120 -8 -252 -58 -52 53
5604 53 -22 -59 125 41 124 54 68 81 -151 -350 61 -179 -110 99 31 -72 246 -23 136 105 193 161 161 -81 136
5629A36j00j33L63j67J51k63k02K94k34Q3J22j28K68q0P4j86J94j78K4J89j77
5650E0R6j28m7K30j45m2j89R1L85l68n3P6J47k00J92k51L70l31J08J63k16K8M27
5673C93l00k63j2K2K42l92J28R1J91q9K63k69J83l62K80j00J65k21P8P5q4o3p
5696e1K91m52J68J08q1j61J22m8J39k9QK28k65J45j08j8J49j84L6K2J52Mj18J
5720E8J8Kk51Q7K51l07K75k32J01MJ14j66J72k01j19R6M3r5L04j45r6K21k18K6
5744e8k85J84J29Q3j11j80%K46M0o5j81J10J65m9J83k85l3j22L09j1Q4k68j42
5767b57N6K37j75L61k13j38M23k73K86l69J22j09N4J63j10k55M11L2j14Q0k33
5788b1J65q8j51K47j88j30L17k1L4n8j77M0r7L20j65l2O3J82m76J45K34l10J67
$$ plain form
5629 136 36 -97 266 99 250 -13 -215 79 -155 -72 50 -78 190 110 184 -2 192 14 38 227 50
5650 50 146 18 -29 201 56 14 -175 -84 301 -67 -120 -44 103 -97 95 -156 214 -117 -9 154 -62 -34 393
5673 393 93 -170 -182 -160 82 -310 -182 -91 100 11 274 5 188 -174 106 6 171 -50 28 103 19 -44 -51
5696 -51 240 -212 -44 64 -17 -178 -56 -104 35 6 14 242 -23 122 14 -4 145 -39 -3 19 171 175 57 58
5720 58 76 78 -173 -86 165 -142 133 -99 2 6 120 -46 126 -75 -194 -98 -55 -150 154 9 -87 134 -84 -58
5744 -58 -343 -159 -30 53 -58 -238 -238 8 48 -17 -198 -88 77 28 211 -74 -107 -229 80 69 153 -115 -257
5767 -257 -201 36 -139 222 9 -129 294 21 307 -62 60 -49 5 168 58 -197 214 246 132 212 -21
5788 -21 144 56 -95 152 -36 -166 151 130 164 106 -71 -31 -128 192 27 -5 58 240 -236 -91 143 -167 0
5811@N7LJ3l10K35j64j55N20k90J37j8L3o3R8k65O9J11l1J2r9R5r5P1J12j19j2
5837e5k70L22k84J34M8P4n8j31MR0J77j40J85k22J79J8n4j49R9j78L08o4J8J55
5861B06p8J33k96K2j8j65M00j12L3k42K96l28k6K43l48K52J8j04J84L1k06Qp2
5884a69J60L7m38K61Q1J82M7k57K01j70j44M84l12Qj90N3M6q4j05R1K27j00J14
5907B3j6rn4J36Q6r0j17K0Q2j34J09J9j05L6j4j34J64J87n9J72k04k04K8M6J4
5932a8J00J74l47K07K04l66K65l19oJ59o0q4K59j83L2K62k93m6J76k93K98j02
5954A9j50K58K2k50R4O6n8N7k44K43j25p9J7J41q0O4J39j43M5l34J27J00j14J50
5978c5J33n9n5j43J79r0P4J48l38J19M7j25J46j45L4K06p4j27J66M6j21q0r1K06
$$ plain form
5811 0 57 60 73 -237 -2 -166 -321 199 -91 46 28 61 -2 96 -169 -100 11 -20 -8 -107 -12 -107 -36 76 -43 -55
5837 -55 -325 -3 -287 -153 -105 -31 -89 -220 -216 -126 51 -89 96 -126 53 71 17 -132 -33 -211 97 33 51 206
5861 206 128 261 -35 -13 -31 -196 204 92 125 -117 179 -149 -175 68 -280 -28 -10 -114 70 101 -105 -97 -169
5884 -169 -9 28 -410 -149 -68 114 161 -96 105 -65 -209 275 -37 -29 -219 -166 -120 -204 -309 -218 9 -91 23
5907 23 7 -2 -56 80 166 76 -41 -21 61 -73 36 55 -50 -14 -28 -162 2 189 130 302 98 -106 -78 -32 -18
5932 -18 82 256 -91 116 320 -46 219 -100 -106 53 -7 -91 168 -15 17 279 -14 -60 116 -177 121 19
5954 19 -131 127 149 -101 -7 59 1 58 -186 57 -68 -147 -130 11 -69 -5 134 -9 36 -298 -171 -71 -185 -35
5978 -35 98 39 -16 -159 20 -70 4 152 -186 -67 -20 -145 1 -144 -110 96 22 -105 61 107 -14 -94 -185 21
6002B1r6o0K84j09l7j02QL02j54L8j27J81j96J95j81K16p0J64j36q4K0L4j33j8
6026d0J82j36J46k39K96l40K37j33R7j02k3k26R4oJ84k7n9j1J28j17J67k10R0
6049d8J83j86K0PJ66n3n0l2j25M20j03l55L70k13M6l46J30J91Q0P2m19M08n61
6072c98O69k19k9L7O5j51J53J2Q7j81j56J62l1P3k4j19o6L56j37j81L45l21J60
6095A06j15K21l31o6L18k06k16Q1J80N9O4n2l33M24k08J79j45J04o4p1K2j69L04
6118H6k34L5K3K82k04j74N0J30J05k2l58m8o0Q1K13k8O1O7K68n61L42k01N4K82
6142A89l70J68J69n2j66J05j9m3L7J07m6Lr2R7j45K25n7q5J8j08P6M0R1k85L68
6167B25k65J28k46J25N7J13j14K15k34k3K08j34j6l17J34K05J7jL2j85O8j20j2
$$ plain form
6002 21 -75 -135 149 40 3 -99 -91 211 57 95 -32 149 -47 148 -33 183 113 277 141 57 77 111 -22 -40
6026 -40 142 6 152 -87 209 -131 106 -27 70 -32 -55 -281 -187 -193 -9 -36 -95 -106 22 -95 72 -138 -48
6049 -48 135 -51 -31 -24 142 89 39 7 -118 302 199 -156 214 1 47 -299 -169 22 102 174 -245 163 -398
6072 -398 271 52 23 60 125 -26 127 139 226 45 -111 51 20 93 69 -50 -116 240 103 -78 267 -54 106
6095 106 -9 212 -119 -185 133 -73 -289 -208 -28 31 95 43 -290 134 -74 105 -40 64 0 -71 -49 -218 86
6118 86 -148 -113 -90 192 -12 -186 -136 -6 99 77 -281 -329 -389 -308 -95 -123 -62 5 273 -288 54 -147 -93 189
6142 189 -181 -13 156 104 -62 43 24 -19 18 125 79 82 -10 87 -58 167 110 25 43 -65 11 51 142 -143 225
6167 225 -40 88 -158 -33 24 137 23 238 4 -19 189 55 39 -278 -144 61 78 77 109 -76 -8 -128 -140
6190a40K20l49k3L55k5J67k20N2J35m63K27K58j05J72l67J65m35L63M6j81JL01
6212A54j34K9j39J63r2J60m9j40r5M1m8J92m6M2O6o4L3J93l28O9J64j4m6j60p8
6237a27q7K38k57L03m0m3k5J68m69K05J03K13k54n6J44n1j56J1J31L7J0J90k74
6260h6O9J10l09K55m6P9N7j31o1L1rn4J8J19N7J11j79k6j70R7O3%l2j2J32j01
6286a8L35m25R8J29l31L85j20J7J2r7P9R0j66o5R6J92j83J60l69J82J47k51L35
6309B32m96N06l19j63N55l62K27l4L6j51l6n7kJ04K40m84J22j8Q3p4J21k35K71
6332F6n9k7l6M6j10N4j09L67k83r9M95k70L3Jn0l00Q7J15K23j56R5j59J64P4k07
6357d5Qm9k45K00K09k55J67j7j16P6K7P6j95K40M1m4k04k52K93j1J67n3p7J75
$$ plain form
6190 -140 80 -269 -292 63 38 205 -15 37 172 -291 -64 194 89 261 -106 59 -376 -13 33 -148 -147 154
6212 154 20 49 -90 73 -19 141 92 -48 -143 -102 -150 42 -4 38 104 40 73 266 -62 7 171 157 111 -49 -127
6237 -127 -214 24 -233 70 30 -13 -38 130 -339 -134 -31 182 -72 -128 16 -35 -191 -180 -49 -12 -2 188 -86
6260 -86 -17 93 -216 39 -7 72 129 -2 -63 -32 -41 -95 -77 42 99 210 31 5 -165 -68 -5 -5 -37 -49 83 -18
6286 -18 317 -108 -10 119 -212 173 53 70 82 -15 64 154 -12 -77 19 211 28 188 -181 1 148 -103 232
6309 232 -264 242 -77 -240 315 -47 180 146 182 31 -5 -62 -64 40 280 -204 -82 -100 -17 -91 30 -205 66
6332 66 7 -20 -56 -10 -120 -66 -175 192 -91 -190 305 35 68 69 19 -281 -194 -79 144 -12 83 -76 88 162 -45
6357 -45 -37 -86 -331 -131 78 -177 -10 -27 -143 -67 -40 36 -159 81 122 78 -126 -378 -85 -96 71 18 -59 116
6381A16J9l4pn0L6m0J71k13O0j73K04q6M2J94k23JK2l5Q8N1m96N39o8m47J94J2
6407a23K26N2L7L8k20j64J96J24q1OJ81j73j53J18J02l03N7K74j41q2p3O5P9j91
6431a49L19l18J47kJ81k16K40j92L18l26J53k36L35j25j30L0j33J16J10j38O0
6452D4k5l85M28j4j18P6m6L04l10P7j1m1M2J31j27j41K62j64j23J78k46J68J72
6475A31j01j06j6J76j24r7J69j07L0o6J04j48O0M3JJ0L1k10J62r2O7J4j5p1K19
6500F4j94n6K36k5o0k5N9q0J08J17r6k6J15j15n5r9j38K96m5J72j12J1j84K92
6524A60j47j15J41O8n3k13J89k79L33J48j7j59K00n8j57n7O0J1J99j95j30O4J95
6547A88j79r2J80q3P2J70o6j02K2l49L7L46j31J42j34kj22k01K56M9J16j15N4
$$ plain form
6381 116 135 101 94 44 80 40 211 -2 58 -115 89 3 45 239 16 17 39 4 92 143 -353 186 118 -329 -135 -123
6407 -123 103 155 192 230 10 -154 42 166 85 91 272 99 -54 64 166 -137 -80 194 53 -29 -102 -37 42 -149
6431 -149 170 -148 -1 -3 178 -38 202 10 328 2 155 -81 254 129 -1 29 -104 12 122 -16 44
6452 44 19 -366 62 48 -70 6 -40 264 -46 31 20 -21 21 152 25 -116 146 -18 -141 37 -209 -41 131
6475 131 30 -76 -92 84 -40 -137 32 -75 -45 -111 -7 -155 -95 -52 -51 -41 -10 -220 -58 -150 -83 -69 -84 -155 64
6500 64 -130 -186 50 25 -35 -60 -1 -81 27 144 48 22 137 22 -33 -132 -270 26 -19 153 41 52 -132 160
6524 160 13 -102 39 107 54 -159 30 -249 84 232 215 56 256 198 41 -16 44 55 254 59 -71 -7 188
6547 188 9 -83 97 14 86 256 190 88 110 -239 -202 144 13 155 21 19 -103 -304 -48 1 117 2 56
6570E6P0j81O0l1j3j9QJ3r3l4K22j7j02J9K1om0j50J87J31j60J37N7l22K18J08
6596A39j49p0J8J62k89J40lL9j9jJ08M3J42O7k12j94K09j61N6M8m1M1j15K3R9
6621H0q2j5k91J77Q0K3L17k44j14j4K03k79K96j38J0q0j30RN35k69k68J12J03
6644B1j07qN4K3j94K11O2k15Q9j16J3J15O2kM4k83J51L56m05L06l29J48L06k59
6668D3m1K51k91l1J56l01K27j88j8L60J9j51M2r6Nk3L9m6K0J93j00m8J97J45l27
6693C6j36K38j00M1r8M2J08l73K16L0l6Q4K2NL8k48J56P5j10P9j05k02J35N3j50
6718b00N65k58o1j29j13J38J60L4n2m02J24K7O4K04j01j20N0J68l19K39L7l8J2
6741B9j20K23j8o1j8j00J03o2j04Q1K9J11j15J42Jj76j96O39l21l0M50o53R6j70
$$ plain form
6570 56 126 -55 5 -26 -39 -58 -50 -37 -130 -164 58 41 -61 -42 -21 -27 -67 -217 -30 101 -59 78 135 -187 31 139
6596 139 -10 -80 -62 100 -189 -49 -52 -13 -32 -33 75 118 260 327 115 -79 130 -31 25 73 32 73 -42 -19 80
6621 80 -2 -17 -308 -131 -51 -28 289 45 -69 -83 120 -159 137 -1 9 -71 -201 -192 343 74 -194 -82 21
6644 21 -86 -94 -40 -17 -211 0 62 -153 -64 -180 -167 -52 10 8 52 -231 -80 276 -129 177 -152 -4 302 43
6668 43 2 253 -38 -69 87 -214 13 -175 -193 167 186 35 77 -19 -14 -37 2 -44 -24 169 69 21 218 363 36
6693 36 -100 138 38 79 -19 23 131 -242 -26 4 -32 52 74 79 117 -131 25 100 -10 69 -36 -238 -103 -50 -200
6718 -200 365 107 46 -83 -196 -58 102 136 84 -318 -194 -167 -103 101 0 -120 -70 98 -221 18 55 17 29
6741 29 -91 132 114 53 35 -65 38 -24 -128 -47 -18 93 -22 120 121 -55 -251 388 67 37 487 -166 -70 -240
6765b40K47P0o6q1j80K69L7J93o0j56K4M9l12J14K4O6Ok12J72K3jN3Jj30J38j23
6791g5L42j64r9j2q7K83q0k1nJ35k39L8n6K02k48Q0l6j2K12k04j53N61m62J14
6815A4k05M71l13j03J38j88K28jj92N0O5J29K7J75j49o6R1l44L17k78L55k67L0
6838a6l0p5L63Ok03j0K12l09J2K7P6J62k75J38r5L8J55k4J42l83P7R9N6l0J30
6863B43l87Q2J58k32K87o6K8k59J06K01l40L81m07L88m75K80J5p3J41j67O5p7
6885a08L2j04K12K3qj77k0J93J45k54J02K3J20m1j11k57K17l0RR9J71k49J31q3
6909C5m3N3K15l3j26m5j31j06J82O5k23K86N5k02j84J33j28J73j27J19L34j24
6931A78k02J45J01l72K47L1j06n6N0l9O6j54K80l68m3J92Q3m0J15k6j99m8J79
$$ plain form
6765 -240 7 77 11 -70 -250 19 56 249 189 33 57 106 -206 -92 -68 -2 4 -208 -36 -13 -14 39 40 -90 48 -75
6791 -75 267 103 4 -8 -95 188 108 87 82 217 -22 16 -40 162 -86 -6 -42 -54 158 -46 -199 362 -100 14
6815 14 -191 280 -33 -136 2 -186 42 41 -151 -101 -36 93 120 295 146 80 171 -173 144 -134 221 -46 -16
6838 -16 -46 -121 242 248 45 35 247 -62 -50 -23 53 215 -60 78 -17 21 176 152 294 -89 -12 87 143 113 243
6863 243 -144 -62 96 -136 151 85 113 -146 -40 161 -179 202 -205 183 -292 -12 3 -70 71 -96 -31 -108
6885 -108 -76 -180 32 55 47 -130 -150 43 188 -66 36 59 179 138 27 -230 -13 -43 -34 65 236 -13 118 35
6909 35 -8 45 260 227 101 56 -75 -181 1 66 -157 129 184 -18 -202 -69 -197 -24 -151 -32 302 178
6931 178 -24 121 222 -150 97 128 22 -34 16 -23 43 -111 169 -199 -242 -50 33 -7 108 82 -117 -165 14
6954A4j06J26J5m0J95k70j52K96n4k8K50k94J50j65J40J85j69p3j16L6K07m9P0
6977A68l9j17J3Oj07p4J85j0J69j12j64R6J15j9j19J9J15j7k69L70J2l23P1K98
7001B67r8r5q9M3j79K34k4j06O0O2k93L17k25L7P5j35j87L27J53j38m3O2j42N7
7025f0K7j08J02K4q9j48L90k2k2K5q1k51K08M4j26l8L1J20qJ3l9j3J6J02j25J7
7051a1J52k76N6J77J20k56o5j31K95j21NJ09o2J7J96j70J32l53K53J05k05r6M
7074a25q5L42J12k83L4k4K25k17r1P8K07M4l03J9j27L55J51n73M12k42P2j3NK7
7098@j96J44M33l83J43n8j97o7M12j55P2j99J72j26J49j67Q5ll4J77j92J93k72
7121f9J55r9j56K94m8m8j65K62P0j75O6j88O0j21K68r2M0K4m0R1O2k15N5K5l06
$$ plain form
6954 14 -92 34 49 9 204 -66 -218 78 24 -4 246 -48 102 -63 77 262 93 20 -96 -60 147 98 168
6977 168 129 12 25 31 -76 -150 35 25 194 82 -82 14 129 110 -9 10 125 108 -161 209 221 -102 -31 267
7001 267 169 74 -15 28 -151 83 59 -47 13 75 -218 99 -126 -89 -14 -149 -336 -9 144 6 -37 25 -117 -60
7025 -60 -33 -141 -39 -15 -104 -252 138 116 94 119 38 -213 -5 39 -87 -125 -94 26 18 31 -8 -21 -5 97 -28 -11
7051 -11 141 -135 -79 98 218 -38 -103 -234 61 -60 -55 54 -8 9 205 35 167 -186 67 172 -33 -129 -125
7074 -125 -210 132 244 -39 -5 -29 196 -21 -112 -34 173 217 -86 -67 -194 161 312 -261 151 -91 -19 -32 -27 0
7098 0 -196 -52 381 -2 141 83 -114 -181 231 76 148 -51 121 -5 144 -23 62 59 25 202 10 203 -69
7121 -69 86 -13 -169 125 77 29 -136 126 196 21 87 -101 -41 -162 106 14 54 78 38 129 191 -24 31 56 -250
7146b50L65k96n1K11k1O5J36k22m7J87j12O3k2P9j07j3J36k41Q5n2J80P6k51P0
7170c2k01J84K03k32K64k98Q6J43j30pr7K01L8r6k05n2M5RJ47l7Q7J32k08K97
7194B41l19J91k4j23kJ9L1J17l93K06j11K01K80j20j28j69qJ26M0k8M3J3n4K66
7218B95q8J10p6k65R8k66l0j30L71k8J51J1k6o0r5J7p8LK40j46Q0j84J18Qq7r8
7244a55J90r4j10R3l8J97R3j64K12k05J27j6j32Q9k6k58L52q4LK3r9J2j23J7O6
7269c0j71J90R2N3j47k7N3n9o6O1Q4R3k3j77J73k6J92k82J86k53J17k4K51j84
7293G6k48L23j56R5q1k93L82j49R1j40Q9K38j89M9q9J14k32j5K38j66J54r7p9
7316h5J24k7k83K56p3J14n0rK33k69J05k1P7j47L8L5J7k47L64j13o8j61K91k9
$$ plain form
7146 -250 115 -181 -232 -21 -42 23 159 -63 -110 77 -35 28 6 85 -22 -35 101 -140 -55 -107 73 149 -102 -32
7170 -32 -233 -49 154 -78 186 -112 -26 117 -13 -20 -117 84 122 26 -179 -231 -186 -177 -30 -67 20 152 -56 241
7194 241 -78 113 89 -34 -36 -17 14 131 -262 -56 -167 34 314 194 66 -103 -111 15 55 27 70 83 29 295
7218 295 207 317 241 -24 74 -192 -222 -352 19 -9 142 153 127 67 -28 -11 -89 -86 154 8 88 -96 22 30 -57 -155
7244 -155 35 -59 -169 -76 -114 83 176 12 224 19 146 130 -2 87 61 -197 155 71 74 97 -2 10 -113 -96 -30
7269 -30 -201 -11 81 134 -13 -40 13 -46 -112 -51 33 126 103 -74 99 73 265 -17 169 -84 33 9 260 76
7293 76 -172 151 -5 90 9 -284 98 -51 40 -100 -11 227 38 87 -2 112 -120 -135 103 -63 91 -6 -85
7316 -85 39 12 -271 -15 -88 26 -24 -33 200 -69 36 15 92 -55 -17 18 35 -212 152 39 -29 -190 101 72
7340G2rJ49j73q6P2J29j10j92J57m8N0o1K7J51q5j01L61l24P8p5J02p0J12j66
7364d0J12k6Q3k96J59q4N4K78m07K25Kj71J09K1J52n79K96J16j12Q3k44K01O9
7387AJ55k62K13J4k79pp3K5J34J86Jm03K75r1r8J36l02N24qj31j96J35m5M8j94
7412b42M02J52m76R3k1R2M6J25k07J7K18k71j28J52K9q4L5R5J00l63J39J70O6
7435A39N1j81M8L04l48O3k49K61j99L27N2l16Q6J20o4j48J70o5j33J01m0l8J2
7458d7J62Q9l48K48k25j4lL19k65J56k64L66k94J91j74J43j80M11m37n2J79P7
7480C8RM2o9M1j38l8J61R5j60KK73n91L17nL92m60K03J07k72J38j87j54K86K66
7504B96M3m51L35j14J91q26J178m82L1K57m72j42N00m64l39P37L04j034M44J012
$$ plain form
7340 72 63 212 39 -47 25 154 44 -148 9 -39 11 -50 -23 128 43 -58 303 -21 57 -18 84 14 126 -40
7364 -40 72 46 129 -167 -8 -92 -38 240 -167 58 60 -111 -2 19 171 -408 -112 4 -108 -25 -269 -68 1
7387 1 156 -106 107 121 -158 -165 -238 -213 -79 107 108 -295 -20 -111 -209 -73 -375 149 141 10 -186 -51 -96 -48 -242
7412 -242 160 312 -164 -71 -92 0 46 171 -36 -19 199 -72 -200 -48 -19 -103 -68 27 127 -236 -97 73 139
7435 139 190 9 57 361 13 76 -173 88 -111 216 268 -48 38 158 94 -54 116 51 -82 19 -21 -59 -47
7458 -47 115 204 -144 104 -121 -135 -138 181 -84 72 -192 174 -120 71 -103 40 -140 271 -166 -218 -39 38
7480 38 47 89 20 61 -77 -115 46 141 -19 -17 256 -335 -18 -23 369 -91 112 219 -53 85 -102 -256 30 296
7504 296 339 -112 223 109 300 -526 652 170 201 458 -14 -156 344 -120 -459 278 582 -452 -8 1004
7524A004n29r17q6J8P43k01K13n2m0K12n70N88o92O3j38L07l2r4M23k18O0j40
7546g8k5J20Q4j75M3N0m0J8L5n7r8K06R8j46k11m9K79k28J30J81j44K34l17J83
7570I3j66j0J7M7K11l1j89J87j14J18k10N5L5J5pr3l6K4kr7N1J50J56k00k83J40
7596a39M16j57j00J2N7M0Jm5L0Lk23J07K88m68L04j09nM3J10k81J52J18jl73K85
7621F5%J80m94j34M42m2J21j86J05J21k34K40J00l15J67k41K57K4m02J89j30K06
7643C9K8K9K14j87j13J43m3J73j80J05j39k71J48K88j53N5j50j72J64J84k26p2
7665a36J23j18R8J39l7m9L98n93K56m5R3j02J15j55J08N3k7k62p7Q8N9KJ2J56
7689I9j91j00L25n6r3o9j36m7M47jl41N4k24L74kq4N3j41M7L4n5J27L7J2j6k1
$$ plain form
7524 1004 475 -442 -528 -510 233 32 245 193 153 365 -205 383 -309 -246 -384 -77 -109 -203 220 2 62 -78
7546 -78 -103 17 101 -74 -31 19 -21 -3 32 -25 -123 83 181 35 -176 -225 54 -174 -44 137 -7 227 -90 93
7570 93 -73 -83 -66 -19 192 161 -28 159 45 163 -47 8 43 58 51 -42 -78 -54 -56 -153 -102 48 204 4 -279 -139
7596 -139 277 120 20 32 89 129 130 85 115 118 -105 2 290 -178 126 17 12 55 165 -116 36 154 153 -220 65
7621 65 65 245 -249 -383 59 17 138 -48 57 178 -56 184 284 -31 136 -105 152 176 -226 -37 -167 39
7643 39 67 96 310 123 10 153 110 283 103 208 69 -202 -54 234 81 136 -14 -186 -22 162 -64 -136
7665 -136 -13 -131 -33 106 69 20 418 -175 81 36 129 27 142 -13 95 148 121 -141 -218 -130 -71 -69 -57 99
7689 99 -92 -192 133 77 -16 -85 -221 -268 179 178 -163 -109 -333 41 39 -45 8 -133 -86 -52 -107 20 57 69 53 32
7715C2k8n0R3k01J61N9r7k06L88j63O6L0L6m33J72o2P7J6K62O1k11L06n66L06
7739D8j76k4p5M24k11Q6j23J58j54J53J75l43L37l02m1R6J04l27K31j92m8L3P8
7762i3rL13j89k28K99j52o0L94l33p9o4L8L16j75J60k20K71n65M64J51m33J1j03
7785b86J99J65r4j36L07k49r4L97j49k06K34J5j16R7l57l01P06j59L89l62j85
7806a85r0K24j40O21l40j8K64r55Q84j15M06m27n29M16J8P7k73l77R31j64j42
7827H6r6j92J33j82L07J1k56l6Q08K08q56L58J95l86N0K92J56j22q43R32k24K29
7849E72l65l58K58j81M77o35L47o1J41Q37p09l19K33o47J47L23k02L08j67o48
7869f49N76m2N31l57l61j28L83J10O6K61L74k80o67J099q11K1k53J90L8L91k92
$$ plain form
7715 32 4 -46 47 -154 7 66 -31 -237 151 -12 54 84 120 -313 -141 -203 -126 -110 152 213 2 308 -258 48
7739 48 -128 -152 -227 197 -14 72 -51 107 -47 106 281 -62 275 -27 -68 28 132 -195 36 -156 -204 -171 -93
7762 -93 -102 211 22 -206 93 -59 -119 275 -58 -137 -201 -163 153 -22 138 -82 189 -376 88 239 -194 -183 -286
7785 -286 -87 78 -16 -152 155 -94 -188 209 60 -146 88 103 -13 84 -273 -574 132 -27 362 0 -185
7806 -185 -275 -51 -191 430 90 72 336 -619 265 150 556 129 -400 16 34 111 -162 -539 392 228 86
7827 86 -10 -202 -69 -251 56 67 -189 -225 583 791 -65 293 488 102 152 444 600 478 -365 567 343 572
7849 572 207 -151 107 -74 403 -232 115 54 195 1032 323 4 237 -410 -263 60 -142 166 -1 -649
7869 -649 -73 -115 416 59 -302 -430 -47 63 129 390 764 484 -183 916 105 126 -127 63 101 492 200
7890B00n23O76m92K73K83p07N59J09n26K86n2j74R8r0K8r2LJ13Q3Q9l0k65J43
7913hJ18j43j03K05M7k19J69M9k04P7nJ8J63k08K83n34L24o9O4j72K79k11p8n1
7937b09Q5J7J31j03J02j37M6J9J53r1p7j27R7J21qj9J38j70j1J81J53j52k29o4
7961a54J57j17L4n7o8M35k19Q3K09j97rL7k85K31q9J84q9k19L14j42k7j43R9R4
7985F2K1k25jM13l00J56j08r4R7mk39O8K39J54j99p0n8RJ93J29j74k02o0K06j72
8010a59J4K29Pk0K3j30j45K52q9k49J90j14L2R1J29j47j02J42r3K30p6k4J89k14
8034c4k2K4j06K91j90L5n0k28M25k18k15L45l14K70J04q0j21J49j08K24r0PL5
8057A33k07j17N19l55o0J94k60R5l4M0J55Q0j24j74l2J87k49M42%r1m37J77JK48
$$ plain form
7890 200 -323 353 -139 134 417 -290 269 378 -148 138 86 -88 10 -80 -52 -144 -141 -28 55 144 114 -151 -8
7913 -8 110 -33 -136 69 116 -103 66 115 -89 -12 -17 1 164 -44 239 -295 29 -40 24 -148 131 -80 -158 -209
7937 -209 -124 -107 24 -79 23 -114 -68 -49 104 13 -64 -191 -94 27 19 0 138 -32 -43 138 291 139 -90 -154
7961 -154 3 -114 -80 -137 -205 230 11 94 303 106 97 134 -151 80 -9 175 86 -133 181 39 12 -131 -32 62
7985 62 83 -142 -143 270 -30 126 18 -76 21 17 -222 -154 85 239 40 -30 -88 -79 114 243 69 -133 -193 13 -159
8010 -159 -145 84 91 71 94 -36 -181 71 -18 -267 -77 -191 -159 -68 61 -86 -188 -46 -139 91 15 -9 180 -34
8034 -34 -56 -32 -138 153 -37 -2 -52 -280 145 -73 -288 57 -257 13 117 37 -84 65 -43 181 91 98 133
8057 133 -74 -191 328 -27 -87 107 -153 -58 -92 -52 103 183 59 -115 -147 40 -209 233 233 142 -295 -118 -117 131
8081A31r0k39k7K57l98L13n9J02l9N8pl3K1J43m5j64L10k97n3K01L2p2j32j03
8105a90L4K46k89R8MNJ56q3J12j54j26J32L17j02m2j6%j29Q5n8j01J37j98M07
8129B45l82K70j93K8R3m02M66l00K69j17R1k59L89k12J86k77o7O3J62r8K08j79
8151a6j35K35l33k68N25j81J11M0L5o5M4J23k83J19o8L92j45k80K11O9p9M8J52
8174B51j92j26j13J27J34j18j83K04J10l07M03k43j27K45p1m6M6
$$ plain form
8081 131 41 -198 -225 32 -366 -53 -112 -10 -49 9 2 -31 -10 133 88 -76 234 -63 -116 85 117 45 -87 -190
8105 -190 -156 90 -199 -101 -97 -92 64 -19 93 -61 -187 -55 262 160 118 102 102 -27 58 0 -101 36 -162 245
8129 245 -137 133 -60 -32 61 -341 125 -175 94 -23 68 -191 198 -14 172 -105 -172 -109 53 -45 163 -16
8151 -16 -151 84 -249 -517 8 -173 -62 -22 13 -52 -8 115 -168 -49 -117 275 130 -150 61 130 51 99 251
8174 251 59 -67 -180 -53 81 -37 -220 -16 94 -213 190 -53 -180 65 -6 -52 -6
8191f
$$ Imaginary data points
##PAGE= N=2
##DATA TABLE= (X++(I..I)), XYDATA
0@%%%%%%%%%%%%qJ6j6J6k4L2m0M8n6P2q4R6j16J36j56J80k08K40k77L18l62M13
34B20m69N30n97O72p52Q40r38J044j162J289j426J577j743J926k125K342k579
51a351K839l129L449l803M199m645N151n731O405p193Q133r277J0703j2544J5022
66H228j8555K4075l4370Q8746k28859J67498Q7240k89919K92605p5438j06528
77h5277J78935j06327k0492Q6435p3698K7448j7571J3988k043j5077M9454o0926
89b5151l761M0446o2870P0094j4332k7820R3446p9169j3808O2738r3568L9666
101a4089K9411o9383N9624J1839l7664L9974l668k1009N518p573j0201J4881R314
114F974j0447J2211j0401k2236K3953m833Q75J8722j3697K0739j100k7017J0349
$$ plain form
0 0 0 0 0 0 0 0 0 0 0 0 0 0 -8 8 -8 8 -16 16 -24 24 -32 40 -44 52 -64 72 -84 96 -112 128 -149 169 -193 220
34 220 -249 281 -316 356 -396 444 -494 550 -612 677 -749 828 -915 1011 -1114 1228 -1351
51 -1351 1488 -1641 1808 -1995 2204 -2441 2710 -3021 3384 -3809 4324 -4953 5750 -6794 8228
66 8228 -10327 13748 -20622 68124 -160735 6763 94003 -195916 96689 21251 -85277
77 -85277 93658 -12669 -33161 53274 -20424 7024 -10547 3441 1398 -13679 35775 -25151
89 -25151 -28912 11534 -51336 18758 4426 -23394 70052 -9117 -22925 39813 -53755 -14089
101 -14089 15322 -54061 5563 17402 -20262 19712 16044 -4965 553 -7020 -17221 -2340 6974
114 6974 -3473 8738 -1663 -23899 54 -4779 -3904 14818 1121 21860 20760 -6257 4092
127D092k2792k561K0881m260K4406q335q177K0572l7096R918K5398l7522J8464
140B988O916j8756K6401j7641j5288J9100o785P611K214K52R312j9161M137j242
154E8j9358K7401r154k0399L4440r070r616K2831k4544m57K4085k8513k39K0401
168G866k0363Q939J5807k5903R099J2701k6148J4099J6654j8618J2322J443k3580
181a5682J2195J340j5213J5974R011o768O325k371j4098O204P891j0127O698Q323
195I702j6667P833Q537k0273J3139L100j9050K6187j383j6698K7125k1393j5184
208a5025K5982k3950J0835K5331l1514J5122M903k7539K6516n192j3828K4313
220A5954j6547m757J3701j0072M082k642j763j62n360J7097j0690j849K4915l1142
$$ plain form
127 4092 -18700 -21261 -380 -4640 19766 11431 3254 23826 -13270 -3352 22046 -15476 2988
140 2988 9904 -8852 17549 -92 -15380 3720 -3065 4546 6760 7012 16324 -2837 1300 58
154 58 -19300 8101 -1053 -21452 12988 3918 -5698 17133 -7411 -7868 16217 -12296 -12535 7866
168 7866 -12497 -3558 12249 -13654 -4555 8146 -18002 -3903 12751 -5867 6455 7898 -15682
181 -15682 -3487 -2147 -17360 -1386 7625 857 7182 4811 -9287 -3083 4808 -5319 1379 9702
195 9702 -6965 868 9405 -10868 2271 5371 -13679 12508 11125 -5573 21552 159 -15025
208 -15025 10957 -12993 -2158 23173 -8341 6781 11684 -15855 10661 5469 -8359 15954
220 15954 -593 -5350 8351 -1721 2361 -281 -2044 -2206 -7566 9531 -1159 -3008 21907 -9235
234i235K110J8366l6901K7213J1168l7104L6371n007k5280L3789k3444o373K7133
247A2806k6638J3071J3481k5133J8428q297j8781K2947r708K15J9102j0479M281
260E295j17j1431K612n563P163J084o659J8868j1934p178K1025k2034N697J9346
274A6174k5263J3604O248k0444J7734q694p835J5140j6508J1227R071j3913K0194
287A6735q777j2246J6642k0280o89J5294j4689J0015N519r329Q565l752j664K227
301C571n903M548n21k386L580m365k084j046o72K517J114Q701j413l174N808j4421
317f146k426Q738j2778P705Q421j0758Q777K472p748N891p25m696K468J103m754
332d456n13P247q753O98J0784j4435R071J1602j8036J5019O99k0368J9479r740
$$ plain form
234 -9235 -7125 11241 -25660 1553 12721 -24383 11988 6981 -18299 15490 -7954 -14327 12806
247 12806 -13832 -761 12720 -12413 6015 -2282 -21063 1884 -7824 -7609 11493 1014 5295
260 5295 5178 -6253 -3641 -9204 -2041 -957 -7616 11252 -682 -7860 13165 -8869 -3172 16174
274 16174 -9089 4515 10763 -9681 8053 -641 -8476 6664 -9844 1383 10454 -3459 16735
287 16735 7958 -4288 12354 -7926 -8615 6679 -8010 2005 7524 -1805 6760 3008 1344 3571
301 3571 -2332 2216 1695 -691 2889 -1476 -3560 -4606 -5278 -2761 -1647 7054 5641 2467 8275 -6146
317 -6146 -8572 166 -12612 -4907 3514 -7244 1533 4005 -3743 2148 1423 -3273 -805 298 -4456
332 -4456 -4969 2278 -6475 -5777 5007 -9428 -357 11245 -6791 8228 8927 -11441 8038 -1702
346a702j2929K2641j3194p49J7218j2456N346M509q226L601n470K660q48m321
360c920J0607j0045K556R034j6961J5023L169j6882K0316q582j1488J7537j6414
373f050r9J2769j5182R591N596j1624R314R28o610L363k52m474j755L758l593
388d320o67P549o224K283N431q046M832J985p184L222n56l286J066L059j771k422
404e049Q018o070r23J2003j3188N259P078j8329J3896j817j3991K0886r777l551
418e555J5656j5599Q337L669j1767J2601j0165q24R145j2396J2489k619p489J5812
432A1295j6275N309J1183k0019J6520k507j4287K0944j5318j241J5566j9216J0391
445B345M330j2337J4815q712j576Q879j4180Q433j248q680J4737q762Q5J0022
$$ plain form
346 -1702 -14631 8010 -5184 -5933 11285 -1171 4175 8684 458 4059 -1411 1249 401 -3920
360 -3920 6687 -3358 -802 8232 -8729 6294 9463 -7419 12897 4315 -7173 10364 -6050
373 -6050 -6149 6620 -8562 1029 6625 -4999 4315 5243 -1367 1996 1744 -2730 -4485 -727 -4320
388 -4320 -4987 2562 -3662 -1379 4052 -3994 838 2823 -4361 -1139 -1695 -4981 -3915 -856 -2627 -5049
404 -5049 2969 -3101 -4024 7979 -5209 50 7128 -11201 2695 878 -13113 7773 -2004 -5555
418 -5555 10101 -5498 2839 6508 -5259 7342 -2823 -3647 5498 -6898 5591 2972 -4517 11295
432 11295 -4980 329 11512 -8507 8013 5506 -8781 12163 -3155 -4396 11170 -8046 2345
445 2345 6675 -5662 9153 441 -1135 7744 -6436 1997 749 -7931 6806 -1956 -1871 8151
459H151j4648P109K656j0485J0833n250k307P929q741N328J035q757P113k761
473b795k72N445m611K790j143k414L798n876L645K57m301R819n391j876Q056j0952
489e821M216N095q109O506k034j879N733m927L667k837l117O212o133O289K015
504D876q449J1397p915k956J1598j5829P968M903j2974J6912o878p085J4269j5269
518e432M939Q026j3349J1118l699l754R263j1860N390J079r295J3319n929m66
532f50P246j1542P859k130o922J0354r870J283P886q627Q990k514p340R524o195
547b648q21O047n587K39K602R3j909K79J345n437N940J241l748Q349p639j448
563c102P208j0311N089J471o773J0009l017J400L436q841N555k456j083O459q678
$$ plain form
459 8151 -6497 612 3268 -7217 3616 -1634 -3941 3988 -4753 575 1610 -7147 -34 -2795
473 -2795 -3067 2378 -2233 557 -586 -3000 798 -5078 -1433 -1176 -5477 4342 -1049 -2925 5131 -5821
489 -5821 -1605 3490 -4619 1887 -147 -2026 3707 -1220 2447 -390 -3507 2705 -3428 2861 4876
504 4876 -3573 7824 -91 -3047 8551 -7278 690 5593 -7381 9531 2653 -4432 9837 -5432
518 -5432 -493 7533 -5816 5302 1603 -2151 7112 -4748 642 1721 -7574 5745 -184 -650
532 -650 6596 -4946 2913 783 -6139 4215 -5655 -4372 3514 -5113 3877 1363 -5977 3547 -2648
547 -2648 -3469 2578 -3009 -2770 -168 -75 -1984 -1705 -360 -5797 143 1384 -2364 5985 -1654 -3102
563 -3102 4106 -6205 -1116 355 -6418 3591 574 1974 5410 -3431 2124 -332 -1415 5044 -3634
578c634P983k844o880J4791j2247j14J2463j6377J2257K785j4280J5323j0536
591a310l859J4510j5789O644N277j1417J3153n036l509Q465j0881M196J789p116
605d883P157l665K10L461m232M933m956j858O641o238M978J418p636N396l503
620b777k909P118m324k46N608m033L41L542m718j256L492l527J721M343o434L102
636i57K444o320P456j289n279O917m886O56L806n721M368j202k153N474m503K590
652A401O03l619N910m533P35L592p945N939K32n312Q199n053k13N798p630L251
668A355J168m765M794j193j193Q04j198Q16j797L555p46l019N404o073Q13N119
684C844r115O500O24p180R767n911k742Q325r237M775L072p573Q309n269k397
$$ plain form
578 -3634 4349 1505 -5375 9416 -2831 -2945 9518 -6859 5398 8183 -6097 9226 -1310
591 -1310 -5169 9341 -6448 196 5473 -5944 7209 2173 -1336 7129 -3752 444 2233 -4883
605 -4883 2274 -1391 -1181 2280 -1952 2981 -1975 -3833 2808 -3430 1548 2966 -4670 726 -2777
620 -2777 -5686 1432 -2892 -3138 2470 -1563 -1222 2320 -2398 -3654 -162 -3689 -1968 2375 -4059 -957
636 -957 1487 -4833 2623 1334 -3945 2972 -1914 -1258 2548 -3173 1195 -7 -2160 3314 -1189 1401
652 1401 2004 -1615 4295 -238 497 4089 -3856 2083 2315 -2997 5202 149 -64 5734 -1896 1355
668 1355 2523 -2242 2552 1359 166 970 -228 588 -1209 2346 1600 -1419 3985 -2088 -1275 3844
684 3844 -5271 1229 1853 -5327 4440 -1471 -4213 4112 -5125 -350 2722 -4851 3458 -1811 -4208
699d208O953q173N076K010o250P777n220l60M870q203O858p87m530R199p811J119
715a680N619j0144Q832q81o810J0846q211L99P956j0722Q348J49r288J1428p124
730a283k046J0501j0131L912M810r368O145m76m057N293k588O64R48j616J765
745B473m110J798J324m638O103r18l026N453m914j600M122m902K478K311l993
760b039K639j77k960K302J94k415K958j45k977L732j998l440N695l588k124O820
776B477n455N31N530o347L252J817n431L370j041j994K753n40J728p53J63Q60
792I20l312L316n43k467N241m097M93L843o924M491P69n956Q830l060k440P614
808F718q072Q84M269p708N446J545n228N482k120j725L521k450O18O99j593O33
$$ plain form
699 -4208 2745 -5428 -352 1658 -4592 3185 -2035 -2395 2475 -5728 1130 343 -4187 5012 -2799 -1680
715 -1680 3939 -6205 2627 1746 -5064 5782 -2429 -2030 5926 -4796 3552 3701 -5587 5841 -1283
730 -1283 -3329 7172 -2959 953 5763 -3605 2540 2064 -1993 3300 712 1376 2324 708 2473
745 2473 -1637 161 1485 -3153 2950 2032 -994 4459 -455 -2055 2067 -2835 -357 1954 -2039
760 -2039 600 423 -2537 -235 -41 -2456 502 357 -2620 1112 -886 -4326 1369 -2219 -4343 2477
776 2477 -2978 -2447 3083 -3264 -12 1805 -3626 -256 -1297 -3291 -538 -1078 650 -103 60 920
792 920 -2392 924 381 -2086 3155 -942 -449 3394 -3530 961 1730 -4226 4604 1544 -896 6718
808 6718 -1354 -470 3799 -3909 1537 3082 -2146 3336 1216 -509 3012 562 1180 1879 286 919
824I19l92O68j279J44J351k866K535J37l133M366k683n81L962n423J696J822n839
841d596N034l30k435M101k621L81K57j985J907k019J272J112k913M761l789j283
857c146N535o868M203L692q220P869k398n728Q641o564J008O048q021N599K15
872A865n381O822m075L66L323n422M595j875k076N790n785L297J627n657O529
887C943l986j680O515p596L912L127q042P359k425n263Q881n554k65O011o856
902a919J582K839n504L602K58k566K989r66j251J563j466o4J190j089j07J171
918B62j701K18R29j055M68N00j75r5J30k58n01Q35l6j546K216j154j310L425k768
937a616P0L259l492K241J023l536K771j085j536L904k155L96J211k809K309L43
$$ plain form
824 919 527 1195 -84 60 1411 -1455 1080 1217 -1916 2450 -233 -814 3148 -2275 -579 1243 -4596
841 -4596 438 108 -2327 1774 -847 -466 -209 -2194 -287 -2306 -1034 78 -2835 1926 -1863 -3146
857 -3146 2389 -4479 -276 3416 -4804 3065 667 -5061 3580 -2984 -1976 4072 -3949 1650 1865
872 1865 -3516 3306 -769 -403 2920 -2502 2093 218 -1858 3932 -1853 1444 3071 -2586 3943
887 3943 -43 -1723 4792 -2804 1108 4235 -3807 3552 1127 -4136 4745 -809 -1074 4937 -1919
902 -1919 -337 2502 -3002 600 858 -1708 1281 315 -936 627 -839 -903 287 -802 -909 262
918 262 -1439 -1221 -292 -1347 -879 -379 -554 -649 -519 -777 -1278 -443 -479 -2025 191 -963 -2273 1152 -1616
937 -1616 -1546 1713 -1779 462 1485 -2051 720 -365 -1901 2003 -152 244 1455 -1354 955 1298
953A298j551K500j594o52J466j215K49N68p72J87L81L91l11N74m71j085J285m74
971G74O7O64j067j2q74K99J128q52J457q45j126J075j361L70J259j721L33m92
989i24j23J138j042J594p75k411L173j482q16L182l015j172K719j955K15L147
1005A453k959o76L116k300N68K951l962O45J520k972K734P16k481K438j514M39
1021b84J825k312J380l64q88J600o91N30p89p83K676k936J662J921m079M934j539
1038A863m287O058m215j012O001o030J905K380m399L591k50k271K397j933m51
1053f53J492o55K60n61j77M24q04N69L84j300J108J25r97J565j626j433K788k241
1071a732M47L240m505J627K299n121M749l93m608O070l651j061N883o180K374
$$ plain form
953 1298 -253 2247 653 1 1467 252 501 1069 297 484 865 1256 945 1519 1048 -37 1248 774
971 774 841 1505 438 426 -448 -149 979 127 1584 739 -387 688 -673 -303 956 -765 -432 -924
989 -924 -1047 91 -951 643 -132 -2543 630 -852 -1668 1514 -1501 -2673 46 -1909 -1694 1453
1005 1453 -1506 -2182 934 -1366 -798 2153 -1809 -1164 356 -2616 118 834 -1647 791 -723 -284
1021 -284 1541 -771 609 245 -643 957 266 796 7 -776 1900 -1036 626 2547 -1532 3402 1863
1038 1863 -2424 3634 -581 -1593 4408 -1622 283 2663 -1736 1855 1605 -666 1731 -202 -653
1053 -653 839 184 444 -117 -294 130 -674 -105 279 -1021 87 212 -785 780 -846 -2279 509 -1732
1071 -1732 -1285 1955 -2550 -923 1376 -3745 1004 611 -3997 2073 -1578 -2639 3244 -2936 -562
1086e62J589m691N662j893j500L477m810L237O08l378N164l922L44K846n105N373
1102B439q49l826O615o220J584M106o565N737j526m037O317n135J598L823n753
1117a692M692k117k690M895m225K540J67l500M143k622P60K458m449K481j484
1132f43j437L632k640J237R02l138L596k569k71K808m252L366q60k510M661m016
1148b134R74J575m242M905j960j459N203m942J426J727m360M488j966j482L612
1163A365l232K024M78j817K463k509O53K139k718K818n48k939K963k060Q42J353
1179A275k167K770r96j461L244k590RJ762k384Q60J92L37j47j78O64q15L80O98
1197A453k211K612k06k201K624j621J9K96j740Q04k59J24J893k130J081k7k335
$$ plain form
1086 -562 1027 -3664 1998 105 -1395 2082 -2728 509 1117 -2261 2903 -1019 -675 2171 -2934 2439
1102 2439 1590 -2236 4379 -1841 -257 3849 -2716 3021 1495 -2542 3775 -1360 238 4061 -1692
1117 -1692 3000 883 -1807 3088 -1137 1403 1570 -1930 2213 -409 351 2809 -1640 841 -643
1132 -643 -2080 1552 -1088 149 1051 -2087 1509 -1060 -1331 1477 -2775 591 -269 -2779 1882 -2134
1148 -2134 -1160 415 -3827 1078 -882 -2341 2862 -2080 -654 1073 -3287 1201 -765 -2247 1365
1163 1365 -1867 157 635 -1182 1281 -1228 -575 1564 -1154 1664 1116 -1823 1140 -920 -78 1275
1179 1275 -892 1878 882 -579 2665 75 84 1846 -538 322 514 851 704 526 1190 375 755 1453
1197 1453 -758 1854 1648 -553 2071 450 469 765 -975 -171 -430 -306 1587 -543 538 511 -1824
1214a824J884j040J98J009o99Q97j268l00K401l452J816J008k959L843j425k429
1230b340L449k681n30J699k157L318Jj943L053l035R76J536l964M150j604k367
1246b439M603l366O14K875l198R22J313j471J673j157j043K012k825J380J282
1261A175j838K473o79m34J093p43K22k32j458J467j842K91J950j079k47J261k539
1278a159K849m64k003J543o22j364K026j867K82R23j961J803J76j100J728j125
1294c35q6Q39j395M51n69n61J064k81Q2Q08o17R54p83j12Q46j889J476l77j264
1313a749J137n3k04J474j413O38J227j316J023l43n99L69n90O83k50j7M67n01
1331a7R10K84l51N96j148j19O09j446J491m50p57K452j434j09J755k659J458R75
$$ plain form
1214 -1824 60 -980 -782 227 -472 425 -843 -1143 1258 -2194 -378 630 -2329 1514 89 -2340
1230 -2340 1109 -1572 -2102 -403 -2560 758 759 -1184 1869 -1166 -190 1346 -2618 1532 -72 -2439
1246 -2439 2164 -1202 -588 2287 -911 11 1324 -147 1526 369 -674 1338 -1487 -107 1175
1261 1175 -663 1810 1131 697 1790 1047 1269 1037 -421 1046 -796 -505 1445 366 119 1380 -1159
1278 -1159 1690 1226 -777 766 144 -1220 806 -1061 -779 144 -1817 -14 162 -938 790 -335
1294 -335 -421 418 -977 -526 -1095 -1656 -592 -873 -791 17 -600 354 -429 -541 305 -1584 -108 -485 -1749
1313 -1749 -612 -665 -869 605 -808 -170 1057 -259 764 421 -178 191 -399 284 34 17 484 -17
1331 -17 893 1177 826 1422 274 155 764 -682 809 359 -398 2054 620 511 2266 -393 1065 2040
1349B040k678J531l39j154K166j210l11M04j199J808j19k2o50p96oK97q01L69
1367f70p30N82J339j003J496j21j681J273j506r98K497k214K58K581k772J190
1383d79Q65j834J952q29j139K030j246Q20n33j159J135j86n11J886l95m2N52k81
1401F06J31o96O9Qo00R65j48k43J662p75n67R29q54j00J596n28j422L92P4q34
1421c35P93k93j34J273j055J194j241l58J672j932q43K463k296R34L74j380K136
1438I72n44q11J102j454L86Q8j022J260j984J809R20l436L031j208j532L810k423
1455a036O50J792l211K329l91k966M197l429J441K216k344K306p79j297R72o14
1471a64M59R80k598K841j735j16J116j606J900p21n95J837j019O51J58j019N00
$$ plain form
1349 2040 -638 893 554 -600 1566 356 45 449 -750 1058 939 917 267 -529 -535 -238 -1039 -670
1367 -670 -1400 -818 521 -482 1014 893 -788 485 -1021 -2019 478 -1736 -1478 1103 -1669 -479
1383 -479 386 -1448 504 -325 -1464 566 -680 140 -393 -1552 -417 -603 -1114 772 377 335 887 606
1401 606 737 41 110 118 -482 483 335 92 1754 979 412 1341 487 387 1983 1455 33 425 499 -335
1421 -335 458 165 31 1304 249 1443 202 -156 1516 -416 -1259 1204 -1092 -158 216 -1164 972
1438 972 428 -383 719 -735 -349 -261 -1283 -23 -2007 -198 722 -2714 317 -891 -2423 1387 -1036
1455 -1036 -386 1406 -1805 524 133 -2833 1364 -2065 -624 1592 -752 1554 775 -522 450 -164
1471 -164 295 1275 -1323 1518 -217 -333 783 -823 1077 356 -239 1598 579 1230 1388 369 869
1488H69p61o47J315j475J086J494j418J084m74j1J03j182O38n43j220K166j318
1505b94n2J727j969P30Q71j715J577m75j026J049j385N66n93l98J240o31J43J759
1523A124j792L02M67j296M07J91j571K469r91k76J392j319P22m6j400J940k24
1540I9j28K26j300J138m46j082J696j047Q36J680j674K156j004k159J990k207
1556a226M98K383l210K524M06j944L111j657j335K180k112J216K12r62P1p03O41
1573I3r5n96J954r61R43P36k672J517j085j342J751j421O88Q75r38J660p00k60
1591A47K03j153O58p40P60J46j795K136j644r77L436k549J035K071l229K182j72
1608E15k672K171j432k37J413r54J844l82m5J180k235J113j38j260K074j902R49
$$ plain form
1488 869 108 -539 776 -699 387 1881 463 1547 1073 1062 1165 -17 621 78 -1142 1024 -294
1505 -294 -346 1381 -588 142 1013 -702 875 400 -626 423 -962 -396 -989 -1387 -147 -778 -635 1124
1523 1124 -668 -366 101 -1195 -788 -597 -2168 301 -690 -966 426 -893 -171 -217 -1617 323 99
1540 99 -29 197 -1103 35 -411 -1493 203 -844 -8 1672 -2 2154 1150 -1009 981 -1226
1556 -1226 -728 1655 -1555 969 1375 -569 2542 885 -450 1730 -382 834 1046 84 155 -548 93
1573 93 -2 -598 1356 395 1338 2074 -598 919 -166 -1508 243 -1178 -490 385 -553 1107 407 147
1591 147 350 -803 -145 -885 -125 21 -1774 362 -1282 -2259 1177 -1372 -337 1734 -1495 687 515
1608 515 -2157 14 -1418 -1655 -242 -1196 648 266 221 1401 -834 279 141 -1119 955 -947 2
1625BJ001k548K367j49j319L080k425J68K107k802J195j9j615J502q70R13O24
1642A212q10J374r39j73P22j866P88q7j143J487j161N73P18q72J082n25m37Q47
1660G90j015k47K44o25K32m21R68j2m84J004o46q70J625j259L0J042j597L16M58
1679d67j066P11M49n95J098J71k06L32j118R0k3p32J018k6j14P78k18o0K37k44
1699A5N6n0K35K97n58O33L97j743J131j86j226K659o15n66J522j988M50l7j197
1718g71J097L1O3Q57j060Q97j92j469J274j095L35J058j308J520o67j479J459
1735E50j787K49J763j993J905L77j785J472j344o94J242j492J180L12n07J218
1751F66j472L13K20j143J408o43K45J577j774M39n8j349Q40n17M40J531o32P21
$$ plain form
1625 2 1003 -1545 822 673 -646 2434 9 177 2284 -518 677 658 -957 545 -325 588 1212
1642 1212 402 1776 837 664 1386 -480 308 221 -922 565 -596 -23 695 -177 905 380 -57 790
1660 790 -225 -472 -228 -853 -621 -1042 -74 -86 -570 434 -212 -1082 543 -716 -686 356 -1241 -925 -467
1679 -467 -1533 -822 -373 -968 130 301 95 427 -691 -601 -624 -1356 -338 -364 -478 300 82 22 259 15
1699 15 71 21 256 553 -5 628 1025 -718 413 227 -999 1660 1045 479 2001 13 463 426 -771
1718 -771 326 357 420 1277 217 1114 922 -547 727 -368 -33 1025 -283 1237 570 -909 550
1735 550 -1237 -988 775 -1218 687 1064 -721 751 -593 -1287 -45 -1537 -357 -45 -552 666
1751 666 -806 -493 -273 -1416 -8 -651 -406 1171 -603 -164 -222 -1571 -731 -1248 -808 723 91 812
1769H12j21p37K04j180N02N6J52J097o26l44J470j615O97L6q09J748j065L65Q21
1788A463j754M24k90q37J558k0K52Q46j009Q21q29j102Q43j290O14M20p42J967
1806A335j031n73J314j500K01Q91j311J116n33p06P45j176M81K87k45J023k48
1823G0N82j74j082J49k66o57O06n89P32O38k74O74l86j56J48j76j31K7J40n25
1843f50n51Q56j60j29J352o32O25L86j206R35n22j062R86q76K38J128n93M73M85
1862A083n37M53o12J31K54p73L39o92J10R78j051R07Q86j251R69k37j083R15j064
1881b75o78J610j642P18P38j321J338l44k41Q64r86L31q8j170J071r26r2P33q49
1900a209J330L45j041J425j069m99Q00j623O54P27j185J290k15l45Q29l02j83
$$ plain form
1769 812 691 -46 158 -1022 -520 -464 -312 785 159 -185 1285 -330 367 403 -406 1342 277 642 1463
1788 1463 -291 133 -157 -994 564 544 796 1642 633 1454 625 -477 366 -924 -310 110 -632 1335
1806 1335 304 -269 1045 -455 -254 637 -674 442 -91 -797 -52 -1228 -747 -460 -705 318 70
1823 70 652 478 -604 -455 -721 -1378 -772 -1361 -629 9 -265 409 23 -133 15 -161 -292 -265 -125 -650
1843 -650 -1201 -345 -505 -634 718 86 711 1097 -109 826 304 -758 228 -648 -410 718 125 598 1083
1862 1083 546 999 387 518 772 -1 338 -354 -244 734 -317 590 1476 225 1194 957 -126 789 -275
1881 -275 -953 657 -985 -267 471 -850 488 144 -97 767 -219 112 24 -1146 -75 -1001 -1093 -360 -1209
1900 -1209 121 466 -575 850 -219 -718 82 -1541 -887 -160 -1345 -55 -270 -615 214 -88 -271
1917b71J24R0K97m54O94m22p90J091q98j14J476q23O78P01r17m2m68l57J89K06
1937a0K12L21J51M19n49L69n36m14P28r68P61P37j327R95n82j272J534r43K32
1956a42J357r67K0L47r61O8k09j01R4j16P84k61K39J27r05K77n9p16R56j02k70
1977e40J359j041l99N26j008M14R10p79P66K45j236Q46l31p00Q54l98M12O31k51
1996B80J54m30k40J70m58R76l39L68P05q88J26N17j682O87M68o14J321l85k86
2015D50O57p17j61j96k4L16j75K77K11m17J74o06L52K7l51O48k74r7M88q82L01
2036Ak74o68P08l14N31M01m75O21j070J75J20j068J032j50o98J415r88L19R08
2055E26j608J193k90p80J661j383r4R63j523J111k96l72J627j055N43O94j198
$$ plain form
1917 -271 -147 -57 240 -214 480 58 -732 359 -539 -653 823 0 678 1379 462 420 -48 -405 -216 -10
1937 -10 202 523 674 1093 544 913 377 -37 691 -277 484 1221 -106 889 307 -965 569 -374 -142
1956 -142 1215 248 268 615 -346 -278 -487 -588 -494 -610 174 -87 152 279 -626 -349 -408 -1124 -168 -270 -540
1977 -540 819 -222 -621 -95 -1103 -689 221 -558 208 453 -783 63 -268 -968 -114 -512 -100 531 280
1996 280 434 4 -236 -66 -524 452 113 481 1186 298 424 941 -741 -54 414 -200 1121 736 450
2015 450 1107 390 229 33 9 325 150 427 638 221 395 -211 141 168 -183 465 191 94 582 -300 1
2036 1 -273 -941 -233 -547 -16 385 -90 531 -539 -364 -244 -1312 -280 -430 -1128 287 -701 -382 526
2055 526 -1082 111 -179 -959 702 -681 -775 188 -1335 -224 -520 -892 735 -320 223 917 -281
2072b81P44q16o03J154r91N63J173j136J401n12n53Q31j064K47L46q71R28m60
2090A00k27P13m07N23l28o0N97j86j10k94n12N43p84j42P32k31M37L84m98L01
2110E51m39j43K2l10k55J2J70J88L9N08m94l4M72p01J36K41q94L77K10o79Q13
2131b10j8o39R04j91o7N66j96k28K02m48J96k7l73M29N4J56N9JJ94R1m21M90r36
2154d12K94K30m97J088k55l54P12o34j32R94j289Q99J98j034J019p22o21R35q86
2173d67P01N68o72J018p73l24L14p38L38j20j63R38p81j16P59q52M34j86q08J124
2193A94n12j45O72o24J60j84m68M48k91L56L19K85k57l98j6j46k81O40l91M67
2213a72L39j54P8j53n47M50l72N76R0P3M05o89J98j3p97Q79j54j17J204j126L62
$$ plain form
2072 -281 463 -353 -956 198 -793 -230 943 -193 1208 696 143 974 -90 157 503 -368 560 100
2090 100 -127 586 179 702 374 314 911 725 615 321 -191 352 -432 -574 158 -73 364 748 250 551
2110 551 112 -31 -9 -319 -574 -562 -392 -204 -165 343 -151 -185 287 -414 -278 -37 -931 -554 -344 -1023 -210
2131 -210 -228 -867 37 -154 -221 345 149 -79 123 -325 -129 -156 -529 -100 -46 110 169 170 364 455 34 524 -412
2154 -412 -118 112 -385 703 448 94 806 172 40 1034 -255 644 842 -192 827 105 -516 419 -467
2173 -467 234 802 130 1148 375 51 365 -373 -35 -155 -318 620 -161 -277 482 -370 64 -122 -930 194
2193 194 -318 -463 209 -415 -255 -439 -907 -459 -750 -394 -75 210 -47 -445 -461 -607 -888 -248 -639 -172
2213 -172 167 13 91 -62 -609 -159 -531 45 135 208 613 -76 122 109 -688 191 37 -80 1124 -2 360
2234C60M85j267P81l10o03J599q05K02Q95j499N71j18p33R72m45M00M00r32Q67
2253H20n55q70R59j110Q13O42j042J105j99j035R89j064j6P42p82O69L69q52P55
2272C38p33k37K97k30N02j43q2L62n51L71o48J81L21j55M57K34o20M93k17n25
2292e85J7J20o8J58O26N4k00K05k01n00P91p50L13O72n33m0L77o40M45k94J61
2313A28O38m68L34R4k30m9j16m11K10l35J68O01l96L14P6m99K92j98j26M74r78
2334d77M97Nq54O71K92p84R62j82j57L44p86L4K31n48N43l98K65K00o90Q94k10
2355a48n31J045p81j6O19j061P09o8q52J513m79m60J359q18M0K01p05K62J18k33
2375b86L60p2j99L45p7O4J40J78o3o6K16l01m4J62m56o8O62k03J02O12n50j14
$$ plain form
2234 360 845 -422 359 49 -554 1045 240 442 1337 -162 409 291 -442 530 85 485 885 -47 820
2253 820 265 -605 354 -756 57 699 -343 762 563 -472 517 -547 -563 179 -603 66 435 -417 338
2272 338 -395 -632 -335 -565 -63 -206 -288 74 -477 -106 -754 -573 -252 -407 50 284 -336 157 -60 -585
2292 -585 -568 -448 -516 -358 268 322 122 327 126 -374 417 -333 -20 652 119 79 456 -184 261 -33 128
2313 128 766 298 632 726 496 447 331 -80 130 -205 -37 564 168 482 558 59 351 153 27 501 -477
2334 -477 20 25 -829 -158 134 -650 312 130 -27 317 -469 -435 -204 -752 -209 -607 -342 -142 -832 62 -148
2355 -148 -679 366 -415 -431 188 -873 -164 -232 -1084 429 -50 -510 849 31 71 272 -433 -171 -53 -286
2375 -286 74 2 -197 148 71 135 275 453 390 324 540 239 195 357 -99 -167 495 292 394 1006 456 342
2397C42K94m94m66N97l90L11K66m75K86L36q08O03l01l58O00n25k05K18k93K36
2417b26k54L09L75o35R52m63n24R08q46l44O28q49M27N04q34J106K9j002J016
2436B77p02l57Q54q69R98k35j13K73l07j40J87j45Q63m47O7M39l66k26j67l34
2456d50P99j12o64J069p8p10N72m20k82Q73k65k43L99k08l30N77m08k99M25O7
2476C12r3M19l05j29O20r31J26J57l71L95J88p19O33k21j4N4n47K3K45K02n65
2497e21L2J105r54k99N96r20P06P05j455J260L14j807J668r32m14J317j018O38
2515B1O4m07N60n02J51L41o48L98k17J17Q49p08J08M17p33O82p8o15Q92p17o0
2536h5O48m86N51o9q92J002n5l10K58J14m06n45L50L92l82o8J21K77m75k68J19
$$ plain form
2397 342 636 142 -324 273 -117 194 460 -15 271 607 -201 402 101 -257 343 -182 -387 -169 -462 -226
2417 -226 -480 -171 204 -431 521 58 -466 442 -404 -748 -120 -969 -542 -38 -872 234 263 -739 277
2436 277 -425 -782 72 -797 201 -34 -147 126 -181 -321 -134 -279 584 137 204 643 277 51 -116 -450
2456 -450 349 237 -427 642 564 -146 426 6 -276 597 332 89 488 280 -50 527 119 -180 245 312
2476 312 219 638 333 204 824 -107 19 176 -195 200 388 -331 302 81 67 121 -426 -403 -158 44 -521
2497 -521 -489 616 -338 -637 -41 -961 -255 450 -1005 255 569 -1238 430 -502 -916 401 -617 21
2515 21 85 -322 238 -264 -113 228 -420 -22 -239 -122 727 19 127 544 -189 493 415 -200 692 -25 -85
2536 -85 563 77 628 559 -333 669 614 304 562 676 270 -275 75 467 85 17 138 415 -60 -328 -209
2557b09M76K0l51L52l56l60L11k5j69K76l24l00O11p17N09N76q72P08j87o58P49
2578F0p0n49O76m98J54J83n00J68R7k35N42m01L49K15o32N22k52L7N23o31K27
2599a5K77l57N03k12p61R88m19l64P60m09K1N75p16O38r5k99K74K20n34L15j70
2620B20l8J6o5L33j66j03L79k54K62k28o88Q95m18q43J022n61K1L53p63P90k2
2641A42n44M46k99j31L84n96J28J41K04j6j06J4K65k20K99o15K94L66m05M14n26
2662c61k2L56O4l37J63R3N9J08j53j94K32J22m65L20N52n19L92J41p37Q31o84
2683c9l5N15n02K27M0l44J003j038L45N13r77P71m00p4R29p71J8L74j090R27j10
2704B82q65R69l19J50M24j047Q1O30p49K82N5j66O14n90L38m13n06P34n90L24
$$ plain form
2557 -209 267 287 -64 288 -68 -428 -117 -142 -311 -35 -359 -659 -48 -765 -256 320 -552 156 -31 -689 60
2578 60 -10 -559 117 -381 -227 -44 -544 -376 -279 -514 28 -373 -24 191 -441 81 -171 -134 389 -242 -15
2599 -15 262 -95 408 196 -565 423 4 -360 400 -9 12 587 -129 509 414 115 389 609 75 390 220
2620 220 182 198 133 466 300 197 576 322 584 356 -332 563 145 -698 324 -237 -216 137 -626 164 142
2641 142 -402 44 -255 -386 -2 -598 -470 -329 -125 -141 -247 -233 32 -188 111 -504 -210 156 -249 165 -361
2662 -361 -383 -27 37 -300 -137 -44 15 123 -30 -224 8 130 -335 -15 537 18 410 551 -186 645 -39
2683 -39 -74 441 -61 166 206 -138 865 -173 172 685 -292 479 79 5 934 163 181 555 -535 392 282
2704 282 -583 386 67 217 641 -406 -325 305 -444 -162 -107 -273 341 -249 89 -324 -830 -96 -686 -362
2724c62M55o74M44k15l86Q00l14k24M12J92n82N90k36l64J76j65K54K93k31K34
2744I7M17j042O15j7n33L06P9J73P4l8K37k72K97j88l71N47K94p68P80n1o77M62
2766D21k36l60J121j051O08j29o23J085r66o1L29j68k6L85o44M18R6k21L38k68
2786D8l57M47l6M4k40j90K15k04j18P15n43l5L10m32K65q2l29K84j52K9L96o83
2808f48L67O27j032O49m7n04M72j97n5N99n36R0j98L25K9J51R4N36o18j90n0o8
2830b04N49k91m5L47k28p0K35m76J92K22J63l61M13l04L61k19k72k9J15K1k5M30
2852E24p27L52m1K89K9n60O6o26Q74J94j008L94KJ86N16r59p2J068p13j70N00
2873A18o43L87k73l24O99m93%P21l05R6k04P7k19q4N50N27j177O04L53j096P61
$$ plain form
2724 -362 93 -581 -137 -352 -738 62 -252 -476 -64 128 -454 136 -100 -464 -288 -453 -199 94 -137 97
2744 97 514 -528 87 70 -463 -157 -78 95 169 131 368 96 393 205 -166 381 675 -93 687 636 -41 421
2766 421 185 -175 946 -105 503 374 -249 836 -130 -191 138 -30 -56 329 -315 103 199 -22 316 48
2786 48 -309 138 102 146 -94 -284 -69 -273 -391 324 -219 -254 56 -376 -111 -193 -522 -238 -390 -361 35 -648
2808 -648 -281 346 -686 -37 -84 -588 -116 -313 -368 231 -305 -215 -413 -88 -59 92 186 722 104 -86 -136 -204
2830 -204 345 54 9 356 128 58 293 -183 9 231 394 33 446 142 503 284 12 -17 98 119 94 524
2852 524 -203 149 108 397 426 -134 -68 -694 180 374 -634 -240 -238 -52 464 -495 -567 501 -212 -382 118
2873 118 -525 -138 -411 -735 -36 -529 -529 192 -113 -17 -221 -144 -363 -447 103 630 -547 57 410 -686 75
2894G5l07J76Q37j258N86K76r47R10k97l00M58n47P07M74q32n4k96P70K53m81
2914B03L10P6l97M63l8k63L98o44M74m8m6M42p56K04l90j20J55L02l09OO46p23
2936e5j52O84j217N01J04k82J58L91j171J748k92r27M54k87O1L76p53O48n9j16
2956a86o9n14R96o16M05l11M78p89M96k41l05J283j029O19M68q34L20m17m94J367
2976F27j004K41L86n40P20r76O42O35o25j37O97q90Q84n38l13O32p09N10k53m22
2996d33P15J71n11K05l82J54k13R42Ok19n13M82L22j052n81M03O18p43N83q79
3016i25N52L33J43l51J87o05P11J27m98N50Q2l31j390J211r80Q27O65R2k62J91
3036C29q79O11j17m19P39M19q73k20Q11q52P3R47m74K50n04O67n51P9l94L21p6
$$ plain form
2894 75 -232 -56 781 -477 109 385 -562 348 51 -249 209 -338 369 843 11 -43 -339 431 684 203
2914 203 513 589 192 655 617 354 752 108 582 534 488 930 174 378 -12 -132 23 325 16 22 668 -55
2936 -55 -207 477 -740 -239 -135 -417 -259 132 -1039 709 417 -510 -56 -343 -282 94 -659 -11 -70 -186
2956 -186 -255 -769 227 -389 16 -295 183 -606 -110 -351 -656 627 -402 217 685 -149 171 -246 -740 627
2976 627 -377 -136 250 -290 430 -546 96 731 106 -31 666 -224 660 122 -191 441 -268 242 -11 -433
2996 -433 282 453 -58 147 -235 -81 -294 648 654 435 -78 404 726 -326 -907 -504 114 -629 -46 -925
3016 -925 -373 -40 103 -248 -61 -666 45 172 -326 224 306 -25 -1415 -204 -1184 -357 308 400 138 329
3036 329 -550 61 -56 -475 264 683 -190 -410 401 -451 -378 569 95 345 -159 508 -43 36 -358 -37 -113
3057a13J09O7K54P12q11J44j148j10J536j303J066l64k34J484o64o12K53k9l79
3076a42L35r70J837o47k60n58N24j72L05J18o32R72j206P25m18j446J495j43M80
3095A97M19o59PP47j145m2K89K99K20nj373J028p0K24o46K52J87K3N5M02J51n41
3117A9k75M17m81N10o76q2M99n63P21N14o7L60J96m59p34q35P52J085j272P07
3137C36l09L26M68j07j182P15P3k60j1j10N33n34k04L54j88M55n12J041j143n79
3157h38J441p92j93J110p98k78R48o01L33m0p29R65q19q21Q12J3k22J275j275
3176e09N14l80J89R05q63qR51j105O32j75n32J46N0K46q2l88N06l58L0P60L19
3197H48o79L78n80l72M83o64O68O43k16m76J0O09p2r8q2k68M38j49M99n43p67
$$ plain form
3057 -113 -4 63 317 1029 218 362 -786 -896 640 -663 403 39 -195 1289 625 13 266 237 -142
3076 -142 193 -777 1060 413 153 -405 119 -53 252 370 -262 710 -496 229 -189 -1635 -140 -283 197
3095 197 616 -43 -36 711 -434 -476 -187 112 332 327 -1046 -18 -88 136 -510 -258 -71 -48 7 409 560 19
3117 19 -256 161 -320 190 -486 -568 -69 -632 89 603 536 896 1092 633 -101 -936 -184 901 -371 336
3137 336 27 353 821 714 -468 247 320 60 49 -61 472 -62 -266 88 -100 355 -157 884 -259 -838
3157 -838 603 -189 -382 728 -70 -348 600 -1 332 292 -437 528 -291 -1112 -300 -287 -509 766 -509
3176 -509 5 -375 -186 719 -144 -152 799 -306 326 151 -381 -235 -185 61 -21 -409 97 -261 -231 529 848
3197 848 169 547 -33 -405 78 -586 82 725 509 33 43 652 580 482 400 132 570 421 920 377 -390
3218c90Q41l64j2J36M64n54k53j98L62l42N09m87N55P29q46j12J56o59R33k65
3238B03K55m20P19q7l91p19P97l22K97K01n00m92M1R0m24M06j17R73k40k5Q5k84
3260D6Qk34L72o00N20l49J54l25N63j74l03J21Q97q82k5N36j3m90j68M31m04N87
3282B68l33M59o95P06K98o66K71j1n93P45o38Q14K2q34J275p02n60N29k44j59
3302d8k49N14m53J128m30K84l93n97P32o61R37j298K76m64R07L2k91L84j149O65
3322a74QK88n84L87r9l57m55Q24j07N1O33n21j43N82l20K60j102J39R41L7k12
3343G6J91m03KJ60j81K29k35ML48m41o16J778r1l52k33m4J73q25M56O47l31j73
3365A39J74m30M39J42l47J29j088J266j18n20J252o83n77p25J638j95n33R47j343
$$ plain form
3218 -390 451 87 75 211 675 121 -132 -330 32 -310 199 -288 267 996 150 38 194 -465 468 203
3238 203 458 38 757 670 279 -440 357 35 332 533 33 -459 -418 -328 -752 -346 -463 510 270 245 330 46
3260 46 54 -180 192 -408 112 -237 -83 -408 155 -19 -322 -201 696 -186 -211 325 312 -178 -346 85 -319 268
3282 268 -65 394 -301 405 703 37 308 297 -296 449 -189 625 647 -187 1088 386 -174 355 111 -48
3302 -48 -297 217 -236 892 462 746 353 -244 488 -173 764 -534 -258 -722 185 217 -74 310 -839 -174
3322 -174 -166 122 -462 -75 -174 -531 -986 -162 -269 -218 415 -106 -249 333 13 273 -829 -690 251 288 76
3343 76 267 -136 -134 26 -155 74 -161 -157 191 -250 -866 912 821 469 236 192 365 -460 -4 643 312 139
3365 139 313 -117 322 464 117 246 -842 424 306 -214 1038 355 -222 -947 691 496 -37 910 -433
3384d33P04j81O39p56j49L93j201J484o21R6J88n52P31j131J397k80N09r18j27
3403b08p7q71M75L56K44L10k12l03J68q3j00Q12n57L0l18K36m0R5J93J24k13P70
3425H31o13L59l96m39Q68Nl46m31K81j84p6O16n74M73l25k29J76M30l44n9k5K15
3447B13k50k25k44P61p12P52j8q77P94l37JJ64KJ35p99M91K3n29J249n80l12K78
3469b0l92K53J65l86M10K19o86P45R1q48N71L9o77N83m16k80P18o86J77K36p5
3490b59J28J13J1J02l24J35K53q7K1k47L72l33J83O5L74l24j61K12m01O76m75
3511C4l46L00r1J21M00k58K84k92k05R7J14j6M6j05m3L15k49n2j69k36L96k7N7
3534G5J28l21O59m56n20N83k54N5L14m74J4K57l40J11R9K7J66n98M81o5l41K33
$$ plain form
3384 -433 271 90 729 -27 -176 217 -984 500 -121 -25 163 -389 342 -789 608 328 837 -81 -208
3403 -208 -285 -1156 -681 -325 -81 229 17 -286 -118 -201 -301 511 -46 -16 -334 -98 -138 -43 150 274 61 831
3425 831 218 577 181 -258 610 615 269 -162 119 -65 -141 475 -99 374 49 -180 -4 426 82 23 -2 213
3447 213 -37 -262 -506 255 -457 295 277 -600 194 -143 -142 22 24 159 -640 -149 -126 -655 594 14 -298 -20
3469 -20 -412 -159 6 -380 30 249 -437 308 399 -449 122 161 -516 67 -349 -629 89 -597 -420 -184 -259
3490 -259 -131 -18 -7 95 -229 -94 159 72 93 -154 218 -115 68 133 507 183 22 234 -167 509 34
3511 34 -312 -12 -103 18 418 160 444 152 -53 44 158 142 188 83 40 355 106 54 -115 -351 45 18 75
3534 75 203 -118 541 85 -435 148 -106 -51 263 -211 -197 60 -280 -169 -70 -43 123 -475 6 -59 -400 -167
3556a67r5p8K93j94QM35l69L77m37J28J80p1j12ML95l01K6j27L3J10JJ26q5m3
3580C7n8k1L33j81k10R8J35o7L55j55j02Q4j24j02J84j12j23J09j38M58k37o2
3602A01K60k20m24M86j52J60rk82P6k4j60K27k08J78J51l94N51m43J78K71o14
3623b91J57j7k17L10j79J34L85k08q6P1m63L55j91P6qO5K78l34qJ13K24l47L75
3646A94k71K8j43L39O7j12p0k05L71k22N26k43p5j69K58m25J54J6K23K9q6n6M16
3669E44m70J94j45j22J31m4K9%k21L95k44j7j11K28j0J32k59L18k38l93L01k53
3691b55J5J53j64J25J81J07J64l08l59J31R7k14L94m70M62m5r8M9k43J35J19N5
3713C1j87M47o31K39j41O9L25k29R5L13k05p4J46m12L53k57n0L08pK7%j75J81
$$ plain form
3556 -167 -262 -340 -47 -241 -233 202 -167 210 -227 -99 81 10 -102 -98 297 -4 22 -105 -72 38 39 165 80 37
3580 37 -21 -42 291 110 -100 -2 133 66 421 266 164 248 124 22 206 94 -29 80 -58 400 163 101
3602 101 361 141 -283 203 51 211 202 -80 -4 -28 -188 39 -169 9 160 -234 317 -126 52 323 -291
3623 -291 -134 -151 -368 -58 -237 -103 282 74 -12 59 -404 -49 -240 -164 -172 -107 171 -163 -171 -58 166 -181 194
3646 194 -77 -49 -192 147 214 102 32 -173 198 -24 502 259 184 15 273 -152 2 18 241 270 184 128 544
3669 544 74 268 123 1 132 88 117 117 -104 291 47 30 -81 147 137 269 10 328 90 -303 -2 -255
3691 -255 -240 -87 -251 -126 55 162 326 18 -341 -210 -113 -327 67 -403 59 14 -84 -35 -278 -143 -24 31
3713 31 -156 291 -340 -101 -242 -173 152 -77 18 331 126 52 198 -214 139 -118 -168 140 133 160 160 -15 166
3736A66k72m9J6P8J30M83m95M4r4k29K8J04K15m5j0KQ6P1k72K13k60NK42j32J1
3761C6k60J45k4J16m6L7j86L7j01P7oJ4l70J95J56J75m4k72M18l39j1J70l06J22
3785b67O0J8L41n1j23J76l44Q4J0J26k68J08j52N57j04k03O1L0k52P5K88J06l9
3808B37N3O0j23J54k04j53K66j09J24O3k65J84j67M4j09K8L3L09j6l91J25r8l00
3831b55K15N2O8L0k5J11J31l17L5k06J64k11o0K41J04l62K19MK94k20Q1Pk41m45
3855e86L93kj61L63k79J32J04m01K95O6N4K64l13j64K42j07k07L21j14J95J91
3876B86j34O7p8k64J22J56j36Qj52K12J11r2K2p1J26k4q3J74j54K5J43m55J98
3899GK76m60L55J7j08J90k63k55M16j01m15K17J6J55J82j03M2j92r7K32j80N1
$$ plain form
3736 166 -106 -155 -139 -61 69 552 57 101 7 -222 -194 -90 125 80 70 72 158 229 -43 170 -90 -85 157 25 36
3761 36 -224 -79 -103 13 -33 4 -182 -145 -246 -169 -175 -161 -531 -336 -180 -5 -49 -321 97 -242 -253 -83 -389 -267
3785 -267 -207 -189 152 101 -22 154 -190 -106 -96 30 -238 -130 -282 275 171 -32 29 59 -193 -118 170 276 237
3808 237 290 350 227 381 177 24 290 181 305 368 103 287 120 164 55 83 116 425 409 18 143 45 -255
3831 -255 -40 12 80 110 85 196 327 10 45 -161 3 -208 -268 -27 77 -285 -66 -62 232 12 93 100 -141 -586
3855 -586 -193 -195 -356 7 -272 -140 -36 -437 -142 -76 -22 242 -71 -235 7 -100 -307 14 -100 95 286
3876 286 152 219 141 -123 -1 155 19 27 -125 87 198 106 128 57 183 159 76 250 96 121 264 -191 7
3899 7 283 -177 178 195 87 277 14 -241 175 74 -341 -124 -108 47 229 126 168 -24 -121 111 -69 -18
3921a8J06l34L48l98M9O5j93K67q3M7O8r0o5J65j57j0k2K13n8J21j35m4LJ60j33
3946a28P1k28K50J88j21K4p0J23K4k06k2L33p4M1M4Q8l4k46J13L8n02L95l8L2
3970I5j15M65l71R0k26J20J99l16J87mj31K13q1j68j5oK09k74J62j59j78K36L44
3993B76n43K73J23k91M38p05L56L5n13K19K20k72K64M1q4L3rj9K9J72j71K22k64
4016a70J04l4J56k84J12J28k17K34R1j35J65j14Nj90J76K05j64J02N5k9j8r1k49
4039a62J80J40J18k55M0R1l1j8Q3l4J81l20L1J40j47R8J45j34J7l7j76K73r1%
4063A32nj46M6J04r9J74m89K66r3L2j53K33k10J20L81l65O7k31L41l17J1O9l0
4086a62K62j34j96R8K8j14K11m6R3j12O7L7k44Q9M5R1j39K47j02R4J33r0j26Q3
$$ plain form
3921 -18 88 -246 102 -296 -247 -182 -375 -108 -191 -144 -76 -166 -231 -66 -223 -233 -255 -42 -100 21 -114 -158 -155 5 -128
3946 -128 -57 -285 -35 153 32 56 -14 109 133 -73 -95 238 164 205 249 337 303 57 170 208 -294 101 63 95
3970 95 -20 445 74 164 -62 58 257 -59 128 124 -7 206 125 -43 -58 -64 145 -129 33 -126 -304 -68 276
3993 276 -267 6 129 -162 276 -429 -73 -38 -551 -332 -112 -384 -120 -79 -163 -130 -139 -158 -129 43 -128 94 -170
4016 -170 -66 -100 56 -228 -116 12 -205 29 120 -15 150 36 41 -149 27 232 68 170 225 196 178 87 -162
4039 -162 18 158 276 21 61 152 121 103 186 152 333 13 44 184 37 135 280 146 163 126 -50 223 132 132
4063 132 127 -19 27 131 32 206 -283 -17 -110 -78 -231 2 -208 -88 293 -72 -5 -236 105 -212 -201 -132 -162
4086 -162 100 -34 -230 -132 -104 -218 -7 -53 40 -72 -5 32 -212 -123 -78 13 -126 121 19 113 246 156 30 113
4110A13J95N4k5n19J63j1J8J38P2m3M9Q9j86K97m92L22j59j98K38J6j12O9j6p6
4134dN6m70M09j38P1R5k55K22lp8J84j44l61K74K42J7k92N9J16k40M4o0j12M39
4158G1k16Q1N0j67Jk8P1M8L21j48l4Q2l33L44J66l83J33J31J99j12k59J6J56P9
4182B69k18p0M0J76j11J53J63k59NJ09l63M0J34N3j3J01l53J36J32j36K05j69
4204B4M0o8Q9J79k57j34J08K2Q6j39K49j01O0l12J36k87J75p6j66L52J6k13K05
4227a2N6r9j20J16R6j17K03q3J65j78r6l6Q8J8j69LL23j9k11pp6J39K5l1K66m22
4253a78K35mL7J02j53L5Q7r4p3Q6j29K69k7k7J29j48o8J57j33j5Q6l2N2k34o6
4278a06K65l07K49q9M7J24k53m9K69l22J41j61m7L14k51q2K24j49L8N1n0O8n4
$$ plain form
4110 113 308 362 337 -182 -19 -30 -12 126 198 155 204 293 107 404 -88 234 75 -123 115 131 19 88 72 -4
4134 -4 52 -418 -9 -147 -76 19 -236 -14 -17 -95 89 -55 -416 -142 100 117 -175 -116 0 -240 -196 -256 -368 71
4158 71 -145 -64 -14 -181 -180 -208 -137 -89 232 84 50 132 -201 143 309 -74 59 190 389 277 18 34 190 269
4182 269 51 -19 21 197 86 239 402 143 148 257 -106 -66 68 121 108 209 -144 -8 124 -12 193 24
4204 24 64 -4 85 264 7 -127 -19 3 89 -50 199 98 158 -154 -18 -305 -130 -206 -372 -20 -4 -217 -12
4227 -12 44 -55 -175 -59 37 -80 123 40 205 27 -69 -105 -17 1 -168 -165 158 139 -72 -79 -155 -16 9 -22 244 -178
4253 -178 57 53 90 192 39 74 161 67 -6 80 -49 220 193 166 295 147 79 236 103 88 174 142 194 -40 -106
4278 -106 159 -148 101 12 59 183 -70 -119 150 -172 -31 -192 -239 75 -176 -258 -34 -183 -145 -94 -144 -76 -130
4301a30J10j05P5P9K9k50J32K60k09Mj0Pl8m9n4J45M4m6K76j71j83J67M9k06J87
4326A13M0j5j70J33n2k05K05P0j68J14j6J5K17k31P3J12k22K24k30K64j64L4m41
4349c00O08q4j78J36l04K10p8M3j29K60j87N3L3L6j50m5j0L6L52m07o6q1Q3K23
4373E4l8L2j79K56p3j4j15j5J19k04Q9k10L83j10MJ08N7l24J62l4n5J76j66J68
4397G1j7Q3l68J01L48l50n1J66j53K92K1P0l28P9Q2n7P0K48j23j43j05K64l14
4420a14K26k96K15K94l67R6k0o7R6j08J46N0k23L7N8o9R3j58J59K27k03j54L05
4443B23j14r1l46L14j83J13m6O4L3k00K15J7rk36P7J23O6Rk07K31j96J39k03R6
4467a11M4R1j53o2J08L76p5%l66K01J2q6J69pP8q0M0k26J83P2r8J45M7m20K85
$$ plain form
4301 -130 -20 -125 -50 29 58 -192 -60 200 -9 -5 -15 -8 -46 -95 -149 -4 40 -6 270 99 -84 83 132 -74 113
4326 113 153 138 -32 101 49 -156 49 119 -49 65 49 64 281 50 123 235 13 237 7 271 107 141 -300
4349 -300 308 224 46 182 -122 88 10 53 -76 184 -3 50 83 119 -31 -76 -86 -50 302 -105 -171 -252 -169 54
4373 54 16 48 -131 125 52 38 -77 -92 27 -177 -88 -298 85 -25 -21 87 144 -180 -18 -52 -107 69 -97 71
4397 71 54 137 -231 -130 218 -132 -183 -17 -170 122 143 213 -115 -36 46 -11 59 307 184 41 -64 200 -114
4420 -114 112 -184 31 325 -42 54 34 -33 63 -45 101 151 -72 -35 23 -46 47 -111 48 275 72 -82 223
4443 223 109 18 -328 -14 -197 -84 -130 -66 -33 -233 -18 -1 -10 -246 -169 -46 20 29 -178 53 -143 -4 -207 -111
4467 -111 -67 24 -129 -191 -83 293 218 218 -148 53 65 -21 148 141 219 139 179 -47 136 208 110 255 302 -118 167
4492A67j8R4k72J5L11j11j47K59k51p3n8j34L22j54J19N5k62J55Q5l48ML62k06
4515h6K22k19l1K71j80Lj75K44k6l87R9J24q7J28j77O5R3J87j31J25k65J04l8
4538a37J99n2k22K2N1M6k0P5J65m4j64N2MK77k15R4j45oQK63j02n5J60k16K46
4563B84l44J70k27K53L16l55j77N2K10j4J71k75O1n0J95j14J08k45L0M1l27L65
4585A28k0r0OP7j61q0K61q3l7L22l90K2j39J30j5k02k6J15P0P5J95j46j55K12
4609F9l36K32p3j41J87L41m02L43j46J31l43J21r5J10O1J69k24m05L06q4J94k02
4631a87JL13R8j59J49l84M8j06J38P1N8j38K37j68J54k17P3q3K99r5j36J34j69
4654f9K2O8l0M3n1N9l0M3R2r6K6j75J8m0J01j03MR8j22M1J17m24K70qJ1p9K7J62
$$ plain form
4492 167 149 243 -29 -14 297 186 39 298 47 -26 -84 -218 104 -50 69 124 -138 17 102 -246 -242 120 -86
4515 -86 136 -83 -114 157 -23 -20 -195 49 23 -364 -265 -141 -228 -100 -277 -212 -119 68 -63 62 -203 -99 -137
4538 -137 62 10 -212 -190 -139 -93 -113 -38 127 83 -81 -29 -25 252 37 131 -14 -20 -12 251 149 94 254 38 284
4563 284 -60 110 -117 136 452 97 -80 -28 182 168 339 64 125 75 270 156 264 19 49 90 -237 128
4585 128 108 18 24 101 -60 -140 121 38 1 323 -67 -45 -184 -54 -69 -271 -297 -182 -112 -37 158 12 -143 69
4609 69 -267 -35 -108 -249 -62 279 -123 220 74 205 -138 -17 -112 -2 59 228 4 -401 -95 -179 15 -187
4631 -187 -186 127 225 66 215 -169 -121 -227 -89 -18 40 -98 139 -29 125 -92 -19 -102 197 102 -34 100 -69
4654 -69 -47 21 -9 34 -17 42 12 55 147 51 77 -98 -80 -120 -19 -122 -118 -20 -142 -101 16 -408 -138 -146 -135 -214 -187 -25
4682b5N9j89r1K78j05Kj1m6N1J2l2j31J37j20J56N9j88j27N58k70J04m1J37k81
4706a04L23j80J76N9k68K43k50N3M0O7oJ17k26J36J6k86K46j96J68K67k67k02
4728g4k2P9K74l01L4J32j08K97k86m6J8r3j5l4K87m6j81J07k73K05J3P2j2q8Q6
4753B5J53l94k8J91j07j34K13q8J40n5l6J27r6j15J51j66J02n3K23%k87J32J87
4776H5k09K53o4j94K90j15j20K83j34k8n3K5J59k41J21J94l32K65L7j89K66j25
4798A74l31L79j16pP6k96J98Kj77K22k43J83q3j21J75nJ81j59l00L06Nj68J03
4821bk13K29j49R5p8L28k83k14j11N54r3r4J79o4k19K98j57q6K52J13m29J22o4
4844h6j04J86k3N7o9P5K92k07r2r1J00l6K30m42J70J20k69O35l14j76J10j11p1
$$ plain form
4682 -25 34 -155 -246 32 -73 -71 -82 -128 -77 -65 -97 -228 -91 -211 -55 4 -184 -311 247 -23 81 40 177 -104
4706 -104 219 39 215 274 6 249 -1 52 92 159 153 270 44 180 196 -90 156 -40 128 395 128 -74
4728 -74 -96 -17 257 -44 -10 122 14 311 25 -21 -3 -96 -111 -145 142 96 -85 22 -251 -46 -33 39 27 -61 25
4753 25 178 -216 -244 -53 -160 -294 -81 -169 -29 -84 -120 7 -89 -204 -53 -219 -117 -170 53 53 -234 -102 85
4776 85 -124 129 65 -129 161 46 -74 209 75 47 -6 19 178 -63 58 252 -80 185 222 33 299 174
4798 174 -157 222 106 99 175 -121 77 79 -98 124 -119 64 -19 -140 35 30 211 52 -248 58 63 -105 -2
4821 -2 -215 14 -135 -40 -118 210 -73 -287 -398 156 63 -31 148 84 -135 163 6 -80 172 285 -144 -22 -86
4844 -86 -190 -4 -27 30 -39 36 328 121 29 -62 38 2 232 -210 -40 80 -189 446 132 -44 66 -45 -116
4867a16L54O1k66K26m40L16j11O3k71P3J56O9j49Q9k4P0j18J1K38j66l33lL73
4890A02k33L20k8p5j81n8j03K26k70J41P4j6J15j13R9j21K76k81P0p9J47N1k98
4913b35J67k9O1r8m1q7L34J02m65N60p9k67k80J03J92L39k36r9j72N11o4O1p08
4936d30P02l01N93j264J061m15k83P34j32RJ01J10K78n35l39J35m83Q49p70K97
4956h3j53L94j80L30L56p41J81M64l36j43m67K13j46J78J2J60j63l1J50p7K15
4977A33k17J49M6l95J9M18l21q6J32J73j45l9PJ75N9m1j25j11oJ60J29J79m22
5000a29K16k18O1K26j04k7J13l29L74o6j66J27k6k26L31j17j13L31j72K74m75
5021a15J17K25j03k83L36J52j80m4Onj48ML2k31K62k5J89l32j45Q1J41j02J61
$$ plain form
4867 -116 238 299 33 259 -181 135 24 87 -184 -111 45 114 -35 54 30 100 -18 -7 231 65 -268 -271 102
4890 102 -131 189 161 86 -95 -153 -256 -30 -300 -159 -85 -101 14 -99 0 -121 155 -126 -56 -135 12 63 -235
4913 -235 -68 -97 -36 -134 -175 -262 72 174 -291 269 190 -77 -357 -254 -62 277 41 -58 -230 281 217 278 -430
4936 -430 272 -29 564 -700 361 -54 -337 397 265 274 375 485 763 228 -111 24 -459 390 -380 -83
4956 -83 -236 158 -22 308 664 -77 104 568 232 89 -378 -165 -311 -133 -121 39 -124 -155 -5 -82 133
4977 133 -84 65 111 -284 -265 153 -168 -254 -122 51 -94 -133 -126 49 108 67 -58 -169 -175 -15 114 293 -129
5000 -129 87 -131 -70 156 52 25 138 -191 183 117 -49 78 52 -174 157 40 -73 258 86 360 -115
5021 -115 2 227 124 -159 177 329 149 105 111 106 -42 -38 -6 -237 25 0 189 -143 -288 -207 -66 -168 -7
5044gj98j84K66j07j12q7K98k12J57L52k22l07P92j04l16r4j5J03m4j32J30N2
5066Ij89R9K34o1k50J70K17k48K15j52l1L29l6l46O8k92M55o5k56K65j0r8J09
5089A36K40j82j23k1R6k42J34K04j65J09j34K8k84L20j10K56q0j37J72k32J48
5110A33j86K50j81K06j40P7J97n08N6J97k30N4Q8K76k23j93J5M0n7J96k10M3J76
5133G6k82R7J8J4J66j53N8J56l22J40k47n1L27mP8J05k95P6p4K3K53K5j41l1o4
5158e2J98j96J10J69k46J43J84l88L25M8l16J23Q7k30Q3J6j47K64k14o0l6j1K57
5181A11j01k0J87j98J65k0j15k29J62q0J73J8o5Rj05K47j06o4m08K77l5K51j25
5204g1p7R3n0q3J42n9m6J72k38K22o2q4J19j50J17N0j16j24O01l19K62k99q5M8
$$ plain form
5044 -7 -205 -389 -123 -230 -342 -429 -131 -343 -186 166 -56 -363 429 325 9 -85 -100 3 -41 -173 -43 9
5066 9 -180 -81 153 92 -158 12 229 -19 196 44 13 342 306 -40 28 -264 191 126 -130 135 125 27 136
5089 136 376 194 71 50 146 -96 38 242 77 186 52 80 -204 116 6 262 182 45 217 -15 133
5110 133 -53 197 16 222 82 159 356 -152 -96 101 -129 -75 13 289 66 -127 -112 -72 -129 67 -143 -100 76
5133 76 -206 -109 -91 -77 89 -64 -6 150 -172 -32 -279 -330 -3 -7 71 176 -119 -43 -117 -94 159 184 43 12 -52
5158 -52 146 -50 60 229 -17 126 310 -78 247 295 -21 102 189 -41 42 58 -89 175 -39 -99 -135 -146 111
5181 111 10 -10 177 -21 144 124 9 -220 -58 -138 35 53 -12 -3 -108 139 33 -31 -439 -162 -197 54 -71
5204 -71 -148 -55 -105 -188 -46 -105 -151 21 -217 5 -57 -141 -22 -172 -55 -5 -121 -245 356 37 299 0 -85 -37
5228c7K05k73J92k07L8J65q6K91j18m50N58q1q3k52MK72K97o69L52j82k18R37
5250F55n53O0l22k3K70j38M48j85l20Q06r33MP03p79K38K67j18j35M9K18n6j85
5272b9K46m58M36l38l04L37L87o36L66j16K34L9o67L93j87M15l60k01L55J19J23
5293A54j52J48j47k39K44J84l11P9K48n11O9K07j67P27n90J22NlJ08L8j87K58
5315B84k56K9J74n2K6J61m94J42j89k06N70j47L6R8J2k55K22q7j12j95Q5P2R7
5338A5k90K74m0j93K88j45K40k49J50j23P0k5Q5N7n1n04N15m3k13j6Q2P1P4j66
5362a37M8L12j19r1Oo1j00J37K18j41J73k57L39l41K72k7K2j98j93J31Jj9L34
5385C09r7p6j20O1j62J90j38O7R4j14P7j36J37m1J5K4mJ24O9k08l24K96J61l88
$$ plain form
5228 -37 168 -105 87 -120 -82 83 -3 288 170 -280 278 197 114 -138 -134 138 435 -234 118 -64 -282 655
5250 655 102 162 -160 -183 87 -51 397 212 -108 698 -235 -231 472 -307 -69 198 80 -55 -6 212 156 -29
5272 -29 217 -241 195 -143 -447 -110 277 -359 7 -109 125 164 -503 -110 -297 118 -242 -443 -88 31 154
5293 154 2 150 3 -236 8 192 -119 -40 208 -303 -234 -27 -194 533 -57 65 70 67 175 213 26 284
5315 284 28 57 231 179 205 366 -128 14 -175 -381 189 42 78 176 188 -67 155 68 -44 -239 -154 -82 15
5338 15 -275 -1 -41 -234 54 -91 149 -100 50 -73 -3 -28 57 114 63 -441 74 31 -182 -198 -116 -45 29 -137
5362 -137 -89 223 104 13 19 -42 -142 -5 213 72 245 -12 327 -14 258 231 253 55 -138 -7 -6 -25 309
5385 309 212 136 16 77 -85 105 -33 34 128 14 91 -45 92 51 66 90 86 210 279 71 -253 43 204 -184
5409a84L16L1j14j15M6qJ02j10m8Q0j37k34N11j37M3j96m7L29k90K05ql6J54k29
5433g6M8k1l7j29J13k4J69q0j34L03l37L25j21j5J73L41m12J33k45j8n1P0J51
5456A26M0j59K1jn0K29l33L67r0q2Qj8K6k03K14j91K00k4p5o2nJ49j16O%J5j04
5483a12K93j51J1J13j06j34J64Q4Op4k16K2J41JO9l53M1K35j45L4k93M34l9o7
5507d2m5J4R2n2j27J83J40k78NJ77k42L05k23K12j77L7Q4p2P8j70J72j71K84j03
5531H1l1J4j27J43J36j43j29J16j58K28q6R3j66J80J0o0j87J83j51L19k11M0j62
5554f8K48k42j21K71k6r9l23M52k06q5P6L50n5k59L47l78j7j5JJ02l3m8K96l88
5578b20L41q6M9l1k33L40q6j02J0L1k98K94j69L7M27l69J63P1l48Q3J08j34K86
$$ plain form
5409 -184 132 163 49 -66 -20 -28 74 -36 -84 -4 -141 -375 136 -1 42 -154 -201 128 -162 43 35 -1 153 -76
5433 -76 -28 -49 -86 -215 -102 -126 43 -37 -171 132 -205 120 -1 -16 157 498 86 219 -26 -44 -95 -25 126
5456 126 166 7 28 27 -23 206 -127 240 150 68 76 58 84 -119 95 -96 104 80 5 -57 -62 87 -29 -23 -23 -8 -112
5483 -112 181 30 41 154 48 -86 78 162 168 94 -122 -100 41 42 111 -242 -201 34 -111 -77 -370 64 25 -42
5507 -42 -87 -73 19 -33 -160 23 163 -115 -110 67 -175 130 -93 119 -58 -21 63 -9 69 -101 71 -100 184 81
5531 81 50 64 -63 80 216 73 -56 60 -98 130 44 137 -29 151 161 101 -86 97 -54 265 54 94 -68
5554 -68 180 -62 -183 88 62 -37 -360 92 -114 -199 -123 227 172 -87 260 -118 -135 -150 -149 -47 -80 -128 168 -220
5578 -220 121 35 84 53 -180 160 74 -28 -18 13 -285 9 -160 -123 304 -65 98 169 -179 -96 12 -122 164
5601A64j25J0l00J90J6J21k42j5M81k69J15q3L6J8j70K44q7q9L48n62K14K39k91
5624c7o0L76l46K46j17k4J58l46K18k15L24k97P6j18r9M03j60M0k58K38r6k1K37
$$ plain form
5601 164 39 49 -251 -61 -45 76 -166 -181 300 31 146 63 99 117 -53 191 104 15 363 -199 15 254 -37
5624 -37 -97 279 -67 179 62 38 196 -150 68 -147 177 -120 -44 -162 -261 142 -18 22 -236 2 -94 -115 122
$$ [...]
8191a31
##END NTUPLES=NMR FID
##END=
