##TITLE=1H_L3L30-SeO2-f4
 CDCl3,32 sc, 
 5.02.2021
##JCAMPDX= 6.0         $$ Bruker NMR JCAMP-DX V2.0
##DATA TYPE= NMR FID
##DATA CLASS= NTUPLES
##ORIGIN= UXNMR, Bruker Analytische Messtechnik GmbH
##OWNER= root
$$ XWIN-NMR		Version 3.5
$$ Fri Feb  5 10:34:47 2021 Russian Standard Time (UT+4h)  she@DPX200
##.OBSERVE FREQUENCY= 200.1315066352
##.OBSERVE NUCLEUS= ^1H
##.DELAY= (6, 6)
##.ACQUISITION MODE= SIMULTANEOUS
##.ACQUISITION SCHEME= undefined
##.AVERAGES= 32
##.DIGITISER RES= 18
##SPECTROMETER/DATA SYSTEM= spect
##.PULSE SEQUENCE= zg30
##.SOLVENT NAME= CDCl3
##.SHIFT REFERENCE= (INTERNAL, CDCl3, 0, 15.7039)
##AUDIT TRAIL= $$ (NUMBER, WHEN, WHO, WHERE, WHAT)
$$ ##TITLE= Audit trail, XWIN-NMR		Version 3.5
$$ ##JCAMPDX= 5.01
$$ ##ORIGIN= Bruker BioSpin GmbH
$$ ##OWNER= she
$$ F:/spectra/data/she/nmr/H-F/1/audita.txt
$$ ##AUDIT TRAIL=  $$ (NUMBER, WHEN, WHO, WHERE, WHAT)
(   1,<2021-02-05 10:33:43.03 +0400>,<she>,<DPX200>,
      <continue with go, POWCHK disabled, PULCHK disabled
       configuration hash MD5:
       00 E9 B6 7A A2 85 ED C7 34 08 36 98 17 FE 4E 26
       data hash MD5: 16K
       5D AE 69 EA 83 3A 2B 1B C9 1E 28 20 43 5F 71 AF>)
$$ ##END=
$$ 
$$ hash MD5
$$ B4 FF EE 65 F4 AA 1D 50 0B 98 54 DB F5 D8 F4 10
##$RELAX= 
##$RELAX= 
##$RELAX= 
##$RELAX= 
##$RELAX= 
##$RELAX= 
$$ Bruker specific parameters
$$ --------------------------
##$DU= <F:/spectra>
##$EXPNO= 1
##$NAME= <H-F>
##$PROCNO= 1
##$TYPE= <nmr>
##$USER= <she>
##$AMP= (0..31)
100 100 100 100 100 100 100 100 100 100 100 100 100 100 100 100 100 100 
100 100 100 100 100 100 100 100 100 100 100 100 100 100 
##$AQSEQ= 0
##$AQ_mod= 1
##$AUNM= <au_zg>
##$AUTOPOS= <>
##$BF1= 200.13
##$BF2= 200.13
##$BF3= 200.13
##$BF4= 200.13
##$BF5= 200.13
##$BF6= 200.13
##$BF7= 200.13
##$BF8= 200.13
##$BYTORDA= 1
##$CFDGTYP= 0
##$CFRGTYP= 5
##$CHEMSTR= <none>
##$CNST= (0..31)
1 1 145 1 1 1 1 1 1 1 1 1 1 1 1 1 1 1 1 1 1 1 1 1 1 1 1 1 1 1 1 1 
##$CPDPRG= <>
##$CPDPRG1= <>
##$CPDPRG2= <>
##$CPDPRG3= <>
##$CPDPRG4= <mlev>
##$CPDPRG5= <mlev>
##$CPDPRG6= <mlev>
##$CPDPRG7= <mlev>
##$CPDPRG8= <mlev>
##$CPDPRGB= <>
##$CPDPRGT= <>
##$D= (0..31)
0 1.2 0 0 0 0 0 0 0 0.06 0 0.03 0 0 0 0 0.0002 0 0 0 0 0 0 0 0 0 0 0 0 
0 0 0 
##$DATE= 1612506687
##$DBL= (0..7)
120 120 120 120 120 120 120 120 
##$DBP= (0..7)
150 150 150 150 150 150 150 150 
##$DBP07= 0
##$DBPNAM0= <>
##$DBPNAM1= <>
##$DBPNAM2= <>
##$DBPNAM3= <>
##$DBPNAM4= <>
##$DBPNAM5= <>
##$DBPNAM6= <>
##$DBPNAM7= <>
##$DBPOAL= (0..7)
0.5 0.5 0.5 0.5 0.5 0.5 0.5 0.5 
##$DBPOFFS= (0..7)
0 0 0 0 0 0 0 0 
##$DE= 6
##$DECBNUC= <off>
##$DECIM= 32
##$DECNUC= <off>
##$DECSTAT= 4
##$DIGMOD= 1
##$DIGTYP= 9
##$DL= (0..7)
0 120 120 120 120 120 120 120 
##$DP= (0..7)
150 150 150 150 150 150 150 150 
##$DP07= 0
##$DPNAME0= <>
##$DPNAME1= <>
##$DPNAME2= <>
##$DPNAME3= <>
##$DPNAME4= <>
##$DPNAME5= <>
##$DPNAME6= <>
##$DPNAME7= <>
##$DPOAL= (0..7)
0.5 0.5 0.5 0.5 0.5 0.5 0.5 0.5 
##$DPOFFS= (0..7)
0 0 0 0 0 0 0 0 
##$DQDMODE= 0
##$DR= 18
##$DS= 0
$$ [...]
##$SUBNAM2= <"">
##$SUBNAM3= <"">
##$SUBNAM4= <"">
##$SUBNAM5= <"">
##$SUBNAM6= <"">
##$SUBNAM7= <"">
##$SUBNAM8= <"">
##$SUBNAM9= <"">
##$SW= 16.9725356469052
##$SWIBOX= (0..15)
0 0 2 0 0 0 0 0 0 0 0 0 0 0 0 0 
##$SW_h= 3396.73913043478
##$TD= 16384
##$TD0= 1
##$TE= 0
##$TE2= 300
##$TE3= 300
##$TEG= 300
##$TL= (0..7)
0 120 120 120 120 120 120 120 
##$TP= (0..7)
150 150 150 150 150 150 150 150 
##$TP07= 0
##$TPNAME0= <>
##$TPNAME1= <>
##$TPNAME2= <>
##$TPNAME3= <>
##$TPNAME4= <>
##$TPNAME5= <>
##$TPNAME6= <>
##$TPNAME7= <>
##$TPOAL= (0..7)
0.5 0.5 0.5 0.5 0.5 0.5 0.5 0.5 
##$TPOFFS= (0..7)
0 0 0 0 0 0 0 0 
##$TUNHIN= 0
##$TUNHOUT= 0
##$TUNXOUT= 0
##$USERA1= <user>
##$USERA2= <user>
##$USERA3= <user>
##$USERA4= <user>
##$USERA5= <user>
##$V9= 5
##$VALIST= <valist>
##$VCLIST= <CCCCCCCCCCCCCCC>
##$VD= 0
##$VDLIST= <DDDDDDDDDDDDDDD>
##$VPLIST= <PPPPPPPPPPPPPPP>
##$VTLIST= <TTTTTTTTTTTTTTT>
##$WBST= 1024
##$WBSW= 4
##$XGAIN= (0..3)
0 0 0 0 
##$XL= 0
##$YL= 0
##$YMAX_a= 577385
##$YMIN_a= -601293
##$ZGOPTNS= <>
##$ZL1= 120
##$ZL2= 120
##$ZL3= 120
##$ZL4= 120
##$ABSF1= 10
##$ABSF2= 0
##$ABSG= 5
##$ABSL= 3
##$ALPHA= 0
##$AQORDER= 0
##$ASSFAC= 0
##$ASSFACI= 0
##$ASSFACX= 0
##$ASSWID= 0
##$AUNMP= <proc_1d>
##$AZFE= 0.1
##$AZFW= 0.1
##$BCFW= 1
##$BC_mod= 2
##$BYTORDP= 1
##$COROFFS= 0
##$CY= 11.3945322036743
##$DATMOD= 1
##$DC= 2
##$DFILT= <>
##$DTYPP= 0
##$F1P= 15.9154993809931
##$F2P= -4.1035820241983
##$FCOR= 0.5
##$FTSIZE= 0
##$FT_mod= 4
##$GAMMA= 1
##$GB= 0.15
##$INTBC= 1
##$INTSCL= 1
##$ISEN= 128
##$LB= 0.24
##$LEV0= 0
##$LPBIN= 0
##$MAXI= 10000
##$MC2= 0
##$MEAN= 0
##$ME_mod= 0
##$MI= 1.114404
##$NCOEF= 0
##$NC_proc= 0
##$NLEV= 6
##$NOISF1= 3.799351
##$NOISF2= 2.8
##$NSP= 1
##$NTH_PI= 0
##$NZP= 0
##$OFFSET= 15.70392
##$PC= 1
##$PHC0= -10773.13
##$PHC1= 28.00094
##$PH_mod= 1
##$PKNL= yes
##$PPARMOD= 0
##$PSCAL= 0
##$PSIGN= 0
##$REVERSE= no
##$SF= 200.130013532006
##$SI= 16384
##$SIGF1= 3
##$SIGF2= 2
##$SINO= 400
##$SIOLD= 16384
##$SREGLST= <1H.CDCl3>
##$SSB= 0
##$STSI= 0
##$STSR= 0
##$SW_p= 3612.71676300578
##$SYMM= 0
##$S_DEV= 0
##$TDeff= 0
##$TDoff= 0
##$TI= <>
##$TILT= no
##$TM1= 0
##$TM2= 0
##$TOPLEV= 0
##$USERP1= <user>
##$USERP2= <user>
##$USERP3= <user>
##$USERP4= <user>
##$USERP5= <user>
##$WDW= 1
##$XDIM= 8192
##$YMAX_p= 0
##$YMIN_p= 0
$$ End of Bruker specific parameters
$$ ---------------------------------
##NTUPLES= NMR FID
##VAR_NAME=  TIME,          FID/REAL,        FID/IMAG
##SYMBOL=    X,             R,               I
##VAR_TYPE=  INDEPENDENT,   DEPENDENT,       DEPENDENT
##VAR_FORM=  AFFN,          ASDF,            ASDF
##VAR_DIM=   8192,          8192,            8192
##UNITS=     SECONDS,       ARBITRARY UNITS, ARBITRARY UNITS
##FACTOR=    0.0002944,     1,               1
##FIRST=     0,             0,               0
##LAST=      2.4114304,     0,               0
##MIN=       0,             -601293,         0
##MAX=       2.4114304,     577385,          0
$$ Real data points
##PAGE= N=1
##DATA TABLE= (X++(R..R)), XYDATA
0 0 0 0 0 0 0 0 0 0 0 0 0 0 -32 32 -32 32 -61 64 -64 94 -96 127 -157 184 -208 244 -283 316 -369 414 -476
31 -476 539 -613 694 -783 879 -984 1099 -1228 1366 -1517 1684 -1862 2061 -2276 2516 -2768
47 -2768 3051 -3359 3698 -4075 4488 -4953 5462 -6046 6701 -7452 8323 -9340 10556 -12029
61 -12029 13854 -16185 19269 -23557 29889 -40132 59283 -106390 437801 410362 -598233
72 -598233 577385 -114374 -308400 464638 -249444 -22051 242221 -239311 161789 47027
82 47027 -38301 96583 -63430 72664 13871 -15200 105714 -75045 42717 14807 -81191
93 -81191 32233 -79385 -612 116757 -31212 32026 53335 -52758 -8087 2089 -94025
104 -94025 -13185 44999 -79269 25581 46106 -100467 64220 -10517 -94179 102018 -76525
115 -76525 -53761 102641 -101870 -5448 19191 -121872 39230 957 -50018 57066 -2677
126 -2677 10158 28480 -33166 -52348 -47453 16950 2993 -3846 44454 -21030 -8250 31104 -1018
139 -1018 27920 -2463 -34234 16003 25641 11346 6630 4098 -15444 -12874 17878 11137 30860
152 30860 42088 7531 9903 -18429 -15653 10344 -26171 13813 22140 -15372 37498 144 -14818
165 -14818 43343 -34402 -28507 31534 -35931 -846 32325 -42522 3583 7052 -62349 933
177 933 10045 -23395 25026 -8090 -32378 2875 -35959 -37745 -12091 -26882 -2674 5068 -10018
190 -10018 -4490 -17813 -22248 -21787 -15352 -7011 -20603 -13628 -3508 -3654 5758 -16263 -27502 -8114
204 -8114 -9974 1311 16656 1701 4431 2096 -27272 -10732 9262 -7619 22168 21117 -12271
217 -12271 24236 3832 -20538 34245 -2123 -16028 29283 -1494 20439 35425 -5280 8616
229 8616 -2954 2608 8383 -2323 40729 3711 7194 37785 -47585 19078 29570 -51685 59203
242 59203 3456 -41854 63620 -43361 -10261 49433 -69418 20881 18533 -45246 54193 -20328
254 -20328 -28197 27092 -47549 -1370 -10953 -36147 27623 -22783 5594 6851 -51035 21351 -33972
267 -33972 -31505 45290 -57280 -534 22805 -72500 32249 -9742 -54871 52431 -33097 -13950
279 -13950 45774 -52528 16616 18545 -57337 22493 -16691 -30214 47581 -10651 5686 29584
291 29584 -22122 9016 8543 -5275 12908 -3081 12707 753 -4165 25453 -11546 14212 32294
304 32294 -17263 28064 20149 -17689 34846 -32 -21348 21111 -15963 -1902 30378 -1933
316 -1933 18987 20028 -7814 11793 -1363 -12476 8169 -4645 -6989 5019 -7760 -5302 7981
329 7981 -2748 -1563 8583 -8489 -6388 8381 -14330 -14165 -689 -27729 -14594 3599 -14566
342 -14566 5709 9781 -11666 3961 -3807 -23262 -2781 -5204 -18221 -964 -971 -14299 2293
355 2293 9204 -9912 8619 8058 -13433 13028 2371 -16065 15832 -5263 -18634 17037 -662
368 -662 -2673 28047 7042 7408 21631 -3864 -424 13276 -8982 1649 20606 -6087 6182
381 6182 24606 -5603 13788 23789 -9708 17082 9709 -16377 20981 -1953 -15157 20782
393 20782 -10859 -2088 20522 -5436 9431 11823 -5995 172 -8869 -7573 -10680 -5669 1737 -17284
407 -17284 3965 2157 -19132 18134 -10118 -20257 16502 -28969 -12168 10458 -36576 1300
419 1300 -1760 -30620 14472 -11150 -17470 18880 -14146 -7036 1600 -23561 -4562 -7286 -10898
432 -10898 590 -10276 657 6144 -1294 8192 -4511 -1582 7074 -10845 4504 3672 -11617
445 -11617 11333 1919 -665 20810 -6248 6712 22982 -8687 16409 8796 -16984 20269 -4049
458 -4049 -4430 26079 -11464 10066 19067 -12372 25589 196 -7650 22147 -23513 7481 14718
471 14718 -24318 23701 -5065 -11250 26344 -21874 9038 9954 -27611 20246 -12747 -10833 15361
484 15361 -35211 12326 -438 -26482 31249 -25889 -13675 27307 -34748 10807 282 -37787
496 -37787 20158 -16719 -13578 20106 -23878 -314 3325 -13813 8516 -10830 -3805 -316 -9675
509 -9675 10478 -7744 -1228 4753 -12484 13991 688 -6630 19692 -8947 609 15028 -8416
522 -8416 9604 5664 -6067 13159 4532 3595 13680 3057 -3147 6578 9684 -1951 6339 10782
536 10782 -7247 11486 12120 -5022 9758 -2731 -6265 16485 -2662 -4145 9607 -10653 -1548
549 -1548 10375 -3252 -5444 -1972 -3142 -658 2954 -4813 -12117 -4531 -6989 -8039 6013 -10335
563 -10335 -14062 10085 -8276 -8004 7218 -20795 -12757 5767 -15966 -624 3303 -20697 5016
576 5016 2891 -16225 5215 21 -13647 3831 3079 -9867 2728 -339 -10223 4533 2122 -3063
590 -3063 16619 2674 -5139 16957 -2767 -2215 14378 -6594 834 11818 1860 12431 8421
603 8421 1123 4939 8580 7614 3144 7931 1817 -2549 18229 1453 -4781 14003 -8139 6055
617 6055 19829 -7547 10481 5079 -15312 14255 -3164 -12972 11225 -7607 -1930 14454 -8223
630 -8223 -2301 2658 -11673 2140 -1508 -10267 -2413 -4740 -6523 -3880 -5905 -3963 -7575 -4693 2599
645 2599 -10367 18 -400 -15887 -119 -9562 -14631 10776 -9667 -1070 10743 -17041 10029
658 10029 2265 -17747 12424 -12880 -4440 18210 -17713 9256 8441 -17024 19778 -1905 -5518
671 -5518 17721 -8464 10731 9122 -8927 10398 -8154 3927 13838 -7777 17778 -248 -2368
684 -2368 21830 -12062 6032 7711 -18330 18446 -1914 -7497 20092 -16116 6279 11960 -19273
697 -19273 14361 -2257 -13241 17554 -12663 -6404 6151 -15749 -28 -2493 -8878 52 -5208
710 -5208 541 -7300 -7158 -3719 -15365 530 -6053 -14637 6805 -11475 -4742 7696 -18066 42
724 42 -1581 -17364 8712 -4239 -11178 7358 -8097 -6267 4518 -5501 -2339 5733 3362 -3678
738 -3678 3025 3033 -7867 9466 2709 -7660 15037 3694 -1813 19675 706 -931 11457 -5940
752 -5940 5828 10300 -383 9616 6912 206 9612 1983 3614 8026 2943 4719 5454 1151 3294
767 3294 3416 -433 -284 4423 2801 -611 7143 1527 -4945 2037 -2981 -8570 1988 -4878 -6744
782 -6744 4580 -3645 -4371 2198 -8196 -6824 1201 -7500 -6222 -847 -7987 -4420 -2856 -8789 -2017
797 -2017 -1345 -6890 2251 -2259 -7419 2804 -4644 -8879 1683 -7465 -3468 5247 -4499 2960 5382
812 5382 -5397 3806 2018 -1403 4206 264 4064 2759 1023 7571 -162 4759 7133 160 9239
827 9239 4541 2443 11029 -1707 4293 7690 -4493 10504 3847 33 14917 -1748 3343 11258
841 11258 -7958 6180 6038 -7986 8802 1606 -4015 6404 -3953 1447 3712 -5489 3206 -1619
855 -1619 -3861 1654 -6692 -577 -2993 -8694 3816 -6325 -4784 5717 -8022 -886 662 -11025
869 -11025 2036 -3838 -9166 4144 -7517 -3313 2542 -5840 1690 -1408 -2767 2738 -3709 2474
883 2474 -246 -2556 3892 -3506 3668 3415 -4990 11649 -69 -1312 15497 -6417 5660 10671
897 10671 -11077 12851 5903 -6826 16056 -228 -246 14482 -1441 5794 7655 607 7746 1282
911 1282 4207 4739 914 6337 -1725 2449 6187 -2715 7370 1176 -3509 7095 -5315 -785 3895
926 3895 -9059 2683 -1925 -8217 5278 -5258 -4335 3673 -8225 -3105 -1196 -7204 -562 -5835
940 -5835 -6147 -4229 -9403 -1047 -2514 -8191 589 -7038 -4864 3506 -7919 -3925 -2160 -10449 37
955 37 -2016 -4915 2458 -5719 470 2749 -3537 5439 -3172 -3657 4784 -4313 3773 2127 -3456 5387
971 5387 -421 2868 5534 -2906 9801 2449 666 9708 -4442 3762 6438 -2873 9332 411
985 411 143 10152 -740 7699 3482 -3110 7125 -3940 3147 6975 -7592 3581 1139 -4909
999 -4909 5027 98 327 582 -894 92 -2841 2352 -6676 -5464 2313 -10842 2275 4043 -11074
1014 -11074 5572 -4690 -9070 8026 -9149 -2278 956 -13554 2739 -749 -6100 3834 -6607
1027 -6607 -2591 1483 -497 5047 -4334 946 406 -5460 6389 -4668 -2423 9695 -7052 6055
1041 6055 9437 -7113 10427 3860 -4444 9617 -1047 -1464 8837 54 5761 7158 -2095 3101
1055 3101 7455 4633 5501 4728 1404 214 4541 3601 712 2984 851 828 8224 2025 -1294 5075
1071 5075 -3794 -2771 9164 -6347 -2265 6625 -10437 2315 4414 -10494 5585 -2417 -8212
1084 -8212 6797 -4501 -3278 3202 -9257 -4427 -3683 -6797 -555 -3705 1251 -1753 -5131 2787
1098 2787 -6755 -736 2105 -12666 2976 -798 -7652 9147 -5887 -3197 8527 -8093 4680
1111 4680 5215 -4627 10472 -558 -1964 7207 -5207 4510 5984 -725 9769 -289 4300 10174
1125 10174 -839 8159 893 -1156 10219 93 7251 7232 -4349 9441 2896 1329 10245 -2603
1139 -2603 4291 5022 -249 8188 -2264 -311 3741 -5906 7540 -502 -2159 8700 -5823 1144
1153 1144 3502 -9016 3584 -1775 -5241 4543 -6598 -1208 678 -6874 1349 -4225 -3989 2096
1167 2096 -4142 1324 -2400 -6724 -828 -6987 -1259 -295 -5278 2896 -2310 -3156 4075 -3359 -247
1182 -247 1301 -3975 268 397 -947 987 645 175 -286 2471 3585 2368 5364 1746 432 1935
1198 1935 -215 1239 2783 1344 4148 3171 3842 3877 2578 4518 113 1515 3367 -239 2115 1962
1214 1962 -1402 3566 -80 1065 3287 -1720 3076 1355 -2891 2611 -3813 -5281 96 -6174 -2648
1229 -2648 308 -4535 240 -1400 -3362 -265 -5414 -2296 -3435 -7672 -2644 -6707 -6827 635 -7051
1244 -7051 -2808 372 -7876 807 -405 -6722 1800 -6135 -7821 1309 -6637 -1513 1029 -3479 2282
1259 2282 1996 -1669 3695 -1887 -447 1788 -2278 736 -375 1270 4469 -365 5231 4433 -53
1274 -53 9099 1863 1143 7581 -3777 1147 6662 -5302 6418 3971 -1733 10713 1150 1174 7774
1289 7774 -3978 3614 2572 -4784 3978 -1640 -1586 4363 -3280 2381 137 -2404 4827 -3954 432
1304 432 -1254 -8494 1979 -7457 -6056 3458 -8948 1584 1928 -9328 3325 -4895 -6993 3771
1318 3771 -9656 -3933 -1168 -8916 1262 -3675 -3961 1346 -4687 1883 -1395 -4309 2176 -5808 -1959
1333 -1959 -795 -6993 1482 -1604 -722 5528 -3331 3472 3683 -3295 5571 -1101 -1725 4769 -2773 2909
1349 2909 4841 -2996 4695 4311 211 5380 2390 2130 3820 778 1796 910 -652 1527 3077 2596
1365 2596 2166 2325 2066 255 526 252 -1692 -1498 -240 -2072 643 -1094 -3988 1809 -1546 -3027
1381 -3027 2428 -3796 -2088 771 -6086 -2340 -3258 -5338 -79 -3087 -2364 -165 -3313 -392 -3092
1396 -3092 -3063 -2987 -2919 -636 -3145 -1226 -406 -3388 917 -685 -1586 2049 -2100 284 2854 -1756 1778
1413 1778 490 -411 2017 885 4264 787 2823 5031 -1091 4738 1716 -517 7764 -222 2734
1428 2734 7255 -930 5246 2724 -109 6447 -232 5204 4693 -1748 6759 256 237 5245 -4307 3616
1444 3616 2205 -2776 6861 -3455 -1198 3958 -6392 3422 287 -5664 5236 -3859 -2330 1523
1458 1523 -7661 -278 -2469 -4688 1834 -4634 -514 -202 -6199 1530 -5070 -5626 1505 -7242 -2113
1473 -2113 1380 -7058 304 -1911 -5276 2294 -2426 -1237 2740 -2871 -97 -368 -3362 -83 -1215
1488 -1215 -457 2233 783 2923 2103 1342 1392 -978 1595 1724 -528 4301 1220 384 6234 65 1617
1505 1617 4861 -179 4195 5245 -1083 3413 258 -1624 2745 -757 1575 2924 1611 5319 1941
1520 1941 700 482 -3638 4 -466 -3344 1653 -2765 -1410 1954 -2485 518 -959 -3825 1664
1535 1664 -928 -3055 -802 -5203 -3209 -2918 -3657 -275 -2098 408 950 -1886 1077 -4052 -4143 -616
1551 -616 -6459 -721 1994 -5272 2821 144 -3727 5155 -2135 -247 5884 -3020 2613 2444 -4203
1566 -4203 1455 -1405 -311 3541 1660 6150 3219 3257 4974 -2296 2070 454 -2656 5868 -496
1581 -496 1234 8036 -1415 3584 3717 -2262 5081 1260 233 3034 -1931 445 -1093 -1413 363 -1694
1597 -1694 3022 1350 1151 4582 -5365 -1724 -1157 -8627 1277 -2913 -5271 3869 -2707 -1051 886
1612 886 -5566 -935 -2385 -2815 -1236 -4767 -1412 -4617 -2935 -615 -6909 295 -593 -2510 6044 -3687
1628 -3687 -2240 1079 -8371 -71 -1507 -5226 5455 -692 1459 5216 -3583 3135 468 -2241 4458
1643 4458 -1670 2181 3497 -1690 4814 -278 -930 5478 778 5683 5635 -807 5248 530 -1594 2642
1659 2642 -2227 2904 4375 1772 5157 1837 2102 1969 -1626 1725 -567 -1149 3661 -588 306 1909
1675 1909 -3371 199 1273 -2100 1561 -128 -1360 500 -3221 -4288 -2227 -3792 -886 1071 -1652
1690 -1652 315 -432 -3549 -1264 -3380 -4157 -1435 -2252 -1407 232 -568 -980 -2353 -913 -1038 -3047 1801
1707 1801 -19 -475 2647 -3499 -1903 1285 -1891 1944 2222 533 4101 1341 1969 1516 -1086 2263
1723 2263 -805 2647 4439 828 4419 2168 694 3342 -2762 617 4078 -21 4988 866 -1406
1738 -1406 4520 -2392 -670 3146 -2600 3423 1934 -736 1471 -4014 -1549 -604 -3330 1869 -2307
1753 -2307 -1009 2586 -3547 -91 -3232 -7459 -443 -3921 -3232 701 -4054 -215 -1512 -6142 -1180
1768 -1180 -4029 -3064 1232 -2154 -1477 -2601 -4004 -1619 -3484 -1452 -1049 -2094 1935 334 -1606 704
1784 704 -3219 -791 83 -1714 2085 2110 1473 3461 1181 635 587 1268 2199 1817 2983 1591 1675 2515
1802 2515 208 2650 2308 389 5911 4086 2426 3696 -432 496 2564 -578 2003 1442 2087 4497
1818 4497 1397 2138 -316 -1676 719 -1616 -100 2068 -2042 -153 -771 -2933 659 -2523 -949
1833 -949 1472 -1761 -546 -1846 -3816 -479 -4821 -4350 -1418 -2035 1250 -183 -2342 361 -3612 -3054
1849 -3054 -2646 -4098 -882 -1700 -1567 2105 -3125 -1508 759 -1931 1038 687 -874 2071 698 554
1865 554 -867 -1632 1320 745 2197 3720 1399 5077 3292 -577 2352 -442 -1546 3974 1315 2753
1881 2753 3683 843 3117 1481 1294 2937 -1161 1881 2184 -49 2053 -866 395 1824 -1133 2080
1897 2080 1948 -78 3365 -555 -1916 -762 -4476 -43 460 -3578 2249 -798 -1994 2088 -2759
1912 -2759 -3000 -1970 -3992 462 -2395 -2599 -1440 -3165 118 -1553 -2798 974 -2714 39 1453
1927 1453 -2638 -82 -1704 -2953 2554 -1535 -149 3769 -1033 3036 2706 -1711 2404 1017 -314
1942 -314 3905 492 2267 2416 1951 4309 1741 1577 3613 2012 4551 2177 688 3457 -467 1457
1958 1457 3275 490 3655 4432 1406 4677 1666 162 1244 -30 876 1351 12 1244 1113 1703
1974 1703 1371 -15 1239 -1407 -810 -2 -1462 -1555 -170 -3050 -2829 -2070 -2666 543 -289 -1967 -132
1991 -132 -1846 -2413 -882 -3221 -2902 -1868 -3099 -707 97 -542 -2000 -997 -1173 -1438 -1133 -1496 -1499 1584
2009 1584 -875 -394 912 -1477 929 2107 248 1926 839 1049 1095 352 1641 332 830 2391
2025 2391 1511 4012 1677 486 4112 -353 113 2506 -1318 2444 1384 414 4528 95 562 2779
2041 2779 -295 2284 413 378 1143 -1002 172 -1547 -1658 1023 -2467 488 2022 -2407 1944 -1515
2057 -1515 -3302 686 -5820 -1118 879 -4369 1480 -1583 -1681 559 -2914 -291 -823 -3704 1116 -1903
2073 -1903 -991 -84 -3922 -420 -454 -1405 3802 -2603 991 2381 -2966 2300 -494 -1775 1965 -1404
2089 -1404 1741 3170 159 4298 2 -494 2432 -1480 1553 2212 1146 3231 838 585 3105 -711
2105 -711 2468 3240 -62 2834 1730 374 3294 -678 -830 1592 366 1393 3014 -917 1242 600
2121 600 -589 -598 -1393 -1474 -1390 -1060 81 -779 -780 -241 -1697 -545 -692 -2129 -878 -2943 -3636 436 -4982
2140 -4982 -3637 -1423 -4060 181 -837 -1616 -316 -2120 -2603 -1579 -2173 -2004 -2276 -757 704 180
2156 180 620 -1023 -887 1622 -666 -207 1778 -463 1147 1851 -1744 1468 183 -246 3165 1292
2172 1292 2123 2556 447 1283 1355 818 1499 1332 2425 2119 1825 2736 660 1132 1883 240 1479 628
2190 628 367 2163 211 898 1157 -1001 496 526 122 112 54 -46 -637 -1040 -1423 -2088 88 -97 -341
2209 -341 557 -1686 -929 77 -2763 -1407 -1761 -2196 -194 -608 -45 -594 -2370 -709 -1663 -1297 365
2226 365 -2036 694 310 -523 1906 -1754 -168 1713 -846 2630 1735 -531 2735 -64 -65 1052 -840
2243 -840 1724 907 1608 3646 -40 1984 1686 -733 2359 -434 1454 4003 -1119 2708 1661 -1015
2259 -1015 3209 -374 284 2976 -450 1812 1043 -1682 1298 -2052 -459 1389 -251 2119 638
2274 638 -442 1562 -1899 -1929 -1696 -2932 757 -698 -2816 254 -3348 -1348 -465 -3495 -317 -2571
2290 -2571 -2387 -66 -2752 -1279 -1826 -2961 -1164 -985 -600 843 -1276 -322 189 -2268 -895 -755 -1128
2307 -1128 1313 156 115 2112 -9 1780 450 -1237 1382 72 -183 2320 394 550 1969 86
2323 86 2139 1401 1131 3212 1753 2536 2049 -773 1378 -142 100 2223 53 1718 2245 -89 1991
2340 1991 673 -439 1448 -460 -280 776 -1294 -758 171 2 -639 -1265 -131 322 -595 -547 -2594
2357 -2594 -1912 -349 -3283 -906 -1363 -504 22 -605 -310 -1379 -1734 -1001 -2110 -1759 -1790 -1701 -1186 -192 -1045
2376 -1045 -2062 -663 -253 241 -90 -204 12 -426 152 -707 -1058 -685 -152 -250 2194 2443 2322 1347 1347 -192
2396 -192 -978 -736 493 707 1526 1236 1679 536 1299 2064 -88 1385 1228 -639 113 -235 -208 -169 -1219
2415 -1219 396 916 722 1508 -28 92 -910 -2372 -504 -1685 -813 726 -1918 -1106 25 -1648
2431 -1648 -754 -845 -3475 -818 -1335 -1291 -1048 -2464 -1066 -1170 -1911 -824 -2179 -763 -1084 -793 63 -1948
2449 -1948 -1325 326 -2553 715 -536 -1377 1910 -723 -474 1611 -990 883 1329 -445 1674 677
2465 677 -97 2604 -411 602 926 311 2940 1187 1559 2272 545 1826 1235 -14 3467 437 1272
2482 1272 3659 -662 2302 1418 -1422 2419 712 630 2930 -812 1601 1601 -1189 1398 -559 -592 884
2499 884 -894 778 -725 -1357 1260 -1799 -863 -442 -2670 -385 -371 -1833 234 -2612 -1694 -168 -2730
2516 -2730 -493 -487 -2621 206 -879 -1112 11 -1740 -1111 -314 -838 -223 -401 -455 -283 -599 134 18 -636
2535 -636 927 -459 141 636 76 951 984 232 811 1522 1070 1073 1394 769 928 809 434 1420 1437 990 1917
2556 1917 1245 1255 1368 937 1037 799 335 529 520 384 -81 292 402 262 103 700 -213 295 -354 -1157 -147
2577 -147 -1277 -1467 -559 -1559 -1039 237 -1764 -1094 -20 -1420 -824 -1066 -1712 -530 -1675 -716 -1069
2594 -1069 -746 -605 -947 -318 -623 -691 -526 -892 -748 -176 -649 -79 421 -218 690 954 466 750 984 3
2614 3 914 23 45 983 390 1388 1499 1216 1426 1807 1541 1369 782 1314 867 813 1312 514 963 1877 -104
2635 -104 1477 669 131 1977 -294 -473 562 -1033 256 95 -968 526 -1120 -309 356 -1330 297
2652 297 -1009 -1928 -74 -1848 -1306 -853 -2922 350 -1103 -2208 200 -2252 -930 436 -2403 -68
2668 -68 -901 -2690 -416 -2561 -1573 -207 -1673 249 -1010 -917 755 -1076 -25 -241 -1478 959 -853
2685 -853 -440 1637 -1405 743 597 -749 1918 824 311 2429 -167 1667 1277 -358 1263 713
2701 713 707 2062 1111 1532 1269 804 1361 -437 914 806 465 1652 1030 339 1207 -77 733 512 -7
2720 -7 716 474 -247 318 -247 -277 -1057 -769 -275 257 477 -201 -636 -719 -1263 -167 -1380 -949 -147 -1133 -647
2741 -647 -694 -1234 -948 -408 -672 -337 -960 -519 -320 -783 87 -816 -532 479 101 -281 821 520 486 482 1003
2762 1003 564 627 289 451 1162 853 330 204 1102 823 1598 1562 700 1244 927 1541 1048 339 1188 1720
2782 1720 919 1524 1591 1108 1298 889 93 338 -335 522 246 -552 50 -224 -296 -742 -1614 -740 -764 -360 -69
2803 -69 -964 -240 -1109 -2099 -828 -1448 -2065 -46 -1395 -750 -242 -2253 -917 -859 -2110 -386 -1573 -1393
2821 -1393 -519 -1434 -298 -584 -1211 -409 -1063 152 17 -807 318 -192 -741 892 -786 -289 1007 -346
2839 -346 1689 1012 22 2094 -102 576 1827 -123 1550 1384 294 2149 169 997 1716 165 1850
2856 1850 648 950 1416 -154 1006 1309 -775 1183 705 -158 1360 -187 443 493 -977 629 -615
2873 -615 -1120 776 -282 -118 80 -814 -99 -634 -847 -695 -1435 -350 -561 -1400 -140 -867 -1564 -263
2891 -263 -1463 -176 -473 -478 -454 -1228 -479 -697 -997 -443 -349 67 -490 -340 23 -727 -659 -98 -157 265 612
2912 612 657 241 328 -4 -437 -124 1334 963 1370 1183 1173 1288 979 129 305 318 1439 516 205 787 953
2933 953 678 360 552 -364 521 676 720 674 -458 -200 -148 36 245 -616 255 -246 225 -450 -1110 -633 -148
2954 -148 -1526 -583 -434 -1727 -704 -1444 -1445 -1247 -1692 -593 -297 -1006 178 -665 -734 -295 -1238 -1209 -730 -1370
2974 -1370 85 -329 468 -49 -1083 224 -1089 -804 447 -698 385 1203 -989 1289 777 -489
2990 -489 2550 809 844 1571 -30 637 40 202 304 575 1201 1059 -284 1497 510 729 1118 397 1134
3009 1134 896 1432 1264 660 -301 1855 -309 414 1571 -702 1374 543 -381 878 137 -629 -441 -2267
3027 -2267 -46 -705 -384 -271 -609 -581 -674 -767 532 -1112 -928 -492 -599 -605 -581 -1853 262 -1301 -1011 482
3047 482 -883 -1234 313 -907 -1398 279 -1929 -229 -202 -487 289 97 894 737 625 19 1120 1016
3065 1016 -399 -6 149 -87 23 43 1365 779 1973 1309 9 1586 568 1176 809 402 -186 755
3083 755 1081 -260 1028 373 1462 18 481 380 -472 1157 -89 173 -73 -388 -649 283 71 -723
3101 -723 -763 -580 259 -398 -1023 -1023 -959 -871 467 -758 28 635 -1138 222 -497 -1421 -846 -516 -1096 -847
3121 -847 -335 -478 -281 -309 -340 -247 568 -549 -356 1272 -662 -440 792 -719 990 938 871 1208 685 1070
3141 1070 1399 630 -38 143 194 587 1088 119 1297 985 1002 1140 691 1587 1041 767 1576 368 1795
3160 1795 1099 -245 1298 -394 287 1113 464 232 247 -906 293 -1017 411 -151 -145 -292 584 -1012
3178 -1012 -754 -926 -265 -498 -722 -29 -2771 -951 -65 -759 275 -705 -2123 -646 103 -912 427
3195 427 -937 -1240 -1218 -46 -642 101 -743 -372 -1083 -737 -1138 230 -34 -74 -884 686 954 46 713
3214 713 530 872 -426 -945 1163 -641 692 415 -523 -549 1882 95 714 -56 964 981 -7 735
3232 735 500 1056 6 861 -658 978 527 -499 75 -1343 1028 -1130 -748 512 310 115 -123
3249 -123 160 -488 592 -293 -321 -912 -159 154 380 -108 877 -2129 -676 -689 -524 -279 -1251 -1081 -198 -370
3269 -370 54 -1939 -1118 272 -59 -473 -1617 -413 220 1488 -1172 280 1572 424 -193 -867 -1205
3286 -1205 586 492 872 569 1567 162 2354 1863 364 290 903 905 648 334 1366 1394 1741 228 322 1768
3306 1768 76 1280 883 973 1590 -1320 6 794 -1151 -593 1046 -15 897 832 -1107 475 -526
3323 -526 -867 -1415 -1003 570 -1617 -560 -1603 -627 4 -849 -1057 186 -1836 -1406 164 -3038 -15
3340 -15 -582 -1447 218 -1358 -809 -412 855 -577 238 -509 -552 -899 -752 5 641 518 1104 -307 1825
3359 1825 -498 669 759 -144 1703 488 -146 1219 362 279 1731 658 840 1299 259 654 939 547
3377 547 1275 132 -33 1563 1253 1420 570 -389 1096 1141 1067 1531 243 647 66 -1148 612 534 80
3396 80 1376 -646 699 -140 249 319 -523 -716 -750 -992 -509 -654 -831 235 -411 400 -872 -507 -446 -1024
3416 -1024 -1088 -482 -1156 -777 -363 -605 -334 1 -373 -835 -979 -35 -75 -320 -338 -278 -179 462 -200 786 346
3437 346 187 347 -31 100 532 -610 1031 618 556 882 937 712 343 516 -296 605 958 299 440 759
3457 759 619 80 270 222 171 785 647 1196 -62 384 -122 -302 -394 -119 145 -468 -9 -353 -292 -529 -1090
3478 -1090 -675 11 -860 -1632 -217 -1251 -1389 -514 -1079 -85 345 -1643 -520 -1079 -331 -1227 -1391 -1220
3496 -1220 -917 -499 0 -223 -578 702 -482 527 -153 -1360 591 -293 -686 493 -312 393 542 320
3514 320 1045 780 909 1455 558 -1048 707 432 1615 1462 -124 1580 1605 -283 1162 266 -84 1102
3532 1102 714 1156 -351 1480 1656 893 1140 460 80 -186 -530 271 1025 -1338 -748 -524 -1347 297
3550 297 -1354 -227 488 -1467 473 1043 -671 -582 -248 -1387 -828 -791 121 -284 -1348 -415 -1000 311
3568 311 -284 -1036 -686 -1283 -738 -807 -995 -156 -100 -61 -10 -584 -859 933 281 -364 -21 -580 -39 38 -433
3589 -433 76 386 502 933 266 618 622 654 502 553 575 543 651 739 365 515 1424 352 591 489 493 188 609
3612 609 -56 223 -579 776 448 -270 339 366 456 -325 324 -366 125 -329 -379 -663 -596 -781 -75 -499 -244
3633 -244 -1107 -1114 -457 -517 -13 -286 -664 -666 96 -90 148 -402 -233 386 -218 -47 356 -149 641 -715 -1110
3654 -1110 -177 -1202 -832 528 -267 482 -71 141 1538 -84 489 1209 434 -218 1140 -319 1934
3671 1934 1157 868 282 769 -61 245 1139 1218 -487 391 1437 -331 1183 332 -142 813 -703 -444
3689 -444 1333 -54 886 1013 -153 93 192 -1101 1285 627 -891 -143 -189 -577 -585 -1471 -789 68 -192
3708 -192 -721 -360 80 -36 -1313 -1293 -623 -362 671 -1671 -438 -137 -1291 -1536 -1607 -856 -774 335 -119
3727 -119 58 -985 457 -188 -153 827 -679 -582 1358 910 181 136 311 56 1199 222 1125 769 1075
3746 1075 645 956 17 513 1099 409 109 895 761 444 172 -891 1416 -43 331 1137 190 369 1026
3765 1026 -464 -928 -765 418 15 -204 -55 1207 -616 56 -153 -529 -453 -1045 -622 -431 -450 -849 -871
3784 -871 -292 -231 -787 -83 -615 -368 -235 -10 -130 537 -577 -351 26 -917 190 1639 -358 503 39
3803 39 -48 -966 1187 -200 622 475 523 1076 807 912 460 958 -638 916 572 635 518 365 305 313 840
3824 840 565 213 858 792 137 409 182 948 628 -1061 1876 103 506 573 646 507 367 -908 -695 180
3844 180 -5 -422 50 511 -1177 -253 -930 -132 463 -342 78 -871 -820 -1116 -1215 -1130 -783 441 -367 -873
3864 -873 -749 -65 520 -728 -857 -602 -1519 -978 600 -348 -295 -249 75 -245 308 193 178 -152 360 435 84
3885 84 1126 946 223 33 180 1196 531 1210 632 540 1096 221 -543 412 863 1061 1108 377 409 -191 165
3906 165 138 756 130 617 157 29 201 -135 -299 291 -92 323 37 631 330 -534 236 -69 -466 -233
3926 -233 131 -412 223 0 237 -494 -711 -270 -855 168 -594 -539 -512 -295 -415 -34 -450 -94 413 -254
3946 -254 -361 -556 -1135 265 -198 -195 35 67 5 138 -126 472 293 -180 410 219 210 316 322 902 14 586
3968 586 177 43 1398 649 523 1263 493 181 1065 140 -83 877 685 529 739 375 475 306 112 298
3988 298 439 -100 26 464 -237 -217 435 -472 -166 -745 -546 -33 -308 -45 -598 -149 -953 -947 -96 -648 142
4009 142 183 -718 -367 -374 -530 -1212 -916 -777 205 -612 -444 -186 -609 -162 -91 -407 -258 -349 -801 248 156 -317
4031 -317 69 -270 171 23 -191 339 140 309 336 549 279 628 400 201 -102 1313 705 399 486 -99
4051 -99 -130 18 521 467 505 29 723 804 323 62 76 930 570 522 -277 -329 674 73 91 417 24 1294
4073 1294 623 -67 751 -33 -366 -539 -228 85 -438 -558 -543 271 -1099 -458 -1174 -782 -95 47 -290 1042
4093 1042 -724 -1011 -153 -1068 -1350 -1 -232 603 636 -379 469 -295 897 -761 871 -340 279 398
4111 398 -92 164 253 -294 590 470 -587 -533 134 567 1316 422 -289 186 512 52 510 1659 872 237
4131 237 -15 250 712 168 -68 546 -37 419 236 51 -211 -719 809 -274 1137 -208 -740 152 -1636
4150 -1636 432 -232 -462 325 -288 -1030 -713 -723 -1500 -140 -338 -208 -545 -391 -294 222 -224 -537 -309 113
4170 113 -601 -299 64 -827 881 -15 -584 121 698 428 452 219 505 827 1078 183 148 297 225 622 676
4191 676 701 1116 73 1638 1314 -148 776 1291 918 309 621 -622 670 546 -121 854 -238 996
4209 996 840 -636 866 537 387 709 1443 -524 826 621 247 190 -496 676 610 36 -240 -284 -380 -798
4229 -798 -138 885 -690 -726 -1612 -591 218 -539 721 645 -303 -9 -502 -414 -541 76 -32 -75 70 -397
4249 -397 26 -429 77 -106 -387 439 -253 94 -211 444 1212 830 419 -837 -520 294 137 1752 142
4268 142 176 422 251 261 820 1303 973 -181 112 -602 938 716 479 256 -87 1031 751 1306 520 817
4288 817 23 35 58 103 -357 929 264 -315 203 -285 -243 -223 -208 -21 -669 198 -375 -543 -723 -143 -710 -781
4310 -781 -598 -454 -611 -169 -1302 -228 -559 -453 -218 -120 -252 -325 52 21 -584 -780 -90 -405 -396 59 403
4331 403 -157 804 163 81 439 449 -127 -60 -526 789 688 1135 1053 -194 378 55 635 777 952 -25 254
4352 254 207 -400 306 938 688 933 1009 -305 1298 -415 701 461 -73 -67 -807 -622 112 -623 -888 -235
4372 -235 -407 125 -114 -521 -548 -922 -123 -610 -979 -415 -725 -109 -672 -711 -484 -542 -312 -420 -1264 -485 -623
4393 -623 -299 -433 -2 -443 -250 -179 651 -478 -100 317 262 -157 -80 116 -882 -395 205 1033 -619 -62
4413 -62 323 378 410 404 1052 194 836 339 680 841 482 -91 122 162 761 272 -134 22 -776 230 -113 218
4435 218 402 709 464 691 408 580 252 -50 -90 -438 -815 -31 434 -162 -1053 -1168 30 -728 -698 -896
4455 -896 218 -137 113 -642 199 -1188 -724 -1126 -145 -373 -437 -1386 -560 -393 -307 -79 200 -1061 -117 -355
4475 -355 220 57 196 320 536 828 1278 633 -100 190 -783 1659 138 400 1442 -842 609 1021
4493 1021 -365 517 798 818 1965 -136 -167 -221 543 -138 725 969 176 553 1172 777 1097 776 -310
4512 -310 510 1191 650 90 -490 394 -535 -553 389 -123 396 -514 -232 -764 -266 -111 -865 313 -712 -384
4532 -384 -361 -392 -1465 -426 -217 -647 -4 26 -106 -606 -946 191 -1157 -153 -818 72 -449 -1076 -938
4551 -938 -50 -149 461 109 77 570 787 352 172 -179 1501 681 182 642 -95 661 247 139 955 909 -75
4572 -75 158 1297 813 244 526 446 -87 202 -103 -27 391 809 679 212 334 263 625 65 -288 -208 271
4593 271 -35 225 -229 289 126 -760 22 -492 -375 -54 -411 -188 -301 -380 -299 -235 -675 -899 -245 102 -260
4614 -260 -391 -340 -291 -261 -130 -97 -83 -145 28 -68 236 56 -685 -229 -65 401 301 318 64 44 72 213 91
4637 91 404 -73 591 74 267 795 567 511 -96 651 533 520 423 -7 376 293 232 417 218 287 43 537
4659 537 463 495 263 210 262 581 108 -112 -103 -309 -496 -72 136 -106 -809 -236 450 -424 -572 59 -773 -536
4681 -536 -146 -542 338 -580 1105 -987 -221 189 -339 238 -842 -667 -379 -897 -161 522 -387 -228 240
4700 240 -430 191 -353 124 -121 -415 -180 -76 84 264 302 1033 721 274 263 -377 101 845 586 1125 692
4721 692 42 1162 838 71 632 405 -12 -164 58 799 744 -53 403 150 434 190 566 -384 131 -233
4741 -233 -118 352 -399 -480 -227 -17 -184 -426 -371 20 -87 -369 -295 -735 46 -655 -303 -357 150 -687 -647 -650
4763 -650 -666 -568 107 -57 -700 -140 24 709 292 -61 211 535 -472 4 -581 131 243 442 356 368 -335
4784 -335 486 -517 376 -25 793 64 -134 121 391 1324 703 -594 174 942 -1013 32 -301 -700 -271
4803 -271 -75 -1145 1188 -860 196 191 -4 20 705 318 22 -4 -721 -844 90 -367 128 472 -375 -379 62
4824 62 -289 -477 -179 -679 -1237 389 313 690 -658 -55 -578 -1221 -403 -770 -341 438 -425 -522 1308 -197
4844 -197 -305 -343 -402 120 -709 -256 224 392 -536 -267 490 -582 329 -90 1083 170 -1225 700 636 -189
4864 -189 -388 1205 252 -787 188 228 2350 -298 -273 -487 -94 21 1051 -261 1720 645 618 590 -240
4883 -240 -133 572 45 -156 -1539 226 271 -303 -729 -51 192 -812 44 1580 -818 -1216 274 -208
4901 -208 -847 -31 440 -744 -144 -48 -299 -929 375 312 331 -460 -1253 -1189 -629 513 624 -109 -1530 199
4921 199 -355 -1382 365 852 -177 328 -524 71 790 72 923 -156 1277 300 -40 625 654 243 218
4940 218 1366 90 785 182 -760 -76 96 570 591 306 -308 158 909 201 32 1252 540 896 -235
4959 -235 1193 203 -484 835 -594 -20 250 292 1551 328 -108 1230 -694 278 -252 -408 -794 388
4977 388 134 264 -380 -402 291 420 299 568 -728 66 -308 -665 -737 -356 -201 -238 202 -542 670 -1395
4997 -1395 0 58 -7 548 -22 -88 17 -236 1469 770 -409 -210 -623 -1760 284 837 -68 257 642
5016 642 736 330 -482 -1419 17 620 -353 -275 377 -1085 1011 346 -402 261 -280 52 -91 325 202 -831
5036 -831 803 -173 -221 29 370 423 9 316 -253 -457 -708 -220 -211 446 -292 187 523 248 59 -323 -441
5057 -441 557 -1416 -277 -939 -363 59 -214 91 -1255 -974 509 -815 338 -495 -312 120 494 25
5075 25 -1065 -91 -831 -1845 -307 223 671 265 37 253 8 426 -134 425 49 662 1135 406 628
5094 628 612 742 2416 242 723 -385 -185 1122 465 596 73 -612 -569 2086 -338 355 -285 359 -63
5113 -63 626 -999 -197 951 412 -1001 -519 -376 -1106 -228 -324 119 -1020 -215 -704 -138 -792 949 47
5132 47 -1223 -788 -794 830 -548 -629 -69 255 536 461 515 12 -378 774 327 -1058 383 -166 -1027 -472
5152 -472 1531 -222 15 674 -3 -591 307 -385 166 648 466 1115 24 429 -749 -489 371 -141 -279
5171 -279 -639 -204 -826 814 -137 94 194 839 -610 -196 -45 426 342 -33 -53 -91 583 -439 2 -815
5191 -815 523 -228 178 -357 447 205 756 -407 -157 -163 763 -599 -198 -1217 892 -158 48 453 -682
5210 -682 -14 -692 -1242 7 154 63 -681 -244 -243 -143 -357 -134 276 -156 62 271 764 -573 552 -189
5230 -189 -232 2 471 -458 475 209 234 889 -327 632 -186 623 289 433 342 -19 -19 453 418 358 321 244 -28
5253 -28 552 538 -385 -156 624 115 235 -384 -18 -382 67 -573 -197 -339 -326 547 -248 -229 203 -152 -573
5274 -573 -393 -120 52 -486 -353 -717 -275 44 -538 -380 84 -727 132 -211 0 -633 183 -304 -345 -655
5294 -655 42 -358 -134 24 -182 -578 -25 -447 -887 -230 -346 -81 -195 -245 541 156 359 775 -16 -363
5314 -363 157 -354 325 379 328 -292 -370 97 322 -188 -79 431 863 206 657 -132 111 553 565 -66 510
5335 510 -441 -196 15 -556 -80 453 -437 223 -276 -240 -464 -227 469 -287 769 728 109 -403 -546 -329
5355 -329 120 -1098 184 -200 -235 134 -337 -637 -187 164 -548 200 394 46 66 -338 103 82 -20 -93 -124
5376 -124 839 -287 -59 992 -204 439 -69 -833 -75 487 503 12 -251 311 -410 -199 845 80 286
5395 286 1562 -345 137 556 -194 239 457 178 743 -1047 566 1350 202 -1204 -135 164 543 -354
5413 -354 949 211 372 972 240 234 -17 -1193 -80 -360 297 493 -1039 709 -453 246 -377 -98 -570
5432 -570 -176 -2 227 -1682 -704 1351 -603 628 -634 162 -1032 -251 841 -776 35 -826 396
5449 396 401 743 -735 -709 -737 48 -236 -147 374 339 895 58 1004 168 141 -131 117 463 457 179 -574 -235 9
5472 9 -213 1071 509 -125 7 -785 -34 -868 759 188 126 -948 559 379 -826 -558 177 471 -377
5491 -377 -1060 -206 -210 198 -1406 84 126 -213 -86 -13 -1937 -539 204 -802 -574 -308 259 -457 -414 192
5511 192 -233 315 -974 537 -69 -135 -402 395 -54 179 40 -498 -535 -602 -1049 -83 12 -286 1677 -538
5531 -538 581 1297 -48 190 855 -301 -100 -738 533 389 704 549 -107 589 892 515 -387 183 574
5550 574 875 441 -86 702 911 431 155 -82 105 382 -911 -18 -98 -537 445 -10 -32 71 -498 936
5570 936 -271 246 -1858 -911 170 -274 -42 461 -420 -129 368 -30 68 -878 -92 -1 102 348 371 -365
5590 -365 -55 1242 1047 844 -274 516 -1014 -1136 359 -404 -426 -75 1019 49 -869 2 126 134 160 -394
5610 -394 89 -3 384 657 473 782 -102 -141 298 833 813 508 737 400 791 1150 232 -67 938 8 1098
5631 1098 -249 -454 700 504 -410 307 45 -71 -173 -523 1330 27 -526 293 788 -793 -41 -964
5649 -964 -570 111 42 -41 -739 -579 278 191 -102 549 -722 104 694 -224 143 -39 -451 549 58 -116
5669 -116 -73 19 1071 142 396 250 620 -637 293 579 797 -431 178 221 -61 429 493 -767 368 93
5689 93 313 413 243 579 -343 105 384 140 -30 -792 -192 227 536 882 765 1240 -603 337 -205 -412
5709 -412 508 699 -518 -10 704 489 305 -182 1090 20 712 282 32 -630 -283 372 -413 -364 -792
5728 -792 609 -209 957 -22 -193 -494 -1752 -299 -312 -563 -278 1292 219 -688 -188 398 -321 -1000
5746 -1000 873 107 156 526 -132 327 -196 -91 324 148 -251 82 461 1061 -128 -227 344 233 178 394
5766 394 -366 -94 190 819 -29 -116 -714 790 -967 -204 298 -112 -882 745 689 -353 460 390 -145 647
5786 647 -106 -85 -140 101 620 -1036 536 736 83 -1148 335 953 -734 -107 -368 -145 71 -543 -180
5805 -180 -773 485 -62 205 -202 -79 105 -323 -254 260 -554 426 631 296 363 449 162 645 153 173 -773
5826 -773 -361 -141 53 -298 -99 452 -526 330 373 -118 635 554 -377 -378 456 285 224 904 150 102 378 571
5848 571 278 -37 457 -515 71 -539 368 -333 -95 -87 -115 -1252 511 -322 776 323 -635 318 213 253
5868 253 366 -505 277 758 -120 487 -292 -1449 -53 357 -383 -409 -297 798 -518 1270 -135 19
5886 19 264 -37 -20 53 -1117 550 -136 -598 323 -255 228 -588 -304 70 435 -90 272 585 704 -763
5906 -763 -526 -252 -287 -276 263 531 149 575 217 549 722 199 -321 48 -339 77 194 122 661 5 391
5927 391 -206 -219 1445 -250 -243 265 -459 -381 680 -110 113 -462 -145 -557 -391 -164 -48 68 -321 -1202
5947 -1202 -769 259 51 -890 -471 -268 -3 -358 -37 -721 341 -141 364 -435 -304 -200 195 386 -554
5966 -554 305 -216 -1109 -39 -1739 -354 690 -182 -479 434 119 25 -458 312 -336 -500 9 -310 -485
5985 -485 350 385 -170 672 -593 319 114 179 26 223 -301 34 122 -441 -71 1146 -131 -376 267 390
6005 390 257 357 506 466 -401 315 -639 -444 228 604 35 -804 248 -911 -150 -169 -187 368 -462 590
6025 590 -325 -726 -295 -298 174 -251 183 -58 -15 -136 -167 -739 -925 620 151 226 15 -351 6 -76 -115 -894
6047 -894 317 -435 489 -1048 520 -1635 440 -192 -165 98 338 389 73 336 898 -201 -1101 -191 865
6066 865 -215 465 614 297 -52 -35 -204 -12 1106 -93 319 302 122 9 151 -642 49 -278 564 -596
6086 -596 133 377 -320 -182 106 -69 -446 -409 -184 -264 178 -209 -264 184 -553 -233 -122 -298 -313 -50 -488
6107 -488 56 395 487 -687 -447 -75 -443 -680 -77 -531 359 -164 221 345 444 -182 -417 192 -780 37
6127 37 -391 234 377 -91 1 529 -686 326 138 251 -67 141 539 -53 -183 760 -117 -134 -283 1230
6147 1230 149 -229 -361 192 675 -436 57 363 591 1225 1380 -202 684 -209 -268 -255 -146 63 419
6166 419 -255 394 -824 -75 -60 211 -229 -117 -527 -424 109 -7 247 292 551 393 -435 -387 -188 -416 243
6187 243 -61 -760 -287 332 559 79 343 -70 73 -260 -719 466 299 175 -4 192 351 196 -110 109
6207 109 -217 87 -79 294 42 186 -224 -91 -55 259 516 -17 362 -945 47 -624 -21 464 59 42
6227 42 599 -184 476 -252 -676 320 127 98 546 -265 74 29 500 604 -290 -12 -52 595 -227 -345 -365 11
6249 11 -233 -381 -103 -46 -120 -161 -428 -472 -153 -305 -248 -64 -122 -532 -72 8 233 -73 -355 -165 -231 288 219
6272 219 268 -24 -167 -147 55 254 -637 322 488 -52 125 -114 313 -121 571 49 77 804 841 363 -281
6293 -281 410 -229 -272 648 254 -498 -88 58 179 49 -121 591 285 -111 208 -173 438 447 -647 461
6313 461 -26 118 271 422 -421 -1187 -101 -497 -118 152 -1208 -23 -15 -1017 -287 533 -759 507 262
6332 262 -208 -110 103 751 -669 -302 96 340 -490 371 23 -318 -532 -438 168 106 -195 564 -49 -124 -21
6353 -21 345 -207 24 27 53 1014 -80 607 693 45 115 -234 735 1227 587 63 678 -589 143 252 398
6374 398 -243 -370 -47 473 -61 -624 500 -362 -387 -356 -379 434 102 402 -782 -644 358 -569 806 -800
6394 -800 1019 305 -1331 174 497 -159 -167 -357 702 573 -183 -246 284 -756 -10 144 -2 -459 -599
6413 -599 619 250 361 -100 411 570 379 -468 -925 219 -189 132 -180 -6 268 340 893 400 314 548
6433 548 357 -389 1044 -639 350 -589 -103 -793 -667 -410 1061 -94 -407 1006 453 518 556 138 -460
6452 -460 -704 -223 -47 340 -61 -196 392 124 91 -1280 -221 562 637 762 -539 -288 -332 -294 162 -1157
6472 -1157 -240 223 -573 -92 493 -592 -134 -156 -168 -331 991 157 -118 -998 -13 -480 479 69 638 -792
6492 -792 -218 -52 242 425 1216 363 -620 330 607 -501 56 474 869 -750 1452 -256 -936 -204 1190
6511 1190 1107 1155 1023 1502 1403 -667 962 -478 -830 652 -341 -517 366 205 150 -841 -401 467 179 -1280
6531 -1280 138 914 798 622 2 -697 260 -871 -999 910 -1064 -519 -1450 -263 -793 -929 659 -991
6549 -991 -647 15 441 146 -607 1115 272 -436 -36 -200 -545 449 -374 741 -33 1222 397 544 382
6568 382 -21 1380 -883 -390 -13 302 660 458 -170 -555 -539 -179 -79 1674 295 86 730 -372 -43
6587 -43 -362 -208 659 1285 -90 360 260 807 -446 949 749 -459 -562 185 885 403 236 -208 672
6606 672 -221 -620 -262 -96 370 -22 -245 1614 -890 -587 105 661 683 -668 -575 -831 828 284 -19
6625 -19 132 -966 -91 -1209 -113 -153 -785 113 -174 777 504 591 411 -898 323 1092 135 1170 -435
6644 -435 767 -388 759 -341 610 -1212 1284 -918 -260 -227 -153 -545 -99 384 24 -48 150 927 -1277
6663 -1277 -1 -173 281 -294 -176 546 221 -387 288 327 415 -410 -598 -754 830 134 810 -665 786
6682 786 83 599 -441 -574 -376 -307 -160 -12 773 -780 -327 621 -312 -9 117 -726 644 -84 -317
6701 -317 -169 235 496 645 -173 624 339 -587 -103 414 366 -31 -67 -315 253 380 127 327 356 671 -566
6722 -566 -32 -361 425 221 136 993 -705 676 -829 -215 -710 897 836 459 1045 -23 -339 -30 -81
6741 -81 418 -47 45 134 173 -54 1290 -763 -488 587 950 830 1386 115 362 -199 816 142 183 555
6761 555 7 119 214 303 -370 19 425 39 102 -182 805 23 -408 -409 392 177 413 -9 267 485 312 -463
6783 -463 57 799 116 1028 -343 -413 -591 363 371 -275 -212 359 -953 -158 363 -706 368 -227 655 -211
6803 -211 -296 -165 57 -233 68 139 -17 -174 107 746 -368 -87 574 68 168 439 678 -186 161 503
6823 503 545 24 -22 477 654 -344 -208 275 -91 61 1329 -277 578 784 -30 655 -669 195 291 -841
6843 -841 -224 -89 -861 813 -936 -70 -398 -708 -182 794 1106 -538 393 -451 -173 63 297 631 -18
6862 -18 -796 470 -123 3 541 -228 17 295 -282 -603 534 404 272 -73 -185 1454 -169 514 123
6881 123 -582 808 493 -765 161 618 -6 -503 -3 538 -341 530 860 745 84 -393 -76 305 1263
6900 1263 -231 -77 255 -633 271 -677 -421 -648 953 135 133 -85 488 -1148 682 -1397 -1266 -1
6918 -1 -66 -616 429 -476 -343 -107 -286 503 465 -308 -858 -410 -156 83 -138 1115 206 338 -335 615 1177
6939 1177 -286 346 674 -139 -80 -239 -54 -1232 238 -489 -900 -406 9 -1177 -1037 393 -1435 -458
6957 -458 -1206 1364 92 507 453 -217 -477 -110 -748 672 244 -647 -206 187 681 826 830 31 137 -287
6977 -287 -973 -455 723 -1384 575 -205 10 603 481 31 688 -106 -869 32 185 161 727 197 -952
6996 -952 750 -1239 945 -245 -1054 1423 -692 829 -846 1205 280 -1095 388 462 -456 138 -164
7013 -164 88 -645 -158 133 -1745 37 -1102 -455 -789 -388 133 -1714 772 363 -169 -425 -139 75
7031 75 82 600 191 150 -325 -354 -583 178 -270 -73 575 95 221 324 1009 -237 -418 -309 734 -144 418
7052 418 -350 110 334 -226 -570 509 -896 467 372 -16 -209 -1423 -278 -262 -609 -246 263 491 -331
7071 -331 -272 666 -372 -16 141 -186 -69 59 -18 334 -270 -38 500 -852 31 -81 -439 36 7 247
7091 247 476 75 1123 -419 709 505 -338 782 51 -46 -125 227 -189 -635 808 746 490 305 336 10
7111 10 -179 260 -366 290 417 -219 -935 145 200 -509 342 480 -128 -304 -36 -69 -185 25 366 -1234
7131 -1234 -557 -36 -79 -240 -907 -158 500 -356 -532 377 342 210 -189 682 -259 469 1182 230 -563 -23
7151 -23 63 1050 -504 194 -622 -259 -459 -57 -447 -653 -329 -81 -14 28 -294 471 -600 964 -1201 -1309
7171 -1309 258 -168 -165 34 438 -238 928 912 2 400 804 -465 -261 -45 -1224 179 420 111 1365
7190 1365 617 -590 125 -385 -924 -468 -205 927 -968 397 -1118 -1263 -1218 592 -127 -1008 -146 -727
7208 -727 851 -245 -722 -416 -26 -459 -602 -31 375 -841 437 71 451 -630 -502 352 311 -735
7226 -735 50 719 -446 -1045 -192 732 345 183 1115 -615 284 109 -219 -257 -706 364 235 -647 1207
7245 1207 -302 315 -45 -613 345 69 209 39 -506 562 693 -869 -93 197 -138 -40 760 -137 451
7264 451 764 343 645 -1087 -100 1090 117 142 -480 548 -719 -1416 217 -324 -230 109 -735 -617 428
7283 428 -166 211 490 -874 -1069 -546 -838 -107 -256 132 370 -807 -311 -102 -46 345 184 346 703 -366
7303 -366 424 -1151 -373 -134 -32 -476 -150 1224 1014 -471 109 -162 -122 944 88 609 -450 -306 363
7322 363 -699 70 768 -620 -483 922 323 -496 -595 -613 -918 -182 539 699 734 587 115 -56 -148 -272
7342 -272 -927 -620 15 -16 226 25 50 451 -1193 782 166 -318 -416 318 102 -1051 91 -319 -164 -705
7362 -705 -1120 436 -535 171 -423 -669 -943 -362 561 834 -212 1173 -195 663 -1320 -1080 -72 -92
7380 -92 545 -765 -1374 -173 398 -83 568 -704 27 -186 -740 -13 -337 723 -73 311 327 -283 -74
7399 -74 -367 -58 178 -23 115 -1023 -320 -711 220 -1040 262 -507 -573 661 -461 253 145 -152 -21
7418 -21 118 -332 239 -632 83 -434 -759 -568 531 -71 4 -201 355 127 -685 257 -174 -368 524 -367
7438 -367 -203 107 -146 153 -425 128 90 322 121 -265 192 -425 -115 11 -447 -292 419 -344 -915 -424
7458 -424 -105 -318 625 319 154 -424 36 616 1426 -241 -699 272 -91 -1546 633 409 -322 519 -933
7477 -933 664 861 -625 741 322 -227 611 -110 588 268 194 -589 185 -113 230 140 19 608 584 -273
7497 -273 -310 -701 -641 -30 83 -329 -772 588 -637 -254 387 -210 -355 710 -24 -634 604 -194 101
7516 101 -1082 384 -348 65 184 -762 -194 259 -408 410 -563 -345 -194 -419 -156 -301 -640 -752 -146
7535 -146 -1463 -503 298 263 135 93 345 207 6 188 388 552 437 274 731 -348 283 -1118 375
7554 375 -329 -1159 -158 512 1060 -1223 -235 92 799 -128 308 787 258 789 197 -245 -728 -328 -482
7573 -482 -62 621 1192 592 502 -630 -156 -21 234 -136 -659 -312 -43 17 -315 234 197 -186 -348 -242 -321
7594 -321 -406 28 -385 179 705 280 363 -207 -130 182 139 347 345 451 261 -656 674 54 26 532 220 175
7616 175 185 163 270 -39 -518 1033 -617 -224 699 -187 -195 384 -183 425 770 -590 338 -224 -256 374 189
7637 189 253 365 -451 -254 616 -97 442 546 59 -241 356 -521 504 638 674 -551 -372 557 268 -327
7657 -327 -276 -218 -743 402 -540 -253 -367 875 -687 -615 52 -1026 -628 261 354 -53 -767 369 -814
7676 -814 -491 116 -784 -532 -257 -336 -1061 289 371 -182 -220 -303 -385 805 -451 261 -452 -286 -50 328 277
7697 277 -1125 -379 1053 135 -744 -200 -48 549 -890 -706 -518 -178 -466 -498 512 48 -330 409 -330
7716 -330 75 576 -290 -717 86 4 488 30 528 -994 -476 -138 320 249 381 -274 -615 66 -813 -232
7736 -232 666 770 -6 168 142 351 309 21 -15 -161 264 115 -188 -419 344 266 -209 -145 61 -478 -73 -307
7758 -307 -406 -292 -724 265 1232 85 -140 416 1105 616 -144 -610 542 257 147 432 -168 113 55 436
7778 436 -52 990 9 238 -136 -128 412 318 -415 652 -273 -157 -419 -171 -137 -463 -67 -129 -824 20 555
7799 555 -237 351 284 -840 -51 -501 -175 -571 438 -260 -250 606 297 -108 -524 -67 -220 153 -111 229
7819 229 317 547 153 -541 49 326 -439 -506 -675 63 64 -521 -556 -499 456 284 -756 237 -777 -269 -535
7840 -535 -64 88 189 145 148 -228 -260 181 125 503 -782 -3 108 -514 888 -332 -50 -246 -320 -137 526
7861 526 -283 477 -19 -271 -50 491 -241 730 375 -33 -252 -389 80 75 57 126 269 -356 36 449 -423
7882 -423 -418 -215 -42 -108 -533 -328 -97 236 -172 151 -339 245 222 492 69 -650 28 117 -413 -339 -384 -410 -123
7905 -123 722 -368 403 61 226 518 317 -446 62 688 -526 -373 -432 269 -412 -204 152 -481 -86 887
7925 887 -177 260 365 -444 323 -81 -974 453 497 568 -343 -71 340 -615 210 -93 473 617 445 18
7945 18 -440 -209 1008 -254 547 -15 492 -403 388 109 66 -121 191 38 -477 118 -200 85 -247 350
7965 350 -1070 369 -421 -550 379 -673 735 615 -390 -902 -44 -255 20 -667 -152 1082 262 125
7983 125 -75 -209 101 -701 -1282 -806 -337 779 -930 -605 -330 -1747 24 -893 -537 -162 533 536 -542
8002 -542 -23 -436 -1417 884 -1154 1491 435 434 698 -915 325 -323 -445 999 1112 552 -1110 -846
8020 -846 39 200 -152 -164 -938 -1172 420 -40 -261 -230 272 -683 -746 -511 -50 -299 29 312 -457 -252 -168
8041 -168 -533 -1009 493 355 40 97 443 452 -1344 170 559 1238 268 -25 -130 213 -123 -690 -533 130
8061 130 -148 273 577 -1148 -221 322 -466 71 719 -349 -242 1178 -92 687 -844 481 176 65
8079 65 -41 81 223 -28 23 1249 -743 -360 270 -41 -1587 378 344 -194 364 -1146 582 336 424
8098 424 1642 782 -1624 1263 644 410 853 -33 -426 540 -592 -789 -642 -860 250 125 181 192 903
8117 903 645 -413 -293 -141 548 374 -1008 -100 339 -442 -86 -600 -824 -393 -158 717 -54 228 104
8136 104 496 -589 -39 401 92 155 773 343 -397 238 35 174 223 143 -253 -326 -541 165 -348 256 429
8157 429 1095 72 -317 175 -193 539 -497 430 -299 -238 -409 -501 -150 259 250 -291 -154 -154 418 146 137 -540
8179 -540 123 314 487 -580 365 -134 136 -188 -300 -364 -362 -343
8191c43
$$ Imaginary data points
##PAGE= N=2
##DATA TABLE= (X++(I..I)), XYDATA
0 0 0 0 0 0 0 0 0 0 0 0 0 0 -28 32 -32 32 -56 64 -64 94 -96 127 -156 187 -219 252 -286 345 -389 448 -516
31 -516 594 -673 764 -864 978 -1103 1236 -1384 1545 -1723 1915 -2126 2358 -2611 2889 -3188
47 -3188 3521 -3880 4273 -4705 5181 -5710 6294 -6944 7673 -8496 9430 -10506 11755
60 11755 -13234 15002 -17176 19912 -23488 28361 -35470 46917 -69572 226945 -556557 114797
72 114797 343914 -601293 451146 -14392 -252789 347587 -146816 -4390 203280 -144783
82 -144783 94213 -34643 2336 62041 -66332 65827 -43561 -54324 61756 -102773 23413
93 23413 4501 -20989 129679 -16969 -51866 40884 -76077 -51708 8263 -59524 -22001 76846
105 76846 -37271 -18394 76684 -83610 -118 55930 -112125 64543 7542 -108866 111016
116 111016 -44371 -71352 80457 -79127 23262 84118 -48646 53880 29118 -24314 23171
127 23171 -33653 -37232 -2611 47197 52262 4395 46378 8830 -16915 48819 13586 11782 14965
140 14965 -22352 27478 47117 11711 5200 6556 4496 5756 37622 34783 23589 34331 -6306
153 -6306 -13549 -10495 -16221 24053 1593 8904 41586 -11600 15409 13659 -36009 22887 -13661
166 -13661 -48377 36497 -9249 -23918 38272 -32502 -23486 23217 -44652 -6550 39676 -22024
178 -22024 5457 2097 -46016 -1643 -13040 -32367 12749 2086 5724 20192 -7072 -8280 -10223
191 -10223 -15308 -4587 455 8802 -424 -1354 15263 6533 7249 -2831 -16127 10977 16967 12325
205 12325 25027 6991 -2351 5309 -12001 -1546 29912 13230 18573 29539 -11298 7131 18086
218 18086 -22094 23937 17976 -25427 29484 15062 -473 28097 -16277 -13161 2349 -6752 13318
231 13318 -5468 18143 7195 -29057 19865 -36534 -23587 46087 -52151 10880 30672 -74324
243 -74324 31735 -9792 -60320 52649 -46715 -26221 50254 -57058 16277 4350 -66448
254 -66448 22912 -28672 -27367 20810 -34551 23407 2485 -24605 18583 -46222 1949 9972
266 9972 -44274 47851 -19364 -33427 53889 -50007 7690 43928 -55472 44520 16366 -41057
278 -41057 57300 -24326 -17149 48886 -47489 10862 32134 -27670 52094 18269 -18068 34847
290 34847 -15430 -7092 22456 -8915 10579 4565 4895 10237 -9000 21087 2645 -4993 32253
303 32253 -15435 -1511 23871 -32083 6399 7229 -38218 13579 1155 -15117 31286 -2619
315 -2619 -8500 11144 -23933 -10261 -3825 -24142 -904 -2940 -15373 672 -5655 -8501 5570
328 5570 -1440 -9216 1424 -7329 -15842 2633 -11069 -18812 4728 -10264 -8932 21104 2661
341 2661 4645 17236 -10717 -4161 3275 -16375 1054 11182 -4397 5851 15851 438 8203
354 8203 20752 1025 6825 17784 -8021 7193 16138 -13826 12264 11650 -15287 21463 17911
367 17911 -4721 25788 10571 -9400 10424 -5664 -12613 10625 -3653 -6027 17937 -2766
379 -2766 -7608 18722 -6213 -8029 17092 -18331 -9568 7685 -27585 509 2547 -29525 9583
392 9583 -2656 -17902 16476 -9266 -11482 3670 -20956 -14630 -11854 -14075 -6493 -9120 3590
405 3590 -9821 -3512 10251 -18403 5087 3825 -29044 12411 -8929 -22009 22997 -14981 -4541
418 -4541 23950 -18739 13911 15627 -15353 24357 3235 -12983 13281 -8204 1263 15699 1867
431 1867 13697 8190 7921 17924 4653 9919 4812 -2212 12292 -588 3614 15894 -3863 11499
445 11499 15661 -3350 16649 1910 -5227 22021 -7628 -4580 12513 -21754 6458 10118 -17278
458 -17278 20227 -4324 -11887 19473 -19661 805 4522 -29297 11011 -14984 -16205 21297 -27673
471 -27673 1814 9828 -28835 17519 -13264 -18741 17739 -31390 2931 5027 -29174 17769 -20379
484 -20379 -5425 22941 -28794 18822 -608 -32605 34457 -18011 -10734 25070 -33447 15686
496 15686 14868 -20366 29750 -5452 -8557 21799 -9676 8954 4873 -5270 14050 -2343 11918
509 11918 6412 -4731 15166 -3381 10020 14010 -11731 16413 1917 -9366 19099 -4796
521 -4796 128 11142 -8415 8391 6323 -6377 5363 -2999 -10018 -3 5171 -6245 -5419 5585
535 5585 -10574 -4417 8519 -14634 -6585 -2600 -17177 7542 -3736 -17567 1966 -10819 -11277
548 -11277 6446 -8406 -12822 -4246 -5083 -3410 -2398 -7911 -14281 -4733 -315 -4781 5635 -1152
562 -1152 -13055 11364 2871 -13397 10003 -6241 -11294 18577 -582 -488 14890 -8974 5581
575 5581 17764 -9256 6831 14373 -6637 5853 12612 -2543 6274 12144 -1439 8223 14302
588 14302 321 15064 10182 -9328 13600 5294 -7750 14323 2433 -3399 16395 2271 4072
601 4072 7314 -5802 1458 4367 1432 -1808 -1936 -912 -8364 7641 2528 -16186 6590 -4463
615 -4463 -7599 15081 -12902 -9806 3454 -22910 -551 2161 -21890 5481 -1511 -11694 10196
628 10196 -8263 -14727 2178 -11832 -5428 3006 -10366 -3145 1127 -5941 87 -1026 -1148 246
642 246 -1426 6594 -3548 -2248 6451 -10250 596 7945 -8056 16643 6956 -4239 18062 -7111
656 -7111 1542 16613 -15498 10365 6901 -9508 25314 -3475 -2076 22947 -14508 12177 13404
669 13404 -13946 17361 -184 -2587 13803 -12903 4850 2529 -3755 16574 -6759 3682 6865
682 6865 -15344 13135 -8921 -12909 11498 -19762 4435 9493 -19896 13548 -8905 -14614 15468
695 15468 -21594 -1917 7127 -23423 10096 -4073 -18928 8814 -11073 -5215 5910 -9250
707 -9250 1354 -1750 -3260 -3055 -9113 481 -7843 419 7365 -9772 8362 3449 -8220 14048
721 14048 -7564 -4485 13276 -9150 9209 11146 -9506 11197 3911 -4548 11850 4555 5
734 5 10502 6955 -942 2420 7189 -3178 5981 10407 -7626 9485 10156 -7403 10791 2938 -11988
749 -11988 8838 -2410 -2790 11190 -4356 -303 3987 -7135 2007 -1233 -6546 2050 -3332 -4801
763 -4801 -757 -6152 -6255 -2061 -5836 -6044 -1121 -2173 -6095 -2993 -4580 -11861 -4988 -4428 -11282 -2629
779 -2629 -3044 -9735 774 -1169 -8693 -1158 -5473 -8552 2480 -3413 -5986 2061 -3895 -3447 2627
794 2627 -3507 251 4328 -2396 1254 4125 -5298 4349 4252 -6140 5639 3096 -1298 11984 1346
809 1346 1499 9325 -3015 2187 6669 -2022 5266 2450 879 4929 717 4888 2108 -558 7186
824 7186 -1278 2854 4148 -4765 3544 -2685 -5258 5237 -5757 1362 5180 -7607 6097 -2693
838 -2693 -9982 6241 -10143 -6593 6378 -11945 -1381 2583 -11540 1311 -3621 -6507 2184
851 2184 -7361 -3427 -382 -7123 -30 -4773 -3699 1056 -6648 3150 1989 -6509 6916 -1751 -4523
866 -4523 6665 -6890 1644 5910 -6452 7121 2613 -2212 9525 400 2802 6250 -995 5790
880 5790 2491 3028 6797 -638 6829 3392 2366 9273 -2225 8143 7707 -5631 13420 -1030
894 -1030 -5222 14137 -8050 3080 12913 -11967 9715 5511 -10000 10594 -2353 -4695 5784
907 5784 -5569 -809 -1230 -4803 1090 -4955 -1242 -2725 -6014 3451 -6765 -2617 -870 -11344 257
922 257 -4323 -9790 2957 -8899 -4405 2183 -9618 2820 -473 -9141 3457 -5061 -6663 2788
936 2788 -5588 -1175 -197 -4818 1591 -1826 1358 4915 -3583 2607 2495 -2096 8073 -647 -2291
951 -2291 6388 -2569 4534 8156 -705 6581 3186 2791 10177 1172 4429 3472 -1736 8674 2084
966 2084 1919 8427 -2280 5831 4962 -387 6909 -845 3531 4674 -5349 5334 -3452 -3533 6759
981 6759 -5304 2145 2637 -6504 6649 -1971 -3274 1748 -10067 495 -3138 -6153 4972 -10310
995 -10310 -4447 3225 -8030 278 -1381 -6317 -1538 -3910 -3132 -4757 -2198 -4931 -9025 3270 -4670
1010 -4670 -2632 9145 -9797 -727 2962 -10505 7156 -1185 -7485 6675 -8173 1706 9112
1023 9112 -6053 5209 203 -2808 7703 1148 4401 317 -276 5218 -3349 6299 3905 -3293
1037 -3293 12178 360 -292 11868 -6967 2424 8192 -7710 5264 2150 -5562 7080 -604
1050 -604 -1543 3568 -4192 -1423 4465 -695 -1445 -1994 -3736 -4515 -1263 -1059 -4352 -3273 -2751 -3537 1519
1067 1519 -365 -9587 -2335 -4426 -9933 4652 -3823 -10332 4661 -8126 -4538 6110 -11357 -1842
1081 -1842 2808 -11928 3581 -833 -8824 4842 -4555 -5596 2191 -3516 2406 1286 289 2460
1095 2460 -4041 4781 314 -1041 6850 -5548 3840 10097 -4845 10131 4822 -6437 13283 1818
1109 1818 723 13078 -4125 6642 6135 -5554 9711 -18 2786 11852 -1236 5610 3945 -1223
1123 -1223 9361 -765 45 3931 -5815 7212 2215 -1548 5664 -7293 1734 4853 -4999 4985
1137 4985 -3052 -4248 4517 -6071 -732 -3277 -7571 3366 -5089 596 3248 -9205 2982 -3951
1151 -3951 -6787 4570 -8518 -2354 2747 -8407 2978 -2682 -4588 4099 -4589 1205 1175 -4436
1165 -4436 4709 -1590 -890 1243 -4889 2536 559 1930 7185 -971 4054 4069 -1500 6677 199 -822
1181 -822 5732 -314 2837 6221 1030 4111 4031 3472 2302 4288 5432 3367 3614 2566 -750 2061
1197 2061 959 1546 3971 831 2674 2562 950 3268 -657 -150 -927 -1734 1217 -2229 -1259 934
1213 934 -3185 55 -9 -2923 1942 -2254 -1822 350 -5654 -2395 -2855 -7328 182 -1752 -1625 3733
1229 3733 -1702 -360 1490 -4013 -325 -1934 -2629 1308 -4332 1733 1492 -2229 5259 42 -1308
1244 -1308 6675 -1115 2116 6862 -5352 2373 1881 -4959 6097 3445 1718 9977 1500 3720 7338
1259 7338 38 4290 2431 -347 5387 1024 2762 3871 1831 5277 2371 2132 5077 -1955 5085
1274 5085 3672 -3706 3657 -3534 -3882 7336 -3784 1140 8491 -5616 4092 2242 -8382 2636
1288 2636 -5456 -5255 2681 -8428 -904 949 -5417 3026 -2718 -3953 906 -6253 248 -4100 -6368
1303 -6368 -159 -8948 -1184 -1012 -6937 5125 -3251 -2421 6199 -9036 -93 701 -9005 4075 -3290
1318 -3290 -5450 5023 -4093 2097 3928 -3148 5092 -44 1396 4573 -3852 3521 -220 -2024 4848
1333 4848 -2360 3617 5627 -267 6974 716 -277 6121 -3838 1750 2933 -4796 4419 497 -693
1348 -693 5390 -2683 1269 4660 -3282 1155 998 -2965 -20 -2448 -3020 -481 -1945 -63 1129 -383
1364 -383 -1335 -1116 -1891 -3077 -2902 -2251 -3309 -3182 -849 -2763 -2320 -1040 -4276 944 -545 -5034 844
1381 844 -2294 -4357 1328 -4300 -3074 1203 -3254 1832 2659 -861 2181 -907 -110 372 -762 1275
1397 1275 85 2692 1686 820 3365 322 2700 4219 -471 3798 1306 716 4932 -563 1144
1412 1144 2632 303 3419 1829 3737 2528 440 4486 -1134 145 2965 -2678 3943 157 -3582
1427 -3582 5138 -4030 -1478 2771 -4694 2037 -1180 -2638 2469 -5654 -603 -1000 -6837 1549 -5706
1442 -5706 -3878 2498 -7235 1238 -2285 -7740 2994 -5950 -3313 2029 -8307 1253 -1434 -7305
1456 -7305 1810 -5219 -3227 2216 -4099 2638 -206 -2042 2642 -4521 653 968 -5171 4403 150
1471 150 -889 6459 -2329 1382 4831 -2480 4581 3369 -806 5708 866 92 3126 -346 2884
1486 2884 3761 2067 4710 3961 3654 2540 -14 963 -414 756 3523 -435 2921 2594 -1188 4598
1502 4598 997 -2241 3342 -1098 -739 3020 -4767 -2266 -636 -4679 574 -828 -1291 1437 -284
1517 -284 754 -1588 -4992 -2725 -4970 -2842 200 -3865 74 -1549 -3662 1831 -2130 -2637 241
1532 241 -3897 73 -294 -4179 -904 -2630 -2603 837 -213 3031 2374 1478 3211 -879 548 -454
1548 -454 -3318 3341 161 997 7572 -579 2954 6311 -2963 4679 3064 -2260 6138 149 -689 5275
1564 5275 -2798 1785 3318 54 5224 2770 2987 2086 -2011 1294 -3816 -2952 1899 -3996 2894 1758
1580 1758 -2937 4572 -2423 -3394 1930 -5508 -890 123 -5504 -680 -4068 -3829 -1304 -3820 -590
1595 -590 -2209 -381 914 -4037 -118 -6823 -7311 397 -7321 -739 2246 -5745 3557 267 -4330
1610 -4330 1291 -4538 -1963 1258 -2356 976 -2019 -12 1068 -1427 3961 -1144 1940 6046 -94
1625 -94 5344 768 -4745 4866 -2925 921 7124 -1761 7556 5704 -361 6604 -1395 18 4562
1640 4562 -2407 4591 1848 482 5376 -912 2320 2190 -2267 5563 1111 691 3874 -4619 -106
1655 -106 384 -5283 1606 -650 -468 4006 -629 178 -1964 -3946 -1357 -4271 -2192 -598 -4051 818
1671 818 -864 -3998 111 -3697 -3027 1571 -2376 -1025 -291 -3443 -792 -3140 -4966 -873 -470 667
1687 667 3381 -592 -469 -124 -2864 -831 -582 -1585 1098 2222 1197 3135 708 299 495 1799
1703 1799 2377 -49 3157 4309 -73 2995 -547 -1834 4782 1616 2086 5052 1153 3197 463
1718 463 -662 416 -2436 1484 1993 777 3870 -447 269 1225 -3106 369 -2156 -2312 3126 -2115
1734 -2115 15 758 -5563 778 -1819 -4679 1475 -2369 -467 1054 -5567 -1485 -3406 -4110 1090
1749 1090 -1998 1489 118 -2801 1696 -3561 -3825 -781 -5358 388 1823 -1921 2965 -1035 -828
1764 -828 1408 -4044 -30 1633 -899 4053 679 -388 1102 -1296 1543 1905 1632 3715 1393 3473
1780 3473 3116 -1435 1804 -607 578 4188 1599 3232 4597 1832 1541 763 -1231 597 1146 1860
1796 1860 1362 353 1252 -726 257 -1667 -941 975 -238 1261 1357 -3083 -2206 -2149 -3829 307 -1959
1813 -1959 -789 863 -382 201 -1624 -4626 -2640 -5341 -2172 -2376 -2356 667 -2407 -1508 -736 -3919
1829 -3919 -591 -1697 -2168 1080 -2665 -2819 -747 -4612 -1173 -2836 -2667 3400 1030 996 2802 -3003
1845 -3003 286 -1611 -3591 1057 -393 1564 2931 374 3254 2 -614 3050 -265 868 2310
1860 2310 -809 605 816 606 829 -925 2229 2884 1452 2927 -214 -529 1133 -3964 -537 256
1876 256 -3032 2211 1326 -583 837 -1430 -777 -216 -2611 -383 -2036 -1476 -173 -3258 -1663 -1318
1892 -1318 -2951 -151 -1577 -1013 218 -2174 -259 -1622 -4292 -1611 -3685 -1658 2633 -2125 848
1907 848 961 -2285 751 -1705 -2660 428 -928 939 1938 -833 1630 -417 150 2255 -185 2442
1923 2442 2395 238 4180 -1031 -920 2118 -1122 3256 2718 93 5038 953 1431 2673 -2436 1107
1939 1107 1961 -1010 3175 1700 -96 2917 -211 1190 1269 -1516 1247 778 649 -262 -3166 -589
1955 -589 -1426 -2139 1308 -1543 -998 2119 -2318 -452 -1598 -4477 -252 -1668 -2639 -667 -2480 -638
1971 -638 -16 -2046 -1603 -2867 -2972 -302 -2254 -1104 -1082 -2302 -1117 -1730 -975 1073 -1081 1344 1607
1988 1607 -1652 536 -328 -2383 378 -1066 -1221 1822 658 1937 2260 282 149 359 825 619 2382
2005 2382 1760 609 2529 3016 207 2700 1725 836 3293 47 2509 1874 -166 1129 29 -162
2021 -162 635 224 1981 289 1929 1242 -2032 854 -367 -2449 2352 -1674 -538 2675 -1843 875
2037 875 977 -2607 -170 -1220 -381 130 -2385 -628 -3236 -1127 -317 -3066 1192 -418 -549 2088
2053 2088 -3386 -978 266 -4586 1241 -585 -1274 2830 -464 815 1908 -1128 1936 -68 -419
2068 -419 1505 -254 1302 1729 158 4224 -971 810 2853 133 4163 -386 -567 2924 -1738 845
2084 845 3492 -1201 3318 2799 389 4695 270 398 1495 -1741 2203 -321 -519 3345 -935 1554
2100 1554 1548 -1986 1267 -1028 -1353 1312 -2601 -1652 279 -4061 -637 -907 -3863 -385 -308 85 -171
2117 -171 -2786 -2711 -2402 -2264 -2242 -2808 -1845 -740 -2175 -537 -885 -2004 -379 -2674 -1718 611 -1943 -1254
2135 -1254 -198 -2166 438 -733 -2756 1835 498 -64 2474 -382 746 831 18 857 840 836 2101
2152 2101 1225 3811 1537 1812 2569 77 2655 1110 733 3505 1197 1958 3285 356 1912 1503
2168 1503 -230 2676 1163 -308 1216 -651 -300 1230 -413 300 692 1501 1121 -185 -208 -1547 -1858
2185 -1858 -202 -2205 -744 10 -1321 271 -764 -2096 -1305 -2069 -1609 -477 -1347 -999 -1779 -1787 -1080 -2009
2203 -2009 -1431 -1205 -104 899 -1051 -138 -608 -2451 216 -1533 -1202 489 -338 1579 1364 -181 650
2220 650 -684 229 889 307 2678 470 1268 2507 -589 1733 957 -188 3806 799 1587 3317 -1565
2237 -1565 1928 714 -905 2181 -260 2561 2597 82 1971 37 13 817 -1193 1333 -1 -1559
2253 -1559 2063 -627 -638 1236 -2890 911 169 -2780 1289 -2313 -1846 501 -3033 -1337 -744 -1858
2269 -1858 742 -376 -1268 113 -2663 -309 -1956 -3230 289 -2420 723 973 -2379 1744 -1451
2284 -1451 -2225 1731 -1156 72 546 -1360 1103 -36 -834 1128 -186 2297 2575 749 2315 968
2300 968 316 1918 -1264 1199 1950 183 3179 3299 1528 3161 2041 986 1985 -101 1173 2722
2316 2722 241 2365 779 788 2344 1101 834 1324 203 1643 484 -740 62 -2175 -204 -327 -143
2333 -143 1358 -1125 385 1335 -1180 -841 -1772 -2454 -775 -1853 -1808 -495 -1363 -1972 -104 -1606 -137
2350 -137 -1093 -1105 -279 -2380 -774 -2605 -1760 -1841 -1841 -676 -333 -698 335 856 -953 164 -1411 -1305 -717
2369 -717 -456 217 1066 1146 871 958 -467 1457 1118 1411 162 1199 195 -272 889 745 220 579 1492
2388 1492 529 1767 1258 245 345 72 656 -515 64 -17 1554 1439 -400 90 340 -739 -194 -1070
2406 -1070 -990 -1315 -2197 -106 -2765 -1408 -1177 -800 -580 49 -1208 157 -1338 -1326 -762 -2223 -1192 -202
2424 -202 -923 167 -1267 -1493 438 -1902 -1282 -205 -3346 -19 -315 -950 496 -655 -1135 -383 -2
2441 -2 2306 811 645 637 -70 664 266 -1066 2105 605 1746 2376 -2 2682 1996 -673 2661 -86
2459 -86 -310 2351 240 2027 1848 -717 1438 232 319 1448 975 681 1380 -611 1395 -411 -125
2476 -125 891 -995 1618 597 -1108 836 -2199 -1704 250 -3069 -579 -397 -2775 455 -2020 -2140
2492 -2140 -314 -3587 -989 -748 -2647 -351 -1326 -1437 -1161 -2112 -108 -1701 -2382 356 -2238 -1040
2508 -1040 686 -2070 -494 94 -1585 1036 -723 303 1015 -820 937 320 -1117 974 -114 468
2524 468 1728 1034 1328 1041 1124 1701 626 455 866 545 939 706 989 1302 662 566 1312 1079 474 1336
2544 1336 264 1093 1202 -185 -520 455 -34 368 1083 -21 306 -213 -261 -572 -842 -1052 -502 -900 -1007
2563 -1007 -274 -877 -1012 -421 -345 -652 -1193 -960 -1330 -1209 -628 -1885 -595 -269 -1761 458 -351 -1422
2581 -1422 705 -337 -930 91 -1229 -788 -4 -520 309 388 313 1199 395 857 1439 923 693 786 1029
2600 1029 612 733 713 1391 320 1289 1042 1002 2057 1105 810 1342 249 171 836 500 1016 1435 -46
2619 -46 1585 793 513 796 -20 -216 -211 -95 -92 -1138 -145 -429 -648 239 -1659 -968 54 -2157 -661 -1051
2639 -1051 -2485 -897 -2238 -1821 -441 -1792 -774 -836 -1843 40 -1402 -1588 -550 -2093 -320 -1024
2655 -1024 -1502 546 -1521 -19 352 -1923 1592 -242 -1197 1911 -1166 541 1210 -1496 1386 455
2671 455 -737 2472 205 1486 1887 -34 1382 134 485 2049 -222 1658 1401 298 2109 -30
2687 -30 642 2057 -366 1766 1650 -1281 2076 163 -660 1686 -668 602 914 69 1347 -101 -238
2704 -238 -310 -1181 53 -690 -1006 -559 -901 -170 -145 -1226 -265 -979 -1154 -94 -1081 -1021 -1056 -1828 -1499 -1662
2724 -1662 -1556 -811 -921 -767 -610 187 -554 -1007 -472 -557 -334 -332 -672 595 462 -264 180 -280 -392 340
2744 340 888 1314 486 243 1166 -131 593 259 436 1477 348 1637 614 1023 888 252 708 993
2762 993 645 770 1378 543 799 241 181 885 38 509 1291 -208 1149 -392 -262 30 -823 -606 594
2781 594 -1377 -831 -550 -552 -990 -607 -2047 -490 -1223 -1319 -315 -1367 -1055 -401 -2449 -1004 -1622 -1323 -1476
2800 -1476 -866 440 -1699 -664 -602 -1313 -255 -88 -1298 677 -41 -318 1083 -643 -82 836 -653
2817 -653 583 674 158 1347 496 838 1666 568 1173 1168 1101 2012 375 1471 1185 143 1837 1147 842
2836 842 2883 754 1489 1640 -485 1775 468 -512 1888 10 462 1149 -108 1021 167 8 984
2853 984 -655 -52 592 -915 36 -961 -1095 90 -1547 -422 44 -1343 52 -657 -1667 1 -1690
2870 -1690 -1103 -547 -1869 -922 -619 -1450 -372 -1384 -951 -437 -1552 -476 -703 -933 172 -775 -187 154
2888 154 -692 338 -325 236 989 46 107 310 -416 279 401 571 1207 694 1418 706 522 754 646 965
2908 965 1084 633 614 770 616 601 256 78 331 703 513 636 656 566 -265 -379 -34 -301 -400 -529 129 -449
2930 -449 -546 -486 -816 -495 -963 -709 -215 -463 -826 -285 -1498 -834 -1044 -766 -643 -1326 -707 -945 -1038 -848 -1397
2951 -1397 -942 -472 -866 85 68 -986 -339 -288 -1159 478 -704 -384 1253 -298 117 1237 -696 685
2969 685 -284 60 1544 434 1075 640 1284 1621 -181 1117 1312 -302 1948 984 113 1668 -138
2986 -138 911 2224 -466 889 1867 -214 1788 -187 13 1094 -1092 136 -566 -1033 991 -750
3002 -750 -841 220 -1390 -763 -217 -899 -111 -1643 -1141 -309 -1913 -297 -1525 -2172 469 -1756 -897 -19
3020 -19 -1741 -1094 -592 -2208 -452 -515 -1317 -325 -415 -944 -833 -551 -209 -814 -739 317 316 955 -146 441
3040 441 424 -1436 -57 853 358 2502 716 -531 537 222 -636 217 -158 1398 2117 552 925 296
3058 296 492 622 635 1150 1028 576 413 -452 584 1085 647 757 1105 335 1319 -346 -898 -729 373
3077 373 -4 -250 -201 -163 -1457 -180 -461 -879 -106 -253 -1347 356 -1303 -445 -310 -372 -140 -176 -493 -1851
3097 -1851 -923 -405 -1089 -865 -836 -1316 -1083 154 -825 20 -375 486 729 -80 704 532 63 172 143 1004
3117 1004 1082 222 1441 1079 590 499 771 689 110 672 800 875 1039 1375 215 675 770 539 1519 573 1210
3138 1210 1511 -135 831 500 290 1002 1066 895 860 -947 1314 -58 -696 -600 -512 291 -302 -694 291 -717
3158 -717 -292 -77 -1826 -304 -98 -1715 -860 -1492 -1937 28 -1426 -1388 -283 -921 322 -823 -1643 -896
3176 -896 -772 -1709 -1212 -916 347 -898 198 -605 -1408 511 -131 597 894 -604 -242 1183 -1495 1050
3194 1050 17 508 1573 514 316 1377 1500 884 868 1198 -218 1547 330 1008 983 625 1474 -463
3212 -463 -182 733 884 1569 -356 1399 608 400 1310 -777 599 -1257 41 -876 639 -84 -240 438
3230 438 -1780 -963 -674 -452 212 266 -681 226 515 -1207 414 -709 -891 -1732 313 -1067 -211 -1618
3248 -1618 -633 -271 316 -754 -777 297 -1043 -48 -1662 -1175 -403 -1175 547 349 1499 273 -1528
3265 -1528 -698 -444 757 818 682 -1112 261 1336 804 1724 579 412 1247 551 1166 1181 487 358 207
3284 207 966 311 2021 -472 694 1409 1478 254 337 -370 323 512 -105 -27 -616 -555 -676 -614 514 29
3304 29 -475 -1022 -1136 42 -2612 -729 -1447 -664 -357 -1821 -865 -504 -413 -1562 -495 -2241 -449 -517
3322 -517 -867 -346 -653 -537 -116 -1251 -1326 -755 249 426 -855 1384 19 -148 412 -1111 -1136 1805
3340 1805 -931 252 1066 686 1036 -576 -215 1285 114 237 1486 336 577 1902 280 1358
3356 1358 -33 1624 1315 371 768 -510 1589 -71 -279 806 784 373 1668 -82 743 1050 12
3373 12 -108 -85 -856 -426 249 -779 817 -433 -774 -406 -778 268 -246 -389 -389 -638 -1158 -760 -1203 11
3393 11 -855 -394 -460 -911 -486 -564 -1124 -825 -849 -897 525 -223 13 -5 -751 189 -777 -1014 -193 -828 415
3414 415 -376 171 -278 176 107 589 196 198 506 798 184 626 800 320 329 592 682 320 1522 1318 12
3435 12 -556 -2 290 457 161 476 568 558 482 328 550 178 -103 -387 194 -333 -411 402 -1066 -261 -641
3456 -641 -743 -190 -106 -940 -93 -531 -11 -1190 -1753 -1508 -638 -786 -1052 -284 -638 -638 -1006 86 -597 -608 -534
3477 -534 -1221 -201 279 263 -578 -359 -327 567 -335 -378 1820 191 378 699 -802 -154 973 383 843
3496 843 1277 796 709 -89 1983 682 620 -6 -20 1029 727 1802 1870 71 667 1434 350 1290 433
3515 433 932 367 -203 -951 788 -1002 -12 1215 0 1382 646 -822 -1149 -1182 -1177 129 -744 657
3533 657 17 -147 -1552 55 928 -409 -1494 -647 -791 -95 -136 -867 -909 -296 -1808 13 355 -428 -237
3552 -237 -352 -58 -527 -1883 -276 -1480 548 -271 364 -427 1293 178 285 -500 -419 238 425 691
3570 691 452 -376 306 199 440 791 -94 968 1031 171 247 620 333 1031 74 573 878 1094 1066 1083 264
3591 264 1141 -620 -513 503 131 696 69 -61 206 -308 -98 59 199 264 -457 109 -233 -1414 -461
3610 -461 -1083 -640 -845 -433 132 -36 -399 -1283 -25 -742 -654 -803 -749 -942 -807 -376 -408 -303 -954 352
3630 352 -430 -787 129 -192 -254 340 61 -327 -433 -376 723 691 817 633 1041 1476 -44 1173 738 948
3650 948 1123 873 6 482 391 595 1129 -103 2 754 329 794 649 404 412 215 -377 -51 455 716 752
3671 752 -390 146 331 -888 -466 658 -664 -739 323 -231 -409 -1021 -941 -868 -870 -1517 -1071 -403 -1575 -1748
3691 -1748 -350 -1173 -1059 663 -2656 -1114 -1541 -577 -1360 -775 -760 -870 -703 1534 -166 -1269 1210
3708 1210 628 266 118 -265 -675 919 -414 -417 39 -532 -197 1319 1565 974 537 1484 -655 1067 -394
3727 -394 9 916 -32 -785 212 -317 1153 1098 -531 557 903 -302 249 292 -27 -236 422 499 101 -557
3747 -557 565 120 335 585 -845 -1005 73 -368 -1137 -715 31 -529 -577 -238 -1356 -1216 -1256 -1408 -1761
3766 -1761 -595 -1563 -1593 148 -919 108 -272 -669 -934 -833 -199 12 -738 322 -299 -941 -239 -402
3784 -402 104 15 220 708 -637 988 380 -78 -206 173 649 1388 870 -204 610 -27 553 860 -1033
3803 -1033 -584 -184 -357 1445 1352 842 1261 908 99 -353 19 429 581 936 583 738 -207 726 -594
3822 -594 -428 1142 573 877 -276 173 -1514 -1104 -288 -75 -1742 -340 -81 58 26 -468 -793 -1047 -1280
3841 -1280 -852 -766 -852 -106 -832 -600 -126 -515 -804 58 -945 -291 -553 -1074 -787 -92 597 -343 588 899
3861 899 -503 -81 282 299 -419 947 -506 672 833 -290 200 315 701 89 739 426 426 422 539 856
3881 856 261 817 98 661 521 350 1486 409 1215 891 63 913 320 487 123 467 457 1328 -123
3900 -123 819 122 -601 -167 713 -140 322 -79 -489 -39 -826 -85 -1235 -364 -70 -781 -272 -508 -793 -131
3920 -131 -1709 -447 -79 -843 342 -395 -335 -153 -915 -73 -688 -616 -124 -70 -563 159 180 -260 -496 -576 816
3941 816 246 178 773 -179 182 451 -57 917 -532 238 739 631 471 1208 471 659 517 433 35 -25 272
3962 272 734 80 571 -27 -120 -85 -210 186 190 -60 464 -35 -678 -47 -228 -304 306 -48 2 58 -453 -438 -496
3985 -496 -849 -558 -829 -178 -221 -482 -511 -755 -535 -678 -409 -180 -747 -770 -682 -615 -673 -245 72 -518 421 -398
4007 -398 269 199 -194 399 202 -150 600 360 357 635 57 195 859 -59 -113 696 -7 618 984 504 899
4028 899 988 162 1056 683 630 340 658 612 331 334 185 849 15 453 567 621 484 329 107 -200 -329 -173
4050 -173 -650 -857 -168 -276 136 -886 -191 -253 -174 -270 -1126 -884 185 -757 -62 -809 -531 -551 -1054 -1147 -314
4071 -314 -107 -819 -87 -612 45 486 -380 -845 -529 673 -490 191 535 114 -158 -749 -358 715 -237
4090 -237 -123 -358 236 -749 -388 161 1274 -22 1372 1139 860 1012 629 530 1397 838 252 -115 248
4109 248 399 226 899 163 220 115 421 -99 317 469 252 -991 521 138 709 102 -772 978 591
4128 591 -331 -26 -25 -1014 699 -369 -160 -430 -932 -826 -837 -926 123 122 5 -493 -509 -1053 -543 1289 -1071
4149 -1071 -527 -380 -1179 -617 1026 11 -810 -795 -709 -294 -562 -82 951 200 -719 208 1255 193 1182
4168 1182 1046 134 751 880 573 346 916 -784 641 245 -958 -1027 -119 -86 656 1376 1100 1071 323 294
4188 294 921 866 237 1203 649 242 -1043 -142 915 32 392 417 221 -815 348 -67 -696 -274 -531
4207 -531 -260 -224 -187 -48 42 -1240 -989 -289 847 -1469 -1101 23 -810 217 -396 -1351 -336 -246 -1644
4226 -1644 563 -262 7 -228 -232 -482 311 437 -101 -356 -471 -1239 -224 -452 302 578 635 596 -645 619
4246 619 -32 -958 792 1100 699 1214 254 498 547 887 669 770 813 55 1451 707 -384 259 583 584
4266 584 15 -766 -345 373 176 532 -347 -36 -429 -16 149 -917 -568 -953 -725 -936 781 633 -603
4285 -603 -582 249 -909 515 33 359 -149 -172 169 -494 -224 -177 -727 -496 -646 -469 -197 90 -1025 296
4305 296 -308 -736 312 177 -1067 200 -200 -647 361 212 -376 429 637 353 137 406 16 569 970
4324 970 492 537 -37 775 1213 489 538 382 548 258 1161 856 230 1084 687 -911 -322 -81 -23 458 -929
4345 -929 805 -334 124 1608 -675 753 233 -735 125 463 -1745 637 -150 -379 -1291 -1592 -329
4362 -329 -755 -1500 -260 -1 -689 -733 -569 -743 -765 -761 111 -476 -293 242 -1188 -619 -1122 -432 -609 706
4382 706 -167 -122 -411 -153 -526 -183 509 -215 317 355 352 59 443 -24 131 464 1084 822 188 269 558 416
4404 416 284 268 210 -70 -274 437 1000 495 597 378 615 556 147 971 692 336 12 290 102 148 -178
4425 -178 340 -361 -146 1108 196 677 146 -718 224 -108 -1111 1 -411 -32 -72 -1033 -965 -199 397 -198
4445 -198 -167 -280 -1090 614 950 -307 -682 -33 -557 686 19 -234 -35 -74 -98 -600 -828 637 534 420
4465 420 646 14 695 678 -238 169 113 371 472 -64 -213 370 674 798 626 604 235 1209 736 310 -406
4486 -406 -485 1362 -626 1082 356 -299 -695 -888 705 67 99 -683 -822 129 -628 371 855 -570 -431
4505 -431 47 70 301 -1170 -753 190 -599 -168 30 -593 -1333 -1147 593 -1062 -174 2 -389 186 465
4524 465 -711 -616 27 80 689 489 -520 -1057 338 1438 -782 575 826 728 -347 -218 1316 185
4542 185 507 276 281 386 616 1599 -103 695 725 521 1224 466 531 435 79 902 836 163 941 279 823 -104
4564 -104 572 487 633 12 11 379 747 -153 1011 904 434 -907 -102 -661 -107 -14 -582 -26 12 -473 -207
4585 -207 39 -808 -690 243 -195 -592 -256 -463 -652 -584 -629 -372 -166 -361 -297 -261 228 -7 -178 -589 -452
4606 -452 217 483 138 -144 71 -59 164 -632 -48 -105 179 -26 428 -151 225 362 334 277 152 153 563 326
4628 326 197 453 -44 288 677 293 375 561 441 482 217 -68 442 -71 455 -56 -242 341 -544 -459 -49
4649 -49 -122 170 -32 74 -188 -419 200 -271 -45 -859 -343 -181 -255 103 258 -148 -422 -706 -269 168 -329
4670 -329 -801 -736 12 -773 -39 -524 -139 -720 -299 211 214 -498 -433 -100 -885 -266 -121 -430 121 -499 369
4691 369 -270 1313 450 -242 150 472 702 75 948 499 -198 309 179 885 1381 358 -397 357 63
4710 63 136 124 894 -8 -701 255 -72 32 1146 -41 -298 -88 263 -296 -498 71 481 -324 -765 313
4730 313 -415 46 829 -604 -547 -765 -572 253 395 -417 -183 -455 303 -360 -244 -105 -541 -43 -507 -657
4750 -657 -428 -267 -207 -298 354 37 -105 116 -565 -974 -170 259 -629 -458 343 441 395 175 -660 -5 -173
4771 -173 220 40 573 784 1449 637 122 607 179 -65 949 683 118 677 211 292 86 -1730 -122
4790 -122 395 1155 1098 -52 218 83 -514 75 -481 -527 -301 524 405 -1118 -217 -713 -651 845 52 1083
4810 1083 40 -22 -74 -618 309 -203 -485 393 83 112 806 285 -328 160 -479 1 -1490 -844 -678 -312
4830 -312 -325 -57 29 -925 719 1010 577 924 78 533 306 -563 -569 -260 81 -195 -603 353 966 697 834
4851 834 -568 509 -30 1578 822 1150 -829 -1076 37 196 684 422 746 -1805 219 -183 175 -393
4869 -393 -20 -372 -525 -362 -1991 904 -626 -212 -614 -546 -1031 -123 54 -806 223 119 -32 250 -667
4888 -667 -614 -940 -1039 -787 468 1168 -716 -122 -739 -986 -148 -434 -1284 -296 -603 506 1312 1664 -245
4907 -245 -1265 619 -21 165 -179 187 -303 555 173 69 591 242 810 248 106 560 240 89 1027
4926 1027 -799 -401 382 438 485 907 -375 1188 -915 492 808 909 602 -541 333 317 111 -1613
4944 -1613 -693 24 -495 40 754 784 398 1169 300 -118 517 -590 -102 818 -488 -1159 -626 518 -1139
4963 -1139 324 -119 -1260 -695 50 -675 -420 -135 1135 -256 -1072 -859 -577 -1019 1171 -202 726 -374
4981 -374 490 1057 294 -186 -1073 -499 -487 290 -18 -371 83 170 1103 1 -1199 322 711 -1409 640
5000 640 104 588 3 1395 836 -500 6 262 326 583 407 11 -465 451 -862 -895 421 -282 574
5019 574 -430 -656 362 81 -1064 405 297 -1431 -1390 827 -543 381 -1019 -1434 603 -737 113
5036 113 -1469 -567 -934 -937 1045 -264 49 -155 379 -1614 -644 -1082 -1004 -196 118 74 32 -1355 -325 -508
5056 -508 711 -691 -492 -1083 -81 -240 -128 -18 236 428 735 631 616 25 678 279 -605 -399 425
5075 425 664 598 -392 -171 595 1424 -121 1562 -622 628 679 1345 1262 62 148 -855 49 349 -376
5094 -376 257 166 132 -518 -550 -9 -414 48 76 -381 -46 -289 -652 -509 -869 -894 -69 151 733 -939 36
5115 36 358 -423 627 -343 -1017 -194 -635 -1203 -402 592 -349 981 732 -255 498 -635 591 573 -728
5134 -728 74 -649 176 95 -913 246 -627 134 341 756 -241 -219 -1139 521 162 1064 779 243 505 -308
5154 -308 698 -860 1140 -4 -345 704 246 258 600 117 412 -219 -33 -34 -638 -539 72 -293 -407 6
5174 6 -520 -390 -408 -359 -1003 -853 -270 470 -504 526 502 8 251 -101 338 -750 242 -589 -342 -771 -400
5195 -400 -1228 -576 -27 423 -745 -651 -521 -442 1177 553 -1078 -852 -114 528 209 386 -232 -223 -408 -80
5215 -80 553 -355 697 379 567 404 432 63 522 91 -71 -962 -52 529 547 371 -213 852 395 -23
5235 -23 -149 29 404 -66 333 337 30 -385 -290 -69 -322 97 -419 322 -366 -514 -250 -185 -48 252 -316 -296
5257 -296 -159 -82 -395 289 48 -462 -695 -282 -177 -366 -621 22 -694 -1090 -990 -435 -310 -257 -343 6 -315
5278 -315 -536 71 -540 303 -12 180 431 -497 -11 -200 188 241 377 424 -68 369 539 343 758 -462
5298 -462 378 388 -141 218 36 -318 484 912 -4 278 -71 -244 66 621 201 109 -474 -523 -230 -819 -1057
5319 -1057 -266 -1 -396 -205 -51 -215 -385 75 832 274 5 148 -716 -143 791 -562 -961 -480 -1192
5338 -1192 -562 -200 -314 379 31 282 156 156 -245 -138 73 22 -173 -255 -296 515 -410 166 176 275 -9 98
5360 98 -156 699 -354 -51 903 -30 -293 140 -226 524 -25 -301 610 596 407 765 321 -145 860 791
5380 791 824 -390 -537 462 465 -89 -16 573 234 233 727 -587 334 -17 535 -467 418 1063 -439 1032
5400 1032 -555 -107 -922 -543 257 604 -132 -1018 -1440 -1473 -113 -531 -441 401 -225 -192 -503 144 -776 626
5420 626 -1230 -640 -298 432 -850 -759 548 -36 613 -422 -869 -1228 320 -254 78 -799 -52 188 815
5439 815 -1493 -255 -201 933 215 460 606 39 97 -275 585 110 938 125 -166 -426 -551 -177 1369
5458 1369 261 747 -537 -44 488 553 802 -221 513 -30 -28 -72 -60 401 25 -595 -553 -412 -833 -230 134
5479 134 -13 -385 124 -351 -414 315 58 -62 -589 440 -504 185 -363 -515 -1960 -174 253 -175 288
5498 288 17 -475 -191 976 -227 -534 -701 -325 126 -142 -683 293 1060 -568 -208 240 98 330 -767
5517 -767 61 -453 55 -427 -260 71 61 -382 162 176 174 -250 -435 25 811 132 -67 -245 415 338 287 -221
5539 -221 707 -253 -80 239 275 355 720 134 236 -15 621 -757 -835 285 -311 -334 -412 -366 198 323 -342
5560 -342 575 -788 -209 -197 -93 -305 539 -77 246 1044 -470 563 -1446 -665 378 117 853 -430
5578 -430 -318 -38 -867 1105 -431 -450 -745 478 -89 -246 378 -486 1194 -1033 170 396 -548 -13
5596 -13 -1047 319 -863 -379 -44 -293 -864 7 196 -514 1163 650 1760 539 757 -21 185 -199
5614 -199 779 172 170 370 256 482 -107 -525 -684 -179 -609 392 -302 -394 213 -872 -708 -80 -613 -194
5634 -194 -79 -1677 -126 -32 -164 -444 -539 520 -451 -489 -469 -309 1178 33 427 198 307 362 59 477
5654 477 444 -323 -398 -397 1124 892 -660 656 -1068 -49 121 133 -331 -586 660 342 627 -318 -391 177
5674 177 -155 358 502 81 1140 -438 344 75 103 -391 -387 -76 -47 -104 -10 7 720 50 -100 329 330 -259
5696 -259 192 504 -319 -155 -380 -684 265 -293 340 -65 -466 -13 -582 275 -445 -609 -830 -209 -69 38
5716 38 455 -59 -862 -718 -485 227 -75 33 852 184 -270 -326 -41 -394 189 678 817 926 336 1027 397
5737 397 721 544 -525 31 795 -195 -292 1159 -400 385 302 1029 1016 373 888 680 671 1035 -15 39 -94
5758 -94 -211 146 -193 -1397 -365 352 52 -160 1258 -610 -63 -222 -578 418 -1461 -83 -531 98
5776 98 678 1440 995 196 -61 263 -1429 -495 1 1487 223 179 50 -836 -144 297 -515 260 -968
5795 -968 -289 -88 -125 123 62 -22 355 136 -792 121 1061 -74 -273 575 525 489 -912 -587 229 384 751
5816 751 302 190 50 444 -291 803 581 -211 -278 441 -616 -657 99 -25 -205 695 354 773 -476 268
5836 268 -346 -237 -216 -640 552 643 682 -273 58 -623 -277 -766 -408 1 -107 -281 316 268 -43 -253 -353
5857 -353 -187 -55 133 201 -287 -79 -159 -523 118 34 143 -421 -154 460 -779 -504 -155 385 5 427 -141
5878 -141 139 -488 -686 304 -46 -420 -268 227 -321 262 623 771 174 -230 471 3 356 -374 121 290
5898 290 212 260 604 23 -130 560 -363 -24 282 411 -22 -344 241 580 81 673 -612 40 -171 315
5918 315 308 78 435 405 52 -161 -137 -150 -158 94 257 -328 58 -920 -275 171 -575 878 -351 -346 -112 -537
5940 -537 -40 263 103 245 -878 -344 98 234 490 -43 -313 -273 430 -343 46 133 -345 -88 442 -529
5960 -529 -494 -1070 87 -121 378 155 -533 122 -331 734 -813 -2 -818 -80 -217 -602 -85 532 -1001
5979 -1001 718 -20 -518 -475 178 523 483 1511 -174 200 57 196 532 96 -164 -14 -456 166 -91
5998 -91 394 -349 276 -138 -748 -1046 -667 -118 -373 -398 101 38 202 -72 -452 366 46 -402 467 -395 -334
6019 -334 37 -895 76 -159 -195 -545 107 -361 364 -353 -1379 -27 -255 -535 -137 336 -793 -166 998
6038 998 940 272 1294 -578 -338 130 699 614 720 585 -647 206 -384 48 583 -969 1021 213 210 -768
6058 -768 -396 188 -632 620 499 155 796 34 40 -415 1523 176 -150 70 -1052 -115 29 -484 -1192
6077 -1192 472 -125 -41 -353 -580 -534 -725 -616 275 -1362 -255 123 -65 192 -56 -432 490 -347 -275 260
6097 260 -163 -150 61 -353 401 145 -216 -268 35 908 -201 503 0 438 -230 488 -533 -414 127 -236
6117 -236 611 526 144 288 -15 5 433 522 302 570 168 273 -18 -657 288 -153 -123 400 1027 0 122
6138 122 50 -458 51 462 -11 -300 -636 -120 425 -204 -212 -134 34 321 602 -153 -434 857 -358 -896 -90
6159 -90 -334 206 -199 -170 69 -34 -885 224 -430 -163 -284 107 -662 -489 -455 -1 -550 67 -569 39 -73
6180 -73 133 -345 519 -714 -40 212 116 -261 -24 17 -249 -177 110 151 -477 488 -19 103 177 27 -205 213
6202 213 341 545 247 53 170 -215 520 299 -221 366 297 149 -310 64 29 -783 51 -415 -42 -226 -215
6223 -215 607 -179 -839 -243 1533 194 -726 -80 -486 1083 -660 -914 -1403 -402 -248 -781 -640 346
6241 346 -92 337 92 -98 -297 -333 -123 -182 -294 -185 161 -144 -446 -291 96 -217 167 -355 -167 84 245
6262 245 -170 -17 63 -683 143 301 -88 309 92 -150 728 602 565 475 -168 333 595 -129 -300 295 -63
6283 -63 231 247 416 588 301 35 -540 -78 -331 408 147 163 -513 -100 -251 422 -997 -125 426 -217 -87
6304 -87 -370 -202 256 234 -344 -104 -133 126 -813 -608 -752 -572 -556 -328 555 -220 -419 432 177 -426 560
6325 560 -276 69 141 -452 213 -343 -802 67 -152 -295 728 886 56 595 333 -38 -428 -165 663 -42
6345 -42 5 2 400 -593 119 -8 607 -321 -445 -101 213 -6 -265 258 545 331 110 -71 -1000 -637 90
6366 90 297 709 616 -191 -698 116 377 83 -218 -2 -211 -557 -995 -637 660 -539 302 463 198 -253
6386 -253 326 -1124 1108 -426 -195 -630 -217 -1058 -108 -1205 -690 111 -69 779 -821 -60 -136 -260 -333
6405 -333 110 -348 194 -167 -670 -198 -129 -1205 239 614 341 399 761 935 79 213 -234 139 753 430
6425 430 363 672 585 -181 -887 171 -686 326 -176 664 -218 461 264 -650 1177 150 281 -30 -500
6444 -500 49 -854 -443 149 -81 -394 -802 662 582 327 677 -1027 -222 -1127 -168 -153 -215 -933 713 -614
6464 -614 130 -632 188 180 444 -558 510 529 -1009 -526 -433 -238 668 -224 428 -123 -1557 -1450 240 116
6484 116 910 608 370 1515 -218 553 376 257 631 671 -60 976 -673 -297 -600 626 -835 1769
6502 1769 -351 -704 -300 902 -731 -384 926 -114 -1278 -458 110 -481 470 1071 448 -1499 661
6519 661 -614 987 -34 297 262 -26 -55 -331 -303 1418 549 -1432 749 -625 258 -206 -412 475 -1447
6538 -1447 -827 -73 -883 -335 -172 -772 297 -288 -11 -111 -223 409 -58 309 -992 928 383 -638
6556 -638 -222 -91 -195 845 -398 -456 -448 -261 2201 -384 -561 855 755 750 36 470 317 -365 581 725
6576 725 -1155 357 -74 -9 363 15 -349 304 -784 -628 -210 -161 1061 -213 411 464 126 -288 -223 117
6596 117 412 -34 -696 -1012 -39 307 -262 772 -176 -1014 1078 -574 -459 -796 246 -579 -96 -556 490
6615 490 299 -870 167 -187 -1738 -487 -426 30 -871 933 -1134 202 -205 382 1188 -1076 587
6632 587 -394 -355 794 270 -413 292 593 630 46 -652 -622 519 -595 290 -178 190 -530 33 582 -11
6652 -11 -404 -949 -409 -299 1239 610 181 698 -2 44 -624 554 274 -172 253 245 138 -148 28 180 24
6673 24 703 -300 -281 -493 -128 713 -497 -464 -2 -263 -426 -328 179 70 555 -338 -801 390 -485 281
6693 281 310 -1022 537 -133 1261 -225 -550 -47 78 621 679 -532 359 191 -98 400 -457 -14 -114
6712 -114 291 340 -43 -362 -117 196 -1091 -39 -734 -120 -719 -17 461 298 947 -198 39 -355 -106
6731 -106 540 58 63 -23 -457 -120 -403 -1006 429 -473 -669 -233 7 163 -143 -471 24 -187 392 -851
6751 -851 -885 -1921 40 779 -122 898 -415 717 -492 -340 165 6 -534 -32 -707 -4 561 1458
6769 1458 -438 -741 7 582 278 -449 112 -127 283 8 -1062 111 64 531 1029 137 -540 690 653
6788 653 57 107 492 -34 -245 482 -1051 247 17 -165 -18 250 504 -18 -614 -302 -264 57 332 -14
6808 -14 -438 -33 21 -23 979 523 538 -1104 311 -1040 473 -577 -798 29 518 -84 -476 159 -152
6827 -152 194 2 -251 134 -251 -775 -131 -222 31 -1334 -735 -159 673 -268 -16 225 313 -288 332 521
6847 521 385 104 261 599 -595 603 247 140 -494 157 704 -554 15 831 232 -85 147 252 519
6866 519 -176 810 -528 -168 218 -5 180 -355 22 278 -429 -325 423 -94 -497 -567 117 -646 318 -234
6886 -234 355 -684 409 490 -780 577 -371 -92 -597 -576 -56 -543 -585 -31 526 -152 -167 -507 146 675
6906 675 34 -28 -192 -397 -647 101 1101 43 -263 -190 586 -1003 -493 643 -453 49 -92 386 -489
6925 -489 730 -376 310 632 -746 115 426 -16 960 415 -467 -27 -134 -97 -289 -116 -180 322 -60 -109
6945 -109 627 -1033 -456 71 156 -165 773 275 628 288 -1100 -524 98 -67 -1132 438 -1082 -1025 -42
6964 -42 -828 -259 137 260 332 300 -482 229 -977 629 -1164 -419 -404 -165 -789 1159 -272 -448 -2210
6983 -2210 -662 -1122 -277 410 -91 -597 -812 -504 -184 -849 764 1380 -870 718 -377 69 1351 64
7001 64 -423 -144 -391 -653 -622 -162 1062 17 287 1253 -211 16 -949 -227 1067 -1384 176 -512 200
7020 200 -731 -461 511 -362 503 62 397 -182 44 1204 266 -718 608 664 87 337 615 108 644 -216
7040 -216 -50 -493 22 1024 155 253 -770 -329 315 26 430 -526 -18 499 -487 -722 832 -287 7
7059 7 -347 297 141 -124 -317 201 -158 -537 -127 -805 -194 369 -671 -48 -132 -689 616 -5 238 -151
7079 -151 338 -185 35 -283 318 814 102 -9 56 -474 52 645 464 544 134 -290 1190 -408 24 547
7099 547 18 497 230 610 250 166 -274 -381 -771 450 -118 577 -644 -700 196 233 -47 -228 -43 -240
7119 -240 -49 -676 -339 -343 -11 106 -242 -222 -280 176 -270 -156 -338 -114 77 -76 58 -794 -119 636 -73
7140 -73 233 52 68 229 -384 -135 278 50 558 -967 111 452 527 153 -176 -679 -186 65 30 561 -1656
7161 -1656 38 -521 -15 -79 415 512 301 67 594 567 438 1031 -108 -308 126 541 602 -193 524 273
7181 273 1305 573 -163 -748 246 520 -473 249 -24 -377 136 436 -69 225 60 366 -434 -413 -256 -932
7201 -932 -88 -641 1032 -1259 248 193 74 -73 -250 726 581 -403 1434 239 108 -258 227 296 1464
7220 1464 -115 1040 423 -1206 -320 973 116 20 -599 568 -86 225 -100 -139 449 743 -683 675
7238 675 15 -1051 990 624 695 -783 116 800 5 525 1002 -143 362 205 382 800 -183 1729 711
7257 711 86 262 -581 -304 -400 -501 1434 90 1047 533 -147 293 -338 -646 -333 589 344 628 -336 -1128
7277 -1128 -1125 932 -5 266 318 625 -278 72 -261 706 -528 131 700 56 920 409 109 32 642 395
7297 395 -105 -1294 304 444 -372 -391 -216 144 -401 57 54 403 788 237 914 658 250 223 15 -245 838
7318 838 784 -305 178 1224 445 471 -333 171 -453 974 114 -496 -707 559 -189 -552 -236 -1 -72 235
7338 235 -923 -902 -969 -261 -1309 -319 1056 -371 -573 -126 1267 230 304 114 -1037 -995 735 -685
7356 -685 -699 4 -155 -732 -224 -811 -197 -259 -302 -566 -232 18 -538 260 175 531 644 -169 -369 438 -620
7377 -620 177 -24 582 -77 -452 521 1579 638 171 -89 7 -67 515 453 905 442 -69 -459 583 -259
7397 -259 -908 -368 1050 222 761 536 582 -36 -1196 -579 -148 525 -11 -108 2 -601 121 275 1034 -815
7417 -815 98 -222 72 136 469 -679 1314 -142 -208 396 -322 -133 78 -291 -112 147 -891 280 -23
7436 -23 -67 -710 -109 -454 1065 303 -229 -458 328 -326 622 296 109 388 86 -739 504 697 182 478
7456 478 -857 -204 43 -532 -95 120 -15 384 -67 78 1129 609 -325 -285 -765 734 150 531 -757
7475 -757 120 301 514 50 185 -37 -242 126 -7 8 -599 -129 -553 -681 -104 -9 -82 -185 329 -111 -97
7496 -97 -338 -825 -999 117 -136 -83 1458 386 -1282 828 346 -106 -704 -212 4 334 731 623 211
7515 211 -200 1010 -518 69 120 -1095 485 37 -217 280 -41 695 -480 -295 742 709 -439 536
7533 536 227 1106 891 -245 145 64 340 -69 -490 -463 651 -52 923 474 -912 -833 353 -631 631
7552 631 669 323 771 173 1062 249 -252 -407 -419 -6 -94 -122 -1488 -632 -461 1197 -743 -13 -740 -287
7572 -287 -234 672 -80 40 936 520 -729 439 -377 -637 489 -508 -25 441 43 -346 -77 -139 125 383
7592 383 658 501 -216 584 127 439 -25 816 59 169 556 -47 474 443 1163 -401 61 -316 273 405
7612 405 801 -110 -236 -325 -609 27 578 -786 635 -73 -58 -339 335 -282 -196 349 208 641 631 40 -216
7633 -216 291 -63 362 129 -84 351 210 -82 -408 325 336 -175 -158 562 -361 -132 -411 -218 -103 -1012 5
7654 5 -690 -186 -402 -81 -518 475 190 -37 87 721 365 -476 95 -736 -710 -312 112 594 -278 -628 -64
7675 -64 -248 -625 -161 -1116 293 -414 878 -146 290 287 -642 434 -651 767 170 -28 27 259 121
7694 121 -173 -371 607 -138 73 243 -710 238 -395 128 95 -48 298 485 -245 -77 577 -244 -634 -171
7714 -171 136 -286 -679 -679 -569 433 -246 243 60 -96 683 11 816 -138 -7 17 -531 441 -47 -52 -185
7735 -185 715 -437 -220 -525 -1142 411 207 -13 21 52 675 -181 -695 -468 -96 -417 -159 36 -326 -165
7755 -165 -301 249 -553 -186 25 487 -283 -282 16 -1057 240 841 -402 279 90 -16 638 335 -427 -401
7775 -401 -334 -143 -623 -151 -248 -448 232 97 -693 -153 -708 259 186 -56 -198 -184 32 -542 -4 -237 540
7796 540 216 -121 474 -178 192 -253 -93 -64 53 841 -797 43 -254 -690 126 244 336 -316 -742 172
7816 172 -131 -424 -368 14 -52 232 121 -286 349 653 135 1209 562 19 -294 -243 49 360 762 717 222
7837 222 -96 57 861 495 130 259 8 -147 276 615 129 55 328 -146 -685 561 420 -273 653 -176
7857 -176 -764 184 -500 203 967 25 -350 -25 -201 -67 135 -225 32 65 39 -686 -216 -482 132 54 -481
7878 -481 67 553 93 929 -362 594 580 -244 -91 -147 146 206 -411 -664 -190 -42 325 -360 222 120 86
7899 86 53 -14 -277 730 386 403 -942 416 652 87 741 -280 25 -155 655 -836 -142 105 -442 -11
7919 -11 -1140 -576 430 -350 -973 285 196 -945 -586 -439 -407 -409 -581 -321 471 500 -858 -676 -274 629
7939 629 378 444 -363 -89 352 812 11 -216 77 -327 57 -963 -165 386 -572 -211 -728 -48 467 -171
7959 -171 -339 -321 -466 -648 873 1018 -223 103 570 229 127 242 -201 -102 -422 -271 -830 444 710 430
7979 430 375 -791 534 -255 -434 -514 -408 -954 52 -2004 -724 -447 525 -33 -31 14 260 564 -450 -90
7999 -90 -320 -8 865 721 -169 884 -378 -738 -748 -102 319 -123 137 -149 -1295 -125 -1402 457 482
8018 482 -531 -991 -433 -754 -85 -356 -1001 -781 259 37 867 791 -84 330 28 -373 -897 219 -484
8037 -484 691 -1173 -97 -671 118 -620 519 -915 479 -1113 9 244 -764 88 970 1338 393
8054 393 232 -256 565 -502 -518 -1491 -356 1061 616 -989 -770 471 539 -427 984 35 -42 634 -229
8073 -229 -56 -946 313 -694 890 185 107 194 -467 225 -398 -994 130 -465 338 -494 -505 -295 -348 -236
8093 -236 -30 579 47 -382 -1176 281 240 -889 -78 -436 -212 350 -174 -516 709 282 -412 -390 -1072 -394
8113 -394 91 562 -832 687 368 -71 584 1 681 166 268 -400 174 688 -342 163 361 300 172
8132 172 583 -769 -174 303 -339 -38 -591 16 101 -62 171 -190 431 -55 -686 241 285 -321 -415 -124 402
8153 402 -432 -155 208 -267 296 570 -42 -20 9 -81 166 -259 246 -558 -86 -111 42 193 -293 -464 426
8174 426 169 -342 59 35 132 -165 8 -485 -269 70 -48 -527 -137 305 -196 -220 636
8191F36
##END NTUPLES=NMR FID
##END=
