##TITLE=1H_L3L30-SeO2-f19
 CDCl3,8 sc, 
 4.02.2021
##JCAMPDX= 6.0         $$ Bruker NMR JCAMP-DX V2.0
##DATA TYPE= NMR FID
##DATA CLASS= NTUPLES
##ORIGIN= UXNMR, Bruker Analytische Messtechnik GmbH
##OWNER= root
$$ XWIN-NMR		Version 3.5
$$ Thu Feb  4 11:04:51 2021 Russian Standard Time (UT+4h)  she@DPX200
##.OBSERVE FREQUENCY= 200.1315066352
##.OBSERVE NUCLEUS= ^1H
##.DELAY= (6, 6)
##.ACQUISITION MODE= SIMULTANEOUS
##.ACQUISITION SCHEME= undefined
##.AVERAGES= 8
##.DIGITISER RES= 18
##SPECTROMETER/DATA SYSTEM= spect
##.PULSE SEQUENCE= zg30
##.SOLVENT NAME= D2O
##.SHIFT REFERENCE= (INTERNAL, D2O, 0, 15.7039)
##AUDIT TRAIL= $$ (NUMBER, WHEN, WHO, WHERE, WHAT)
$$ ##TITLE= Audit trail, XWIN-NMR		Version 3.5
$$ ##JCAMPDX= 5.01
$$ ##ORIGIN= Bruker BioSpin GmbH
$$ ##OWNER= she
$$ F:/spectra/data/she/nmr/H-F/1/audita.txt
$$ ##AUDIT TRAIL=  $$ (NUMBER, WHEN, WHO, WHERE, WHAT)
(   1,<2021-02-04 11:03:18.78 +0400>,<she>,<DPX200>,
      <created by zg, POWCHK disabled, PULCHK disabled
       configuration hash MD5:
       00 E9 B6 7A A2 85 ED C7 34 08 36 98 17 FE 4E 26
       data hash MD5: 16K
       2A E7 E6 D3 A0 07 58 EF A8 49 DF C4 BC 4F 5F D1>)
$$ ##END=
$$ 
$$ hash MD5
$$ E4 23 35 6B E8 07 EB 2C 73 23 B9 F5 B6 9B FD B4
##$RELAX= 
##$RELAX= 
##$RELAX= 
##$RELAX= 
##$RELAX= 
##$RELAX= 
$$ Bruker specific parameters
$$ --------------------------
##$DU= <F:/spectra>
##$EXPNO= 1
##$NAME= <H-F>
##$PROCNO= 1
##$TYPE= <nmr>
##$USER= <she>
##$AMP= (0..31)
100 100 100 100 100 100 100 100 100 100 100 100 100 100 100 100 100 100 
100 100 100 100 100 100 100 100 100 100 100 100 100 100 
##$AQSEQ= 0
##$AQ_mod= 1
##$AUNM= <au_zg>
##$AUTOPOS= <>
##$BF1= 200.13
##$BF2= 200.13
##$BF3= 200.13
##$BF4= 200.13
##$BF5= 200.13
##$BF6= 200.13
##$BF7= 200.13
##$BF8= 200.13
##$BYTORDA= 1
##$CFDGTYP= 0
##$CFRGTYP= 5
##$CHEMSTR= <none>
##$CNST= (0..31)
1 1 145 1 1 1 1 1 1 1 1 1 1 1 1 1 1 1 1 1 1 1 1 1 1 1 1 1 1 1 1 1 
##$CPDPRG= <>
##$CPDPRG1= <>
##$CPDPRG2= <>
##$CPDPRG3= <>
##$CPDPRG4= <mlev>
##$CPDPRG5= <mlev>
##$CPDPRG6= <mlev>
##$CPDPRG7= <mlev>
##$CPDPRG8= <mlev>
##$CPDPRGB= <>
##$CPDPRGT= <>
##$D= (0..31)
0 1.2 0 0 0 0 0 0 0 0.06 0 0.03 0 0 0 0 0.0002 0 0 0 0 0 0 0 0 0 0 0 0 
0 0 0 
##$DATE= 1612422198
##$DBL= (0..7)
120 120 120 120 120 120 120 120 
##$DBP= (0..7)
150 150 150 150 150 150 150 150 
##$DBP07= 0
##$DBPNAM0= <>
##$DBPNAM1= <>
##$DBPNAM2= <>
##$DBPNAM3= <>
##$DBPNAM4= <>
##$DBPNAM5= <>
##$DBPNAM6= <>
##$DBPNAM7= <>
##$DBPOAL= (0..7)
0.5 0.5 0.5 0.5 0.5 0.5 0.5 0.5 
##$DBPOFFS= (0..7)
0 0 0 0 0 0 0 0 
##$DE= 6
##$DECBNUC= <off>
##$DECIM= 32
##$DECNUC= <off>
##$DECSTAT= 4
##$DIGMOD= 1
##$DIGTYP= 9
##$DL= (0..7)
0 120 120 120 120 120 120 120 
##$DP= (0..7)
150 150 150 150 150 150 150 150 
##$DP07= 0
##$DPNAME0= <>
##$DPNAME1= <>
##$DPNAME2= <>
##$DPNAME3= <>
##$DPNAME4= <>
##$DPNAME5= <>
##$DPNAME6= <>
##$DPNAME7= <>
##$DPOAL= (0..7)
0.5 0.5 0.5 0.5 0.5 0.5 0.5 0.5 
##$DPOFFS= (0..7)
0 0 0 0 0 0 0 0 
##$DQDMODE= 0
##$DR= 18
##$DS= 0
##$DSLIST= <SSSSSSSSSSSSSSS>
$$ [...]
##$SUBNAM2= <"">
##$SUBNAM3= <"">
##$SUBNAM4= <"">
##$SUBNAM5= <"">
##$SUBNAM6= <"">
##$SUBNAM7= <"">
##$SUBNAM8= <"">
##$SUBNAM9= <"">
##$SW= 16.9725356469052
##$SWIBOX= (0..15)
0 0 2 0 0 0 0 0 0 0 0 0 0 0 0 0 
##$SW_h= 3396.73913043478
##$TD= 16384
##$TD0= 1
##$TE= 0
##$TE2= 300
##$TE3= 300
##$TEG= 300
##$TL= (0..7)
0 120 120 120 120 120 120 120 
##$TP= (0..7)
150 150 150 150 150 150 150 150 
##$TP07= 0
##$TPNAME0= <>
##$TPNAME1= <>
##$TPNAME2= <>
##$TPNAME3= <>
##$TPNAME4= <>
##$TPNAME5= <>
##$TPNAME6= <>
##$TPNAME7= <>
##$TPOAL= (0..7)
0.5 0.5 0.5 0.5 0.5 0.5 0.5 0.5 
##$TPOFFS= (0..7)
0 0 0 0 0 0 0 0 
##$TUNHIN= 0
##$TUNHOUT= 0
##$TUNXOUT= 0
##$USERA1= <user>
##$USERA2= <user>
##$USERA3= <user>
##$USERA4= <user>
##$USERA5= <user>
##$V9= 5
##$VALIST= <valist>
##$VCLIST= <CCCCCCCCCCCCCCC>
##$VD= 0
##$VDLIST= <DDDDDDDDDDDDDDD>
##$VPLIST= <PPPPPPPPPPPPPPP>
##$VTLIST= <TTTTTTTTTTTTTTT>
##$WBST= 1024
##$WBSW= 4
##$XGAIN= (0..3)
0 0 0 0 
##$XL= 0
##$YL= 0
##$YMAX_a= 194855
##$YMIN_a= -224110
##$ZGOPTNS= <>
##$ZL1= 120
##$ZL2= 120
##$ZL3= 120
##$ZL4= 120
##$ABSF1= 10
##$ABSF2= 0
##$ABSG= 5
##$ABSL= 3
##$ALPHA= 0
##$AQORDER= 0
##$ASSFAC= 0
##$ASSFACI= 0
##$ASSFACX= 0
##$ASSWID= 0
##$AUNMP= <proc_1d>
##$AZFE= 0.1
##$AZFW= 0.1
##$BCFW= 1
##$BC_mod= 2
##$BYTORDP= 1
##$COROFFS= 0
##$CY= 11.3945322036743
##$DATMOD= 1
##$DC= 2
##$DFILT= <>
##$DTYPP= 0
##$F1P= 15.9154993809931
##$F2P= -4.1035820241983
##$FCOR= 0.5
##$FTSIZE= 0
##$FT_mod= 4
##$GAMMA= 1
##$GB= 0.15
##$INTBC= 1
##$INTSCL= 1
##$ISEN= 128
##$LB= 0.24
##$LEV0= 0
##$LPBIN= 0
##$MAXI= 10000
##$MC2= 0
##$MEAN= 0
##$ME_mod= 0
##$MI= 1.114404
##$NCOEF= 0
##$NC_proc= 0
##$NLEV= 6
##$NOISF1= 3.799351
##$NOISF2= 2.8
##$NSP= 1
##$NTH_PI= 0
##$NZP= 0
##$OFFSET= 15.70392
##$PC= 1
##$PHC0= -10406.73
##$PHC1= 21.60095
##$PH_mod= 1
##$PKNL= yes
##$PPARMOD= 0
##$PSCAL= 0
##$PSIGN= 0
##$REVERSE= no
##$SF= 200.130013532006
##$SI= 16384
##$SIGF1= 3
##$SIGF2= 2
##$SINO= 400
##$SIOLD= 16384
##$SREGLST= <1H.CDCl3>
##$SSB= 0
##$STSI= 0
##$STSR= 0
##$SW_p= 3612.71676300578
##$SYMM= 0
##$S_DEV= 0
##$TDeff= 0
##$TDoff= 0
##$TI= <>
##$TILT= no
##$TM1= 0
##$TM2= 0
##$TOPLEV= 0
##$USERP1= <user>
##$USERP2= <user>
##$USERP3= <user>
##$USERP4= <user>
##$USERP5= <user>
##$WDW= 1
##$XDIM= 8192
##$YMAX_p= 0
##$YMIN_p= 0
$$ End of Bruker specific parameters
$$ ---------------------------------
##NTUPLES= NMR FID
##VAR_NAME=  TIME,          FID/REAL,        FID/IMAG
##SYMBOL=    X,             R,               I
##VAR_TYPE=  INDEPENDENT,   DEPENDENT,       DEPENDENT
##VAR_FORM=  AFFN,          ASDF,            ASDF
##VAR_DIM=   8192,          8192,            8192
##UNITS=     SECONDS,       ARBITRARY UNITS, ARBITRARY UNITS
##FACTOR=    0.0002944,     1,               1
##FIRST=     0,             0,               0
##LAST=      2.4114304,     0,               0
##MIN=       0,             -224110,         0
##MAX=       2.4114304,     194855,          0
$$ Real data points
##PAGE= N=1
##DATA TABLE= (X++(R..R)), XYDATA
0@%%%%%%%%%%%Qj6J6j6K4l2M0m8N6p2Q6j00J18j36J57j81K08k40K74l14L60m08
33b16M61n20N85o57P34q20R15j017J128j250J385j530J690j865K053k263K493
50A306k745L024l331L675m062M498m996N571o237P023p972R136j0603J2516j5123
65h320J8888k4794L5354n9516K01769L1474m18965L84613j32592j76679K83878
76A35110j52536q2574J89207j08874l819R5081m9799p8529R2210K3589j33167
87g4101J16328M7061j70872J29498l1425j25079J81098p3777q0249J61340q1542
98a720o755R2866j11203j4932O1270m2489n086M7131k9689m0256R0843j8384q4434
111f2838R6348l3353n4713J06203p1117l73Q0971j30841K7269P6002r1246N2562
$$ y = [0, 0, 0, 0, 0, 0, 0, 0, 0, 0, 0, 0, 8, -8, 8, -8, 16, -16, 24, -24, 32, -40, 46, -54, 64, -72, 85, -96, 112, -128, 146, -168, 192, -216, 245, -275, 310, -347, 387, -433, 482, -535, 593, -657, 728, -802, 888, -977, 1076, -1187, 1306, -1439, 1585, -1746, 1929, -2133, 2365, -2631, 2940, -3297, 3726, -4246, 4890, -5713, 6803, -8320, 10568, -14226, 21128, -38388, 163381, 194855, -224110, 160503, 27911, -148768, 135110, -17426, -100000, 89207, -19667, -23486, 71595, 21796, -56733, 35477, 59066, -74101, 42227, 89288, -81584, 47914, 16489, -108590, 72508, -1269, -81518, 79822, -1720, -8475, 84391, -26812, -41744, 19526, -22963, -28049, 19082, -10607, -50863, 39980, 21596, -62838, 33510, 157, -54556, 51647, -19470, -19843, 61128, -69713, -42444, 33558, -57688, -5126]
123e126L9597o1211K7626K4470r741k2419j4301l282j506M8127k8317k2858P2920
136D3979n8951o215P7484q8541J6826O4439p5005L7184J9331n8423L8081p178
148C011l0589L1617K0002o782j6716K4761j0924k2811M6806n6372k0323P9400
160D1080n7319J3830N3037q2831L8277K8640o1029M5966q453k3790L8236k9511
172c867p109J0238l733K197k4300L3470O081k2136M7654m7125j8261N5207n7725
185b9409J3014K6474n8170N7533J3748m9789L6617j2733j4238K6475j3447p575
197a1500N483J3298j4778j4393K8938l0213N435M2791n0395K8107L5416n6528
209a8339L0156m253m2850M7025j2452k0361K8834n182M073K247j021n649j0028
$$ y = [-5126, 34471, -26740, 886, 25356, 15615, -6804, -21105, -24387, -25893, 22234, -6083, -28941, 43979, -14972, -21187, 56297, -32244, -15418, 49021, -25984, 11200, 30531, -27892, 10189, 3011, -27578, 4039, 24041, 17259, 543, 25304, 14380, -8431, 38375, -17997, -38320, 41080, -16239, -2409, 50628, -32203, 6074, 34714, -26315, 19651, 11198, -12592, 25644, -3867, -10976, -738, -4471, -2274, -26574, 6896, 12977, -9159, 38495, -8630, -26891, 28316, -29409, -16395, 10079, -48091, 9442, 23190, -26599, 10018, -2715, -16953, 9522, -3925, -11500, -6017, 7281, -7497, -21890, 7048, -23165, -17730, 25061, -25334, 2773, 38189, -18339, 11817, 7564, -35286, 11739, -713, -21074, 7760, 2578, 6651, 8898, 7877, 2228, -7800]
222g800L0757k0394j3462L8770l6334P024K2160n1988L5892J7135l7105M2212
234B6867j0047k1212L2277k3166j7123O847j505R612m604J0857n538m748K8106
247B6623l3258j415K5486l9550L1462J0013n0320M1337p615k6911L2903k3310
259a4555L703K9357k2228R702k987j2211Q395j5988P275n488K07L0152k8583J1410
273a839K0222m2286L1188k456l5097M5098j5874j6556L2049l0496K904K1207j9706
286a1642Q748O978O467j822p116J0138k2804M943J7599l3917K2778J3373k2731
299i008L3081j5222j8044K9146j9971J37Q391j3437J5202q575K46M569j8072K2367
313A0810o574q435K7106k5185J0357J3652l9871K2634l124k3350L3716j7185l48
$$ y = [-7800, 22957, 2563, -10899, 27871, -8463, -1439, 20721, -31267, 4625, 21760, -15345, 26867, 16820, -4392, 27885, 4719, -12404, -5557, -7062, 2550, -2054, 8803, 3265, -1483, 26623, -6635, -8050, 17436, -22114, 9348, 19361, -30959, 10378, 2763, -24148, 8755, -14555, -10852, 18505, -3723, 5979, 2992, -9219, -824, -16812, -9537, -15025, -14818, 15334, -13249, -1839, 18383, -23903, 7285, 4829, -30268, 14830, -1044, -17600, 14449, -16047, -13143, 8064, -11642, -2894, 4084, 10551, 8729, 1613, 11751, -11053, -6110, 11489, -22428, 350, 13723, -9008, 24073, 8851, -9193, 19953, -18, 119, 8510, -4927, 10275, 1700, 1946, 6515, -11557, 10810, 4236, -4199, 22907, -2278, 8079, 21731, -18140, 4494, 1370, -21980, 11736, -5449, -5797]
326e797K3736k2958J1087j373j6498J7848j0849O9M616j0161J4815j4424k150
339a2039J6137j9676J8476M427k0572K5145j3123j0202J7624k7655R395J6156
351D093j8497J4176M266o021O295m581J947j0432M141J2385j8922J5416l788j6433
365a5955L1087k0130r814L7530k8509N928K6868l5028J0333R186k2473J1612r93
378c58k190R310o52L868r123J0561j964k0681K6218j1030j7408L4758k5160o395
392a0246K8836k9199Q394J5992k1673J6072L153j2435N282o493j896l384N986
405a611q02r958K4422q867j4866K7479k4819j805K2953k9431J3648J0555k5094
418a8196K4050o950j5782J9349o648J84M680qL146j1571R798m657j5442K3083
$$ y = [-5797, 17939, -5019, 6068, 4695, -11803, 6045, -4804, -4735, -119, -10280, 4535, -9889, -12039, 4098, -15578, 2898, 7325, -13247, 11898, -1225, -11427, 6197, -21458, -12063, 4093, -14404, -228, 4038, -1983, 4312, -269, 1678, -8754, -4613, 7772, -11150, 4266, 478, -15955, 15132, -4998, -14812, 22718, -5791, 137, 27005, -8023, 2310, 11496, -10977, 635, -358, -2548, 6762, 6110, 9978, 855, 11416, 9452, -11229, 14989, 3959, -13449, 21309, -3851, -10246, 18590, -10609, -2215, 13777, -7896, 8176, 11329, -1106, 4176, -2317, -4213, -7597, -1611, -2413, -12371, 12051, 3184, -11682, 15797, -9022, -10827, 12126, -17305, -3657, 6898, -18196, 5854, -1096, -16878, 2471, -4177, -3993, 687, 679, 3825, -7746, 2052, -2605, -18047, 5036]
432E036j5150K83K7218k7866J1213J6178l0991J8861N84j9826K1978p130k632
445b244R074q206K172l119Q319k59j0010J9091r611p762K0882k5686K870J6289
459A1800k6900K2693N467k1024K5087r692j2717J5153j2473J743K561l780P656
472E574q317P528j978j0484J4848j2089J657J7654k3772J2536M855k4607K2296
485E701q091j5465K2184j0092L867R585j2693N490l105m552N919o626O368o600
499h110L311J4188k2789J2286P873k6910K6063j80j6199K1905j6332j074J3179
512G211j9038J0808K808p835Q888j013P314q655l930J4815k1880Q066J5859k4339
526a0921J7388Q9j5360K4981j7109k788J8127k1559J0972J0412j6708P848n738
$$ y = [5036, -10114, -9831, 17387, -10479, 734, 16912, -14079, 4782, 5366, -14460, 7518, 388, -2244, 6830, -1376, 796, -2323, 5996, 5737, -4273, 14818, 5207, -2555, 18327, -7359, -4489, 11800, -15100, 7593, 13060, -7964, 17123, 7431, -5286, 9867, -2606, -863, 1698, -2082, 5574, -2743, 4785, 2807, -7677, 7171, -4918, -3261, 14393, -9379, 3157, 8012, -16595, 5701, -2390, -17855, 4329, -5763, -1896, 7689, -5004, 486, -2619, -7171, -1252, -7878, -1510, -8110, -4799, 9389, -13400, -1114, 6759, -20151, 5912, 5732, -10467, 11438, -4894, -5968, 7211, -11827, -1019, 1789, -6046, 2842, 1829, 9143, 488, -3442, 11373, -10507, -2441, 13418, -10921, 6467, 6556, -8804, 16177, -932, -3720, 14407, -7152, 3820, 14232, -2476, 5372, -366]
539c66J401L25o854J4776r421p31J3764j6209J1956m617j8053K4340j5107m004
553h800K4924k4146K557J3547j6179R523J31p167O644n241M689N61n034L4q046
568a2003J2883j642j1065K2633j4058q365K4059j8419k252J2168j5279R878L711
581B249q422J0440o770l623O939m53o49m396R591j537j1755J8306r366j0686J8192
596H060j2262L869J4157j8679J0258L953j6629J3692j660p995N072M26K045k707
610A600M818O55j4397J1856J111q334J4580j2779k623J4808j6827N989O505j7143
624a0181J3474J212n774O295n256l25k112j322O512q197M849K438q241J1626p628
639b630m927J4216j7226N331J3297j7486Q992J770j1968J0630l194k540N125l483
$$ y = [-366, 1035, 1360, -5494, 9282, -139, -870, 12894, -3315, 8641, 4024, -14029, 10311, -4796, -8800, 16124, -8022, -5465, 8082, -8097, 1426, 1557, -5610, 1034, -4207, 482, 1043, -3991, -3957, -12003, 880, -762, -11827, 10806, -3252, -11617, 12442, -5977, -8229, 3939, -11340, -1462, 2249, -6173, 4267, -2503, -6126, 813, 360, -289, -4685, 4906, 3369, -8386, 9920, 554, -10132, 8060, -4202, -333, 13824, -4855, 5403, 9356, -7273, 6419, 4759, -3236, 1836, 2262, 4307, 1600, 6418, 7073, -7324, 4532, 5643, -2691, 11889, -890, -3513, 11295, -5532, 457, 6962, -10181, 3293, 4505, -1269, 5026, -230, -555, -2667, -3989, 2523, -5674, -825, 1613, -6628, 4998, -2630, -7557, 6659, -10567, -5236, 8061, -9425, -433, 1337, -10631, -1, -3195, -5735, -610, -4093]
653d093L959j513K902m39r360J0820o460m506J8221j4563O17J3627j6600Q996
667A608M633j3298J0542j633l296P242n031J311k731J065M028p165R375k795p419
682c564J5455j1079l202J3272j6052O147P633j3772J1452r73q239Q612m912n83
696A95K578k854K708l804M749j796p560J1704r461k000J4300j6352O367R182j7993
711a0037J2324nj2950J4162o519l303Q674o884K858J42j423J693n295Q279m034
726b318n405J3069j1892K690J0302j7465J1575L468j4820J6322n076p601J3732
739F581q809o58N997n244L185j192L056j516l828R188q706J172J0333j5750R385
754C194O585j6953J4644k136j1344J4554p361k502Q380p034K244O75j162J142
$$ y = [-4093, -134, -1647, 1255, 816, -8544, 2276, -4184, -8690, 9531, -5032, -4415, 9212, -7388, 1608, 6241, -7057, 3485, 1852, -1444, 5798, 767, 2078, -653, 412, 4440, -2725, 6650, 3855, -3564, 11891, 812, -2390, 10882, -5170, 977, 8610, -5162, 6290, 5317, -2922, 5690, 778, 195, 2773, -81, 2627, -1177, 3572, 1776, -5784, 5920, -3541, -5541, 8759, -7593, -1226, 7956, -10037, 2287, 2282, -10668, 3494, -3025, -6328, 2346, -4538, -1680, -1538, -2961, -1268, -6563, 1716, -2318, -7723, 5346, -6546, -3856, 6446, -11019, 556, 4024, -10796, 5526, 450, -7151, 6581, -2228, -2886, 3111, -2133, 1052, -140, 2916, 1400, -2428, 6760, -1946, -774, 9559, -6191, 3194, 9779, -7174, 7470, 5334, -6010, 8544, 1183, -1319, 7061, 27, 2271, 2946, 1784, 2926]
768B926l927N824n167n06R049j3036N772O337j5481J2055q82j1708J5831p970
782h83n355J2898j0535j35P215o851J025J802k59k319J077L861q031M960M013
797B483j1819J1265q51j1965J6695p687q569J6750j0179k688J1297q255J434M249
811B160m087K71J318J313m566M208L230j0437J1080L74j3181J6803n487j1281
825h282J8934j0153m297J3472j2712K938P170r866N601K108m332J006K160P70
839D517o140N059J438j0411J1613k348r688J3475q538j924J1901j3606M573O592
853F513j2067O906J563o331K067K19J450l730L251J978q615R246k243q104J3860
868E963j1756j081J3887j6894O633R020j6007R349K926p701P189l380n55P24r71
$$ y = [2926, -1001, 4823, -344, -850, 8199, -4837, 935, 7272, -8209, 3846, 2964, -8744, 7087, -883, -6238, 6660, -3875, -4010, 3205, -3646, -2621, -819, -1078, -3397, -2320, 1541, -6490, -1530, 2483, -9336, 1929, 1078, -10887, 5808, -1879, -10448, 6302, -3877, -6565, 4732, -3523, -2089, 2160, -1927, -1656, -338, 975, -3591, 617, 3847, -6590, 4490, 4864, -8317, 8486, 2999, -8282, 10652, 499, -3798, 9674, -3038, -100, 7070, -2796, 2805, 4913, 581, 1587, 3747, 4517, -1623, 3436, 4874, -5537, 6076, 3728, -5960, 7515, -1023, -2947, 8954, -4652, -79, 6513, -5554, 1352, 2915, -3416, -1349, -1130, 320, -3410, -159, 1819, -6796, 2450, 207, -7897, 5963, -5793, -6874, 7013, -9881, -3248, 5772, -10235, -886, 2040, -5661, 1528, -1852, -2407, -1683, -2654]
883b654L421m747M392p37o132J2703p354l952J3257j3169K645J1004j3077N648
897A248K257p726P878k419j275L380k567J707o68K792j396n902Q638o076k432
912b561J1919j2378K993Q016j2669R431O63j0123J0600n464k828Q569p567R17
926d82N01j497L294l649M468k291m424R519q004q43Q429j3392O481N409j1754
941h235J1110k626q094J1102n273k197N767m932O07Q22P44o42k236N353o089J144
957c675R224j0572M841M577j1729J0097j177q600J0790n677j777Q573m663N95
971H27k82P53J330m737P452m226m890J0950r292J828Q157j3652R417K802j1114
986d677J2553l588p089Q265n656L31J784k358L243l995L521J059m546N545n622
$$ y = [-2654, 767, -3980, 412, -325, -6457, 6246, -1108, -5060, 8197, -4972, -2327, 8677, -4400, 1248, 3505, -4221, 3657, 1238, -37, 3343, 776, 2483, 1815, 4607, 3211, -2691, 5947, -129, -2561, 9358, -3020, -27, 7989, -4680, 4751, 5414, -4709, 5891, 427, -2401, 6168, -1399, -482, 19, -1478, 1816, -1833, 2635, 344, -4080, 5439, -2565, -3408, 5021, -8371, -1890, 3519, -8235, 2875, 249, -7845, 3257, -2016, -4213, 1554, -3378, -2771, -1949, -1205, -1847, -4083, 1270, -4819, -3675, 5549, -5023, -182, 4395, -7334, 2763, 1586, -7014, 3776, -1901, -3678, 4895, 232, 827, 545, 1298, 2628, -2109, 5343, 1117, -3773, 7177, -2115, -287, 7870, -5782, 3635, 6437, -4677, 7876, 4288, -2801, 5464, -192, 139, 1923, -435, 2808, -1187, 2334, 3393, -1153, 4392, -1230]
1001a230j50O183r289N957J650j1120J0157r22p116Q375m490M0L741l785K757
1016G58k533j361J469k635L184k941J016N990q410N036M693j2059Q272L06n854
1031e069O316l458m76M481o342L428J992k497K326o99K750k531j236N212p213
1046c016L98O250p021N066J830m796O371m084k72M352o925L062K430k563R61k222
1062a79J473N14m286P132k521k493O736n322J025J019o221N239l555j981Q163
1077D743n933Q32M222n312L004j049j904L569m768L21K153l391K695k071J745
1092a144M47l858O113j784m006P798o461j221M499o928N070J252l324N885l227
1107h89p26J295j756J504k251K291J957n922P266k348m985Q466n426Q9P106p604
$$ y = [-1230, -1380, 4803, -4486, 1471, 3121, -7999, 2158, 1236, -5880, 2495, -1995, -1955, 1786, -1999, 758, -1775, -3136, -1667, -4302, -1118, -4059, -3043, 2947, -5463, -427, 4266, -7793, 479, 785, -5069, 1247, -2211, -2687, 1794, -4548, -1120, 872, -1625, 701, 2, 2752, 221, -1015, 4197, -3016, -2618, 3632, -3389, 1677, 3507, -1289, 5082, 998, 726, 5078, -1847, 1215, 3645, 1082, 2043, -179, 1294, 1808, -2478, 4654, 2133, -360, 6376, 1054, 2079, 3098, -3123, 2116, -1439, -3420, 4743, -1190, -358, 3864, -1448, 1556, 507, -1397, 2172, -2596, -2275, -122, -3513, -818, -2889, -1144, -697, -4555, 1558, -226, -4232, 3566, -2895, -4116, 383, -6545, -1475, -223, -3547, 2338, -889, -1615, -320, -2076, -572, -2823, -532, 1425, -4497, 2769, 421, -4564, 3902, -1524, -1435, 5671, -1933]
1123a933M290K588p517N409l167j979M564k336J890M90o37L520n688K552R72m344
1139a326N242m106m95N607o379K353K468o773O026k83l760N144l229p73K95k351
1155b340J637j766K083M3p44M727m082j915N721q569K957M493r132O974N99o287
1171e601P106l583k036M912l219J869Q33j381Q72k338K112k624j312N877m281
1186b794J660N609p387M733J533r212Q064k213m850Q407l859p02M752l830J200
1201A111N18j47k20O6K635l449N80J515o074N039O21n069P947k122k858O251o766
1218d22L74M218p581L461K601m360L948j818j444J707o74J20k015M990k023m050
1234b968N950m363l914P116o558J325O263o248M161K919o509K789r48l296L193
$$ y = [-1933, 2357, 4945, -2572, 2837, -330, -2309, 2255, -81, 1809, 2299, 1662, 5182, -506, 2046, 3018, -1326, 3916, -190, -685, 4922, -1457, 896, 3364, -3409, 2617, 2334, -1426, 3718, 489, -284, 11, -2340, -703, -2469, -386, -343, -1087, 3640, -442, -2357, 3364, -5205, -2248, 2245, -6887, 87, 686, -5601, 1505, -2078, -4114, 798, -2421, -552, 281, -1100, -228, -2566, -454, -3078, -4390, 1487, -2794, -1134, 4475, -2912, 1821, 3354, -5858, 2206, -7, -4857, 3550, -309, -1011, 3741, -89, 1111, 1629, 1482, 1262, 1328, 3963, 514, 1094, 2609, -3465, 1574, 2195, -2874, 5073, 2951, 93, 6344, -422, -48, 4170, -3411, 50, 2651, -1709, 2239, 421, -1023, 684, 10, 130, -1885, 3105, 1082, -2968, 2982, -1381, -5295, 1821, -4737, -3412, 2851, -3397, 764, 3683, -2826, -37, -985, -4281, -1088]
1249a088j841J43L95K259j351j375K639n65k498N072k755j456N520o776K508J109
1265f0m539N664n34j464M709j978p30J1j368J098j995M72J432j212L326k630O35
1282H37K726m318J923M705o595L775J519o942M567k885p87L088j821K550N54j210
1298A686J378l692R48k75k344M234m669J536M311n348K572J557n272M543j881
1313g16m04L564m650J177M1k772J607q72K300o2j655N852m079j692L803o165K013
1330b710J780l638N323j616j939N088l422L01J604k082J921j435J677O62m751
1345c237L954j784j905N607k889K158J954l981M466k676l501L981m095J129L651
1360B832k553K814j952k50K677l817K506J7k876L191k531J104O14n720N011m39
$$ y = [-1088, -2929, -2786, -2391, -132, -1483, -2858, -219, -784, -3282, 1790, -965, -2421, 3099, -3677, -1169, -60, -4599, 1065, 531, -933, 3776, 1798, 1068, 1079, -289, 809, -1186, -714, 718, -494, 2832, 202, 837, 3563, -755, 1168, 5873, -722, 3053, 4572, -2370, 2197, -688, -1475, 1613, -208, 2342, 2896, 1686, 3064, -628, 320, 45, -2299, 1935, -2734, -1198, 3113, -2235, 337, 1894, -3378, 1165, -716, -1120, 2444, -2206, -1029, -988, -3760, -2153, -3025, -725, -787, -2442, 3410, -669, -2361, 1442, -4723, -2710, -930, -4568, 755, -861, -2800, 2288, -1134, -833, 771, -1311, 610, -825, 852, 1514, -3237, 717, -1067, -2972, 2635, -254, 1904, 3858, -123, 4343, 1667, -1834, 2147, -1948, -819, 2832, 279, 3093, 1141, 891, 3568, -249, 2257, 2274, -602, 2589, 58, 1162, 1776, -3944, 1067, 628]
1376F28l204O765k331j732K815m236J445n43l141K775j489J311J800j576J254
1391E41k704J93L510m161K276P50m042L797j474k254K940l731L001K193j873L387
1407B349k421j620J528k857K049o18r23L381k249K245K145m401K268j345r47M249
1423B833k370k64J765l555K720L6j635K531k406K263K028k113J021k340j823K492
1439A183k532K572N45j606L008k623J211J605n075L217l89k707M700k584j325
1454h00J844l386J610P86q08K509k582K407m8m133K930k971j315L963k743K444
1470b93J288l139L064o28l180K423k436J987o50j628M211j923j954K316j517J902
1486a57J023j441L052k543j553L265l225J031j478J132K592j827K632m01l264
$$ y = [628, -2576, 4189, 1858, 126, 2941, -1295, 150, -393, -3534, -759, -2248, -937, 863, -713, 541, -2163, -1970, 1540, -2621, -345, 405, -3637, 160, -1314, -3568, -628, -4359, -1358, 835, -1038, 2349, -72, -1692, -164, -3021, -972, -1590, -2513, 868, -1381, 864, 3009, -1392, 876, -469, -1416, 2833, 463, 199, 1964, -1591, 1129, 1165, -470, 2061, -345, 1918, 3946, 1833, 2854, 514, -1309, 1183, -1349, 1223, 1768, 162, 3170, 547, 1758, 3363, -1712, 1505, 1116, -1591, 3109, 525, -800, 1044, -2342, -732, 54, -754, 1755, -827, 1580, 1532, -2601, 329, -2642, -3957, 6, -2737, -293, 995, -2144, 920, 292, -2888, -465, -2901, -914, -1564, -3192, 1019, -904, -2858, -542, -2059, -157, 866, -575, 2477, -66, -1619, 1646, -1579, -548, -2026, -894, 1698, -129, 2503, 2102, -1162]
1501a162K121q70J96J163l056K628Q16l592L963j766j050L035q85M69Q86k174
1517G22J389j671K85k74k187L550j668K07K738k881J310N38n186M745j290k056
1533a729L470k632J3R16k422J797q1j530L153p2p27q21n22O73l266J922J619k158
1551b397K444k24j731L919l885n19K768l410J762J892k848J540j532J581K14p78
1567a204K711k390J075K825m642K815m62l891K932q30o10N034k191J008J007k525
1583F62R87r70j68J154k673L507j019j347P47O0p80J650j359K325j574j733L272
1600B741l624k03J414j970K645p76L24J935k393J09K46k453J179q09k01K129k006
1617a713Q4J295k206L048j685k28K330k142R95R17k891Q60q42j059L431k160K505
$$ y = [-1162, 959, 89, 285, 1448, -1608, 1020, 1836, -1756, 2207, 441, -609, 2426, 1541, 2010, 2896, 722, 2111, 440, 725, 451, -1736, 1814, 146, 353, 3091, 210, 1520, 2058, -3128, 1617, 327, -1729, 1741, -891, -878, 38, -2384, -587, -668, -2198, 955, 883, 156, -665, -1187, -514, -3780, -1858, -239, -2397, 47, -177, -1908, 2011, -1874, -2393, 375, -3035, -1273, 619, -2229, -689, -2221, -640, -426, -1204, 1507, -883, 192, 3017, -1625, 1190, 728, -3163, -231, -1061, -1671, 3363, 1172, 2180, 3187, 662, 1649, 679, 511, 1665, -1008, 2499, 1480, 133, 880, 940, 160, 1810, 451, 2776, 1202, -531, 2741, -883, -1086, 328, -1642, 1003, 227, 551, 2486, 93, 202, 448, -2005, -826, -1635, -1836, 293, -1713, -1629, -334, -2540, 508, -1177, -1405, 925, -1217, -222, 695, -2196, -1336, -2178, -3237, 194, -1966, 539]
1634E39P32q77Q73k311P06Q02k516K947q07q12K356k005J61R50k162K958L7q52
1652G19K473k134m91r03j302K894j883J631J924j323J567n11l035J861j761N05
1668B31R94j977K081l42n24l87m81J468m94r37K342o19p83J191l396R14k43p51
1686a713K588k186K088O42l435J992r89j526K354j365l34K316k543J993N7k060
1702b121M57J89O84J488j601J305j347j939K374l088K030J729j103J367N16K38
1718A178L5k330P14M1j035L289l030J079K185k090J096O53l011L121q50l79J492
1735B158j230n81l28k14O70N91K66J502k074J994j580N4M90l788K342N18j551
1752g61K381j327j096J958j629K47K79j141J419k67L88l52j646J456j800r60L857
$$ y = [539, 1271, 394, 1267, -1044, -338, 464, -2052, 895, 88, -724, 1632, -373, -212, 738, -1424, 1534, 1571, 719, 3192, 1058, 567, -336, -1638, 1256, -627, 1004, 2928, 1605, 3172, 2661, -374, 1487, -274, 231, 1225, -752, 1329, 987, 463, 76, -405, 1063, 569, -368, 1974, 1355, 572, 1763, -1633, -719, -962, -1713, 875, -1311, 777, 1419, -2016, -24, -1013, -2539, -185, -1550, -1884, 432, -2111, -118, -61, -2121, -1664, -1475, -791, 697, -904, 401, -946, -2885, -511, -3599, -1569, 160, -943, 424, 940, 1178, 1213, -1117, -403, -362, -1397, 1892, -1138, -59, 2126, 36, 1132, 1785, -1226, 1895, 1045, 666, 2158, 928, 347, 19, -195, 475, 1066, 1332, 2834, 760, 2754, 1174, 1228, 1718, -2070, 272, 790, -761, 1620, 293, -803, 1155, -474, -227, 52, -1089, 330, 63, 451, 99, -1547, -91, -1891, -2851, 1006]
1769A006j901O91J739k840R75p59j168K980l736K143O84j457J005O49p09L54p17
1786a061J048o00q4J663j562j67M50j937K496q8j246M387k251r27K150k493J90
1803c2L59j677K002J60P71k24k49J91j150M91O87j934K509J25k357K485k183j096
1821a122K674k029J356N82p24J290j563q66R41j856O17P79j068J657j185O50L81
1838E14k775K369l48j515K125n94p2J12k380J643j75j818K956j078R71R90j910
1855i85P90r49j91K51r97J760L68j035J481q55J5R80l044K052R17j335J715p68
1873A70j009J496j325M23O03K14J371n67J93rp65L93j917O12J980k009J702J011
1891B567k219J105k76r18R79j210R68p0n82K49j061O38M72j241J770r8j803K400
$$ y = [1006, -895, -204, 1535, -1305, -330, -1089, -2257, 723, -3013, -870, -186, -1643, -638, 11, -698, -344, -1061, -13, -613, -697, 966, -596, -763, -313, -2250, 246, 158, -1088, 3299, 1048, 121, 2271, -222, -32, 327, -1350, 652, 812, 1583, 1359, 1110, 1301, 151, 642, 1329, -605, 1904, 2029, -328, 2157, -26, -1122, 1552, -477, 879, 1461, 737, 2027, 464, -402, 539, -1317, -700, 79, -989, 668, -517, 133, 514, -2261, 108, -240, -1755, 370, -224, -296, -184, -2564, -921, -1096, -2914, 42, -1036, -65, 925, -985, -195, -1144, -1335, -1084, -2081, -321, 47, -988, 493, -362, -347, 633, -2411, -359, 558, -777, 938, 170, -839, 657, -668, -245, 358, 572, 1943, 1376, 1569, 1560, 795, 1188, -729, -117, 1863, -146, 1556, 2567, 348, 1453, 1177, 259, 1238, 28, 996, 926, 344, 593, -468, 170, 642, -599, 1171, 1073, -730, 1670]
1909A670j714m98P00j673L52J89k55K256j677L29P95j829Q08j91m70Q52j328Q63
1927h21m4n81J178j693K86J823j558J886k36j518J886j732j172K795j476l62J772
1944D33m0K21k14l09L23j075J544p95m63J983j960J344r4j581J474L57j004J636
1962A780m94j68M18j755M40k98R48j20n23J864j498Q9P61j811l23J551j091J308
1980A078l86j634J448r86m55Q01m78N00J30m14P12j716P94j8j120J850j765O03
1998a056J357j961J496l57j879J779k09q76J602j108J231l36j846J068j49N08
2014g36n02K49J384j493J793o17j263J554l2j562K040O2j379K041j692N58J086
2031A491k003J022N26j011K027j831J012m78l60P2j78J269L11j831J878n33q82
$$ y = [1670, -44, -542, 158, -1515, -1163, -974, -1229, 1027, -650, -321, 474, -1355, -547, -738, -1208, -356, -1684, -821, -865, -1446, -268, -1961, -1675, 148, -1410, 476, 240, -1278, 608, -1124, -2296, 499, -977, -1339, 433, 393, 614, 400, 91, 414, -661, 883, 88, -375, 1608, -352, 992, 898, -683, 791, 1148, 144, 1780, 1286, 1118, 1536, -219, 221, -77, 871, 751, 228, 2092, 594, 683, 1444, -367, -690, 861, -230, 1078, 692, -942, 506, -480, -935, -134, -612, -112, 18, -396, 316, -1400, -606, -624, -1744, 106, -1659, -1056, 301, -1660, -164, -521, -2400, -621, -830, -1706, -104, -1212, 19, -317, -2163, -1095, -1244, -736, -1238, -989, 395, -1098, 695, 78, -1185, 369, 337, -1225, 815, 877, -502, 1539, -153, 405, 1491, -512, 510, 1036, 25, 2052, 221, 1233, 755, 395, 467, 289, 1558, 1869, 38, 1916, 1383, 501]
2048E01J012k071J15J231l33o3R30j809N49o41K58kj020J753K10p66j71j132R97
2067d52p74O51M64r47M33J458j128J1k83r17N01q55k0J924m92J85l49J65j14l26
2087h65k25l1J08K196j881J107k16j168r4J410o99J132K81j243P22n59k94J011
2105F92m41J88m59J188l5l92J023j190o56J357j413N11J800k318J322K2k053J859
2123A005n50J7M38q53K75Ln73L97n32R39m35l96O64j000K88N08j180P54j06j100
2143a437J524q4j022R71j332L18N88j232J036P0j67L28m27m6Q5k93J459j840J037
2162d64P60j659J271j95j537K054o98j23J212q09j02L62M32p91N46L34k94o69
2180c70K087j210L49M38j335J037P39j865J438l95j215J723j530O44P54p99J89
$$ y = [501, 1513, -558, -443, 788, 455, 392, 1322, -487, 62, -579, -321, -323, -1343, 410, 620, -146, -317, -1449, -452, -1226, -575, -111, -1058, -625, 833, -295, -284, -567, -1484, -983, -1838, -1858, 66, -426, -241, -590, -425, -539, -865, -1090, -1121, -1013, 1183, -698, 409, 193, -975, -1069, 341, -358, 774, 1055, -188, 534, -25, -319, 692, 251, 439, -20, 1168, 1133, 741, 1764, 574, -82, 1275, -138, 373, 2173, -145, 1177, 1199, -854, 1005, 455, 472, 910, 57, 332, 335, -238, 159, -373, 566, 131, -265, 399, -601, -313, 195, -985, -231, -337, -1437, 87, 3, -1019, -48, -1380, -1062, -474, -1706, -670, -600, -767, -439, -866, -912, -827, -1120, 339, -1501, -464, 296, -1363, -92, -287, -1824, 230, -468, -591, 621, -188, -290, 72, 504, -287, 259, 593, 299, -370, 1717, 507, 856, 1294, -41, 996, 1735, -130, 1308, 913, -302, 1421, -109, 535, 1289, 490, 679]
2197F79L13o9l07N22k45j487R51L42j501J157j30j048K046j278q01J976k039j28
2215a047J413j579O01M23n63O71l79l53j17N31j15m78P35l60j058J374n41q77
2233a719J900j032k3J436j615N36M42j103J024K54o63M48L74l45m24J160k44j068
2251f62J755p97m62J760j566q6J287j626Q46N61j299J335K18o60N33r6n90j71
2269B80L26K29o79P52o5p60R12o96p7P06j434J009M81j408P76r8j200J024l02
2288b24m85N65j82m1K86j17l40k23M76j351P33Q46j544R86P21j577J199K20j269
2307a321J047r4o56P72m73k60O38m19K45K25M71l52n5R67q46n0Q04j096Q71Q0
2327D98o02R03n11m28J092n43j1Q21m72m76L28P04o77n44R01n21j90Q21r44Q00
$$ y = [679, 992, 923, 616, 1138, 893, -594, 357, 699, -802, 355, 225, -823, 1223, -55, -856, 1120, -919, -1047, 366, -1213, -612, -189, -752, -81, -460, -813, -930, -399, -514, -992, -257, -617, -1675, -301, -842, -1719, 181, -851, -874, 562, -1053, -517, -75, -1178, -154, 100, -563, -115, 259, -86, -510, 650, 406, -662, 1093, 296, -166, 1594, 28, -58, 1229, -397, 449, 1010, -289, 1046, 1264, 604, 1137, 1041, 451, 280, 606, 835, 156, 908, 843, 83, 995, 299, 222, 928, -506, 503, 984, -424, 352, 254, -946, 78, -224, -709, -144, -326, -367, -81, -198, -538, -761, -285, -1636, -903, -57, -1601, -615, 106, -1471, -272, -52, -1321, -274, -368, -1024, -252, -725, -985, -347, -766, -521, -296, 175, -177, -232, 735, -111, -161, 643, -453, 418, 498, -104, 799, 288, -140, 952, 409, 398, 1219, 747, 271, 599, 1303, 626, 82, 983, 462, 272, 1093, 149, 949]
2347I49j44p03J006n97o35Q57o14m76O95k67P6k58K78M9k12K36n84k03K35m26
2367g38K69m6o18P70j26m99J173r69k04Q49r29L04J37n71L21J68J6q7L58R7n86
2388i11Q10J98j224R79j93m92R61j78n01J208n26k83O19j32K80k25j23Q4L3K41
2408F25m54j4J085p86M56R2n68R85o21j92K72o64K33K78m63N07n10l20P68k24
2428D85k48K18j0j44n21M24Q5j191J167j047L56N59q05K92J192j428N43n37n31
2447a141J231r04L05k43P84M64j426J225r98M05N44l88j560J732j758P36J281
2464B89j479P52J042n72K86Q7j086N56K1M31m89O01j80k80R33l96o71J280o94
2483D31l32J219r16m93J485j300K05N77q01K75N85k06J67p9p1n2k6l45o69J015
$$ y = [949, 805, 102, 1108, 511, -124, 733, 119, -357, 338, 71, 147, -111, 167, 216, 4, 240, -344, -547, -312, -738, -469, -515, -1133, -363, -489, -988, 185, -784, -988, -139, -1068, -764, -627, -1198, -877, -709, -693, -780, -422, -325, -911, -101, 97, -1127, -148, -341, -833, 128, -50, -551, 657, 131, -152, 467, 335, 615, 390, 267, 351, 384, 625, 171, 157, 1242, 456, 912, 1004, 436, 1421, 800, 608, 880, 216, 449, 727, 264, 771, 261, -59, 709, 485, 237, 455, 445, 301, -220, 204, 289, -902, 265, -782, -426, 133, -672, -380, 812, -616, -73, -610, -1141, 90, -814, -509, -752, 32, 496, -930, 295, -703, -298, 246, -142, -1702, 30, -1728, -992, 289, -1190, -438, 604, 32, 318, 405, -681, -125, -104, 327, -162, 439, 259, -21, 912, 516, -155, 1125, 431, 99, 1318, 402, -91, 1394, 94, 299, 876, 75, 350, 935, 729, 896, 817, 746, 694, 668, 323, -346, 669]
2503F69l63n48J157r26k14J057q96L06J94p83J95m7n07jL03n99L61P15m87j28
2523e42O80n18o55R23r45j08J066j076M67M88n82L03M69r40P28J97q13N38J41
2542a79r8m00Q62n86k33Q81n12J08J027q65L22M60j148L38P02j004Q00L38o03
2561B10P99j48k38l3J56j10j73M01n90k0N90q43K93M97q67M57O92q05M23q9o62
2582f0M06l63k76K36K81K5j80J41j23j63M5o49R5N96r58K99J59n17N30L1l41N30
2604b56p4j75M05p01oO03o24l42O91O6o52P75O00r11P55R6r33J056k06p32O97
2625A32ml93K33J24n87J320j50l27J81J75l48l25M09j043J040L13o42L42K49n12
2645A87J028p29l30P09r72N02Q6n1m28J06l34K71J79l98O46k48j10o90N83k41
$$ y = [669, 306, -242, 915, -11, -225, 832, -64, 242, 436, -347, -152, -199, -706, -707, -404, -1003, -642, 73, -414, -542, 138, -380, -1035, -112, -1057, -1165, -99, -1175, -708, -220, -802, -499, -30, -970, -242, -45, -858, -320, -179, -277, -677, 185, -401, -634, 247, -265, -157, 870, 5, 327, 787, -361, -23, 679, -325, 475, 813, 210, 1009, 861, 623, 590, 746, 636, 463, 864, 274, 254, 844, 1, 294, 791, -76, 381, 1073, 268, 691, 602, -60, 346, -17, -293, -57, 224, 249, 69, 210, 87, -76, -31, -680, -585, 11, -947, -648, -489, -1006, -476, -445, -786, -256, -330, -505, -100, -801, -807, -204, -828, -1170, -479, -413, -1065, -290, 310, -601, 154, 250, -683, 373, 167, -565, 132, 128, -265, -32, 92, -495, 825, 675, 348, 529, 704, 356, 31, 440, -603, 437, 750, 108, 450, 699, 187, 1215, 486, 156, 865, -107, 395, 481, 430, 2, 108, -226, 45, 224, -174, 472, 224, 114, -576, 7, -234]
2665b34l05J77l3m25J196o91l00Q62j186n9N85J62n91J39j47j79M37L75m45M21
2685b41n53m2N40L07o65P16j176J85N36J39K12Q33m92q66R52n6o93M02L71j1l0
2706C68L65r71K70N00j049J428R8k69M82r20N56o60j52P31k36r0N04n63L99r2
2726F99l41O79r03R7l62K03p86M49N95l70L09l33L31l24N94p05k73N00o30m49
2746a020m7K02j04O89k18K20K93j61R2q48J14J88m41P61j21L7J40l58K58J22K03
2767AM04j026Q95N78q09q89L69O31l4L07J60M62p43R12r95N53k48pM29l68N15
2788A097k54o87L09N07q78N86q37J605j167l41J146p77R5m4o17R07j88l90R40
2807A012l17K67n78k90k16p35Q68k91k77L26P1r87M05P99n07j1o69J291q61J51
$$ y = [-234, -539, -362, -395, -820, 376, -315, -615, 247, -939, -998, -413, -251, -842, -703, -850, -1029, -592, -217, -662, -241, -794, -836, -296, 11, -654, 62, -1114, -929, -393, -254, -42, 791, 299, -567, 385, 329, -364, 38, 409, 398, 368, 733, -238, 32, 532, -517, 911, 1009, 740, 1222, 302, 858, 198, 46, 777, 541, 451, 955, 392, 791, 699, 358, 1037, 134, 231, -131, 72, -714, -265, 330, -40, 269, -64, 267, -57, 537, -168, -441, 59, -571, -1020, -1067, -865, -969, -280, -498, -278, 15, -146, -54, -902, -788, -600, -1041, -280, -401, -364, -224, -582, -324, -202, 1, 405, -621, 274, 852, 43, -846, -477, 154, 120, 427, 587, 1049, 306, 1218, 223, 776, 528, 521, 950, 582, 1097, 843, 156, 465, 972, 94, 680, -157, 1448, 281, -60, 1086, 309, 404, 360, -257, 650, 462, 72, 1012, 695, 962, 384, 94, -122, -857, 11, -280, -557, -231, -160, -1147, -742, 57, -450, -461, -1130, 161, -700, -549]
2827e49M26q00J13O28n95J40L91k55J48m54M96l27l14P69m36K05N77n3j93Ro28
2848g02L94K06j50K87P51n38n83L54L28J38j53r1L23j04L88j07k22m69J41j32
2868E9O36J03J57m54r4j70Q1k92M98K15p6n01l59O58m81j32K64K1k56Q23m68o19
2890c87K56M7l91K43n39K05N97j87J56k87m13J5k64N47L50J32m00j85p11P43j270
2911a743J651L52o22N78j51k23j56j09q6L80q62J671m84m3J44L23r44L40J043
2930A059j241M55j53M85n05P53q57Q14l1l56o6J291r7j039O41p55K14l09m40P02
2950E65l96N38j91K32p30M58J4o07M55J10M50j003P2l05k03O78n43l08R07j505
2970a312Q95K94k84p9j024Q52jO00n86J55l9Q6l38J0J27m16K33N05n7M62o20P8
$$ y = [-549, -123, -923, -810, -182, -777, -637, -246, -501, -353, -807, -311, -638, -952, -183, -619, -414, 163, 110, -83, -74, -702, -308, -102, -252, 35, 786, 248, -335, 19, 347, 485, 332, 241, 564, 460, 848, 741, 519, 50, 191, 59, 695, 798, 955, 501, 407, 237, 318, 26, 524, 739, 663, 162, -197, 461, -20, -152, 112, 133, -123, 700, 232, -387, -131, -84, -475, -232, -771, -566, 31, -156, 0, -287, -700, -685, -949, -402, -52, 80, -320, -505, -1216, -473, -1743, -92, 260, -362, 216, 65, -158, -314, -423, -509, -129, -991, 680, 196, 153, 297, 620, -324, 16, 1059, -182, 273, 120, 605, 100, 853, -4, 810, 779, 423, 357, 1648, 1551, 512, 1153, 398, 612, 303, -137, 565, 169, 707, 516, 748, 18, 476, 490, -117, 338, 448, 898, -105, -33, -338, -541, 137, -406, -714, 193, -1312, -417, -123, -407, -486, -1510, -658, -659, -59, -645, -490, -529, -443, -781, -771, -644, -1060, -827, -322, -379, 83, -537, -459]
2992d59m77n08R17J338q58l54O37R8o10L83Q47j316N3P82P0N77j002N59J82q14
3012D5K1l09O25m92J162m98M57q27L68r4l7J97n60O58l97m4M11o47N0J8l77P14
3034D44l3R84j390m66k96J626j224O01K02j103L57J57k0r40N36P72j087OQ20j499
3054a553R54M32m80K39l76O80j97R32l53n73n1k20j29P64p02k57O18l90O74P08
3074G20l81j69P95j273J555j090j21O63l02l56L16r29O58j488O99R93j0j166K343
3093A457j58j285O30n56m1Q4N01j55P33p11p17M40p7L00l74N63j51p12k04o2M31
3114f4P85p04n89P22o4o90k79P26k1j27K69p64O85j229J227m31n47L78k66N15
3134d68n09R59p48J002n27n23k05P13O95j144O12Q60m88K48j11o23P49l76r2R6
$$ y = [-459, -936, -1444, -527, 811, -47, -401, 236, 334, -276, 107, 954, -362, -309, 473, 543, 1120, 118, 677, 859, 45, 66, -243, 382, -110, 1052, 554, 1011, 184, 552, 458, 421, 618, 58, 716, 319, 275, 686, 39, 89, 107, -270, 444, 411, 1395, 5, -461, -757, 869, -355, 246, 448, -655, -298, -141, -161, -1101, -565, 207, -880, -874, -54, -1553, -599, -167, -647, -408, -784, -104, -301, 631, 278, -295, -346, -566, -695, 69, -633, -890, -272, -662, 12, 720, 339, 170, 965, -308, 1247, 157, 36, 699, 397, 41, 357, -572, 86, -1402, -703, 290, 280, -886, 1457, 1299, 14, 644, 88, 47, 131, 632, 477, 1210, 499, -218, 222, 145, 445, 71, 634, 483, -229, -433, -495, -64, 721, 17, -572, 150, 86, -604, -883, -157, -178, -305, -36, -800, -115, -1344, -117, -548, -1095, -717, -983, -468, -977, -18, -766, 236, -291, -814, -1019, -306, 389, -755, -143, 717, 229, 477, 366, -257, 492, 116, 24, 120]
3154A20r8M7k32R6p0K39J069m68l87L36K66q4j209j91L37M59Q41k45j6l36m50
3175B4o38J422m05M59k82m60J7M23j19j336R69J62k3J15r38O93M2J75p39k42O92
3196A1K76J36n94l52M24M57j369l3J039R4n15M8j30l81R32q07P73K39j226Q38
3216a40K04j09j516J727l70k41N95J2j50L53J56K94p09P2p99j23Q30Q67m01L13
3236H65k43n29K72k44J011p54O36r54P01o3J47n94L08p23J080N2m24o61L22J18
3256C23k68J00K70p38R93n04o07M89m42L98r6j71J24p6L56o71J77j49Q4l77R55
3277A70k47l66P85o49r9o09L25M41J37p29N68L36J17L36k79k49J90l58j95j02
3297d77O69J91m01k50j45L03P11l35l51P29l64P42o31p58O58P1j95l53M36Q04
$$ y = [120, 22, 69, -163, -67, -137, 102, 1171, 703, 316, 652, 918, 834, -375, -566, -229, 230, 1071, 826, 810, 474, 24, -614, 808, 403, 862, 580, 120, 137, 560, 441, -895, 74, 236, 213, 328, -610, 83, 125, 300, -439, -681, 11, 287, 423, -171, -523, -99, 358, -1011, -1044, -5, 89, -426, -378, -508, -889, 43, -764, 9, 248, -978, -140, 64, -45, -1561, 166, -204, -445, 150, 162, 12, 365, 521, 815, 106, 178, -621, -744, 86, 953, 552, 865, 622, 93, 365, 121, 1132, 378, 1014, 60, 761, 698, 845, 251, 559, -164, 916, 968, 544, -117, 205, 323, 55, 155, 425, -313, 680, 176, -431, 58, -384, 14, -82, -253, -129, -205, 151, -520, -343, -492, -408, -785, 170, -77, -443, 342, -307, -406, -1015, -690, -249, -112, -841, -273, 63, 180, 516, 237, -12, 178, -180, -375, -477, 192, 383, -18, -268, -413, -110, 601, 266, -85, 644, 280, 1022, 391, -367, 291, 362, 167, -186, 250, 1054]
3317A054q84J32K99j93k13K1J48%L34m03j00K01K22o62o35J248p77Q77M49q47
3337B71k87q2O21k19r05K63M15J76m63O5n3o5J12l4o60J027l7j60L4l97N31j235
3359a082J219n97j03N25n6J26m9L2m21O73p33N26Q7n25J50m5N89j36M43l44k9
3380B50j40J84J80m57kk2N2L04k11O00J62K5p84M62k44r5K82k97K33k44j04K23
3402C57J85o7m35K5N00L89o39Q0K13m71n63L0M12l55N54J62n63n26O74n07M95
3423e0L5L26l39l12l85R78o21L97l9o80M20J14j35K54l13j83Q1l97O50j24L2J84
3445a07J30k31J87j61n3Q8k6L02p6k8L96j23J62n92L42k03L67R4j0m1o5m1j64
3468A47K20p6K16M9p4L89l23o67M42P9K15m43K37p9l45L00j63j8j0j60K68q9o1
$$ y = [1054, 170, 302, 601, 408, 195, 216, 364, 364, 698, 295, 195, 396, 618, -44, -679, 569, -208, 669, 1118, 271, -16, -98, 523, 304, -601, -338, 77, 253, -210, -145, -198, -263, -151, -185, -845, 182, 145, -15, 19, -378, 153, -1082, 137, -460, -563, -38, -94, 32, -17, 15, -406, 267, -466, 60, 147, -378, -228, -273, 316, 180, 623, 279, 250, 110, 294, 474, 17, 15, -7, 45, 349, 138, 738, 900, 925, 141, 603, 359, 264, 546, 249, 482, 238, 134, 357, 542, 475, 40, 65, 565, 954, 315, 395, 608, 137, -426, -396, 16, -339, 215, 377, -186, -712, -38, -545, -50, -15, 311, -28, -340, -725, 253, -368, 29, -10, -690, -270, -156, -291, -37, -350, -533, -452, -849, -199, -323, -291, -107, 23, -208, -21, -182, -235, -147, -173, 129, 53, 25, 421, 298, 460, -132, 210, 7, 374, 468, 458, 417, 352, 311, 147, 367, 291, 507, 556, 482, 871, 548, -119, 323, 402, 617, 174, 411, 332, -13, 287, 124, 106, 96, -64, 204, 115, 54]
3491E4j06J55l09k32J94J89q1O3j82O5j78J94j96lL24m48k2O4L90j64N4k77M5
3514d07O0J92k2m07N56j82K22J80l61m65O00KL37p0o1J06J6k81K81k25R3k3nL48
3538D84l28L96J03j027L55J334j166O8L33n76N18j51L73j008N56j76R67j457P90
3557C88k43J28K49l84J200j137n00J68R2M79o19J43j3j30j11N38p66L19K18m45
3577d26O73o51Q16o78N3J5l7Jn44P4L26O82o25N47l39n0K2n52L87j3K65m2J33
3600C7j73M36j91N59m71l73J00O2N39k21K85p34M39L29k29q23M89j47O72m0j32
3621D13J78P9r3n57Q12k69l69m3l05M36l19k3J5O41k79J72k65j18k11K1k41J72
3643a53M32m28N6j65l26M80n58L57k84M39j42o4J05p32P05nL5k01N4J51L54n36
$$ y = [54, -52, 103, -206, -438, -244, -55, -136, -73, -255, -190, -368, -174, -370, -373, -49, -497, -519, -455, -65, -229, -175, -452, -407, -347, -155, -177, -584, -28, -210, 12, 192, -169, -634, -34, -32, 305, 235, 174, 280, 296, 15, 296, 71, 164, 141, 136, 484, 156, 552, 655, -372, -17, 1317, 151, 219, 552, -24, 494, 343, 716, -292, 264, 88, 1055, -402, 388, 145, 273, 522, 138, 1338, 201, -299, -131, -39, 440, -179, -36, -49, -179, -290, 248, -518, -199, 19, -426, 247, -404, 412, -266, -213, -198, -235, -234, -778, -704, -378, 304, -321, 226, -113, -163, -141, -693, -306, -319, -54, -96, 37, -136, 300, 109, 668, 197, -176, -76, -14, 525, 304, 589, -145, 294, 623, 394, -429, 60, -87, 585, 545, 413, 591, 670, 577, 20, 832, 563, 194, 151, -154, 282, -37, -60, -45, 596, 317, 489, 224, 106, -105, -84, -325, -153, 279, -149, -93, -258, -584, -104, -662, -305, -589, -150, -292, -356, -251, -983, -278, -283, -248, -449, -395, -244, 110, -426]
3665d26N86k84m49K59k22O04M32p71K82L19l03l0j21J28k90M71L77m19j59l9J43
3686H8l6P3L67l25J85j05l60L64P29j119J30M53J71J04m96L29n1m10j09O30j90
3707D22l67K25m41o0O58P8p67P0K78J82k73l8l12L54n23K61l16K43o6j13R9M52
3729D6J62j032K62L67r5l9M50o80J68L61m47O46o86N8M8M30j76K35L6l22J91J97
3751A80L73n59M6M7J14l84K51Q3n04L34M35j63l06L90m6j12N84l51o0R9K5k93
3773A83o5O93q61M05J51m86N95J76p86R23p67k11m68M93M91n12j55k29n5P45n46
3794b86j13Q3j57O3K05Q6o06N97l41J03K47l05K55k88K15M71j227P62N08n16L53
3815A09j128N43M32K91j95j90N86p08J40L18J79k69M60p55R0K10N6l60L20pQ85
$$ y = [-426, 160, -124, -573, -314, -536, 68, 500, -271, 11, 330, 27, -3, -124, 4, -286, 185, 562, 143, -16, -55, 88, 52, 125, 492, 167, 352, 247, -113, 251, 980, -139, -9, 444, 615, 719, 223, 552, 501, 91, -18, 612, 422, 55, 280, -161, -221, 437, 515, -252, -182, 96, 278, 5, -33, -345, 9, -514, -253, -569, -326, -392, -505, -406, 46, 208, -824, -562, -195, -290, -329, 121, -559, -391, -30, -477, 169, -517, -459, -411, 19, -157, 78, 114, -208, -17, 180, 553, -6, 40, 87, 201, -183, 68, 151, -353, -19, 416, 253, -53, 337, 291, 179, 763, 412, 352, 451, 476, 183, 118, 811, -50, 355, 506, 20, 615, 791, 5, 928, 161, -50, -518, -25, 466, -46, -201, -430, -485, 260, -286, -399, -316, -473, -410, -205, -119, -725, -128, -469, -366, -119, -424, -169, -457, -242, 229, -998, -236, 272, -244, 109, -1019, -476, -44, 247, 52, -138, 448, -260, -120, 198, 377, 108, 568, -187, -97, 113, 169, -191, 129, 122, 1007]
3836A007o07k51n16QL61K63q45O40M63o86K35M76K00q36K32M02n15p29K40J82
3856b76O51o27l53J277j077l79M24P52p08O74k79q54J093o65K94K22K66L71m09
3875C97l63L4k56N16r13P27k70o32P91n17P16J41n57M90j032M55l9M29o01J59
3895c25J45M10n16l17J105k66q7J45o49M52l80N62k22j16M33m42P28n60L36j84
3915B52L22m35J42J22l40O08k84j3j65k53J084q26K10k3n81P06n2n49Pk74P10
3936C68Kk95l38K50L78j04Kp14O14l78R0rQ6j73J72K39n83Oj7M50k76j29k87N32
3960a14O6R0j09pk24O05l03N6l48K29j03k36N39l58M6K2J73N2N7j07k04J29J86
3983A37l27O0L52k78l0L31J08j0J92q0j98M59n08J5p0k24K21K42k76J10M0k5J90
$$ y = [1007, 400, 149, -367, -359, 2, 265, -580, 60, 523, -163, 72, 548, 748, -88, 144, 546, 31, -698, -458, -276, 375, -252, -605, 672, -405, -784, -360, 392, -316, 358, 79, -775, 318, -347, -53, 169, 435, 806, 397, 34, 68, -188, 328, -585, 142, -128, -760, 31, -486, 230, 371, -186, 304, -728, -273, -312, 117, -484, -325, -180, 230, -286, -603, 502, 236, 149, 294, -355, 97, -283, 279, 57, -59, 374, -68, 660, 100, 436, 252, 574, 139, 281, 403, 63, 671, 387, 374, 209, -44, 1040, 214, 424, 401, -180, 526, 474, -75, -68, -342, 368, 370, 75, -263, -13, 365, 261, 263, -451, 163, -215, -125, -134, -48, -221, -49, 190, -393, -387, -404, 46, -230, -359, -646, -114, -48, 42, -67, -74, -298, 307, 4, 60, -288, -59, -162, -398, 141, -217, -171, -149, 24, 76, 133, 26, -178, -49, 137, -190, -130, 222, -56, -86, 245, 353, 343, 535, 455, 257, 716, 208, 223, 153, -71, 150, 392, 116, 226, 266, 241, 431]
4006D31l64j5K84n09K19J61q3p5n2L81m00k43K00J41k54k05N65j59k17k18L12
4027a00l0p3J1j50J85n6k7N6J67K0k93o9n4j15N66m28k9K86j89M25o3j44M9Pp5
4052a23J5p6J44J79M6J11j04M0k03r3L42r8p2J46j08N0k47Q9L17k8j35J59k81
4075G0J44j37J17K7K1k9j65p6N2k6J83n5j39M5J98r1k8J3k14J74l26J66K47p15
4099e44N86j66o0j27r3K60j40j5j61J0L09j10q4M5K74j61L7K54m97r9L33mJ46
4122gp4RK4R4J01o32M39Q1P9r8r4K01J26n42K94J70N5mJ91j32L9k6k2J73l59J47
4148B33J21J28J08m90J0K14p8j17L43n40K4J65J0L0n9L90l68L4n9K1%r8j8j03
4172i9j7%q1R4j70q1M3Q7o7R9o8k91L65o7L5R3k04NQ7o9P9K7J58k39K94K2j20
$$ y = [431, 67, 52, 336, -173, 46, 207, 124, 49, -3, 378, -22, -265, -65, 76, -178, -383, 182, 23, -194, -412, -100, -130, -203, -192, -342, -157, -213, -240, -184, -17, 3, -290, -359, -413, -528, 38, -390, -419, -133, -322, 103, 40, -104, -55, -48, -123, -108, -184, -40, 139, 185, 296, 192, 232, 29, -64, 278, 180, 108, 254, 146, 196, -51, 38, 355, 327, 192, 351, 70, 214, 77, 194, 221, 242, 213, 48, -28, 24, -2, 181, 126, -13, 32, 230, 139, 111, 124, -90, 84, -242, -76, 171, -544, 42, -124, -184, -311, -404, -144, -284, -299, -460, -450, -141, -251, -335, -290, -16, -177, -140, 114, -383, -482, -149, -153, -7, -81, -72, -48, 46, 147, -485, -46, 35, 114, 16, -78, 123, 249, -293, 1, 171, 226, 222, 413, 281, 320, 294, 272, 445, 86, 233, 354, 482, 590, 100, 110, 324, 246, 129, 472, -68, -44, 121, 131, 161, 102, 492, 124, 158, 99, 120, 120, 22, 4, -99, -116, -116, -197, -103, -273, -354, -311, -224, -291, -192, -260, -551, -186, -253, -218, -125, -329, -324, -237, -306, -227, -200, -42, -281, 13, 35, -85]
4199h5K69j49J5K00j68k40M63m02L56O3j97J02%j04nj4P9n8R8J06qj86JR5J42
4224C73j45l8n2J8n3j85P5K44M1j92J32j27O5l4k67J84q8J06k35k44J74Q85q72
4247b35K02L83l09l28K64L71o23L06M38q32j82O41K6K38o4j330J342p05J093j135
4267d39M28J15l14K12L80m53JJ15l06k03M10k0O8Q5l20K29L88q28L44o04O31j11
4289a92J117j044M63M61q62P5Q96q47M0O18m33J37l48P56m38l0k68M39m78m72
4309d10j81L6N65J14L28p05P50p46M48J8l3K07l75M32q52L43o14O93k9l48P94
4330D35j24J21q4r49Q54k99K62N44j186N57L7o12j84R89q0n5l96M29p88j77P03
4351cQ2J5N99q75N80n30M25o96J720j126Q05m11j085m23J559O9J36j446l7j10
$$ y = [-85, 184, 35, 50, 250, 82, -158, 305, -97, 259, 322, 125, 227, 227, 123, 118, 104, 183, 125, 223, 329, 321, 135, 136, 231, 373, 228, 190, 138, 156, 103, -82, -7, 237, 278, 86, 218, 91, 156, 122, -145, 39, -49, 57, -178, -422, -248, 637, -235, -33, 350, 41, -287, -23, 348, -275, 31, 469, -363, -545, 96, 122, 360, 296, -1034, 308, -397, 696, -439, -11, 104, -210, 2, 382, -71, -70, 45, -261, -464, -54, -74, -6, 79, -241, -12, 376, -452, -108, -712, -81, -192, 925, -119, 344, 805, -57, 18, 914, 67, 107, 725, 292, 429, 81, 837, 399, 369, 101, 540, 62, -410, -591, -555, 10, 124, 452, -253, 497, -249, 199, 217, 184, 391, 16, 448, -404, -61, -675, 18, -11, -359, 435, 311, 432, 348, -601, 253, -46, 216, 760, -426, 131, 168, -444, -628, 361, 281, 226, -170, 259, -529, -706, -3, 79, 94, 693, -182, 398, -132, 293, -403, 1317, 191, 996, 585, -500, -923, 636, 705, 841, -605, -642, -752]
4371g52J343M90k077J500k009Q55J357M9p40J4n62J126o51n26J345j41o48k8R47
4390H92r67R2M45L17r52Q14m82j226J604l08N37j605J022N43k145J307o7m74J040
4409C87j295L73J208j158R42k24m82k77P45o52R45j380M53m5J128j77j33l6po25
4429c10L79k10K38O01q57J131n75m41l24O14L83n67k28m25J093o55Q61q8r14Q30
4449E36K73p20r0j52K7M06q3Q6j67R1j34r5lN41j113N07Q19l77j68l82L52N1l97
4472a92P27j51k11P8k45K15p24N25l52M51J76j70N30r89M75j413J297J14o77J011
4492D75r64N51R27j046r59O17K87R42o14k49K65j25o54k1J456q26l95K50L28n98
4512c53J90O03k94M75l07L64J41k95p96L37j14l5J95J32l34K19K79j87J25m25
$$ y = [-752, 591, 1081, -996, 504, -1505, -650, 707, 756, 16, 30, -532, 594, -57, -583, 762, 621, -27, -55, 892, -75, 17, 462, 779, -173, 641, 159, -1067, 537, 229, 766, -839, 183, 726, -1419, -112, -179, -653, 387, -908, -535, 673, -485, 457, 233, -249, -526, 219, -433, 512, -868, -415, -460, 668, 491, 358, 322, 315, -310, 69, -141, 97, 698, -159, 972, 397, -44, -368, 246, 629, 62, -166, -591, 502, -153, 708, 620, -294, 536, 809, 89, -1, -153, -126, 280, 197, 283, 116, 207, 73, -22, -25, 516, -597, -90, 729, 352, 184, -198, 154, 205, -192, 535, 384, 173, 251, 6, 221, -503, 22, -330, 121, 297, 127, 657, -332, 143, -1270, 27, 141, -536, 475, -489, 62, 989, -57, -1016, -399, -112, 830, 216, -33, 232, 107, -547, -568, 888, 62, -333, -83, 245, -353, -163, 440, 146, 621, 314, 678, 819, 524, -272, 65, -49, -84, 111, 243, -91, 128, 407, 220, 345, -80]
4532h0R97o51k23j09J42o12K14J4P97m07M60j258J313m46P2l10P6j071J101N7
4552G6k3k46M35l36k96N24n58M61l75k05m2J99L32k8p2j90P5J0j19J038p78j71
4574b89k42M30r0M34l89P25n99J75J97J73l36l50J79K84M78m17n8p67L95p8O75
4595E30l60J96R6O6J27l88J47l13n67O29K0q4r4P69m67J3k27L06j05l61k12K88
4617IL2k19L4k26J20K50J13J40r6k40k94K83m39L38J98q3l5J35l3p6N7l27J28
4640b31N99m57j42J95n6N1o6q9J77k38J19k73J33K62k82L38Q4j28k28L43p9rk7
4663dl0L78o1j35O9J0pJ4j86P4J10k08L78k05k13K69k6j15kJ86j64j55p2K59L7
4688B01j51j28j38K99J39l56J12j93L59j38r9k41K07K96m30J09J13k39R7J44K64
$$ y = [-80, 917, 266, 43, -66, 76, -536, -322, -308, 489, 82, 542, -716, 597, 151, 223, -87, -11, -1082, 19, 76, 53, -193, 242, -94, -390, 134, -424, 37, -338, -543, -585, -386, -54, -82, -154, -344, -269, -259, -378, 660, -118, -289, -531, -101, -191, 243, -146, 579, -20, 155, 352, 525, 189, -161, 18, 302, 780, 363, 305, -462, -67, -145, 530, 170, 366, 462, 528, 655, 267, 414, 101, -466, 163, 183, 99, 5, 774, 307, 320, 93, 399, 294, -67, -279, 9, 41, -178, -144, -370, -250, 0, 113, 253, 157, -83, -377, -94, -533, -195, 3, -80, -115, 20, -13, -89, -32, -359, -231, 368, -89, -231, -36, -92, -41, -107, -196, -19, -257, -138, -411, -278, -16, -298, 40, 124, -4, -232, 111, 32, 23, -4, -34, 344, 283, 148, 217, 227, 220, 234, 48, 122, 232, 24, 402, 197, -16, 253, 227, 112, 110, 296, 132, -23, -95, 164, 201, 50, -78, -216, 83, 222, -134, -22, -215, 144, 6, -93, -334, -127, 169, -261, -152, -39, -278, -181, -37, 227]
4709B27k73j2j36kP8j07Q4k7P9r4j30J43J40j15K23j85J25k20j9K10l7j26M28
4732B54j78j89N66j34p1k28J80k12J3M9Q4j29K5J81m0j74J76J51l43j41O28m16
4754E2M22o0Rm85K45k03K93L1j60m16K16PK16k05j87J77K93k01n17M99q0M14m84
4777a24K56m56M6m45Q11p39J046n01m4j14l20O66n75O7K32n39L25M92J20N4j89
4798F9j04j99Q30p31m5O26l85M25r04l93Q44k31L86k09O71l18o99K84J206j393
4818b70P05l33j031J124m53j74O57J60J72l78K3J1m33m84P59o7K53Q5l82J64k62
4839a54O07l19L81j32K31m19o83M93P1k29N72n87L89j45k28l57M87k51j33L41
4859f5j95J11k75Q8K95n1l8L29j80K3q3ro6Q9P0qj74L6J54j40n7K36J6k96K09
$$ y = [227, -46, -58, -194, -196, -118, -225, -141, -168, -89, -183, -313, -170, -30, -145, 78, -107, 18, -202, -221, -11, -48, -174, 254, 76, -113, 453, 319, 248, 20, 200, -12, 1, 50, 134, 5, 30, 211, 171, -3, 173, 324, -19, -160, 468, 52, 474, 414, 423, -62, 183, -20, 273, 304, 144, -272, -56, -49, 167, -38, -225, -48, 245, 44, -473, 26, -54, 360, -124, 132, -324, -278, -723, 88, -651, 395, -106, -150, -264, -584, 82, -493, -426, -194, -733, -408, 84, 204, 258, 69, -35, -234, 596, -135, -180, 446, 61, 486, -418, -811, 33, -198, 188, -21, 650, 332, -367, -83, 1123, -270, 435, 102, -929, 195, -258, -432, 225, 385, 557, 179, 202, 213, -220, -704, 55, -12, 241, 326, -56, 108, -154, 453, 134, 515, 383, 614, 195, -488, 5, 76, -153, 419, -168, 221, 76, -152, -509, -22, -273, -406, -65, -260, -149, -424, -336, -41, -92, -130, 199, 19, 42, -41, -50, -116, -27, 43, 35, -139, -103, 51, -89, -146, 90, 106, -190, 19]
4884A9K07k20K5NOm0J7K78k29K87j54n5nJ40j66J3j2M7O8k55M93l38J30j74j11
4909b4K34l42K37j96L46q0J38l94M0N2N4j25M1j5j03N2j00kJ49J71l22j29L16
4932bj82P7j00l7J30m7l27K31J89j29K65m96M53q5J36l0j33j19R6J16l7J4M7L3
4956F3k51K43j6P6K32j04j09N9K7k1R1j7j09L7o1Q3J17j55J47j22k5p6p6O0M1
4981A34J12J35j82j45k9j7K10m68L99Ml36K62O5j16J01j3j20j76P3J3j6K8p3j1
5005a66K43O7k77J57l85K20j31lJ57L1NJ18k31j01l2J43K08j62p6J55j46r1K66
5028c1j63J56L1J1j44K54M48l21l94n5L75K9J01J8K30n91k9L16l4J0j01k37K01
5051H0M19J61k72j84m3K29q5l16K47K19j3k78P08m88j22k14L30k06k51j41M62
$$ y = [19, 226, 6, 31, 36, 42, 2, 19, 297, 68, 355, 201, 146, 141, 281, 115, 128, 116, 163, 231, -24, 469, 131, 261, 87, -24, 210, -132, 105, -91, 255, 175, 313, -81, -41, 11, 65, -60, -19, -34, -137, -85, -185, -187, -38, 133, -189, -318, -2, -184, -107, -207, -244, -114, -161, -488, -257, -68, -197, 68, -428, 25, -60, 76, 46, -87, -206, -110, 6, -31, -17, 30, 63, -188, 55, 39, 115, 347, 243, 134, 193, 220, 199, 290, 273, 164, 201, 140, 223, 340, 185, 332, 210, 185, 109, 33, 93, 134, 246, 381, 199, 54, 25, 8, 218, -250, 149, 153, -183, 79, 144, 28, 129, 116, -4, -180, -107, -94, -110, -82, -155, -166, 77, 144, -133, 24, -361, -141, -272, -275, -118, -87, -82, 36, -195, -296, -328, -185, 23, -139, -215, -60, -206, -297, -31, -194, -38, -7, 4, -140, 114, 562, 241, -153, -208, 167, 196, 297, 315, 545, -46, -75, 241, 207, 217, 116, -121, 80, 499, 660, 388, 204, 161, 390, 305, -11, 236, 455, 442, 164, 872, 384, 262, 48, 378, 172, -79, -220, 242]
5072B42j70L08r03P10p30P23k13J75n30O97q99k13r4N01k30P94j57r75J225n96
5092c35N97m65M66k76n87K08N47l24l5l82M63j41R58q2o7m71J43L58m83K07o6
5113B33K79k44p13Q31r5m43j48K28O58l72j73j22K9J88J29m11O11k04l83K05n8
5134B5Ql8K11l36M04k3j61j62O4M8j43j32Q9L2O0M4O1J3m6r3o6n2n5p6r7K53L05
5161A37l94J50k82J72O1J72j17k03Q7J25k24J98r5K45k86L1J61M5Q4j74L87k98
5183a8Q9k35P9N6M6K9J84q2k06o8Q5k35L83J15k26K35J32k02J30j9l50M75l77
5206B0j46J18M94o08K47m02N51k84L14j49M3k28K92O03o28l31j27L75o6n58J21
5227c49M07L91j219J566n45o64L92m56Q30J53n96k17j70j05J250n93M11l27l03
$$ y = [242, 72, 380, -523, 187, -543, 180, -33, 142, -388, 309, -590, -803, -897, -396, -626, 168, 11, -964, 261, -335, 262, -203, 263, -13, -600, -392, 155, -169, -204, -586, -123, -264, 694, 612, 545, 74, 217, 575, 92, 299, 233, 512, 268, -445, 386, 291, -152, -300, -72, 586, 214, 41, -81, -52, 136, 265, -146, 465, 261, -122, 83, 25, 33, -5, 206, -130, 274, 251, 90, -72, -8, 40, -103, -235, -146, -114, -54, -10, 51, 64, 18, -75, -141, -193, -248, -324, -421, -168, 137, -257, -107, -389, -217, -156, 16, -101, -304, -217, -92, -316, -118, -213, 32, -254, -223, -62, -17, 67, -107, 280, -18, 71, -164, -85, -29, 17, 46, 230, 148, -58, -126, -41, -276, 107, 222, -4, 231, 363, 161, 291, 272, -78, 397, 20, -126, -8, 486, -122, 125, -277, 274, -10, 304, 155, 198, -30, 262, 865, 237, -94, -221, 154, 88, -470, -349, 58, 449, -770, 796, 251, -413, -21, -477, 353, 506, -90, -307, -477, -582, 668, 75, 486, 159, -144]
5246a44K53J190r70l49r5j57N7q66J560o95Q97j55o92N71j90j34o31J251l51J21
5266D71m65K85l08L46N04q07J05m37P24K39n40K25j6J73m47p28Q29l02O16o42
5286a75L95n09M55J26k20k58R0k67M31K66p8l52N0J86k16K36j77n9j4j56K52m2
5308c6J19j73j4N8k01l8M37k75j31K75q5K55k76k2o5O2J06J32k80N3jO3N6k8M5
5333C6n7p9J43q9L8L48j95j40K17j95n4j43K98o0J2j9O6J35j57j45J5K91k53J39
5357A52j81J04m6k03L19J2k6j41K18L3k76mM2K08m61J60J29k10L57l04Nqk52L42
5381c1J99m27J2J23j31K83l06N4L83k41J87j40k6L9r5P8j72J5R9p7J65k7k78K15
5405i9J70K6n3r1m8Q7K2j64K28J5n5j20K56j13J21k20K22o5J97l46K32r4J90j59
$$ y = [-144, 109, 1299, 329, -20, -115, -272, -215, -1081, 479, -216, 681, 526, -166, 405, 215, 81, -550, 701, 350, 471, 6, 291, -17, 329, 833, 26, 131, -306, 418, 657, 117, 342, 326, 499, 52, -676, 153, -149, 467, -175, 220, -289, 166, 292, 72, -186, -96, -363, 68, 334, 256, -96, -46, 140, -76, 160, -17, -76, -90, -246, 6, -36, 83, -90, -104, -46, -247, -285, 152, -123, -254, 21, -64, 191, -85, -107, -172, -110, -4, 128, -152, -99, -100, -37, 19, -9, 36, -21, -100, 43, -46, -8, 340, 145, 5, 222, 27, -27, -170, 128, 68, 80, 61, 127, 262, 105, -40, -25, 266, 13, 152, -29, 75, 29, -174, 145, 157, 131, -10, 208, 241, -35, -39, 3, 211, -250, -90, 39, -171, 186, -118, -113, -121, -373, -31, 168, -259, -247, -124, -255, 28, -278, -224, 159, -82, 105, -35, -61, -22, -117, -39, -211, -196, -97, -174, -9, -36, -314, -99, 71, 97, 44, -47, -95, -8, 14, -150, 78, 93, 38, -82, 174, 61, 182, -38, 184, 119, 316, -30, 202, 108, 298, 139]
5429A39O8Q2r2l3m1J65k46P2l16L26m7j12K30n1j01Q4k4k13L02m65J05J75p3j61
5453b27Q2J52Q4j53l12K38J70N2k28L9q8p3L26l33K96J23n54J71q1K6L58j16Q9
5476D1j55K2J75L7l60K69m5M0J10j56J6p6N0P4q0L12j21L1q8J99lq4o2Kl3L5J81
5503C31m1j29o7j09K55k68R6J38k70M6J78k06L70j12q6M3o3j70k14K70p5J32l3
5526A6m6k35K84r5Q0j0k22J39l0k10K12O1k82M43m68J07L24j52j03K93l23J77
5548d0j32R1LnR5q6L39l72K76k74J97k65J18K12l46L74R0j07q6j83K93r6j64R6
5572B8J86l76J22K55k26L29j20k0j92R6m2K29k64KN6o0q7J08P9n5j11J77k21L01
5596A94q3j36M1j22Q1J96K7l51j2R3Q1r2j23K28n3P2o2l13K26j44L6M08k51j39
$$ y = [139, 207, 289, 197, 164, 123, 288, 42, 114, -202, 124, 77, -35, 195, 144, 43, 127, 103, -110, 192, -273, -168, 7, -66, -227, -145, 7, 91, -62, -374, -136, 34, 86, -142, -103, -191, -264, 62, -271, 25, 148, -406, -235, -316, -290, 68, -48, 41, -114, -92, 83, 120, -240, 29, -16, 24, 134, -22, -6, -82, -32, 42, -38, 274, 153, 184, 96, 295, 292, 208, 146, 148, 115, 150, 331, 290, 161, 94, -15, 240, -28, 68, 206, -64, -18, 160, -46, 324, 212, 126, 169, 106, -64, -278, -8, -83, 49, 16, -30, -265, 19, -76, 4, -6, -228, -89, -119, -329, -117, -56, -338, 105, -363, -256, 68, -84, -187, 106, -217, -40, -172, -81, -78, -83, 12, -74, 265, -107, 169, -105, 92, -173, -55, 157, -189, 185, 275, 168, 82, -101, 192, 96, -68, 28, 214, -162, -40, 215, -11, 318, 198, 178, -14, 82, 40, 269, 5, 7, 63, 3, -84, 24, 103, 48, -63, 114, -107, 194, 111, -25, 16, -106, -25, 171, 198, -153, -165, -72, 9, -83, -206, 22, -31, 41, -21, -334, -108, -252, -216, 192, -59, -198]
5620a98J2J42j18R9Q0J40j93k82K97m2o5Q0Lm9J91m39L56K3lO6j65P4l35L82K14
5645B70l64K90j67Q7l7N7Kj06P2L9j4Q9l11L95p2q7p0L41k33j41J53k86r6K12
5669B3K27j99J23j82j68J67P8n9j69K1j4J6r9l9K12oJ58k07O4K5j46r2L08r8j83
5694b39J70p9K30k07J25k46Q5J24O9J6J2j96p7J44J44l6Mk13M62k70j63K69j0
5717A18j77J27J4J23j74K32l59P0Q5nN8j64L29j38q8J5k4n6%j26K75J02j4j09
5741A14j22R3J3m4j89N7J9R2Pk2j41K6Q8K7k44M13l67j72J07K54Qk64J88m2q8
5766a89J98k54M0P0L19l36P9J93k04K5j0k09L07j34P1nP7lj25K3J58p9k53K87
5790D6j23j33J98J67n2J20r3q1N8L19k11k30M8K00k15J16m9L8k38K56l04L59k9
$$ y = [-198, -186, -44, -162, -63, 17, 157, -36, -318, -21, -63, -128, -48, -45, -94, 97, -342, 14, 37, 34, 100, -65, 9, -326, 56, 270, -94, 196, 29, 116, 79, 136, 138, 32, 104, 143, 129, 218, -93, 302, 230, 143, 73, 414, 181, 40, 193, -93, -189, 23, 250, 51, 174, -8, -176, -9, 69, 10, -159, -138, -152, -136, -235, -274, -62, -68, 90, -117, -53, -28, -174, -266, 42, -56, -239, -69, -148, 82, -125, 0, -246, -161, -37, 32, 48, 60, -136, -213, -69, 75, 39, 43, -170, 292, 22, -141, 128, 118, -59, 68, 82, 205, 31, 263, -96, -26, 59, 54, 112, -52, 277, 139, 51, 66, 42, -14, -14, -140, 135, 237, 223, 114, -8, 85, 98, 54, -135, -78, -59, 33, 40, 18, -123, -97, -9, 18, -226, 187, -180, -352, -245, 9, 17, -247, -59, -101, -189, 9, -245, -205, -135, 184, -152, -73, 120, -84, -59, -69, -278, 29, -105, -34, -39, 38, 35, -90, -67, 91, 12, -241, 46, -77, -210, -12, 155, 103, 223, 130, 49, 107, 426, 215, -15, 33, 233, 18, 134, 85, 123, -115, 141, -163, 196, 167]
5813A67N1k15j12L21L3k37K66j71n7L4K5l9k35j39K78j64K33j63o7J85j21J88
5835F1j14nJ23k67J21J47m75M4K30J78k35QJ99j90J45nP1R6j93J72j96K04R7l35
5859a19L12k42J65o4N9k44J84Lj46J96N9o0p3jP1Q7o0J11k30j98M60j70J31K82
5883E13l78k33L8J69p1L8J06k02K0k87M13J3j20j40pq8O8Q8J83m1j4M1k34Q5k46
5908b86K33J5M1k28l5K11l3j40K00j04N9l9o9N0P4j32N8Q1J37l8j42L36l38Q7
5932bk03K82J57m86M44l20J15J02l2l32N31L0P5j94J8J42k16n5o0J10M6r0JJ07
5956A70l19MJ40q3J49PJ4k07L26q5J78j02K5m37N54n26k67P42j04Qj29j5J23m23
5980b57M35K66k97k25j92L06p25O09l83O15K01o85l37J191n81J73O16n93m94O29
$$ y = [167, 218, 3, -109, 212, 245, 8, 274, 103, 46, 80, 105, 66, -169, -308, -30, -194, 39, -124, -191, -6, -127, 61, -53, -58, 65, -202, -81, 66, -409, -365, -135, 43, -192, -184, 15, -175, -30, -35, 36, 132, -61, 111, -85, 119, 216, -119, 193, -49, 116, 52, 111, -133, 51, 54, -92, 104, 163, 103, 30, 29, 100, 187, 127, 238, 8, -190, 270, 100, 231, 513, 135, -98, -60, 109, 38, 76, 182, -20, 0, -287, 126, 139, 19, -121, -128, -216, -148, -60, 123, 82, 68, 109, -125, -40, -286, -53, -38, 3, -225, -260, -49, -82, -222, -22, -126, -67, -106, -175, -125, -51, -183, -125, -44, 93, 55, -87, 249, -89, -2, -205, 77, 234, -252, 192, -128, -13, 89, 57, -275, 256, 286, 361, 167, 185, 327, 111, 56, -4, 106, 152, 62, 63, 170, -149, -145, -5, -88, 61, 68, 82, -125, 201, 116, 294, 192, 217, -220, 334, -192, -459, 283, 179, 187, 58, 43, 166, -257, 178, 444, 147, -78, -270, 36, -689, -80, -463, 152, 353, -332, -669, 522, -59, 114, 730, 137, -357, 272]
6000B72K04r86L49N65k82j41j17l77NP18L53n35J77m17j60k81P96j44M58n9j47
6021B51J97m32M32o80q6P07m15L15m53k08P29l52p8L04r0n2n38N67L67p53j3K32
6043d9KM16p9l39q8m04K94rN97l33k0k81M88K5r8j81l53L42K46m9o9O0l49K60
6067B9K5J38k67Q0J21J0J33m07K18L5j11k95K98j23M4j59J21K06m4k48pJ73J00
6090G0J31k48K46k91O9K51k33L3O0j32N5j08K00k82M62j12q5Q1k48K07K9j57K87
6113B85j64j70K37k54j01K4L11l35L61k49J55l37J61j07n7J86k69M02k20q7L31
6134A03Jl67R6p%nK88q0j13k4J74m6p4j64J29M8K49k12R6M8O6p1k5j05K3j10J01
6161A9j2n3J4Q0n5J24j2l7K33j21l37K40l7j22L3J45J48l26l7L39l0k52NK0J60
$$ y = [272, 476, -510, -161, 404, 122, -19, -136, -513, -508, 210, 563, 28, 205, -212, -372, -653, 143, -1, 457, 398, 251, 448, 16, 448, -232, -318, 389, -26, 289, -164, -372, 357, 5, -73, 231, 141, 89, -449, 118, 485, -268, -281, -49, -47, 369, 290, -49, -137, -541, -247, -256, 341, 8, -12, -293, 195, 220, 122, -59, -412, -70, 176, 127, 58, 118, -231, 29, 54, 192, -75, 5, 126, 136, 269, -138, 80, 115, 4, -291, 7, -116, -72, -231, -110, 96, 52, -196, -203, -30, 70, 201, -47, 199, -92, -23, 228, -5, 28, 88, -44, 11, -97, 103, -179, 283, 171, 86, 167, -81, 126, 155, -2, 285, 121, -49, 188, -66, -167, -143, 168, -167, 194, -55, 100, -237, -76, -183, -240, -54, -323, 79, -141, -228, 103, 104, -263, -167, -174, -174, -179, 109, 29, -84, -108, 66, 20, -54, -218, -89, -41, 208, -4, 92, 140, 206, 135, 110, 5, 28, -82, 19, 7, -46, -32, 48, -7, 117, 105, 68, 301, 180, -157, 83, 46, -76, -43, 102, 250, -76, -113, 226, 196, -56, -51, -31, 129]
6186A29L8j03O0k5k20K54k82J39L0k67L43j86Q5J95j91L5j63J32k32J22K2m6J93
6209F2l82L14mJ44j62j43Mj35J40J20k14J23Q5j13JK05l19K88j85J90k2L5m7j24
6233a39J73k76L59j48j39J70J35O0k33R5J11n2j82m3K99j8j00l81L73J35J4j6
6255A97k2Q7j84N2K04m08L19k08P0J27k71r6K79j18j20Q1K4j07L4K00r7j32O6
6278b3k7P5k09K24j45J96r6K30m23J54K92l13J27j71J8m9J14j44J00J60k99J37
6300g2ol3l5L57j52j5r3K6N2j27K0J95k77J1K48j90K19l86M37J02k20k7Q9o2K02
6325B63J2m27K80m4r5Q9j21r2K80Mk49J93J88m61M4K85r3J3Ok29L95l17L86k64
6349D6j0j63J10o5J00j66j5K38j70j56m4L51j52J3j74N2J2KO8J73L9j93Jl5J97
$$ y = [129, 167, 64, 124, 99, -121, 133, -149, -10, 20, -247, 96, -90, -5, 190, -1, 34, -129, 3, -229, -107, -85, -131, 62, -320, -6, -10, 134, -28, -171, -167, -302, -162, -42, -256, -133, -48, -161, -160, 45, -274, 14, -171, 19, -3, 32, -15, -139, 34, -242, 117, -31, -170, 0, 135, 195, -38, 57, 168, 116, -66, -109, 190, 172, 72, -309, 64, 199, 213, 197, 175, 262, 78, 130, 334, -74, 245, 37, 107, 234, -37, -133, 146, 28, -92, -11, 13, -94, -60, 140, 43, -89, -23, -50, 25, -184, 40, -105, 91, -5, 225, -198, -44, 248, -65, 62, -109, -91, -140, -26, -170, -70, 90, -209, -72, -78, -111, -146, 211, 59, 44, -49, -23, 29, -98, -78, 117, -160, -149, 99, -91, 128, -258, 179, 281, 61, 34, 123, 61, 263, 275, -152, 128, 84, -11, 78, -43, -135, 145, 149, -100, 93, 281, -180, -136, 149, 56, 69, 75, -154, 241, -76, 310, 46, 36, -127, -17, -82, 18, -148, -163, 75, -95, -251, -295, 56, -96, -83, -257, -205, -193, -191, -123, 50, 89, -104, -103, -138, 59]
6374E9k95K94R0k5j97N2q4K37K0k95K34l2J3lP4m9J33j97J31j41q1K09K3J3j90
6399gK16j2n8j14n6J88j73N7K06k25J8j15K8r6L9K92n7m6o6L9j0r4K46m7j6k1
6425A16j89p8rj10L59k9j76L4j15k7J70l54M43j47qJ74k0j96k5k04L19p9J52j20
6449a19l0K4j22K48l02K16R6%j7k84K61K3J99k46J2j38M07j96R4R5k06K25l5q8
6473A17J82l84J46o1J46l3%k90K96j88O0O4p2o0K51K64k60l4n1o8L15m53l4J52
6497Ek2O3j51J59j15J86n1j63K59l63P9J10L6q6P8q7k10K92l3J33j14k8KM4j47
6522a24L0J88m38N09l11N8J96Mk0O4r9L9j53L2J56N6m8q2m0l2K21j3Lj12J1o6
6548B9O5L5j36k08L23Lj44O4J95j55K15j65n8l9K26k60K9P3m7J51r2r3j76k1j3
$$ y = [59, -236, 58, 148, 123, -74, -22, -106, 131, 151, -144, 90, 58, 71, 68, 142, 93, 226, 29, 160, 19, -62, 147, 170, 183, -7, 209, 197, 139, 25, -31, 157, -16, 41, 247, 22, 40, -75, -47, -143, -104, 188, 131, 85, 19, 58, 48, -46, 200, 153, 137, 116, -73, -151, -160, -270, 89, 60, -116, -82, -197, -224, -54, -408, 35, -112, -120, 54, 34, -162, -187, -391, -72, -151, 1, -119, -149, -125, -247, 1, -301, -85, 11, 11, -6, -290, -29, -6, 193, -53, -41, -179, 228, 32, 126, 221, 15, 240, 205, 117, 299, -85, 61, 0, 146, 113, 113, -177, 119, -69, -9, 55, -17, -77, 174, 438, 178, 144, 93, 25, 340, -113, -147, 5, -17, 46, -105, 54, -61, 125, 74, -89, 170, -193, -114, -4, 32, -54, 24, -63, -273, 19, -14, 119, 5, -23, -21, 23, -124, -94, 94, -344, 165, -146, -88, 108, 112, 92, 156, 57, 96, -57, -25, 131, 187, 139, 57, 17, -15, 206, 193, 196, 84, 95, 29, 94, 129, -7, -215, 108, 111, -33, 31, 226, 71, 286, 121, 63, 24, 250, -10, 19, 92, 45, 196, 104, 11, -165, -186, -199]
6573a99K51P3r2p6NjL8m9K06k85j02J62k5K57l25K14j44j73M18j29j43l4L3j00
6597b20J73Q1o1j06p1K52q4J38k74J54k23L17j35N0j34N9Q3m8J07O9n5p6L4J83
6621B13l74rJ11L46j73j74K77o4O8k06J08k33K39N0l5k52K05Q8k00P7J19k26Q4
6644C9o0o8j3J46j94O1J96j07p6K28l47J65j53L3J26qp7K74Mk66L4J7m0j82J62
6669a06k17Q3k7K27j51K09k24J63j4j7p8K1M2J30n2o4k6L43m00J42J02k07K56
6692A35j97P7J10J31j03j44K9Q7k24J94O7j51K7K28j79r1O6M6j19Q1k28K94j27
6715Ip8J29q8j7K86j05k78Q5j52J97p4J49r9n9m1K2j39K74rp2O4J36j59l07K22
6740a04J89n0p1o4R0j35J21P3Qkj70J47j00J90k07p3L34rj03l16L87j58P8q8j12
$$ y = [-199, 52, 125, 33, -43, -38, -39, -1, -50, 156, -129, -231, -69, -94, 163, -162, 52, -92, -265, 153, 24, -119, -153, -120, -220, -47, 34, -27, -133, -204, 48, -36, 102, -172, -18, -241, 76, -59, -9, -143, -84, -1, -49, 58, 127, 72, -4, 30, 213, -161, -170, -59, 287, 114, -60, 217, 153, 221, 15, 123, -110, 129, 179, 144, -108, 97, 185, -15, 62, 181, -45, 39, -21, -89, -102, 44, -150, -89, 107, 0, -76, 152, -195, -30, -183, -150, -24, -32, -109, 165, 169, -97, -63, -46, -86, -268, -106, -323, -240, -267, -40, -191, 18, -206, -43, -57, -74, -152, -131, -89, 41, -11, -75, -101, 242, -158, -16, 86, -121, 135, -62, 15, 125, 256, 153, 9, 38, 125, -99, 95, 162, 11, 38, 266, 87, -4, 62, 108, -11, 70, -158, 136, 9, -69, 60, -28, -45, 241, 136, -142, -57, -209, -12, -86, 63, -36, -95, -136, -114, -253, 21, 12, -60, 4, 140, -19, -326, -104, 85, 35, -36, -100, -10, -145, -24, 49, 57, 55, -115, 32, -68, 122, -85, -158, 176, 167, 64, -252, 135, -23, 55, -33, -145]
6765a45L01j43J03j8k73J45j10L70j27J24l8j76K34o0k49P7j33K55k56N9M63m09
6787fMPL9l00K70j9J49l23n1J12K35k2l69J97j2J53j36j68L72k26J4K43L5j31
6811F7lm31N9K41J09j49j64J33K39j26K26m15J60j57J25K0j90Q9k7J80jJ70j67
6834a2m0Nk49N05k36K11r0J3M7j5j84J42K8r3K42j99m4J27j69j49J10J35k2j9
6858D4N7j29N3J79P6o8k58nK49m13N07l6j21j36j16q5L9J71Lk34K57j41q2J6K54
6883H1k04k05K70j8p3L8j35L15Kj39l9n1k4k2O2J27j78J42oj01L5J4j29P4K67
6908A03j24J0J8n9L56k81L6P2k23L42j04j34o3Q9k48M3K12J47j12r6p7K52r8L2
6932I3j15J61R0j70j8J45j98M9j5j96K79k29L6J08K8j47N29p76N29l55J09j9N5
$$ y = [-145, 156, 13, 116, 98, -175, -30, -140, 230, 103, 227, 189, 13, 247, 187, -62, 15, -118, 137, -119, -60, 403, -6, -2, 5, 44, -256, 14, -5, 144, -179, -230, -118, 117, 95, -274, -77, -89, 64, -72, -240, 132, -94, -80, 163, 198, 67, 64, -367, -308, -67, 42, -107, -271, -138, 101, -25, 201, -214, -54, -211, -86, -66, -256, -167, -194, -14, -15, 155, -12, -52, -47, -296, 209, -27, 184, 94, 107, 154, 139, -45, 97, 125, 32, 274, 75, 31, 158, -11, -160, -50, 85, 63, 44, 101, -28, 25, 204, 280, 212, -46, -51, 198, -215, 292, 256, 135, -1, -117, -202, -163, 8, 11, -223, 34, -107, -189, -173, 81, -123, -328, -58, -76, -149, -111, -246, 69, 71, -68, -107, -158, -182, -204, -142, -15, -193, -51, -57, -158, -123, -109, -238, -164, 103, -21, -11, 7, -52, 304, 23, 59, 131, -92, 250, 146, 12, -51, 38, -210, -167, 45, 192, 80, -16, -93, 159, 61, 93, -22, 139, 229, 59, 41, 186, -12, 37, 22, -174, 105, -124, -88, 20, 48, -99, 430, -346, 183, -172, -63, -82, -27]
6955b7Jj62O6j71J30J01k32J18J99k09p3m8J96l8R7j79K85j67N8M8R8J28k35J32
6979A16l32P4J04j47j37L48j0J5J13j47j54J67m7L56j88j03k0j66J61K32j58K27
7001C04j3l90K71k21Q3j99J59O2o5n6q2J66J7N0n1Q9j73N1K10q8j68R2j09Q2J10
7026A31rj29j04J50r4K2r9J34k1K15k45J98k1n15K20J23J63o7j79M0rL52j1m20
7050a75L1R9J33j12J93m97L52P5j68j25J74k4j23L15l5q5k63L66J35j65l57K66
7072A0L3j39P1k5N4m6j00J64K06k12O9K01l4k84L4K6n8N4j22p5L20j77M0n2k5
7097f7K11k00J12J34k13J38j32L0o2r5K13j35j24K54k9k50K67Kj11R7k41N5L6
7120a10n0J97j43K5r3J27J5J28o7J82l79K41L8Jp6p8K51m21K99k6j66M9K53J4
$$ y = [-27, -26, -188, -122, -293, -163, -62, -294, -176, 23, -186, -259, -307, -111, -149, -52, -231, 54, -113, -55, -7, 91, 219, -16, 116, -216, -142, -38, -185, -322, 26, 16, 31, 144, -3, -157, 10, -37, 319, 131, 28, 8, -158, 3, 235, 77, 304, 291, -99, 172, -49, 34, -165, -6, 56, -9, -65, -147, 19, 36, 86, 35, 124, -49, 2, 212, 124, -44, 48, -61, 21, 131, 122, -7, -111, 39, -55, -33, -132, 2, -19, 196, -49, 149, 128, -387, -167, -44, 119, 52, -127, -87, -96, 256, 245, -175, -144, -45, 88, -24, 169, -328, 24, 99, -69, -194, -20, -44, -167, 148, 113, 28, -235, 131, 266, 101, -256, 10, 43, -96, -25, -50, 4, -42, -142, 22, 228, 16, 85, 286, 252, -32, 2, 28, -30, 24, -98, -173, 147, -30, 10, -42, -67, 144, -56, 56, 190, -23, 115, -17, 13, -49, -144, 69, -66, -190, 64, 35, -215, 52, 54, -57, 40, -201, -146, -110, -160, 37, -106, -81, -174, -47, -32, 96, 29, 211, -168, 73, 111, 112, 36, -42, 209, -212, 87, 61, -105, -56, 197, 211]
7144B11l42J48J5k8K7m4L1o0J52O3k74K91j70j04%K67Q4l43J62k14J12j32J56
7167HJ40j28j42m0J01J51j98J54qL8N2o4j78K27j84j42J00l2K01M6n6j59JJ3K15
7192A16m10M99m34N8K31on0j08%J7j41K95m4j01J64k65L14J64j59r9l7j01J11
7215A4P1j82l3L49k83J09J30k02K6K62j72rO3j82J36J4JQ7j39k23K21o5j78L83
7239A98j63K44k75j97M45l36M6lj1M5j44J63k2o5o0M8K1j4k18M97j66R8j38k08
7263b15K33n2j27K61l76J8J85m1K2o7J29j30o0M72l17M4o5Q8J57l34L45k52J03
7286B1R8rp0o3J00L4k03K79k61M9J15r9J75j97K72j83R0L4j53K2q0j2J42l18P6
7311a41J7K56j34k28L11r7J77j51l1O8K05j87k7k81K0M24k49q5K12j83L3j16L45
$$ y = [211, -131, 17, 32, 4, 31, -13, 18, -42, 110, 173, -101, 190, 20, -84, -84, 183, 267, -76, 86, -128, -16, -148, 8, 148, 20, -122, -162, -61, 90, -108, 46, 38, 76, 128, 64, -114, 113, -71, -213, -113, -145, 56, 102, 46, -113, -112, -99, 116, -294, 205, -229, -171, 60, 54, 4, -104, -104, -87, -228, 67, 23, -78, 86, -179, 135, 299, 140, 41, 4, -97, 14, 85, -97, -130, 219, -64, 45, 175, -27, -1, 261, 89, 80, 143, -39, 97, 111, 112, 199, 60, -163, 58, -7, -185, 198, 35, 279, 4, -193, 252, -84, -38, -41, -52, -7, -151, 12, -10, -75, -135, -87, -66, -80, -298, 199, 33, 131, -7, -215, 18, -34, -161, 100, -276, -258, -73, -114, -92, -159, -30, -160, -220, 252, -65, -21, -86, 2, 159, -175, 170, -82, 21, 119, 110, 40, -23, 77, 111, -92, 187, -74, -25, 90, -9, 166, -31, 241, 58, 148, 182, 29, 51, -29, -41, 101, -217, -141, -124, 132, -2, -230, 81, -16, 161, 10, -21, 47, 252, 65, 38, -243, -223, 201, -48, -133, 79, -104, -71, -187, 158]
7334A58k40l0K98k83nJ00j29q1J38J77p7P8j45P4L6p7Ml8j34J62J16j00j49J4
7358a33K29j16N3k3R1r9j29J44J48l08K12Kk24O0J60K9p0p4J69J05j83J81k95
7381g1L60N9l41K9L3J28m34J80r5OM11k27R5k58J12k1m1K55j80J05kl29L23j47
7405e0q0K75l18Q2n0r9j55L54J25p7n0M2J68l21J49j1p4K23J5l51J60l6k19K51
7429d7j7J34N8K05l80R5j11L46k52k28K52k83N59l60r6K00j23K5j40jP1M76n55
7452a72L02J20L06l66J34J07l8l90l45Q98k32l93o59J060j79k47j05j65R01q16
7472b79j54R63n49K50j65k76K18N1j33l59O04J50l2m33L56n16M30k76J8L33m13
7493b12M24M3L38l14l00M66J02p68P22r54Q81q25O85O2j146K17N30l14J028o79
$$ y = [158, -82, -112, 186, -97, -102, -2, -131, -212, -74, 103, 26, 104, -41, 33, 69, -8, -4, -42, -176, -14, 102, 2, -147, -133, 96, -20, 33, 10, 101, 2, -127, 17, 165, -143, 69, 71, -153, -93, 67, 96, 26, -48, 121, 226, 43, 224, -71, 289, 348, 7, 36, 69, 197, -237, -57, -152, -146, 265, 38, 133, -125, -13, -34, -75, 180, 0, 105, 103, -226, 97, -50, -130, 145, -173, -91, -141, -240, -395, -41, 84, 7, -43, -1, 167, -154, -5, -16, -90, 133, 148, -203, -43, -79, -298, -47, -64, 70, 128, 333, -47, 48, -63, 283, 31, -197, 55, -228, 331, -29, -125, 75, -48, -23, -163, -164, -93, 383, -172, 130, 250, 556, 190, 324, 431, 393, 3, -342, 556, 324, -69, -728, 332, 153, -94, -199, -364, 537, -279, -433, 530, -19, 231, 66, -210, 8, 59, -74, -433, 171, 321, 289, -144, 212, -304, 126, -150, -132, 201, -212, 212, 255, 593, 279, -21, 445, 547, -221, 501, -453, 428, -397, 288, 350, -796, -579, -49, -363, 665, -14]
7513a4r8O41Q9q12j26o1q15J605j399J217K86K50m24l82P41k71k55j140J480j75
7533C37O73r04N9R2m84P96n51q40N47L55P0m7l44l09k07J35k03P78M45O2L42j397
7555e95o63J167L08o4R30j280n22Q71L37o20M38N02j076k04PN67N24j45r69O01
7575A14j53j302J025J29m32N01N66Q60r36o10N97q91L77k42j02k74M21L21P48
7594G17p8k82l98k61L68NK61n52M03j30l59J13k09N8R9O86m22k47R8l11l84J676
7616H51p21q70J065p83P40n35Q35j640J266M86j313J081r04R55q65j39k90J742
7634I61o90N7m19Q4j85l46L60K38J58j25n5n73J325j448J172j273R00j26o54O67
7654B8J17K15K68p40N73k50j15k8J4j50O21R0q62L24M59l16j71l54O7J61k50O15
$$ y = [-14, -112, 529, 618, -194, -320, -381, -1196, 409, -990, 227, 513, 763, 339, -43, 698, 427, 172, -968, 512, 337, 1010, 106, 165, 257, -227, 569, 18, -822, -275, 80, 150, 103, -241, -550, -757, -622, -825, -47, 398, 460, 802, -595, -1258, -91, 217, 153, 1083, -197, -719, 152, 489, -131, 307, 809, -267, -471, -464, 103, 627, 482, -487, 114, -39, -1341, -316, -187, -619, -118, 448, 1308, 372, -238, 359, -532, -155, -397, -499, -773, -352, -31, 717, 639, 357, -41, -302, 66, 71, 332, -220, 183, 53, -306, -193, -402, -344, -245, 441, 19, -228, -130, -441, -825, 851, 130, -740, 325, -458, 282, -253, 582, -1058, 208, 694, -619, 462, -442, 513, -352, -491, -781, 961, 271, 328, -91, -7, -192, -538, -178, 60, 218, 93, 38, -535, 790, -658, 514, -759, 141, 15, -639, 28, 145, 360, 628, -112, 461, 211, 96, 68, 82, -68, 553, 643, -219, 105, 564, 248, 77, -277, -210, -49, -299, 316]
7676C16o97N57n36R03n66k37M16o90O78o63O91j68k32J73k82J45L4N99j35n39
7696b33M63l01N8k65k25J71O10k00k77N40m44J15r68Q33lO21q48N10p46O46k30
7717a73K62o31O85J24k39j57R8r14L99N40L97o15k28L03L22K07p11M35L92k2m23
7738E1L54p10N33o71Q80O0j334J209q47j85R65m16m12k9P01r0M2o07M18K81n89
7759c96Q30o19L63J4L54p68k97J84M59M0o91J011j114J068n0n51m3K58q5k46K99
7780B0n72P41l86l2J17J029l00o74n38M38nN41k21m11k32l03L82N62l67k97L06
7801b02J24M4m5L09m12N59l30q4O54r19j47L89k85L11k92P12j124O18K6p3o8M79
7823B44l58L15p35P84o13P25o51n73J118O21k85j380J352q57N99j088P40j077
$$ y = [316, -381, 176, -360, 543, -23, -260, 156, -534, 144, -519, 172, 4, -228, -55, -337, -192, -158, 441, 306, -233, 230, -71, -13, -278, -503, -332, 278, 78, -199, 341, -103, 12, -956, -123, -126, 495, -353, 157, -589, 57, -173, 89, -542, 143, 267, 28, -129, -31, -945, -546, -6, 391, -224, -452, -149, 173, 380, -331, 104, 496, 474, 51, 405, -305, 228, -443, 437, 497, -837, 372, -475, -660, 305, -111, -523, -552, 149, 59, 101, -506, -88, 193, -396, 434, -185, 178, 192, 546, -222, -519, -335, 124, 164, -527, 484, -630, 438, 388, -163, -206, 52, -33, -279, 20, -552, 189, -197, -229, -112, 917, 617, -57, -595, -157, -162, 379, 158, -253, -485, -788, -406, 156, -211, -508, -202, -78, -34, -79, 230, -182, 377, 47, -37, 617, -302, -449, -60, -345, -34, -326, 386, -738, -120, -94, -167, -235, 244, -114, 201, -534, 250, -363, 362, -289, -862, 256, 877, 592, -788, 564, -293, 306, -782, -42, -1119]
7841a119J388L62l00n71J50J39L74m20k13L1m38K37M07o0j20K07j08k25L05l80
7861c54L64L57q46P00n55J5K02k72M51N32l60M9n61K58p8N9j147J046k59L35j19
7882a83K99J84k84j63J36K06n14M98q9L94j227P24M63m76L59k02l90P27m81j05
7902a24O65p41K63L48k05k75j28L34k84K06J0L67l85N1J73p60M25L49o46Q47o77
7923a87k88Q68p06N95n77M33oJ7n08N76q58K29J93L79M42n95p12L89M20k1n05
7944d22L01N91n85J68l94J86j35L45q62N04K28M40p99Q45m71j97P58p53L91q8
7964E1L92o83J94l54M28R3k21j39j11P86k55m42L64n7n19M10K5L19m31N9K13j83
7986f1o44P60K7L89J36q34K47M8M25L47j631L57P40k51j76K20Q0N25p96m31M39
$$ y = [-1119, 269, 631, 331, -240, -90, 49, 423, 3, -210, -179, -617, -380, 27, -33, -153, 54, -54, -279, 26, -354, 10, 367, -479, 221, -334, -319, -117, -389, 62, 594, 234, 283, -278, -20, -98, -39, -1186, -140, -399, -64, -183, 116, 300, 16, -147, -11, 195, -319, 179, 90, 484, -743, -19, 444, -32, 327, 125, -265, 462, -19, -124, 541, -200, 63, 411, 206, -69, -197, 137, -147, 59, 69, 436, 51, 102, 275, -485, -60, 289, -357, 490, -187, -475, 393, -313, 282, -295, 138, 132, 149, -359, 217, -641, -412, -219, 160, 602, 7, -705, -316, 104, 83, -422, -121, 470, -115, 53, -341, -155, -290, 55, -807, -303, -75, 365, -434, 411, -60, -257, 501, -252, 139, 51, 443, -240, -46, -400, 28, 121, -100, -239, -350, 436, 181, -261, 103, 46, -473, -63, -38, 281, -150, -91, 122, -61, -705, 55, 82, 471, 607, -227, 20, 68, 493, 840, -791, -434, 306, 55, -121, 99, 179, 704, -92, -523, -84]
8007h4j85L6p2J57j46M59l32M72q49O63m86Q26j140r5M1M8N23j67l81J090m36
8028e8j62N93o9P3r11N14k41Q9P91j091N25j45P0J04n00P25l99l89Jk36R46o92
8050d62O41k86n30R2K2O78L51q33M84k29N9L27r51Q60k18J93k74o6j53N04l41
8071a32L73l67K40M8l69K34k57K9K26l7J7k36M09j51J63j81OK7J00k3j43j34j24
8094b82L25k05J72j19J02M7j45J3k56M02k36J96p8Q3Q7l52K41p4J09P5j78K37
8116A64q7N6R7l78K26k36L47j30J72l31J56j55j7K12j32o3M4j21L22O3j26R4l89
8139b12k9M21Ll92L19k17P9p1L26k80j48K6O4J67k69p9K26R1L1j99p9L93j27j47
8163a03K24l50K7K85r2l8j94K55j39J28J41K5l61K4N0P9J93p8k74J65J53m78N62
$$ y = [-84, -269, -233, -305, -148, -294, 165, -167, 305, -544, 119, -367, 459, -681, -776, -735, -687, -164, -331, -712, 378, -58, -220, 373, 304, 377, -534, -20, -261, -172, 619, -472, 53, -92, -22, 82, -418, 307, -92, -481, -480, -716, 230, -462, 179, -107, -637, -545, -523, 155, 506, -327, 157, -72, -13, 314, -637, 223, 5, 198, -76, -142, -295, 209, -132, 241, -126, 114, 162, -207, 27, -230, -201, 25, -12, 5, -231, 178, 27, 190, 9, 15, 42, 142, 119, -24, -158, -282, 43, -162, 10, -109, -7, 40, -105, -92, -348, 54, -182, 14, -64, 19, 106, -246, -5, -79, 30, 105, -73, 164, 77, 133, 230, -148, 78, -158, 189, 59, 231, -100, 56, -99, -116, 96, -36, -99, -55, -176, 146, 209, 83, 177, -212, -241, 180, 183, -209, 110, -107, -28, -99, 227, -53, -201, -175, -111, 56, -213, -292, -66, 25, 56, -143, -222, 171, 44, -103, 121, -229, -202, 83, -9, -47, -241, 14, -125, 3, 144, 169, -192, -168, -118, -39, 154, 76, -198, -33, 120, -358, 204]
8186B04O6k82k26K76N0
$$ y = [204, 270, -12, -238, 38, 88]
8191H8
$$ Imaginary data points
##PAGE= N=2
##DATA TABLE= (X++(I..I)), XYDATA
0@%%%%%%%%%%%Qj6J6j6K4l2M0m8N6p2Q8j04J20j41J65j92K24k61L01l44L95m53
33b42N16n83O57p41Q34r35J045j166J299j441J599j774J963k168K391k635K904
50A523l201L525l882M276m715N211n767O397p121P957q940J0115j1548J3340j5657
65h487J8786k3274L0348m3710J14696k92023J80767J78882l69711K96870k5628
76E7516j91270K06571k8326j04458J23110m6790p7053N8400O7386j25573M2865
87a7622J07636j71568M2939R3030j64039J38004L2220j55163J49629j0940j03308
98e9182J07779p6523n5752R7943k0152k6698M8808r411m5165O0209K0055j03214
110f1303O4295L3825r4652Q8975j0716p2664R7584p9789l0969J28255p2835l450
$$ y = [0, 0, 0, 0, 0, 0, 0, 0, 0, 0, 0, 0, 8, -8, 8, -8, 16, -16, 24, -24, 32, -40, 48, -56, 64, -77, 88, -104, 120, -141, 160, -184, 211, -242, 274, -309, 348, -393, 441, -494, 551, -615, 684, -757, 842, -932, 1031, -1137, 1254, -1381, 1523, -1678, 1847, -2035, 2241, -2474, 2737, -3030, 3367, -3754, 4203, -4737, 5378, -6170, 7170, -8487, 10299, -12975, 17373, -26337, 88359, -203664, -22897, 155985, -213726, 83144, 57516, -133754, 72817, 44491, -59967, 63143, 16353, -60700, -2300, 65086, -60487, -17622, 90014, -81554, -38615, 54415, -109624, 28380, 60600, -94563, 55066, 44126, -59182, 48597, -27926, -83678, 14265, -5887, -32585, 16223, 6812, -38353, 21856, 41911, -61303, 2992, 36817, -57835, 31140, 20424, -52240, 45344, -34445, -65414, 62841, -9994, -13444]
122a3444P7446p2227K234L9239k7398k0983q473J5653P462K8772l485m6596N8312
135C6512j6926n3601Q3901m9849l7669R4101o1744j2609N6160o3866J7727K8360
147B0497l9355L0277K2011j8936k0260R861N970l4447L1685j2548m5365Q3502
159C2892j9488m1716P1269o2063r894O8601o6475J6872K9156m7945L3875q955
171c871k5215K6621m680M040j1095J4556K5312l8298K3680j2870m6001O2974k4437
184i284k6385N8585m5290K0564M5900o6958J9109J8110l2875K6629l181j5593
196a0669J0600P069n347j8496K5704m050j7641M8306l0629j2787N3742n6348k535
209a3081L1750m8545L5821J7169l9043L0413L982j2004N479q649j0r251J8911
$$ y = [-13444, 64002, -8225, -5991, 33248, 5850, -15133, -23606, -7953, -491, 28281, 24796, -21800, 36512, 19586, -34015, 49886, 37, -37632, 56469, -5275, -17884, 38276, -25590, -7863, 20497, -18858, 11419, 33430, 14494, -5766, 4095, 10065, -24382, 7303, -5245, -50610, 32892, 13404, -28312, 42957, -19106, -29000, 39601, -26874, -10002, 19154, -28791, 5084, -3871, -29086, -2465, -7145, -3105, -14200, 356, 25668, -12630, 11050, -1820, -47821, 15153, -9284, -35669, 22916, -22374, -1810, 44090, -22868, -3759, 14351, -18524, 8105, 4924, -10669, -69, 7000, 1653, -16843, 8861, 4811, -12830, 35476, 4847, -7940, 45802, -10546, -13081, 18669, -29876, 5945, 23114, -15929, 14484, 18466, 6462, 11941, 3292, 3282, -5969, 12942]
222A2942k314l0538L6835j4112k2988M0036l6758Q395M5394m7384J6978J4737
234B1223m3497K6924o764k7436K0872M667N778K28k81L453j4347J9393j5273k2018
248b7078L7616k3708J401L2370n0223J9566K6085m3958L1229J132j9810L6801
260B1423k1314q932J0735j8486J1483l764l60J2823q084K4534j3839j5705L1497
273B2011l3368L868K7318m2177K9945J1702l8578L4247j1871j7689L5211j7589
285C030k158J5710n439j165j2804N802p683o981K6765k1906M833L1229l1847J3417
299A0803N810l5346K7722m807j6740K0534j3008N936L463j2513J2813j3847R911
312G31J1026k2259K2882j2309j4353K5868l3450M970K4798k9811K5834M400k2012
$$ y = [12942, 10628, -19910, 16925, 2813, -20175, 19861, -16897, -8502, 36892, -10492, 6486, 21223, -22274, 4650, -2114, -29550, -8678, -4011, 1767, 1995, 1714, 5167, -9180, 10213, -5060, -27078, 10538, -13170, -11769, 20601, -29622, -10056, 16029, -27929, 3300, 4432, -15378, 21423, 109, -8823, 1912, -16574, -5091, -8855, -9215, 3608, -4476, 20058, 6219, -9486, 22011, -11357, -7489, 19829, -22348, 7597, 19299, -19279, 14968, 3097, -14592, 20619, 3030, 872, 16582, 11143, 9978, -2826, 2976, -4707, -11688, 15077, -6829, -1996, 29233, -2614, 10803, 16613, -18733, 8989, 4182, -12558, 7976, -5032, 904, 4367, -8146, 4667, -9180, 731, 11757, -10502, 12380, 71, -14282, 11586, -21864, -16894, 7904, -21907, 3927, 8327, -13685]
325a3685K8035j7515p302J4682k1322J4099K519j1624J3695r902P947l42j2652
338a3367K2533j1504Q03J7133k6574J3413L764k4034K1574j0195m779K8915j7720
351c8K383J2750j4134M677k879k510j284j830J5204j3921J633J2320k2769K2422
365A2024J033k7913L6663j1479k0271L3490k7693q898K6476k2858O085J1713r737
378a365J0626k489k632n168J53P101k0754J4498Q611k8535K8816m558k6382L4981
392A2903j6537j1344L0016k2082K721J3270j9446L174O72l992L517L148O799j0479
406g660J3072L473k5637K2183o197j9472L1370j8325n062K6821k6232J0446J1630
419A0410k5142J8548M083j0335R150m747J996o687p7P274j6472J7813M103j6067
$$ y = [-13685, 14350, -3165, -10467, 4215, -17107, -3008, -489, -12113, 1582, -8320, -373, -715, -13367, 9166, -2338, -1535, 15598, -10976, 2437, 6201, -17833, 3741, -6454, -11233, 17682, -38, 2345, 15095, 961, 5638, 2759, 249, -1035, -2865, 12339, -1582, 51, 12371, -10398, 12024, 13057, -14856, 21807, 10328, -9943, 23547, -4146, -13044, 13432, -9426, -3341, 8372, -1365, 9261, 6772, 4140, -1028, -875, 6226, -14528, -30, 8581, -19954, 8862, 4304, -22078, 12903, -3634, -14978, 15038, -7044, -4323, 8947, -10499, -7325, -6653, -10645, -7128, -3980, 2819, -7660, 5412, 8885, -16752, 5431, -766, -20238, 11132, -7193, -12255, 14566, -11666, -1220, 10410, -14732, 3816, 7899, -2436, 6714, 1967, 3963, -2724, -2801, 4473, -11999, 5814, 9917, -6150]
433f150K7803j7479j1771K8996k8909K416J8718k4401J6887N149j5620J2921o419
446B141l776M611J441M998j2800J0360J104k0107J9935j0838j1866K7626j9650
459f821M619K0567k8700J3254N888k4343J5981l058p644J1981o339N138k224k850
473d551O438j2883J1274N16j0722K0533j8538k462J9071k4966J0931J1751k4075
486a7683K1898J743j1156J4860j4997O02M672p951Q921k656J571J779m668J5177
500A2112j5477k212J9991k4184J1411J6032k6119J5149j672j5062K0686j2788
512b133o63J4220j2845P930J102k868j328r872J4550j0072n684K4708k0767J379
526b343J6047k3190J6954p59j8937K4015j3591m259J9766k0223J113N450m666
$$ y = [-6150, 21653, 4174, -7597, 21399, -7510, -5094, 13624, -10777, 6110, 11259, -4361, 8560, 2141, -1635, 2976, 4417, 9415, -3385, 6975, 8079, -12028, 7907, -2931, -14797, 12829, -6821, -2202, 18365, -10335, 2919, 8807, -15536, 445, -2613, -10257, 1724, -4615, 523, -1701, -4551, 1887, -10996, 278, 794, -9928, 10605, -7933, -10395, 8676, -16290, -5359, 6392, -17683, 4215, 5958, -5198, 9662, -5335, -4733, -61, -8012, 909, -1747, -176, 1603, -3065, 12112, -3365, -5577, 14414, -9770, 1641, 17673, -8446, 6703, 5031, -10031, 10655, -2133, -2796, 11424, -1421, 6509, 7611, 4743, 3415, -6457, 8093, -1979, -7663, 17045, -3722, -2343, 13704, -9486, 7468, 6709, -12228, 11787, -1804, -6063, 13703, -6520, -5407, 43, -4623]
539d623O513p376Q222n1j0178J4115j0717k394R854j9835J5970L295j8460K6069
553A0404j2318j3680K4316j3980q3R880j2862O929K90k202M940p579J319j116
567e742N964P982j6012J4292O1j9878K2662o918j5730K0479r000J50J3358j3794
581b126N434J607r535J0143m09k906j865L570L896j2984J0235K753j8387J8391
595G817k24j0978J8295j4596m072J3377j7152P263Q503j4214O480J794j085K71
609A479p53L624j2825O205J0250j4787R167j654j2606J7606r173n264J4947j4328
623h112M565J1103j3191M962j152m618L242l001O677l104l087R289r613O047K114
638B121j2293J4573p219n647J9491j4766j853J1519j3306P035M711p629P146k121
$$ y = [-4623, 1890, -5486, 2736, 2685, -7493, 6622, -4095, -6489, 3365, -16470, -500, 2795, -15665, 10404, -1914, -15594, 8722, -5258, -5341, 4539, -8323, -1394, -1104, -3306, 1634, -5945, -4626, -5742, 222, 8204, -7808, 6484, 6545, -13333, 9329, 2411, -13319, 7160, -1840, -1690, 11668, -2126, 3308, 4915, -4620, 5523, 5114, 2208, 343, 3913, 7809, -5175, 5060, 7813, -10574, 7817, 7593, -3385, 14910, 314, -3758, 9619, -7533, -270, 8233, -5981, 499, 2293, 1208, 1479, 726, 4350, -8475, -2270, 7980, -6807, 2360, 706, -11900, 5706, -3467, -8731, 6216, -8112, -3547, 7556, -5635, -673, -1825, -6443, -3201, -6202, 475, -2629, -5716, 3573, -6040, 7, 2121, -10172, 4401, -2818, -8465, 11026, -3740, -5593, 5926, -7380, -345, 4366, -3263, 3883, 1762]
652A762M41J276k305K514q515O873L548j1098J6054n159j2051J8725j1863k725
666b523J4007j4782M705O174q997O876l382k842K320j864N771n471J930M731j1846
681e193J0484j957j2725J5522q699l858J4958j3470K899P739j3479P718L47n680
695e394N869l314R99o32n1K775q522Q181l41r401J5763q843n570J6511j5751K625
711e096J1100j6679J0369L317j0574J0976l789k589N037m569L247k751L094L085
725D178r541J0594l492p220J5063j2404K56J3932j6805Q691N886j5561J2897k203
739D271q273J0248m832P4K122j235J454n542O460k284o269J2884j0597j472J4344
754A1353j6861M689R216j6568J0966J326j0488J0663m630k687M698l916J861k822
$$ y = [1762, 2203, 3479, 1174, 3688, -4827, 2046, 5594, -5504, 10550, 5391, -6660, 12065, 202, -2523, 11484, -3298, 1407, 7581, -1416, 5460, 2078, -764, 1556, -308, 5463, -8, 1922, 6653, -5193, 5291, 3334, -9391, 6131, -2568, -6426, 8532, -4938, -2039, 5700, -7779, -61, 286, -5394, 475, -2839, -1840, -2472, -2523, 252, -8270, -89, -430, -9831, 5932, -2911, -8481, 8030, -7721, -5096, 6004, -10675, -306, 3011, -7563, 3413, -376, -2965, 2072, -2497, 750, -2001, 1093, 4178, -5363, 5231, 1739, -5481, 9582, -2822, -2566, 11366, -5439, 3252, 9138, -6423, 6474, 4271, -4002, 6246, 1414, 1488, 3610, 2375, 3829, -1713, 4747, 2463, -3806, 9078, -1519, -2991, 11353, -5508, -819, 8397, -8171, 2795, 4121, -6367, 4296, -334, -3021, 1677, -2239, -378, -3200]
768c200K607L64n590R373p114l564J2926j3399L107R836j5549J0806K561j3593
782a0429J3557m063p419J1258n286j810M661j469q06o06M389m545m32Q605j0347
797d742L769P966j4790J0916L013j5406J5505j693j0739J3375m639m874P678m357
811I82r44K561L72k197L67N507q592L388Q022j4970R132N387j7410J4926l59j3987
827g815J5266o799n696J2532r051k5O623o687P21K180J70m656R16N751r665N207
843a028N994j3966J0290Q06j0521J3290p673m955J2872j1199J443P391q318K136
857c438K266L04j022p08M533p037L746M906j1429R916j329j0266J6980r274m717
872f569J6371j4594J741J1247j1380M473J442m632L918k035K831k003J28L794
$$ y = [-3200, -593, -229, -5819, 3554, -3560, -7124, 5802, -7597, -4490, 5346, -10203, 603, 3164, -10429, 3128, -935, -8354, 2904, -2382, -4192, 469, -1000, -1806, -2412, 1977, -2568, -3000, 5605, -4742, -973, 6993, -7797, 3119, 6132, -9274, 6231, 4538, -6201, 7174, 2535, -2339, 5339, 982, 38, 2599, 2971, 774, 1141, 6648, -1944, 1444, 9466, -5504, 3628, 9015, -8395, 6531, 6172, -7815, 7451, 652, -5044, 7488, -1563, -1588, 5035, -1652, -931, 1249, 1419, -3237, -2321, 3430, -6235, -1028, 4966, -9000, 1290, 2096, -8425, 4865, -2808, -7763, 5109, -6090, -4647, 2744, -5574, -3438, -1172, -868, -1890, -2598, 1935, -5102, -1356, 3550, -7879, 2037, 708, -9558, 7422, -1852, -6569, 9802, -4792, -3051, 8196, -3184, 1289, 2731, -1901, 2017, -18, 2813, 810, 938, 4732]
886D732p403Q195N82j1408J2965n684o942J5113j0507k348R507r475M758K808
900D893n656M278k384j37O60n28J080o475N574Q34p856J1321n637o501J3304j0604
916c834J131Q525j3547P092K480r010R378l917l897N511k918K919j463j89K329
931E90o819P317j273p689J0895p776j466J2676j1546L942N982j2328Q905J386
945B796p887P645l307j832L706q94P86k558L703o93l582R833o849l347J0112j1225
961c593L833O796j1975Q220J316p545R965l341l984K983j729K161l630K519J683
976C679q599R328j972o753J1592r551q2J0880j3450O067L999j2635Q322p16m734
991d625N581l154K302p04j278L824n771L216o49n169Q765n661j194P738j0925
$$ y = [4732, -2671, 5524, 6106, -5302, 7663, 1979, -4963, 10150, -357, -2705, 6802, -2673, 2085, 4893, -763, 3515, 1131, 994, 1654, 1126, 2206, -4269, 1305, 2139, -5717, 5604, -33, -6534, 6770, -3834, -2703, 5822, -7725, -633, 1847, -7163, 2215, -1702, -5599, -88, -3006, -87, -1550, -1739, 590, -6229, 1088, -185, -7874, 3021, -4755, -6221, 6455, -5091, -1149, 4833, -7495, 1410, 2796, -5091, 2554, -753, -2585, 1121, 227, 1013, -1545, 2158, 1465, -2117, 7716, 867, -2480, 7632, -3593, 240, 7036, -4939, 3281, 4597, -2948, 7017, 3676, -308, 2675, 946, 3107, -523, 1996, 3679, -4920, 4408, 2436, -4317, 7275, -2276, -2358, 8522, -4928, 1139, 5138, -7497, 825, 109, -4625, 956, -2198, 104, -600, -1878, 1946, -3825, -609, -1258, -6427, 2338, -3323, -4517, 3221, -7704]
1006g704N216O211j0310O606R42m713N473l631L02N74l307L859j244J760J25k307
1022b148O797o565k65Q846j0755K005P377q339M988J063m652N752m165k48N500
1037E191m520J493J023q24o0l951M740k603k918Q017m278k79N105o650L762m73
1053B775n394N473l560r73N265m948J227Q96j179K847m877M225Q05o980O648l124
1069h74k704M258o349L400K265n608Q541k831m422P276n547j236K307j953M415
1084I38l244j337M876m731R61L004k052K575k752K442J452o938O084j400n035
1099e157P322l935J936M975n908M007L37m670K868j270O8n81J81M217n635K821
1115A576L463q049O561O98o547Q311m629j542N845q668K582L245n549N205j9r37
$$ y = [-7704, -2488, 3723, -6587, 19, 961, -3752, 1721, -1910, -1608, -1034, -4341, -482, -1726, 34, 159, -2148, 4649, -1916, -2181, 6665, -4090, -2085, 5292, -3047, 1941, 3004, -1648, 4104, -61, -309, 5191, 671, 2164, 3187, 2363, 2303, -1648, 3092, 489, -2429, 5588, 1310, 1031, 6136, -514, 3248, 2775, -2619, 2854, -706, -1679, 3586, -1362, -135, 761, -418, 2429, -2448, 1777, 2582, -4398, 2250, -874, -3578, 680, -5669, -2269, -4, -5612, 2929, 98, -4324, 2952, -2595, -3831, -1524, -3477, 938, -2306, -3643, 1233, -3498, -2537, 467, -1585, 990, -1762, 680, 2132, -4806, 1278, -122, -5157, 2165, -1770, 166, 5141, -767, 3240, 3577, -1093, 1775, 505, 573, -8, 173, 4390, -1245, 1576, 5039, -3010, 3551, 4249, -2298, 6013, 1384, -158, 5687, -2981, -399, 2846, -2703, 2502, 2483, 1546]
1131A546J618l210K160l295j054L966n386L208J485m417O488m472k342O557o773
1146c921K365M041n947K655J08l659L011j714K51J266r8K774k786L382j915m827
1162e014O790m433k233Q375p004J804O118q442M758J398o241O492j629j206L209
1177B742l044L00o37M71J316k678N117l66l256O888o639p63O513r417L895M035
1193D477p652O820O34o009O179k662k323L559j659R0q31K161k561k172L816l870
1209b003O97N658o804M821J691p510N520l202m354O772m245l94N773m869K217
1224b32Q76l419K145p67O31o93M25J904m529K706N17n858P034j646k637Q891n436
1241h8j727O017p389M45L212l437K097J768j93j1L04J859l743K462N47l680M640
$$ y = [1546, 3164, -46, 2114, -1181, -2235, 1731, -3655, -447, 1038, -3379, 3109, -1363, -3705, 2852, -3921, -1556, 2485, -3462, -807, -699, -4358, -1347, -3061, -2810, -1544, -1642, 1132, -1654, 1728, -187, -5014, 1776, -2657, -4890, 3485, -3519, -1715, 4403, -4039, 719, 2117, -4124, 2368, 739, -467, 2742, -302, -2, -639, -168, 1148, -1530, 3587, 3221, -35, 6853, 214, -549, 5964, -3453, 442, 4477, -3175, 3645, 4279, -1730, 4449, 1787, -536, 3023, 1364, 1454, 623, 2784, 223, -1949, 1867, -2003, -1306, 4352, -2452, 2369, 4060, -3450, 2070, -1132, -5486, 1286, -2959, -3353, 2420, -2449, -232, 644, -2775, -630, -1397, -766, -1459, -1034, 870, -3659, -953, -436, -6294, 740, -906, -3543, 5348, -88, -1815, 4202, -3187, -2742, 470, -2967, -870, 898, 705, 694, 998, 2857, -886, 1576, 2123, -1557, 3083]
1258C083n67m765M807l555j011N905m543K862L464n468M054j060k176J227l109
1273h52Q24k04L73L769k423Q08L73m373M648k609j871N594n405M73K741o215L696
1290f53J150k855L692j002M87J607l571M42j707j205J297j677M368r92j851N243
1306B773m405r62M490n526K194J857l807M385k163k329L141k678J788J478J45
1321C81J515k400K931j310m947N043k828j413O036l846K766J824m933M497j490
1336A826k476L217k339J001K77q98K118m313J981K143l630N280j005k444L689
1351D427n080J572R46n638M627p13j831N370k865J67K55k823L257k662m67K780
1367A322l975J982J64k013K843m561K731L867n226M714j46n323L310k247r02K722
$$ y = [3083, 2516, -2249, 2558, -997, -2008, 3897, -646, 2216, 5680, 212, 4266, 3206, 1030, 2257, -852, -28, -232, 141, 3910, 1487, 2295, 2668, -1705, 2943, 334, -1537, 4057, -1348, -875, 1866, -4349, -653, 497, -2358, 1334, 332, 819, 2426, -1145, -703, -2410, -3615, -2318, -3995, 373, -619, -2470, 2773, -1632, -2594, 1896, -3630, -1436, 421, -3386, 999, -1164, -3493, -352, -3030, -1242, 236, 381, 1896, -504, 2427, 1117, -3830, 1213, -1615, -3028, 3008, -838, 1928, 3752, -1181, 3316, 1826, -650, 2567, 228, 1229, 1506, 608, 2726, -1587, 394, 2537, -1093, 4187, 3182, 738, 4427, -653, 919, 1865, -3773, 854, 141, -1690, 3680, 815, 982, 1237, -1586, 1671, -991, -1458, 1322, -2653, -671, -507, -2520, 323, -4238, -1507, 2360, -2866, 1848, 1702, -3621, -311, -2558, -3460, -738]
1383g38l733L060J231j019K534k263j31j21j510M163k925q45L812m337K129J586
1399H93l234L674j542J56L943k867K54M70l413K061j173O08K000j767K867n89
1415B341j254K978m432K75K026k889M208r90l139K944k395P72K707l884L332r89
1431A611j499L070l163l52r76k397L725m59K27J913k887K835j544j994L390l908
1447b408l37L716m033K904L79m741L456p90J01L441l357K621j761p99K062l538
1463c084Q85N72k843N640l33j506L261m239J239K003l715J705K84j009K715k366
1479g91K603q42k300L434q59J390K01j824J625q97k815K050j157o7J766Q12Q03
1496C132p56m02P50l551Q83J400j612J799j602J206J515l342J352Q53l983M501
$$ y = [-738, -4471, -1411, -180, -1199, 1335, -928, -1059, -1180, -2690, 1473, -1452, -2297, 1515, -2822, -693, 893, -2341, 1333, -209, -53, 3890, 1023, 1277, 1747, -1666, 395, -778, -170, 1830, 63, 2930, 2341, 1087, 4065, -367, -92, 1934, -955, 3253, 2263, -876, 2068, -327, 445, 3152, -732, 2600, 1611, 112, 3182, 19, -333, -1309, -3706, 19, -440, -213, 1700, -1187, 1648, 104, -1890, 1500, -2408, -2745, 971, -3062, -158, 221, -4520, -1064, -1854, -1753, 1688, -1669, 952, -809, -1608, 454, -3084, -2199, -1627, -4470, 1170, 837, -669, 2592, -1647, -408, 1595, -2120, -415, -131, -1140, 1575, -791, 1812, 970, -1330, 2104, 1245, 2635, 2836, 1012, 2637, 1740, -1075, 975, -182, -249, 1517, 2329, 3132, 2376, 1974, 2724, -827, 56, 1456, -156, 1643, 41, 1247, 2762, -580, 772, 1625, -2358, 2143]
1512B143j43j316O25l099j29O23j450J864l16J797J609k997J985k564j81J073
1528d76m147L184K282m506L773J83k558K613k807J305K518l502K949k31j459J76
1544g03j914J307n91Q17L555l098L88K901l287J675q35k998M791k383r84L772
1560B413k450J27J312q06J340p42O0R00j492K462l012j695L433m001L366J260
1576B475j518L348j839k249J991k360m88O43j694K648j855J856j12l273J868J183
1592F24j906K215k524J752l59j244J157j604r73K067m87J754N33l127L780l261
1608a603j515K355j503J096K84j067K884j560J33Q85k630K093O85j442L292l282
1624h95j40J443k878K203L27j471M507j149n64J330k520N86q93P1J684k324K224
$$ y = [2143, 2000, 684, 1309, -1790, -1919, -1296, -2746, -882, -1198, 599, 2208, -789, 1196, -1368, -1549, -476, -4623, -1439, 843, -3663, 110, 293, -2265, 348, -2459, -1154, 1364, -2138, 811, 580, -879, -703, -2617, -1310, -1901, -1084, 2471, -627, -239, 2662, -625, 1050, 215, -2783, 2008, -375, -1359, 2413, -37, 90, 1402, 596, 1936, 1194, 1254, 2154, 662, 3124, 112, -1583, 1850, -2151, 1215, 2475, 957, 4305, 2466, 217, 2208, -152, -640, 3, -1691, 957, -898, 958, 846, -2427, -559, 624, -1282, 933, -1591, 161, -198, -1442, -285, -1889, -2862, -795, -1282, 472, 1005, -2122, 1658, -1603, -3118, -763, -2266, -1170, -886, -1953, 931, -629, -496, 389, -2241, -148, 537, -905, 2387, -895, -1035, 408, -2470, -267, 60, -1411, 3096, 1947, 1383, 2713, 193, 779, -114, -43, 1641, -683, 1541]
1641A541J205k912K909j612r61K299l296K089J210k138J490j426r02Q21k526L516
1657A307k20n16K715k433n61R36l070M60r1J61L022j874l22Q39r45Q94j105p00
1675a503K073j690J063L44k920J809j691r08K176o41J624L80m91J426k708O8R11
1692f78k056J069J131p53L584k582JJ809k561J706j29l58J598j564J102k18k886
1709a785J952m6l78K404j095P23P99j184L11k201O28O62j55P72p27k10K771l042
1727A99n02J960k735J680M81j250J086k85j570Q14m12O78P20j61O93k050J175
1744E21q81j820K136k186mL660l431J703J220l422K154o89k69j7Q2N57J37n48
1762a097J040j790J035O82j745L323j030p82J947k169o93J139k099J960K28j040
$$ y = [1541, 2746, -166, 2743, 1131, 170, 2469, -827, 1262, 2472, 334, 1824, 398, -504, 317, -2209, 1307, 1087, 571, 3286, 853, 292, 1228, -1842, -1382, -1473, -1312, 1710, -164, -486, 353, -592, 302, -803, -1503, 570, -1120, -57, 287, -2633, -824, -2515, -3423, -1247, -1888, -264, 116, -375, 1051, -1657, -1589, -678, -2734, -1665, -534, -1287, 2297, -285, -284, 1525, -1036, 670, 541, 183, 1781, 217, 1319, 1101, -1785, 167, 121, -257, 2147, 1052, 1775, 2574, 1390, 1701, -500, 128, 790, 635, 1407, 680, 470, 3241, 199, -303, 1657, -1078, 602, 1083, -167, 919, 634, -936, -122, -534, 144, 864, 703, 1396, -654, 521, -360, -2180, -44, -2230, -2234, 1426, -2005, -302, 918, -2504, -350, -1039, -1308, -1325, -1243, -686, -549, -1097, -57, -1847, -812, -130, -1875, 1448, 418, -364, 1583, -586, -1279, -140, -2239, -279, -51, -1091]
1778a091K715k151J62K211k492J309o40M27J639k136J507q49j056J510j508J503
1794A060J504k142K488r08k600K174k196m63J974j028J179M77r86P84j300M83
1810E00n68o51J686j656O81J382l700K389j17l187L306Oj180K126j472n10J78
1827g87j512J018n34q2J978j229R12l34o80K086k742J149P20j436J442m2p37Q61
1845E1k149J218J250j834K142O81j534J380j148n66K44q54J853o00J672P15k324
1862A97R78K21j402J926j464k69J678j777J086P64k259J648k45o22J105m89J27
1879A203m42l25L69p52J8j7l97K924k604j63J514j857L02N18j364O90m09N07R85
1898G00j299r45K98J27O63j125J878J09j942J250o32j522K230k005R18J837j535
$$ y = [-1091, 1624, -527, -365, 1846, -646, 663, 23, 450, 2089, -47, 1460, 611, -445, 1065, -443, 1060, 2564, 422, 2910, 2002, -598, 1576, -620, -1083, 891, -137, 1042, 1519, 533, 1317, 17, 500, -68, -719, 967, -689, -8, 1374, -2326, 63, -54, -3241, 65, 71, -1109, 1017, -455, -965, -787, -2299, -1281, -1815, -1897, 81, -1148, -236, -570, -1250, 836, -1906, -757, -37, -1473, -31, -73, -810, 51, -2098, -880, 370, -1464, 678, 1359, -175, 1205, 57, -509, -265, -1119, 734, 134, 1806, 2521, 197, 1175, 1396, -6, 1920, 456, 187, 1865, 88, 1174, 1938, -321, 1327, 1082, 460, 1565, 1076, 1203, 761, 436, 805, 53, 71, 54, -343, 2581, -23, -186, 1328, -529, -227, 291, -1073, -383, -792, -285, 700, -599, -1544, -1246, -1119, -456, -1581, 297, 406, -1536, -286, -918, -2440, -210, -2215, -1297, 540, -995]
1915i95J445o16p14Q75r48N03M62j192J379k63l02P49q91M31R5r02K570p53p26
1934B07J141j850R44j73j410K189M88j134J448q1q58L20p78l47k70J234R5j336
1952a71J376j157l56K030j448k20J554j683J071J85j486j74J45r39R12K58k0o95
1970h18Q73r21n84J366q33r01K274j655J266k17k211K079o71n24Q90j27J64N54
1988Dp46M48j290M22O70j703J766O8r6J119j477P27O60j532J311M01j964K044
2006H32l79j18N41j197Q49M15m16J231j085O27q91m03J492k043N63K100j272r4
2024G52J860k725J082l77j293K306j263J27J538j552L90p8n67j075P27L97L69
2041F18j449K586k309K97P83j570R27k12n85J362p58j241J343j371O29M06r57
$$ y = [-995, 450, -166, -880, -5, -953, -450, 12, -1180, 199, -64, -366, 383, -508, -77, 18, -884, 1686, 933, 207, 1348, -502, 442, 269, -1141, 1048, 1536, 402, 1850, 1769, 911, 1231, 453, 106, -164, 1070, 1165, -171, 1205, 48, -308, 1722, 274, 54, 1608, -75, 996, 1181, -305, -479, -334, -1273, -361, -103, -123, -818, 55, -866, -1450, -84, -917, -1818, 456, -1199, 67, -150, -2361, -282, -953, -1477, -587, -714, -550, 4, -742, -294, -1584, -1162, -492, -2195, -429, -361, -457, 662, -815, -88, 572, -960, 351, 752, -1212, 832, 453, 335, 876, -321, 528, 943, 527, 1758, 673, 1300, 409, 6, 1498, -545, 18, 2118, 846, 752, 2612, -113, 969, 592, -701, 1605, 342, 469, 2007, 455, 845, 767, 200, -875, -148, 249, 618, -831, 1755, -554, -257, 526, -1044, -117, -329, -914, 448, -310, -1551, -208, -1579, -950, -544, -1501]
2058a501Q10m3j92m7M11Q64j098l99k11R43M05j56o33J900j382n50J385j525O57
2077c62J185m81M19o29k69Kl3J59L67r1R77j045J244j025p40K229q38l01J274
2096B042j340J95J205k665J360J13j045J356l00m94N32P1j15j287N71l42k30J032
2114F59j163J14J965j367n84Q79j625M16J060j540J090j64j28j094Q60l91K82
2131g31j22J147j719J309r23k86R45m89k57R97o10Q28K55j482J221q65r4P59J63
2150D6j64L56q2K3l45O08p79K7J302j262L35R28j052O48M89j591J566J61j422
2169b08J399j18n47O05m80K86m29P02n46n92J562j137l86R41j324N48J163k179
2187g40J231M83j458J250j126Q6M22j9m38L80J13o56M2L02n10J07L35n32p9R37
$$ y = [-1501, -691, -734, -926, -973, -562, 302, -796, -1195, -1406, -463, -58, -214, -847, 1053, -329, -879, 506, -1019, -362, 823, 342, 761, 132, -137, -135, -168, -9, 358, 267, 1244, 199, 1443, 418, -322, 1907, 1069, 768, 2042, 702, 897, 2102, -563, 797, 910, -135, 1221, 921, 427, 959, 1030, 915, -372, 199, -143, -373, 659, -504, -390, 1575, 208, -376, 503, -1122, -706, 354, -1186, -96, -260, -388, -1482, -622, -1013, -731, -853, 294, -1425, -116, -1039, -1325, -380, -869, -1126, -129, -739, 89, 344, -1138, 83, -782, -876, -117, 46, -118, 238, 156, 179, -166, 442, -337, -310, 992, -270, 65, 993, -59, 589, 1078, -513, 1053, 1214, -208, 1191, 1073, 526, 1131, 651, 937, 508, 1210, 664, 72, 1634, 497, 111, 1052, -272, 276, 1439, -740, 491, 974, -484, 766, -360, -274, 148, 129, -309, 71, 184, -472, -430, -128, -638, -531, -196, -728, -807, 130]
2207A30j553R29M7j460K105j065p56J759o85p26J488p64J54J5j73M38j50M92r27
2226g02L30J042j710J209Q3j270K591r46j088K017j125o22J340j256N21R03r50
2243C67J27N18l90k2K67L67j038J039L19j808J608p19j283J705p69k18J072j308
2261a66N29P25j304K88o3n23J90J67L44o03J05K32n84M38R0r27J116j043L7J089
2281A37j355K94N55j524J335K25n96N23J98m46N36m23k91J29N44l68l16J456j193
2300e80J08J553j645M14J254j455L21P78r41O39N6p44O83K67l62M35K27m72l20
2319B16J084m17q38J148q74j42Q68p93K98M25o48O21k54n10O13j73p48K62Q4m82
2339b60j29R54n15l52M70l27j40L73r08M05M40j104R15j21p85O36J59n28L04J29
$$ y = [130, -1423, -494, -447, -1907, 198, -867, -1623, 136, -549, -1275, 213, -551, -397, -382, -555, -117, -267, 225, -702, -372, 670, -1040, 169, 252, -1018, 1573, 627, -461, 1556, 431, -191, 1149, -107, 414, 1317, 367, 494, 1012, 622, 600, 867, 1234, 196, 1235, 1554, -254, 1354, 635, -648, 1057, 288, 70, 1142, -166, 363, 1088, -216, 72, 9, -514, -324, -157, 187, -416, -311, -79, -663, -225, -135, -1062, 54, -989, -952, 137, -1218, -924, -369, -1893, -558, -333, -929, -406, -208, -654, -118, -541, -832, -703, -159, -527, -843, 613, -580, -472, 1081, -564, -150, 1104, -351, -30, 748, -193, 446, 502, -242, 441, 708, 346, 781, 1008, 536, 216, 1300, 883, 45, 1193, 319, 177, 1045, 252, 550, 975, 327, 948, 694, 184, 797, 624, -124, 138, 222, -260, -389, 565, 50, -302, 168, -159, -299, 74, -834, -429, 11, -1093, -178, -299, -1084, -448, -289, -817, -513, -384]
2359c84j54k75K00n4m57P06k16K19J12n52O39L47r94P76j02n42J024l71o49R16
2379A89m47J38K22K03L13k9M40p32K06N04j021L46R00j232P03L86r87R62k39m29
2399C96P82n22q2q0j55P3l6NR8k47L65m62j84N91n17K6q8m14M80m94j17N94l92
2422c80j54L81l76M6K68l58M15p69Q62o92n24R70j030Q97k82q14J309Q8j042J144
2442d1l10l26n1l98J43J224l58l78O22o85J070l39J16J37r6K67j525J347l34r80
2462h95K222r41r14J978j068l61J544j779N55P04m74J46M05j02r09M74M34r64
$$ y = [-384, -538, -813, -613, -667, -1124, -418, -634, -415, -303, -855, -216, 131, -863, -87, -189, -731, 293, -78, -727, 189, -258, -120, 102, 305, 618, 589, 1029, 297, 503, 1007, -14, 332, 1232, 0, 703, 1089, 102, 1064, 825, 396, 1178, 656, 574, 494, 339, 412, 376, 381, 479, 232, 597, 135, -49, 542, 25, 51, -37, -451, 29, -465, -582, 12, -380, -534, -153, -529, -483, -215, -573, -158, -927, -65, -757, -1281, -311, -1341, -444, -726, -1540, -231, -143, -1185, -41, -351, -677, -728, -1126, -983, 241, -117, -495, 127, -558, 512, 173, 289, 426, 330, 597, -928, 419, 85, -895, 1327, 386, -528, 1450, 382, 21, 1565, -214, 341, 1045, 571, 717, 1122, 1020, 111, 585, 1019, 55]
$$ [...]
8191a81
##END NTUPLES=NMR FID
##END=
