##TITLE=1H_L3L30-SeO2-f14
 CDCl3,8 sc, 
 4.02.2021
##JCAMPDX= 6.0         $$ Bruker NMR JCAMP-DX V2.0
##DATA TYPE= NMR FID
##DATA CLASS= NTUPLES
##ORIGIN= UXNMR, Bruker Analytische Messtechnik GmbH
##OWNER= root
$$ XWIN-NMR		Version 3.5
$$ Thu Feb  4 10:30:28 2021 Russian Standard Time (UT+4h)  she@DPX200
##.OBSERVE FREQUENCY= 200.1315066352
##.OBSERVE NUCLEUS= ^1H
##.DELAY= (6, 6)
##.ACQUISITION MODE= SIMULTANEOUS
##.ACQUISITION SCHEME= undefined
##.AVERAGES= 8
##.DIGITISER RES= 18
##SPECTROMETER/DATA SYSTEM= spect
##.PULSE SEQUENCE= zg30
##.SOLVENT NAME= D2O
##.SHIFT REFERENCE= (INTERNAL, D2O, 0, 15.7039)
##AUDIT TRAIL= $$ (NUMBER, WHEN, WHO, WHERE, WHAT)
$$ ##TITLE= Audit trail, XWIN-NMR		Version 3.5
$$ ##JCAMPDX= 5.01
$$ ##ORIGIN= Bruker BioSpin GmbH
$$ ##OWNER= she
$$ F:/spectra/data/she/nmr/H-F/1/audita.txt
$$ ##AUDIT TRAIL=  $$ (NUMBER, WHEN, WHO, WHERE, WHAT)
(   1,<2021-02-04 10:29:19.40 +0400>,<she>,<DPX200>,
      <created by zg, POWCHK disabled, PULCHK disabled
       configuration hash MD5:
       00 E9 B6 7A A2 85 ED C7 34 08 36 98 17 FE 4E 26
       data hash MD5: 16K
       55 1C 2E 95 C8 AD 6F CF 6F 09 C9 A9 9E E0 66 0A>)
$$ ##END=
$$ 
$$ hash MD5
$$ EB 12 A7 A3 45 2B 65 4A C3 CB AE 88 7B 3E E7 27
##$RELAX= 
##$RELAX= 
##$RELAX= 
##$RELAX= 
##$RELAX= 
##$RELAX= 
$$ Bruker specific parameters
$$ --------------------------
##$DU= <F:/spectra>
##$EXPNO= 1
##$NAME= <H-F>
##$PROCNO= 1
##$TYPE= <nmr>
##$USER= <she>
##$AMP= (0..31)
100 100 100 100 100 100 100 100 100 100 100 100 100 100 100 100 100 100 
100 100 100 100 100 100 100 100 100 100 100 100 100 100 
##$AQSEQ= 0
##$AQ_mod= 1
##$AUNM= <au_zg>
##$AUTOPOS= <>
##$BF1= 200.13
##$BF2= 200.13
##$BF3= 200.13
##$BF4= 200.13
##$BF5= 200.13
##$BF6= 200.13
##$BF7= 200.13
##$BF8= 200.13
##$BYTORDA= 1
##$CFDGTYP= 0
##$CFRGTYP= 5
##$CHEMSTR= <none>
##$CNST= (0..31)
1 1 145 1 1 1 1 1 1 1 1 1 1 1 1 1 1 1 1 1 1 1 1 1 1 1 1 1 1 1 1 1 
##$CPDPRG= <>
##$CPDPRG1= <>
##$CPDPRG2= <>
##$CPDPRG3= <>
##$CPDPRG4= <mlev>
##$CPDPRG5= <mlev>
##$CPDPRG6= <mlev>
##$CPDPRG7= <mlev>
##$CPDPRG8= <mlev>
##$CPDPRGB= <>
##$CPDPRGT= <>
##$D= (0..31)
0 1.2 0 0 0 0 0 0 0 0.06 0 0.03 0 0 0 0 0.0002 0 0 0 0 0 0 0 0 0 0 0 0 
0 0 0 
##$DATE= 1612420158
##$DBL= (0..7)
120 120 120 120 120 120 120 120 
##$DBP= (0..7)
150 150 150 150 150 150 150 150 
##$DBP07= 0
##$DBPNAM0= <>
##$DBPNAM1= <>
##$DBPNAM2= <>
##$DBPNAM3= <>
##$DBPNAM4= <>
##$DBPNAM5= <>
##$DBPNAM6= <>
##$DBPNAM7= <>
##$DBPOAL= (0..7)
0.5 0.5 0.5 0.5 0.5 0.5 0.5 0.5 
##$DBPOFFS= (0..7)
0 0 0 0 0 0 0 0 
##$DE= 6
##$DECBNUC= <off>
##$DECIM= 32
##$DECNUC= <off>
##$DECSTAT= 4
##$DIGMOD= 1
##$DIGTYP= 9
##$DL= (0..7)
0 120 120 120 120 120 120 120 
##$DP= (0..7)
150 150 150 150 150 150 150 150 
##$DP07= 0
##$DPNAME0= <>
##$DPNAME1= <>
##$DPNAME2= <>
##$DPNAME3= <>
##$DPNAME4= <>
##$DPNAME5= <>
##$DPNAME6= <>
##$DPNAME7= <>
##$DPOAL= (0..7)
0.5 0.5 0.5 0.5 0.5 0.5 0.5 0.5 
##$DPOFFS= (0..7)
0 0 0 0 0 0 0 0 
##$DQDMODE= 0
##$DR= 18
##$DS= 0
##$DSLIST= <SSSSSSSSSSSSSSS>
$$ [...]
##$SUBNAM2= <"">
##$SUBNAM3= <"">
##$SUBNAM4= <"">
##$SUBNAM5= <"">
##$SUBNAM6= <"">
##$SUBNAM7= <"">
##$SUBNAM8= <"">
##$SUBNAM9= <"">
##$SW= 16.9725356469052
##$SWIBOX= (0..15)
0 0 2 0 0 0 0 0 0 0 0 0 0 0 0 0 
##$SW_h= 3396.73913043478
##$TD= 16384
##$TD0= 1
##$TE= 0
##$TE2= 300
##$TE3= 300
##$TEG= 300
##$TL= (0..7)
0 120 120 120 120 120 120 120 
##$TP= (0..7)
150 150 150 150 150 150 150 150 
##$TP07= 0
##$TPNAME0= <>
##$TPNAME1= <>
##$TPNAME2= <>
##$TPNAME3= <>
##$TPNAME4= <>
##$TPNAME5= <>
##$TPNAME6= <>
##$TPNAME7= <>
##$TPOAL= (0..7)
0.5 0.5 0.5 0.5 0.5 0.5 0.5 0.5 
##$TPOFFS= (0..7)
0 0 0 0 0 0 0 0 
##$TUNHIN= 0
##$TUNHOUT= 0
##$TUNXOUT= 0
##$USERA1= <user>
##$USERA2= <user>
##$USERA3= <user>
##$USERA4= <user>
##$USERA5= <user>
##$V9= 5
##$VALIST= <valist>
##$VCLIST= <CCCCCCCCCCCCCCC>
##$VD= 0
##$VDLIST= <DDDDDDDDDDDDDDD>
##$VPLIST= <PPPPPPPPPPPPPPP>
##$VTLIST= <TTTTTTTTTTTTTTT>
##$WBST= 1024
##$WBSW= 4
##$XGAIN= (0..3)
0 0 0 0 
##$XL= 0
##$YL= 0
##$YMAX_a= 93060
##$YMIN_a= -105569
##$ZGOPTNS= <>
##$ZL1= 120
##$ZL2= 120
##$ZL3= 120
##$ZL4= 120
##$ABSF1= 10
##$ABSF2= 0
##$ABSG= 5
##$ABSL= 3
##$ALPHA= 0
##$AQORDER= 0
##$ASSFAC= 0
##$ASSFACI= 0
##$ASSFACX= 0
##$ASSWID= 0
##$AUNMP= <proc_1d>
##$AZFE= 0.1
##$AZFW= 0.1
##$BCFW= 1
##$BC_mod= 2
##$BYTORDP= 1
##$COROFFS= 0
##$CY= 11.3945322036743
##$DATMOD= 1
##$DC= 2
##$DFILT= <>
##$DTYPP= 0
##$F1P= 15.9154993809931
##$F2P= -4.1035820241983
##$FCOR= 0.5
##$FTSIZE= 0
##$FT_mod= 4
##$GAMMA= 1
##$GB= 0.15
##$INTBC= 1
##$INTSCL= 1
##$ISEN= 128
##$LB= 0.24
##$LEV0= 0
##$LPBIN= 0
##$MAXI= 10000
##$MC2= 0
##$MEAN= 0
##$ME_mod= 0
##$MI= 1.114404
##$NCOEF= 0
##$NC_proc= 0
##$NLEV= 6
##$NOISF1= 3.799351
##$NOISF2= 2.8
##$NSP= 1
##$NTH_PI= 0
##$NZP= 0
##$OFFSET= 15.70392
##$PC= 1
##$PHC0= -10408.59
##$PHC1= 24.20095
##$PH_mod= 1
##$PKNL= yes
##$PPARMOD= 0
##$PSCAL= 0
##$PSIGN= 0
##$REVERSE= no
##$SF= 200.130013532006
##$SI= 16384
##$SIGF1= 3
##$SIGF2= 2
##$SINO= 400
##$SIOLD= 16384
##$SREGLST= <1H.CDCl3>
##$SSB= 0
##$STSI= 0
##$STSR= 0
##$SW_p= 3612.71676300578
##$SYMM= 0
##$S_DEV= 0
##$TDeff= 0
##$TDoff= 0
##$TI= <>
##$TILT= no
##$TM1= 0
##$TM2= 0
##$TOPLEV= 0
##$USERP1= <user>
##$USERP2= <user>
##$USERP3= <user>
##$USERP4= <user>
##$USERP5= <user>
##$WDW= 1
##$XDIM= 8192
##$YMAX_p= 0
##$YMIN_p= 0
$$ End of Bruker specific parameters
$$ ---------------------------------
##NTUPLES= NMR FID
##VAR_NAME=  TIME,          FID/REAL,        FID/IMAG
##SYMBOL=    X,             R,               I
##VAR_TYPE=  INDEPENDENT,   DEPENDENT,       DEPENDENT
##VAR_FORM=  AFFN,          ASDF,            ASDF
##VAR_DIM=   8192,          8192,            8192
##UNITS=     SECONDS,       ARBITRARY UNITS, ARBITRARY UNITS
##FACTOR=    0.0002944,     1,               1
##FIRST=     0,             0,               0
##LAST=      2.4114304,     0,               0
##MIN=       0,             -105569,         0
##MAX=       2.4114304,     93060,           0
$$ Real data points
##PAGE= N=1
##DATA TABLE= (X++(R..R)), XYDATA
$$ [...]
1810c05J26K92m52M86L7l53M15j40p0K72k04q0M08l75M28m60k24L35j20K47J24
1831C87l53K78k52J41J24n50L08Pl91L58K6k4J75o99M70J18k78K35j38k32P02
1852D12n52R6k1n00M94k08K1K33j78K31j34l16L5K04k04L27j99J00J10k47L10
1873A4N9m03M46k54Q4J33j05O9N0k43J92k63K21K05m14M70k52l10L70j23lJ60
1895A03k37O16l98k85M23k18L8L97k40J13j79j77K14j56j68K12k3J08kj15L91
1916D17j63l07M14l33k23L97n80N47r2j89M08l42k31K12j22J56j03j7J70k43N
1937b19J56j78L05j68j3N3l9R9L00m91J41k1k98M89l15J26N5k5N9j37j16J60J41
1960F4o8K90n88M91j86j11J28q0K96n5n7r4K31j91Q4j62j09M53o49M93N4j93r2
$$ y = [-305, -179, 113, -339, 147, 184, -169, 246, 106, 36, 308, 104, 24, 432, 57, 485, 25, -199, 136, 16, 263, 387, 34, 312, 60, 201, 325, -225, 83, 90, -301, 57, 83, 59, 234, -465, 5, 123, -155, 80, -58, -290, 412, -140, -44, -65, -565, -71, -279, -258, -25, -203, 28, -106, -422, -387, -183, -387, -60, -259, -159, -49, -296, 14, 73, -330, 116, -138, -54, 79, -26, 43, 93, -150, 42, -221, 0, 205, -209, 261, 9, -301, 69, -54, -57, 103, -134, 482, 84, -201, 222, 4, 42, 439, 199, 312, 133, -44, 170, 14, -154, 58, 35, 143, 141, 26, 417, 254, -53, 361, 28, -195, 202, -378, 169, 77, -112, 296, -46, -277, -65, -187, -31, -134, -151, 19, -224, -219, -63, -241, 64, -104, -117, -64, -103, -4, 296, -195, -54, -75, -373, 116, -199, -73, -18, -43, 16, -121, -237, -77, 64, -4, 286, -302, 189, 3, -108, 20, -60, 236, 181, 124, 30, 261, 70, 154, -8, -117, 336, -313, 180, 234, 41, -51]
1983e1K6mL07l09K11J95l86P4j02K7J26m0j89K02l27M52K2l73L77m51J26o8L0
2006a25K54j45r3K21l71K56j58P5O2Q8j88L6j9j71LK29k7L0j41J27j19J68R9k65
2030a74K29k5N2m7n6P8p0l8J7J35j61Q0J20J28k17J33j93l2pK58l64O5L05j37
2054G9R3o2q0Lp7J93J96j82k00J04n5J67j59j98K28j31K44q3k62K27k90K85OK9
2078G5k02Q2m2J45k02J90m5o7j96L09N9lj05j71K88k09L0O3o3R6j13j4K61k00
2102c4l4N5j78J37K81n76K43J23j2J1k88L92j80j13K65K7j88%K61k33K78k15K01
2125B23pj08Q0l52K50j68n1M19l31K6O7k70L52M2k26J66M7k54K77j36L7M9j19
2148A3L5l7j51J25n4q6J98k53J78k91K87p4J43k19%M5K3J21k33J68N3j86Q4m1
$$ y = [-51, -25, -29, 278, -31, 180, 375, -11, 63, -39, -12, 114, 74, -115, 87, -240, 212, 234, -139, 238, -213, -87, -155, -125, 129, -16, -109, 112, -259, -3, -161, -86, -24, 64, -124, -88, -107, -278, -275, -46, -73, -43, -184, -57, -176, -8, 91, -174, 55, 30, 82, 35, -21, 57, -13, -51, -34, 101, -60, 20, 140, 268, 51, 184, -9, -41, -48, 210, -154, -89, 216, 79, 172, 110, 30, 33, -44, 149, 345, 163, -37, 67, 12, 179, 20, -178, 50, -81, 163, 80, -182, 45, -245, 40, 46, 75, -127, -45, -87, 58, -144, 46, 1, -66, -262, 47, 106, 103, -2, -173, 115, -94, -64, -1, -64, 32, -81, -95, 166, -34, -68, -13, -191, -54, 227, -349, -106, 17, 5, 16, -272, 120, -60, -173, 92, 119, -69, -69, 192, -41, 237, 22, 223, 216, 108, 188, -164, 86, -82, -133, 286, -45, -19, 48, -222, 130, 172, -54, 112, 159, -95, 182, 46, 83, 132, 13, 48, 11, -140, -15, -69, -155, 43, -210, -32, -323, -36, -110, 33, -186, -186, -141, -118, 3, -230, -62, -9, -195, -111, -152]
2172a52J83k24J89K17j99r0p1M5J22L5j59l1J38o7N1r4K76k50q3M95j27k83R3
2195A4J6Q4M6k27K49J54m13J06j94K06n6j40K80J01k28p3l3L52k09Q2M4N0j64
2218D7J71l11m3L01j18L04k13q6Kr2J55j66j70K08r6K05j24j56N5J99j06K15j08
2241G3j40m6J63j02j21J29k5j05O0M1J0j55K46j15Q1J90l76J32ljk35k06N72J54
2265B21l79J1J19N4q4l4J91P0k30Q6m5L9J52m09K24J14N2qj7j83K56n24M29L5
2289A40k44K46j29R7J07m00J84r2K09k51J76J73k02j77L8K69k03L49o2r9r0j84
2311a45J27J20J8q6K35m56K29j05k20M22j24j04J1J01k11K5K76J43l53K52k67
2332a12j82L85j96n1J17m3j56K01K3o4L1M7O3N7j37J87j27K4J08n0q1j29J44j03
$$ y = [-152, 31, -193, -4, 213, 14, -76, -147, -102, 20, 55, -104, -135, 3, -64, -13, -107, 169, -81, -164, 331, 204, -79, 14, 30, 114, 160, -67, 182, 336, -77, 29, -165, 41, -15, -155, 125, 226, -2, -75, -108, 244, 35, 117, 161, 211, 47, 218, -93, -136, 165, 47, 351, 138, 52, 54, -38, 117, -49, -219, -11, -107, 98, -26, -182, -127, 72, -34, 181, 73, -67, -113, 50, -52, -173, -44, -69, -174, -114, -73, -63, -218, 28, -87, -6, 184, -192, -60, -63, -64, -299, -505, 67, 221, -158, -147, -28, 26, -58, -92, 99, 169, -61, 25, -20, 19, 171, -238, -14, 100, 152, 144, 127, -56, 200, -324, 105, 140, -104, 142, 13, 110, 217, -183, 1, -91, 118, -133, 43, 216, 14, -163, -125, 144, -59, 290, 228, 129, 39, -145, -18, 102, 120, 34, 269, -187, 42, -63, -283, 139, 15, -89, -78, 23, -188, -163, 113, 256, -97, 155, -112, -294, 91, -105, -156, -39, -82, -238, -37, -14, -78, -47, 0, 63, 120, -17, 170, 43, 67, 175, 125, 44, -85, 59, -44]
2356d4M1L01l69j07L35l51L07J12k43J19p6P2m4j4P6kk04K44J43k61K1j67J00
2379a1L58m65J61r1rN4j67J33L6J2j46M56l98J52j52n7J81j42JJj26J06q4J24
2403g3J81m5l9N5l72Q1J0K30k3j2J60k71k39K86K61j77oj25K26p6k66J28JK3K87
2428B05n1m3l04K17k57J51J35j7n0N9J8m4l8N4J8l82L96R9j57r8J93J49k13L9
2452G9q3P6R9l69M40j46Jq4K2KJ34k14lN4m4J16j70Nk3o7J47j19mM8J24j59J79
2479D1O0j26P8j77K53k8k86K25L0j13j14J55r8J31k19K29J7j58Q2o5J04J08j68
2502c9J15k84J15K21k82n2R7L11l6k47J66J01J8j74j4j19mJ58J7j5q3lJ03o7R9
2527A02r0K95k75k79K04N5l0L8p5J20r5R8j67M1k27J94n7K22j87pJ52j69K95L0
$$ y = [-44, -3, 298, -71, -178, 157, -194, 113, 225, -18, 101, 25, 97, 53, 39, 115, 113, -91, 153, 296, 35, 56, -111, -11, 347, -118, 43, -48, -57, -3, -170, -37, -1, 11, -135, 321, -77, 75, -77, -134, 47, -95, -94, -93, -219, -113, -197, -73, 108, 63, 24, 79, -293, -212, -202, 28, 5, -7, 153, -118, -357, -71, 190, 13, 7, -118, 108, 32, -234, -106, -105, -82, 205, 154, 111, -193, 24, -233, -82, 53, 36, -14, 45, 63, 19, -19, 35, 53, -329, 67, 166, 9, -89, 104, 253, 40, 79, -4, 72, 171, -198, 242, 96, 97, 13, 35, 37, 171, -43, -46, 8, -36, 80, -90, -85, -108, -175, -28, -147, -151, -103, 21, -138, 41, 101, -25, 53, -124, 129, 101, -185, 40, 70, -43, -157, -2, -100, 31, -188, 41, 58, -100, -18, -83, 21, 129, -39, 76, -208, -93, 128, -154, -206, -109, 202, 166, -81, 85, 186, 204, 30, 16, -103, -107, 51, 68, 53, -30, -33, 70, 3, 102, 12, 307, 32, -247, -43, 12, -18, 20, -55, 65, -30, 68, -99, -58, -285, -91, -148, 74, -113, -120, 32, -137, 158, 188]
2551A88k38j4J39k13K46N5j4l20J52p9J12o2M6J77j84N8m3j59J81R9M5l18K01
2574E5p0k78K23O4J6j15J71P1l20J26j61K20J06j45k24L96l76K93q5L4J0k06K20
2597B5K21k81J80j15Lj62j6M6NJ49L3j34nJ90j62K21kl14P4J37p7J44l00J60J9
2622C9l37L56m2j36L2M1K67k74K2J54k08l5O2p6K52j81Pl1J15J3oj3J3J61l41
2647a46J90j45K32J24k10kM5L3j30J33k79J57k2N1J97l69K12P3r6k49J14J7K55
2670A85P4m55J72O3N3j33j11J13J93j67n7p4J27p6K17m5K4k21J67k13O1J75j32
2693f0mM5J59l2j18k23K96j80J38j5Q5m2o3Q4k05J35k2j14J75j74m0L80k42r2
2717a29M1j01R7OM6q8Q6m29L76J96j22j64J16J09k87K42p9j10P3J34j20J33J30
$$ y = [188, -50, -64, 75, -138, 108, 163, 149, -171, -19, -98, 14, -48, -2, 175, -9, 49, 6, -153, 28, 127, 172, -146, 55, -15, -293, -70, -6, 10, -105, 66, 137, -183, -57, -218, 2, 108, -37, -261, 135, -241, 52, -33, 1, 11, -195, 25, 246, -35, 145, 30, 33, -129, -145, -99, -94, 55, 88, -46, -51, 139, -23, 198, 196, -118, -44, 93, 16, 160, -140, 20, 39, -298, 58, 16, -120, -88, -47, 220, -54, -32, 122, -86, -121, -59, -135, 117, -64, -57, -88, 27, 40, 34, 21, 34, 195, -146, 44, -101, 131, 255, 45, 43, 88, 121, -9, 124, -155, 2, -20, 31, 228, -141, 71, 144, 48, -201, -87, -70, 185, 259, -196, -24, 39, 92, -41, -152, -39, 154, -13, -70, -144, -17, -93, 124, 79, 103, -118, 49, -164, -103, 72, -60, -64, -19, 140, 108, -10, -233, 63, -117, 21, 6, 91, 49, -14, 70, -135, 0, -22, -136, 39, -135, -175, 205, -37, -129, -88, -189, -92, -86, -40, -128, -42, -471, -95, 101, -21, -185, -69, 40, -247, -5, -84, -194, -121, 13, -107, 26, 156]
2740A56j22Jq3p2J05j26k1J04k1lL69l18Q4rk10J52J58N7j99o1k91M07L83m55
2764a5j07K71L3k83j30J00k7Q6N7N5L01m16J06j00K94j50Q0q5J74k70OL12n76
2787b84L00k31M81k37k0k4J0k19J71P7J93j82q3O3j9M9j18K30l16K16k65N24m42
2810a26k4J04k6j67J80N0N1P4k55K00j06j25L11j08m5J8k48L79k84K78Qj65o9
2833i5K47l9k6Nj36J76r3k9J27j41N8p4J85K12k48p6K6j63J69k49Q6K15q0l7K34
2858B54m43J0K56n9k0l36L76J23o2j46j08J32Lj88J55P7k45K25n2o6J96k57L5
2881a40K41j23P6o6Nj18MK16j55n9J89n7j40R1j45K20L7k37K16Pp7qJ6M7%R8k79
2908a41K25j94K09j7j2k86K09K34n8l29J75J23j75R9J95mk25J12K4k17J64k8k11
$$ y = [156, 34, 35, -48, -120, -15, -141, -162, -58, -79, -82, 287, -31, 53, 44, -166, -14, 144, 201, 2, -59, -350, 57, 440, -15, -122, 149, 182, -101, -231, -131, -158, -72, -15, 40, 341, -75, 31, -69, 225, 75, 155, 70, 244, -26, -20, 292, -284, 16, -215, 266, 29, 9, -15, -5, -224, -53, 24, 217, 35, -48, 15, -4, 45, -73, 157, -159, 57, -208, 316, -126, -150, -46, -72, -239, -59, -9, 42, 116, -139, 61, -45, -170, 141, 33, -12, 6, -242, 137, -147, 131, 139, -26, -95, 152, 113, 87, 92, -44, 132, 39, 10, 137, -4, 54, -20, 165, 377, 129, 53, 79, -84, 85, -164, -78, 137, 57, 20, 254, -189, -179, 77, 18, -2, -338, 38, 161, 99, -47, -155, -23, -20, -208, -53, 24, -221, 4, -48, -114, 82, -175, -140, 101, -22, 54, -12, -7, -125, -121, 95, -60, -119, 70, 13, -127, -36, -181, 39, 76, -161, 55, 62, -15, -23, -7, 40, 40, 138, -141, 84, -110, 99, 82, 70, -216, -7, 227, 169, -160, 15, 138, -37, 62, 257, 253, 28, 140, 164, -53, 111, 83, -128]
2931a28L52k15j05J2K98k03K12k90l9L33l01J69L6j62l3J52l64K3J2J62K76k81
2953h4j17K20k88J48J05P0J18k96K38l57j22K74j51J57K68l73J06J70k31Q7J09
2974E1k46Q0K00R3l00R8O1j03n6J79J1J48k70J62rm6p2r3L9J69J20J56j10k25
2998C7pM5k47J30J23j4J20k05K43k06L51l18J27M5j30m7j7K9o4K52m94K75r1K91
3022B28l06J72j85R0M0m57L84kl4L0m1L51q0o02L07K70k87K09p33K0R65m31L3
3045e9k32N92n9o97J32Q6k45K92j1K63J50n51M47M80m64k34m8J02j04K73n14M00
3067aL02K43p70O01j002J41L81k10n0L43N5k91O19m99J52j09N7j10N4K59m6l8
3089H1J02L41r30O02nj44j18l64J91N71n85l0J134j023L85k73k49O19l18k49O03
$$ y = [-128, 224, 9, -96, -84, 214, 11, 223, -67, -106, 227, -74, 95, 131, -31, -64, 88, -276, -253, -241, -79, 197, -84, -201, 19, -269, -121, -16, 54, 172, -124, 114, -243, -365, -91, -242, -85, 183, -190, -84, 86, -145, -58, 51, -195, -115, 85, 178, -122, -24, 37, -66, -122, 57, 68, 216, -54, 108, 99, 53, -19, -112, -73, 96, 216, 372, 262, 37, 30, 75, -172, -42, 81, 67, 187, -18, 225, 19, 370, 52, 179, 224, 94, 47, 30, 59, -5, 247, -247, 28, -63, 228, -78, 94, -91, -1, 39, -418, -34, -36, -70, -40, -81, 270, 190, -412, -105, 165, -122, 87, -646, -626, 339, -92, -59, -291, 301, 242, -455, -323, -237, -482, -190, -201, 62, 212, -339, 108, 588, 124, -110, -158, -56, -160, 113, -401, -1, 301, 544, -226, 375, -627, -486, -105, -315, -365, -22, 33, -258, 361, -138, 14, -95, -38, -148, -94, 165, 119, 81, 183, 524, -406, 196, 191, 47, -71, -435, -244, 327, -258, -288, 846, -177, 208, -65, -314, 305, -13, -262, 341]
3110C41P3j046R35n14P5k10L54k76M79m15K02j09J42N9k46N5K13k49K33m29J78
3131a55M9n0L80l8m41J64J31m7J33R4k23J05L5k30j38L06o4P0J56k94L88k23j21
3154a3J77L2k70M24l51Q5l8K47l91J03j4j7r2L02o0k07O4j55R0K08j82P3Ml21
3178c02L93o1j47J55l29K5J89k79K27j5nK3J39k19R8J96j99k0J27r8lr8J53o1
3202a11j1K36j72J92k73j07K45m7K9J13k48J26J91k14L7n1J47k0J95m6j72K76
3224C15j69j74J05j12K76j83O0j66J70J20k05j28j62K99P8k24J76L8j99K9K31
3245A75q9k69k6Q4M3L26l95K87j3j28m6J34k56J80j38q0J04J61Nj68J48j28K24
3268A35l07J71Q6l4j17L7Rj34N9K52r4j9mp2J09k6J09M9m11K45k3j37R7M8Rk09
$$ y = [341, 414, -632, 303, -211, -136, -346, 8, -268, 211, -204, -2, -111, 31, 90, -156, -101, 112, -137, 96, -333, -155, -106, -156, 224, 186, -255, -91, 40, -7, 126, 220, -3, 102, 137, -93, -231, 75, 11, 81, 237, -57, 331, 108, -13, 164, 196, -74, 350, -1, 84, 46, 293, -98, 5, -9, -26, -118, 184, 124, -83, -19, -174, -84, 124, -58, 15, 19, -302, 91, 30, -117, 38, -291, -266, -77, -356, -129, -144, -149, -126, 13, -206, -108, 88, -111, -131, -4, -102, -105, -203, -50, -111, -122, 114, -58, 134, -139, -246, -1, -48, -19, 94, -154, -28, 163, -51, -14, -65, 82, 62, 257, 211, 39, 315, 146, -28, 77, -35, 241, 58, 118, -48, 122, 242, 37, -91, -253, 46, 124, -100, 76, 114, -85, -56, 175, 86, -183, -209, -125, -82, 244, -151, 136, 123, -5, -51, 83, -173, 7, -131, -211, -107, 54, 59, -109, 39, -89, 135, -172, -1, 85, 51, -66, -29, -20, -154, -95, 157, 63, 44, 40, -32, 77, 51, 160, 209, -202, 43, 20, -117, -20, 28, 37, -172]
3294a72K54k03k5K17P3K0k44M04l35j4M2J2J59r9j08J46j08J28j47m0P0J65k21
3317b6o9P4o3P4j21N4M9j23J66J71k64L85k47n4j4j79K76k71Q9O9j30P1K85k45
3341d3J00R6k44m0J6O1j20jJ16k8j78K13j33J97k87K40J1j32q4K62P7M5J27n07
3365b36O4J84J57K1j59P7Q7j54J43j47J91j90q3P1J45j9j39K23j71J06j33J4p
3388D5j24J4OJ09j99L65l97K03j89j5K59j38K19M6k50k7L4M0j01Q1r2l2l2J29
3412d6l2P9O1k00q9J89o3J08n5MK06k46k25M32j70j34J31j8J49J9j06l04L57k2
3436B5k49N07n0o1m36N45o41O94n82J33n1J1P49l08q96N53M99j33n8k61R3m42
3458c59M42j5m7rr7R6Q2mR1l4j23j60J39J87k90qp5J77N1K08r5j74J0j9j6Q0l4
$$ y = [-172, 82, -121, -146, 71, 144, 164, -80, 324, -11, -25, 17, 29, 188, 89, -19, 127, 19, 147, 0, -40, 30, 195, -26, -95, -21, -84, -10, -131, -77, -28, -151, 15, 186, -78, 307, 60, 6, -8, -187, 89, -182, -93, -24, -154, -83, 202, -43, 57, 153, -91, -131, -115, -54, -174, -175, -59, -87, -265, -52, -185, 12, -275, -35, -24, -156, -240, 22, 99, 144, 271, -236, -172, 12, 169, 190, 31, 108, 195, 41, 184, 37, 228, 38, -45, 26, 171, 152, 13, 236, 65, 171, 38, 52, 45, -79, -65, -59, 50, -149, 216, -181, 22, -167, -182, 77, -61, 158, 204, -46, -73, -39, 1, -100, -19, -111, -143, -175, -46, -78, 1, 62, -138, -227, -38, -101, 7, -48, -44, 162, -84, -309, 123, -47, -181, -50, -68, 81, 100, -6, -310, 47, 25, -224, 283, 233, 172, -264, 281, -360, 334, -248, -115, -166, -155, 594, 286, -610, -57, 442, 309, 251, -10, 83, -359, 83, 68, 21, 12, -85, 11, 93, 89, 180, 146, 23, -137, 2, 189, -101, -109, -184, -7, 44, 252, 157, -17, -7, -26, -42, 38, 4]
3485Dj87p1J80J33j25j72K27J16j36J11j86L59k04l66J23j6J32J00%k99J92K09
3507A24l27L49j20l4P1O6j73j07K4J33l07M40o1n1L0l1K10j58l9r2J76l17M24
3530B30j09j65K89j25J7J84P5l49N2J98k55k90J85J93m5J55k34J36l04K15J23
3551A76j52j98K36P6k98K59j06Q5j56o2K86k49j25J76Jj62J20J14j7j7j88O9k37
3574c69K59J96n5j43o9J02J50j05N5R7j56O4j61K90j48n2J48j25j6K83l14J97
3596A28j27Q1J39j74k4J26j49J27k00K8L8m6j24J98K1J35J26j30p8o1j9J15R5
3619B25k9m31pK72J75j53M8q6l6L50l61j81M64l24j2J74m41K97K1m9J31j33RJ01
3643B4m00O04j27m5j65P9m3k96N73o89L74k50P65m09PL42q50M63K29L77j303N72
$$ y = [4, -183, -254, -74, 59, -66, -238, -11, 105, -31, 80, -106, 253, 49, -317, -194, -210, -78, 22, 22, -277, -85, 124, -203, 146, 26, -8, 63, 129, -44, -151, -127, 6, -301, 139, 78, 27, 57, 26, 236, 78, 39, -53, 123, -194, 230, 121, -44, 245, 120, 137, 321, 396, 47, 99, 297, 42, -248, -63, 130, 85, 240, 6, 142, -162, 53, 176, 24, -174, 62, 138, -160, 99, -7, 78, -78, -140, 146, -103, -228, -52, -51, -213, -93, 21, 4, -13, -201, -132, -369, -110, 86, 31, -112, -181, -79, 71, -34, 21, 118, -38, 26, -135, 155, 7, -45, 103, -22, -38, 245, -69, 128, 1, 82, 221, 47, 23, 149, 0, 127, -73, -45, -7, -53, -177, 21, 42, 177, 303, 173, 95, 34, 15, 130, 225, 196, -235, -242, 30, 205, 52, 100, 14, -22, 328, -33, -214, 250, -74, -86, 88, -353, -56, -35, -84, 47, -86, -77, 24, -376, 228, 101, 56, -109, -30, -73, -369, 204, -485, -111, -361, 404, -5, 2, 344, -506, -43, 186, 563, -740, -168]
3665a68O3n36N77K56n26P00Q05j061N46r14O69j82k27j68rJ5j66L70Q5k1JL39
3687D48p17J0j06O67m31K96J38n22L10j41Kj46J98m4J11j19j06M3l4K45p7L6J4
3710G5L2N2k04K2q0mJ71k1L4j49J10j69K6O9N0j43K37m09K26j1L9p4j09J56qJ6
3736f6K57m62L27j42k1O8p8K94J5m85L00j29m0K30M2q6q6J4J55j04J8k2M3n8J16
3761A00l0Q8j52J5M0r1J42L1M0j76o6j50K52j11J99J52k54J85l4k70R8o2K67m28
3785b15J90J03j43m5L2J58k43J46k55J96O1j38K04j01j69K76j60P5l1J38m06J59
3807a68J06k06L30n8j55O0J94l63o8L19o1j7J7N8R2r0m2K71j85j26J86m9Q8M1
3831A74q6M40o90K39k5J5j7j37J39K21n3jj90j21M13k81J22j11j14J83j00j50
$$ y = [-168, -105, -641, -64, 192, -334, 366, 1171, 110, 656, -258, 411, 229, 2, -166, -175, -160, -326, 44, 129, 108, 109, 448, -269, -259, -365, 302, -129, 167, 305, -217, 93, -48, -46, -192, 6, -38, 73, -46, -152, -109, -143, 102, 25, 61, 75, 107, 159, -45, -23, -103, -107, 64, 43, 77, -72, 38, -131, -105, -36, 14, -129, 108, -301, -75, -86, -47, -121, -230, -74, -82, -66, 191, -271, 56, -86, -107, -39, -117, 177, 192, -293, 7, -122, -162, 68, 110, 24, -62, -48, 107, 3, 21, -1, 42, -16, 100, 70, 158, 6, 21, 61, -30, 112, 143, 183, 7, -59, -209, 43, -68, 131, 283, 29, 214, 180, -90, 8, -54, 213, -215, -25, 78, -65, -110, -78, 80, -163, -17, -272, -76, -15, -153, 51, -50, -219, 57, -103, -28, -59, 79, -327, -168, -62, -268, 62, 4, -151, -91, 103, -260, -328, -9, -70, -87, -70, -12, 80, -10, -52, 219, 34, -92, 94, 45, 133, 174, 88, 528, -162, 77, 52, 67, 50, -87, 52, 273, 220, 219, 29, -92, 321, 40, 162, 51, -63, 120, 20, -130]
3853a30N42n72N16m21R6k56N5M1m7M2J59o4o2L80j06k63J97l9j47P9K7l15K04
3876h4K40j08k04M46k17j26j42J85ok1L06L41m94j61N78p21P13n41J84o33J004
3897E39j06k57o14l94R31j7L5k22L17l31L87m06M16j81J5j55k2L52j20j9j58j61
3919a71K31K25l77j26M34k15R0q1q7K40jl22K61j15O8K4m7j81M03n11J61J08j38
3942a27L78l07J53k79J39J15k32K18l12K13M0j10K67j76J05j21K6n3k09J93J80
3963A01j74p1J44M7K60q8j41k09L02k52M1J3m2J08k9J05n9J20k86J70j9j51N12
3986D02l04N3J08j41j25M6j75K07O5L8J9L5l44j10L36j71J26K71n05O9J24o6p8
4009a20J63O1n5M7O9l47O4J1J72k12J66J45j46o1o9j28J29K7M8k15K75j89ML88
$$ y = [-130, 412, -160, 356, -65, 31, -225, -170, -129, -176, -134, 25, -39, -101, 279, 173, -90, 107, 68, -79, 0, 27, -288, -84, 156, 48, -156, 290, 73, -53, -195, -10, -16, -37, 269, 610, 116, -45, 533, -188, 525, -16, 168, -465, 539, 433, 176, -438, -832, 99, 82, 117, -105, 212, -119, 268, -138, 278, 97, 112, -43, -65, 287, 167, 148, -10, -171, 60, 285, -92, -218, 216, 1, 91, 10, -77, 163, 162, -160, 101, -14, 54, 78, 31, -150, 253, -258, -97, 11, -127, 251, -56, 97, -182, -43, 72, -160, 58, -254, -41, -1, -111, 156, -20, 85, -36, -10, -63, -272, -79, 101, -73, -144, 0, 47, 307, 219, 78, -131, 171, -81, -40, -27, -69, 39, 10, 115, 56, 176, -110, 60, 41, -110, 402, 98, 151, 259, 118, -7, 39, -136, 71, 136, 174, 193, 228, -116, -226, 110, -61, 65, 336, -169, -100, 24, -42, -120, 43, 104, 49, 96, 165, -182, -118, -107, 65, -147, 19, 164, 18, -43, -112, -240, -111, -84, -36, -251, 24, -165, -161, 227]
4033B27j68l39N35j96j91L3J57k98K11R1k30M0j7N6J71q7J09P3R5k3k57J44J68
4056C04q8j00q3J89j08po9K14k33J14j03l6K05j54j28r6J8J68K37l27L81j13k22
4079c7j8J17l0J56k19j65J99M1mj65j44K04j02O9J12j19J04k28J64J50O4j13k12
4102a76n0J79p6K71k92M0j42L21j17l6m0Q0Q2q6N1J8K2r3MR7j54o5K76k82K23
4127E5l7o2J46J16k2o9m9k42K44K5k62K51Jl7k2P9J74n61L40J07l21K69j47J51
4151A27q0M1j17M2M1j83J38l9N5J21j42M8m2j63Q5k47L59j70ML62l76K2j32k1
4175b67p9K68j26K81l32L38k33o8L06k40k5P0ll0K95m17J12PK01j42j60L79q8
4198D7k57L72p6j67l8K05Jj1l8J88l3k46P2J03J38j58j37j26O1K28o1on4K9j1
$$ y = [227, 59, -280, 255, 59, -132, -99, 58, -240, -29, 62, -168, -128, -145, -89, 82, -5, 104, 177, 272, 249, -8, 136, 304, 216, 116, 33, 222, 114, 107, 38, 252, 19, 133, 30, -6, 199, 45, -83, -179, -161, 7, 244, -83, 298, 185, -37, -55, 62, 32, 188, -31, -196, 3, 44, 40, -125, -269, -65, -167, -98, 14, -105, -1, -229, -65, 85, 149, 36, -176, -226, -47, -123, 148, -144, -104, -246, 75, -42, -78, -118, -38, 44, -42, 9, 27, 49, -44, -40, 57, -97, -162, 114, -168, 55, 18, -44, 102, 218, 196, 127, 78, -164, 80, 105, -157, 94, 95, 58, 36, 115, 289, -272, 68, 175, -146, 123, -24, 127, 47, 88, -29, 13, 54, -129, 9, -30, 25, 146, 4, 52, 10, -153, -68, -315, 44, -126, -122, 240, -136, -114, -246, -267, -346, -78, -204, 77, -255, 83, -150, -218, 88, -152, -177, -107, -110, -140, 155, -262, -150, -143, 58, -84, -244, 135, 47, -210, 162, 86, -81, -119, 86, 87, 76, 38, 226, 193, -53, 19, 122, 260, 102, -35, -161, -100, 128, 67, 61, 7, 36, 25]
4223B5o2M15l01J92k81R1j6o5o7N8q6J61j11K81k19p8J66k9k79K19j72K70k15
4246a03j06K42P2k49O1J27j56J52k15PL54l93O6O7j16J17M4J93m28J35J45L74
4268C90n77J24%J44k51J55j94J00J05n3k4K41k01M39j16k87M13m99o8L47j63N4
4290G9M8k92K40l43L56L49l52k83K56P1O9L3Pk76P0j52J67J71j18J49J71k97l64
4313b41O7l4M70l10j29l25M64M7J7J08k44k9K14m17O39n0n4l72J70nj07L01L14
4336D94p25J19j7j8l90R32q4l48J92p9r1J0N0l50L77J34Q4j77j66j09K96j54K30
4359B10mj4m58Q38r52Q80j86j47l8n87M66K8J37M3l41L32k37J93n74q90J038M99
4381B36J83o3l88m35K29M05n83L81R58q07l14k35P6L47o15M29K46J60j17n80R45
$$ y = [25, -37, 378, 77, 269, -12, 79, 63, -2, -69, -11, -97, 64, -47, 234, 15, -63, 103, 74, -205, 14, -158, 112, -103, -209, 33, 105, -144, -83, 44, -112, 40, -175, -168, 186, -207, -141, -74, -190, -73, -29, 164, -264, -129, 16, 390, -187, -63, -63, 81, -170, -15, -209, -109, -4, -57, -81, 160, -41, 398, 282, -5, 408, -91, -159, 188, 25, 79, 127, -165, 75, -268, 88, 437, 85, -198, 58, 129, 198, 231, 238, -38, 32, -120, 47, 218, 100, 249, 420, 123, -241, -174, -208, 262, -48, -177, -502, -38, 9, 26, 134, -110, -139, 75, -342, 297, 247, 193, -179, -9, -14, -121, 180, 494, -231, -112, -129, -147, -537, 395, 311, -37, 155, 76, -15, -5, 45, -305, 72, 206, 290, 113, -53, -162, 134, -20, 210, 206, 192, -266, 572, -380, 500, 314, 167, 129, -458, 8, 36, 173, 216, -125, 207, -30, 163, -411, -1301, -263, 236, 419, 356, -32, -467, -238, 167, -416, -35, 923, 116, -198, -433, -357, -10, -625, -196, 50, 210, 93, -487, 458]
4402D58l19Q5M46m48m20m8J00j52M38j38o7N09n1j94l32k5L9r7o05J47O95M35
4424D56o00N72J29p79K23j94O7L79j41o4o41K44R54j95o42Q51l48R8p36P02p34
4445c99J00O25j62M22j146L09k74K28P07m7l17n6PP7L8l58L09P3l22M49q91M13
4467b15K44K3o59O64P6K64p59n56J155P49j82p44k68M67o34o08J006r4o6P5rJ08
4489C7j60j67N29N67r26L44k82J91n5l43J49R2k5l5K65j92R6l27K85K10k60J66
4511A59p9j90K34j05k07K07M55l5m42p1J29p1Q8k0J81k59P5j18Q1k30L1K46q4
4534b5O4p7r3K89N4N5j66j14j00P5J5N6n5k14K24o1l4L38l18J90k68L21k70J16
4558Bk01J09o9J55O9N4J0j08k7P0M6o4j69J42n8J16k92L03k12J18J03p0j16j75
$$ y = [458, 139, 224, 670, 222, -198, -246, -146, -298, 140, 2, -65, 444, 393, 199, -133, -158, -119, -216, -821, -674, 21, 456, -144, 428, 557, -222, 1, -193, -126, 253, 112, 48, -593, -349, 605, 410, -232, 619, 271, 369, -367, 335, -399, -299, 326, 164, 586, -560, -251, -525, -297, 410, 363, 46, -10, -3, 74, 112, -246, 63, 136, -186, 263, -628, -215, 29, 52, -607, 57, 133, 397, -362, -918, 237, 986, 804, 60, -208, 259, -375, -983, 23, -71, -137, -62, -71, 37, -123, -290, 239, 806, -120, 224, -58, 133, 78, -265, -116, -24, -49, -84, 181, -11, 85, -242, 43, 253, -7, 159, 80, -110, 124, 19, -188, 19, 474, 439, -3, -74, 55, -16, 72, 52, 233, -26, 49, -69, 12, -218, -187, 59, -25, 39, -38, -131, 158, 212, 267, 101, -13, -113, -38, -23, 33, -22, -236, -12, -73, -107, 231, -87, 103, -165, 156, -114, 2, -199, -90, -159, -4, 65, 119, 129, 21, -6, 64, 110, 46, -123, 19, -39, 77, -215, 88, -124, -6, 97, 27, -89, -264]
4582b64L02k7N5j99K28J55q4k19r7L18L9k29K6M8o4q3L07k81J28Q1l14M04j79
4605E1J4L1l1r9m0L36k88K09k83p3K41k27K82j64L20l12M5m9n4j23L24j84K91
4628B17j67j08k1LO5j81K07j95J42n7M3Q3L1j33p6L58l56J69j50J26P2j19O9k68
4652b46L65r7m2j31L34j66r4O8r2Q2j63J71j48L56m7M5j83j09RL09k13N0l2j28
4676a02J20n4K65q7O2m1j81l6o1P6R7m7j67Q5m8J26Q9j43K97l74P1j31L79k74
4700g9r5RJ17j96M43l00J1J1k21M08k77J48k05K46j97J95j69K9K04j36PK2O8J42
4724A85k32K28k10O1k81J28jj17L95k38r7L36k73K56p9J72l06K21j14J99j90j4
4746B9K09k25o1L2q3K22Q4l95L76k09O5%n3J82r3n4k12M84j07j73o2K44l24l4
$$ y = [-264, 38, 11, 66, -133, 95, 250, 166, -53, -150, 168, 207, -22, 4, 52, -12, -95, 212, -69, 59, 140, -174, 230, 51, 65, 96, 65, -34, -74, 262, -26, 183, -100, -173, 68, -159, 123, -41, 279, -33, 12, -37, -91, -214, 110, -74, 217, 50, -58, -79, -76, -11, -192, 15, -180, -38, -95, -52, 31, 62, -71, -147, 211, -145, 24, -126, 0, 72, -47, 22, -246, 119, 22, -20, -151, 183, 17, -77, -9, -101, -19, -182, -11, -159, 197, 150, 195, 12, -97, -88, 221, 8, 58, 26, -102, 18, -36, 229, 142, 204, 163, -18, -54, -115, -39, 58, 11, -156, -71, -119, 7, 96, -47, 250, -124, -53, -184, 195, -79, -174, -165, -48, -244, 199, -101, -90, -79, -300, 108, -169, -21, -226, 20, -177, 18, -151, -122, 82, -54, -47, -25, 43, 185, -47, 181, -29, 32, -249, -121, -122, -239, 156, -82, -179, 157, -116, 140, 61, 233, -73, 148, 34, 233, 43, 29, 238, 13, -48, -16, -99, 123, 207, -188, 188, -21, 44, 44, -9, 173, 80, 26, -186, 298, 191, 18, -44, 200, -124, -158]
4770a58J30n9Q0j83L3K8K99o8l50P3J84j39R5j65L88l03K17l36J83p0J78q9l04
4793c36L58k46R1L7K24r1j36K10K0k75j62N08l82J29J49j06j13j5K14l6K4k2J01
4816A45q9R2m9L06l92P2o5q3o0J03N4j08M13j62j87Q0Q9j77k07J43J55k00K33
4839A06K31l68L04l27J5qJ68k6l1p0j80M05j11O1m02J16P3J98p6p7N7j88j11O
4863b35K07l0Q3j60o3J2L10j45QJ83k02J7P6o1j3p2J59n4j16kJ31j87J0K42r0
4888Hq4K47j62o6j29L43j45Q4m8NKN2K18n11K75k7k1j19RL9J08r2J1%M0k53J25
4915i1L53k96M1q7j30K17Q2l15M04l83K40j07L4J0j00Q3O4j16Q2M1L6j03j98K27
4939a2J24k76L17rj48kk13K07j19p5J66k00J46L32n00K87K28k87lJ1l1K91l21
$$ y = [-158, -28, -87, -7, -190, -157, -129, 170, 102, -248, -175, 9, -130, -35, -200, 188, -115, 102, -234, -51, -121, 57, -32, -336, 22, -224, -133, -96, 128, 37, -99, 111, 131, -144, -306, 202, -180, -51, 98, -8, -121, -136, 78, 42, 66, 44, 145, 56, 148, 99, 405, 13, 85, 20, -63, -123, -20, 34, -74, 339, 177, -10, 70, 159, -18, -225, -82, 73, -127, 106, 337, -31, 273, -54, -39, -47, 121, 95, 64, -6, -186, 219, 108, 169, -233, -117, -44, 154, 78, 1, 58, -130, -241, -235, -28, -58, 25, -135, -198, -186, 124, -21, -13, 170, -32, -15, 61, 0, -13, -85, 74, 20, -96, -98, 33, -154, -144, 98, 8, -76, 171, 9, -57, -186, 157, 12, 96, 48, 53, 55, 107, 325, -186, 89, 62, 41, -78, -69, -30, 78, -14, -3, -3, 37, -216, -91, 262, -34, 7, -80, -210, 7, 89, -226, 178, -205, 35, -72, -38, -28, -128, -45, 19, -97, -15, 26, 62, -41, -239, -12, 112, -164, 153, 144, -4, -6, -219, -12, -131, -206, -40, -240, -94, 238, -262, 25, 253, -34, -37, -26, -57, 234, -87]
4962h7K20l0K8J17m03K55k39K71k0l0K00j94J64j90Ml6J0L17j99j76K19j18Q4
4985A67k32Q4p0M7J7m4J75k25J0P2j2r5J92j04lK8J25j86K3J41j47Q3k6Q5Q7m30
5011b38K38J91l43J5J4J06O4j50Q7o9Q9m1p0K18l37l0J46k3K7j1J10J30j07j72
5035a56J29j50J17j8J46j46Lj03K01j06L35k93QR4J89n2o9m9J06j48N7kj24j9
5059e0K8J97k78J0L13k26JR7j41J69Q7j72jJ4r6j59K06k08J55k1J16J2r7q2K18
5084I2k36K49r0j19j0K20J75o41N22l29Q0o2J12O0j5j13m6N7q9R6R6n3J22j92
5108a14K6K5J46l56K26L8Qj0K3L5n4j9o8N3J18P7l4j7k60K62k7J7K27n52L57l8
5134H9J42j04k64J9K34r2J41j67j8J91p2L3n6j90K15j16j51K78j65j0m2Q1j17
$$ y = [-87, 133, 103, 131, 248, -155, 100, -139, 132, 112, 82, 282, 88, 252, 62, 66, 30, 40, 357, 158, -18, 201, 83, 167, -65, 19, -51, -4, 13, -31, 144, -81, -71, 1, -11, -106, 86, -18, -21, 7, 132, -54, -31, 110, -37, 46, 20, 105, 192, -238, 0, 191, -152, -137, -123, -17, 47, -103, -16, -85, 4, -37, -107, 111, -226, -256, -110, -133, -106, -117, -7, 123, 16, -156, -27, -177, -60, -78, 68, -78, -75, -178, 23, -83, 252, -41, -33, 61, 250, 198, 129, 80, 186, 38, 95, 93, -31, -50, -22, 175, -103, -93, 220, -6, -5, 92, -49, 120, 207, 35, 34, 48, -48, -207, -1, -209, -54, -75, 41, 53, -44, -126, 92, -144, 105, 15, -104, -114, 106, 281, -360, 162, -167, -87, -149, -37, 23, 8, -105, -151, -94, -183, -87, 9, -44, 78, -114, -88, -63, 83, -273, -47, -9, -1, -11, 12, 47, -7, -26, -94, -41, 77, 154, 120, 103, -157, 105, 78, 95, 322, -230, 127, 89, 231, 127, -137, -118, 116, 24, 165, -2, -20, 171, 99, 132, 76, -114, 101, -15, -166, 112, -53, -63, -105, -24, -141]
5157a41L22k95O6J63k25j7K36l49K42o7o6J94k53J03J98m06K71l6nN9R3k5l70
5180c08M37m25M60j58j8o4J09P6k29J25j84K62N3P5l30L03j21N4Lp8p8j34J15
5203e5j16K20J0m8M4J99j94l9Q5N9l24J23R3o2nl3j2J63k07K5r6O5L10l01J46
5228E0K2j73J11j17o1M31m46JN6r1J71k2P1m8pP4O3l52J34l9M2J50m14O95p29
5253d28k25L14N01l78l1L5O4Q81j166M37q7N22n24k2J69m44L58J91L9k06K54k98
5275d4K90l6j50j44L4J82m34J25M14j37q2O5K7j14k88J26l7K79q1k85L79L13p22
5298c20L82l34J82o60M55J377j136m00M69Q9n6K17j22p5k30M85m05K68Rk22j15
5319a42J59p7q9J94k28R8N0N2J81l69j2J15nj4J80j01k2q6K93j14k74m0K92j85
$$ y = [-141, 181, -114, -48, 115, -110, -127, 109, -240, 2, -65, -131, 63, -190, -87, 111, -295, -24, -60, -65, -6, 87, 62, -308, 129, -296, 164, 6, -12, -76, 33, 109, -120, 5, -179, 83, 136, 211, -119, 184, 63, 117, 120, 42, -36, -170, -55, -171, 49, 59, 11, 55, 254, 60, 21, 106, 165, -159, -36, 57, -5, -10, -43, -55, 108, -99, -74, -170, -105, 205, -96, 50, 72, -101, 10, -107, -168, 263, -183, -182, -126, -217, -46, -68, 3, -45, -52, 22, 85, -267, -133, -172, -130, 20, -394, 301, -428, -653, -339, 162, -216, -247, -212, -148, 733, -433, 4, -83, 439, -85, -107, 62, -382, -24, 167, 206, 0, 254, -44, 246, 210, 60, -84, -50, 132, -302, -177, 237, 100, 18, 83, 110, -4, -292, -166, -203, 76, -5, -290, 89, 402, -320, 62, -272, -90, -750, -295, 1082, -54, -454, 15, 104, 48, 265, 143, 68, -162, 323, -82, 186, 195, -27, -142, 17, -60, -149, 45, -183, -85, -35, 17, 198, -171, -183, -68, -73, -87, 93, -8, -30, -116, 177, 63, -211, -251, 41, -144]
5343a44J07n3%K11J94m63J64K7j47R6J25M5k19P8j12L72l05k79K09r1K04oN2j42
5367g7J85j18r8J20J19l16Q2l37K71K18j75L8j23L40n2j03q0Q3K1J38j86L8R1
5390G9k01j17J84j45L53o1j7l22K82j03j69K90J27l97L03J4j45K45J07k02n2P1
5412A24N4l6r3oj89L03k45K60j45r2J51N6N1k1k85J90J65r9r9k2J07j3j49p5K58
5437A50k4m68N15j55j3K04m19M92Jq16Q57n74K08n54N22K86m15O19q82Q56M94
5458H84o01k24j68k50J42j61L35k13J90K16m68L17p9K38l02R4j10j2j1J95j41
5479a29l5K94k10jJ39k88K55Qj07M6K91m35K90J65m88J99p0L37k4J5k91M38k20
5502A79j23J58l04p3L61r4l0L8QmM6M5j72J43q6O8k71J83Q7K1j44K2J26j46j89
$$ y = [-144, -37, -90, -90, 121, 315, -148, 16, 43, -104, -8, 117, 162, -57, 21, -91, 281, -24, -303, -94, -185, 19, 13, 65, -77, 108, -10, -108, 12, 131, -185, -103, -440, -169, 49, -126, -88, -211, 129, 77, -26, -106, -23, -2, 136, -50, -12, 79, -122, -239, -55, -200, 153, 92, 75, -247, 35, -68, -237, 53, 180, -217, 86, 100, -45, 200, 307, 105, 53, 124, 178, 142, 49, 43, -146, 157, -88, 172, 27, -65, 86, 142, 193, 172, -113, 77, 242, 143, 44, 22, 129, 116, -33, -108, 150, 126, -342, 173, 18, 5, 209, -210, 282, 283, -533, 324, -250, -42, -596, -74, 212, -203, 416, -466, 390, 884, 283, 59, -109, -359, -217, -378, -43, -256, -66, 150, -318, -1, -80, 158, -144, -50, -160, -172, -183, 12, -129, -164, 130, -80, -81, 58, -230, 25, 33, -74, -28, 263, -172, 118, 283, -205, -6, -76, 261, 237, 252, -39, 399, 179, 56, 214, -90, -163, 198, 104, 74, 112, 120, 116, 162, 207, 35, 178, 92, 160, -111, 72, 159, 180, 36, 58, 184, 38, -151]
5527a51J53P3o3j40J63m4J06n6m9j74J68k27M8J42L1j15J80O9j55J60k57J96p4
5550a6K1j83K19j88P4pJJ05N3k49L37o7j11j7j11j63J20Q7j9L4Q2j9J81k26j03
5575a65K01K3J97m27K00n4Q7P0j00k08P2Q8j1J15k33J09L1j87K01n7N1K2J89k28
5599a4r5r8J65J16k34J8K83j99j29K31J81j74j63K92l13J55M3k26J00J27k45P0
5621a09l1K24r8k1r0J49n9j87J97j40R2R6j65j04K14j01M35m70L94Q1k12j10j27
5644a42K96o1j54J55Q4k33N7k6M1J72J4k50M6nRJ68j02o1N7N5N1j69K17j72p4
5669b7M9k8K53k61K7Q4l9Qj14O6m9J1J01k90K48Mj34J45l3o9k0p4J49p9q6K8J21
5696iOR2j08k2P2j28Q4p2J6j15O4J79n2j38Kj37K96n5j02J29J53j66J07r4J78
$$ y = [-151, 2, 75, 12, -128, 35, -9, 97, 41, -8, -182, -14, -241, -193, -51, -20, -135, 45, 114, -41, 119, -138, 58, -16, 5, -178, 41, -147, -73, -80, -79, 26, 79, -170, 167, 100, -11, -28, -139, -302, -182, -95, -114, -80, 2, -17, 164, -62, -165, 36, 59, 256, -171, 29, -25, 62, 132, 32, -176, -104, -16, -27, 88, -145, -36, -5, -192, 9, -48, 3, 25, 214, -14, -109, -207, -42, 74, -160, -142, 141, -58, -187, 44, 225, 51, -112, 180, -133, 22, 65, -161, -61, 66, -179, -109, -140, 84, -14, -35, -125, 24, -35, -222, -25, -165, -73, 23, -142, -246, -32, -133, 302, -168, 226, 307, 95, -15, -142, 154, 93, -61, 94, 178, -55, 2, -24, 17, 189, 203, -47, -1, -6, 3, 171, 69, 8, 65, 120, 171, 2, 219, 47, -27, 22, -6, 247, -14, 13, 97, 58, 66, -48, 18, -31, -20, 81, -209, 39, 43, -91, 54, 21, -48, -68, -142, 7, -72, -158, -130, -9, -3, 89, -19, -41, 31, -97, -13, -85, -69, -184, -120, 59, 7, -131, -129, -266, 30, -25, -127, 2, 155, -11, 96, 2, 180]
5721A80k19r3L26k69J09j33l8m3L75o1M5q9j86J76j35J08k8Rq3M8p4K12p1P8j94
5746e0M4J28O5k43l5J75j14j24Jp0J63O3J09j21J6l8J3J3k61J79K37l41r6J83
5770a04O3K6l2M5l9j07l2n1L45j8m05M48O9k48k3K69j09K5j16J20k00M0M3L13
5794C22k92j23J92J49j36k27J15j03n6J40j71R1K47o7k0j20J63N8m6K9K3j06j7
5817D5l2l1K7J20j61j4q4L32k86Q9J89K0k31K4L7mN7j62o7J81k41L9K85l76J33
5842a11Rk48L13k35J73K8j8R7k18K12O6j62k5M00k83K1k6j07M7k50L79r4K48k79
5866f3j87K48J59j25J25j8j89Q8J29j71J30l62J16J59Q5j1l39K44ko2K53k58k3
5889g4K10j79J24kJ54k46N0N0J13k76P0n2j8K27k68K17m14N56k02k41L63j64k00
$$ y = [180, -39, -132, 194, -75, 34, -99, -137, -180, 195, 134, 179, 90, -96, 80, -55, 53, 25, 34, -49, -1, -75, 137, 66, 144, -50, -6, 122, 187, -56, -91, 84, -30, -154, -153, -223, -60, 3, 112, -9, 7, -31, -18, -5, -266, -87, 150, -191, -287, -104, -41, -15, -47, -2, -41, -148, -180, -231, 114, 96, -309, 139, 208, -40, -63, 206, 97, 122, 6, 126, -74, -34, 9, 322, 30, -93, 99, 248, 112, -115, 0, -103, -159, -19, -190, -99, 148, 81, 61, -59, 104, 162, 116, 145, 168, 62, 45, 13, -18, 9, 129, -32, -46, -130, 202, -84, 5, 194, 214, -17, 7, 44, 40, 97, -65, -132, 49, -192, -153, 132, -244, -111, -102, -350, -37, -272, -99, -71, -89, 8, -210, 2, 68, -94, -119, 281, -2, 19, -7, -114, -67, -317, 62, -32, 216, -63, -250, -2, 157, 32, 157, 139, -50, 38, 167, -4, 126, -236, -120, 39, 124, 113, -226, 18, 16, -46, 207, -51, -74, 136, -43, 81, 79, 233, -13, 37, 87, 200, -76, -6, -58, -76, 151, -117, 100, -314, 242, 40, -201, 162, -2, -202]
5912b02J03J43J12l26J06Nm5Nl26M67m0k28k2K30J27m2r7j04K39j60P0j25j50
5935b60K32K2J66k27K9M6J00j29j30L46l07l2K26q1j81J95L8M0k37J85k75L94
5957A60N9j49P5r8j76M16m19L67k42O4J17k29K09j10J14o1j9J4L8n5N1J19k45
5980@Q6j25J7p2J58m2j57O2O0J21k8j31o7J38m1p1J48l2k99l5K12qK27k61j91
6005c31K66Q5j54K6qN8P4J73l06j44K29j98K26J1P9J8j56O2L33l81p3J19M1k06
6029a57J94r5J57o8n3K1o1N1l2J54r8q9J80k7j24L22l69J08O8o8M7m4M0l2l9L28
6055C14n02L79k62l9J47K2k33L08n99L30P9m44O85p50J163o62L70p67M83k91l
6076b72J81m35M49M2j64L47L1k21J00k86L5Q9q2L17k26k1K18k02J72k6k11K05
$$ y = [-202, -99, 44, 156, -170, -64, -59, -104, -99, -425, 42, 2, -226, -248, -18, 109, 67, -30, -134, 105, -55, 15, -110, -260, -28, -6, 160, -67, -38, 8, 108, -21, -151, 195, -112, -144, 82, 1, -180, 15, 53, 93, -144, 41, -234, 160, 219, 70, 145, 47, -129, 287, -132, 235, -7, 57, 174, -55, 154, 44, 158, 97, 78, 92, 130, 75, 126, 245, 0, 86, -39, -22, -94, 64, 22, -135, -73, -13, 108, 80, -51, -118, 20, -21, -92, 56, 24, -275, -310, -98, -106, 121, -140, -331, -65, 20, -134, -108, -116, -58, 16, 189, -117, -261, -32, -230, -4, 7, 86, 104, -52, 10, 343, -38, -111, 8, 49, -157, 37, -58, 99, 31, -22, -1, -62, -11, -43, 111, 13, -76, 104, 77, -47, 275, -94, 14, 82, 14, 61, 17, 57, 25, -14, 314, -188, 191, -71, -110, 37, 59, -174, 134, -465, -135, -56, -500, 185, -565, 598, -64, 306, -461, 22, -269, -272, -91, -526, -77, -35, -199, 148, 179, -42, 58, -228, -193, -104, -186, 131, -95, -116, 102, -100, 72, 46, -165, 40]
6098D0j37K39j31J13l16K61k7o5J71l1j16M6J24j30J9o8J5M1k7N6Q2o3O9k8k6
6123A11J1j3q5j82J22K14l26L03j79j50K6j3J63Lo3J60qk76L37j68J05k94K57
6146E5l9Q6R2j01l56L89j24Q4j76Jn4R6L97j55k71k60K12K05L0j79q3L05k83K01
6170G2J27l84J29l3J02L1P1K1j76N1J13r7o3M0k03L34k13J44k02K29j91J81o1
6193B2j49M70l29L3j93P1J77r8j68J39m1K61j15mk74Q8J22J17k62O1J00m5l8K58
6217B03m73L99p1M9k52L15j92P0Q9j46K1m27L51J79j18k21K21l35L65m08J86J57
6239c8j20l8M32l44M2P4L4%N01l02q3p44M42J9L73k05j9K53p19Q05l12J00q2k57
6263a88L61l60L45J01k77l5k9J08J07j46k43M34P0l67K74K07p7j78J9L71n37k03
$$ y = [40, -97, 142, 11, 124, -192, 69, 42, -23, 148, 117, 1, 47, 171, 41, 60, -8, 7, 48, 21, 77, 159, 96, 165, 137, 111, 122, 109, 24, -158, -36, 178, -148, 155, -24, -174, -148, -161, 2, 5, -58, 102, 94, -182, 155, -13, 92, -202, 55, 16, 102, 194, 93, -263, 126, 2, 86, -90, -89, -143, -47, 350, 195, -76, -336, -124, 81, 111, -68, -151, 154, -129, 72, 199, -185, -56, -89, 13, 44, 115, 136, -40, 11, 124, 27, -36, 4, -199, 135, -78, 66, -136, 93, -98, 83, 22, -127, 343, 14, 47, -146, -75, 102, 4, -164, -25, -66, 195, 80, 76, -198, -110, 12, 129, -133, -72, 28, -17, -55, 203, -270, 129, 58, 107, -145, 170, -22, 48, 137, -9, 12, -415, -64, 115, -3, -224, -3, -338, 27, -381, -195, -38, -158, -196, 236, -108, -66, 8, 42, 42, 543, 241, 158, -586, -144, -125, 248, 43, 24, 277, -442, 363, 51, 151, 69, -188, 173, -187, 158, 259, -18, -53, -82, 26, 133, -13, -256, 178, 248, -119, 155, 362, 285, 107, 126, 497, -40, -243]
6285b43K80j85j7O12j20K8J82n04k78P0R1P86n68j3m71K5O67L13r12N13k66O8
6307E8K00o90J10M42j97K29O65j011j96J83M49l49l31M58l9J33J3l17p6J91k02
6328b77J44J095n52l85R2q3j40P61n34J227j021q39j09R60r6oJ99n5j008P11J62
6349B46m26J93O0q03l25P89J196j563M63J37L55n79l75J102k11N39j478J102m40
6368a8p66Q10m48k79r9R68K5K18o49N63o27M31n51q2L44O30k42p98R17l14l12
6389b79o9KL02K73M8l23L96j56k51n7M32j21k33K61j28q0Km81P39n04p8N36m86
6412b55j44K34K26n06L36l72K97j58O39k57q85P11o38O33L53O66r42p33P61m43
6432d77N12o40N18R51r31M9k37k37K82K0M79o10M21k5K10K3m54J66l28j28L46
$$ y = [-243, 37, -148, -165, 447, 327, 355, 537, 33, -245, -175, -84, 702, 134, 121, -350, -325, 342, 655, -257, 256, -10, 58, 258, -432, -322, 120, -77, 152, 817, -194, -390, -207, 242, -107, -438, 20, -19, 114, 127, -190, -266, -75, -277, -133, 962, 410, 25, 117, 34, -106, 655, 121, 1348, 327, -512, -621, 339, 243, 237, 436, 381, -627, 84, 246, -180, 13, 73, -730, -1055, -266, 930, -633, -170, -33, 322, -257, -632, 470, 259, 798, -680, 422, -18, -784, 26, -422, -701, -800, 168, 193, 411, -238, 325, -302, 129, -422, -504, -160, 470, 228, -570, 347, 33, -279, -348, -346, -44, 229, 277, -46, 350, 194, -57, -114, 318, 197, -36, 225, 97, 17, 19, -462, 277, -227, -305, 231, -255, -399, -165, 61, -445, -109, -481, -184, -342, 297, 40, -845, -134, -772, -139, 214, 880, -62, -795, -34, -477, 35, -605, -87, 864, -67, -18, -255, -492, -210, -190, 289, -321, 100, 75, 285, 308, -146, 20, -308, -436, -90]
6453i0K40j73J12k84Q1O1K66k79R2j24m2J90j00K32j67K84l98O8L55q5l25j34
6475b20K77r0O5j57J80lL79m18J92j37K82k72j09l6J55n2r9J72k5j66K42k65M4
6498f1%J35j8j69J76j02O0j03J59o0Q0k47J09O4k52L28K52l87j74J48j0j9J46
6521E5o1K80j37k47K96j70Oj94RJ27k49K64j82M32k96Q5o6j94K03k8p0J52N1r5
6545b9J35l0jj08j64K98m72M10k27K65p5l93L44j17J53l10K57Nk00N38j84J92
6567B87j92j4q7J05j73K24j98K17l30J15n3J33k41J63O1j49R3J43k5j41K6J65
6589A29j15m8N9R0k2j17p2J37j35Q2j92K26j15J75q7j23J47P1r0r4J12O0r5jJ9
6614Aj19K26j91Q1R3j30J2J1P1j44K36o8j65j89K10Q2J07j05m2L2K5j97K12nJ25
$$ y = [-90, 150, -23, 89, -195, -114, -53, 213, -66, 26, -98, -140, 50, -50, 182, 15, 299, -99, -31, 324, 239, -86, -220, 57, -33, 32, -125, 55, 52, 431, 13, 205, 68, 350, 78, -31, -67, 88, 36, -63, 109, 84, -82, 160, -105, -61, -61, 74, 56, -113, 63, -39, 21, -82, 77, 17, 97, -150, -41, 23, -229, 99, 351, -36, -210, -62, -72, -91, 55, -6, 274, 137, -110, 186, 16, 22, -172, -163, -36, -285, -21, -203, 229, -67, 18, -48, -242, -39, -67, -137, 15, 66, -29, 106, 76, 75, -33, -197, 101, -371, 39, -188, 77, 2, -391, -47, -164, -11, -321, -64, -59, -259, 279, 95, 287, 95, 81, -6, 99, -74, 150, -48, 169, -161, -46, -99, 34, -207, -44, 17, -132, -39, 104, 79, -62, -36, 129, 14, -34, 25, 115, 93, -24, -96, 41, -94, -12, -204, 22, -93, 82, -5, -128, 19, 90, 0, -94, 18, 78, -17, -18, 1, -118, 108, -83, -2, 91, -39, -27, -16, 55, -89, 147, 79, -86, -275, -65, 17, 124, 19, -23, 9, 34, -163, 49, 44, 169]
6639A69l4j31j43n5M12k16K7R6j50p7K91k18N0R9n9o1R1k38Q6J79q4q8j0p1J95
6664F0J07o9K02n65K37J83j58J00l21%L97l64J48k6K1K64l07j54J91L0j81K76
6686G1P3j19j35m4J69k09J52K51j79q9k27K57P8q9k72L80q9Q5p8n9J27q3R6j49
6710h2J33j97L94l9o1j65J72k13J86j61K40j99m9J27j19J17j47K33j07M1l5oj58
6733i5L74j41l14L21l05PJ92J59k82J98k17p5o2L12p9j43J16J0j03J50j7J1L1
6756D8j56J65J20k25j35J53j74L88Q9l68P4j2J00j90P4J89j29MM6q8n7J01j7M3
6780D3J29k24J4N2n9J13K19l12l9k11J43P8O4M2M6j62J60j05L06r2l20R5o3L09
6804B26j17J45k66O2j90K62k25J43k16R5j69J69J18k00Oj25K70q2J7N7P5j89j98
$$ y = [169, 135, 4, -139, -194, 218, 2, 29, 125, -25, -102, 189, -29, 21, 120, 61, 0, 91, -147, -61, 118, 34, -54, -64, -135, 60, 167, 98, 300, -265, -28, 155, -3, 97, -224, -224, 173, -191, -43, -69, -48, 216, -91, -245, -54, -24, -205, 71, 144, 25, -110, -154, 15, -194, -42, 209, 30, -59, -286, -29, 49, -40, -312, 68, -21, 64, -14, -73, 54, -29, 67, -82, 51, -146, 248, 209, 148, -17, 155, -58, 128, -33, 207, 8, -41, 86, -33, 84, -63, 170, 63, 104, 69, 63, -95, 279, 138, -176, 145, -160, -153, 39, 198, -84, 114, -103, -178, -240, 72, -7, -150, -34, -24, -127, 23, 6, 17, 48, -108, 57, 177, -48, -183, -30, -204, 184, 273, -95, -21, -33, 67, -123, -49, 140, 11, 15, 61, -27, -84, 17, 0, 43, 172, -52, -38, 14, -45, 68, 287, -25, -64, -275, -132, -54, 10, 52, 98, -64, 96, -9, 297, 205, -115, -20, -83, 226, 109, 254, -12, 50, -140, 122, -103, 40, -176, -81, -250, -81, 37, -163, -157, -282, -12, -94, -77, -20, 55, -134, -332]
6827c32L55o8O6k7j16J7k8J32k97M19l84J49m7K80k49jL1p0J35n0J55R9k04k5
6851f0L27l78qj01J79L77m26J51K3M8l9o7Q2j37K44k66r4R8J57j53L5k98K31J2
6875f3O9j01K00j1k7L9m4K11j47J94l58J84j93k40J96J06j69j4K83k84K21j01
6897d9P7J61m63K75j35oR4J54m1l26L98j04j07K6k23J65k28K67J36o7k67J72l5
6920a26O7k51L54k66K06r4O5j48J94n6LK18l35l1K00P8L6m7k12M3KL71m6pq4l14
6946a80M19k11O0K8J0L1k09k5O8J88J38k59m26L97j39q9K35j7p8J40o9m5j42K41
6970F6O8m07M82l40J04K58j77k76K16N0j45J33P5p9O9j23O1L8j2J03m29L04k16
6993a77M5q0J85K05k32l5J6O8P0k84L5L88k67J35k0O4J32m85L78j5J7j14J42p2
$$ y = [-332, 23, -45, 21, -6, -122, -105, -133, -1, -298, 121, -263, -114, -161, 119, -130, -131, -100, -170, -35, -85, 70, 169, -35, -60, 267, -111, -119, -220, -41, 336, -90, 61, 84, 132, 93, 26, 108, -29, 215, -51, -145, -47, 110, -43, -8, -306, -75, -63, 6, -95, 105, 94, 67, 106, 62, 273, 126, 320, -38, 146, -47, -287, -91, 15, -154, -168, 115, -169, 52, -49, 28, 189, -274, 1, -134, -140, -46, 108, 67, -259, 139, 35, -72, -46, -269, -104, -332, -65, 71, 4, -263, -91, -126, -59, -310, 44, -222, -16, -110, -45, -193, 1, -55, -52, 166, -169, -200, 0, 78, 114, 67, -145, -102, -100, 271, 225, 218, 134, -180, 239, 28, 88, 116, 126, 157, -52, -77, -9, 179, 317, 58, -368, 29, -110, -199, 36, 19, -59, 81, 12, -33, -175, 66, 134, -273, 209, -131, -27, 231, 54, -222, -6, 44, -101, 32, 107, 28, 97, -26, 35, 73, 61, 164, -265, 39, -177, -132, -212, -27, 178, -54, -89, -73, -5, 65, -219, -184, 204, -63, 72, 52, 116, 248, -237, 141, 126, 143, 29, 171, 99]
7017I9j06J25Rj88l4L75j41j36j1J4J8j96R6p9K89l4j14l4M6M1r5M5N8j46M33
7042C34m95J32l2J28k01n0L4J77j27l09M35k66J02n2J58j89M27j18k38N8n0J96
7064E4M6J12k05M6k97J13M11m23OK49p3l0j08L42m41K60J04j60J69j14K84j02
7086B43q5l70k02L93L96l79j24r4Q60o54M3J68m33P6N82o36K08M54k31m56q0J44
7108a77K50k55J08J27j16M18k14j80N9mL27m70J38J53L7k75k55J47j11J42J41
7129a0j11o0J50Q2k86L73l5k28L41m11J70j51K20O8m20L08J90j73K07o1k06j56
7151a99J30K91l12N3J23J56k36J21j55j02R9j87QK06K41j90j8k79J24M08n0r9
7173A33j41J61j64mK42l46J67L07l36O3j76J76p0k08K35j5Op0M1P7J05k58M0K85
$$ y = [99, -7, 118, 127, -61, -95, 280, 139, 3, -8, 6, 24, -172, -76, -155, 134, 100, -14, -48, -2, 39, -56, -11, 47, -99, 334, -161, -29, -61, 67, -134, -184, -150, 27, -100, -409, 26, -240, -138, -190, -32, -221, 206, 88, -150, -92, -142, 54, 100, 212, 7, 53, -244, -131, 280, -143, -137, 112, 39, 9, -99, 243, -198, 62, 166, 6, 175, 61, 345, 243, 158, -212, -414, -21, 375, -4, -128, -222, 638, -16, 27, 195, -238, -162, 420, -216, -8, 446, 215, -241, -321, -177, 73, -182, -74, 53, -63, 355, 141, -39, 20, 16, 343, -127, 11, 164, 201, -74, -329, -182, -293, -151, -10, -121, -181, -31, 51, -235, 138, 103, -125, 216, -195, -25, -176, 44, 112, -308, 0, 190, 17, 224, 163, -43, -199, -69, 222, -90, -37, 86, 242, 6, 127, -28, -130, -31, -218, -210, -4, 237, 47, 29, -250, -126, 282, 232, 133, -8, 153, -11, -15, 227, -119, 48, 355, 19, 82, -94, 82, 12, -196, 39, 24, 30, -40, 1, 78, 183, -75, -35, 250]
7197B50k37J73k55J57k47K27J6j66K19j87j14J54L8l8OQ7j50k1MK20j0k62J03
7220c3j3j9J85l10M30j39l16K08k8K30n2k79K21j25j28K28L5k39J48qJ6m5M1J08
7244A16J66J54j96l55R7K97n58M03j20j68M9O1J34m5QM5Jk43K06p6K46j48r7N4
7268C1r2L9mM3J88k68l0J81l7M3Oj93J5K03K12k70j85M0n6K35P7j03m5Q4j59k2
7294f7K0N2K60j34j32j89J17m20O35lj0j42l7P0L5J1q2N9M8o5k09P4L20j49j82
7319a20K49j70o4J44k74L26p2j33J20O6%j13J07m8p0qj11K93k3k91L08k32k1o
7343a43J48j09J11j81K29K8l73L49j02M2n8j44K44k21J84r3K25O2k33j33N1L13
7365A96k35j51j07M32j12p6O0m9J5j07j6P4J05J1O2j13j3J08q6n4J42q4K8J10
$$ y = [250, 13, 186, -69, 88, -159, 68, 84, -82, 137, -50, -164, -10, 28, -10, -4, 83, -67, -88, -84, 136, 126, -136, -33, -46, -65, 120, -190, 240, 101, -215, -7, -35, 195, 143, -136, 85, -40, -168, 60, 95, -144, 4, -4, 12, -33, 8, 116, 282, 436, 240, -115, -18, 279, -279, 124, 4, -164, -115, -54, 80, 35, 43, 88, 89, -154, 52, -24, 222, 74, -23, 31, -61, -22, -26, 17, 205, -63, -93, 88, 51, 94, 100, -93, -78, 125, 337, 67, -118, -78, -134, 101, 178, 75, 30, 114, -45, -67, -47, 5, 265, 131, -1, -190, -73, -493, 142, 139, 129, -13, -50, 20, 55, 66, -16, 43, 91, 26, -183, -109, 211, 62, -120, 129, -41, -105, 39, -235, 91, 19, -114, 6, 72, 72, -41, 66, 18, -52, -60, -171, 122, 99, -192, 116, -116, -137, -143, 5, -104, 7, -174, 55, 83, -290, 59, -43, -1, -59, -203, 41, -180, 4, -89, 136, 198, -35, -168, -117, 196, -39, -190, -297, 135, 23, -53, 7, -42, -27, -134, -150, -76, 29, 40, 102, -11, -24, 84, -2, -56, 86, 2, 30, 140]
7389A40j39pk3j0O1j38K84k49p1K57m04K32PJ63ML5j83J74j97R9mn8J4q4m1K04
7415F6J24k35N5J52j88M9j59J91l7k02J86J42n63L61k5P4N9j55J41l24L90J37
7437B39j42k54L22j48j25jr3K87j2j03q8L3J30l8k41L59k62m5J14J17j59k88K87
7460a11K1J74m8j81J44P7n9P6j41J15J44k93L30l61QM2K99j53j9r5K89k75K90
7483B73j27LPk95J38R9k09N2k9RK18l7j84J75J38r4Mj44j16R7J99j10rk72K12
7508bL6K09j32N6j04j05R1j37n8M04j53l09L20l46J08K4N8K42o4L0o1Nm03J98
7532i3J29r5o2m0mK11J26j64J7n9K28l52K26m7l0L1j01J28k38L00k08J35j87M44
7556B95k93j8J17p0J1m8j37J43J49j1J18j91k43K89n5k32J41m7m1J95k58K60l2
$$ y = [140, 1, -6, -29, -39, 22, -116, 168, -81, -152, 105, -299, -67, -60, 103, 107, 142, -41, 133, -64, 35, 31, -27, -13, -97, -138, 66, 190, -45, 10, 162, -26, 23, -136, 55, 18, -184, 2, 144, -419, -58, -83, -9, 50, -105, 36, -288, 102, 239, 97, -157, 165, 17, -108, -109, -202, 85, 73, -30, -118, -85, 45, 7, -234, 125, -137, -182, -68, 49, -110, -398, -111, -90, 84, 36, -145, -1, 76, 17, 93, -48, 67, 211, -82, 248, -113, -105, -63, 236, 83, 64, -31, 258, -17, 273, 146, 149, 156, -139, -1, 98, -111, -59, -88, -79, 139, 102, -82, 93, 231, 137, 141, -3, -119, -22, 177, 67, 58, -214, -2, 34, 243, 111, 167, 63, -42, 49, -88, -146, 258, 105, -204, 116, -230, -122, -98, -40, 202, 138, 168, 107, 112, -291, -93, 36, -59, -121, -161, -165, 46, 172, 8, 25, -34, 194, -158, 68, 21, -9, 22, -79, 49, -189, 111, -97, 38, -149, 295, 2, -16, 101, 31, 42, -6, -143, 0, 149, 138, 256, 65, -178, 111, 56, -176, -35, -82, -123, 72, -186, 74, 42]
7579D2J64j79m9j30NO4J21j24K46J80l65j96J86J77k2k64J96j57J21O4j46J16
7601E0r3j75o0J98L1J07L4k43J95J52j80J16r3j11J54n8L4o6r6K24j24J88k20
7624c6oO8P8j06Q1n0J00J2k29J5R8O7k4R2p9j94J47p4K51k31j53K12J40j49o9
7649c9L29k03j34n3J57Nk4j29K19k15J94P5k86j13M3j0J76K80k06k53K52k32J57
7672a0j29J76R6j58k6j32L22J43l16r0K24Q2j69k05J56o8J75R0j75k15J42L22
7694B35r8k33O5j36K86Mj57L8l8K32k44J93k72K88j94K03q6k1j24j8J08q9K89
7717B31m86J24J10j57L5K15o9l0M0j40L44j41j65K6K16j4j07j32J13O8J74l35
7739h0O7r4J69J9j38J49j2j4K5l8n7P5k9j75k8J59o6O0J48j38M9k46K67J95m26
$$ y = [42, 206, 27, -22, -152, -147, -83, 38, -86, 160, 340, -25, -221, -35, 142, 120, -144, 52, -105, 16, 80, -66, 50, -43, -218, -278, -80, -49, 58, 92, -151, 44, 196, 16, 132, 39, -72, 82, 24, 58, -8, -104, 120, -4, 184, -36, -42, 26, 104, -2, 79, 29, 129, 141, -88, -73, 25, 92, 68, 160, 81, -113, 34, -40, 211, -20, -173, 39, 179, 30, -39, 290, 87, -47, -100, 57, 62, 38, -91, 128, -87, 107, 182, -104, -217, -174, -184, -8, 272, 66, -187, 65, -167, -10, -139, 37, 133, -25, -51, -183, 139, 282, -34, -124, 100, 182, 13, -192, -36, -104, 71, 161, -14, -229, -87, 235, 137, -96, -31, -167, 119, 123, -34, 4, -34, 198, -46, 147, -125, 163, -31, 172, 86, 65, -59, -77, 31, -58, 231, -255, -131, -21, -178, -143, 72, 3, -27, 13, -127, 217, 76, -89, -63, 153, 139, 32, -100, 13, 81, 255, -80, -13, -107, 62, 81, -57, 92, 80, 66, 91, 53, -4, 71, 42, -133, -161, -2, -68, -8, 140, 2, 51, -195, 72, 267, -159]
7764a59K44J8j16J26M5l97K09J6N1O1pQ9m1k79O9J39n3k1K4j76J84J56k05j19
7788a42P1J62j70p0J8P4k4K81l20K55l5j44k8Q1Q3o2J9k59K73K2m4m1J22j35j33
7813a46J13j11K17K3k55J72l0Q9J70m91M3J03K70j23j56j76L12K2p6M3r7J35o2
7836a1J35K3p3J05p8j62J17l03K80j24m4P4O9N6q4J49J07j35l33J84O7j39OJ31
7860A7k28R3P0o1K19j21J6j2Q7k56J00K08m7j23o9j36L32k41j08K82R4m48J59
7883a73L6M7N1j7k0j79J05J64j6k18K04J24J5o3j9q2q9J08K23l69J57Kj68M11
7907B34k66J41j42K84n50O18m35j23K12oQ9p0q3k7K93q4k4K6L0q1m5J83l08k8
7931a62K13J96j74j65k2Q0k3J95q5J8j72K26j37K6l4L8j26J76j08o4o0N2Q4n1
$$ y = [-159, 85, 103, -13, 113, 158, -239, -30, -14, 37, 98, 91, 180, 139, -140, -71, 68, 15, -6, 18, -158, 26, 182, -23, -142, -71, 91, -79, -149, -131, -57, -81, 200, -120, 135, 100, -44, -72, 9, 92, 30, 49, -210, 63, 85, 41, 0, 122, -13, -146, -33, -144, 73, 96, -159, 13, -17, 72, 242, -249, -206, -103, 167, 44, -112, -288, 24, 46, -30, 13, -84, 51, -11, 124, 147, 74, 179, 101, -61, 56, -247, 33, -91, -135, -61, 8, 64, -20, 129, 236, 101, -232, -48, 19, -120, -114, 17, -211, -118, -48, -109, 110, -11, 5, -7, 80, -176, -76, 132, 85, -38, -107, -243, 89, -152, -260, 22, 116, -332, -173, -137, -90, -39, -56, -76, -255, -150, 14, -2, -220, -16, 108, 123, 60, 41, -41, -130, -22, 201, -168, -11, -9, -177, 234, -32, 109, -33, 251, -299, 319, -116, -239, -27, -33, 56, -14, -97, -124, 169, 85, 61, 87, 117, 36, -9, 174, -134, -162, 51, 247, 73, -92, -114, -34, -57, 138, 53, 71, -101, 125, -12, 14, -20, 18, -108, 68, -40, -104, -164, -112, -28, -79]
7955g9J76k59O5J30k4j89L0J46L6k13K15n1n8K4L55l28K5j05O7J77k99J49R6k24
7979a38L6K5K07j87m8K31o6k20J73k0r0j4J26j49J99j22Q7m2J85J09k91N2j02
8002e9K03j16J16l11J4J39L65l38Nm4k2j6J57m8m5J18l53K09j24J85n0R0j08K06
8026A73M9k05m3L2p7K22k06M8j31L45j14l23K14K42m43L21r5Q5j53OK18K8K3m03
8050a87J92j96K40L1l26K42K63n05J24N3R7k1rQ5j58m4K59l18N27m83J33L2k2
8073IM8l5p7K38k45J09j38J20n6k72K71j42n7j2O6N2J08q2J35j24N39m89k32K42
8097b4R0K9K36k85J28q8P7n7j27L9R3j50m1J51p7J53K12m43m5j2K44J62n28K02
8121f1mK67k67J48j74J64j48j8K21l32K84L7k74L67l65J91J03q3N3o3k4j24K35
$$ y = [-79, 97, -162, -97, 33, 9, -180, -150, -4, 32, -181, 34, -17, -75, -51, 304, -24, 1, -104, -37, 140, -159, -10, 86, -138, -102, -77, 130, -57, -105, 126, 60, -160, 13, -7, -97, -111, 15, -134, 65, -57, 30, -12, 173, 282, -9, 43, -59, 144, 28, 144, -167, -153, -14, 351, 13, 18, -26, -48, -64, 93, 45, 0, 118, -235, -26, -150, 35, -15, 75, -33, 173, 222, 17, -26, 6, -71, 151, -55, -7, -138, 207, 93, -230, -16, 226, -217, 104, 9, 94, -59, -53, 165, 193, 216, -187, 5, -191, 49, 80, -246, -4, 259, -246, -122, -69, 28, 7, -2, 83, -75, -119, 140, -178, 349, -134, -1, 31, 9, 57, 22, -55, 183, -62, 47, -91, 29, -27, -299, -28, -170, -227, -239, -173, -121, -13, -95, 40, -84, 455, -34, -266, -24, 66, 95, 331, 46, 174, 86, 163, 106, -21, 18, 111, -39, -80, 71, -6, 147, 359, -84, -129, -141, 103, 265, -263, -61, -65, 202, -65, 83, -91, 73, -75, -93, 128, -204, 80, 117, -157, 210, -155, 36, 139, 56, 109, 46, 22, -102, 133]
8144A33k85P5J53m0O5j77jj4m9K21j47K62j26j82L47j30j23k71K98J78k73L68
8166B82j51q6J46l62J66J43n33L67L6k32K72O6l23L02l1K6l0Kj8J4j08L60n7j59
8190I2q2
$$ y = [133, -152, -77, 76, 36, 101, -76, -77, -91, -140, 81, -66, 196, 70, -112, 235, 105, -18, -289, 9, 187, -86, 282, 131, 45, 191, -171, -5, 138, -395, -28, 8, -224, 48, 114, -209, 93, 62, 88, 58, 60, 42, 56, -52, 308, 251, 92, 10]
8191A0
$$ Imaginary data points
##PAGE= N=2
##DATA TABLE= (X++(I..I)), XYDATA
0@%%%%%%%%%%%%%Pj5J6j6J6k4L2l2M0m8N6p2Q4r2J06j27J49j68J92k23K52k84
35a51L21l61M06m54N08n69O33p04P82q65R55j054J162j281J413j559J716j888
53i90K083k298K536k805L112l467L876m354M926n625O503p638R173j1383J4881
68H530k1561N8717j39567Q6956Q2130j79519J50126j8832r4685J10410k9498m4064
80c0857P6731n4723k3702M6959j4l5137K1565J7170m4889J3348K1542m7051M6466
93G408P321m4786N2880j3975l0617M5461m6020j0833L9940k9665K2619J4058l8841
106b5050K5160R375r965L760j8630J2092P925o235J4394k1758j931J0617j5548
119a5794L1312j1286k5929N6128k1661k8763M6153l5592j1397L5965l6931J4715
$$ y = [0, 0, 0, 0, 0, 0, 0, 0, 0, 0, 0, 0, 0, 0, 7, -8, 8, -8, 8, -16, 16, -16, 24, -24, 32, -40, 44, -48, 58, -69, 80, -88, 104, -119, 133, -151, 170, -191, 215, -239, 269, -300, 333, -371, 411, -454, 501, -553, 609, -672, 741, -818, 898, -990, 1093, -1205, 1331, -1474, 1638, -1829, 2047, -2307, 2619, -3006, 3497, -4141, 5032, -6351, 8530, -13031, 45686, -93881, -6925, 75205, -104314, 45812, 26980, -67705, 42705, 13207, -30857, 45874, -8849, -32551, 14408, 14394, -20743, 822, 17992, -26897, -13549, 7993, -39058, 7408, 14729, -30057, 22823, 8848, -21769, 23692, -22328, -33161, 6779, -22886, -267, 13791, -25050, 110, 9485, -480, 3280, -15350, -3258, 4667, -1568, 12826, -8932, -10863, -246, -15794, 15518, 4232, -21697, 34431, 12770, -15993, 30160, -5432, -16829, 19136, -17795, -3080]
131c080L0955l6970J6417J7568l7787J3703K6579l1037o249K9594j7997o326K7511
144B2881l6354m623M1294l3293R494L2223m9450K0396K6787n0257K0144P739l5765
157b8784L4480L728k4793K2866k918j3546J0483j503p817M061P845j0931j284
170h113J2613j8269M552J4238k6379J8462J8332k6295J7117j91k3905K2033p362
183c167j4648J8333p009J784J3876p939l773J169M325k238l431J0774j1616P74
197b786J6663k4473P188J4693k6714K3425P908k5660K9298p688k1858K5020j8922
210c906n733K3120j8098L907J1783r587N573j350k857k298j30R888j2139L124
224A297P322k0015J6351j709k0090K7998j0937q949K9485k4556k455J8641k6360
$$ y = [-3080, 27875, -9095, 7322, 24890, -12897, 806, 27385, -3652, -9901, 19693, 1696, -4630, 22881, -13473, -18096, 23198, -10095, -601, 31622, -17828, 2568, 29355, -20902, -758, 6981, -28784, 5696, 9424, -15369, 7497, 4579, -8967, 1516, 13, -7804, -3743, 4102, -6829, -8113, 4500, -13769, -9217, 5021, -21358, -2896, 15436, -10859, 6258, 6067, -17838, 4195, -3167, -17815, 518, -6491, -4707, 9169, 1230, -2543, -1374, 2951, 713, -2718, 8056, -3560, -2786, 13877, -10596, -3408, 11285, -15429, 7996, 15904, -9756, 19542, 11854, -10004, 15016, -3906, -9639, 13481, -4617, -710, 11073, 1486, 7059, 5709, 2852, 554, 424, 10312, -1827, 1297, 8619, -11396, 4955, 3246, -16844, 11154, 217, -8732, 20753, -3803, -6258, 12383, -13977]
237a3977Q453O871j5871J5846j366n398R334o937J129j166j874N091q934R535
251G36J748j5684J4955o006j0486K1009j1697j088J8337j6788N881O554j9496
264a2025R716J891r148J1288j334k0M157l063L775o836K290N040j0046J1154k209
279D630j0206J5781j2258m133J8281j7718P563J4238j9541J2021J613j7187J3038
292F122o006o970J2804n516O58N474l186o99k854M281m752l248J1990j2065M85
307c482J2556k0518R416Q788k1385J8183L210j7358J9672o406j3054J3468q861
320e771l508Q118l792J867J333K730k433l495Q536r499j13J3716j6663N269J1842
335H137k0531J0888N321j6384J6863j379q384J4708q183k968P278r313J443K057
$$ y = [-13977, -5524, 1347, -14524, 1322, -44, -5442, 3892, -3045, -1916, -3082, -4956, 135, -8799, 736, 2484, -13200, 1755, -4251, -14737, 6272, -5425, -6513, 11824, -4964, 917, 7471, -12025, -2309, -418, -9566, 1722, 388, 368, 4525, 1462, 5237, -1599, 691, 5731, -4315, 6839, 4630, -5576, 10205, -2053, -6186, 12095, -5623, 1940, 16178, -3363, 8658, 10271, -6916, 6122, 116, -6854, 5950, 434, 1092, 6566, 3380, 2681, -173, 4108, -644, -3892, 8098, -3967, -3482, 9074, -11444, -2028, 6760, -14625, 3558, 6768, -10590, 9082, 2676, -10378, 3090, -5771, -9279, -1161, -4953, -3086, -1753, 977, -1456, -4951, 3585, -5914, -6027, 7689, -8974, -3705, 8137, -12394, -1506, 3815, -12569, 4294, 2915, -5469, 9239, 1056, -1912, 5366, -3947, -2504, -447]
349d47q30L063j875O027l367k859R245j0772K175Q469j3480J1335m07j4287J7359
364I349r144q018J9898j4022N23J5317j4909M222L754j2503O953p85m603M816
378H48O72J95l053N024j195r864J2552m029j0504J7268j0295n992J6332j7398
392i439K553J3783j7289R588P606j5017J0403L50j0437N646j213j741K203J782
406a222J081l943O141q39q423J0897n226n469J4936j2059p25J3485j6610N709
420b267R341j5912J1360M949j0843R175k870n141O443m580j789K746J588L0p93
435A437N457o080k218J0571j0950J101R946j4506Q741N035j6653J2867q86j1758
449g896J5567n241n799J1963p889k405N059o513N09K966j216j957K314M917o641
$$ y = [-447, -1277, 1786, -89, 5938, 2571, -288, 8957, -1815, 360, 8829, -4651, 6684, 6277, -8010, 9349, 205, -7813, 12085, -1937, -1414, 13903, -1006, 3216, 6970, -5533, 1420, 635, -3968, 848, 1520, 1715, -1338, 3686, 2491, -7373, 5179, 1150, -9354, 7914, -2381, -8373, 7959, -9439, -6886, 6897, -10392, -804, 6802, -8215, 2188, 2538, -7899, -2253, -3466, -5207, -3004, -1222, -141, -4084, 2057, 1218, -7205, 3692, -1534, -7003, 7933, -4126, -4851, 8634, -7976, -2267, 7074, -8838, 2522, 7471, -3372, 5803, 2933, -2208, 4235, -345, -2134, 612, 2200, 2230, 1437, 6894, 814, -1404, 9167, -1783, -682, 9264, -5242, 3499, 8534, -8119, 4748, 3862, -7896, 7671, 2430, -3369, 8594, 705, -1700, 3359, -3154, -2645, 321, -895, -2852, -538, 4379, -2262]
464b262J014M169r682O816L154j0446Q904k087q052J3104p588n776J2170o902
478c464K42P897p521P87K138l880J365R8k00K33K266J014l800N335r86p499R879
495C904l511n928J3539q709m435J1643r948K666P523j1695O949M647q344P215
509E516j479p424M708J135j590r58K186N62l233N962k433n269P145n923O64P436
525G005j0748M857M646j2209P750K354p709O698j941k165M582l199O09j481l145
540d096K471K07K099k167k200O018n076M38O488j0629K302P459p825M584O87p816
556g056Q030k697l444Q419n091j809O917l921j178K296j669j134j47L458m18j060
572e04K558l639K003K650n276N046j514n526R577k663n439O542n297Q68N189m636
$$ y = [-2262, -1248, 2921, -6761, 55, 3209, -7237, 1667, -420, -8472, 4632, -2956, -8732, 3438, -3464, -3222, 4675, -2846, -2059, 79, -3801, -2436, -2338, -2538, -2305, -39, 975, -2825, 2510, 1524, -5975, 3904, 393, -5535, 8004, -705, -5140, 6503, -3445, -779, 6744, -4951, 1998, 6645, -1699, 5516, 4037, -3387, 1321, 2456, 866, -92, 2094, 2656, -577, 5385, 2952, -2317, 4828, -1095, -431, 7005, -3743, 1114, 5760, -6449, 1301, 3655, -4054, 2644, 703, -1462, 3120, -79, 530, -951, -4096, -1625, -1418, 681, -1486, -3686, 2332, -2744, -2306, 4182, -6447, -4145, 3314, -4511, 73, 760, -7056, 974, -1723, -5167, 3252, -1839, -3648, 3269, -652, -1830, 466, -1203, -2337, -2484, 974, 556, -504, 2054, -1585, 418, 3068, -2208, 2838, 1324, -4202, 5375, 2712, -2727, 3815, -1482, -614, 4575, -61]
588f1L806j797l172O744m368j464L028m510L197Q9j115M061n376J068L929o462
604b403M006N21m241M244l002M60L631o618K542J315l369M722j167j634Q42k376
620b527L306j741k569L655l795K536L527o052M290j555m307Q015m431k616P604
635C340o805Q54N632p008K782J728l920L979j31r54K046k387L89j06L15J774l668
652b140L314Q60m026N908k358m194N975l457P6M585n746K557J297l715M071k377
668F30q14K447k384L087j174j975L652m877J656K825n842N063m08m907O696l816
684a41j557N134o197J932L129m627K873j53k929K798o66r33L42j96P73q18J314
701G8n76k421L561k609p00M307m730J313L865o071L913J761o030N054m89l638
$$ y = [-61, 3745, 1948, -1224, 5520, 1152, -312, 2716, -1794, 1403, 1492, 377, 4438, -938, 130, 4059, -2403, 1603, 2124, -2117, 2127, -875, -415, 3216, -3402, -860, 455, -2914, 1808, 641, -993, -151, -2527, 779, -962, -3531, 124, -3671, -1135, 2392, -3660, 630, -925, -5232, 2783, -1648, -4264, 3340, -3465, -2611, 3021, -3987, -1205, 523, -3397, 582, 451, -503, 1543, -844, -455, -561, -246, 1528, -2140, 1174, 2034, -1992, 3916, 1558, -2636, 3339, -118, -42, 4543, -1203, 1354, 2651, -1064, 3007, 630, -184, 2263, -121, 2966, 1792, -183, 3469, -1408, 248, 3073, -2769, 2294, 1886, -3021, 3675, -141, -1698, 3436, -2761, -829, 2300, -2327, 546, 393, -2536, 262, -404, -1337, -995, -1191, -418, -1236, 78, -498, -2919, 642, -1967, -2667, 1640, -3090, -1777, 2088, -3983, -70, 1691, -4339, 715, 226, -3412]
717c412N458k792j461L636k715M55J705j881J459j91N95L3j354K476k427l2L103
734B655l553J947J615m428M263m73l199M409k781r59L840k973M42J235j949J293
750A384j028P23j17j319K655k468j49L219n209K899K212o193N459m93n403O759
766B931l028l312O382m822m22M437m471J237K076k945Q83O97p88q02J190N08k524
783b773K828K4l722M822k116k819O165m268r56N970o049J578L904n903L488J667
799A840m431M170r31k247L348k159K16J175o47L89j125K004o09j774L232k002
815D49j235M200l867O40L215n126L375O80m366M371o24k877L334j449n75J256
831A401q46M1p51P43j20j266K133k292J09L326m773K158K751n954L526J394n452
$$ y = [-3412, 2046, -746, -2207, 1429, -1286, -831, 874, -1007, 452, 261, 856, 889, -465, 2011, -416, -448, 2655, -898, 1049, 2664, -1764, 2499, 2026, -1173, 3236, 455, -504, 3336, 363, 805, 2040, 91, 1384, 356, 1079, 962, -357, 2298, -170, -319, 2900, -2309, 590, 2802, -3391, 2068, 1575, -3828, 2931, -97, -3409, 2973, -1849, -2271, 2166, -2305, -1068, 1008, -1937, -1054, -357, -1145, -1947, -757, -249, -2773, 55, 79, -3643, 1179, -937, -3756, 2409, -1859, -2815, 3155, -2894, -1316, 2588, -3315, 173, 1840, -2591, 1579, 648, -1599, 1749, -410, -194, 981, 334, 723, -402, 1602, 993, -781, 2451, 449, -786, 3414, -453, 187, 3402, -1724, 1651, 2331, -2035, 2336, 1712, -1165, 2169, 720, 145, 1401, 555, 596, -155, 588, 468, -798, 1335, -957, -848, 2478, -2295, -137, 2614, -3340, 186, 1580, -3872]
848c872M478l78l489M441k522p59L416k952J86K100k194M30J050q68p18M48J405
865B02j902P21J410k427K430N5k314L486k135j779M705l726k40L796l622J331
881iJ630k745K247j96j077J775j457O29J49j065J470j412Q67Q53k598L104p13
898A452k287L735k579q98L156l502J120J767l005J928J63j812J736o53p19N29
914A31J25L63j562Q52M05k339K486p63j803L531k893K84L094m250J436J810l948
931c041L079K57k863L398j743j002K431j824N46N67j237J603j249L65N76j497
947a634J996p83n67K396k462J137J540l123K268n7k254K817j306l35K098k282
963e51J186Q70j885J919r39j90J563k243J833p25j562K705k160M20K286k952J657
$$ y = [-3872, 606, 228, -3261, 1180, -1342, -2101, 1315, -1637, -1451, 649, -1545, -1115, -65, -933, -1651, -1203, 202, -1700, -979, 431, -1996, 434, 489, -1825, 1661, -474, -2253, 2452, -1274, -1514, 2282, -1340, -9, 1621, -1124, 1123, 927, -150, 1625, 168, 797, 946, -119, 1351, -61, 806, 1659, -939, 2165, 1452, -835, 2900, 321, -577, 2579, -923, 197, 1964, -1041, 887, 1050, -762, 974, 321, -398, 131, 256, 619, -943, -91, 314, -2025, 461, -302, -2105, 1426, -1467, -1183, 1911, -2339, -903, 907, -3041, 38, 295, -2568, 830, -913, -1915, 516, -1308, -762, -195, -1432, 171, -1078, -713, -137, -1634, 362, -421, -988, 1408, -1054, 83, 1623, -1500, 768, 711, -1543, 1274, -32, -367, 1731, -551, 635, 1505, -380, 1539, 600, 410, 1973, -270, 1563, 838, -724, 1981, -179, 241, 2527, -425, 1232]
980A232N47k417K666j799j278K555k103N49J662k310Q75M39q19O60j138P96R0
997B07j419J622j313l05J034j464J353J8j800K857j054j469K789k250k44J244
1013a94k007J703K19j371K138j361m97K228j577N41K55r40J468j580L73J241k275
1030a636J633R47j395J681q91L8J535k640J543K96k406K473j92r49J500j319R16
1047A134o01n97K452k072k52J866k226J145j39j811K603j991O3L101k955L63J579
1064A662k359J295l52j115R95q77M88J000j599P87k87j64Q95j500J381k72k043
1081b065K702j572j063K131j793Q37J277j739K084o89k019K497j508m57J517j353
1097a213O89M38o09J625j480m9J264j231J292k89r14J390k152J016J423k545J941
$$ y = [1232, 1779, -638, 2028, 229, -1049, 1506, -597, -48, 1614, -696, 179, 618, -201, 459, -679, 117, 207, -1212, 410, -903, -1208, -174, -1638, -285, -267, -2067, 790, -264, -1733, 1056, -1194, -1438, -194, -2201, -498, -279, -1650, 488, -873, -1370, 858, -719, -178, 77, -863, 605, -975, -602, 639, -1636, -3, 944, -451, 1230, 339, 377, 1912, -728, 815, 1111, -1295, 1178, 986, 37, 1537, 218, 1134, 533, -64, 2388, 316, 64, 1930, -296, 849, 710, -1101, 1502, -489, -426, 2675, -280, 83, 1662, -697, 598, 246, -869, 126, -751, -263, 737, -862, -75, -362, -526, 369, -1131, 250, -22, -2065, 637, -935, -1998, 133, -1660, -823, 454, -1285, 799, 110, -1909, 588, -920, -1377, 140, -1213, -524, -86, -695, 930, -550, -599, 665, -566, 726, 437, -477, 913, -1239, -223, 1200, -1345, 596]
1114E96M87j542K537r37q88J223j790Q28M19j097J168m51l17Q40q39J031q96o22
1132b50K399k105N94J285k905J207K79k075K512j013q72K711j842LJ613k623O04
1149d78M97j281J150n69M70m2n36L71j85k11J031j251P05L89j800J547r13q87
1167a993K424j799M34J832k011J528L25j823J245q89l58J666j415Q65J86p10R15
1184D22n28J55P79j160J351l49p44J639j702m07J859j964J264J113k013K000n49
1201A166j362J993j852O5J133j204J040k01l56M20j004P87j63r20J786j266k88
1218b26J265j815M71N41j909K145m93j104K231j283j44P22j734M31N96r82J091
1235a97l37P2N16r75P28j85m90J208j009J55Q16j451O52J22j091J783o36j46J389
$$ y = [596, 1083, -459, 2078, 1141, 253, 1476, -314, 514, 933, -164, 1004, 553, 236, 1076, 237, 1268, 372, -250, 2149, 44, 638, 1923, -982, 225, 504, -1571, 941, -72, -944, 1767, -75, -72, 1541, -1082, -478, 19, -1262, -112, -681, -211, -253, -789, -418, -603, -814, 217, -1034, -329, 60, -1740, -193, -1106, -1993, 431, -1368, -934, 898, -1113, 415, 740, -1083, 162, -727, -1085, 581, -834, 31, 217, -493, 422, -106, 49, 828, -332, 1019, 670, -74, 1565, -137, -544, 1315, -649, 615, 1728, -285, 1715, 1166, -196, 1797, -55, 10, 1143, -61, 979, 778, 422, 842, -162, 625, 462, -458, 1328, 62, -226, 1039, -776, -305, 236, -1673, 472, -21, -1125, 1106, -177, -321, 401, -1333, -902, -306, -1288, -197, -534, -462, 54, -921, -193, -378, -868, 340, -669, -514, 302, -1149, -497, -375, -1466, 317, -319, -465, 924]
1254I24j204P83J62j738J223n51k27J599j272P49N42j167J201m82m16J359j703
1271b18J415J49j700J264r49l44J420j220R30P17j487J561p16j120J563j581J22
1288a94Q16r97J085m46o36J334j317N1R66j080Q20m05m86Q08j499L88O52j046
1306a186J243j83k14P29j043L85M07j864J362j79p09J555j025NR86j354J271j28
1324E8j312J808p14l78R42j265P16j36n59J479o74K70R96j150N62k56p05Q04q50
1343c64M83J053j592J029K08j017J133k95l90R30j285P69M04j609J191n63o71
1360e86J257n76M42J81p15J212j001o98J225j415K02P11r63J429r90m85J438r51
1378b83l67J251j241L01L65n98K72n18j12P42p05Q39J59n08O19r31N36j4j370
$$ y = [924, -280, 503, 665, -1073, 150, -401, -628, 971, -301, 448, 990, -177, 1024, 542, 126, 1485, -218, 1197, 1346, -354, 910, -39, -383, 1037, -183, 747, 1464, -23, 1538, 822, -298, 1265, -316, -194, 622, -375, 710, 264, -372, 962, -355, -304, 662, -418, 402, -3, -489, 319, -1180, -792, -140, -1186, 57, -126, -340, 389, -654, -269, 138, -1726, -364, -543, -1252, 303, -722, -717, 269, -1085, 186, 58, -1254, 554, -160, -538, 404, -861, -145, -281, -840, 639, -35, 235, 1231, 81, 643, 387, -318, 486, -364, 119, 1172, -420, 609, 817, -200, 933, 638, 248, 1178, -107, 662, 1066, -543, 648, 85, -586, 671, 95, 537, 718, 3, 1215, 214, -484, 741, -674, -472, 239, -724, 705, -285, -770, 668, -283, -650, 601, -640, -339, 26, -572, -300, -818, -930, -188, -893, -54, 105, -403, 216, -715, -179, -193, -1563]
1397a563J213J1r28J903q88j96J063j492Q64M90j289J254k74o66J278j227L94
1414e3k7l32J041j39K41N77j072J97J43j117J086o03o6J163j046M47L90j064J022
1433G88k93m68J022j020K9L26p78M82k06n14J057l32J89L89p03Q03j375N2P94
1452B42j079L81N31q96J136j87j157J357q42l4Q33q07L03l4n84M92m37mN09l29
1472f06O48m3j76P16j196J20O11j254J145J38p09J292p20r2Q47j380N78Q07j065
1491c39Q55m47o7M37r02N00P12p12Q67l90J65N98j280O41k82p03J058p15K04P60
1511I60j153L40P71j088O82j93o09J003p30J20Q9q16M27J15j18M69o70R61k67
1530B93r56P13m33k99M51l78J37O31r63R74o2j303J379j75n50P44n05M6K58p40
$$ y = [-1563, -350, -339, -1267, 636, -252, -448, 615, -877, -13, 477, -812, 442, 168, -498, 780, -447, -53, -80, -412, 629, 490, 731, 1308, 236, 433, 576, -541, 545, -58, -124, 1039, -7, 440, 830, -234, 788, 495, 27, 1049, 29, 58, 384, -394, 88, -118, -632, 425, 93, 282, 671, -32, 771, -604, -552, 242, -837, -456, 75, -821, 315, 128, -1029, 328, -514, -548, 285, -522, -219, -253, -837, -345, -782, -786, -277, -606, 42, -1, -177, 539, -657, -537, 74, -1180, -35, 103, -606, 686, -34, -126, 721, -659, -81, 726, -339, 516, 69, 2, 439, -463, 37, 749, 37, 904, 514, 679, 1277, -3, 638, 356, -347, 711, -4, 200, 960, -193, 147, 918, -170, 512, 319, -290, 713, -17, 103, 192, -624, -197, -82, -200, 269, -401, 560, 293, -663, 50, -383, -682, -231, -609, -472, 159, -804, 170, 108, -1195, 184, 9, -541, 203, -302, -256, 2, -738]
1550g38N46k65k63O07R1K61j08j95N00o82p1M45o01N31L00o87J204q90k45J016
1570G56r62N13M31r09Q91k24o58O13o89L96L62n47P57K8l77J05l51k5j25j82M50
1591B53j15k15O97m46n29Q33o02J20l2r8M07m52j50K77l69J26n6J27O17n83J63
1612b7L35j132P87L3j071R15l76J86R17j058N27r8o13Q28j48k70N37m99J50j67
1632b44l68M57J82j06M40l36K66L5k36K62m83mL51p38Q05R2n32R56o51l23R92
1653H17q63K54L37n59O49k05n83L80j85R9J98k06L30J01m22M24p34j63M16k13
1673a28K14Q8l89L43j41k7ol34L61J88k09R3k46kJ07o25M96n9k24O12l43Q3L49
1696B01n82K93r2n16O10j53k39O87o09M19L48j062Q60k22j68K07O8J7j70l27J88
$$ y = [-738, -192, -457, -720, -113, -22, 239, 131, -64, 436, -246, -317, 128, -473, 58, 358, -329, 875, -15, -260, 756, -206, 307, 738, -171, 720, 496, -162, 451, -238, 158, 520, -27, 730, 758, 381, 486, 135, 110, -15, -197, 253, 138, -77, 620, 174, -355, 478, -124, -4, -36, -134, 273, -179, -329, -52, -421, -295, -351, -224, 393, -190, -27, 308, -824, -37, -4, -1075, -160, -536, -350, 567, -491, 36, -62, -675, 153, 5, -265, 272, -227, -77, -244, -612, -155, 27, -79, 361, 25, 291, 326, 90, 352, -131, -135, 216, -522, 283, 375, -157, 799, 148, -175, 817, -46, 208, 545, -14, 635, 430, -153, 227, 42, 141, 339, 133, 463, 564, 142, 566, -168, -331, 85, -128, 86, 174, -215, 128, -13, -40, -46, -380, -19, 169, -40, 53, -193, -195, -88, -713, -217, -276, -500, 112, -231, -148, 201, -381, -88, -180, -696, -86, -239, -478, 209, -400, 19, 367, -695, 165, -57, -225, -18, 50, 67, -103, -430, -242]
1717b42k1K41O12n59M03m9m24J20k80K75K25m32L75J46m66M78j01l41O19o06J43
1738A16M82o35K50n1m04O79l24k39N94p93P35j48m57K57m02K61R2k06K23o7l05
1759c42L83k08l3K88n03J67K16k08J69k27L6J79l43L17O4m07L74J77R1M3n15P5
1781b07O5j84M94j65k19M48l82K43J21k65J00L6k36K42j59JK90l97J69M6J62N84
1803G87j006M88j7m35K88J03r9K73k95J57J96n25M14l63k20N17k34J55J23Rk24
1824I2j11k71K47j33K99K70o48J16J37l46M87m93kN59o30L48Q5l25N11m13j60
1845c81L10j31P5J97m35N19n50J99K29k12J08R3j68K37j16j3J47k26K89k41j83
1866b53N61k76L4L53m82q0J40J04M0Ok82M44l44J40K11m09L80j69k4J90m69L86
$$ y = [-242, -263, -22, 590, 31, 434, 385, -39, 81, -199, 76, 301, -131, 244, 390, -76, 402, 301, -40, 579, -27, 116, 598, -37, 213, 162, -242, 437, 113, -126, 468, -325, 410, 262, -195, 62, -340, -79, 13, -193, 30, -37, -342, 41, -167, -200, 88, -415, -248, -32, -240, -71, -298, -262, -83, -426, -109, -45, -452, -78, 99, 190, 233, -282, -207, -142, -326, 168, 3, -216, 232, -150, 93, 214, -51, 49, 85, -151, 91, -68, -67, 223, -174, -5, 41, 203, 787, -219, 269, 252, -183, 105, 208, 109, 382, 87, 244, 440, -85, 329, -34, -254, 263, 29, 184, 307, 316, 92, -19, -290, -43, -176, 123, 393, -255, -139, -2, -348, 139, -354, -356, 203, -427, -79, 6, -319, 192, -221, -381, -71, -202, -127, 70, -365, 154, -396, -197, 32, -180, -72, 21, -147, 90, -26, -39, 108, -118, 171, -70, -253, 308, 32, 66, 419, -63, -143, -3, 101, 141, 147, -135, 309, -35, 105, 316, -93, 287, 118, 94, 284, -185, 201]
1888B01j5k26N36m50j32M79l26r6N66n89o1L37o60M83J78k23q7K66k26J35l30
1909b40L42n21J73L78j67K49j24m67M19j23j05J9k89M46kk36K57j57rK5n3L9K99
1932A53l10J71j54K43k13n8N63l37K2K53m54L94J16o04L14n5k19L26j39j09J68
1953G1M1p3L3j17L54k7k35J40j36J73j98KJ52j39r9M31l68j30L04l00K39j60P2
1976C0J58k46J40l1k81L05j63%K19k59K66L4l98J5J26n8K14L1l34J40p4m9J74
1999d1l16J66K85l98J36K35k83L2j96N31nk95J81n1K16k11m9K6O1j57J6JK33Q9
2023B06l53L44J5k11L58m60M99l87j59K08J65j35J7k68J9M18j93K6R3j95K92k29
2045G0L0j01o3L14k08J97r1L2k42L09m59m0K30o1K25j00k10L23q1l70K91m7j52
$$ y = [201, 186, -40, 496, 46, -86, 393, 67, -29, 537, -52, -113, 224, -436, 47, 225, 2, -85, 181, -45, 90, -240, 102, -419, -246, 132, -35, 214, 90, -377, 42, -81, -186, -167, -456, -10, -12, -248, 9, -148, -157, -132, -185, -146, 153, -157, 14, -140, 103, -110, -168, 395, 58, 80, 333, -121, 273, 389, -215, 99, 44, -175, 151, 12, -97, 71, 112, 39, 72, -45, 309, 282, 47, 187, 51, 224, 26, 28, 180, 41, -58, 373, 5, -125, 179, -121, 118, -42, 30, 188, -58, 82, 51, -230, 75, -88, -88, 131, -128, 138, 172, -226, -211, -85, -143, 71, 102, -232, -92, -166, -215, -41, -357, -191, 94, -304, -168, 67, -216, -184, -380, 151, 146, -149, 32, -19, 197, -14, -63, -37, 24, -133, -117, -116, 117, 206, -147, 197, 212, 1, 359, -101, 398, 11, -148, 60, 225, 90, 107, -161, -142, 276, 83, 109, 202, 7, 299, 70, 100, -1, -64, 250, 42, 239, 148, 180, -62, 247, -212, -252, -22, -83, 142, 42, -168, 155, 74, -296, -5, -52, -204]
2068b04L07l10L36k69j06K07j13J59R4m30L44o2l1J72l40J42J14m9j1P3l33N94
2090B84m03K90j57j84K67N9l29L07j18L5j5l3J73j24j80K98l12J99j89j28L27
2111F7Q2j11l9J30p7l9o4p2K26jm3j40P1K62l77J40J13q0N3L7q2l3j08L11k13
2136A3l89M28j72P4J83j83M4J44l11J65j82LL1j64L7L96k48K64k37j1j84J80K10
2159I1j53q9J73j95Q5J1k48L63n1j64K34k8O7q0j01l4K40p2J98k23J46k82J21
2182IR2O5j74Q5N2j93K36r0J97j89j11K46k40J77P0k60K5M5Oj38J22q5L63k31
2206G9P5o0j99J83l35L11J98m26K21k98K05O2l2j89K88k24r4K49j50K49j78R1
2228B6j8m5l0Jq3J74j02m9j7j6q7K96k39J81J50k74M7N2J20L3r8j2nq0J89k33
$$ y = [-204, 103, -207, 129, -140, -246, -39, -152, 7, 101, -329, 15, -47, -78, 94, -246, -104, 10, -39, -50, 23, -310, 284, -119, 171, 14, -170, 97, 156, -173, 134, 16, 51, 36, 3, 176, 52, -128, 170, -142, 57, -132, -260, 67, 149, 38, -1, 129, 52, 13, -51, -123, 103, 102, 59, -81, -10, 252, -125, 15, 128, 48, 101, 138, 56, 23, -85, 226, 13, -376, 52, -120, -46, 137, -46, -2, 142, -169, -4, -186, -183, -152, -316, -279, 117, -131, 133, -104, -115, -299, -119, 91, -62, -151, 22, -173, -88, -77, -325, 38, -13, -177, 57, 29, 96, 16, -85, -119, 121, 49, 247, 24, 170, -112, 9, 101, 166, -8, 77, 129, -64, 172, 82, 279, 90, -21, 225, -15, 162, 232, -28, -3, 42, 48, -90, 32, -53, 310, 79, 154, 94, -105, 78, -257, 54, 252, -174, 47, -251, -46, 16, -16, -205, 83, -141, -235, 14, -136, 113, -65, 26, 8, -37, -67, -66, -149, 25, -77, -126, -143, -159, -246, 50, -189, -8, 142, -132, -85, -33, 87, 120, 22, 10, 5, -75, 114, -119]
2254a19K57%j28J83l51L4M13j76L4M4k25K91m9l39J66n8m9K63q6J7om30M18J46
2278B50p9j63K74l03r0K31N3j91j96M1M60l08L89k97O9j65q0J7o3J28k4o6J7P7
2302a9n7K50j46k47L78k52J23o7l8J61k69J38L2N4j73Q3M6k8J66k98J50j7J90
2325A60m5p0P4j52J45Kk9K8K8jR0k33k02L26r3P3O1j73J13O4k56M44m14KK70m58
2351b46K38n3L12j73m38Q2L06j71J75O3JJ70k68L7m2J21j94j2O1L16j99P2j44
2374A4j63P2O1j3J29k72M7L6R6j11p1J66J97r8q4J11k63J70Q6j08r4p3J98J96
2398B29k31J2J35q7j18M9Q2J04K9J31k88qm0M3q0K22l1j90j48K88J34j92K4q7
2422a8J2n8N3J4K9j35M8J63m05L26J21q3j05K26l06J64k38J26K23j7q3J25k66
$$ y = [-119, 138, 138, 10, 193, -158, -124, 289, 113, 147, 191, -34, 257, 208, -131, 35, -23, -72, 191, 105, 122, 116, -314, 104, 250, 171, 8, 282, -21, -111, 120, 173, -18, -214, -173, 287, -21, 368, 71, 140, -25, -105, -88, -151, -23, -47, -113, -96, -19, -76, 174, 28, -219, 159, -93, 30, -37, -75, 86, -183, -45, -13, 41, -132, -49, -3, -31, 135, -163, -13, -30, 160, 115, 45, 119, -33, 112, 114, 85, 113, 141, 140, 230, -3, -205, 121, 28, 101, 162, -11, 102, 166, -90, 354, -60, -58, 212, -246, -8, -61, 251, 78, -360, -278, 28, -143, 32, 95, 96, 266, -2, 35, -7, 114, -80, -92, -31, 285, 86, 158, 14, -149, -77, -16, -29, 100, -172, -125, -89, 7, -104, -175, -9, 188, 90, 6, 117, -146, 24, 110, 2, -92, -165, 33, 229, -2, 10, 145, 58, -60, -11, 71, 175, 204, 335, 47, 39, -1, 42, -38, 184, 153, -37, -185, 103, 237, 45, 69, -18, -6, -64, -11, 3, 32, -103, -55, 108, -297, 29, 150, 67, -38, 188, -118, 46, -192, -66, 157, 140, 57, 182, -84]
2445h4K19Mk3j0l77Q9M25k73J01o8j24M4q6J70j68k1M3J23J07L8q0j13p6k9J79
2470A0K34l14J00J71k17n3J80k8m3j42J99k62J65j49J0k9M01l49L07O7n56K81
2492a7O2j6m1Q3P3m36M25Pp8kq6Mm8J72L3k2j99J76j02L6L5k77K11o4J47j0j40
2519g4O7J56J0j03o0N6m0K8k03K96r6m3Q9j98K68q8Lk00J52r9J39k3K3R2q5j52
2545h5J44p3N3j15J22mj08Q7K05o6m2j27j04Qk03L03P4j44J31Q5p7j26J38j9j71
2570a14J13K97m37K51k1j33R0K92m78O8J38r1M2J9K6k09L92j32J46k29O8O8Lj53
2594A6j09J40o2Km2J44mj00K31k9j22j44J1J55k38J36j79K34K4O1j87k5K55k02
2618c4m9L74n8m81K50l6J06k09J36J56jk80J40J11l34L97j62k09K7M2P3j3J54
$$ y = [-84, 135, 139, 116, 106, -271, -182, 243, -30, 71, 3, -121, -77, -163, 7, -161, -182, -139, -16, 91, 129, 49, -64, -140, -169, 10, 244, -70, 30, 201, -16, -69, 111, 83, 40, -102, 97, -165, 0, -149, -139, -168, 233, -116, 191, 258, -298, -17, 45, 29, -12, 71, 144, -292, 133, 140, 62, 60, -26, -22, -70, 102, 135, 113, -86, 90, -12, 24, 59, -218, -7, -71, 76, 66, -74, -7, 149, 159, 56, -4, 52, 12, 40, -163, 133, 37, -6, 83, -115, 153, 65, 68, -132, 20, -79, 60, 37, 60, 152, 67, -85, 59, -14, 39, -76, 46, 42, -66, 21, 226, 160, 118, -9, -113, -105, -308, -5, 69, -75, 56, 141, 64, -62, 76, 57, -114, -1, 296, -141, 110, 89, -44, 46, 338, -140, -72, 66, -25, 17, 36, 62, -147, 245, 113, 259, 30, 98, 166, 169, 16, -93, 47, -15, -13, -55, 89, 85, -15, 216, 187, 65, -79, -68, 87, -151, -15, -194, 40, 64, 125, -62, -87, 168, -34, -83, 291, 233, -248, 2, -34, 72, -137, -1, 155, 154, -126, 14, 125, -209, 188, 26, -183, -156, -114, -41, -54, 100]
2641A00l04J96R1n2k01J06K20j28j89L67m0j17J20m8m8j27N5k9O7J08R1m43M6
2664a59J16J56l50L97J70m92l2M64l48k0R8k12K29J49Q0k10k8P7K0j42J74j44
2686gn9k0l4K49j58J41l8q6Q5Q7k35K91r1j44O0r8k05M14p2L7oR8j85p1L8l3j02
2713a44J29N2j10n2R0r3j39L01n5OJ65k59J65j82J0NJ60k7j91K80m40M16Q4n8
2737A13k91M30k75n0Q8j57M35k33n4J93l73K11O8L7j33J98k68J98j88J66P2k66
2759g9j9J6J04K36Ml3k35J23k01m7n1L51j83j19K44l09J22q1K45j29J14L7j9l51
2783b60J54q6J81M3J0K3j05J81p8j04p2Q9P0j64N5j66K11m3q0J23J07p6J01o3
2807E1n8j93j5M11l42J15j3Q7J43o0k74L9Q6J76Oo7J12k36M8O9K17p7J11n18J32
$$ y = [100, -204, -8, 83, 31, -170, -64, 156, 28, -161, 206, 166, 49, 169, 121, 73, -54, 1, -28, 39, 147, 238, -205, -159, -43, 113, -237, 160, 330, -162, -194, 270, -78, -98, 0, -212, 17, 166, 246, 36, 8, 85, 105, -37, 137, -7, -66, -86, -120, 129, -29, 112, 74, -12, 73, 160, -75, 216, 125, -19, 41, -57, -262, 152, 80, 117, 111, 209, 24, -47, -9, -42, -144, -15, 37, -73, -125, -35, -128, -267, 34, -21, -15, 150, -109, 56, -126, -116, -111, 49, 22, -169, 111, -329, 87, 171, 113, -178, 252, -23, -73, 15, -142, 293, 60, 6, 199, -174, 37, 105, 142, 9, 207, -61, 137, -51, 115, 187, -79, -98, -82, 22, 258, 262, 229, -6, 117, -84, -131, -182, 169, -14, -133, 111, -198, -76, -157, 88, -41, 73, 110, 91, -260, -106, -192, -11, 32, 42, 65, -40, 141, 63, -41, -113, -24, 46, -118, -63, -229, -18, -61, -141, -18, 89, 13, 114, 51, -7, -200, -215, 196, -146, -31, -44, 43, 186, 126, -148, -109, -23, 153, 159, 92, 204, -32, 16, 85, 302, 225, 336, -182, -50]
2832e0J45J2p6J49p5R0o0k94n2o1L44N7j63J02n1L22O4l44k85M27l70m0J82J40
2856A13r5n6r8L62m15Q1K88l10J64o6k14K89j99m4K28j24K27J02l65J01M6Mr8
2879g9Rj37K90j21R4p6Q5l4J11j78L26k11qj3k1J44r7k08J26M2J54J44j64k5k8
2904A25Pk90L18o3Lnj7j70K10j87J34J55j05k8k04M3L3J09p5K07k24j70N23l29
2928@k28K62j8J05l80J77K38n27M38M4m35M30l50J17J75m2n4J98j58mL9j85R2
2951f6p3K93l77J78m4J5k1J14m6j3k73J79J94J27j25L32k10j89J00j4P0j65R3
2974G9J78j57k68kL10k03J8L30l31o0%K23k01J44J15j48j14K10j89K85j61k69
2996b11K45pL5q4J54j93p9J13j9k03J50P7M9m6M3J24n2j19k6J92l61L84l15K0
$$ y = [-50, 95, 107, 31, 180, 105, 195, 135, -159, -211, -272, 72, 129, -34, 68, 17, 339, 403, 59, -226, 201, -169, -209, -27, 113, 18, -38, -136, 226, -189, -108, 180, -130, 34, -32, -246, 43, -156, -200, 28, -96, 131, 233, -132, -31, 15, 19, -79, -70, -207, 83, -38, 56, -20, 65, 31, 142, -36, 290, 79, 71, 58, 37, 181, 84, -124, 2, 44, 198, 342, 178, 153, 125, 132, -158, 160, 97, 100, 95, 78, -92, 118, -69, 65, 220, 115, 87, -117, -74, -41, 68, -7, 200, -24, -194, 329, 0, -228, 34, 16, 121, -259, -82, 156, -371, 67, 111, -324, 106, -244, -127, 48, 6, -48, 150, -8, -12, 27, -158, -66, -139, 154, -223, -45, -89, -74, -95, 19, -27, -40, -313, -134, 60, 187, 62, 394, 184, -5, 95, 81, 151, -14, 79, 257, 100, -168, -170, 140, -63, -45, 285, -46, -106, -106, 117, -84, 60, 175, 27, -87, 123, -66, 219, 58, -211, 34, 27, 62, -22, 132, -61, -140, -27, -46, -249, -99, -22, 27, -19, 24, 148, 96, -23, -49, 143, -218, 166, -149, -129]
3020a29J38n9n8K39j35k98K54p1O9M3n0k9p8p0J40m48J72N98L13p80J44K47l48
3043a96j10N99p8m88L45K11n35K57j27M27m17m49N24j53M39l20k3j31K36j23l16
3064d28N56k21K36J1l64L9J26m6L55O1q48L13P9k38N76o49L58j91L56J71l13j88
3086b49J29K79P6n23O78p10L34p6j51JO01o39J02M46p39J01N52l12M90q39K53
3107a96J77nn86P09l50M10Lk93R9K40m13K48p9j14L17L5k28N5k58K69r9R7j1J67
3131A94l02R6L86k95J00j25R3k73M00m1j45j38R6r5J98j48N1L5q8p5L05m28K83
3154H4j05k19J49J28J12j88K8l7K98l12Q1n6l8p0m8L74j83j32R9j39J75Qj55L8
3178a08m1o2K37J7R2P2l20P4R1j46J79j68J99l1k6k60K31r2J0n5Q0K34m99M02
$$ y = [-129, 9, -50, -108, 131, -4, -302, -48, -119, -50, -7, -57, -86, -164, -234, -94, -542, -370, 228, 541, -239, -95, 152, -196, -306, 293, 215, -273, 72, 283, -252, 5, -122, 305, -112, -561, -37, -190, 249, -71, -94, -225, 11, -112, -428, 128, -93, 143, 154, -210, -171, -45, -91, 264, 325, -523, -210, -131, -369, 207, -442, -84, -275, 81, 252, -61, -249, -120, 159, 235, -288, 390, -320, 14, -62, -213, -212, 389, -250, -148, 298, -441, -340, 212, -100, 390, -449, -196, -19, -24, -610, 99, -251, 159, 162, -131, -32, 208, -205, 43, -36, -150, 167, 202, -26, 29, -229, 40, -59, 38, 27, 194, -108, -12, 374, 79, 179, 54, 147, -126, 274, 233, 88, -50, 46, -49, 149, 1, 52, 87, -1, -76, 229, -199, 84, -21, -240, -91, 37, 149, -39, -11, -48, 250, -62, 19, -37, -75, -145, -193, 181, -2, -134, -35, -174, 1, 9, -146, -108, -149, -211, 26, 43, 135, 207, -113, -39, 52, -94, 85, -83, 116, 85, 59, -201, 30, -62, -52, -107, -27, 207, -292, 110]
3202A10j26R9K43l12P5J46j54j48J44K3Pp1OO4M6k13k9L72q0j54J16j33k3K83
3226B91j85k12j58J67L4J80k02m9K6o2l1K47l60K36r4j4P2L2J37j18j82L39l63
3249b69O90q1o05M73k80k81N18m01J78K36q8j88n0j41J90Rj74J43p8M02j94J95
3271B04j36M4K22j68j80l5N9LK56k22J94Lk69J98j17k00M17k94RK04J76m91J97
3294G4N4M3jj28J01l28Rl2R3L84j86o8j06J16j07L20l60P5K8p3L5m4J6J2P0k02
3320b05K21q3l4O1J32J42k48k3l1q7j01j09K82j79P7J34M7j17K56j04p9J79r7
3343C4o3K4J46k31J79k31K35j23J40k54L59m46K18o9J88k00Q6J29QJ88j64r2l24
3366b63L41M2j31K4Q2k7J21k51j41%K90k1P7m51M60m3k83K10k20l2K74j94k8J97
$$ y = [110, -16, 83, 326, 14, 89, 235, 81, -67, 77, 100, 107, 36, 42, 106, 152, -61, -90, 282, 202, 48, 164, 31, 8, 291, 106, -106, -264, -97, -63, 117, -85, -134, -108, -170, -201, 46, -314, -78, -172, -186, -114, -82, 55, -63, -245, 94, -269, 421, 340, -265, 208, -72, -353, 165, -236, -58, 178, 90, -98, -148, -289, -99, -90, -264, -121, -199, 203, 9, 204, 68, 112, 334, 166, -14, -49, 10, 13, 269, 47, 241, 244, -25, 173, 56, -144, 273, -21, -12, 192, 368, -123, 74, 128, 171, 170, 42, 143, -185, -176, -208, -115, 269, 83, 15, -91, 25, -82, 238, -122, -47, -19, -92, -57, -101, -85, -73, -3, -205, 16, -67, -101, -40, 92, 234, -14, -37, -68, -155, -256, -365, -83, -262, -185, -51, -4, -121, 135, 31, -48, 131, 34, -29, -5, 141, -90, 89, -142, 93, -30, 110, -144, 215, -231, -13, -82, 106, -94, -8, 121, 129, 317, 153, 61, -263, 78, 120, -11, 13, 95, 68, 189, -62, -203, -203, 87, 66, 143, -308, 152, 109, -174, 36, -184, -216, 58, -136, -164, 33]
3390C3L2j78m9L7O3M6j41J50Pk2q1O2r9K27J04l90J25J95j42j3Q9q4j14K46j54
3415e1J17j30r2n6K48k23K32K5j23J40K1J24k26J57n5J34p1m06J88K16q9N1Qj49
3439a0N8J0O7M59r74O54m87J8R37p50J05J54M1m98J03P47r38N31j53k68K16n2
3461c0L7k43J6N9o4L14q9k66J80M22l88K45k72k17K63N9k28K88j59J24O6j84J22
3484E5m10K10J39K3K78l19R4l3l5K48j05j73J04j45J76m6m50J89M97k05J08k54
3506e4J22j52l7J84q6o5M2J60k90K78KJ7M1l7k59K53k69K90j71Q2L75m77K97k04
3530D2N5j04L6J64l01k6l1K17j77o4J80K21l70p5R9N2l3M20k68J46j29n25L46
3553a25K48k95L1K8j45J09k0j03J72M6k1Nq1j8j1L11n7k54Q7Q7j14N2J47K22k47
$$ y = [33, 65, -113, -162, -125, -62, -16, -157, -7, 0, -22, -103, -41, -140, 87, 191, -199, -74, 121, -21, -34, 55, -29, -143, 103, -51, 66, -64, -156, -212, 36, -187, 45, 70, -53, 87, 108, 232, 6, 163, 108, 242, 171, -235, -47, 169, 80, 131, 139, -10, 48, 58, 125, 584, -390, 264, -223, -205, 732, -18, 87, 241, 282, -216, -113, 634, -304, 227, 74, -194, 22, -30, 7, -236, -220, -161, -225, 89, 0, -266, -86, 336, -52, 193, -79, -296, -33, 26, -202, 86, -73, 51, 117, -67, 55, -355, -145, -6, 17, 295, -24, 70, 37, 2, 250, 145, -28, 76, -69, 107, 61, -389, -200, 297, 92, 200, -54, 68, -84, -121, 63, -23, -88, -46, 114, -176, 102, 104, 121, 162, 125, -134, 119, -150, 140, -31, 51, 426, -51, 246, 42, 97, -7, 29, 193, -108, -134, -165, 52, -125, -189, -9, 212, -158, -233, -134, -82, -115, 305, 37, 183, 54, -471, -125, 123, -172, -141, -113, -258, -149, -169, -272, -100, -54, -75, -70, -151, -169, -180, 131, 74, -180, -93, -6, -120, -68, 79, 301, 54]
3578E4k33N8K06j7K5J74l70P7J70j8pQ4j36j3J9j42O9Kj1L4J54p3J05k26N9J95
3604B39k19J5j10J92j48K69j47j75P0J44k36J05j02J73k92j69K51J67J06m17J97
3625h7o3q8mK48j26J66j93K80j98k31L40J4k25j31l1L35j04J23k65N2K63lJ61
3648B33l16L43m00L08j85k81N70J24n57O05K27l32j02r0n38P59j214Q67N33p13
3668a59M20k3k7J06K0j23M4k73L3L21k74J44j67m0k20J13L71o15P80n84m57J039
3690D29q73P36j94j34p3K39k71j06K03m4J4k9K0k8R9k9P2J3j39p4L39k33L69j72
3714A34j72K49j70o0L4J09J28k35p6J03j19J55j98K86j4k07K84j36m7j97J43j14
3736a20K79R8k12J24j74J93qj32R1j23n3J15q3n0J45O6o6J37j65p5K5R3k14J31
$$ y = [54, -179, -121, 85, 68, 93, 267, -103, -26, 144, 126, 119, 203, 67, 54, 73, -69, 0, 2, -9, 25, 179, 106, 211, -15, 44, 239, 20, 35, -75, 117, -31, 238, 91, -84, -14, 130, -106, -1, -103, 70, -222, -391, -140, 27, 133, -284, -87, -150, -238, -242, 6, -120, 46, -147, 133, -65, -296, 44, 58, -167, -298, -329, 6, -98, 25, -240, -188, 75, 72, 233, -83, 260, -140, 168, -17, -298, 272, 396, -161, 444, 671, 339, 237, 147, -391, 368, -846, 21, 554, -159, 261, 238, 211, 317, 337, 214, 258, -15, 18, 339, 65, 209, 42, 2, -218, -105, 266, -349, 431, -153, -610, 429, -444, 292, 98, -36, -109, 130, -141, -247, -44, -88, -74, -103, -83, -111, -12, -41, 31, 44, -95, -169, 170, -63, 306, 134, -38, 211, 41, -19, 15, 124, 252, 17, -59, 44, -75, 80, -118, 168, 154, -53, 231, 95, 48, -149, -6, -120, 159, 257, 45, 169, -5, 188, 180, 48, 139, 16, -37, 78, -5, -55, 90, 156, 90, 227, 62, -13, 12, 105, -109, 22]
3760B2K97j4k20n9n8j56L56q3j03J2J6j48Q1j9N6j5J27k78K50l1j17J59On86L35
3785a70L8K58j14N4q7K6O1j46rl4K11Ll04K74p7J32m22N03j73k17K05M0r1J1J57
3810A29oj47J77j87j20L08Mk05K71k85K48Q7l15J80j28J42j72q9J37k2o9K95l06
3833g3k53L99p4J28o7j77j2J09k21J64O7m3O2m05J92q0K41r5n4O5j18J35K6rK1
3858g2K22n03J43q7L40k08R1K66j65k11K65k19J01J10j31r3J97k57Q4K42k1j92
3880i8K44O0j85N4J18l9L36rl33o3O0k25L56m4M07l6o43l54J39K21N27j171N87
3903i1L35M4k8k67P6l15L09q3j18k7K10N6L2p8k87L46j98K10m1j45o8O2Lm22M14
3928g1J1J47l7k21l8l7K53n3R8Ml5P1r7J2K0j73J6j3J29J01k81K13p5J95K40k89
$$ y = [22, 319, 305, 85, 26, -32, -188, 168, 85, -18, -6, 10, -138, -57, -76, -20, -35, 92, -186, 64, 33, -84, 75, 81, -505, -170, -132, 126, 12, 66, -21, 5, 66, -80, -89, -123, 88, 91, -213, 61, -16, 116, -306, 197, 24, -193, 12, 52, -39, -28, 129, 123, -24, 153, -34, -154, 154, 158, -47, 224, -61, 187, 274, -41, 139, 11, 153, -19, -108, 29, 7, -62, 233, -73, -326, 73, -1, 127, 60, -117, -129, -20, -241, -77, -10, -53, 9, -396, -204, -284, -43, -138, -192, -127, -245, -110, -84, -93, -72, 150, -353, -210, -297, 43, -165, -74, 192, 27, -184, 81, -138, -37, 73, -58, -151, 46, -211, -127, 115, 94, -98, 146, 206, 21, 75, 193, 154, 490, 481, 148, 85, 145, -80, 276, 232, 639, 603, -40, -394, -255, -34, 493, -678, -91, 244, 288, 260, -7, 69, -246, 63, -20, -138, -165, 45, 101, 133, 55, -232, 114, -84, 126, 85, -60, -128, -66, -63, -485, -71, -60, 87, 50, -171, -209, -246, 7, -46, 52, 56, 21, 92, -5, 7, 27, -146, -130, -143, -14, 87, -194, 19, -56, 139, 379, 90]
3954I0J7M9j48K22k70j40K52J7J15j34J59k80Q5K34k46r5J53j75K40on5K11k00
3977I5k17K88l4k1k07K52p9O6j34K15j85q1K17k89N3O2J08k04K54q1q9Oq4N7J52
4002A20j01j66J5K51k64m5J84p3PJ08k48L42j89J61J4K6l14nL19m9j8P3p4l35
4026b61J16J58j94J51M8j55K22j76K46L6j23L3j57R5OK84k79J32k69J34j38K35
4048A44Kq8J6Jk10M2N4j29K27j4N5J18l34K58k8j55L2J17m68M97k56n9K01N2j82
4073a07L50l40J85L3Q7l64J35P2k54K25J8j31K00l2m33M29k39j5L63k20q6K10
4095H6j62K91l72K1J20k41L74n7j05J84k07R6J31k05J92j53j77K23j5J68J25k26
4117I1R1m9k23K03j8o0J89j53M6J56k21l6J29q3j33K05J22k06k8K4J30p6q1N2
$$ y = [90, 107, 156, 8, 230, -40, -180, 72, 89, 204, 70, 229, -51, 34, 268, 22, -73, 80, -95, 145, 139, 84, 295, 95, -122, 166, 132, 111, -96, 156, 77, 143, 9, 224, 39, -42, 175, -114, -61, 1, 109, -95, 159, 78, -11, -5, -89, -32, 120, 19, -147, -132, 119, -145, -190, -6, -79, -72, 36, -212, 130, -59, 102, 116, 142, -172, -177, 142, 93, 75, 148, 74, -261, -145, 13, -181, -30, 18, -137, 85, -91, 155, 191, 68, 101, -56, 39, 45, 329, 50, 182, -87, 47, -91, 144, 146, 58, 74, 75, -135, -93, -39, -168, 59, 45, 100, 218, -116, 142, 114, -41, -9, 108, -360, 137, -119, -178, 23, 75, -107, 243, -97, 88, 121, 208, -156, -21, 51, -203, 22, 40, -91, 109, 77, -356, 73, -166, -181, 182, -38, -124, 86, -76, 215, -157, -136, -16, -257, 117, 60, -45, 139, -68, 28, 159, -46, 146, -7, -184, 39, 24, 192, 317, 91, 182, 133, -90, 113, 95, 35, 224, 71, 117, 273, 52, 16, 145, 62, -71, 134, 256, 50, 22, 46, 176, 100, 19, 71]
4141G1k32M11l07j34J95m2M6P7j14k10J43N0R8l04R3jM4J99j93Q4mm9rk4j7K84
4167A55j17j85K88l08K01K0j14l5NJ09K0q2O9R3J6P8k63L09m5o5j72M5J42N7j58
4192F3L1o5J10j25K3J23J32k36r4J35Q3j82K24n1j27J05p2j04l4P3q5L6o7J27
4216B3J27R5n44K09j93K66OK20k50l7M5o4K2o6J79j01l4O8k52K17O8j76L1M3J29
4241C1k2J05k06J79k25Q6O9N2j44j23J04J70j59P0J97l16K28O5N2l80J49LN0k4
4265A1NL7L79n69R9J34J39l15J76m42K44K6l9L44M5j76J91l62L72l03k43M33l87
4288b01L10J43k67N15n59L50j04k20J63n1l15M04N8l24K36j06k65k49P38k25j30
4309i9Q3r4L38p2n07M71k76R8L4Q16j203O84k83J41l77kJ26j97j25L11o8m1j85
$$ y = [71, -161, 250, -57, -191, 4, -38, 8, 85, -29, -239, -96, -46, 52, -252, -159, -160, -116, 83, -110, -26, -30, -79, -88, -112, -129, 155, 38, -147, 141, -167, 34, 54, -60, -95, -90, 19, 39, -43, 26, 119, 135, 213, -50, 259, 214, 149, -23, 22, 164, 221, 63, 94, 29, 139, 14, 37, 160, 292, 56, -38, 97, 180, -2, 222, 171, 44, 149, 77, -27, -61, 12, -73, -37, -104, 23, 150, 245, -299, -90, -283, -17, -11, 209, -41, -78, -33, -97, -75, -141, 38, -63, -97, -29, -281, -64, 4, -172, -141, -98, 31, 9, 114, -92, 87, -138, -52, 17, 69, -75, -198, -94, 76, -83, -13, 184, -132, 96, 161, 213, -167, -18, -15, 35, 11, 16, 53, 432, -137, -38, 96, 235, -80, 96, -346, -102, -76, -115, 229, 274, 98, 289, -73, 299, -4, -247, 186, -201, 109, 252, -15, 500, -59, 291, 187, -33, 130, 79, -236, 168, 226, -98, 138, 32, -233, -482, 256, 31, -99, -16, -110, 228, 156, -351, 120, -156, -58, -24, 792, -411, 273, -10, 131, -246, -248, -122, -319, -444, -133, -201, -242, -427]
4332d27L89K07j60J84j75O0K37j40j48j10j39p1k69L80k5J65r7J98q8L33o64Q02
4354D42n90k86J54M78k17n49M51Q34j130O5K82o08N80p3n5n34K95M54r4J67m42
4375c76N83l11O40n15j68J33j58K91o16K68L34m0l09L4r1J01J48J3R8q85L89O99
4397B62q58M00q1K66J15j69m90P3P91j30O14q23M39m71p8J81j80PM09l93K95n60
4419c81K76J8L24j14L1K9n33M99j74m96O73L86p75M93J91j86K81L6l62j31j67
4440h2L04j75k85j58J41L7K85n59M48J05M37r23o13J253l24l79M42Q7J44k40l04
4461c59Q31r22K96l50P93o69J38K45k49l87K68J93M72k06K64k04n95N32J88k16
4481F3J40l83K44N19o44L58o25K45L44m83L84M3k50o40P01m59L11j30K84N16p43
$$ y = [-427, -38, 169, 9, 193, 18, 78, 315, 175, 27, -83, -222, -293, -562, -182, -207, -42, -139, 59, -29, 304, -360, 442, -148, -434, -280, 198, -19, -568, -117, 717, -413, -348, -66, -674, -94, -167, -222, -756, -461, -7, -101, 66, -376, 207, -104, 536, 21, -147, -14, -172, 119, -497, -229, 105, 65, -244, -210, -301, -200, -52, -39, 59, -826, -437, 262, -596, -196, -277, -11, 104, -65, -555, -482, 309, 179, 793, -30, 409, -62, -140, 41, -139, -132, 277, -116, 179, -381, -105, -87, 237, 123, 154, 183, -350, 149, -25, -521, 152, 538, -237, 256, 447, 261, 542, 578, 216, 85, -82, 222, 47, -238, -396, -255, -218, 67, -492, -44, 61, 498, -425, -1038, 215, -109, -488, -46, 41, 185, -55, -359, 472, -450, -154, -504, 289, -380, -242, 3, -246, -633, -365, -172, 300, 94, 358, 154, -441, 91, 279, 63, 203, -180, 64, 583, -61, 297, -328, -83, 261, -222, 162, 205, -45, -685, 16, -443, -132, -262, 22, 538, -205]
4502b05L17l34L88m70O44m14L2j04K73q1j23N06m35J62l53Q5M5j20jM1J18N3j24
4525a00K47j92J49q1k78K31j66J37j50K93j51l7J35j84k55L59j4k06J30j83K56
4546f0j05k14L47j1M3L4J16j49J39k4j13o6R5j04K40j1rM0l40L49j57J05j15Q3
4570A13J86m77J27J91k72n0L00Pj20K22l43K95k40P4J8J63j49j77M16j13j49j29
4592a07P3k75K14J23K3k05K78L5j7j36n7m5K32q6j83m2R6Q9k27J58j88J84m1j0
4616a14l3J87p8j34Q2NK2J21k04J07o0O8k3j39J22j6J61j66Q2n3K74k34J52l7
4640I2J12j05j63J62j01O2r5J82J7m9m5Q5k14K37k00M0J73PO0l20N7K31o3k4j40
4665bm5L3K27j01j86j0j28N5Q5J35j22o8J5J14O0j52N0k9K05k84K11J46k92m7
$$ y = [-205, 112, -222, 166, -304, 340, -74, -42, -146, 127, 46, -77, 429, -6, 156, -197, -112, -67, -187, -188, -147, -29, 24, -100, 147, -45, 104, 23, -255, -24, -190, -53, -203, 90, -61, -98, 37, -147, -402, -43, -57, -263, -133, -316, -60, -165, -379, -32, -43, 0, 34, 150, 1, 140, 116, 3, -63, 32, -72, 168, 157, 148, 188, -152, 197, 40, 145, 30, 113, 299, -178, -51, 140, -132, -182, 118, 125, 5, 227, -116, 179, -61, 13, 31, 194, 45, -132, 284, 171, 22, -107, -34, -309, -95, 28, 51, -154, 124, 159, 142, 6, -51, -96, 136, 50, -133, -175, -79, 10, -217, -59, -247, -63, -104, -114, -147, 40, -38, -172, -90, -85, -63, 58, -146, -39, -99, -31, -54, -193, -71, -87, 74, -92, -10, -63, 211, -23, 129, 92, 204, 99, -64, 98, -3, 59, -36, 146, 163, 114, 69, 154, -60, 177, -23, 17, 190, 197, 257, -63, -6, 225, 162, 138, -2, -47, -14, 213, 112, -74, -84, -212, -157, -72, 63, -59, -127, -112, 2, 62, -90, -40, -69, 136, -148, 63, 209, -83, -130]
4689a30R0r2J21m0R4N2k89p6J47n6n9J76J53k25J46k33K50J15l00L94k44J29k10
4712h7Q5O2J9J9j23N7j03J65K33j01j59j44K23O6j61K9q1O2M3J00j99K02L6k09
4736C4j47J77jJ28j5j83J85l01J08J21k26K23L5j87K5J89j70J94k09Nk38J65m7
4759a35PQ5N4L1J63l18J23k14K53l08K67k17J05J19n4J97k19M7m0k62L92j58j4
4782i6P6j60p7L66p3J7r1n2J52M9p2J08o7J27r4O3k08N3J59l2q8RJ12l88L00o6
4808B7L9O6j1j61j38J34L35j12r6J8K12k76j19m9J29qK4o5j18q0J16J06l11K89
4832d9j93L53k70J18lJ53j49R8P5j69N0j67Q3m7n8J3mO8P9P8k61k2n6L59q3j04
4858a08J90j52K75j97L2j1M2l41L82j09K26j73j18l3K22j48J8P0L3j47Q8R4j78
$$ y = [-130, -40, -132, -11, -51, 43, 95, -194, -270, -123, -179, -238, -62, 91, -134, 12, -221, 29, 144, -156, 238, -6, 123, -87, -2, 60, 79, 98, -25, 32, -71, 94, 327, 226, 67, -77, 146, 212, 51, 80, -1, 61, 104, 204, 5, 207, 243, 34, -113, 64, 63, 191, 176, -7, 178, -123, -15, 106, -120, 103, 138, -49, -24, 165, -5, 189, -20, -15, -253, -88, -135, -128, -43, 11, 42, 205, -113, 10, -204, 49, -259, 8, -209, -104, 15, -39, 158, -61, -14, -54, -316, 76, -82, -96, -20, -180, -257, 109, 36, 53, -38, -90, 62, 111, 39, 147, 80, 207, 113, 176, -32, 21, 180, 148, 60, 69, 181, -207, 93, 27, 66, 132, 121, -40, -178, -44, 291, 179, 83, 101, 313, 37, -82, -131, -2, -10, 14, -51, -169, -249, -133, -27, -338, -49, -242, 111, -159, -41, -44, 109, -40, 58, 133, -36, 14, -153, -70, -117, -175, -162, -166, -98, -19, 59, -202, -224, -280, 79, -4, -108, 82, -70, 205, 8, 40, 29, 71, -270, 112, 3, 229, 56, -62, -95, 127, -21, -3, 67, 100, -47, 41, 135, -43]
4881d3O9J15m2N3l2l43K98Lj87j53M40r6j01J68n0j02L7r7P3p8K36k73M25m51
4905a31L43k42n9L03j55j61J02P1j40J89m22L72Lj73J15j29J09M9m2Jp6k20M09
4928A16l44O3J80k61K67Ml01L09J61k86K50k69r3P0J39J28l15R2q1J84oJ06R8
4951B11k32J37P8N1j15k04K10J11j8m30J81L0K23l2j47J86k31n7j32J70k27K51
4973A4j26L16k79J04J3j37J08J38J33m03L12l29LO5J37q5p3R1k19P5J77O8j65
4996f2o4M00m89J89KJ56k29J7O4o4P1m7Q2oJ43j42O3N8J34k96j20K24m9j99K40
5021G6K38k79p7o6J20n2M9J55p2j79J31j02K83K5k07L4m4n7J15n6O6J4n1J80j88
5046E6k8P4P3j02K5Pl10L00j28J10k29N6k29L24J06o9L4O9m00K24j88L45o9j12
$$ y = [-43, 26, 141, 99, 152, 120, -223, 75, 78, -109, -262, 178, 82, -19, 149, 99, -3, 34, -63, 10, -68, 168, -105, 320, -131, 212, -30, -89, 214, 59, -102, 0, 71, -69, 120, -302, 70, 73, -100, 15, -114, -5, 44, 2, 3, -73, -293, 116, -228, -165, 15, -246, 21, 25, -276, 33, 194, -92, 158, -111, -204, -134, 5, 133, -182, -90, -171, 13, 7, 113, 211, -21, 116, 194, 245, 130, -74, 136, 247, 229, -201, -20, 10, 233, 201, 54, 240, 9, -48, -180, -10, -237, 14, -112, 204, -75, 29, 42, -95, 13, 151, 284, -119, 193, -136, -133, -68, 69, -16, -89, 2, -217, -142, 35, 103, -62, -126, 274, -215, -26, -24, 132, -97, -80, -16, -80, -9, -56, 26, 20, 163, 21, 84, 142, 276, -20, -140, 84, 35, -164, 76, 314, 35, -42, -108, 12, -40, 9, 164, 92, -87, 44, -58, 225, 250, 43, 77, 33, -24, 91, 35, 101, 115, 64, 244, 56, 28, 102, 175, 73, 98, 105, -205, 95, -33, 77, -152, -96, -325, -1, 105, 36, 70, 139, -261, -37, -225, 120, 51, -61]
5070f1l7J73k40K8q6O6QL79k62j0j11o9J70q1P9j06K61k90K25p1l5N8k37K42k65
5095b72M7K11m3j45L27p8j99L14J18j27o0P3l1l04J99L4N6l2l6RJ88l11R7j47
5119a12J11J21k2J21k21k2J06j27J8k62M12k83J49j8n5L51m16lJ02j43J0K47j44
5142h0j25K14Nj14qj11J28M6J27j76J02k78J15K50m8j25m2J02j04l6J00l50O04
5165A96k74q3J84j1n0N3l1N7pJ9k4l09L92k2M5p9J46j19q8m8L74k75J9M3p0O8
5191A06L1K9k04M5J25o4K01l26m9JJ24O7O2k52J23j95L21L3l19r5J22M9K5M9k6
5216a7J95j37J26q5k12J10o9J92r5k79L98j19l1J6j71N4J37N7j61K97l64Q8j26
5239a96J33j3rJ07lqK88m43L84j99J62j67M24j46o01J20L48o2N61J33r63J29J98
$$ y = [-61, -98, 75, -165, -137, -223, -157, -149, 230, -32, -42, -153, -222, -52, -133, -54, -160, 101, -189, 36, -35, -70, -12, -249, -7, -272, -225, -14, -57, -202, 125, 47, -152, 162, 280, 153, 93, 166, 135, -169, 30, 64, 120, 88, 52, 61, 249, -62, 35, -112, -1, 120, 98, 219, -2, -24, 82, -45, -27, -289, 123, -160, -11, -29, -84, 267, -149, -152, -50, -193, -183, 64, -80, -205, 9, 14, -100, -108, -219, -91, -45, 82, -94, 8, -270, -155, 95, 47, -78, -120, -18, -122, -158, -58, -408, 196, -78, -161, 23, 12, -38, 15, -16, 41, 34, 53, 29, -280, 112, 90, 135, 56, 202, 83, -5, -53, 321, 46, 65, 108, 38, 106, 137, 166, -38, 7, 132, 68, 269, -57, -106, -105, 19, 86, 148, -104, 19, -176, 145, 178, -141, -236, -114, -65, -40, 9, -17, 178, 41, 167, 82, -130, -20, -89, 103, 8, -271, 127, 8, -23, -7, -178, -124, 13, 70, -91, 206, -158, -70, -196, -63, -76, -85, 22, 19, 11, 299, -144, 240, 41, 203, 36, 460, 314, -287, -167, 181, 119, 680, 813, -150, -21, 177]
5262A77j97J03j85J73p4j14L4j24M06n84P03m60M43l17J56k01j8L65r5k22J95
5283A64j87O5l7K9l03M67l43Q8L38r03N70K92j07q82J168n99K60k44q9l72N25
5304a00l00n8j39Q36o00KP59p44O18m54M07j74o9q4J59j89K48J16j97k5j66J65
5326A1j63M6J26m6j5J84J14j66j4j50J23j0L6lj23O0pK47j90J8j75Q6m3R6k68
5351b26R5P4j5R9NL6j05R3q2Qj08J36l3O3n2ok00J13K61k13K02j82J35l11j2J47
5377g8M7J00O6r1k56J31J46nk57O2j27P0L9K89k7k82r8J12J5K63J68q0q6M0j68
5402gJ95k17J16j54K23K03k66j01J71q2O3j37J27P2j96j8J31k17J17p4P9j15m
5425i1Q2m8K2J65k20P1K2p5J37j81K92m9p8k85N69k91j87j25N86k06k18L15K6
$$ y = [177, -20, 83, -102, 71, -3, -117, -83, -207, 199, -385, 318, -142, 301, -16, 140, -61, -79, 286, 191, -31, 164, -23, 42, 5, 34, -269, 198, -145, -57, 281, -622, -52, 240, 133, -749, 419, -180, 80, -164, -253, -625, -100, -400, -458, -597, 239, -361, -359, 400, -344, 274, -180, 227, 53, -16, -100, 59, -130, 118, 234, 37, 12, -154, 11, -152, -106, 20, -26, -41, 143, 257, 91, 77, -73, 50, 40, 76, 73, -50, 10, 3, 250, 60, 78, -97, -11, -54, 42, -226, -131, -57, -72, 27, 32, 68, -37, 56, -26, -18, -126, 10, -23, 40, -12, -18, -218, -105, 156, -57, 145, -37, 98, -213, -225, -78, -31, 69, 135, 44, -212, -81, 65, 60, -197, -135, -262, -192, -153, 136, 109, -173, -271, -159, -144, 119, 287, 207, 121, 161, -7, 188, -29, 87, -67, 156, 359, 93, -8, 163, 81, 144, 7, 134, 206, 10, -8, 123, -94, 23, -51, 28, -87, -91, -9, -57, -35, 130, -90, -19, 3, -72, 65, -116, 176, 127, 49, -236, 333, 42, -145, -270, 316, 110, -108, 207, 233]
5448B33m95l7J33Q5P31n52N01j437Q63J60p9l48k87K13N01m62M64J04k83k29L73
5469A52j31k97M46r5j64J36N3r6L2l1k32J7M75k1j88pj7J49q5R6j45J36l08K93
5493A68j82k4N3k1k58K63J00k12K42j21J03j12m7q7Q8J49n5J25l75P6M0L30k60
5516a7k4j29P3Q6J21j4q3P5r6N3j82n5J00J89j21L8K45k20k31O4L6J16j35K57
5540A46k84K9K19l9J5k62Q6Lq4K22k36J51J11j5j73M80m55J6Q5o1L99k99P2L8
5564A64m9k73J34J20O6l3Q4k36P0K15j3k82P1j49N2k1J36o0p6J38O3k50K34j52
5588d7K15k08K00r3n3j88K0K0n8L31j11l38J42O2Q4N4N9k42J44Q6k03OL22l44
5612a40R2r4J17Rn3J25j74L67l51RO6O5K05l45k6o1J81j9k42K38J73k17J16k80
$$ y = [233, -262, -299, -166, -81, 650, 98, 599, -838, 25, 185, 106, -242, -529, -316, 185, -277, 187, 291, 8, -221, 152, 21, -276, 170, 75, -89, 47, 100, 4, 36, 5, -227, -210, 265, 244, 56, 49, 32, 181, 96, 192, 47, 183, -125, 168, -14, -38, 15, -6, -264, -1, 99, -113, 129, 8, 111, -1, -48, -135, -47, 102, 47, 172, -203, -127, -87, 243, -17, -41, -170, -97, -11, 110, 96, 13, 88, -8, 45, -137, -192, -92, 97, -24, 14, 259, 39, -192, -128, -92, 24, -111, 146, -138, -109, 110, 71, 86, -176, -90, -87, -171, 51, -185, -34, 77, 62, -111, 369, -86, -70, 15, -46, 353, 54, 126, 164, 115, -158, -24, 96, 162, 129, 213, -23, 47, 262, 249, -33, 38, -111, -59, -80, 56, -4, -80, 58, 121, -129, 105, -47, 168, -40, 160, 67, 14, -174, -154, -134, -192, 139, 28, -310, -168, -106, -22, 32, 91, -151, -7, 79, -124, -118, 204, -140, -48, -142, -25, -16, -69, 56, -118, 249, -102, -93, -27, 38, 243, -102, -128, -189, -8, -27, -269, -31, 142, -75, 41, -239]
5636b39K31k26L25k58K59L9j88P9lJ0rk48K16m7J04oP5O3j27j93Rk5rM09k74p9
5662a12j1P2K53k17J22nj39m6L0n3J51p0J27k70m2L79l02J36Q9j38r2r2J00o4
5686a94J67R5p7j58P8M3O1k83K55K13j48n3J55P8k65l7Q0M0l16M51k16J0%K44
5710B23j65lJ20j97L2Kj66oK06n1L9ll7j15J11M1j53K51Km4J38l8j85m9k01K67
5736A9M3k5j42k3J56K4Q1r0k08J87J11l4j75O5j06J85j78L51j80j70M7L6nL5p9
5761g5J06k01L41k35K15l77N2K60J5l27J04J20k56L60q6N6q6P8M1J92j82M5j00
5784F0K7j62L0j56L82l64L08j4j82L5L56k88j66K36j21K96k0k39k1P9l83L96j84
5807i5M8J82l66J82O0J1m4J73j73q9p5jJ77k8J58r8R4j3q8j05k8m5J16q2J67p
$$ y = [-239, -8, -234, 91, -167, 92, 131, -57, 22, 19, 29, 20, -228, -12, -59, 45, 39, 114, 177, 50, -143, -134, -159, -168, 241, -33, -112, -123, -51, 202, -15, 107, 102, -37, -83, -53, -106, 45, -25, 102, -168, -210, 169, -133, 3, 92, -46, -138, -230, -130, -194, -27, 68, -9, -167, -89, -46, 15, -268, -13, 200, 52, -1, 154, 232, -33, -70, 10, 50, -266, 185, -31, -21, -21, 223, 58, 55, 175, -22, 10, 12, -154, -160, 46, -5, 34, 31, -6, -121, -10, 31, -122, 129, 131, 87, 225, 187, 2, -47, -248, 19, 62, 37, -105, -128, 28, 52, 133, 43, -165, 22, 133, 99, -76, -11, -117, 68, -110, 241, 61, -109, -62, -26, -31, 4, -75, 31, -170, 171, -64, 151, -226, -174, 86, 101, -226, -122, -2, -258, 102, 16, 72, -14, 64, 105, 297, 115, 160, 60, 87, -75, -45, -201, 181, -183, 125, 111, -71, -36, 320, 32, -134, 102, -19, 277, 257, 18, -3, 76, -307, 89, -95, -47, 135, -231, -49, 11, 22, -22, 151, -22, -111, -186, -187, -10, -38, 120, 22, 116, 103, 15, -90, -118, -163, -47, -129, 38, 31]
5833C1j21Q5J33q6j6p8P5l09K92Pj8j16Q7J57N3j69L9K9l5k02J17J23j38O6J80
5858A86J0j18L7p2k7K5J13j10o3J01O5L17k97l43J10M10l45J5J15m7j91P8L05
5881B74k56l2R2l09K32J14j35k20M31j95j37j62K79p1K48r1K78l34Kk18L3K71
5903I4j85Lq8J28j19L9P8j6k6J75j70J64K9j46J44k42K10O9k17O8j08K07j45j13
5927a67L63l36K22l8O6k04N1RM3m6L3J34K0k72k3K69j09J23m08K27L3K26q5k22
5951i1K13j17j14l9R1P6N8j06JO1j08J18p1O2r5P9k1j90J71nj71J25n1J84P2r0
5977D2k24J27J62j05J14j22o8L08l64J67n5O3j04J78k59K9J18m4Q8j24J21J7K
6000F7P8k39J3j25K67q8J11q7o8K86k18j59J13R5m8L2j47J15r1J94k67J34J26
$$ y = [31, -90, -5, 128, 42, 26, -52, 23, -286, 6, 13, -5, -121, -34, 123, 176, 7, 46, 75, 40, -162, -45, 78, -60, 6, 186, 196, 78, 115, 43, 16, 41, 154, 44, -19, 82, 147, 464, 167, -176, -66, 344, -1, 14, 129, 82, -109, -31, 274, 18, -14, 78, -231, 1, 115, -20, -240, 191, -4, -141, -303, -24, -95, 153, 62, 340, 6, 8, -210, -177, 94, -91, -88, -176, -48, -167, -128, -50, -66, -92, 83, -87, 77, 106, -40, 104, -138, 72, 141, -76, -8, -116, 91, -54, -167, 196, -140, 82, 44, 110, -94, -43, -34, 9, -37, -4, 130, 150, -122, -145, 124, 15, 138, -270, -43, -10, 216, 131, -91, 122, 5, -109, -148, -57, 19, 77, -29, -28, 33, -75, 43, -28, 34, -61, 18, -3, -193, -22, -27, -198, -73, -124, 60, 132, 42, -182, -55, 107, 2, 116, -6, -74, 234, -130, 37, -18, 45, -59, 119, -140, -111, 7, -37, 51, -73, 48, 65, 67, 145, -94, -81, -206, 61, -27, 84, -3, -71, 215, -3, -162, -49, 46, -2, 30, -117, -2, -93, 101, -166, -32, 94]
$$ [...]
8191g8
##END NTUPLES=NMR FID
##END=
