##TITLE=1H_L3L30-SeO2-f10
 CDCl3,32 sc, 
 5.02.2021
##JCAMPDX= 6.0         $$ Bruker NMR JCAMP-DX V2.0
##DATA TYPE= NMR FID
##DATA CLASS= NTUPLES
##ORIGIN= UXNMR, Bruker Analytische Messtechnik GmbH
##OWNER= root
$$ XWIN-NMR		Version 3.5
$$ Fri Feb  5 10:40:53 2021 Russian Standard Time (UT+4h)  she@DPX200
##.OBSERVE FREQUENCY= 200.1315066352
##.OBSERVE NUCLEUS= ^1H
##.DELAY= (6, 6)
##.ACQUISITION MODE= SIMULTANEOUS
##.ACQUISITION SCHEME= undefined
##.AVERAGES= 8
##.DIGITISER RES= 18
##SPECTROMETER/DATA SYSTEM= spect
##.PULSE SEQUENCE= zg30
##.SOLVENT NAME= CDCl3
##.SHIFT REFERENCE= (INTERNAL, CDCl3, 0, 15.7039)
##AUDIT TRAIL= $$ (NUMBER, WHEN, WHO, WHERE, WHAT)
$$ ##TITLE= Audit trail, XWIN-NMR		Version 3.5
$$ ##JCAMPDX= 5.01
$$ ##ORIGIN= Bruker BioSpin GmbH
$$ ##OWNER= she
$$ F:/spectra/data/she/nmr/H-F/1/audita.txt
$$ ##AUDIT TRAIL=  $$ (NUMBER, WHEN, WHO, WHERE, WHAT)
(   1,<2021-02-05 10:39:40.31 +0400>,<she>,<DPX200>,
      <created by zg, POWCHK disabled, PULCHK disabled
       configuration hash MD5:
       00 E9 B6 7A A2 85 ED C7 34 08 36 98 17 FE 4E 26
       data hash MD5: 16K
       3E 52 5E 23 80 94 24 90 00 3D 13 31 6A 28 73 A3>)
$$ ##END=
$$ 
$$ hash MD5
$$ D5 4D 96 B0 07 2E 04 09 86 2C 60 F5 1B F6 B0 9D
##$RELAX= 
##$RELAX= 
##$RELAX= 
##$RELAX= 
##$RELAX= 
##$RELAX= 
$$ Bruker specific parameters
$$ --------------------------
##$DU= <F:/spectra>
##$EXPNO= 1
##$NAME= <H-F>
##$PROCNO= 1
##$TYPE= <nmr>
##$USER= <she>
##$AMP= (0..31)
100 100 100 100 100 100 100 100 100 100 100 100 100 100 100 100 100 100 
100 100 100 100 100 100 100 100 100 100 100 100 100 100 
##$AQSEQ= 0
##$AQ_mod= 1
##$AUNM= <au_zg>
##$AUTOPOS= <>
##$BF1= 200.13
##$BF2= 200.13
##$BF3= 200.13
##$BF4= 200.13
##$BF5= 200.13
##$BF6= 200.13
##$BF7= 200.13
##$BF8= 200.13
##$BYTORDA= 1
##$CFDGTYP= 0
##$CFRGTYP= 5
##$CHEMSTR= <none>
##$CNST= (0..31)
1 1 145 1 1 1 1 1 1 1 1 1 1 1 1 1 1 1 1 1 1 1 1 1 1 1 1 1 1 1 1 1 
##$CPDPRG= <>
##$CPDPRG1= <>
##$CPDPRG2= <>
##$CPDPRG3= <>
##$CPDPRG4= <mlev>
##$CPDPRG5= <mlev>
##$CPDPRG6= <mlev>
##$CPDPRG7= <mlev>
##$CPDPRG8= <mlev>
##$CPDPRGB= <>
##$CPDPRGT= <>
##$D= (0..31)
0 1.2 0 0 0 0 0 0 0 0.06 0 0.03 0 0 0 0 0.0002 0 0 0 0 0 0 0 0 0 0 0 0 
0 0 0 
##$DATE= 1612507179
##$DBL= (0..7)
120 120 120 120 120 120 120 120 
##$DBP= (0..7)
150 150 150 150 150 150 150 150 
##$DBP07= 0
##$DBPNAM0= <>
##$DBPNAM1= <>
##$DBPNAM2= <>
##$DBPNAM3= <>
##$DBPNAM4= <>
##$DBPNAM5= <>
##$DBPNAM6= <>
##$DBPNAM7= <>
##$DBPOAL= (0..7)
0.5 0.5 0.5 0.5 0.5 0.5 0.5 0.5 
##$DBPOFFS= (0..7)
0 0 0 0 0 0 0 0 
##$DE= 6
##$DECBNUC= <off>
##$DECIM= 32
##$DECNUC= <off>
##$DECSTAT= 4
##$DIGMOD= 1
##$DIGTYP= 9
##$DL= (0..7)
0 120 120 120 120 120 120 120 
##$DP= (0..7)
150 150 150 150 150 150 150 150 
##$DP07= 0
##$DPNAME0= <>
##$DPNAME1= <>
##$DPNAME2= <>
##$DPNAME3= <>
##$DPNAME4= <>
##$DPNAME5= <>
##$DPNAME6= <>
##$DPNAME7= <>
##$DPOAL= (0..7)
0.5 0.5 0.5 0.5 0.5 0.5 0.5 0.5 
##$DPOFFS= (0..7)
0 0 0 0 0 0 0 0 
##$DQDMODE= 0
##$DR= 18
##$DS= 0
$$ [...]
##$SUBNAM2= <"">
##$SUBNAM3= <"">
##$SUBNAM4= <"">
##$SUBNAM5= <"">
##$SUBNAM6= <"">
##$SUBNAM7= <"">
##$SUBNAM8= <"">
##$SUBNAM9= <"">
##$SW= 16.9725356469052
##$SWIBOX= (0..15)
0 0 2 0 0 0 0 0 0 0 0 0 0 0 0 0 
##$SW_h= 3396.73913043478
##$TD= 16384
##$TD0= 1
##$TE= 0
##$TE2= 300
##$TE3= 300
##$TEG= 300
##$TL= (0..7)
0 120 120 120 120 120 120 120 
##$TP= (0..7)
150 150 150 150 150 150 150 150 
##$TP07= 0
##$TPNAME0= <>
##$TPNAME1= <>
##$TPNAME2= <>
##$TPNAME3= <>
##$TPNAME4= <>
##$TPNAME5= <>
##$TPNAME6= <>
##$TPNAME7= <>
##$TPOAL= (0..7)
0.5 0.5 0.5 0.5 0.5 0.5 0.5 0.5 
##$TPOFFS= (0..7)
0 0 0 0 0 0 0 0 
##$TUNHIN= 0
##$TUNHOUT= 0
##$TUNXOUT= 0
##$USERA1= <user>
##$USERA2= <user>
##$USERA3= <user>
##$USERA4= <user>
##$USERA5= <user>
##$V9= 5
##$VALIST= <valist>
##$VCLIST= <CCCCCCCCCCCCCCC>
##$VD= 0
##$VDLIST= <DDDDDDDDDDDDDDD>
##$VPLIST= <PPPPPPPPPPPPPPP>
##$VTLIST= <TTTTTTTTTTTTTTT>
##$WBST= 1024
##$WBSW= 4
##$XGAIN= (0..3)
0 0 0 0 
##$XL= 0
##$YL= 0
##$YMAX_a= 148503
##$YMIN_a= -183284
##$ZGOPTNS= <>
##$ZL1= 120
##$ZL2= 120
##$ZL3= 120
##$ZL4= 120
##$ABSF1= 10
##$ABSF2= 0
##$ABSG= 5
##$ABSL= 3
##$ALPHA= 0
##$AQORDER= 0
##$ASSFAC= 0
##$ASSFACI= 0
##$ASSFACX= 0
##$ASSWID= 0
##$AUNMP= <proc_1d>
##$AZFE= 0.1
##$AZFW= 0.1
##$BCFW= 1
##$BC_mod= 2
##$BYTORDP= 1
##$COROFFS= 0
##$CY= 11.3945322036743
##$DATMOD= 1
##$DC= 2
##$DFILT= <>
##$DTYPP= 0
##$F1P= 15.9154993809931
##$F2P= -4.1035820241983
##$FCOR= 0.5
##$FTSIZE= 0
##$FT_mod= 4
##$GAMMA= 1
##$GB= 0.15
##$INTBC= 1
##$INTSCL= 1
##$ISEN= 128
##$LB= 0.24
##$LEV0= 0
##$LPBIN= 0
##$MAXI= 10000
##$MC2= 0
##$MEAN= 0
##$ME_mod= 0
##$MI= 1.114404
##$NCOEF= 0
##$NC_proc= 0
##$NLEV= 6
##$NOISF1= 3.799351
##$NOISF2= 2.8
##$NSP= 1
##$NTH_PI= 0
##$NZP= 0
##$OFFSET= 15.70392
##$PC= 1
##$PHC0= -10764.53
##$PHC1= 18.80094
##$PH_mod= 1
##$PKNL= yes
##$PPARMOD= 0
##$PSCAL= 0
##$PSIGN= 0
##$REVERSE= no
##$SF= 200.130013532006
##$SI= 16384
##$SIGF1= 3
##$SIGF2= 2
##$SINO= 400
##$SIOLD= 16384
##$SREGLST= <1H.CDCl3>
##$SSB= 0
##$STSI= 0
##$STSR= 0
##$SW_p= 3612.71676300578
##$SYMM= 0
##$S_DEV= 0
##$TDeff= 0
##$TDoff= 0
##$TI= <>
##$TILT= no
##$TM1= 0
##$TM2= 0
##$TOPLEV= 0
##$USERP1= <user>
##$USERP2= <user>
##$USERP3= <user>
##$USERP4= <user>
##$USERP5= <user>
##$WDW= 1
##$XDIM= 8192
##$YMAX_p= 0
##$YMIN_p= 0
$$ End of Bruker specific parameters
$$ ---------------------------------
##NTUPLES= NMR FID
##VAR_NAME=  TIME,          FID/REAL,        FID/IMAG
##SYMBOL=    X,             R,               I
##VAR_TYPE=  INDEPENDENT,   DEPENDENT,       DEPENDENT
##VAR_FORM=  AFFN,          ASDF,            ASDF
##VAR_DIM=   8192,          8192,            8192
##UNITS=     SECONDS,       ARBITRARY UNITS, ARBITRARY UNITS
##FACTOR=    0.0002944,     1,               1
##FIRST=     0,             0,               0
##LAST=      2.4114304,     0,               0
##MIN=       0,             -183284,         0
##MAX=       2.4114304,     148503,          0
$$ Real data points
##PAGE= N=1
##DATA TABLE= (X++(R..R)), XYDATA
$$ [...]
2032b92J074Q51k415J229j06q08J516n66j28J9m72N1q77J054j95n17J518j511
$$ -292 782 1633 -782 447 341 -467 1049 483 355 374 -98 -47 -924 130 -65 -582 936 -575
2050e75L26Q25k358R86O46j624J978l80o28J297q71m62J64l16L27r7P00o65k82
$$ -575 -249 576 -1782 -796 -150 -1774 204 -176 -804 493 -378 -840 -676 -992 -665 -762 -62 -727 -1009
2069a009J212j456L03J277j788J567Q13j950J437o45q01Q81l12K22K24J89O21
$$ -1009 203 -1253 -950 327 -1461 106 919 -1031 406 -239 -1040 -159 -471 -249 -25 164 785
2086G85p73J004o06j209K036j104n53K124k151P23J142k136J792j94q68J360n55
$$ 785 12 1016 410 -799 1237 133 -420 1704 -447 276 1418 -718 1074 880 12 1372 817
2103H17l18L52m70O74j211J42J063j495J365j69j080J923j661m5R81j689J681
$$ 817 499 851 381 1055 -156 -14 1049 -446 919 750 -330 1593 -68 -113 868 -821 860
2120H60o61r11J404j171J68O10j174P75R9o01Q05n93K81k42n28N29n87L64N74
$$ 860 199 -712 692 -479 -311 299 -875 -100 -1 -602 203 -390 -109 -351 -879 -350 -937 -573 1
2139Ar39J130k75j460J629j174j16J133m07K82M33o84J74m60N36j61q3J000j124
$$ 1 -938 192 -83 -1543 86 -1088 -1204 -71 -478 -196 237 -447 -273 -733 -197 -358 -441 559 -565
2158e65P71O94j975J264K12j342K106o98o77J644j087k25N2j80M8k45J105k47
$$ -565 206 900 -1075 189 401 -941 1165 467 -210 1434 347 122 174 -6 42 -203 902 655
2176F55m15J248j574J5J503j786P72M42j391J485k59j219J127r99L26M66l42R42
$$ 655 240 1488 -86 -71 1432 -354 418 860 -531 954 695 -524 603 -396 -70 396 54 996
2194I96r16L37J50j609J288o18o99J314j016N12R12j457L93P0p39R49q11Q65K72
$$ 996 80 417 567 -1042 246 -372 -1071 243 -773 -261 651 -806 -413 -343 -1082 -133 -944 -79 193
2213A93j222J077q19l8R59j470P88M93o34Q08l96l56N25n56R26o12J06J025j181
$$ 193 -1029 48 -771 -809 150 -1320 -532 -39 -673 135 -261 -617 -92 -648 278 -334 -228 797 -384
2232c84N14O22j542J251l20o09J174j96L61j3n40J76m37M20K79j123J308o2r80
$$ -384 130 752 -790 461 141 -468 706 510 871 858 318 494 57 477 756 -367 941 879 -101
2251a01J353r81j37R22j295Q44L67q10N25o37p2K73m59Q12o83L7Q20j392R94Q0
$$ -101 1252 271 134 1056 -239 605 972 162 687 50 -22 251 -208 604 -79 -42 778 -614 380 460
2271D60j326J215p00k83J065j098J24K63k06M54q68P87P5j162J688j141o55J829
$$ 460 -866 349 -351 -634 431 -667 -543 -280 -486 -32 -900 -113 -38 -1200 488 -653 -1308 521
2289E21j693L23Q53j228J023n8o43N56o0J5O0m39R95p30L97N80j501J281m30p88
$$ 521 -1172 -849 4 -1224 -201 -259 -902 -346 -406 -391 -331 -770 225 -505 -108 472 -1029 252 -178 -966
2309i66J703q63L0J182j120P15k35m81P82o12N24N7m84N42n48j51Q20j074M65
$$ -966 737 -126 -96 1086 -34 681 446 -35 747 135 659 716 232 774 226 75 895 -179 286
2328B86O95p93R75r24nL19m30L85q4m54O75n76L08J02j114P12l5m29R34p55L66
$$ 286 981 188 1163 239 234 553 123 508 424 -30 645 69 377 479 -635 77 42 -387 547 -208 158
2349A58k78l73N11r68M84L05j003J322k69j138J733j091l83J212j175P23m5k87
$$ 158 -120 -493 18 -950 -466 -161 -1164 158 -111 -1249 484 -607 -990 222 -953 -230 -275 -562
2367e62K65k31J08r1k63O15o15L99J017j165Q72R2j383J185n18l60J182r61M02
$$ -562 -297 -528 -420 -511 -774 -159 -774 -375 642 -523 349 441 -942 243 -275 -635 547 -414 -12
2386a2M99o11P57m83N0J89p61J410m81p07J039r16J73N29r45Q52r5l24Q99n42
$$ -12 487 -124 633 150 200 389 -372 1038 557 -150 889 -27 146 675 -270 582 487 163 1062 520
2406E20m3K86q87N45m39j08Q12r07M93J5r65J264o20m17N63o52P20k30n52O52
$$ 520 477 763 -124 421 -18 -126 686 -221 272 287 -678 586 -34 -451 112 -540 180 -50 -602 50
2426E0m55j84O19q87Q32l48k18O22p93M21K72n62M05m55J12M17o72N25n5o52J151
$$ 50 -405 -589 30 -857 -25 -373 -591 31 -762 -341 -69 -631 -226 -681 -569 -152 -824 -299 -354 -1006 145
2447A45o52O1N15o62O65j66m67J129r97L68R4l02M73n35K22R17j038Q18J64r60
$$ 145 -507 -446 69 -593 72 -94 -561 568 -429 -61 33 -269 204 -331 -109 808 -230 588 752 -208
2467b08J057l24p23J067o28J09J97l28M03l56M06ln41P43m67k33Q29j036M55J30
$$ -208 849 525 -198 869 241 350 547 219 622 266 672 669 128 871 404 171 1000 -36 419 549
2487E49p02N63n5o81Q99m78K14j84m36M09k95r4N12n96O72o88J01L46p49N34K11
$$ 549 -153 410 355 -326 573 95 309 125 -311 98 -197 -291 221 -375 297 -391 -290 56 -693 -159 52
2508E2q11R61m69o45J397j248L40M50r16R69k50m24O00o86L21r1j51M43m38K99
$$ 52 -759 202 -267 -912 485 -763 -423 27 -889 80 -170 -594 6 -680 -359 -450 -601 -158 -596 -297
2528b97M67q89J197l12m12N61q64M41L44m61M40o9Q8N48o84R4M11n81N63o04J27
$$ -297 170 -719 478 166 -246 315 -549 -108 236 -225 215 146 234 782 98 192 603 22 585 -19 108
2549A08P96r77P35J1q55O37j04j05P62o57L7j13k69J24m97M59R3n87R65l67l51
$$ 108 904 -73 662 673 -182 455 351 246 1008 351 388 275 6 130 -367 92 185 -402 563 196 -155
2570a55N98p88L32J07q67P19m46K06K90n32M07rn97Q37p45K34L85p01M32j44l47
$$ -155 443 -345 -13 94 -773 -54 -500 -294 -4 -536 -129 -138 -735 102 -643 -409 -24 -725 -293 -437 -784
2591g84O27l89kL97l37N98j72r3J99o16M37J78o19N52L4K4N31n46M62L9o96O54
$$ -784 -157 -546 -548 -151 -488 110 -62 -155 44 -572 -135 43 -576 -24 10 34 565 19 481 520 -176 478
2613D78n53J76L05p40J113l24l21R60j007N6P96o58K21J59l57J07j09L08n99K04
$$ 478 -75 101 406 -334 779 455 134 1094 87 143 939 281 502 661 304 411 302 610 11 215
2633B15P42r85N08L82j201Q71k05q82Q40l81k34P57n55M9K39m30O3o5M29o29J5
$$ 215 957 -28 480 862 -339 532 327 -555 285 -96 -330 427 -128 -79 160 -270 -207 -272 157 -472 -457
2654d57O43q44K12M63j144J058N6p63P09j41m56O76l98Oj39p1N30o70P05L1n80
$$ -457 186 -658 -446 17 -1127 -69 -13 -776 -67 -208 -664 12 -386 -380 -519 -590 -60 -730 -25 6 -574
2675e74Q82n33O0M98q70K77M13o19Q76l31l44P23l97L12J3m74M32j28o0K12l13
$$ -574 308 -225 -165 333 -537 -260 153 -466 410 79 -265 458 61 373 386 -88 344 216 156 368 55
2696E5L76k17mO12p02L06K27p45R71p43l65J116r17L8O85q52N17J89m01J38Q9
$$ 55 431 214 210 822 120 426 653 -92 879 136 -229 887 -30 8 693 -159 358 547 146 284 373
2717C73m03l8k6K38n38N73L99j591J314m97n96J360q21k90P30o66J50K90n27K44
$$ 373 -30 -68 -94 144 -394 179 578 -1013 301 -196 -792 568 -253 -543 187 -479 -329 -39 -566 -322
2737c22j7k0j87L09M75q97M82L40r44O89j61j010J470l62o34J148k59j36R0j99
$$ -322 -339 -359 -546 -237 238 -659 -177 163 -781 -92 -253 -1263 207 -155 -789 359 100 -36 54 -145
2757a45J00L8J1L2m4P28p75K5P72r06P26J98q15R63k08n99O35q53J18L07n98O32
$$ -145 -45 -7 4 36 -8 720 -55 -30 742 -164 562 760 -55 908 700 101 736 -117 1 308 -290 342
2779C42K82O6j63m0j81l90M1R5k17N21j77m21P72q64K27O59r87K46N34o73J61
$$ 342 624 690 527 487 306 -84 -43 52 -165 356 179 -242 530 -334 -107 552 -435 -189 345 -328 -167
2800a67K71p74M71p6l16N03j94L03p10R78n21n85Q05n87m1P72q74K98R03j410
$$ -167 104 -670 -199 -275 -591 -88 -282 21 -689 289 -232 -817 -12 -599 -640 132 -742 -444 459 -951
2820i51Q73J31o83M44k5j13J47J75j89j04M68J7n34R97n46k45Q95p74K51N21j247
$$ -951 -78 53 -630 -186 -211 -324 -177 -2 -191 -295 173 190 -344 653 107 -138 757 -17 234 755 -492
2841d92P35M05q15P57l7k59K19K65l90l20L05n6n43Q88m63j89P73n76j43O59p34
$$ -492 243 648 -167 590 553 294 513 778 388 68 373 317 -226 662 199 10 783 207 64 723 -11
2862a1J81K37n79L21N1l62QK69j52L9K80j36l21M44m81r1L44m95Q4M61p70M02
$$ -11 170 407 -172 149 200 -162 -154 115 -37 2 282 146 -175 269 -212 -303 41 -454 -370 91 -679 -277
2884b77M82q09N05o5k01M08o4o99J98K15j71J51K42j29J65M49n33l76Q02p24K93
$$ -277 205 -604 -99 -164 -365 43 -21 -720 -522 -307 -478 -327 -85 -214 -49 400 -133 -509 293 -431 -138
2905a38N12j083R97K5o40N98k93p1N12j71R4j68K42l50l77N88j11j73M86n50M49
$$ -138 374 -709 288 313 -327 271 -22 -93 419 248 342 174 416 66 -311 277 166 -7 479 -71 378
2926C78L75p73N09k04p03P13j46k87O99o87P3K62j45Mk04M39l20l6M79o79K30
$$ 378 753 -20 489 285 -418 295 149 -138 561 -126 -53 209 64 68 -136 303 -17 -53 426 -253 -23
2947b3J76q32N88J21o10Q26j21k96J97n80J38Q4m7m3o3N33k59K44j20j68NJ48
$$ -23 153 -679 -91 30 -580 246 125 -171 26 -554 -416 -332 -379 -422 -485 48 -211 33 -87 -255 -250 -102
2969a02n25M20M46q65P03o30N0N53k26p3M50J21j66J07j52j04j80K78l29L64K78
$$ -102 -627 -207 239 -626 77 -553 -503 50 -176 -249 201 322 156 263 111 7 -173 105 -224 140 418
2990D18k10J01K40p02N95q9p1L08m15J8M51m61Nl3K7L3k27R29n57j90K23o70M36
$$ 418 208 309 549 -153 442 353 282 590 175 193 644 183 188 155 182 215 -12 917 360 170 393 -277 159
3013A59O7o97P07j37r5K96m63j32L15l49L95l21j51N4j50L75k65j02L90o43L70
$$ 159 226 -471 236 99 4 300 -163 -295 20 -329 66 -255 -406 -352 -502 -127 -392 -494 -104 -747 -377
3034c77M52m37L11n36OM06m37p9M75l84N39M9k07M5j15j1K18j42J61o8K32j07
$$ -377 75 -362 -51 -587 -581 -175 -612 -691 -216 -600 -61 -12 -219 -174 -289 -300 -82 -224 -63 -131 101 -6
3056fk11L85n1m87J069m45l12O76p07L61J41m40K82Q3J75l9m9q9k50R2m2k26L82
$$ -6 -217 168 117 -370 699 254 -58 618 -89 272 413 -27 255 338 513 474 425 336 86 178 136 -90 292
3079B92J05n23N92k51l7L37m62K25J01j90K37m29K37m30m2M24l81K69L82m37O1
$$ 292 397 -126 466 215 178 515 53 278 379 189 426 -3 234 -196 -238 186 -195 74 456 19 80
3100H0L5j54J23m00N9M1j99K81jk56O94p16N5K98m26K98Q5l01L14m79L77J39j74
$$ 80 115 -39 84 -316 -257 -216 -415 -134 -135 -391 303 -413 -358 -60 -486 -188 -103 -404 -90 -569 -192 -53 -227
3123b27J05J51L2K31k31J59k48n33O72r8j84P14l82J38K58o02K55m2j49K25k0
$$ -227 -122 29 61 292 61 220 -28 -561 111 13 -171 543 161 299 557 -45 210 168 19 244 224
3144B24K13k3j47J91n75M07J7m51O30P4m28K51j07l87J90j34P3m9K04p9J59j40
$$ 224 437 414 267 458 -117 290 307 -144 486 560 132 383 276 -111 79 -55 18 -31 173 94 253 113
3166A13j95j79N73o88J40M38l67L57l20p6K23l96P9Q5j02K39m18r1L70m57M74
$$ 113 -82 -261 312 -376 -236 202 -165 192 -128 -204 19 -377 -298 -213 -315 -76 -494 -585 -215 -672 -198
3187a98Q4j87K36J06l39J82l19N59n05n4N04m86L60l3j98K96l3k56N94l14l28
$$ -198 -114 -301 -65 41 -298 -116 -435 124 -381 -435 69 -417 -57 -90 -288 8 -25 -281 313 -1 -329
3208c29N31j77k36M08l33M20p9J85j62L8Lm22M05K31o59N73%l58K98O5k36N9O6
$$ -329 202 25 -211 197 -136 284 205 390 228 266 269 -153 252 483 -176 397 397 39 337 402 166 225 291
3231B91k25J27K14k04p2K48j09n16L38j32oK33j49L05p8l85J12j7l08J71j80J50
$$ 291 66 193 407 203 131 379 270 -246 92 -40 -46 187 38 343 265 -120 -8 -25 -333 -162 -342 -192
3253a92j7oK09k50L01l12j15K42O1j50j25k1L59j69k86N33l72N09j75J0O4l79
$$ -192 -209 -215 -6 -256 45 -267 -382 -140 -79 -229 -354 -375 -16 -185 -471 62 -310 199 24 34 98 -281
3275b81J18R0n2j11L45o2J42k2k1K85p02K03L25m53N73k34k74M29k26K4J42l0
$$ -281 -163 -73 -125 -236 109 47 189 167 146 431 -271 -68 257 -196 377 143 -131 298 72 96 238 208
3297B08m2K65k70J11k81J9J79k04J88o9K49O8k60L82n20P0N6m18L46P8j71J6p2
$$ 208 166 431 161 272 -9 10 189 -15 173 104 353 421 161 543 23 93 149 -269 77 155 -16 0 -72
3320g2j0p7p7m5J78J87k04q0J09j1m82L12J40j28K83k44K49j77L7o1J07l20L1
$$ -72 -82 -159 -236 -281 -103 84 -120 -200 -91 -102 -584 -272 -132 -260 23 -221 28 -149 -112 -173 -66 -386 -355
3343c55K85j16K70l95J37J38L3p5K17j1k8K1J17l83R4K00k89K67P8j51O1J15n5
$$ -355 -70 -186 84 -311 -174 -36 -3 -78 139 128 100 121 238 -145 -51 149 -140 127 205 54 115 230 175
3366A75P0m47O2L43JL25k39J30J5j54KJ22j50K47k13k52K26m73N5L6K3J04J44
$$ 175 245 -202 -140 203 204 529 290 420 435 281 283 405 255 502 289 37 263 -210 -155 -119 -96 8 152
3389A52P6j43o9K7k89L21k57k51O93l09j08N74p52J26K32o19L82lj33L65k41j92
$$ 152 228 85 16 43 -246 75 -182 -433 260 -49 -157 417 -335 -209 23 -596 -214 -217 -350 15 -226 -418
3411d18K48r8j05J43r5M02k95J81J15j20k01k30J15M09k85M59j81k21M56m75J01
$$ -418 -170 -268 -373 -230 -325 77 -218 -37 78 -42 -243 -473 -358 51 -234 225 44 -177 279 -196 -95
3432i5K25j11j35L40l0j40J34j9n1l7L71m86K38m3k17L74ll95L07j10j1K98k39
$$ -95 130 19 -116 224 194 54 188 169 118 81 452 -34 204 161 -56 318 315 -80 227 117 106 404 165
3455A65j26J15j49J45K7p1j30R6Q3k15OJ94l71L63J79l17J87j49j60j5R7j13k4
$$ 165 39 154 5 150 177 106 -24 72 155 -60 -54 140 -231 132 311 -6 181 32 -128 -143 -46 -159 -183
3478a83j28L94j2K38k94m04L12k19kM63l98Q8k7m31N63l68K29r6m7N44m18J95
$$ -183 -311 83 71 309 15 -389 -77 -296 -298 165 -233 -145 -172 -603 -40 -408 -179 -275 -322 222 -196 -1
3500ajq0KL39m00N81l38M3L18l50q1K63m62L35k47K36l2J32o4J00k82J90J85m19
$$ -1 -2 -82 -80 259 -141 440 102 145 463 113 32 295 -167 168 -79 157 125 257 193 293 11 201 386 -33
3524c3L50q5L5j58m3%j95M27k15q3L19j47O7O9m28k75P1o3L35j17J9R2K9j78k45
$$ -33 317 232 267 109 66 66 -129 298 83 0 319 172 239 308 -120 -395 -324 -387 -52 -169 -150 -58 -29 -207 -452
3549d52l3L75k89L66J64m77M86j28k72J67k47nL67m14J87n5K4R4m2j01J43J61
$$ -452 -485 -110 -399 -33 131 -346 140 12 -260 -93 -340 -345 22 -392 -205 -260 -236 -142 -184 -285 -142 19
3571A9J0j28K1J27n0k40K06k69K65j89K93L83n13L31o4m60O83k19M1k9k57J78
$$ 19 29 -99 -78 49 -1 -241 -35 -304 -39 -228 65 448 -65 266 202 -258 425 206 247 218 -39 139
3593A39J53l94M26j1p0K3n1K79m79R4k5mM5Q0l57K25O7j47K45k33j5J65J92k30
$$ 139 292 -102 324 313 243 266 215 494 15 109 84 80 125 205 -152 73 140 -7 238 5 -10 155 347 117
3617A17j28M6J5m09L36k65O6M52m93J84J05j14P7j83r1L36m7j33K05j24M0l57
$$ 117 -11 35 50 -359 -23 -288 -222 230 -263 -79 26 -88 -11 -194 -285 51 4 -129 76 -48 -8 -365
3639c65K22%n5J31j43N5L65l70o9K06q3J36j9j59L44o6k49Q6m7K18k4n6J63J30
$$ -365 -143 -143 -198 -67 -210 -155 210 -160 -229 -23 -106 30 11 -148 196 130 -119 -33 -80 138 114 58 221 351
3663C51k07J92l52K26j10j14L89j73j42L4L8M8j65K4J79l35N48k86l43N73n01
$$ 351 144 336 -16 210 100 -14 375 202 60 94 132 180 15 39 218 -117 431 145 -198 375 -126
3684a26K61j99M4j08J9K68L1j03k88M3j35K35j64J50q8N9K81l98k8M4J51R3k74
$$ -126 135 -64 -20 -128 -109 159 190 87 -201 -158 -293 -58 -222 -72 -160 -101 180 -218 -246 -202 -51 42 -232
3707b32j6M09l57J02l8l15L20Pl55M35k1R2j99j84K04J66pJ62l31J41L9q4K03
$$ -232 -248 161 -196 -94 -132 -447 -127 -120 -475 -40 -61 31 -168 -352 -148 18 11 173 -158 -17 22 -62 141
3730A41k38J08J60k52J85K04o8O6j05%k37J29R0j74M9L23l01J41J45l79J71P1
$$ 141 -97 11 171 -81 104 308 240 306 201 201 -36 93 183 9 58 381 80 221 366 -13 158 229
3752B29m1L62k40k14J52p3J35k09k6L3m4j30J82k77M15r6l33M7k37L48j41K13
$$ 229 188 550 310 96 248 175 310 101 75 108 64 -66 116 -161 254 158 -175 -128 -365 -17 -158 55
3774E5J2k29j7k4n7m2K03m3J11j50m1P7lo8k76L12L1l03K23k13L51j9kk2Q3K2
$$ 55 67 -162 -179 -203 -260 -302 -99 -142 -31 -181 -222 -145 -148 -216 -492 -180 -149 -452 -229 -442 -91 -110 -112 -134 -51 -29
3800b9N6K2j82J36k8J19P1Oj87qJ92l1k03L11J2l24K54k25J52j5P4m1r6J44j8
$$ -29 27 49 -133 3 -25 94 165 171 -16 -24 168 137 -66 245 257 -67 187 -38 114 99 173 132 36 180 162
3825A62M3p3j89K2J87j05m5R3j03J22L4r7J51m36L05m9k76M18j77p5J48k46l00
$$ 162 205 132 -57 -35 152 47 2 95 -8 114 148 51 202 -234 71 22 -254 164 -13 -88 60 -186 -486
3848d86M44j20N0j79K77j70K1j82K4K38M2o6m8K05k83K74r7o7j90J69l5L79n3
$$ -486 -42 -162 -112 -291 -14 -184 -163 -345 -321 -83 -41 -107 -155 50 -233 41 -56 -123 -313 -144 -179 200 147
3871A47l01J19m1r2M41k77J77k06N6kJ8j3J93j54lj37L45k82O1L62j67k65Q1P0
$$ 147 -154 -35 -76 -168 273 -4 173 -33 23 21 39 26 219 65 62 -75 270 -12 49 411 244 -21 60 130
3895A30K2J22l6r8J62L5j08m66L50M2j86L95k57j3K02l03nJ68m08M91k82J40j23
$$ 130 152 274 238 140 302 337 229 -237 113 155 -31 364 107 94 296 -7 -12 156 -252 239 -43 97 -26
3918b6K51j05l31K12Nm8L8l85K61K39n23K40Q2j48J80n1j49K41Mq2K16l05J51
$$ -26 225 120 -211 1 6 -42 -4 -389 -128 111 -412 -172 -90 -238 -58 -109 -258 -17 -13 -95 121 -184 -33
3941c3l7K64k72O7j1j7l47M82l68J50O3j44Q3K69k53K60k74Q9J10J69jk56J64
$$ -33 -70 194 -78 -11 -22 -39 -386 96 -272 -122 -59 -203 -120 149 -104 156 -118 -29 81 250 249 -7 157
3964A57l2q3J65r4j9J57k49L16k74oK50k2Q8j03l10K10j10J58j79P5N0j15o3m9
$$ 157 125 42 207 113 94 251 2 318 44 38 288 266 354 251 -59 151 41 199 20 95 145 30 -33 -82
3988h2L7O8Q6k66P1L77n16Q3O6j43J77j4j61K96l52J21J29r1J10j55J49k96L08
$$ -82 -45 23 109 -157 -86 291 -225 -142 -76 -219 -42 -56 -217 79 -273 -152 -23 -114 -4 -159 -10 -306 2
4011Bk0r1j39K10k11L32Q5j88N4q1qj70J92K59k77L2J76k09J95r0p6n9J04Q6M0
$$ 2 -18 -109 -248 -38 -249 83 168 -20 34 -47 -55 -225 -33 226 -51 -19 157 -52 143 53 -23 -82 22 108 148
4036A48j07P0M3m15K22j3K92J04m4j43N4k03Q0lj02K84j66J80k24J39j01j66J54
$$ 148 41 111 154 -261 -39 -52 240 344 300 157 211 8 88 85 -17 267 101 281 57 196 95 -71 83
4059H3J7j13J12k37J89n8j6o1l7j11K35k64P5K22k01J42K00m52j3J29j5J78q3
$$ 83 100 -13 99 -138 51 -7 -23 -84 -121 -232 3 -261 -186 36 -165 -23 177 -275 -288 -159 -174 4 -79
4082g9n9q3K08J44j73k39K90j56q3K36J09K1l18j17J23j49L52J57k31Q6N0j65
$$ -79 -138 -221 -13 131 -42 -281 9 -147 -230 6 115 136 -182 -299 -176 -325 27 184 -47 39 89 -76
4104g6M22l76J87O9k74L28r6j68o9J59j68J52j42K65j43NN5K8K5m6k49K94J21
$$ -76 346 -30 157 226 -48 280 184 16 -53 106 -62 90 -52 213 70 75 130 158 183 137 -112 182 303
4127C03j35Q1k45K82k81J00J44k03k9O6J86l42K58k45j50L5J71j64J82q7j86L82
$$ 303 168 249 4 286 5 105 249 46 17 83 269 -73 185 -60 -210 -175 -4 -168 14 -73 -259 123
4149A23j51Kj1j10J49l20J18L81n75O6K82k33R4J26j6K64l90j36K23j21K72P6
$$ 123 -28 -26 -37 -147 2 -318 -200 181 -394 -328 -46 -279 -185 -59 -75 189 -201 -337 -114 -235 37 113
4171A13j53J89K9j28K28m84L11o9J24Rk13J79j91J36k2p6J09L8k15J21J98j68
$$ 113 -40 149 178 50 278 -206 105 36 160 169 -44 135 -56 80 58 -18 91 129 -86 35 233 65
4193F5J65r7l9Q3j35R9j6J2n7jR0l01L75l76R2L50k58j98L46k23J42j49J36J9
$$ 65 230 133 94 177 42 141 125 137 80 79 169 -132 243 -133 -41 309 51 -147 199 -24 118 -31 105 124
4217A24k09k2J39J47k59L08k74q0K81p2k7o0r0J75j65r7L6o1J26j89J28K29l49
$$ 124 -85 -107 32 179 -80 228 -46 -126 155 83 56 -4 -94 81 -84 -181 -145 -206 -80 -269 -141 88 -261
4240b61K79k26J08j02L34j29n8lm0L0K06j06o9M9Q3l20K12R4k23K09K29l38K69
$$ -261 18 -208 -100 -202 132 3 -55 -58 -98 -68 138 32 -37 12 95 -225 -13 81 -142 67 296 -42 227
4263B27m5j80m2K35Q8j42j61K88k4MJ55l45K35j94q4j97K80k71L13j76j03K24
$$ 227 182 2 -40 195 283 141 -20 268 244 248 403 58 293 99 15 -182 98 -173 140 -36 -139 85
4285H5j71p1O3N3k6%J10p4p8K74j38p1k75N03j23l15J91m90K49K47j29R3jk48
$$ 85 -86 -157 -94 -41 -67 -67 43 -31 -109 165 27 -44 -319 184 61 -254 -63 -553 -304 -57 -186 -93 -94 -342
4309c42L74j02l87N83m49M07m01K40K14k85J48j92M64k95n7J60J17o5K7k0l5R4
$$ -342 32 -70 -457 126 -323 84 -317 -77 137 -148 0 -192 272 -23 -80 80 197 132 159 139 104 198
4331A98k72L54j33J64j56l1JJ56k88K83j76K03j26l7Q4o8k59L17p9nj38J46j32
$$ 198 -74 280 147 311 155 124 125 281 -7 276 100 303 177 140 224 156 -103 214 135 130 -8 138 6
4354FJ71k29L61m79J45k9l6j81K78m4k28K28k38r2j95M55j10L63r22R13j54k23
$$ 6 177 -52 309 -170 -25 -54 -90 -271 7 -37 -265 -37 -275 -367 -562 -107 -217 146 -776 137 -17 -240
4376b40N95n21O5JJ33K28l26J51r6p9Q0l99K27L45k25K09j31l02M19k35K78n25
$$ -240 355 -166 -101 -100 33 261 -65 86 -10 -89 -9 -408 -181 164 -61 148 17 -285 134 -101 177 -348
4398c48L48k68L70j03J76k89k0L39j74j48L15k21PJ05j50K19j29j96J29K02m36
$$ -348 0 -268 102 -1 175 -114 -134 205 31 -117 198 -23 -16 89 -61 158 29 -167 -38 164 -272
4419b72L23J25p4N7k75J68K02j36J76m24J78o4J00j82J59P7J09n9m68Q1J96O2
$$ -272 51 176 102 159 -116 52 254 118 294 -130 48 -16 84 -98 61 138 247 188 -280 -199 -3 59
4441E9n1j27j84L21k90J99q1J06j68J9K01l38L33j37K13j37O6o5J29p0J19k90
$$ 59 8 -119 -303 18 -272 -73 -154 -48 -216 -197 4 -334 -1 -138 75 -62 4 -61 68 -2 117 -173
4463a73j37L52J1l49L37R2n80M34k56L92j46J8K58j84j19K67p9l85K50J1j0J62
$$ -173 -310 42 53 -296 41 133 -447 -13 -269 123 -23 -5 253 69 -50 217 138 -247 3 14 4 166
4485A66R7l5R0k24m7j05L6L99k06nn3j65J48N0k57M89l14j29J95J34K49o08M31
$$ 166 263 228 318 94 47 -58 -22 377 171 166 113 -52 96 146 -111 378 64 -65 130 264 513 -95 336
4508C36n90L23Q9kj6j81L0k03R6k00J55K18K06m45K61k83M18l69j7J73j33o5K97
$$ 336 -254 69 158 156 140 -41 -11 -214 -118 -318 -163 55 261 -184 77 -206 212 -157 -174 -1 -134 -199 98
4531I8J51k61J07l65J15J29P5l21Q5L37k98RN4K90o0m88P1j50N49j16j40N23o24
$$ 98 249 -12 95 -270 -155 -26 49 -272 -187 150 -148 -139 -85 205 145 -343 -272 -422 127 11 -129 394 -230
4554b30R0L02l65K87K21R2j06k08M9K15j77J62j58j94K3k59N86r9k69K00n5l44
$$ -230 -140 162 -203 84 305 397 291 83 132 347 170 332 174 -20 3 -256 330 231 -38 162 107 -237
4576b37N82k40J5j08k07M71l45k31N15j12k91J71N%J81Om68K20l28K28J52J48
$$ -237 345 105 120 12 -195 276 -69 -300 215 103 -188 -17 -12 -12 169 175 -293 -73 -401 -173 -21 127
4598A27ol11m9M04n23M8N35n72j1N75J55q78K67M07k60R9M51p1o97K39Q8k48L95
$$ 127 121 -190 -239 165 -358 -310 225 -347 -358 217 372 -506 -239 168 -92 7 458 387 -310 -71 17 -231 164
4621A64o3n3R0l51L19k46L27L10n98j6J0N1L06l21M66m03K23p9M7j38Q14p35k07
$$ 164 101 48 138 -213 106 -140 187 497 -101 -117 -107 -56 250 -71 395 -8 215 136 183 45 859 124 -83
4644h3K87m90L84J06L07n68K60L6n62J24K71J9n28l5J39M03Q9k28L8j84k35N16
$$ -83 204 -286 98 204 511 -57 203 239 -323 -199 72 91 -437 -472 -333 70 159 -69 -31 -215 -450 66
4666F6M7m8J40n36K9O0K46j66J23n14R42j05m41J27L48q1o84r8L63K58M97j521
$$ 66 113 65 205 -331 -302 -242 4 -162 -39 -553 389 284 -157 -30 318 237 -447 -545 -182 76 573 -948
4688i48J066J16j75K09n84j5N22j88J73o3N2k35l18L60J97J86m59J6L88l9k14
$$ -948 118 234 59 268 -316 -331 191 3 176 113 165 -70 -388 -28 169 355 -104 -88 300 261 47
4709D7q4l20M80k04M03j36J73l39k21J09R4o3J56J21l18Q2p7L4r4K60L8J97P6
$$ 47 -37 -357 123 -81 322 186 359 20 -201 -92 2 -61 95 216 -102 -20 -97 -63 -157 103 141 338 414
4732D14j43L16j060O09J57k05l70L81l03J75N11m41J7q9k98K67o5m13K11P7J13
$$ 414 271 587 -473 136 293 88 -282 99 -204 -29 482 41 58 -31 -329 -62 -127 -540 -329 -252 -139
4753a39o02Q89K6k43J28n51P36k71J20L4k68q3K03n0n2M9K03o9j19j16M61k76
$$ -139 -741 148 174 -69 59 -492 244 -27 93 127 -141 -224 -21 -71 -123 -74 129 60 -59 -175 286 10
4775A0L08k17m2K92l41J68p4n8j09m8J60m6j2K03l84N59k00j33m3K18j14P4l71
$$ 10 318 101 59 351 10 178 104 46 -63 -111 49 3 -9 194 -190 369 169 36 -7 211 97 171 -200
4798b00L60j22J05k38J09j52Q9J72J30j29n6j81M65j30l47L9p5J14l21J76J30
$$ -200 160 38 143 -95 14 -138 -49 123 253 124 68 -113 352 222 -125 -86 -161 -47 -368 -192 -62
4819f2J17p4m1QQ1p6Lj44p8M68j05j88j07L19l84qN01l33J11J0k47K18r8J42j44
$$ -62 55 -19 -60 -52 29 -47 -44 -188 -266 202 97 -91 -198 121 -263 -271 230 -103 8 18 -229 -11 -109 33 -111
4844a11K81j33M3K88m18j75K19j28J24N6P4j9l6k27J54K31M8j33Ln6L21m48R1
$$ -111 170 37 80 368 -50 -225 -6 -134 -10 46 120 101 65 -162 -8 223 271 138 141 85 406 -42 49
4867D9N9o2n4J52J99o63M21j15%K10l23K9L93j73l68J01J3J83j63L42l77K21m11
$$ 49 108 46 -8 144 343 -320 101 -14 -14 196 -127 -98 295 122 -246 -145 -132 51 -112 230 -147 74 -337
4890c37j8O61m42P9J10m9O9L48o35O96o66R5Q4j0j6Qk43L39j89j98J40J22r7k03
$$ -337 -355 306 -136 -57 53 4 73 421 -214 482 -184 -89 -5 -15 -31 -23 -266 73 -116 -314 -174 -52 -149 -352
4914c52J53K56K5j93K01j26j88K66O0j3Q7j08L6l58J30M35m33K05n2J85O1m60
$$ -352 -199 57 82 -111 90 -36 -224 42 102 89 176 68 104 -254 -124 311 -122 83 31 216 277 -183
4936a83P05n20M6j62j63K75J55k2J35Q6r1m98M70J22l82j98M56l3P3j95n69m2
$$ -183 522 2 48 -114 -277 -2 153 131 266 352 261 -237 233 355 -27 -225 231 198 271 76 -493 -535
4958e35R75O4k36j58m4Ok4k58M7J19p8l0l41Q66k50J57n05J12L27n27L13N84k61
$$ -535 440 504 268 110 66 72 48 -210 -163 -44 -122 -152 -493 373 123 280 -225 -113 214 -313 0 584 323
4981C23l75p9j29j48M95K20m34j83K57L24o7L51o03J84J62l07K17l5o91P6N63
$$ 323 -52 -131 -260 -408 87 307 -127 -310 -53 271 204 555 -48 136 298 -9 208 173 -518 -442 121
5002A21m67j2N58P4p0j81k50P17k95J25p88Q51m99L07q2J7p94J365k22J76n64
$$ 121 -346 -358 200 274 204 23 -227 490 195 320 -468 383 -116 191 109 126 -668 697 475 651 87
5023H7j74J33p6M31n30LM70l17J24R1l97L27J26p91O81j17n9m12j14M08J05j07
$$ 87 -87 46 -30 401 -129 -126 344 27 151 242 -155 172 298 -493 188 71 12 -400 -514 -106 -1 -108
5045a08m1k89M54l38j04O50j19n16K94Q8l6m50O12K34k26k98K91q34R67l00K46
$$ -108 -149 -438 16 -322 -426 224 105 -411 -117 -29 -65 -515 97 331 105 -193 98 -736 231 -69 177
5066A77n26n9K81j62Q69j013P17l85K9l8j56J82J61K44L3n22J06J28L6L73l91
$$ 177 -349 -408 -127 -289 580 -433 284 -101 -72 -110 -266 -84 77 321 354 -168 -62 66 102 475 84
5087H4j48M14j70q5m97Q38l35q68N04N97n1l65M55K2m68j3K57m03M00m60K16K6
$$ 84 -64 350 180 95 -402 436 101 -767 -263 334 283 -82 373 395 -73 -86 171 -232 168 -292 -76 -50
5109e0M23n32J34M61p85N32J23j50lk51j91k68R70o20K36M4j78J22j56K12k3k87
$$ -50 373 -159 -25 436 -349 183 306 156 153 -98 -289 -557 413 -207 29 73 -105 17 -139 73 50 -237
5131b37K32Q2o3k37p5L10l97K39J38j14L37J76n71J88J13l57L23J37k47n2K14
$$ -237 -5 77 14 -223 -298 12 -385 -146 -8 -122 215 391 -180 8 121 -236 87 224 -23 -75 139
5152A39N6l16K33m53m7M68J58k59R4j54lL28J20L14k40N0j10o05K48L87k13J2
$$ 139 195 -121 112 -341 -388 80 238 -21 73 -81 -84 244 364 678 438 488 378 -227 21 408 195 207
5174B07m43N50J81m26m73J77L40Q7o5j76L46q13L88L77O7o19k37Q00k35p45M89
$$ 207 -236 314 495 69 -404 -227 113 200 135 -41 305 -508 -120 257 324 -295 -532 268 33 -712 -223
5195b23m96L21K74m5J08j98M87q05Q04l30r6k75M95J31p5N6k62p6L83L3J66m63
$$ -223 -719 -398 -124 -169 -61 -259 228 -577 227 -103 -199 -474 21 152 77 133 -129 -205 178 211 377 -86
5217h6K84m91N87M7N9m31p0k9J31L16p70M00M41l24m56M88J5K23p5k15j00M73
$$ -86 198 -293 294 341 400 -31 -101 -130 1 317 -453 -53 388 64 -392 96 111 334 259 44 -56 417
5239D17p28J92N77n46K2M80p6m33J29n30Q17J14j91l84K97j49q0N8K15m22J36
$$ 417 -311 -119 458 -88 -66 414 338 -95 34 -496 321 435 244 -140 157 8 -72 -14 201 -221 -85
5260h5J33j93k90Q65r70L94m62N69q7m7K29L00n67M00M46r87M2L52k06K71L52
$$ -85 48 -145 -435 430 -540 -146 -608 -39 -126 -173 56 356 -211 189 635 -352 -310 42 -164 107 459
5281D59q87J64L26n07N41L58m94j25K31K29k57J10q1k7j95L02J86j85q4J2j21
$$ 459 -428 -264 62 -445 96 454 -40 -165 66 295 38 148 67 40 -155 147 333 148 64 76 -45
5302d5j51j64K86L7Q04k87n34j5k12N45k12k2j15P20m06l93j76k70P14j00O0K08
$$ -45 -196 -360 -74 -37 767 480 -54 -69 -281 264 52 30 -85 635 229 -164 -340 -610 104 4 64 272
5324B72n93j4K68k63L59j88k14P03l39q0N42o65K93j57j54l10K5M31kq0J38K54
$$ 272 -321 -335 -67 -330 29 -159 -373 330 -9 -89 453 -212 81 -76 -230 -540 -515 -84 -86 -166 -28 226
5346B26n6k04l57Q52m01Kn88L10l8l05P31P5o69M73k79K99M22j105M26M10j60
$$ 226 170 -34 -391 461 60 62 -526 -216 -254 -559 172 247 -422 51 -228 71 493 -612 -186 224 64
5367F4j3p4J70l76L7M98M5l88k78M92J82k12j75r8J042n71l43N31r03N95K00p6
$$ 64 51 -23 147 -229 -192 306 351 -37 -315 177 359 147 -28 -126 916 345 2 533 -370 225 425 349
5389C49K41l39r37N79N56n35J86m37P76l84j4K74m97L65m3j15M7k06O14o24M27
$$ 349 590 251 -686 -107 449 -86 100 -337 439 55 41 315 -182 183 140 25 72 -134 480 -144 283
5410B83l57L42J22k10J10p20L60j18P5l3l35N46J30j17l02L94J20m96j24J51o58
$$ 283 -74 268 390 180 290 -430 -70 -188 -113 -146 -481 65 195 78 -224 170 290 -206 -330 -179 -837
5431h37R43k44L43n07L86J30L77l82j09K37o05K10j71N71l30j26Q5N58o74L07
$$ -837 106 -138 205 -302 84 214 591 209 100 337 -268 -58 -229 342 12 -114 -29 529 -145 162
5451A62k10L31m08J6P8J68P4m40J26L16J51k88L9j35J30l81K62K75k60l94Q13
$$ 162 -48 283 -125 -109 -31 137 211 -229 -103 213 364 76 115 -20 110 -271 -9 266 6 -388 425
5472D25k74L62k54o84O13k38K14J54n29M2J58%n45J283p78J40j06k02P77k99k59
$$ 425 151 513 259 -425 188 -50 164 318 -211 -169 -11 -11 -556 727 -51 89 -17 -219 558 259 0
5493@k7k10K55k15M15K2n57M00o60J032k50M1k47M42o01l8K60k04L5K35j52L49
$$ 0 -27 -237 18 -197 218 240 -317 83 -577 455 205 246 -1 441 -160 -198 62 -142 -107 128 -24 325
5515C25l12K06j76k03j86R0K01L18j12R7m34o4J46J66l22O40p32Q1N88j64j57
$$ 325 13 219 43 -160 -346 -256 -55 263 151 248 -186 -250 -104 62 -260 380 -352 -271 317 153 -4
5536dk13M97m11J76K75n3L2o46L37Mj80O07k23N2k66L41l20J20j34j62K45J23
$$ -4 -217 280 -131 45 320 267 299 -347 -10 -6 -186 421 198 250 -16 325 5 125 -9 -171 74 197
5558A97J6j89k65M46n71O87j79J59l9n69M30k41M0R2l9k9J77J22k80m0j56J69
$$ 197 213 24 -241 205 -366 321 142 301 262 -307 123 -118 -78 14 -25 -54 123 245 -35 -75 -231 -62
5580f2J2j19J08L29m68J51Op5o4K00k05k3L60j04m16Q36p1p47K72L47l62RN39
$$ -62 -50 -169 -61 268 -200 -49 -43 -118 -182 18 -187 -210 150 46 -370 466 395 -352 -80 267 -95 -86 453
5603D53m80oL76q9j32l7j31R2l18K82n3k39M9N97l39J59j1j03K18j20l59K49O9
$$ 453 -27 -33 343 254 122 85 -46 46 -272 10 -43 -282 -233 364 25 184 173 70 288 168 -191 58 127
5626A27j52L59j93j24j72P1J92k09K18l45N36p58Q22l16j80M85j65l41L74l46
$$ 127 -25 334 141 17 -155 -84 108 -101 117 -228 308 -450 372 56 -124 361 196 -145 229 -117
5646a17K8l59M51P6j44l8l42P36o67J62Q1L1N64k03k35q6j7J6n2K01M9r4K28j25
$$ -117 -89 -448 3 79 -65 -103 -445 291 -376 -214 -133 -102 462 259 24 -62 -79 -63 -115 86 135 41 269 144
5670A44mj53m60N03n04L29M11p9Qj37J55J61m38l1K40j11j80J38J0j71K38k41
$$ 144 140 -13 -473 30 -474 -145 266 187 195 58 213 374 -64 -95 145 34 -146 -8 2 -169 69 -172
5692a72K28l8J81m1K5l52L8K01k06J51J88j14R4j71N7j5j97K29k40N09P7o74L98
$$ -172 56 18 199 158 183 -169 -131 70 -136 15 203 89 183 12 69 54 -143 86 -154 355 432 -242 156
5715A56O0k22n1l7K41o19M42l78N96j53l31N80p09J00L81J95k44P9qJ1k08K4j1
$$ 156 216 -6 -57 -94 147 -472 -30 -408 188 35 -296 284 -425 -325 56 251 7 86 78 89 -119 -95 -106
5738a06J53N7M5M3l57K77K1k74J68l76O61l78K00j38k51K6M82j79k82L29O3l27
$$ -106 47 104 149 192 -165 112 133 -141 27 -349 312 -66 134 -4 -255 -229 253 74 -208 121 184 -143
5760a43M9J12J81J10m41N16m03K49m41K87p7M3n5J37k20K25m25M30j87K1n4r9
$$ -143 -94 18 199 309 -132 384 -19 230 -211 76 -1 42 -13 124 -96 129 -296 134 -53 -32 -86 -185
5782a85L2K30K32j96m5k42K18j54K75k54L7l4r4K48o2RL9l01K59K15k33l48K19
$$ -185 -153 77 309 113 68 -174 44 -110 165 -89 -52 -86 -180 68 6 15 54 -247 12 227 -6 -354 -135
5805a35j17OL17k16K14N8l85J94J08J33k36RO9k3lK17k58J12M7j36Q6K8q6j82
$$ -135 -252 -246 71 -145 69 127 -258 -64 44 177 -59 -50 19 -4 -7 210 -48 64 111 -25 61 89 3 -179
5829a79M43j61j29N71m51k48K00J30o2R6j68l5K45j18k37O4MJ72k50L77l91N3
$$ -179 264 103 -26 545 94 -154 46 176 114 210 42 7 252 134 -103 -39 -35 137 -113 264 -127 -74
5851g4J09j88J41K29j73Kln6m3n1j8K31J24k30j52Q4l7knj03j5K1J52K6L03l01
$$ -74 35 -153 -12 217 44 46 43 -13 -56 -107 -125 106 230 0 -152 -68 -105 -107 -112 -215 -230 -209 -57 -31 272 -29
5877b9k6J77k40J36k21j7J46J38j96N4oK39k23R2j04J93j57o6K30o0j08J85r4
$$ -29 -55 122 -118 18 -203 -220 -74 64 -132 -78 -84 155 -68 24 -80 113 -44 -110 120 60 -48 137 43
5900D3q5J20k47K99m33K14n1K18J64j72O7q8k13L94j44j32N7j5p9J28j12J94k24
$$ 43 -42 78 -169 130 -303 -89 -140 78 242 70 137 49 -164 230 86 -46 11 -4 -83 45 -67 127 -97
5923i7P7j05J55p2r0J47l6j02R6j0k08L93j2K0k34K64k43j2K54j64j30Q0p5k0
$$ -97 -20 -125 30 -42 -132 15 -21 -123 -27 -37 -245 148 136 156 -78 186 -57 -69 185 21 -109 -29 -104 -124
5947a24M0p7K93j0k80K04R4k91J02o3O9J48j02j87J81j5J54k28R6OO7N1l1O9K
$$ -124 -84 -161 132 122 -158 46 140 -151 -49 -112 -43 105 3 -184 -3 -18 136 -92 4 10 77 128 97 166 168
5972A68k22jk4J03K38j52j44P9k35K75L9j88P8j70K64q3J44k28J44J54j28m4j09
$$ 168 -54 -55 -79 24 262 110 -34 45 -190 85 124 -64 14 -156 108 25 169 -59 85 239 111 67 -42
5995d2J82j67J87J18k04r7Qo0P0q2J5q7P4J52J6L06k41j22j2p4J26J01k18K05
$$ -42 140 -27 160 278 74 -23 -15 -75 -5 -87 -72 -159 -85 67 83 389 148 26 14 -60 66 167 -51 154
6019A54k82K77k21N0R6k51J16M6j05K11k10K19r2j29K74m9l44L0K20r1j09J68
$$ 154 -128 149 -72 -22 74 -177 -61 -15 -120 91 -119 100 8 -121 153 104 -240 -210 10 -81 -190 -22
6041b2J19l8J16j20q1J48j35k35L16L4k56J48j52K10n8k6J32j09J39K30l96j40
$$ -22 97 59 175 55 -26 122 -13 -248 68 102 -154 -6 -158 52 -6 -32 100 -9 130 360 -36 -176
6063a76J01L1j71J13K38n7j01J3J53P7l49O4J01o3J20N6k43J91l5j73O2N0k45
$$ -176 -75 -44 -215 -102 136 79 -22 -9 144 221 -128 -64 37 -26 94 150 -93 98 63 -110 -48 2 -243
6086b43K66R3j38q1o8J2J02j3J04K03L4k56j64K10j27J26r2k04L04K06j88k06
$$ -243 23 116 -22 -103 -171 -159 -57 -70 34 237 271 15 -149 61 -66 60 -32 -236 68 274 86 -120
6108a20J35m1L62n58J11K71l08K05j10N1K07k34j16L25J32n28M01k47J65J38j98
$$ -120 15 -26 336 -222 -111 160 -148 57 -53 -2 205 -29 -145 180 312 -216 185 -62 103 241 43
6129D3p8k18M27l26J44J13q6m7J73l11R9K31n2o9J38j30K6k47L12n6j34J44K5
$$ 43 -35 -253 174 -152 -8 105 19 -28 145 -166 -67 164 112 43 181 51 77 -170 142 86 -48 96 121
6152A21l52K79j76J3J20j50K34k99L87j93mR9l00K37k21J88q5R4L7L8k26J31R0
$$ 121 -231 48 -128 -115 5 -145 89 -210 177 -16 -20 79 -221 16 -205 -17 -102 -8 29 67 -159 -28 62
6175F2M7j15l7K28k54q4j48J73J01J00k12K08j8j18r7L40Or9lq1j60M1L67j23
$$ 62 109 -6 -43 185 -69 -153 -301 -128 -27 73 -139 69 51 -67 -164 176 182 83 80 -1 -161 -120 247 124
6199A24lj34L1N3o0J20r6K31k20j80L40k41K6j08J16J17j6j6j06K14j8q6k05J2
$$ 124 121 -13 18 71 11 131 35 266 46 -134 206 -35 -9 -117 -1 116 100 84 -22 192 174 88 -117 -105
6223a05L9K38j27J20j48k30K04q9J19J9L7q8j9J54l4k68J72O8R0m40K79k7J7J63
$$ -105 -66 172 45 165 17 -213 -9 -98 21 40 77 -11 -30 124 90 -178 -6 62 152 -288 -9 -36 -19 144
6247A44j33p4K61q4k13J64Q3j85p8k12M62N2k60O6j72L20j12M5J52j34j75J48
$$ 144 11 -63 198 114 -99 65 148 -37 -115 -327 135 187 -73 -7 -179 141 29 74 226 92 -83 65
6269F5j02j0J02q0J24J07q6j61j29L05k39L0K79j81Po0k6K14j34q6J14J0Q1k63
$$ 65 -37 -47 55 -25 99 206 120 -41 -170 135 -104 -74 205 24 31 -29 -55 159 25 -61 53 63 144 -119
6293a19J12n6O7N9j51M0L7m6r9K47o3p8o2J13n8j21J62K9J74l78J15j14K31l58
$$ -119 -7 -63 4 63 -88 -48 -11 -57 -156 91 28 -50 -112 1 -57 -178 -16 13 187 -191 -76 -190 41 -317
6317c17K91m1Q7k8K2m0J27k5p2j14K25k56K1JJ48R1k95J6J70K0p7J06j27J52j16
$$ -317 -26 -67 20 -8 14 -26 101 76 4 -110 115 -141 -120 -119 29 120 -175 -159 11 31 -46 60 -67 85 -31
6342c1M5J7p9k21M82k36J10o5J02R2l47M03j77k60J43R7K5k56O6J84O7j29R2p2
$$ -31 14 31 -48 -269 213 -23 87 22 124 216 -131 272 95 -165 -22 75 100 -156 -90 94 161 32 124 52
6366E2k90M71k47rL89l78Q0q4Q0p9K86k85J1J45j51J04j5O0n7M9l12J5K19k40
$$ 52 -238 233 -14 -23 366 -12 68 -16 64 -15 271 -14 -3 142 -9 95 80 140 83 132 -180 -165 54 -186
6390a86M70j63r3j90J09o1J2O5r6K64j36k5n5L8j31J40J16R9k9j60J25j9j35R9
$$ -186 284 121 28 -162 -53 -114 -102 -37 -133 131 -5 -30 -85 -47 -178 -38 78 177 148 -12 113 94 -41 58
6414E8k82K00q3R6j3R3k25K2L00j52j28n6J62K29k20j03r8J50Rl7j19K41N9J37
$$ 58 -224 -24 -107 -11 -24 69 -156 -134 166 14 -114 -170 -8 221 1 -102 -200 -50 -41 -78 -197 44 103 240
6438B40k05J11k87J67J17j91oJ22k4K2j85K08j65K16j32N5qp5j47L39k24J64j71
$$ 240 35 146 -141 26 143 -48 -54 68 44 66 -119 89 -76 140 8 63 55 -20 -167 172 -52 112 -59
6461e9n2J65j68O7K8l0J39O9n02J55L4K10j53J43j67J33J31m3N1J13k64J3j65
$$ -59 -111 54 -114 -47 -19 -49 90 159 -343 -188 -154 56 -97 46 -121 12 143 100 151 264 0 13 -152
6484a52J62J7O7k29J74Pr6k14K70J66p5Kn2K57l21O3o8j05k2J22J44l21J63J13
$$ -152 10 27 94 -135 39 46 -50 -264 6 172 97 99 47 304 -17 46 -22 -127 -149 -27 117 -204 -41 72
6508G2l6J57j84N0m4l2q0J56j7k4N8k4j26P7p9P6k19K78j29j03J01K11j78p1J60
$$ 72 36 193 9 59 15 -17 -97 59 42 18 76 52 -74 3 -76 0 -219 59 -70 -173 -72 139 -39 -110 50
6533E0n0m0j1k03p7L12j92J69j80J77L1K3k5P2j82K24j52N1J81k91K13kJ7l41
$$ 50 0 -40 -51 -254 -331 -19 -211 -42 -222 -45 -14 9 -16 56 -126 98 -54 -3 178 -113 100 98 115 -226
6557b26N8J56m3r0K40J89j24p3j39N1J80l12j6r7K91J8P4m6k38J17N9k41K92j56
$$ -226 -168 -12 -55 -145 95 284 160 87 -52 -1 179 -133 -149 -246 45 63 137 91 -147 -30 29 -212 80 -76
6581g6q5K54mJ16k40j28J85J07L7j79J67j53J59j21k5J08j74J63k86L63j08j17
$$ -76 -161 93 89 205 -35 -163 22 129 166 -13 154 1 160 39 14 122 -52 111 -175 188 80 -37
6603c7l2J42j16k22N85k26Q4k57P9k4r7O5J54j77R5j49K56j9J06k19n4np6J04
$$ -37 -69 73 -43 -265 320 94 178 -79 0 -24 -121 -56 98 -79 16 -133 123 104 210 -9 -63 -68 -144 -40
6627d0K91l13M8K12m0l56J43Q3k91N22j39j29K60k97k05M91l1k35l3J77l57L21
$$ -40 251 -62 -14 198 158 -198 -55 28 -263 259 120 -9 251 -46 -251 240 209 -26 -59 118 -239 82
6649H2n7nn0r0R9M1Rpq8m5mO7K17j52q0K14j11J24m2o4k6k63J64J86k81J33Q6
$$ 82 25 20 -30 -120 -21 20 29 22 -66 -111 -115 -48 169 17 -63 151 40 164 122 58 32 -231 -67 119 -162 -29 57
6676E7R6k71J78r3k2J7j04L8O1N2j77K70k42MJ88j70K88l73J27J18k25N8J95j64
$$ 57 153 -118 60 -33 -55 -38 -142 -104 -43 9 -168 102 -140 -136 52 -118 170 -203 -76 42 -183 -125 70 -94
6700i4J15m0J39j7k65j5K18p9k45L04J0J9l45J86M6Q1n2lj05J63m3Km8J01J57
$$ -94 21 -19 120 103 -162 -177 41 -38 -283 21 31 50 -295 -109 -63 18 -34 -37 -142 21 -22 -20 -68 33 190
6725A90k13k7l7L76j71k67K89K3k13p3J39R9Mj89n0p3K43Ro5j51L65m0j88K82
$$ 190 -23 -50 -87 289 118 -149 140 163 -50 -123 16 115 119 -70 -120 -193 50 59 -6 -157 208 168 -20 262
6749B62j05M4l24J13PL05k08l17K86r7J10n9k6Q9k36K15P7j44j88o5L35n2j40
$$ 262 157 201 -123 -10 -3 302 94 -223 63 -34 76 17 -9 80 -156 59 136 -8 -196 -261 74 22 -118
6772a18R1l5J29k40K46j46K0L7K89k60L6k3K06j97j68N5L13l19J64k1M4m4p1O
$$ -118 -27 -62 67 -173 73 -73 -53 -16 273 13 49 26 232 35 -133 -78 235 -84 80 59 103 59 -12 -6
6796fJ54l68J36J92k50Q2RK6J2k1J6O4P4n7j30n1K21O4l32J61K18j46k9o2N9p
$$ -6 148 -220 -84 108 -142 -60 -51 -25 -13 -34 -18 46 120 63 -67 -118 103 167 -165 -4 214 68 39 -23 36 29
6822B9Q0jq0P8J50k97Q8J1j1k86L15m7l0J22k63P1J42j78K93j76j75p1J46j16
$$ 29 109 108 28 106 256 -41 47 58 47 -239 76 29 -1 121 -142 -71 71 -107 186 10 -165 -236 -90 -206
6846b06L27j94L9O3q5p7R1M3n5M5j47j35L47q9k00K65J03k83K41M0k00O3k46R2
$$ -206 121 -73 -34 29 -56 -133 -42 1 -54 -9 -156 -291 56 -33 -233 32 135 -148 93 133 -67 -4 -250 -158
6870a58K42o7J14m6j4r2n1J52P8j20J01q7k03L22j20p4q1J63O0j47J43j78M15
$$ -158 84 17 131 85 71 -21 -72 80 158 38 139 52 -151 171 51 -23 -104 59 119 -28 115 -63 352
6893C52j87k51k9K0K55j85L58n13J29J80MMr8j48n6M28l73l15M71j66j8J68n9
$$ 352 165 -86 -115 -95 160 -25 333 -180 -51 129 133 137 39 -109 -165 263 -110 -425 46 -120 -138 30 -29
6916b9R7lk60j61M62k19M38m30J78K6J11m88M89r7m72L18j55Q6k62N66m13J20
$$ -29 68 65 -195 -356 106 -113 325 -105 73 99 210 -278 211 114 -358 -40 -195 -109 -371 195 -218 -98
6938i8K65k72J23K02k42j91L0K21J40m75K74q6M45k67J14l92M13r1O9j81R0jr1
$$ -98 167 -105 18 220 -22 -213 -183 38 178 -297 -23 -109 336 69 183 -209 204 113 182 1 91 90 -1
6961aL6O0L8k48K32j63j50K6J29K68k97L56n1m9r1n13O52q1L6j94k3j74qj1J82
$$ -1 35 95 133 -115 117 -46 -196 -170 -41 227 -70 286 235 186 95 -418 234 153 189 -5 -28 -202 -210 -221 -39
6986c9o0K47Q4j45j01o4N6p1K36m60N48m24J24K06j74R2j30j39L86l01L15j32
$$ -39 -99 148 232 87 -14 -78 -22 -93 143 -317 231 -193 -69 137 -37 55 -75 -214 172 -129 186 54
7008E4j06J93q8J48k73J95j48K45l99J65Mn8K5M6k47P6K95j91mm3J65j24j51R3
$$ 54 -52 141 53 201 -72 123 -25 220 -179 -14 -10 -68 -43 3 -244 -168 127 -64 -68 -111 54 -70 -221 -128
7032a28M0J7K09Q5m6j9O7l29J32j58J22J23K7j43K29k96R7N2m58M23k3n3q0J91
$$ -128 -88 -71 138 223 177 158 225 -104 28 -130 -8 115 142 -1 228 -68 29 81 -377 46 23 -30 -110 81
7056H1k78M40j20m48K43J23K3k17K22j02n9N4J00j44J5K14k28J46m11J87J39j80
$$ 81 -197 243 123 -325 -82 41 64 -153 69 -33 -92 -38 62 -82 -67 147 -81 65 -346 -159 -20 -200
7078b00J45J25PM1n6k4n7N5O4o2j19L20l36J52J35j41o4k1P6oo7j15J73R6K6k1
$$ -200 -55 70 77 118 62 38 -19 36 100 38 -81 239 -97 55 190 49 -15 -36 40 34 -33 -148 25 121 147 126
7104A26k92J01J21M3P7R7j88k55J79k53K94r2K5j22J43j14M6J06l7J40j04j28
$$ 126 -166 -65 56 99 176 273 85 -170 9 -244 50 -42 -17 -139 4 -110 -64 42 5 145 41 -87
7126h7M5q9K24lp1m6M0n4J29j05n8j50K27J39l21K22l16J28J45J01r5M4r1M6j01
$$ -87 -42 -131 93 90 19 -27 13 -41 88 -17 -75 -225 2 141 -180 42 -274 -146 -1 100 5 49 -42 4 -97
7151i7J33k18O0M24k73j32K94j93Q3j07J80Lr3r9j16p3L08O6m6k2K13j13k93L19
$$ -97 36 -182 -122 302 29 -103 191 -2 81 -26 154 157 64 -35 -151 -224 84 150 104 82 295 182 -111 208
7175B08j44k07J07N7j57j61M35j9Q4m46L00p9O2K26k25Q2j53J2k76L28M7K01l13
$$ 208 64 -143 -36 21 -136 -297 138 119 203 -243 57 -22 40 266 41 123 -30 -18 -294 34 81 282 -31
7198c1J13j91j25PK49J09l14J81k9l3n9P9J9q0jK83m40K54j17L36j62K10l08%
$$ -31 82 -109 -234 -227 22 131 -183 -2 -31 -64 -123 -44 -25 -105 -106 177 -263 -9 -126 210 48 258 -50 -50
7222e0Q8rJ43j23k44M49k64L0J19R8l76L46l45J30L53n02K29n49L25K6L6RnJ36
$$ -50 38 29 172 49 -195 254 -10 20 139 237 -139 207 -138 -8 345 -157 72 -477 -152 -126 -90 -81 -86 50
7246E0k16L56Jj44K07k35J90j91j13Q9k05M26k4Ll65K85q7o8%jQ1o2k89J53J19
$$ 50 -166 190 191 47 254 19 209 18 -95 -6 -211 215 191 194 -171 114 27 -41 -41 -42 39 -23 -312 -159 -40
7271d0nR6M9K1N9k96N0q7N1L23k46J50j67m9K1J59J07r1j62j9o5J58k00J65j89
$$ -40 -45 51 100 121 180 -116 -66 -153 -102 221 -25 125 -42 -91 -70 89 196 105 -57 -76 -141 17 -183 -18 -207
7296b07J64j13L32r6k1k3k14J39J81K13m47N3L11p7l98J58j11P1j4l3R0l21M05
$$ -207 -43 -156 176 80 59 36 -178 -39 142 355 -92 -39 272 195 -203 -45 -156 -85 -99 -132 -42 -363 42
7319D2Q6j04N1j16J22r0N8R6k43q8K59M4j9l6k5P9j79p6J9L01j23l6j97L1J9K7
$$ 42 128 24 75 -41 81 -9 49 145 -98 -186 73 117 98 62 37 116 -63 -139 -120 181 58 22 -175 -144 -125 -98
7345i8l2J76j50Q2o7J70k59J81L43j31k22Q8j39j0pJ0J81k05J58k66Q5O0l0j7
$$ -98 -130 46 -104 -22 -89 81 -178 3 346 215 -7 81 -58 -68 -75 -65 116 -89 69 -197 -112 -52 -82 -99
7369i9k9J1K94l32J61j70M67l97l0L34kj94J44k26J13j76L2J33J12j98o6K67o4
$$ -99 -128 -117 177 -155 6 -164 303 -94 -124 210 208 14 158 -68 45 -131 -99 34 146 -52 -118 149 85
7392H5j25K67j17k4j89n8J99OK0R2j89l8J52q6r3R3J68j7k33J33J26j02n9j39
$$ 85 -40 227 110 86 -103 -161 38 44 64 156 -33 -71 81 -5 -98 -5 163 146 -87 46 172 70 11 -128
7416a28M1K4J58j00J8j04M7j65J00M6J75j9Q8k17J90M2n95M41j53J09O7l02L42
$$ -128 -87 -63 95 -5 13 -91 -44 -209 -109 -63 112 93 181 -36 154 196 -399 42 -111 -2 65 -237 105
7439A05j33r5J3j53l7L26k46R1J55l1lJ41k86J01K11l04K85j78m6N1J55M9r1r4
$$ 105 -28 -123 -110 -263 -300 26 -220 -129 26 -5 -8 133 -153 -52 159 -145 140 -38 -84 -33 122 171 80 -14
7463a4J10k97J79J03K1l03K35j57J43P3l82M67j5k66J27p7K29j12J44r3l8QJ16
$$ -14 96 -201 -22 81 102 -201 34 -123 20 93 -289 178 163 -103 24 -53 176 64 208 115 77 85 201
7486B01n7j56J49l25P9o7R6qL0J63j12j50K12j05J3R2K70j64k02J20K7k46J70
$$ 201 144 -12 137 -188 -109 -176 -80 -88 -58 105 -7 -157 55 -50 -37 55 325 161 -41 79 106 -140 30
7509C0r8K69k31o1n0K43j14j54L06q9m4Q3j38j84J46J79q0m35L22mJ30J1m5O2
$$ 30 -68 201 -30 -91 -141 102 -12 -166 140 51 7 90 -48 -232 -86 93 13 -422 -100 -104 26 37 -8 54
7533E4k65K82j02O9j48j3J40P1k0n6M0Q8p1p1N7p4oK4kJ84l15K5L24j07k78J84
$$ 54 -211 71 -31 38 -110 -123 17 88 68 12 52 140 69 -2 55 -19 -25 -1 -3 181 -134 -109 215 108 -170 14
7559A4r0K74j27j37J63j46K29k27Q3k29J05J17K02m5k85M28m06R8l7J30j19k8
$$ 14 -76 198 71 -66 97 -49 180 -47 36 -193 -88 29 231 186 -99 329 -77 21 -16 114 -5 -33
7581c3r7J09n5K1M6j33J50J74k97j7J81p1J50Nk19n5L14j47J12k9r7k60M16j05
$$ -33 -130 -21 -76 -55 -9 -142 8 182 -115 -132 49 -22 128 133 -86 -141 173 26 138 109 12 -248 168 63
7605F3l88L44J5P5p5j21K82%j96k02K52k06J34k1J8j00M03l10K06k70P2M3j43
$$ 63 -325 19 34 109 34 -87 195 195 -1 -203 49 -157 -23 -44 -26 -126 277 -33 173 -97 -25 18 -125
7628a25R4j08K2J18pm1k40K33K84j69q8j99K59k60N18m54R5R0J03m19J97R5k56
$$ -125 -31 -139 -117 1 -6 -47 -287 -54 230 61 -27 -226 33 -227 291 -163 -68 22 125 -294 -97 -2 -258
7651b58K62J52k3k50P9q4L38j70M2JJ64m89K19J38l8j73k9j08L93k12n2K9j75
$$ -258 4 156 133 -117 -38 -122 216 46 88 89 253 -236 -17 121 83 -90 -119 -227 166 -46 -98 -69 -244
7674b44L67n8J48r3j09k3k03K67N60o31K3J1j01J44o1K8k04P1M25q04N06J64m32
$$ -244 123 65 213 120 11 -12 -215 52 612 -19 4 15 -86 58 -3 25 -179 -108 317 -487 19 183 -249
7697b49K02K0J72j30n05P16l66L60O5m16L85j18j64l16L49R7K51k75k37j23N43
$$ -249 -47 -27 145 15 -490 226 -140 220 285 -131 254 136 -28 -344 5 102 353 78 -159 -282 261
7718B61n38J53l9P2j49M6L56l36r9K30L54j44j45j76J70k10M75l77L62j0j73J11
$$ 261 -277 -124 -163 -91 -240 -194 162 -174 -273 -43 311 167 22 -154 16 -194 281 -96 266 256 83 194
7740A94r9R8m24M7n8K24J18l82K73L72L1K13o99K47j43K28k09M09q56J32M62k89
$$ 194 95 193 -231 -184 -242 -18 100 -282 -9 363 394 607 -92 155 12 240 31 440 -416 -284 178 -111
7762a11J05J97j02J12k3%k86R4p2NP98j019R59q21M13k29j40L90l72K43m3j04
$$ -111 -6 191 89 201 178 178 -108 -14 -86 -81 717 -302 657 -164 249 20 -120 270 -102 141 98 -6
7784fK32l33k37p2P18l83k3M38l05l08O39k63j57kJ25o38N59LJ39j97J73n81K98
$$ -6 226 -107 -344 -416 302 -81 -104 334 29 -279 360 97 -60 -62 63 -575 -16 -13 126 -71 102 -479 -181
7807a81N15l45o3m66K42JO12j93m41j05L67J93n28K38K20K95o0k24j34J14J13
$$ -181 334 -11 -74 -540 -298 -297 315 122 -319 -424 -57 136 -392 -154 66 361 301 77 -57 57 170
7828A70j64K44k3j46l17J11K74j66K32m42L36K30m57K67j28P49o01o66R33l34
$$ 170 6 250 227 81 -236 -125 149 -17 215 -227 109 339 -118 149 21 770 169 -497 436 102
7848A02l24q4M49K6n13O27l30K66j84j03K96l57M04p6Pk47P2l2K28K84m43J80
$$ 102 -222 -306 143 169 -344 283 -47 219 35 -68 228 -129 275 199 206 -41 31 -1 227 511 68 248
7870B48k52N00o52R7k67K95J41k13J13l17L90j8M63q03Q9l32Q9N19Q7l15M26n8
$$ 248 -4 496 -156 -59 -326 -31 110 -103 10 -307 83 65 528 -275 -186 -518 -429 90 177 -138 288 230
7892B30n89M41j79J74J59l96j79K70N4J26k22q7P48p97l94P55K54j55K30m96K81
$$ 230 -359 82 -97 77 236 -160 -339 -69 -15 111 -111 -198 550 -247 -641 114 368 213 443 -53 228
7913B28k50J72j87K68j44l19L58m83M55n5j14j14n8K35o9R9j10K33J4j49j33K23
$$ 228 -22 150 -37 231 87 -232 126 -357 98 43 -71 -185 -243 -8 -77 22 -88 145 159 10 -123 100
7935A00j98r3N05p86N10K7r1m82N52O0j17o9J16K33m34J53K90l70K27n08M15m1
$$ 100 -98 -191 314 -472 38 65 -26 -508 44 104 -13 -82 34 267 -167 -14 276 -94 133 -375 40 -1
7957aj25K62k93p1L95l06J37j85K53j1k23L47j03M79j12m73k52P61l06J33l02
$$ -1 -126 136 -157 -228 167 -139 -2 -187 66 55 -168 179 76 555 443 -30 -282 479 173 306 4
7978Dk56J94N4M8J53k55L5k91J28OK0L59n0k15M1K79k7q3j47q9K4J71J01J3j39
$$ 4 -252 -58 -4 44 197 -58 -23 -314 -186 -180 -160 199 149 -66 -25 254 227 144 -3 -92 -68 103 204 217 78
8003G8j46K3J70N2j07J60m43O60l48j52J84j20l4L4kK21Rj87K25K22l70n6k89
$$ 78 -68 -45 125 177 70 230 -213 447 99 -53 131 11 -23 11 9 230 239 52 277 499 129 73 -216
8026b16n7L41L64o38K13k92K88J79m32k7K53r3j89k4L67n34K23J88M56o53R2j31
$$ -216 -273 68 432 -206 7 -285 3 182 -250 -277 -24 -117 -306 -330 37 -497 -274 -86 370 -283 -191 -322
8048c22N08m24P17o24J61L11p77N81Q6j50j80m4M21J80m93n8K70m34M02K06k18
$$ -322 186 -238 479 -145 16 327 -450 131 217 67 -113 -157 264 444 -49 -107 163 -271 131 337 119
8069A19n4j29K04K07l4k28k77N62m45j59L07k08O0p5L62k53M77n74N0k38J011
$$ 119 65 -64 140 347 313 85 -192 370 -75 -234 73 -135 -75 -150 212 -41 436 -138 -88 -326 685
8090F85R9r39O37l78k01K66n91kM38K14k16m45L12J32k89L67P9r2P3n7m24Q7R57
$$ 685 784 -155 482 104 -97 169 -422 -424 14 228 12 -433 -121 11 -278 89 168 76 149 92 -332 -245 712
8113G12j351J169j04l83N1j91P20j42k99l80J6J64K09j68j64l7L05l97N35P8l87
$$ 712 -639 530 426 43 94 -97 623 481 182 -198 -182 -18 191 23 -141 -178 127 -270 265 343 -44
8134d4m51K90N17l37qm2Nl3K44k37J5J64j64M46n3o95J78K95K35J59l49l24J08
$$ -44 -495 -205 312 -25 -33 -75 -70 -103 141 -96 -81 83 -81 365 312 -383 -205 90 325 484 135 -189 -81
8157h1L03l26K48j36p4K39N7k39l6j97j53M4L88k12J63L37n67L80L86o45j97O30
$$ -81 222 -104 144 8 -66 173 230 -9 -45 -242 -395 -351 37 -175 -12 325 -242 138 524 -121 -318 312
8179C12n53j39L25j30J66L12o40N35l87q7K06q6
$$ 312 -241 -380 -55 -185 -19 293 -347 188 -199 -286 -80 -166
8191a66
$$ Imaginary data points
##PAGE= N=2
##DATA TABLE= (X++(I..I)), XYDATA
0@%%%%%%%%%%%%qJ6j6J6k4L2l8M6n6O7p5Q8j06J30j52J76k06K36k70L08l51L99
$$ 0 0 0 0 0 0 0 0 0 0 0 0 0 -8 8 -8 8 -16 16 -22 24 -32 35 -40 48 -58 72 -80 96 -110 126 -144 164 -187 212
34B12m54N13n77O49p26Q12r07J010j122J245j378J524j685J858k048K257k486
$$ 212 -242 271 -306 343 -383 429 -478 532 -590 655 -723 801 -884 974 -1074 1183 -1303
51a303K738l016L324l667M050m483M973n532O183o950P865q981J0380j2187J4629
$$ -1303 1435 -1581 1743 -1924 2126 -2357 2616 -2916 3267 -3683 4182 -4799 5581 -6606 8023
66H023j8139K3681l4192R0401k22376J42645J31945l05272K37297M752j49020
$$ 8023 -10116 13565 -20627 69774 -152602 -9957 121988 -183284 54013 58765 -90255
77i0255J48702k5590q4416R4028k2215o0573J2066P5299n7568r648Q2330j06376
$$ -90255 58447 32857 -51559 42469 20254 -40319 -28253 47046 -10522 -20170 62160 -44216
89d4216j5774R6448r2037N0494N7438r3636N4694K2224o8652L5712q545l3878
$$ -44216 -59990 36458 -55579 -5085 52353 -41283 13411 35635 -33017 2695 -5850 -39728
101c9728J5998K1789P885p049N245j2353n857J9371j6953K0723j960m1084M5526
$$ -39728 -23730 -1941 5944 -1105 4140 -8213 -14070 5301 -11652 9071 7111 -33973 11553
114A1553m029l1535M1340k8726p768L9244k3932J2035J6988l3531n409K3230j409
$$ 11553 7524 -24011 17329 -11397 -19165 20079 -3853 8182 25170 -8361 -13770 9460 8051
127H051k6487L3656Q12n3867O7603j997n9232Q2201m7552m6786J00294o9725j9598
$$ 8051 -18436 15220 16032 -37835 29768 27771 -31461 50740 3188 -43598 56696 -13029 -32627
140c2627Q4206p5113J913O1111l8759L29J5642j1215j7072J5123K1874m9272K7434
$$ -32627 51579 -23534 -21621 39490 731 1060 16702 5487 -11585 3538 25412 -23860 3574
153C574J8778p2154O6041P305p2380Q1377k0099m6801P5673m1365k4031L7846
$$ 3574 22352 -49802 16239 23544 -48836 32541 12442 -34359 41314 -51 -24082 13764
165A3764l7403O389K0016o619J761n199J4838j9151J533L2320m3543J7000K6973
$$ 13764 -23639 -17250 2766 -3853 -2092 -7291 7547 -11604 -10071 22249 -21294 -4294 22679
178B2679n0298L4519J37m6082M3304j2279j2896M7952k2058q129K0170k3241m505
$$ 22679 -27619 6900 7037 -39045 4259 -8020 -20916 27036 4978 -3151 17019 -6222 -10727
191a0727J1445l792n961J1390P170j3235J4317n749k2464K7520o946q450L3810
$$ -10727 718 -3074 -9035 2355 9525 -3710 10607 4858 -17606 9914 2968 -5482 28328
204B8328k0480r504J5980k4522K194J3299q892N168J2821J260j3345R925k494
$$ 28328 7848 -1656 14324 -10198 -8004 5295 -3597 1571 14392 15652 2307 12232 9738
217I738l1441K8053J665k6354M3794j8205k2848M0823l4862m210L3612l4955J3900
$$ 9738 -21703 6350 8015 -18339 25455 7250 -15598 25225 -9637 -13847 19765 -15190 -1290
230a290J8496k4825J1439j554j2249j099N062R730j4646J8290N961l3462L1226
$$ -1290 17206 -7619 3820 2266 -9983 -11082 -6020 3710 -10936 7354 13315 -20147 11079
243A1079r792l2969M3516k3510j3101M5406l3248M647K6668l5999J3162J1941
$$ 11079 1287 -31682 11834 -11676 -24777 20629 -12619 -7972 18696 -17303 -4141 7800
255G800k0665J1125J631o134q86N207J971j3327J7712j372j7817L2124j2649j6123
$$ 7800 -12865 -1740 -109 -6243 -7129 -1922 49 -13278 4434 3062 -14755 17369 4720 -11403
269a1403L2261k6553o498K6864k8297O080J8786j8913J2077J0341j0296J373L763
$$ -11403 20858 -5695 -12193 14671 -13626 -7546 11240 -7673 4404 14745 4449 5822 9585
282I585o168p938J0235l684r234J8424r763o506K1090j8429M46J8101j8144P283
$$ 9585 3417 -4521 5714 2030 -7204 11220 1457 -5049 16041 -2388 -1942 16159 -1985 5298
296E298Q232j5744M133q36o913J374M094J674k908J1130l896j0070J4370j5167
$$ 5298 13530 -2214 1919 1083 -5830 -4456 -362 1312 -1596 9534 5638 -4432 9938 -5229
310e229n225J8741k0526P860J4109k3136J4118K979j5904J4578l804j823N400
$$ -5229 -10454 8287 -12239 -4379 9730 -13406 712 3691 -12213 2365 -1439 -3262 2138
323B138o201N345r750J268P498j5270J6931J306j2844K2261j5185n431J6835k2892
$$ 2138 -4063 1282 -8468 -7200 298 -14972 1959 3265 -9579 12682 -2503 -7934 8901 -13991
337a3991R961Q000j6253J9837o719o379J5445j4949O186M615j0551J3751q898
$$ -13991 -4030 3970 -12283 7554 835 -5544 9901 -5048 1138 5753 -4798 8953 55
350E5j747R075j5267R677o94o450J8160j1100K704J1354j9322Q653q22j3387J4293
$$ 55 -1692 7383 -7884 1793 1099 -5351 12809 1709 4413 15767 -3555 5098 4276 -9111 5182
365E182p030j133J2485r551M370K665o889L604k931J644q43k178L887q500M197
$$ 5182 -1848 -2981 9504 -47 4323 6988 99 3703 772 2416 1573 -605 3282 -5218 -1021
380a021J239j0401J4100l081p042J5763q388m374O498q643o02k0P23L24l74R932
$$ -1021 218 -10183 3917 836 -6206 9557 1169 -3205 3293 -5350 -5952 -5972 -5249 -4925 -5299 4633
396D633j0187K591J2795k2404R126R936k1914J6985Q33j4069J6266q415l990R644
$$ 4633 -5554 -2963 9832 -12572 -3446 6490 -15424 1561 2394 -11675 4591 -3824 -7814 1830
410A830o596N305j434K883L437j1971J2591o598j1025K0514j4981J395J9816k1145
$$ 1830 -4766 539 -895 1988 5425 -6546 6045 -553 -11578 8936 -6045 -4650 15166 -5979
424e979J2066M848j9228J6143p441n492J3624j1406R025J43r306J4364j3353J108
$$ -5979 6087 10935 -8293 7850 409 -5083 8541 -2865 6160 6303 -3003 11361 -1992 -884
438h84J1677j5949J1868J150j1938J2984j0160j266P283r528R557j862j799Q692
$$ -884 10793 -5156 6712 7862 -4076 8908 -1252 -2518 4765 -4763 4794 2932 1133 9825
452I825j3245O682O06j5007J4648m391o462J3291q216R50M053o085K919k657K957
$$ 9825 -3420 3262 3868 -11139 3509 -882 -7344 5947 -2269 -1319 2734 -3351 -432 -3089 -132
467a32j718l171J0458j2712n32J2500j6362P523R068j3551J1251p14o225N977
$$ -132 -1850 -5021 5437 -7275 -7807 4693 -11669 -4146 4922 -8629 2622 1908 -4317 1660
481A660m594j241j479L476K047q076J3901m839j0930J9912j2462m189J8453j7668
$$ 1660 -2934 -4175 -5654 -2178 -131 -8207 5694 855 -10075 9837 -2625 -6814 11639 -6029
495f029N363Q028j4086J0596m198m111Q475p493J1142l231o674J5161j6504J876
$$ -6029 -666 7362 -6724 3872 -326 -4437 4038 -3455 7687 4456 -2218 12943 -3561 -1685
509a685J2171j8693J1762J565j1797J6546p592l062P497r383O793l223l49Q821
$$ -1685 10486 -8207 3555 5120 -6677 9869 2277 -785 6712 -2671 4122 899 550 9371
523I371j5803R115K808j7074J8490n071j1174J8704r950j631J0794j2681Q69J604
$$ 9371 -6432 2683 5491 -11583 6907 1836 -9338 9366 -584 -2215 8579 -4102 -3233 -1629
537a629l545L144M1L988n539J208P623j2440N964M177j4595J2177O02q222J0385
$$ -1629 -5174 -2030 -1989 1999 -3540 -2332 5291 -7149 -1185 2992 -11603 574 1176 -7046 3339
552C339o669k065M325l238N377k187J479K186p147P964l291q157R878n742N8Q991
$$ 3339 -3330 -5395 -1070 -4308 1069 -1118 361 2547 -4600 3364 73 -8084 1794 -3948 -3890 5101
568E101l906L023j836k672K059k709M496n288M84Q840j1860P721N678j6422J2316
$$ 5101 1195 4218 2382 -290 1769 -940 3556 -1732 -1248 7592 -4268 3453 9131 -7291 5025
583E025j379p497J5919j1058L95P046j5032J0019j019p363J3202j1305M152J0423
$$ 5025 3646 -3851 12068 1010 1405 8451 -6581 3438 2419 -4944 8258 -3047 1105 11528
597A1528j5756R943j531j3244J2563m145k710Q353p434J037K126n90j97l837P689
$$ 11528 -4228 5715 4184 -9060 3503 -642 -3352 5001 -2433 -1396 730 140 -57 -3894 3795
612C795p750k240J5668j4940q32J0836j6113R128O090j2155J2245l348p570R638
$$ 3795 -3955 -6195 9473 -5467 -6299 4537 -11576 -2448 3642 -8513 3732 384 -7186 2452
626B452m683j449N46j876M388m046N141K516r353P165j604m507R854n102k883
$$ 2452 -2231 -3680 -3134 -5010 -622 -4668 473 2989 -6364 801 -803 -5310 4544 -558 -3441
641c441N152k973L19J607M5k306n7O023l889K780K496r798O917q41n965J1139
$$ -3441 1711 -1262 -943 664 709 -1597 -1654 4369 480 3260 5756 -4042 2875 2034 -3931 7208
657G208o381l258R192o956L959J489p149N621l962R07N600o545L105k289k438
$$ 7208 827 -2431 6761 -195 3764 5253 -1896 3725 -237 670 6270 -275 2830 541 -1897
672a897O117m870K355J072o205P991m228j155O280j2046N302L984q746J1086m657
$$ -1897 4220 -650 1705 2777 -3428 4563 335 -820 5460 -6586 -1284 2700 -6046 5040 383
687C83n963R646q474K138N204q685M851j179p37N115o040L636k176m787J0783
$$ 383 -5580 4066 -4408 -2270 2934 -5751 -900 -2079 -2816 2299 -3741 -105 -2281 -7068 3715
702C715o817J41Q262j2830O421M658j0116Q090j807n661Q081j860k25J622k332
$$ 3715 -3102 -2961 5301 -7529 -1108 3550 -6566 1524 -283 -5944 2137 277 52 1674 -658
717f58k32j593M639j240k549O102o326J522O781r219M795K089q318Q820m32m704
$$ -658 -890 -2483 2156 916 -1633 4469 -1857 -335 6446 -2773 2022 4111 -4207 4613 4181 -523
733e23N084m325j179K932m59R10j663J859j510l81M639o371J080L095p175O954
$$ -523 4561 236 -943 1989 1530 2440 777 2636 1126 745 5384 -987 93 3188 -3987 2967
749B967O40p323P508m875l186P537m375Q81R78k055J661k523L531k762m262P919
$$ 2967 3607 -3716 3792 -1083 -4269 3268 -1107 -226 752 -1303 358 -2165 1366 -1396 -5658 2261
765B261p093J895Q383j2915O752L830j2723J2181j821q620J1265n830k093O213
$$ 2261 -4832 -2937 5446 -7469 -717 3113 -9610 2571 750 -7870 3395 -2435 -4528 1685
779A685m657J539j136Q50K230m135O542l326m332R180p500J140P666j1041O352
$$ 1685 -2972 -1433 -2569 -1719 511 -3624 2918 -408 -4740 4440 -3060 -1920 5746 -5295 1057
794A057K492p776Q294k714l459N197l438K699p82r74L813n713L767J646o327O987
$$ 1057 3549 -4227 4067 1353 -2106 3091 -347 2352 1570 596 4409 -1304 2463 4109 -2218 4769
810D769l304k834O659n458K166J989n468M911k150j175L811m313K320m44k138
$$ 4769 1465 -1369 5290 -168 1998 3987 -1481 3430 1280 105 3916 -397 1923 1479 -659
825f59L652m091M32K205l481K963j593J164Q84m795N527k666m212P787o638K55
$$ -659 2993 -1098 -666 1539 -1942 1021 -572 592 1476 -3319 2208 -458 -4670 3117 -3521 -3266
841c266O304p919M111J866n743M285j376r4J055j943M159m844J807L460q612P637
$$ -3266 3038 -4881 -770 1096 -4647 -362 -1738 -1832 -777 -2720 1439 -3405 -1598 1862 -6750 887
857H87k30q006J2048n759m414J0467p703J38N249m894K768q68Q20N67l358O397
$$ 887 657 -7349 4699 -1060 -5474 4993 -2710 -2572 2677 -2217 551 -317 503 1070 -2288 4109
873D109n922l08Q580j0544N013N787j2069R448N18q721R864m544l145N889m603
$$ 4109 -1813 -2121 6459 -4085 928 6715 -5354 4094 4612 -4109 5755 1211 -1934 3955 -648
888f48J707K64k00J550m394N711j595n426Q173n395j686P155p964L200K047o393
$$ -648 1059 1323 1123 2673 -1721 3990 2395 -3031 5142 -253 -1939 5216 -2748 452 2499 -3894
904c894M769q49j720K786k195K608k387n86L250n236K725J55m121O049k822r58
$$ -3894 875 26 -1694 1092 -1103 1505 -882 -1468 1782 -3454 -729 -574 -4695 1354 -1468 -2426
920b426M002m912K682J2j956L640m291J827K519n128M497j367k574M414l362K420
$$ -2426 1576 -3336 -654 -642 -2598 1042 -3249 -1422 1097 -4031 466 -901 -3475 939 -2423 -3
936cJ054k514L575l758K013J219n795P854l461l933J0109p952P78O608r522N188
$$ -3 1051 -1463 2112 -1646 367 1586 -4209 3645 184 -3749 6360 -1592 -814 5794 -3728 1460
952A460K706o655O031j653j443K024j974L467m134Q49M012p926O606P66q656R753
$$ 1460 4166 -2489 3542 1889 446 2470 496 3963 -171 678 4690 -3236 3370 4136 -4520 5233
968E233m074m675R314o093l30M482m787J715m30j02l2l322N291m148j212P694
$$ 5233 1159 -3516 5798 -295 -625 3857 -930 785 355 253 221 -3101 2190 -1958 -3170 4524
984D524p931K578N081r340N800J000p351N946j324l363L856p13o68k15J805L2
$$ 4524 -3407 -829 4252 -5088 712 1712 -5639 307 -1017 -4380 -524 -1237 -1905 -2120 -315 -283
1000b83k757M320l057j477M955n565J501L428m731L494m91j291L554l446L119
$$ -283 -3040 1280 -1777 -3254 1701 -3864 -2363 1065 -3666 -172 -663 -1954 1600 -1846 1273
1015A273n00l076N295m335J64L886o209M468J244m389N505k253o08K798l531K456
$$ 1273 773 -2303 2992 -1343 -1179 2707 -3502 966 2210 -2179 3326 1073 465 3263 -268 2188
1031B188j513q47L917n066L091J784n985O644l241k502O278n416J427K665m697
$$ 2188 675 -172 3745 -1321 1770 3554 -2431 4213 972 -1530 4748 -668 759 3424 -1273
1046a273L692k341o51L433n388L967J69m243O468m398j449M941o564K252L266
$$ -1273 2419 78 -573 2860 -2528 1439 1608 -2635 3833 -565 -2014 2927 -3637 -1385 1881
1061A881m770L435k56q37M95j968K350k666j16L021m552L808J193n258N876k310
$$ 1881 -2889 546 290 -547 -52 -2020 330 -2336 -2452 569 -3983 -175 1018 -4240 1636 -674
1077f74l289N913l154k73K520k329P14o00j85J59j162K928j361J103L264m463
$$ -674 -3963 1950 -1204 -1477 1043 -1286 -572 -1172 -1357 -1198 -2360 568 -793 310 3574 -889
1093h89J856J128l984L207j570j032L040k829K718N3j613L156m011K092K706n493
$$ -889 967 2095 -1889 1318 -252 -1284 1756 -1073 1645 1698 85 3241 -770 1322 4028 -1465
1109a465N123j502m602O073m503k20M420n329L386J652l266L595k275q19O48k707
$$ -1465 3658 2156 -2446 3627 -876 -1096 3324 -2005 1381 3033 -233 3362 1087 268 916 -1791
1125a791L064j990o36L088m055L490j65l766N038m111p50N262n614K722O58n041
$$ -1791 1273 -717 -1353 1735 -2320 1170 1005 -2761 2277 -1834 -2584 2678 -2936 -214 444 -4597
1141d597N344k819j211M879m426J207K183l012L097k373q35K184k821L092j20
$$ -4597 747 -2072 -3283 1596 -2830 -1623 560 -2452 645 -1728 -2563 -379 -3200 -108 -228
1156b28j899L412l321J177K195l478K483p66j370L079k022J153K57j563K105q45
$$ -228 -2127 1285 -2036 -859 1336 -2142 341 -425 -1795 1284 -738 415 672 -891 1214 369
1172C69J128M91l145L099k090q35M500m320J221K728l695L601k92k315K293k657
$$ 369 1497 1988 -1157 1942 -148 -983 3517 -803 418 3146 -549 3052 2760 445 2738 81
1188H1R06J110j942J582j983J9J822j784K728j578r01L206l860J599J245n835
$$ 81 987 2097 155 1737 -246 -227 1595 -189 2539 961 60 3266 -594 1005 2250 -3585
1204c585M168j787j793N652m231J386K336n047M168q81k829L373l519J139J810
$$ -3585 583 -1204 -2997 2655 -1576 -190 2146 -2901 1267 386 -2443 930 -2589 -1450 360
1219C60l077L017k883l82L809m073M141P58m875N196l195j759M187m705J286K211
$$ 360 -2717 300 -2583 -2965 844 -3229 912 1670 -3205 1991 -1204 -2963 1224 -3481 -2195 16
1235A6j823L256j101k99P12k464K588j584j93L643m963L109K074n834N128j392
$$ 16 -1807 1449 348 49 761 -1703 885 -699 -892 2751 -2212 897 2971 -2863 2265 873
1251H73l787N870j940k74K161k670N79q01L15P61j514K567q72q98L731l640m63
$$ 873 -2914 2956 1016 742 2903 233 812 11 326 1087 -427 2140 1268 370 4101 461 -2
1268bJ449m000K976J87j085K556k076O97J60j315J579l279J960J698m382M243
$$ -2 1447 -2553 423 610 -475 2081 5 702 862 -453 1126 -2153 -193 1505 -2877 1366
1284A366j087l813M485k966M83K837l329L014q99k222L677m972J143J714m124
$$ 1366 279 -3534 951 -2015 -1532 1305 -2024 990 91 -2131 1546 -3426 -2283 -569 -4693
1299d693N008n01j716M100l486N00J657l167K593j685L7J715k601L575j985j653
$$ -4693 315 -186 -1902 2198 -1288 -788 869 -2298 295 -1390 -1353 362 -2239 1336 -649 -2302
1315b302N450m912J879M739o871L646R03n059L882r91j317K139j265K433q42j63
$$ -2302 3148 -1764 115 4854 -2017 1629 2532 -2527 1355 364 -953 1186 -79 2354 1512 1349
1331A349J622l505K760o53l129N403m028j613N402m578R11L180l685J643Q65j262
$$ 1349 2971 -534 2226 1573 -1556 3847 -181 -1794 3608 -970 -59 3121 -564 1079 1944 682
1347F82K49r05J093k632N76K805m050K883J039l899L371j402j487K676l030J309
$$ 682 931 26 1119 -1513 -937 1868 -2182 701 1740 -2159 1212 -190 -1677 999 -2031 -722
1363g22Q25j776J624j646P29O18k501L751j543j717L800l816R7J915k828K285
$$ -722 103 -1673 -49 -1695 -966 -348 -2849 902 -641 -2358 1442 -2374 -2277 -362 -3190 -905
1379i05l02K16K446k572K326j298k740M199l841J82M459m782K942J450l026K660
$$ -905 -1207 -991 1455 -1117 1209 -89 -2829 1370 -2471 -2289 2170 -2612 330 1780 -1246 1414
1395A414j491j38J833k086K749j906l36K555n214L077J651n272O579k96l885N692
$$ 1414 -77 -215 1618 -468 2281 375 39 2594 -2620 457 2108 -3164 3415 3119 -766 4926
1411D926l869j430K790l891J304J108r55J022o62K044k216j359L936l835P62L312
$$ 4926 1057 -373 2417 -1474 -170 938 -17 1005 343 2387 171 -1188 2748 -1087 -325 2987
1427B987m472K268O51m594L205p63j796K701j67P49m18jL70l177J618o49j760
$$ 2987 -1485 783 1434 -3160 45 -718 -2514 187 20 769 351 350 720 -2457 -839 -1488 -3248
1444c248L907k148k1L551l521P79Q08j673Q37j04O09j60n99J659k268K47J902
$$ -3248 659 -1489 -1510 2041 -1480 -701 107 -1566 -729 -833 -224 -384 -983 676 -1592 -1345 557
1461E57k595K855M69k290L309k502o07J374k634K658n92r62M418l282O49K119
$$ 557 -2038 817 1286 -1004 2305 -197 -804 570 -2064 594 2 -960 3458 176 825 2944
1477B944m376L016o49k678M235k268l50K530k619J579r13J7K152l157K615k44
$$ 2944 -1432 1584 935 -1743 2492 224 -126 2404 -215 1364 451 468 2620 -537 2078 1834
1493A834l469L847l110j047M155m432K448K594m209L219q29k338J952k028P85
$$ 1834 -1635 2212 -898 -1945 2210 -2222 226 2820 -1389 1830 1001 -1337 615 -1413 -628
1508f28Pj305K758k499Q43J420l055L067m50k389L566k081j579K199k141K20O85
$$ -628 -621 -1926 832 -1667 -824 596 -2459 608 158 -2231 1335 -746 -2325 -126 -2267 -2047 -1362
1525a362K34O67m9J471j554l1J164k729J369J052k895L500p04j873L192k087L65
$$ -1362 -1128 -461 -510 961 -593 -624 540 -2189 -820 232 -2663 837 133 -1740 1452 -635 -270
1542b70J651k173K043J4j402J276j306J02l29n26K556j346J316J186k500K189
$$ -270 1381 -792 1251 1265 -137 1139 -167 -65 -394 -920 1636 290 1606 2792 292 2481
1558B481j959j217L005l720J924K256l664L239q62k516L473k975J111J729k890
$$ 2481 522 -695 2310 -1410 514 2770 -894 2345 1483 -1033 2440 -535 576 2305 -585
1573e85K103j260j070J761k879J610Q59j638L394j613r62J981l787J190P97k948
$$ -585 1518 258 -812 949 -1930 -320 539 -1099 2295 682 -280 1701 -2086 -896 -99 -3047
1589c047L045p23j28J838j898J118q36j490K060j551P93R95k337K466j126j552
$$ -3047 -2 -725 -853 985 -913 205 -631 -2121 -61 -1612 -819 176 -2161 305 -821 -2373
1605b373K636j905J008J595j449J823j004j473J137k011J042P09j87J676p92O72
$$ -2373 263 -1642 -634 961 -488 1335 331 -1142 -5 -2016 -974 -265 -452 1224 432 1104
1621A104M51k079J833j439l08J977k158J601N85k493K361j081o97K611j935R58
$$ 1104 1555 -524 1309 -130 -438 1539 -619 982 1567 -926 1435 354 -343 2268 333 1291
1637A291P57j922J430j686j16N15j416K391q31j49K620l540R83Q86l240K518p95
$$ 1291 2048 126 1556 -130 -246 269 -1147 1244 413 264 2884 -656 327 1213 -2027 491 -304
1654c04j196K748k198L09J569k671J925o64m73J718j973J517o85j999K285j954
$$ -304 -1500 1248 -950 -641 928 -1743 182 -482 -955 763 -1210 307 -378 -2377 -92 -2046
1670b046J44L137l075K057L94k222K097j397o95J505j424J273j11m46J439j508
$$ -2046 -1902 1235 -1840 217 611 -1611 486 -911 -1606 -101 -1525 -252 -363 -809 630 -878
1686h78P86O78j396K139j138k76J464k596J491L41j946K644q49M07J620k267J292
$$ -878 -92 586 -810 1329 191 -85 1379 -1217 274 615 -1331 1313 464 871 2491 224 1516
1703A516j87k484J998n23k12J244q99R21n49R9L62j502J450q43n94K942l167n6
$$ 1516 1329 -1155 843 320 108 1352 453 1374 825 924 1286 -216 1234 391 -203 2739 -428 -484
1721d84K265l852J781J645k378K041k67q11R65j264k16q28K22R78j755K804m28
$$ -484 1781 -2071 -290 1355 -1023 1018 751 -60 905 -359 -575 -1403 -1181 -203 -1958 846 418
1738D18k680L762k211j740L563k846K64K308k748J719k73j354M95L3J215m79N22
$$ 418 -2262 1500 -711 -2451 1112 -1734 -1470 838 -1910 -191 -464 -1818 -1323 -1290 -75 -554 -32
1755c2J286k739J158O43l301L280q70j494L949j957r4K411l565J125K02p16J485
$$ -32 1254 -1485 -327 316 -2985 295 -575 -2069 1880 -77 -171 2240 -1325 -200 2 -714 771
1772G71j051J044M58j911J611l77j063J999j547J642j1j105J242j737k50P34r32
$$ 771 -280 764 1222 -689 922 545 -518 1481 -66 1576 1565 460 1702 -35 -285 449 -483
1789d83J694n11o52K555k289m9J184k186O54K6k0J082q07J95r49J07J063k041
$$ -483 1211 700 48 2603 314 265 1449 -737 -83 -57 -77 1005 198 393 -556 -449 614 -1427
1807a427J697O87k753K911l60k995K655j624j029K373j029M04R20n24r35J01J292
$$ -1427 270 957 -1796 1115 755 -2240 415 -1209 -2238 135 -894 -490 430 -94 -1029 -928 364
1824C64j938j60K618l057J453K595m034K139Q65l151L355p82j346K022j134q14
$$ 364 -1574 -1734 884 -2173 -720 1875 -2159 -20 845 -2306 1049 267 -1079 943 -191 -1005
1840a005J051l01L39o96J877j78j319K619k180p12K418l238J234J913k821K287
$$ -1005 46 -255 84 -612 1265 1087 -232 2387 207 -505 1913 -1325 -91 1822 -999 1288
1856A288K37j664J791j048O4J39o85J123p51k44N69j534J217j19p57K093j548
$$ 1288 1525 -139 1652 604 668 807 122 1245 494 250 819 -715 502 383 -374 1719 171
1873A71K11R88j832R11p97r76J574j600R17J270j578Q97m8r24N84l46L32q61M35
$$ 171 382 1370 -462 449 -348 -1324 250 -1350 -433 837 -741 156 108 -816 -232 -578 -246 -1107 -672
1892f72M23j571J465m12j373K682j197p25L122k376l42J699k723O29J000p67P00
$$ -672 -249 -1820 -355 -767 -2140 542 -655 -1380 1742 -634 -976 723 -2000 -1371 -371 -1138 -438
1909d38O61M64j022O43N03k665K239N37k720L272l22k482L341j801q77K170j806
$$ -438 223 687 -335 308 811 -1854 385 922 -1798 1474 1152 -1330 2011 210 -667 1503 -303
1926c03P74J384j106R1k82P2p70k37K083j766R20J717k842J534P3k909K768n72
$$ -303 471 1855 749 840 558 630 -140 -377 1706 -60 860 2577 -265 1269 1342 -1567 1201 629
1944F29j577K420j052l27Q52j118M61k48o0N19p95J262j513k82J348k199P44J219
$$ 629 -948 1472 420 93 945 -173 288 40 -20 499 -296 966 -547 -829 519 -1680 -936 283
1962B83j631K198p38r15J309j687K27Q57j542Q78L72k38L42j45K53l87J69N43
$$ 283 -1348 850 112 -803 506 -1181 -954 -97 -1639 -761 -389 -627 -285 -430 -177 -564 -395 148
1980A48j141J490m58j348K107j541n68K030j846R82J409j652J335j27j179Q04
$$ 148 -993 497 39 -1309 798 -743 -1311 719 -1127 -145 1264 -388 947 820 -359 445
1996D45j040P07j45L0J100j174R07K56j581J954r72j059K507j849L04J692k646
$$ 445 -595 112 -33 -3 1097 -77 830 1086 -495 1459 487 -572 1935 86 390 2082 -564
2013e64J044J52j239J032m29R94n36k14R91j719K70P98j963J761J51j633K480
$$ -564 480 632 -607 425 -4 990 454 240 1231 -488 -218 580 -1383 378 529 -1104 1376
2030A376j395r98J711j831M36J093j532P20N31j070N19m20J14r2L14O72q56R77
$$ 1376 -19 -1017 694 -1137 -701 392 -1140 -420 111 -959 -440 -860 -746 -838 -524 148 -708 269
2048B69n57j116J315j538R7K012j607J018J320j860Q27k04p50P89l55M04l8R6
$$ 269 -288 -1404 -89 -1627 -1530 482 -1125 -107 1213 -647 180 -24 -774 15 -340 64 26 122
2066A22O79j195Q86l30n65J844j223K02J335k205P81N99j526R66J66J05M36j92
$$ 122 801 -394 492 162 -403 1441 218 420 1755 -450 331 930 -596 370 536 641 1077 885
2084H85N16q43q2P12j648J060K59j594K016r55q72K041k038K17J479j750R86Q9
$$ 885 1401 558 476 1188 -460 600 859 -735 1281 326 -546 1495 -543 -326 1153 -597 389 478
2102D78r28O93j142O06m61j78J403r52J49O89j443J074m36q26J366j168M81J002
$$ 478 -450 243 -899 -293 -754 -932 471 -481 -332 357 -1086 -12 -448 -1274 92 -1076 -595 407
2120D07j683J112j25j197J713r55K64Q06j297R44k7p62Q97p13K35K33l07J038
$$ 407 -1276 -164 -289 -1486 227 -728 -464 342 -955 -11 -38 -800 97 -616 -381 -148 -455 583
2138E83j172P18P06j964J141N99r40J441m42p35J129p78P5j34k3J45r4R99o75
$$ 583 -589 129 835 -1129 12 611 -329 1112 670 -65 1064 286 361 227 204 349 255 1254 579
2157E79n31J285j315J66J213j558J045N48j726J119m12p91O24m69L99jK01P37
$$ 579 48 1333 18 184 1397 -161 884 1432 -294 825 413 -378 246 -223 176 175 376 1113
2175A113j440P52l00j306J875j253j77J730j840N56L17j136Q23j55n76J363n84
$$ 1113 -327 425 125 -1181 694 -559 -736 994 -846 -290 27 -1109 -286 -441 -1017 346 -238
2192b38K64l06n05P15j258M73J017j459J593j20r42J245j172j56R02j050J194
$$ -238 26 -280 -785 -70 -1328 -855 162 -1297 296 176 -766 479 -693 -849 53 -997 197
2209A97o0l78J104j432O35J78j179J532o08j47J241r37K81L88r83L27l5N07mm95
$$ 197 137 -241 863 -569 66 244 -935 597 -11 -158 1083 146 427 815 -168 159 124 631 627 132
2229A32R28n65l61J072j420O49O53j187R23J97r60P98r70p1K82k47P01r09P75
$$ 132 1060 495 134 1206 -214 435 1088 -99 824 1021 61 859 -111 -182 100 -147 554 -355 420
2248D20J86j171R24o0j003J256q41l02J156j175O5J17m86N60k89M97j21l61Q65
$$ 420 606 -565 359 299 -704 552 -289 -591 565 -610 -545 -428 -914 -354 -643 -146 -267 -628 237
2267B37j077J21P19j542R47N70j268J445o60k36O23m64J30P2N1Q59j261Q58L01
$$ 237 -840 -719 0 -1542 -595 -25 -1293 152 -508 -744 -121 -585 -455 -383 -332 527 -734 124 425
2286D25j341J274n97m47J873j406r9J240j195P01j96n2L09k11M51k74k90J025
$$ 425 -916 358 -239 -686 1187 -219 -318 922 -273 428 232 180 489 278 729 455 165 1190
2304A190j130K66O54j138J266j28j230J505q73k04O63j199J115j44m36N49q54
$$ 1190 60 326 980 -158 1108 980 -250 1255 382 178 841 -358 757 613 177 726 -128
2321a28K77K44j138J075k69l33J022o60q4L26j089N21k33oM97p52Q44l56l27O62
$$ -128 149 393 -745 330 61 -272 750 90 6 332 -757 -236 -469 -475 22 -730 114 -242 -569 93
2341I3q75J58O55q26P73p9n26M10m93L26j98j4Q62q21J12Q98j300P83M10j554
$$ 93 -782 -624 31 -795 -22 -101 -627 -217 -710 -384 -582 -596 266 -555 -443 455 -845 -62 348 -1206
2361a206J532k60j65P02n49j17J04%K66n66P91k98m1R13j148K0J089j706J121
$$ -1206 326 66 -99 603 54 -63 41 41 307 -259 532 234 193 1106 -42 -22 1067 -639 482
2380D82K64q16J048k85p44J116j128M08M06q68R28o82N00J78j246J100n62p42
$$ 482 746 -70 978 693 -51 1065 -63 345 751 -117 811 129 629 807 -439 661 99 -643
2398f43J442j093M09M93q55L44j85n99R03j031N89O0o72R78o61l06Q88q08N72
$$ -643 799 -294 115 608 -247 97 -88 -687 216 -815 -226 -166 -838 140 -521 -827 61 -747 -175
2417a75l6o26Q58m59j12L61m26K73n9k54Q56p33j2O42n86P01k66k37Q71p93L99
$$ -175 -211 -837 21 -438 -550 -189 -615 -342 -401 -655 201 -532 -544 98 -488 213 -53 -290 581 -212 187
2438A87L2m50N02k91j36L63n38J266m99m58J170j095J52N69n68M52m59j00N84
$$ 187 219 -231 271 -20 -156 207 -331 935 436 -22 1148 53 205 774 206 658 199 99 683
2457F83o19O40j24k84Q27q05m5L23n63L62j96m72O85k17k44O19o41N87n68k03
$$ 683 64 704 580 296 1123 318 273 596 33 395 199 -273 412 195 -49 570 -71 516 -52 -255
2477b55L43m09K99J66q44P41l46m00R92j361Q55M50j024P83k77l36O50o00J25
$$ -255 88 -321 -22 144 -700 41 -305 -705 287 -1074 -219 231 -793 -10 -287 -623 27 -573 -448
2496d48N3k96M90j27j91N07o73N61m49O9N80o14N15K45r98J006q9n46Q83o40K79
$$ -448 -395 -691 -201 -328 -519 -12 -685 -124 -573 -504 76 -538 -23 222 -776 230 141 -405 478 -162 117
2517A17M32p62N59l07N1L92n25M84j24JN99q32L12L99j346R64j04m84P30k81j2
$$ 117 549 -213 346 39 90 482 -43 441 317 318 917 85 397 796 -550 414 310 -174 556 275 263
2538B63M73n26L52j84j85L28q28N81k49k96Q53p76j11Q07q21K31N21j108Q27o5
$$ 263 736 210 562 378 193 521 -307 274 25 -271 582 -194 -305 502 -319 -88 433 -675 152 87
2558H7l96J90o16N49l84OP24o93L62K79r88Q62n07j40P47r01M78L42n74R04l75
$$ 87 -309 -119 -735 -186 -570 -564 160 -533 -171 108 -880 -18 -525 -665 82 -819 -341 1 -573 331 -44
2579d4m89M86o05P37l29j65N89o00L28N96n76M28k58k30Q21p16N69L6q20O80j14
$$ -44 -533 -47 -652 85 -244 -409 180 -420 -92 504 -72 356 98 -132 689 -27 542 578 -242 438 324
2600C24k27O89p98N22K99p19N61k95q1j0k70L70j91k53P66o87N00L0p25N72j94
$$ 324 97 786 -12 510 809 90 651 356 275 265 -5 365 174 -79 687 0 500 530 -195 377 183
2621A83o91J041m57m34N81m99Q5N7L3k73n9O93m69m27J127j355M72N40j347J002
$$ 183 -508 533 76 -358 223 -276 -191 -134 -101 -374 -433 260 -209 -636 491 -864 -392 148 -1199 -197
2641a97K31r71Q64n3m73O66n02J9j11K50k5m25Q08m26l92J193p87m4R40j179O18
$$ -197 34 -937 -73 -126 -599 67 -435 -416 -527 -277 -302 -727 81 -345 -737 456 -331 -375 565 -614 4
2662DN08p95L28J17l91O36m75L57j28j46Q00p08K91P5m42O28n14k67Q30p55K55
$$ 4 512 -283 45 162 -229 407 -68 289 161 15 815 107 398 473 31 659 145 -122 708 -47 208
2683B08N04o95M14k8l14M87l54J22n9l89M52o8k56K06l25J38o4K27M9l36J59q4
$$ 208 712 17 431 403 89 576 222 344 285 -104 348 280 24 230 -95 43 -21 206 255 -81 78 -6
2705fp88J044n54m31J019o82J70M13m33k12L50k94k44L80J69p22M19N28j104J122
$$ -6 -794 250 -304 -735 284 -398 -228 185 -248 -460 -110 -404 -648 -268 -99 -821 -402 126 -978 144
2725A44M2j276J137o8r26J240n10j45O08n87jN05L2k97J40K24n08K39O90j346
$$ 144 186 -1090 47 -21 -947 293 -217 -362 246 -341 -342 163 195 -102 38 262 -246 -7 683 -663
2745f63Q00M67j265J241K19r99R53k79o02O74m22j11M49l84N3k6M09k96l21Q75
$$ -663 137 604 -661 580 799 -200 753 474 -128 546 124 13 462 78 131 105 514 218 -103 772
2765G72p50j30R62j266O41K78j159R92l86m86P25l10K41J64m29j62J0J16k24j46
$$ 772 22 -108 854 -412 229 507 -652 340 -46 -532 193 -117 124 288 -141 -303 -293 -177 -401 -547
2785e47M19k83J58K94q02P15j66p98R68m66k80R36o53K21L36n65K28K43m10J88
$$ -547 -128 -411 -253 41 -761 -46 -212 -1010 -42 -508 -788 148 -505 -284 52 -513 -285 -42 -452 -264
2805b64M17J06o37L03M5o78N95R9m15J119m06o24J286q00l23O28l54M0L32k28
$$ -264 153 259 -378 -75 -30 -708 -113 -14 -429 690 284 -340 946 146 -177 451 97 137 469 241
2825B41R1J50o1k68M66lo49Q40k80p19R09l04p19J117p04j00O57o09J86N93q22
$$ 241 332 482 421 153 619 616 -33 807 527 -192 717 413 -306 811 107 7 664 55 241 834 12
2846A2q4J92N1k79j11N5PJ85L50r74Q23j65o54R41r08N1N64n88Q9J10m46M32K11
$$ 12 -72 120 171 -108 -219 -164 -157 28 378 -596 227 62 -592 349 -559 -508 56 -532 -443 -333 -779 -347 -136
2869a36N3k99J0K05o35N28Q4m68M58r7m46Q75k78n09J034o71J88K02p5j57J71
$$ -136 -83 -382 -372 -167 -802 -274 -190 -658 -200 -297 -743 132 -146 -655 379 -292 -104 98 23 -134 37
2890C7j25J85jj96J81K01K37n53M64r3m16Q66q84L9R19p93J12K54m63J84M45n07
$$ 37 -88 97 96 -100 81 282 519 -34 430 337 -79 787 -97 -58 861 68 180 434 -29 155 600 93
2912I3L94k29K19j36l20J00k49K18j25j77Q00n35k88Q87r82J40L75j006O79L70
$$ 93 487 258 477 341 21 121 -128 90 -35 -212 588 53 -235 652 -330 -190 185 -821 -142 228
2932B28n70M93l75k67M55j51K9k53N20k94k77M69l76q6O19q49L84P08j036P57
$$ 228 -342 151 -224 -491 -36 -187 -158 -411 109 -185 -462 7 -369 -455 164 -685 -301 407 -629 128
2952A28j45n26L00J43o11M71J36J81R2j44q4O3N78p61j95R08o74M97J89p80N30
$$ 128 -17 -543 -243 -100 -711 -240 -104 77 169 25 -59 4 582 -179 -374 534 -140 357 546 -234 296
2973B96K42n44M32M5k08N67k58l10n3r1k2q4M00j45JO02n12m9J27m44K3J78l69
$$ 296 538 -6 426 471 263 830 572 262 209 118 96 12 412 267 268 870 358 309 436 -8 15 193 -176
2996a76L70J06m76L92k49j46K7n1K38l09K34q9k35J91l30p5M20o51O68K80o15
$$ -176 194 300 -176 216 -33 -179 -152 -203 35 -274 -40 -129 -364 -173 -503 -578 -158 -809 -141 139 -476
3017d76L35o8l53N45n51J55K94j85K1Q0m1K00l86K11j56K03M54o28M1K74n17O85
$$ -476 -141 -209 -562 -17 -568 -413 -119 -304 -283 -203 -244 -44 -430 -219 -375 -172 282 -346 -305 -31 -548 137
3039A37k4m35P38n31K09N86r17M48K02n06L48l69N28j13oJ53n05K83L00m45P07
$$ 137 113 -322 416 -115 94 680 -237 211 413 -93 255 -114 414 301 295 448 -57 226 526 81 788
3060G88l79p70N91l05l0P08n68K21N8q5l6k0r5l21J44J09q1j21L74m10L84k23
$$ 788 409 -361 230 -75 -105 603 35 256 314 229 193 173 78 -243 -99 10 -71 -192 182 -228 156 -67
3082f7n7J67l24J28L64n55J75Jp0L3m69N95j57m9O04o56J46Q7n64M86K6l03M87
$$ -67 -124 43 -281 -153 211 -344 -169 -168 -238 -205 -674 -79 -236 -285 319 -337 -191 -104 -668 -182 -156 -459 28
3105B8j7j02L17k57K09m12o3N26m76L56L81p43M47K3l59L73j95K23J41l04P53
$$ 28 11 -91 226 -31 178 -234 -297 229 -247 109 490 -253 194 217 -142 231 36 259 400 96 849
3126H49o34j47L37m40K72J76k01M30l93l03N19l91l8O5r4R8j59K93m3j78K66l89
$$ 849 215 68 405 -35 237 413 212 642 249 -54 465 74 36 101 7 105 -54 239 196 18 284 -105
3148a05%N42m34M5nn93K46l3k86L78j0J83J03l21M94n48OJ95n01L75j33j65N64
$$ -105 -105 437 3 48 43 -550 -304 -337 -623 -245 -255 -72 31 -290 204 -344 -338 -143 -644 -269 -402 -567 -3
3171cj70j99K75k48J90j09Q4J26k60Q7Q1p4J33J05j38N12j64L5P6l02R6l07K96
$$ -3 -173 -372 -97 -345 -155 -264 -180 -54 -314 -227 -146 -220 -87 18 -120 392 228 263 339 37 133 -174 122
3194A22j82L92J73k81m00P98m86J92l6l12O13k39j28J93l89M8K09j4J24o8R8L5
$$ 122 -60 332 505 224 -176 622 136 328 292 -20 593 354 226 419 30 78 287 273 397 329 427 462
3216D62k54j89J7r9K48n51M51J23l16L61N1p56N89l34j59L00k29J50l89L66N5
$$ 462 208 19 36 -63 185 -366 85 208 -108 253 304 -452 137 -197 -356 -56 -285 -135 -524 -158 -103
3237a03k49L7J30k55O54k84j22J41l48j29J92PN1J37L8J21k03O4j13M2L01j79
$$ -103 -352 -315 -185 -440 214 -70 -192 -51 -399 -528 -336 -329 -278 -141 -103 18 -185 -121 -234 -192 109 -70
3259g0j2Q8j77L71k01q3N4J19J73j63j23J60j00q3Q2j20K60n5N5P4Pl6oj59M3
$$ -70 -82 6 -171 200 -1 -84 -30 89 262 99 -24 136 36 -47 35 -85 175 120 175 249 256 220 214 55 98
3284I8k82K88R0j91K52J5l38O5O4r9J80m10J94K76l44K48l66O2J42j8J15j13K40
$$ 98 -184 104 194 3 255 270 -68 -3 61 -38 142 -268 -74 202 -142 106 -260 -198 -56 -74 41 -72 168
3307A68j73j59j23K83n05O31k22l57M87j80k3O6k07J29J8r6N7j14K87k50r9L38
$$ 168 -5 -164 -287 -4 -509 122 -100 -457 30 -150 -173 -107 -314 -185 -167 -263 -206 -320 -33 -283 -382 -44
3329d4m71L14L83k36L35j39q9L54o28P2K01J01Q3P4m23L65P6m73L52J52j69J94
$$ -44 -515 -201 182 -54 281 142 53 407 -221 -149 52 153 236 310 -113 252 328 -145 207 359 190 384
3351C84j7l9l72L99l68J64L81k64Q7M83r28K12Q6m84M58J5l08K79KJ31k12J55
$$ 384 367 328 -44 355 -13 151 532 268 355 838 -90 122 208 -276 182 197 -111 168 170 301 89 244
3373B44j6m51J09J08J18J3k77k3J27k53K79j34p6K06j03O0k53p2K1J36K1Rk9J33
$$ 244 228 -223 -114 -6 112 125 -152 -175 -48 -301 -22 -156 -232 -26 -129 -69 -322 -394 -373 -237 -216 -207 -236 -103
3397a03k84L00K1r4j12K16l44J99K46k08K60k34N1J4oK19r0J98R6j63L4K1m60
$$ -103 -387 -87 -66 -160 -272 -56 -400 -201 45 -163 97 -137 -86 -72 -78 141 51 249 345 182 216 237 -223
3420b23K99k3o8L42k70R8K24m26K19R4j94l2K23j31K19p4j74J81k16J52k67N09
$$ -223 76 53 -15 327 57 155 379 -47 172 266 72 40 263 132 351 277 103 284 68 220 -47 462
3442D62n37k9L21n06KJ86j08L71p0k27M54l05k76P6j33n5K78J17O6k12j9J19q
$$ 462 -75 -104 217 -289 -287 -101 -209 162 92 -135 319 14 -262 -186 -319 -374 -96 21 87 -125 -144 -25 -33
3465c3L9m65J94M15l89J45L56n34J32j89N6K64j26M38n12O8J72m94M38j17L5O08
$$ -33 6 -459 -265 150 -239 -94 262 -272 -140 -329 -273 -9 -135 303 -209 -141 31 -463 -25 -142 -107 501
3487E01n13j2M99l89M8K95m64J82K4J75J85m68K50L4l12M24k16n5K73l19J02o2
$$ 501 -12 -24 475 86 134 429 -35 147 171 346 531 63 313 347 35 459 243 188 461 142 244 182
3509A82k15J86j47m2N3R7M14k38k32J00m70N6K93l30L27J90m52K11r2k84j0L76
$$ 182 -33 153 6 -36 17 114 528 290 58 158 -312 -256 37 -293 34 224 -228 -17 -109 -393 -403 -27
3531b7j17j50K24R0n24J94q3j68K72j75M52P6j25j71Q6N2k00k6M06l19K47J46
$$ -27 -144 -294 -70 20 -504 -310 -393 -561 -289 -464 -12 64 -61 -232 -146 -94 -294 -320 86 -233 14 160
3553A60l57q3K36l13K52K78l63N66k49O0l2n57L53J49o5R4j75N59j91l02J43l27
$$ 160 -197 -280 -44 -357 -105 173 -190 376 127 187 155 -402 -49 100 35 129 -46 513 322 20 163 -164
3575a64M28P5l07J94J76k71K34j76j3J31j81J26J1p3K82m32J34k90K28k9JR6l
$$ -164 264 339 32 226 402 131 365 189 176 307 126 252 263 190 472 40 174 -116 112 83 84 180 177
3598A77j5J09m56J3rk0Q0q0j09M14n3n48M65j94J74j51Q8J04l77J65L76n87O17
$$ 177 162 271 -185 -172 -181 -201 -121 -201 -310 104 51 -497 -32 -226 -52 -203 -115 -11 -388 -223 153 -434 183
3621A83k26j71O5K9O2J72k03P2j60r8J95K06l09J80j34n6J16J6J68n4M9J7m0J40
$$ 183 -43 -214 -149 -120 -58 114 -89 -17 -177 -275 -80 126 -183 -3 -137 -193 -77 -61 107 53 102 119 79 219
3645B19j18l9L29l42K37j55j73J91j18r1K53j70K77R0m70M21j49o3o3k71J48L24
$$ 219 101 62 391 49 286 131 -42 149 31 -60 193 23 300 390 -80 341 192 129 66 -205 -57 267
3667B67m17J66J13j80M8l23J73r0J69J25j3n2L9j45kj07Q6n3J40j95M5o3L49m11
$$ 267 -150 16 129 -51 -3 -326 -153 -243 -74 51 38 -14 25 -120 -122 -229 -143 -196 -56 -251 -206 -269 80 -331
3691c31P7n7N9M9Q5R1n8J54k48m2J09P3J67r5K8P4J2q8l20L39j63J21mK39r6J67
$$ -331 -254 -311 -252 -203 -118 -27 -85 69 -179 -221 -112 -39 128 33 61 135 147 59 -261 78 -85 36 32 271 175 342
3717C42l06K4NP1L6j7K80k36qQ9k12L77l36m3L30p5j92M96m30j68L01m50J73j06
$$ 342 36 60 65 136 172 155 435 199 191 280 68 445 109 66 396 321 129 625 195 27 328 -122 51 -55
3741e5K12k54J29P7j40o1j6M0lj13J3K08k93n3L64j80l6J3N9J04p2j4L2k86K2
$$ -55 157 -97 32 109 -31 -92 -108 -68 -71 -184 -171 37 -256 -309 55 -125 -161 -148 -89 15 -57 -71 -39 -325 -303
3766c03K98j38J3k5p2N9l1K9MJ5J59k52L97j49k05K41j39l6n6q1K59j5J42q5r8
$$ -303 -5 -143 -130 -155 -227 -168 -199 -170 -166 -151 8 -244 153 4 -201 40 -99 -135 -191 -272 -13 -28 114 29 -69
3791f9J28J48j19J33m4k59M11l37J44j13J46J32k15Q7J82k26J19j50qk9J28j4
$$ -69 59 207 88 221 177 -82 329 -8 136 23 169 301 86 173 355 129 248 98 90 61 189 175
3813A75K57l41J84j06k61L99j96k47J69j31J67J38k39R4r5R7J32l40K56l61K50
$$ 175 432 91 275 169 -92 307 111 -136 33 -98 69 207 -32 62 -33 64 196 -144 112 -249 1
3834AK8l85N8%j23M25j6j23K38j01k54ON5M2j40K29p8j7L2k3J38J3k51J59J66
$$ 1 29 -356 -298 -298 -421 4 -12 -135 103 2 -252 -246 -191 -149 -289 -60 -138 -155 -123 -146 -8 5 -246 -87 79
3859G9J5P4O6k62J09k59J99n9j96K99J88j36J69j24j26p7J92R0k86M92k14p6J15
$$ 79 94 168 234 -28 81 -178 21 -38 -234 65 253 117 286 162 36 -41 151 241 -45 447 233 157 272
3882B72k46L65n8k80J75k32J06m1O1l9m7m2m2J50N6o5k44K70m43J66q7J86j30
$$ 272 26 391 333 53 228 -4 102 61 122 83 36 -6 -48 102 158 93 -151 119 -324 -158 -245 -59 -189
3905a89M11l58j63J86k04R5Q4l1Q1k5j5m7k22K81l8J31Jj68J94r9J78pj98k43
$$ -189 222 -136 -299 -113 -317 -222 -138 -169 -88 -113 -128 -175 -397 -116 -154 -23 -22 -190 4 -95 83 76 -122 -365
3929c65M78q4k7j30K0L03J43k77p4p0K28l09L5M62k50k6L1J53n9n2p3K18l9n8
$$ -365 113 29 2 -128 -108 195 338 61 -13 -83 145 -164 -129 333 83 57 88 241 182 130 57 275 236 178
3953A78n6j96O8j71Q2K43j16J42J25k40j1J95j33M4j58O4o7K6k1K4M8j7j83N64
$$ 178 122 -74 -6 -177 -95 148 32 174 299 59 48 243 110 154 -4 60 -7 19 -2 22 70 53 -130 434
3977D34n36q9L0R2P6k7j86P9j26j8R3L9J37l74L68R2k32o5L42k92j82J58j69K74
$$ 434 -102 -191 -161 -69 7 -20 -206 -127 -253 -271 -178 -139 -2 -376 -8 84 -148 -213 129 -163 -345 -187 -356 -82
4001h2k2j09J17k4J18j23J64P5k08K34O7o7R1k5l15J66P8l72M67l93Q2K84j0l23
$$ -82 -104 -213 -96 -120 -2 -125 39 114 -94 140 207 140 231 206 -109 57 135 -237 230 -163 -81 203 193 -130
4025a30L81q9k3N8j05M3J07k49O8K94k20k48K44j96L8M93l37J29l07K42j82j65
$$ -130 251 162 139 197 92 135 242 -7 61 355 135 -113 131 -65 -27 466 129 258 -49 193 11 -154
4047a54L1O1r1K15j89K84l26P7k5j81K11N5j56L18k9m07J04J08j61R1J76p8L94
$$ -154 -123 -62 -153 62 -127 157 -169 -92 -117 -298 -87 -32 -188 130 101 -306 -202 -94 -255 -164 12 -66 328
4070C28n16J78k23j42M04j77j3rJ94J47j77P2Q9m26L61q4J28J47j14k60J72J85
$$ 328 -188 -10 -233 -375 29 -148 -161 -170 24 171 -6 66 155 -271 90 6 134 281 167 -93 79 264
4092B64j28J48p5L6j12K50m07J14J36k46MJ44j96K24N7q6Q2j6k08K2l4K95l32
$$ 264 136 284 209 245 133 383 -24 90 226 -20 -16 128 -68 156 213 127 209 193 -15 7 -27 268 -64
4115f4K08j72L0K49l86L35l86M2K44N1m60J34K18m7o5J94l25K58O7k51N5Ko4j11
$$ -64 144 -28 2 251 -135 200 -186 -144 100 151 -309 -175 43 -4 -69 125 -200 58 125 -126 -71 -69 -133 -244
4139b44no1Q3K5M4L5K38k80l7N1qK38j75j49K92M3l85K19K71k05J23k4k9J01k9
$$ -244 -249 -310 -227 -202 -158 -123 115 -165 -202 -151 -159 79 -96 -245 47 90 -295 -76 195 -10 113 89 60 161 132
4164A32k00K7Q1J12J8L9l10M91j90j37JJ70n6o6r4Q0K46m03J08m7L32j52j19J15
$$ 132 -68 -41 40 152 170 209 -101 390 200 63 64 234 178 112 18 98 344 -59 49 2 334 182 63 178
4188A78j50j30K87J0j45J22k99R9P6j43P1j64M0l8j06L34r0M8j07J65j82r3J0
$$ 178 28 -102 185 195 50 172 -127 -28 48 -95 -24 -188 -148 -186 -292 42 -48 0 -107 58 -124 -217 -207
4211b07J24Q1o5J45j59j0j26j7J28n6qK28j36N4q2J32M3q2j52L3K17p8K53j23
$$ -207 -83 -2 -67 78 -81 -91 -217 -234 -106 -162 -170 58 -78 -24 -106 26 69 -13 -165 -132 85 7 260 137
4235A37l12K2L22k84K5J40rK02j37N3j32J52j79L01j44j29P1K40k29j68M03k22
$$ 137 -175 -153 169 -115 -90 50 41 243 106 159 27 179 0 301 157 28 99 339 110 -58 345 123
4257A23M2J05l62O8L34p3R0m4M1k00j45P4O7p5k78J30l9n1O4ojM0l97O35N6l35
$$ 123 165 270 -92 -24 310 237 327 283 324 124 -21 53 120 45 -233 -103 -142 -193 -129 -135 -136 -96 -493 142 198 -137
4283a37K20j96M9j60J2J09L0M5q7k30N7M43m7j49k93M13k91K87l51J65J30p3L84
$$ -137 83 -113 -64 -224 -212 -103 -73 -28 -115 -345 -288 155 108 -41 -334 79 -212 75 -276 -111 19 -54 330
4306C30j74k33J34J58j64N9j2j55M11k72j29J07P5q2K85j86j78L63k35m05O05
$$ 330 156 -77 57 215 51 110 98 -57 354 82 -47 60 135 53 338 152 -26 337 102 -303 302
4327C02Q3n12J73j04M3l4N04j26k16Q2j71q6K31k11K59l53N2J74J55j54k99J61
$$ 302 385 -127 46 -58 -15 -49 455 329 113 195 24 -62 169 -42 217 -136 -84 90 245 91 -208 -47
4349d7l22L24p3J04k09J48J31j26j1J73P5k22j4K7J89n1m50K45L1j76K84O0q2
$$ -47 -369 -45 -118 -14 -223 -75 56 -70 -81 92 167 -55 -69 -42 147 96 -354 -109 -78 -254 30 90 8
4372Hk0j22K9J2L36l78N7J56K7j79L97l42QN1R4j16J99l28J47j19n6M14j44L13
$$ 8 -12 -134 -105 -93 243 -135 -78 78 105 -74 323 -19 -11 40 134 18 217 -111 36 -83 -139 275 131 444
4396D44r3m14M63m20j30L39k74R8J93k8k37M46k31k27J60j90M4J2q0O7K5L8r1
$$ 444 351 -63 400 -20 -150 189 -85 13 206 178 -59 387 156 -71 89 -101 -57 -45 -125 -58 -33 5 -86
4419h6jl2J85nL21l85J08j46l54M03j62K96j69n9K34k3l03j35L07j70N7J12k2
$$ -86 -87 -119 66 61 382 -3 105 -41 -395 8 -154 142 -27 -86 148 125 -178 -313 -6 -176 -119 -7 -29
4442b9O9O0n75N63j87J47J02k77o3K59n0k16M30k32P1k29K2J82j41J77J10m5k
$$ -29 40 100 -475 88 -99 48 150 -127 -190 69 19 -197 233 1 72 -157 -135 47 -94 83 193 148 146
4465A46J28J00m07N7J59j50j30J43JR5m2K0o2K8P6k32K50j65J46p5J3Q4k72L45
$$ 146 274 374 -33 24 183 33 -97 46 47 142 100 120 58 86 162 -70 180 15 161 86 99 183 -89 256
4489B56n06J73P6J08J65k44J0K0j93N1K63r9j55K81k66oj12J26j60j8K92M4l39
$$ 256 -250 -77 -1 107 272 28 38 58 -135 -84 179 80 -75 206 -60 -66 -178 -52 -212 -230 62 106 -233
4512b33l1k31M43r5K42j92k82K20j64K56j54q3K16j35K75M79q81O21p26R15l80
$$ -233 -264 -495 -52 -147 95 -97 -379 -159 -323 -67 -221 -304 -88 -223 52 531 -350 271 -455 460 80
4533H0p4k36%J92Q4K97j86J16k77n84L41J65K08N47m82k0J09L01o34K16J28J75
$$ 80 6 -230 -230 -38 46 343 157 273 -4 -588 -247 -82 126 673 191 171 280 581 -53 163 291 466
4555D66k61J26m04N07k47p7n5j36O3n20M63K58R4j07j04l11K11o1J74Q0l8l43
$$ 466 205 331 -73 434 187 110 55 -81 -18 -538 -75 183 277 170 66 -245 -34 -95 79 159 121 -222
4577b22K54p8K3M3l87j6O71j8o02J91k6K20J59j64j80N9J49l97N15J21m31N23
$$ -222 32 -46 -23 20 -367 -383 288 270 -332 -141 -167 53 212 48 -132 -73 76 -321 194 315 -116 407
4599D07m96m30N10j51j3R4j78J93q1o6K98j02k79M14k17K50j2Q4l94O73nn49K07
$$ 407 -89 -519 -9 -160 -173 -79 -257 -64 -145 -211 87 -15 -294 120 -97 153 141 225 -169 504 499 -50 157
4622A57l85O91l86K29k72O68q20L63n23O47n31J23K41k08l16k26R30L2j0K6m14
$$ 157 -228 463 77 306 34 702 -118 245 -278 369 -162 -39 202 -6 -322 -548 382 414 404 430 16
4643A6j77K60k51N94q65L63L8L1r4K0J72l32L70n59J77M47j70l3m33M85m13M08
$$ 16 -161 99 -152 442 -423 -60 -22 9 -85 -65 107 -225 145 -414 -237 210 40 7 -426 59 -354 54
4665E4j55m64P71l25l8j1M26l18J73l12K43N4k31J07l5L57n52l8M05l7J44o09
$$ 54 -101 -565 206 -119 -157 -168 258 -60 113 -199 44 98 -133 -26 -61 296 -256 -294 111 74 218 -391
4687c91N95j34j55K40l27P12o33j00N17J78m40J41j86L54m51N23l32K79j50m50
$$ -391 204 70 -85 155 -172 540 -93 -193 324 502 62 203 17 371 -80 443 111 390 240 -210
4707b10j43P56k14k78J15n7L07m47L58k89L73j67j17J11m2l16L34k71k2J6L63
$$ -210 -353 403 189 -89 26 -31 276 -171 187 -102 271 104 -13 98 56 -260 74 -197 -219 -203 160
4728A60n9m53O30r1k90K79N4j73l2J00K36k89k58l5p3J15R4j25L86k45l84O83
$$ 160 101 -352 278 187 -103 176 230 57 25 125 361 72 -186 -221 -294 -179 -85 -210 176 -69 -453 230
4750B30K97r89L09k02N94j5j78M07l96o9n2M4M33n46R2J50K0j92K85J66l89Q6
$$ 230 527 -462 -153 -355 239 224 46 453 57 -12 -64 -20 413 -133 -41 109 129 -63 222 388 -1 85
4772H5k38K94L78m93n8N20n51m8K93j05j77L76l23J20l02N9L90j64j86N8K64l72
$$ 85 -153 141 519 26 -32 488 -63 -111 182 77 -100 276 -47 73 -229 -170 220 56 -130 -72 192 -180
4794a80L05j41Q3k69LJ54j61J42j71PK71n3Lk0k41J20L87j84m14L95J68n11J36
$$ -180 125 -16 67 -202 -199 -45 -206 -64 -235 -228 43 -10 -7 -27 -268 -148 239 55 -359 36 204 -307 -171
4817a71K81j63M0L2k87K13p4K6J23k4nK22k93J04J06J53m39M08j27oj87J35r2
$$ -171 110 -53 -13 19 -268 -55 -129 -103 20 -4 -9 213 -80 24 130 283 -156 252 125 119 -68 67 -25
4840b5M59l72k82J95P2J8j11r4N9N9N1K89k44K5p3K7J80j94j35N7Q4o0K6J7j52
$$ -25 434 62 -220 -25 47 65 -46 -140 -81 -22 29 318 74 99 26 53 233 39 -96 -39 45 -15 11 28 -124
4865a24J78K53k51j91R5K1K6k84N23m84o0P9L06k24o5P3j04K70K78l36o0J16m6
$$ -124 54 307 56 -135 -40 -19 7 -277 246 -238 -298 -219 87 -137 -202 -129 -233 37 315 -21 -81 35 -11
4888a1j10J13K33m71K93k51j30K92o1L9j14L46l3J03o04O81l87j60N24k21k31
$$ -11 -121 -8 225 -246 47 -204 -334 -42 -103 -64 -178 168 135 238 -366 315 -72 -232 292 71 -160
4909a60L64j20o2J16J84q5j59J34l01J11o9L41r2m11K82j9k8J03l87K5K31k92
$$ -160 204 84 22 138 322 237 78 212 -89 22 -47 294 202 -209 73 54 26 129 -258 -233 -2 -294
4931b94M0L93Q6k32k46L35l97O09L2j35l62R9j15O70q32p8J39J20K08N0p13J47
$$ -294 -254 139 225 -7 -253 82 -315 294 326 191 -171 -72 -187 483 -349 -427 -288 -168 40 90 -623 -476
4953d76P80o13O4Q34l91o48K31Q37m54l81K12l0M45l79l9m6M94m60qJ08M1N5l9
$$ -476 304 -309 -245 589 198 -450 -219 618 164 -217 -5 -35 410 31 -8 -54 440 -20 -28 80 121 176 137
4976A37l91P61o74M8O80r24O82k48o7M41q10K03j28R01j87q48M79K01K34q40K84
$$ 137 -254 507 -167 -119 561 -363 319 71 4 445 -365 -162 -290 611 424 -424 55 256 490 -350 -66
4997f6K8r2M4K47O57n01k0m17J28k08N31j14n11r9K73R6N9m00K77K62J08l56L81
$$ -66 -38 -130 -86 161 818 317 297 -120 8 -200 331 217 -294 -393 -120 -24 35 -365 -88 174 282 -74 307
5020C07j18k63N87o58kN08q98N84L22k91K17m92J31M65k11j27O7j32J68k03J58
$$ 307 189 -74 513 -145 -147 361 -537 47 369 78 295 -197 -66 399 188 61 128 -4 164 -39 119
5041A19N33p69l0M99m89n08P25M9k33k4L00N74p15j50K74n4j42K49k04J71k26
$$ 119 652 -117 -147 352 -137 -645 80 129 -104 -128 172 746 31 -119 155 101 -41 208 4 175 -51
5062e1K18O9J74m22k69N42m23N2K70m47N79J61j64k4j38J34o18J25M93k50J49
$$ -51 167 236 410 -12 -281 261 -162 -110 160 -287 292 453 289 265 127 261 -357 -232 261 11 160
5083A60j73K41j50k93K62L46l64O2k7j08n6J77p9n2L89p25J37M21n28Q7N96l10
$$ 160 -13 228 78 -215 47 393 29 91 64 -44 -100 77 -2 -54 335 -390 -253 168 -360 -273 323 13
5105A3j12j7j93K49m51R74n63N2k61L95p0K02j71K05J04k60R3m64O13k43l15O43
$$ 13 -99 -116 -309 -60 -511 463 -100 -48 -309 86 16 218 47 252 356 96 189 -275 338 95 -220 423
5127D23j98m64J97j11N17p39O89n58K15nM46j85q4l73N62k82J17n8k51n2L79j87
$$ 423 225 -239 -42 -153 364 -375 314 -244 -29 -34 412 227 143 -230 332 50 167 109 -142 -194 185 -2
5149bK92l22j38K97k68o3P8j66M25l10l1j72M33J47m42J14k11J34n3PL16l50L11
$$ -2 290 -32 -170 127 -141 -204 -126 -292 133 -177 -208 -380 53 200 -242 -128 -339 -205 -258 -251 65 -285 26
5172B6K85m16J19j44J34J86J75n78J08L01n20L76l25K96j24J7P9m24L60k01j07
$$ 26 311 -105 14 -130 4 190 365 -213 -105 196 -324 52 -273 23 -101 -84 -5 -429 -69 -270 -377
5193c77M73l31L58l10M04Q3k46On4l23O23p09KL42j62J41M74n24P49r61M35Q9
$$ -377 96 -235 123 -187 217 300 54 60 6 -317 306 -403 -401 -59 -221 -80 394 -130 619 -342 93 182
5215A82l12L05n5K01l09K30R3n06L1O72r46K06M56k24j09K63l22R3J1K33m59P17
$$ 182 -130 175 120 321 12 242 335 -171 -140 532 -414 -208 248 24 -85 178 -144 -51 -40 193 -266 451
5237D51m30K30m7j8k32pJ36J97j87Q9K97n46O76k97k90M0J58j64L8k4J0J83m82
$$ 451 21 251 204 186 -46 -53 83 280 93 182 479 -67 609 312 22 62 220 56 94 70 80 263 -219
5260b19K43o85Q33l55J94K66l14j65PK23K29k34Q5K22r3k68o2j79M05k0n7j25
$$ -219 24 -661 172 -183 11 277 -37 -202 -195 28 257 23 108 330 237 -31 -93 -272 133 113 56 -69
5282f9N24j59K55o54k4N90l20R7l23j12K1K30P5J75K32p70L57J25R8J00l7m70
$$ -69 455 296 551 -103 -127 463 143 240 -83 -195 -174 56 131 306 538 -232 125 250 348 448 411 -59
5304e9j77J03L70K66k87o8n78K80l5K49l81N96k61M9l07k92M35k90L79K13j61
$$ -59 -236 -133 237 503 216 148 -430 -150 -185 64 -317 279 18 67 -240 -532 -97 -387 -8 205 44
5325D4p9M68n22m48M32k74J08J72J08j89K58k87n8N57j11J14j81p5M15m78M93
$$ 44 -35 433 -89 -537 -105 -379 -271 -99 9 -180 78 -209 -267 290 179 293 112 37 452 -26 467
5346D67r8k74N9o26K2R65o97P9j03L29j60Q6k62L58J0J31J34o00l06Q45n50M46
$$ 467 369 95 154 -472 -450 515 -182 -103 -206 123 -37 49 -213 145 155 286 420 -180 -486 359 -191 255
5368B55L28l10q4P8m4J17j76j67k41Q53l77k48K17m7j3J36m94l1J40J41k54oN89
$$ 255 583 273 189 267 223 340 164 -3 -244 609 232 -16 201 154 141 277 -217 -248 -108 33 -221 -227 362
5391C62j72K50m22L7L07k22l39R8M10K33r31J95j09K97k7L3k95J84L10M12j23
$$ 362 190 440 18 55 362 140 -199 -101 309 542 -389 -194 -303 -6 -33 0 -295 -111 199 611 488
5412D88p66M41M82n90l64o6J96M8j02K97K07k80P2R0N3m8L17L8m88q8J36k17J03
$$ 488 -278 163 645 55 -309 -375 -179 -131 -233 64 271 -9 63 153 206 158 475 513 25 -63 73 -144 -41
5435d1L2M25l98j70Q50q86K51L14l80J45m97L13L64l9j3o22J45M88N5R6l91l39
$$ -41 -9 416 18 -152 698 -188 63 377 -3 142 -355 -42 322 283 270 -352 -207 281 336 432 41 -298
5457b98P30n28k33R6l24P82J81m86j06K15l24l99J151k07j000Q20M3L63m82k46
$$ -298 432 -96 -329 -233 -557 225 406 -80 -186 29 -295 -694 457 250 -750 70 113 476 -6 -252
5477b52J45M44n26K15j44J9P86m06m03jJ06J03J40k51Rm05K62J70j60J87K8K75
$$ -252 -107 337 -189 26 -118 -99 687 281 -122 -123 -17 86 226 -25 -16 -421 -159 11 -149 38 66 341
$$ [...]
8191D16
##END NTUPLES=NMR FID
##END=
