##TITLE=1H_L3L30-SeO2-7d-f9
 CDCl3,8 sc, 
 2.03.2021
##JCAMPDX= 6.0         $$ Bruker NMR JCAMP-DX V2.0
##DATA TYPE= NMR FID
##DATA CLASS= NTUPLES
##ORIGIN= UXNMR, Bruker Analytische Messtechnik GmbH
##OWNER= root
$$ XWIN-NMR		Version 3.5
$$ Tue Mar  2 10:16:50 2021 Russian Standard Time (UT+4h)  she@DPX200
##.OBSERVE FREQUENCY= 200.1315066352
##.OBSERVE NUCLEUS= ^1H
##.DELAY= (6, 6)
##.ACQUISITION MODE= SIMULTANEOUS
##.ACQUISITION SCHEME= undefined
##.AVERAGES= 8
##.DIGITISER RES= 18
##SPECTROMETER/DATA SYSTEM= spect
##.PULSE SEQUENCE= zg30
##.SOLVENT NAME= CDCl3
##.SHIFT REFERENCE= (INTERNAL, CDCl3, 0, 15.7039)
##AUDIT TRAIL= $$ (NUMBER, WHEN, WHO, WHERE, WHAT)
$$ ##TITLE= Audit trail, XWIN-NMR		Version 3.5
$$ ##JCAMPDX= 5.01
$$ ##ORIGIN= Bruker BioSpin GmbH
$$ ##OWNER= she
$$ F:/spectra/data/she/nmr/H-F/1/audita.txt
$$ ##AUDIT TRAIL=  $$ (NUMBER, WHEN, WHO, WHERE, WHAT)
(   1,<2021-03-02 10:15:41.23 +0400>,<she>,<DPX200>,
      <created by zg, POWCHK disabled, PULCHK disabled
       configuration hash MD5:
       00 E9 B6 7A A2 85 ED C7 34 08 36 98 17 FE 4E 26
       data hash MD5: 16K
       7A 98 44 CA DE 33 46 63 14 53 E8 A9 F5 AC BF DA>)
$$ ##END=
$$ 
$$ hash MD5
$$ 50 23 1F EE B2 FF 54 8E 4A 1F 23 2B 13 09 B1 C8
##$RELAX= 
##$RELAX= 
##$RELAX= 
##$RELAX= 
##$RELAX= 
##$RELAX= 
$$ Bruker specific parameters
$$ --------------------------
##$DU= <F:/spectra>
##$EXPNO= 1
##$NAME= <H-F>
##$PROCNO= 1
##$TYPE= <nmr>
##$USER= <she>
##$AMP= (0..31)
100 100 100 100 100 100 100 100 100 100 100 100 100 100 100 100 100 100 
100 100 100 100 100 100 100 100 100 100 100 100 100 100 
##$AQSEQ= 0
##$AQ_mod= 1
##$AUNM= <au_zg>
##$AUTOPOS= <>
##$BF1= 200.13
##$BF2= 200.13
##$BF3= 200.13
##$BF4= 200.13
##$BF5= 200.13
##$BF6= 200.13
##$BF7= 200.13
##$BF8= 200.13
##$BYTORDA= 1
##$CFDGTYP= 0
##$CFRGTYP= 5
##$CHEMSTR= <none>
##$CNST= (0..31)
1 1 145 1 1 1 1 1 1 1 1 1 1 1 1 1 1 1 1 1 1 1 1 1 1 1 1 1 1 1 1 1 
##$CPDPRG= <>
##$CPDPRG1= <>
##$CPDPRG2= <>
##$CPDPRG3= <>
##$CPDPRG4= <mlev>
##$CPDPRG5= <mlev>
##$CPDPRG6= <mlev>
##$CPDPRG7= <mlev>
##$CPDPRG8= <mlev>
##$CPDPRGB= <>
##$CPDPRGT= <>
##$D= (0..31)
0 1.2 0 0 0 0 0 0 0 0.06 0 0.03 0 0 0 0 0.0002 0 0 0 0 0 0 0 0 0 0 0 0 
0 0 0 
##$DATE= 1614665740
##$DBL= (0..7)
120 120 120 120 120 120 120 120 
##$DBP= (0..7)
150 150 150 150 150 150 150 150 
##$DBP07= 0
##$DBPNAM0= <>
##$DBPNAM1= <>
##$DBPNAM2= <>
##$DBPNAM3= <>
##$DBPNAM4= <>
##$DBPNAM5= <>
##$DBPNAM6= <>
##$DBPNAM7= <>
##$DBPOAL= (0..7)
0.5 0.5 0.5 0.5 0.5 0.5 0.5 0.5 
##$DBPOFFS= (0..7)
0 0 0 0 0 0 0 0 
##$DE= 6
##$DECBNUC= <off>
##$DECIM= 32
##$DECNUC= <off>
##$DECSTAT= 4
##$DIGMOD= 1
##$DIGTYP= 9
##$DL= (0..7)
0 120 120 120 120 120 120 120 
##$DP= (0..7)
150 150 150 150 150 150 150 150 
##$DP07= 0
##$DPNAME0= <>
##$DPNAME1= <>
##$DPNAME2= <>
##$DPNAME3= <>
##$DPNAME4= <>
##$DPNAME5= <>
##$DPNAME6= <>
##$DPNAME7= <>
##$DPOAL= (0..7)
0.5 0.5 0.5 0.5 0.5 0.5 0.5 0.5 
##$DPOFFS= (0..7)
0 0 0 0 0 0 0 0 
##$DQDMODE= 0
##$DR= 18
##$DS= 0
$$ [...]
##$SUBNAM2= <"">
##$SUBNAM3= <"">
##$SUBNAM4= <"">
##$SUBNAM5= <"">
##$SUBNAM6= <"">
##$SUBNAM7= <"">
##$SUBNAM8= <"">
##$SUBNAM9= <"">
##$SW= 16.9725356469052
##$SWIBOX= (0..15)
0 0 2 0 0 0 0 0 0 0 0 0 0 0 0 0 
##$SW_h= 3396.73913043478
##$TD= 16384
##$TD0= 1
##$TE= 0
##$TE2= 300
##$TE3= 300
##$TEG= 300
##$TL= (0..7)
0 120 120 120 120 120 120 120 
##$TP= (0..7)
150 150 150 150 150 150 150 150 
##$TP07= 0
##$TPNAME0= <>
##$TPNAME1= <>
##$TPNAME2= <>
##$TPNAME3= <>
##$TPNAME4= <>
##$TPNAME5= <>
##$TPNAME6= <>
##$TPNAME7= <>
##$TPOAL= (0..7)
0.5 0.5 0.5 0.5 0.5 0.5 0.5 0.5 
##$TPOFFS= (0..7)
0 0 0 0 0 0 0 0 
##$TUNHIN= 0
##$TUNHOUT= 0
##$TUNXOUT= 0
##$USERA1= <user>
##$USERA2= <user>
##$USERA3= <user>
##$USERA4= <user>
##$USERA5= <user>
##$V9= 5
##$VALIST= <valist>
##$VCLIST= <CCCCCCCCCCCCCCC>
##$VD= 0
##$VDLIST= <DDDDDDDDDDDDDDD>
##$VPLIST= <PPPPPPPPPPPPPPP>
##$VTLIST= <TTTTTTTTTTTTTTT>
##$WBST= 1024
##$WBSW= 4
##$XGAIN= (0..3)
0 0 0 0 
##$XL= 0
##$YL= 0
##$YMAX_a= 113779
##$YMIN_a= -138691
##$ZGOPTNS= <>
##$ZL1= 120
##$ZL2= 120
##$ZL3= 120
##$ZL4= 120
##$ABSF1= 10
##$ABSF2= 0
##$ABSG= 5
##$ABSL= 3
##$ALPHA= 0
##$AQORDER= 0
##$ASSFAC= 0
##$ASSFACI= 0
##$ASSFACX= 0
##$ASSWID= 0
##$AUNMP= <proc_1d>
##$AZFE= 0.1
##$AZFW= 0.1
##$BCFW= 1
##$BC_mod= 2
##$BYTORDP= 1
##$COROFFS= 0
##$CY= 11.3945322036743
##$DATMOD= 1
##$DC= 2
##$DFILT= <>
##$DTYPP= 0
##$F1P= 15.9154993809931
##$F2P= -4.1035820241983
##$FCOR= 0.5
##$FTSIZE= 0
##$FT_mod= 4
##$GAMMA= 1
##$GB= 0.15
##$INTBC= 1
##$INTSCL= 1
##$ISEN= 128
##$LB= 0.24
##$LEV0= 0
##$LPBIN= 0
##$MAXI= 10000
##$MC2= 0
##$MEAN= 0
##$ME_mod= 0
##$MI= 1.114404
##$NCOEF= 0
##$NC_proc= 0
##$NLEV= 6
##$NOISF1= 3.799351
##$NOISF2= 2.8
##$NSP= 1
##$NTH_PI= 0
##$NZP= 0
##$OFFSET= 15.70392
##$PC= 1
##$PHC0= -10759.33
##$PHC1= 9.800941
##$PH_mod= 1
##$PKNL= yes
##$PPARMOD= 0
##$PSCAL= 0
##$PSIGN= 0
##$REVERSE= no
##$SF= 200.130013532006
##$SI= 16384
##$SIGF1= 3
##$SIGF2= 2
##$SINO= 400
##$SIOLD= 16384
##$SREGLST= <1H.CDCl3>
##$SSB= 0
##$STSI= 0
##$STSR= 0
##$SW_p= 3612.71676300578
##$SYMM= 0
##$S_DEV= 0
##$TDeff= 0
##$TDoff= 0
##$TI= <>
##$TILT= no
##$TM1= 0
##$TM2= 0
##$TOPLEV= 0
##$USERP1= <user>
##$USERP2= <user>
##$USERP3= <user>
##$USERP4= <user>
##$USERP5= <user>
##$WDW= 1
##$XDIM= 8192
##$YMAX_p= 0
##$YMIN_p= 0
$$ End of Bruker specific parameters
$$ ---------------------------------
##NTUPLES= NMR FID
##VAR_NAME=  TIME,          FID/REAL,        FID/IMAG
##SYMBOL=    X,             R,               I
##VAR_TYPE=  INDEPENDENT,   DEPENDENT,       DEPENDENT
##VAR_FORM=  AFFN,          ASDF,            ASDF
##VAR_DIM=   8192,          8192,            8192
##UNITS=     SECONDS,       ARBITRARY UNITS, ARBITRARY UNITS
##FACTOR=    0.0002944,     1,               1
##FIRST=     0,             0,               0
##LAST=      2.4114304,     0,               0
##MIN=       0,             -138691,         0
##MAX=       2.4114304,     113779,          0
$$ Real data points
##PAGE= N=1
##DATA TABLE= (X++(R..R)), XYDATA
0@%%%%%%%%%%%%qJ6j6J6j6K4l2L6m4N3o1P2q8J04j20J36j52J75k02K27k57K93
$$ 0 0 0 0 0 0 0 0 0 0 0 0 0 -8 8 -8 8 -8 16 -16 20 -24 29 -32 40 -48 56 -64 72 -80 95 -107 120 -137 156
34A56l30L71m18M67n23N85o49P19p97Q83r77J079j189J310j445J592j751J928
$$ 156 -174 197 -221 246 -277 308 -341 378 -419 464 -513 566 -623 687 -758 834 -917 1011
52A011k127K347k594K873l189L555l981M479n077N818o751P960r607J1981j5695
$$ 1011 -1116 1231 -1363 1510 -1679 1876 -2105 2374 -2703 3115 -3636 4324 -5283 6698 -8997
67h997K2318l7426J27915R969k49959K43829r0328j13396J69007q8539l4818J13972
$$ -8997 13321 -24105 103810 113779 -136180 107649 17321 -96075 72932 -15607 -50425 63547
79F3547p7275l237N3368j2307m7111J2716M1256m8182L1027M7623r8559L8061
$$ 63547 -13728 -16965 36403 24096 -23015 -10299 30957 -17225 13802 61425 -37134 927
91I27K2688p9726P0580M301n6052O8197j8594k3379M3420l1446k1238J2670n402
$$ 927 23615 -56111 14469 18770 -37282 30915 12321 -11058 32362 916 -20322 -7652 -13054
104a3054J3000N054r720O16N792j2054O87K4821j9925j2533K4162j5207L642J3509
$$ -13054 -54 5000 -4720 -4104 1688 -10366 -9679 15142 -4783 -17316 6846 -8361 -4719 8790
118H790k6835O772J1694j1923J2079J0144j3876r417J8558p942j6623L7011k5276
$$ 8790 -18045 -11273 421 -11502 577 10721 -3155 -12572 5986 -1956 -18579 18432 -6844
131f844k5102N6006l2066o151N2560n9519J3038M5427o4530K6344K7209n0632
$$ -6844 -31946 24060 -8006 -14157 38403 -21116 -8078 37349 -27181 -837 26372 -24260
143b4260K0172J3734j2610Q774L329k053j6077K1806L768l4680M1291j4266l8715
$$ -24260 -4088 9646 -2964 5810 9139 7086 -8991 12815 16583 -18097 23194 8928 -29787
156b9787N6633k9706j9805N4324m3275K634M1220l5445R110P507k2092Q504j311
$$ -29787 26846 -2860 -22665 31659 -11616 -8982 32238 -3207 5903 13410 -8682 -178 -1489
169a489L283m537J195J1597k6069J6992J3451l3681K9405j092k4500L6017k1832
$$ -1489 1794 -2743 -1548 10049 -16020 972 14423 -19258 10147 9055 -15445 20572 -1260
182a260j6254K6082k8051N563K1934j7904J3768M733j5352M873N39l349k803L978
$$ -1260 -17514 8568 -19483 -13920 8014 -9890 3878 8611 -6741 -1868 -1329 -4678 -7481 -3503
196c503L088m157R484p647r201J2712j2131K465J9888j0968K894P403j5864J454
$$ -3503 -415 -4572 4912 -2735 -11936 776 -11355 -8890 10998 30 2924 10327 -5537 -4083
210d083M452r472J339J3409k705n296J7579j0704j5207K0637j4312m398K6647
$$ -4083 369 -9103 -7764 5645 2940 -2356 15223 4519 -10688 9949 -4363 -8761 17886
223A7886k0364K826J6718k4335Q859N995j6211J3320R93l361O127k106j421j0916
$$ 17886 -2478 348 17066 -7269 1590 7585 -8626 4694 5687 2326 8453 6347 4926 -5990
237e990O683K332j4140K2666n627j5108K8884j9858r406K5109k7993M948J9355
$$ -5990 693 3025 -11115 11551 5924 -9184 19700 -158 -9564 15545 -12448 -7500 11855
250A1855k5724J6352P258k1843J4754O50r692P375j86l168k078N520l069r359
$$ 11855 -13869 2483 9741 -12102 2652 3302 -6390 985 799 -2369 -4447 1073 -1996 -11355
264a1355J4287q688q069K2503j3615k137K0381j9621K360J3114k0083N393P398
$$ -11355 2932 -5756 -13825 8678 -4937 -7074 13307 -6314 -3954 9160 -10923 -5530 1868
277A868j3109P097O959n948L019N493m706k644O829n850k024P954q456J242P457
$$ 1868 -11241 -4144 2815 -3133 -114 5379 673 -1971 4858 -992 -3016 4938 -3518 -2276 5181
292E181j0311M746N127p809P156L078m137K278p50l617j992J889j832j661Q686
$$ 5181 -5130 -384 4743 -3066 4090 7168 3031 5309 4559 942 -1050 839 -993 -2654 6032
307F032m822m79R483j1142K264O904j3688Q629K488j1310R637k262n623N502k505
$$ 6032 1210 731 10214 -928 1336 8240 -5448 3181 5669 -5641 3996 1734 -3889 1613 -892
322h92K693p58J02L945r143M733K76j0686J1594m005m450J2833r909K340N946
$$ -892 1801 1043 1145 5090 -4053 680 956 -9730 1864 -2141 -6591 6242 -3667 -1327 4619
337D619j2008P656k277n555J0239p554J132N438q466O809j666k321Q402q056M067
$$ 4619 -7389 267 -2010 -7565 2674 -4880 -3748 1690 -6776 33 -1633 -3954 4448 -3608 459
352D59J879q966Q071o253k255J0745r245O217P185j0675P298q53p215O547m889
$$ 459 2338 -6628 1443 -4810 -7065 3680 -5565 652 7837 -2838 4460 3607 -3608 2939 -1950
367a950K57M272m214L644J97j627K341k448L042N8j037K295l700J640j673m079
$$ -1950 -1693 2579 -1635 2009 2206 579 2920 472 3514 3572 2535 4830 1130 2770 1097 -2982
383b982N849l655j216P185l033R34J967k630q67j319N48l913J876M863r206P209
$$ -2982 2867 -788 -2004 5181 2148 3082 5049 2419 1552 233 781 -3132 -1256 3607 -5599 1610
399A610M699j3776R960J316j1975J1828l643m400Q083p031P13J251k622K545m175
$$ 1610 6309 -7467 2493 3809 -8166 3662 19 -4381 3702 -3329 -2616 -1365 -3987 -1442 -5617
414e617O812k54p173J2216q006n070J2357j3973M282R507j4168J1526M01q448
$$ -5617 1195 941 -6232 5984 -2022 -7092 5265 -8708 -4426 5081 -9087 2439 2840 -5608
428e608J0164p810L80N087p711Q011k597k661R465j0803L434M948r585Q931j420
$$ -5608 4556 -3254 -2874 2213 -5498 2513 -84 -2745 6720 -4083 -649 4299 -5286 3645 2225
443B225m215R013p558Q85K860o250N405k400K80N290n423M172l87n600O398m539
$$ 2225 -1990 7023 -535 350 3210 -3040 2365 -35 245 5535 112 4284 3897 -1703 4695 156
459A56k177N555l545J115R35q08L78j244J381k866K254L792p714L363K569p535
$$ 156 -2021 3534 -11 1104 2039 1231 1609 365 1746 -1120 1134 4926 -2788 575 3144 -4391
475d391M417p07k728M721k597L84J836n0j314l970N627k442n246J0252q191j048
$$ -4391 26 -681 -3409 1312 -1285 -901 935 885 -429 -4399 1228 -1214 -6460 3792 -4399 -5447
491e447J0902j3081M926P347j1144P824j265l620P501q533L001R78n757J0477
$$ -5447 5455 -7626 -2700 4647 -6497 1327 62 -3558 3943 -4590 -1589 -611 -6368 4109
505D109q360P80J2191j4236N463N396j0954J0021m008n534J0670o651J499J426
$$ 4109 -4251 -3471 8720 -5516 -53 5343 -5611 4410 402 -5132 5538 -1113 386 1812
519A812l750O886p840L673P260j1928R435j417j0803J4354o760o789J2495p885
$$ 1812 -1938 4948 -2892 781 8041 -3887 5548 4131 -6672 7682 922 -5867 6628 -1257
533a257J722O572p711L452Q1l662Q75m74L075l372n27M676m981K857J163p033
$$ -1257 465 7037 -674 2778 2859 -803 72 -402 2673 -699 -1226 3450 -1531 1326 2489 -4544
549d544O219q8m823N391j692k407N14j780J241R97P90j991J121M133m120j196
$$ -4544 1675 1587 -3236 2155 463 -1944 -1430 -3210 -1969 -972 -182 -2173 -1052 3081 -1039 -2235
565b235K067l255P72n37Q07L496k299N90j219O84L112o287L883K280o947Q065
$$ -2235 -168 -3423 -2651 -3188 -2381 1115 -1184 -594 -1813 -1129 1983 -4304 -421 1859 -5088 2977
581B977k689n201Q819p409N66P195o869O983j201o761Q810o004j013N610q628
$$ 2977 288 -4913 3906 -3503 -2937 4258 -2611 4372 3171 -3590 5220 -784 -1797 3813 -4815
596d815P116J908p882R820k565n476N637m496J978J962l402J544o19J982k358
$$ -4815 2301 4209 -3673 6147 3582 -1894 3743 -753 1225 3187 -215 1329 710 2692 334
611C34k001P715p851l97R645r568K795M819j0978N655J564o331P133k422k067
$$ 334 -1667 6048 -1803 -2200 7445 -2123 672 5491 -5487 168 1732 -4599 2534 112 -1955
626a955L990k299K79o73k91N38m055M528J374n183L984j305k591M867k759p39
$$ -1955 2035 -264 15 -658 -949 -411 -4466 62 1436 -3747 237 -1068 -3659 1208 -1551 -2290
642b290K952j964r85J536N26k195Q2J027j417M114p96l153M741l474j536N686
$$ -2290 662 -1302 -2287 -751 -225 -2420 -2338 -1311 -2728 1386 590 -2563 2178 -1296 -2832 2854
658B854m872P55L252m438L247R82k193K016k669J289J488r82J455j784L47Q81
$$ 2854 -2018 -1263 1989 -2449 798 1780 -413 1603 -1066 223 1711 729 2184 400 747 1628
674A628k769L916j391k471M295l822K612K892o956L941n12l721O360l262j326
$$ 1628 -1141 2775 1384 -1087 3208 -614 1998 4890 -2066 1875 1363 -2358 4002 740 -586
689e86M199m787J606K205l498J638j386L59J154j280K624l239j465M553n009K106
$$ -586 3613 -1174 432 2637 -861 777 -609 -250 904 -376 2248 -991 -2456 2097 -2912 -806
705h06M097p293L518J701n140M802r25m097L097J44n74J072L79j715q64K784k124
$$ -806 3291 -4002 -484 1217 -3923 879 -46 -4143 -1046 -902 -1476 -404 -25 -1740 -2604 180 -1944
722a944J52L268m385J696K929m530L081J22l779L505K66r99K344j232r67L78L32
$$ -1944 -1792 1476 -2909 -1213 1716 -2814 267 389 -3390 115 381 -618 1726 494 -473 -95 237
739B37j31J00J143k337J668K232l762K559L51m332M875r29k284M547l136j475
$$ 237 106 206 1349 -988 680 2912 -850 1709 2060 -2272 2603 1674 -610 3937 801 -674
755f74K642j814P68j22M49k13j119L535l072j031M266n980J867M487o971M065
$$ -674 1968 154 922 800 1249 1036 -83 3452 380 -651 3615 -2365 -498 3989 -2982 1083
771A083J114o350O181r99l776M782k685m95K100j854R44j666O37M68k562L846
$$ 1083 2197 -4153 2028 1029 -2747 2035 -650 -1145 955 -899 45 -1621 -984 -516 -3078 768
787G68j330k245M217l642L07L522n021L151N91l686M204j133j779K233j647R90
$$ 768 -562 -2807 1410 -2232 -1925 1597 -3424 -273 318 -3368 836 -297 -2076 157 -1490 -500
803e00k16K6J358k349K000L58k219L191j677r82K551k371J503O29j866J843p60
$$ -500 -716 -690 668 -1681 319 677 -1542 1649 -28 -1010 1541 -830 673 1302 -564 1279 519
820E19m44J252r51J053o63j03J586k145J138J90j470J403j478J399N8k126L440
$$ 519 75 1327 376 1429 766 663 2249 104 1242 1432 -38 1365 -113 1286 1344 -782 2658
837B658k191j245L834l075K1K571m183K301M72k232J474j093J035p64n17K365
$$ 2658 467 -778 3056 -19 2 2573 -1610 691 1163 -1069 405 -688 347 -417 -934 1431
853A431l416J842J972n277M457n95m874O324k631k851N235k725m73J580j468J021
$$ 1431 -1985 -143 1829 -3448 1009 414 -4460 1864 -767 -3618 1617 -1108 -1581 -1 -1469 -448
869d48j151J291k85j793M189l564n38N095o161K408L356o274M813N22m158M790
$$ -448 -1599 -308 -593 -2386 1803 -1761 -2299 2796 -3365 -957 2399 -3875 938 1460 -2698 2092
885B092j754j277K679k399Q99RK04M62j916K884r61k198L864k270p08L070k992
$$ 2092 338 -939 1740 -659 240 249 453 915 -1001 1883 922 -1276 2588 318 -390 2680 -312
902c12J895R46l342J999k57j094P82l98O77l95N85J31j323J714j473p28J905j910
$$ -312 1583 2529 -813 1186 929 -165 617 219 896 501 1086 1217 -106 1608 135 -593 1312 -598
920e98O46J043k354K059j395l33K308k999J956K31k285K578j410m57N75j797K256
$$ -598 48 1091 -1263 796 -599 -932 1376 -1623 333 564 -1721 857 -553 -1010 -435 -2232 24
937B4j264k00K022k985L244r04l674N834l290k271N858m552J203L015n355L395
$$ 24 -1240 -1440 582 -2403 841 -63 -3737 2097 -1193 -3464 2394 -2158 -955 2060 -3295 100
953A00O59k873K366q35R74l29j337L675l522Q86K924n705M687Q36n736O132k167
$$ 100 759 -2114 252 -583 391 62 -1275 2400 -1122 -236 2688 -3017 1670 2506 -3230 2902 735
970G35k747M951l429K89K403k042Q73n46J187l9k555K991j881j485L954m032J195
$$ 735 -2012 2939 -490 -201 2202 160 1033 487 1674 1635 -920 2071 190 -1295 2659 -1373 -178
987a78L088m711K795J253l155K495r55j459J822o94r63J23O92J8j539J402l63
$$ -178 2910 -1801 994 2247 -908 1587 632 -827 995 301 -662 -539 153 171 -1368 34 -329
1004c29K81O84k289J285R63j729K95p09O78J15j635K165l39o45J777k004J382
$$ -329 -48 636 -1653 -368 595 -1134 -839 -1548 -870 -755 -2390 -225 -564 -1209 568 -1436 -54
1021e4J030k832J426n8p17J165j508J459M92j417J774k023J601J121l374K775
$$ -54 976 -1856 -430 -488 -1205 -40 -1548 -89 403 -1014 760 -1263 338 1459 -1915 860
1037H60J20k132K762k039rK219k861J735J11k81J638l359K160J632l893L004r90
$$ 860 980 -1152 1610 -429 -438 1781 -1080 655 766 485 2123 -1236 924 2556 -1337 1667 677
1054F77j575M244l615J13L318m098J227O95j577J744j016M71K5r32K040k468p6
$$ 677 -898 3346 -269 -156 3162 -936 291 986 -591 1153 137 608 633 -299 1741 -727 -803
1071h03K483l508K012Q05k801K747j204k249L152j338j4O77n05J363j354n5N48
$$ -803 1680 -1828 184 989 -1812 935 -269 -2518 634 -704 -718 -41 -546 817 -537 -592 -44
1088d4j587J240j288m12K766j829O31J154j835J431p78m46J434j158L18L36p76
$$ -44 -1631 -391 -1679 -2091 675 -1154 -523 631 -1204 227 -551 -997 437 -721 -403 -67 -843
1105h43J116j513N30R31j323K454o45j275K683j652p48J597k404J227K13j397
$$ -843 273 -1240 -710 221 -1102 1352 707 -568 2115 463 -285 1312 -1092 135 348 -1049
1121a049K056J17k49R1o16R87r34M2Q05j536J645q83j137K551k046k29J558j315
$$ -1049 1007 1124 875 966 350 1337 403 445 1250 -286 1359 476 -661 1890 -156 -385 1173 -142
1139a42J502j07j685J647j314l28J272j967P64K77k27P13q43L99j22r32J150j039
$$ -142 1360 1253 -432 1215 -99 -427 845 -1122 -358 -81 -308 405 -438 -39 -161 -1093 57 -982
1157i82L41J125k149J150N95j722J779p52m77R31j009R07r6m17K96r08J408r4
$$ -982 -641 484 -1665 -515 80 -1642 137 -615 -1092 -161 -1170 -263 -359 -776 -480 -1388 20 -74
1175g4j008J991j378p04K448k252M35J100j848J543m9o71J471j443P95P35j036
$$ -74 -1082 909 -469 -1173 1275 -977 -542 558 -1290 253 204 -467 1004 -439 356 1091 55
1192E5J314q72k33j9o51J376r11K1J465j817J453R04k453K101j174j303K300j870
$$ 55 1369 497 264 245 -406 970 59 80 1545 -272 1181 2085 -368 1733 559 -744 1556 -314
1210c14J97J517k477J568K81j205J612j076J80O61j285J669j772l81J201k646
$$ -314 -117 1400 -1077 491 772 -433 1179 103 283 944 -341 1328 -444 -825 376 -2270
1226b270J863R57k266K536p24q21J620j520L2J47r95J238o97O24L87j469J318
$$ -2270 -407 550 -1716 820 96 -725 895 -625 -593 -446 -1441 -203 -900 -276 111 -1358 -40
1243d0j074K14J744k107J260R12k508K180n60j867J906p45P6J366l95L61n76k3
$$ -40 -1114 -900 844 -1263 -3 909 -1599 581 21 -1846 60 -685 -609 757 362 723 147 124
1261A24J36r45R39n09rJ823j412M75O48j833J377k87q91J446j067N60J97p05J450
$$ 124 260 -685 254 -255 -264 1559 147 622 1270 -563 814 527 -364 1082 15 575 772 67 1517
1280A517j790Q05P48j819J857k07j192J188j497r2J206j818J381J62j091K332
$$ 1517 -273 532 1280 -539 1318 1111 -81 1107 -390 -482 724 -1094 287 449 -642 1690
1296A690j795L24Q50k627J405l66r24J595q48K74O14j088J266j233O63N61j650
$$ 1690 -105 219 1069 -1558 -153 -519 -1443 152 -696 -422 192 -896 370 -863 -200 361 -1289
1313a289J891j057j604K794k243l02K606k178R21J290j643J023j91k54N2p52J326
$$ -1289 602 -455 -2059 735 -1508 -1810 796 -1382 -461 829 -814 209 18 -236 -184 -936 390
1330C90q19k02J170j294J207Q1j221K059j099o84J999j410m79J151j053L86K37
$$ 390 -429 -631 539 -755 452 533 -688 1371 272 -412 1587 177 -302 849 -204 182 419
1347D19J27P8k54P44q59j75J132j556Q53N60j472J087l34o24J217j217O64J31
$$ 419 546 624 370 1114 255 80 1212 -344 509 1069 -403 684 350 -274 943 -274 390 521
1365E21n71Q88j172O01k21j041J368m89p68J752j189J82K04r03P24j126M54J103
$$ 521 -50 838 -334 267 46 -995 373 -116 -884 868 -321 -139 65 -838 -114 -1240 -786 317
1383C17j513J459l28j331K154j596l45K197k163N76Q93j548J499j020k0N25p75
$$ 317 -1196 263 -65 -1396 758 -838 -1183 1014 -1149 -573 320 -1228 271 -749 -769 -244 -1019
1400a019J541o76j65K099k843Q84J385l322K633n0k008K907j144m41J316j436
$$ -1019 522 -154 -319 1780 -1063 -179 1206 -2116 517 467 -1541 1366 222 -219 1097 -339
1416c39Q54Q9m76R81j343J016j11j510K200j330p77K224j330P03R98j969J022
$$ -339 515 604 128 1109 -234 782 671 -839 1361 31 -746 1478 148 851 1849 -120 902
1433I02j43j529P80j83N24q1l81J036r32L11N4j120J150m26p35J291p62j98O68
$$ 902 759 -770 10 -173 351 270 -111 925 -7 304 358 -762 388 -38 -773 518 -244 -442 226
1452B26q40J63L44j23l1K42N36p45j50n7n25N07l28k87J382o37J27J86n32Q53
$$ 226 -614 -451 -107 -230 -261 -19 517 -228 -378 -435 -960 -453 -781 -1068 314 -323 -196 -10 -542 311
1472C11j467J13J631j279Q72L20j413J595m04j007J158n73K36L87n69P71j234
$$ 311 -1156 -1043 588 -691 181 501 -912 683 279 -728 430 -143 93 480 -89 682 -552
1489e52N93O81j586K099n31j661K838j445q57J805k016O85Q63j652J602m91l95
$$ -552 41 722 -864 1235 704 -957 1881 436 -421 1384 -632 53 916 -736 866 375 -20
1506b0J060j395J385q0j484J489j155L93O50k225J772K53j770J844n91l39J012
$$ -20 1040 -355 1030 950 -534 955 -200 193 843 -1382 390 643 -1127 717 126 -213 799
1523G99j270K96K86o32L91r60P02N95j091Q73m52j71Q59j246J099K81j134P93
$$ 799 -471 -175 111 -521 -130 -1090 -388 207 -884 -11 -463 -634 225 -1021 78 359 -775 18
1541A8o54k63Q22r95L57R57n32M59k3k25J73o58K65J43J30L56m64N02j6l49Q32
$$ 18 -636 -899 -77 -1072 -715 242 -290 169 146 -79 94 -564 -299 -156 -26 330 -134 368 352 3 835
1562H35j088K60Q72j250J104k34n37P03q00J77P33p35M39J42l52L96n58J83n0
$$ 835 -253 7 879 -371 733 499 -38 665 -135 42 775 40 479 621 269 665 107 290 240
1581B40n33P80m03K27N67r94J72L54o87N56k78m78Q54n25L34n68P1L56o74O46
$$ 240 -293 487 84 311 878 -116 56 410 -277 279 1 -477 377 -148 186 -382 -311 45 -629 17
1601A7N15j048Q97n74n31R27r57j60O10n54R52k24L4P55j088P2P5o05Q58o31K59
$$ 17 532 -516 381 -193 -724 203 -754 -914 -304 -858 94 -130 -96 659 -429 -357 -282 -887 -29 -660 -401
1622d01N51o25N56k39m78J011p98N93N49j102P31k58q26R37o80J56R23o76R30
$$ -401 150 -475 81 -158 -636 375 -423 170 719 -383 348 90 -736 201 -479 -323 600 -76 854
1641H54p9l24L04q71K88k23k86J117q24K58P59j096O49R6j131J264l34k07K45
$$ 854 775 451 755 -116 172 -51 -337 780 -44 214 973 -123 526 622 -509 755 421 214 459
1660D59o63M50k42m86J027p51M20K90q50R81o23n94P91q21L59M07o91O22j44j50
$$ 459 -204 246 4 -482 545 -206 214 504 -346 635 12 -582 209 -612 -253 154 -537 85 -59 -209
1680b09J83m36J79J1j80M94m08j60N30r59P33j34kN22n68N47p3o72O55k75R6M27
$$ -209 -26 -462 -283 -272 -452 42 -366 -526 4 -955 -222 -356 -358 164 -404 143 70 -602 53 -222 -126 301
1702C01q87M51O33n25N01m05o4J45n7J92l23K22q0k00R9P1m64J301n69j12J025
$$ 301 -586 -135 498 -27 474 69 5 150 93 285 -38 184 104 -96 3 74 -390 911 342 230 1255
1723A255j381K27N46p66J86L87o20N15J53l08k25o2O35j172P94M66j286J199j44
$$ 1255 -126 101 647 -119 67 454 -166 349 502 194 -31 -93 542 -630 164 630 -656 543 399
1742C99j433J222l59j99O66o80N55l3k07L3m06J29j15j75Q61o19j01Q00j041N57
$$ 399 -1034 188 -171 -370 296 -384 171 138 -69 -36 -442 -313 -428 -603 258 -361 -462 338 -703 -146
1762a46J61r97Q76l15k39J006q41L09J17l96R46n64k25R39j037N52P5l91Rm59
$$ -146 15 -982 -106 -421 -660 346 -495 -186 -69 -465 481 -83 -308 631 -406 146 221 -170 -161 -620
1782f20O53j25j39R93n81K6M04o56M96j89o50Q15n4m72P22k37l15L7RJ20J87L56
$$ -620 33 -92 -231 762 181 207 611 -45 451 262 -388 427 373 -99 623 386 71 108 117 237 424 780
1804G80n55k50N78p76O3N42j054J151L50j054N29l18o32O92n6l85L43J0J08n12
$$ 780 225 -25 553 -223 -160 382 -672 479 829 -225 304 -14 -646 46 -10 -395 -52 -42 66 -446
1824d46Q18m10n60R48n17l35J108j232N13L45j176P73J15m73L56Q6q8l4j52K78
$$ -446 372 -38 -598 350 -167 -502 606 -626 -113 232 -944 -171 -56 -529 -173 -87 -175 -209 -361 -83
1844h3o97O83J61p54R13j00q24J273p54J95O34q60L85k12k99M44j90K12K64n88
$$ -83 -780 -97 64 -690 223 123 -701 572 -182 13 647 -213 172 -40 -339 105 -85 127 391 -197
1864a97Q10k69l31M25k86k14J56l86O69k21j94P47p58N29R6n71M93k57l51N65
$$ -197 613 344 13 438 152 -62 94 -292 377 156 -38 709 -49 480 576 5 498 241 -110 455
1884D55l55k52L85l19R6r2K85k19M2J65k23J60o0p45K98M63r43J096l23l70P53
$$ 455 100 -152 233 -86 10 -82 203 -16 26 191 -32 128 68 -677 -379 84 -859 237 -86 -456 297
1905B97m04l54N23l9m56J32K33k91K01J58p18O77J48q30Q74J68o72M51k3m55M49
$$ 297 -107 -461 62 23 -433 -301 -68 -359 -158 0 -718 -41 107 -723 151 319 -353 98 75 -380 69
1926F9k82pJ90K67j75j91P02m61n24Q67p35J3R61q21K09O50j075J018n86j75N92
$$ 69 -213 -220 -30 237 62 -129 573 112 -412 455 -280 -267 694 -127 82 732 -343 675 89 -86 506
1947E06l16J7L3k67L07j18l04O69n89K04J77r9J79l77j54M58p39O04k73m42R16
$$ 506 190 207 240 -27 280 162 -142 527 -62 142 319 220 399 22 -132 326 -413 191 -82 -524 392
1968C92n10l3K09k13j25J07q9L79k44k06J67l04J00L4J08J47k45K83%m61O38m17
$$ 392 -118 -151 58 -155 -280 -173 -262 117 -127 -333 -166 -470 -370 -336 -228 -81 -326 -43 -43 -504 134 -283
1990b83j07K64k31L31J09k71K40J3j9k23k3L86l74J69O24n97J65j81j83L55J12
$$ -283 -390 -126 -357 -26 83 -188 52 65 46 -177 -200 186 -188 -19 605 8 173 -8 -191 164 276
2011B76m48Q93m66k82K52j07j07N16k82k18L53Jk59j11J75k77N22N9r56R01m79
$$ 276 -172 721 255 -27 225 118 11 527 245 27 380 381 122 11 186 -91 431 490 -466 435 -44
2032d4k84M04k22O3O4j16J79J0l0j61j29K97j94nm0m4L66l89K28K94j79n62M14
$$ -44 -328 76 -146 -83 -19 -135 44 54 24 -137 -266 31 -163 -168 -208 -252 114 -275 -47 247 68 -494 -80
2055h0l89M44J3l13K99k34K15o5j7k5Kq4J88j55L8J49m54N52q7k59N68l83L64
$$ -80 -469 -25 -12 -325 -26 -260 -45 -110 -127 -152 -150 -234 -46 -201 -163 -14 -468 84 -3 -262 306 -77 287
2078B87l6l11N2o1J72k9k23M35k97j2M60m77K32K91o29N69O3o91Q16l91m04L28
$$ 287 251 -60 -8 -69 103 74 -149 286 -11 -23 437 -40 192 483 -146 423 486 -205 611 220 -184 144
2100A44n52N39k7mR8k8l8J52n49M60K8j82R2k67K76p7l56M09m13Q3M98n45K32
$$ 144 -408 131 104 100 198 170 132 284 -265 195 223 41 133 -134 142 65 -291 118 -295 -212 286 -259 -27
2123b7m4n35N03j28m8K05o6j71J43n4K13j73J34j31J0J64m24L92J55m46M1M26
$$ -27 -71 -606 -103 -231 -279 -74 -140 -311 -168 -222 -9 -182 -48 -179 -169 -5 -429 -37 118 -328 -287 139
2145A39m29N16k80J90j42N8j21J3K33j87M3K68k38p9J89l06K97K00k19l5N79p22
$$ 139 -290 226 -54 136 -6 52 -69 -56 177 -10 33 301 63 -16 173 -133 164 364 145 110 689 -33
2167c3L87J53m36L66l21p9k33J58M63m35J01J7j71L08k13k22L81k7M8k99j46K46
$$ -33 354 507 71 437 116 37 -196 -38 425 -10 91 108 -63 245 32 -190 191 164 212 -87 -233 13
2189A3k51L8K18m92N00R0l23M86m17j69J67k81ON09k70O8k5J04Ol84L21lk61M28
$$ 13 -238 -200 18 -474 26 116 -207 279 -138 -307 -140 -421 -415 94 -176 -108 -133 -29 -23 -407 -86 -89 -350 78
2213G8j95j1N8l42M66L8k14K18N0k79K32l87L87k41L59o2j39K17o2r0K86m70O6
$$ 78 -117 -128 -70 -412 54 92 -122 96 146 -133 99 -288 99 -142 217 155 16 233 171 81 367 -103 -37
2236c7R6j07p8L22l8K36k19j70J07p9M4j68K33K37m03K48k69k53L79m08L47J59
$$ -37 59 -48 -126 196 158 394 175 5 112 33 77 -91 142 379 -24 224 -45 -298 81 -327 20 179
2258A79j90O7j24J27j9l74P40k09p12P78m74OM39l54r8M67l41R3P8k9m90M02J18
$$ 179 -11 56 -68 59 40 -334 406 197 -515 263 -211 -205 234 -120 -218 249 -92 1 79 50 -440 -38 80
2281H0l99P7K97l72K15K58o24L99J89n34L98J63k97L49j92o3P6K09l15J03K93
$$ 80 -319 -242 55 -317 -102 156 -468 -69 120 -414 -16 147 -150 199 7 -56 20 229 -86 17 310
2302C10J18o00K13K7m1K10k10K45j02k55M21k18l89N48k15J84j84K75l7j54J41
$$ 310 428 -172 41 68 27 237 27 272 170 -85 336 118 -271 277 62 246 62 337 300 146 287
2323B87q6j99j71L03j12NJ19j82K88j90Pk82J91o1j81L00j0m5J77j59m38L03m2
$$ 287 201 2 -169 134 22 27 146 -36 252 62 69 -213 -22 -83 -264 36 26 -19 158 -1 -439 -136 -178
2346a78Q5J35k70J17j1K6P0j81N7m4L6K82m07K07J33o7r1P7l1J24k36P4l7J71
$$ -178 -93 42 -228 -111 -122 -96 -26 -207 -150 -194 -158 124 -283 -76 57 -10 -101 -24 -55 69 -167 -93 -130 41
2370D1k3k85M02p8k60M85j81k28L18j95J26ll61O09k59J88l36j89K33j21N8M89
$$ 41 18 -267 135 57 -203 282 101 -127 191 -4 122 119 -242 367 108 296 -40 -229 4 -117 -59 430
2392D30l72J24J17l79L42j64j02K25k71R1K49j39J71k52r6j02J72q6O3o6K89k22
$$ 430 58 182 299 -80 262 98 -4 221 -50 41 290 151 322 70 -26 -128 44 -42 21 -45 244 22
2414B2Q9O7l02P1J80k51K03k72k34O28l20M00k69j99J47j65O1Q9j06K9L29m92
$$ 22 111 178 -124 -53 127 -124 79 -193 -427 201 -119 281 12 -187 -40 -205 -144 -55 -161 -132 197 -295
2436b95M83l61n1M87n26L63Qj92j27J30Q8J43q2j08J85j75J87j70K08j2J71k63
$$ -295 188 -173 -224 263 -263 100 108 -84 -211 -81 7 150 68 -40 145 -30 157 -13 195 183 354 91
2458I1Mrq6O2Q6J52n23K28N6K08p2n8j54J29J55n3m6j60o1Q0J61l50J91J53l27
$$ 91 95 86 0 62 148 300 -223 5 61 269 197 139 -15 114 269 216 170 10 -51 29 190 -160 31 184 -143
2483a43K56o0j49J6j50R5L70n70J80L80k22J33m19K77K7q8j4j30K12j24k48M43
$$ -143 113 53 -96 -80 -230 -135 235 -335 -155 225 3 136 -283 -6 21 -67 -81 -211 1 -123 -371 72
2505G2j21k00M67o81M35J97n73N05k99j12M41n66L49L8l37M25r3p4K16k03J00
$$ 72 -49 -249 218 -463 -28 169 -404 101 -198 -310 131 -435 -86 -48 -385 40 -53 -127 89 -114 -14
2526a4J13j49K78k49J56R8j9j36L16o26M71k38j5J52j62J70J1j05N7p8q7K75j66
$$ -14 99 -50 228 -21 135 233 214 78 394 -232 239 1 -14 138 -24 146 157 52 109 31 -56 219 53
2549E3K15j64l19K54k52J43J95k08j06K93k14L37m8r2q8j64J48m7o3j41J67N3
$$ 53 268 104 -215 39 -213 -70 125 -83 -189 104 -110 227 179 87 -1 -165 -17 -64 -127 -268 -101 -48
2571d8J26j32p5p0R3O7j31K45l20J58j63l0K21j34J31L22m24p4J75M0J10k09J21
$$ -48 78 -54 -129 -199 -106 -39 -170 75 -245 -87 -250 -280 -59 -193 -62 260 -164 -238 -63 -23 87 -122 -1
2594aJ63k24K06j52j60O5O7k2L06k21K4o9J01k05K36K31k83M7p9J8j88N41k41
$$ -1 162 -62 144 -8 -168 -103 -36 -58 248 27 51 -18 83 -122 114 345 62 109 30 48 -140 401 160
2617A60L8K8l14K63N8k56K20J54j86k01k6K3Q8l07L39q8K21k20J8M5k16q2L22
$$ 160 198 226 -88 175 233 -23 197 351 165 -36 -62 -39 49 -258 81 -7 214 -6 12 57 -159 -241 81
2640H1j24J27K2k81J99j92n5K21%j87J2k0K74m02L35m9j58K24l69J48J93j29K04
$$ 81 -43 84 106 -175 24 -168 -223 -2 -2 -189 -177 -197 77 -325 10 -39 -197 27 -342 -194 -1 -130 74
2663G4l36L59k24K25j75J8Q5K9j02J05J85m0j69k4J66n5n1J35M9l55J34P1j21
$$ 74 -262 97 -127 98 -77 -59 26 55 -47 58 243 203 34 10 176 121 70 205 254 -101 33 104 -17
2686a7J42j08q2J12M1j88K48n0K37j84j07j13jL88j38Q0l09J57j04N1k04Lj33
$$ -17 125 17 -65 47 88 -100 148 98 335 151 44 -69 -70 318 180 260 -49 108 4 55 -149 -146 -279
2709b79Q8L66j64j53J56j98P2L9K67k44k48L71k74MO4nM1K5q4O2K13j69N5J15
$$ -279 -191 175 11 -142 14 -184 -112 -73 194 -50 -298 73 -201 -197 -133 -138 -97 -72 -156 -94 119 -50 5 120
2733A20k89j19K45j98o1M19l36R4K00k30j20N02l91K36J57l91L97J79k82n0N9
$$ 120 -169 -288 -43 -241 -302 117 -219 -125 75 -155 -275 227 -164 72 229 -162 235 414 132 82 141
2754A41k95L40j13Q6l6k24J96J9j30j32L93J08m66j79M85j11oJ28k94J91R9l45
$$ 141 -154 186 73 159 123 -101 95 114 -16 -148 245 353 -113 -292 193 82 76 204 -90 101 200 -145
2776a45Q7j6n8J80j83K56q0K69l96J51n1Jl2l8k78M87M5n38K86k2M4M0K9j88K40
$$ -145 -58 -74 -132 48 -135 121 41 310 -86 65 14 15 -17 -55 -333 154 199 -339 -53 -75 -31 9 38 -150 90
2801I0j36j15o4J31p3J56K6q3J46j74j3K55j71k84N78l01j64M87k34j12K04j47
$$ 90 -46 -161 -225 -94 -167 -11 15 -68 78 -96 -109 146 -25 -309 269 -32 -196 291 57 -55 149 2
2823Bp3O5Q5l4J14j09M1j8J21j48L9J46l30N12j81k75K46j83q3K28j46J95l1r0
$$ 2 -71 -6 79 45 159 50 91 73 194 46 85 231 -99 413 232 -43 203 20 -63 165 19 214 183 93
2847I3j30L40m37M05l00K25k05j16L37l88L12j21j0k09J37O9J13k69J61k40L8
$$ 93 -37 303 -134 271 -29 196 -9 -125 212 -176 136 15 5 -204 -67 2 115 -154 7 -233 -195
2868a95Q0j37J42N7j23K48l10K07R6k29K71j4k13M8j45n6N99n40Q7n0K49O0j87
$$ -195 -115 -252 -110 -53 -176 72 -238 -31 65 -164 107 93 -120 -72 -217 -273 326 -214 -127 -177 72 132 -55
2891e5Q6R8N4j0k85J61p9j39L54p1l08L29j46O1J6M9oK40k80l4kM7n2L66m22J10
$$ -55 31 129 183 173 -112 49 -30 -169 185 114 -194 135 -11 50 66 115 109 349 69 35 33 80 28 394 -28 82
2917H2O0n1l53L87J0l44J54o7J66J18l39O1J02j9Rj79K55j7j18J17m17L99q0k16
$$ 82 142 91 -262 125 135 -209 -55 -122 44 162 -177 -116 -14 -33 -24 -203 52 35 -83 34 -383 16 -64 -280
2941b80L30j03Q3Nk28J21L51o36K79K18m86L94Lj61M6j13J93J12k03J16K5J76
$$ -280 50 -53 30 35 -193 -72 279 -357 -78 140 -346 48 51 -110 -64 -177 16 128 -75 41 66 242
2963B42l46P1K58m04M8L09j36j8K41l93Q9K24m58N22j83k8L1m9M1j31J78o9J25
$$ 242 -104 -33 225 -179 -131 178 42 24 265 -128 -39 185 -273 249 66 38 69 20 61 -70 108 39 164
2986A64j6j33k68M34N5m21J70j37J71J54k8k62K16l33L49j21j49J87k5k27J00
$$ 164 148 15 -253 181 236 -185 -15 -152 19 173 145 -117 99 -234 115 -6 -155 32 7 -220 -120
3007a20J68K76l81J50j00k18K71L5j88p4J95j34M7j91J28N3L6J13k26K34l07K73
$$ -120 48 324 -57 93 -7 -225 46 81 -107 -181 14 -120 -73 -264 -136 -83 -47 66 -160 74 -233 40
3029D0Lp6Q5k27L6J09l9K9L2N5L13l11j61J32m3J18l1K60k21J30k58K23j39J34
$$ 40 43 -33 52 -175 -139 -30 -69 -40 -8 47 360 49 -112 20 -23 95 64 324 103 233 -25 198 59 193
3053A93J06j14Qj83K73j75k58K08K08l90K45k99L3L03l8J81l52J40J05k82j27
$$ 193 299 185 193 10 283 108 -150 58 266 -124 121 -178 -145 158 120 301 -51 89 194 -88 -215
3074b15q5L68r1O9j48L55k80J07n2k23K06Jj35l1P2k21J91N9l9o1j17J89r5R5
$$ -215 -300 68 -23 46 -102 253 -27 80 28 -195 11 12 -123 -154 -82 -303 -112 -53 -92 -153 -270 -81 -176 -81
3098h1J82k65M61l25N8j43J37m1J87K2k68k85L84j81j30L14p6K23K4j30K28j32
$$ -81 101 -164 297 -28 30 -113 24 -17 170 192 -76 -361 23 -158 -288 26 -50 173 197 67 295 163
3120A63j71J9r9J37P1j7n7J70j88JJ72j61P2j97J80%k9K97l75j03n4K72L5n1o2
$$ 163 -8 11 -88 49 120 103 46 216 28 29 201 40 112 -85 95 95 66 363 -12 -115 -169 103 138 87 25
3145B5j10k8J29J45j71K84l13j51L20j94J67j40kmK6J3j23JK57j90k15K65l79
$$ 25 -85 -113 16 161 -10 274 -39 -190 130 -64 103 -37 -39 -43 -17 -4 -127 -126 131 -59 -274 -9 -388
3168c88L20N0K13k12J44j08k6lJ22k96P5M8M5On6M1J62m01K84L1l82K75j3K39
$$ -388 -68 -18 195 -17 127 19 -7 -10 112 -184 -109 -61 -16 -10 -66 -25 137 -264 20 51 -331 -56 -69 170
3192A70j07k8pq8J02K66r0q1K55o48L14N6k72K26J92k19L9J14k94LO8K26n3j13
$$ 170 63 35 28 -60 42 308 218 137 392 -256 58 114 -158 68 260 41 80 194 -100 -97 -29 197 144 31
3216C1j46K17j17l30M5L14q2L7K4j96K7J82l8N9l33L23n0k47K34%j19l0P6J86
$$ 31 -115 102 -15 -345 -300 14 -68 -31 -7 -203 -176 6 -32 27 -306 17 -33 -280 -46 -46 -165 -195 -119 67
3240F7j87j14M27j61j07J35j49K54m07M2M4O6J97j2j61k1K59l19K93M1k07K17
$$ 67 -120 -234 193 32 -75 60 -89 165 -242 -200 -156 -90 107 95 -66 -87 172 -147 146 187 -20 197
3262A97k58J53O0j44k82K89p7K45j87K92m71L50qo7n9m4P3l31K04J97l1kP0m0
$$ 197 -61 92 152 8 -274 15 -62 183 -4 288 -183 167 159 92 33 -11 62 -269 -65 132 101 99 169 129
3286A29K23P6m91J3QJ86K3j67J45j91j32M40l04J4O6J72k35j65R5L01l03J40o
$$ 129 352 428 -63 -50 -42 144 167 0 145 -46 -178 262 -42 -28 38 210 -25 -190 -95 206 -97 43 37
3309C7o9om7l3J79J35k52J67j55O4J77k81j5k07kJ42L7M82m57J3Q3n0j16M27l12
$$ 37 -32 -38 -85 -118 61 196 -56 111 -44 20 197 -84 -99 -306 -308 -166 -129 353 -104 -91 -8 -58 -174 253 -59
3334e9j1k9o7R1J48K9k5n8l1P7O7J07j21q0k9m5L6J69J15k16Q5R2l42P5R6k48
$$ -59 -70 -99 -166 -75 73 102 77 19 -12 65 132 239 118 38 9 -36 0 169 284 68 153 245 -97 -22 74 -174
3360a74M46M0r2j15j22J38j15m7J96k24J94j17n2N7j93j45K91j38J1K29j93k5
$$ -174 272 312 220 105 -17 121 6 -41 155 -69 125 8 -44 13 -180 -325 -34 -172 -161 68 -125 -150
3382a50K73l49K00j79K09j55N8P0j90J65N3k4J50k26R2Q2j11j00J89J34k57K02
$$ -150 123 -226 -26 -205 4 -151 -93 -23 -213 -48 5 -19 131 -95 -3 79 -32 -132 57 191 -66 136
3404A36l04J76J01j09QQ6k31K23Q4JJ17k10p6M0J58n1j31K54m7m43K28j5J46j9
$$ 136 -168 8 109 0 8 94 -137 86 170 171 288 78 2 42 200 149 18 272 225 -218 10 -5 141 122
3428A22k40K32J02j40R6r5j72M34l46L17m07J87k03O2R7R9j48K66l91NK45n5k13
$$ 122 -118 114 216 76 172 77 -95 339 -7 310 -97 90 -113 -51 46 145 -3 263 -128 -123 122 67 -146
3451a46R8j05P1m9K1P5lr1j25K10m7M8j9n5jJ01o7J96j51m4j80J55J06J05q5o7
$$ -146 -48 -153 -82 -131 -110 -35 -38 -129 -254 -44 -91 -43 -62 -117 -118 -17 -84 112 -39 -83 -263 -108 -2 103 18 -49
3477d9O3L5N1k34K93J8k07R7o8k04K02j04J93r4J70k6j14NK07j21j36K92l53K09
$$ -49 14 49 100 -134 159 177 -30 67 -1 -205 -3 -107 86 -8 162 136 22 27 234 113 -23 269 -84 125
3501A25j03R0P4j72k26K03K01K1k38lLk40K97K15k67j2J46l49K29m0p1Q7qK30
$$ 125 22 112 186 14 -212 -9 192 213 -25 -28 -25 -265 32 247 -20 -32 114 -235 -6 -46 -117 -30 -38 192
3525A92L2j20l23K7N7Q4KO5j85k66O05J30m16Q6k26J99r5q5K18J36L8k81q8K20
$$ 192 224 104 -219 -192 -135 -51 -49 16 -169 -435 170 300 -116 -30 -256 -57 -152 -237 -19 117 155 -126 -214 6
3549Fj06K19Q6j06k56N16o16M55k47P7K33j38J7rK2j46k2L4j28L6J57l0K2O7P7
$$ 6 -100 119 205 99 -157 359 -257 198 -49 28 261 123 140 131 153 7 -15 19 -109 -73 84 54 76 143 220
3574B20m0j80o7J68j06j1m9J64k31K68J17l07q5L76j66l26L70m1j57k3L10k62
$$ 220 180 0 -67 101 -5 -16 -65 99 -132 136 253 -54 -139 237 71 -255 115 74 -83 -106 204 -58
3596e8R9O8lj47l7K3oR1m2j02J46o4L8j65J58l30K67j5Rj16J35j64k8K64k18p1
$$ -58 41 109 106 -41 -78 -55 -61 30 -12 -114 32 -32 6 -159 -1 -331 -64 -79 -70 -186 -51 -215 -243 21 -197 -268
3622b68K57N2q4o3J60J2k14R4K13K5k74J66L3j71K05P8l78J71R7r7N1M4m6K40
$$ -268 -11 41 -43 -106 54 66 -148 -54 159 184 -90 76 109 -62 143 221 -157 14 111 14 65 109 63 303
3646C03k16L1j30j14K63k34L31l04M72l73p5J00O6l80J92J97K9q2L6J19p3qm7
$$ 303 87 118 -12 -126 137 -97 234 -70 402 29 -46 54 120 -260 -68 129 158 76 112 231 158 150 103
3669A03K04j11j24j88K09p7J19j8n3n4N2P9k66J37j74K39l06J74j90J14K9J30
$$ 103 307 196 72 -116 93 16 135 117 64 10 62 141 -125 12 -162 77 -229 -55 -245 -131 -102 28
3691B8J40k79O8O7j13R1Q5l6j2j44m8N0J00j88K47J03j93K46l0l69L15K02l05
$$ 28 168 -111 -43 24 -89 2 87 51 39 -105 -153 -103 -3 -191 56 159 -34 212 182 -187 128 330 25
3714B5P9J73j31q2J11j32j0K20o21M02K28l82K26K8j28L4o2j62J91K9MNL6J15
$$ 25 104 277 146 64 175 43 33 253 -368 34 262 -120 106 134 6 40 -22 -184 7 36 40 45 81 196
3738A96k24o5K17j48l7R4jj32J47J16k48k7O2p1j5R8r8K03l01q0J79j2J09l06
$$ 196 -28 -93 124 -24 -61 33 32 -100 47 163 -85 -112 -50 -121 -136 -38 -136 67 -234 -314 -135 -147 -38 -344
3762c44M62j13j54j69J16L22l66j5L26j67J72j97o5J69J17n2p3P4k08N7K44o9
$$ -344 118 5 -149 -318 -202 120 -246 -261 65 -102 70 -127 -192 -23 94 42 -31 43 -165 -108 136 67
3784F7POj08Q1j91K63K36k10j77K57J8j37Nj49q8J44J02n0J19p3Mk16J16J38j56
$$ 67 74 80 -28 53 -138 125 361 151 -26 231 249 112 117 -32 -120 24 126 76 195 122 126 -90 26 164 8
3809HrJ55k95Q2M7j82K93L5l28K0L05m74L33Q1JNq2R6Q7m91M51l53L9K0K24p2
$$ 8 -1 154 -141 -59 -12 -194 99 134 -194 -174 131 -343 -10 71 72 77 -5 91 178 -313 138 -215 -176 -156 68 -4
3835dJ2j38j10M08j60M5N6q7K2m9K9J20q3p0J5k17L43j32J1j3J8n8p4J03J10j11
$$ -4 8 -130 -240 168 8 53 109 22 44 -5 24 144 61 -9 6 -211 132 0 11 -2 16 -42 -116 -13 97 -14
3861a4k6kQ1K07k88L7MK30r1l6J29j00l4n8q3K23q4K36l29J00M5o1l7M3j06J90
$$ -14 -40 -42 39 246 -42 -5 -1 229 138 102 231 131 97 39 -44 179 95 331 2 102 147 86 49 92 -14 176
3887A76m28L04r6J3J03j59K32k94k6R4J71o3j9j16m8J41N6k27L46j42j63o2Q2
$$ 176 -252 52 -44 -31 72 -87 145 -149 -175 -81 90 27 8 -108 -156 -15 41 -186 160 18 -145 -207 -125
3910a25K0Jm3K46k88J90j19J25j59J99K0l56M80k11J25k30nL00j76J35j65O9k0
$$ -125 -105 -104 -147 99 -189 1 -118 7 -152 47 67 -289 191 -20 105 -125 -130 170 -6 129 -36 33 13
3933A3k2J82m7k50Q0M9o1P7p6K61j30j76L86j51J52j71K2l44L14j19M3K14l30
$$ 13 -9 173 126 -124 -44 5 -56 21 -55 206 76 -100 286 135 287 116 138 -206 108 -11 32 246 -84
3956h4J61j93J34k24L35M4l36J49J6p6O9p2k8k3M5l0N5pj61Q7j38L72k6k20K58
$$ -84 77 -116 18 -206 129 173 -163 -14 2 -74 -5 -77 -105 -128 -83 -113 -58 -65 -226 -139 -277 95 69 -151 107
3981A07k79k98K52J70K03l21L20j59j47J80Jl79K93R9K2J2Lk9o2J32l13K2L46
$$ 107 -172 -470 -218 -48 155 -166 154 -5 -152 28 29 -350 -57 42 64 76 79 50 -12 120 -193 -171 175
4004A75k37l4K75m3R6k87MJ47j52pM8P8j00J63j98J41nJ10j18K8l0R7m8j29J32
$$ 175 -62 -96 179 136 232 -55 -51 96 -56 -63 -15 63 -37 126 -72 69 64 174 56 84 54 151 103 -26 106
4029A06kj81J39J00k32Q2J26jj36J78j04o3j74K37K1k36J63P5j64O3J80l38j17
$$ 106 104 -77 62 162 -70 12 138 137 1 179 75 12 -162 75 96 -140 23 98 -66 -3 177 -161 -278
4052b78m1J34J6j42L50j62P5J15m0q4m8j01J41K0O3j2J65k21P9J73Mk22j45P3
$$ -278 -319 -185 -169 -311 39 -123 -48 67 27 -57 -105 -206 -65 -45 18 6 171 -50 29 202 206 -16 -161 -88
4076h8J76l8n4J02l6oj24k4L09k55j45J83P5o6l8J00j93j8K05k62L32N2r6j14
$$ -88 88 50 -4 98 62 56 -68 -92 217 -38 -183 0 75 9 -29 71 -122 -140 65 -197 135 187 91 -23
4100b3j66M95j04p2r1o4R3l11K16N8J21n9m6N6k25K33l18K15O3Jj2qJ44l32Q0
$$ -23 -189 306 202 130 39 -25 68 -243 -27 31 152 93 47 103 -122 111 -207 8 71 72 60 52 196 -136 -56
4125e6J25l07K14k02K61j40J79n3k30J85k1K28k01K3j17J62l3j34K38j60J48j32
$$ -56 69 -238 -24 -226 35 -105 74 21 -209 -24 -45 183 -18 5 -112 50 17 -117 121 -39 109 -23
4147b3Q9L9j25K69j23k63J30n2R3Q6ro5O0q0J04J26l18K03L0l0L5j03k66L19k2
$$ -23 66 105 -20 249 126 -137 -7 -59 34 120 111 46 106 26 130 256 -62 141 171 141 176 73 -193 126 104
4172A04m1J60j57M4J38k65O0L3RK7Jn5l41L56L0l0J6Q4l72K48J28q3n1l44J88
$$ 104 63 223 66 110 248 -17 43 76 85 112 113 58 -283 73 103 73 89 173 -199 49 177 94 43 -301 -113
4197a13p4m9K18j54J22J15R1j41N6j24MJ73k49K33l46K00l47L51K9Q1r7K11j11
$$ -113 -187 -236 -18 -172 -50 65 156 15 71 -53 -49 124 -125 108 -238 -38 -385 -34 -5 76 -21 190 79
4220G9k37K58J2L0j93J47j36L84o23K91P2NO7j19R4P8o4j15J09j81R9m0%J34k09
$$ 79 -158 100 112 142 -51 96 -40 344 -279 12 84 89 156 37 131 209 145 30 139 -42 57 17 17 151 -58
4245e8m4L1k8P2O4J31q6k25J51J46j30o5m1J49j00P9k51M40M0l17j3M9P7k63Q5
$$ -58 -102 -71 -99 -27 37 168 82 -143 8 154 24 -41 -82 67 -33 46 -205 235 275 -42 -55 -6 71 -192 -107
4270a07J44o6K4n0l1L37k41R2k25Q1k4N6j35N3J58J5l37M05r4j30J06L6j32k5
$$ -107 37 -29 -5 -55 -86 251 10 102 -123 -42 -66 -10 -145 -92 66 81 -256 149 55 -75 31 67 -65 -90
4294i0j6p7M4Q1J8k01J83k29J76J55l5K7R4k4j12P9j05mM12m42q4K91J2j78K85
$$ -90 -106 -183 -139 -58 -40 -241 -58 -287 -111 44 9 36 130 106 -6 73 -32 -36 376 -66 -150 141 153 -25 260
4319B60n4M0k84K49p2n8j56j00Q2j3J54m5K74q0m61L61j57j2K41k70J03J22j84
$$ 260 206 246 -38 211 139 81 -75 -175 -93 -106 48 3 277 197 -264 97 -60 -72 169 -101 2 124 -60
4342f0K0J42k29o3K70j65j6L8j66J87J22r7j4P4L0k58J07J06J86j77o6j88L54
$$ -60 -40 102 -127 -190 80 -85 -101 -63 -229 -42 80 -17 -31 43 73 -185 -78 28 214 37 -29 -217 137
4365A37k1j18k98J72O7j57J20QK5K76j69k65K82J31k32O0L9j17R4M2o2k18J45
$$ 137 116 -2 -300 -128 -61 -218 -98 -90 -65 211 42 -223 59 190 -42 18 57 -60 34 76 14 -204 -59
4388e9NJ8m7R9j02L09k13l1Q4K16k72L0O9j00%k09J60k0J01ojO5o2L2r1J82k78
$$ -59 -54 -36 -83 16 -86 223 10 -21 63 279 7 37 106 6 6 -203 -43 -63 38 32 31 96 34 66 -25 157 -121
4415a21M57l99k2k7N5P4Q7l61M23j00j2k65L16J13j23K4r2R7j63J22j20J67l08
$$ -121 336 -63 -85 -112 -57 17 104 -257 166 66 54 -211 105 218 95 119 27 124 -39 83 -37 130 -178
4438a78k8M45j74J21k20m4M3j97J86L61j02k98O4r9R5p3J28J80J12n11J04K11
$$ -178 -206 239 65 186 -34 -78 -35 -232 -46 315 213 -85 -21 -120 -25 -98 30 210 322 -189 -85 126
4460A26J22j2l86J41o1J87n5MQ1O7j84J21k71L54o2k99K35J20l55rJ15N6j89K21
$$ 126 248 236 -150 -9 -70 117 62 66 147 214 30 151 -120 234 172 -127 108 228 -127 -136 -21 35 -154 67
4484F7j94J55q6K00k40J77J1r4l16L52j91J61j75LJ59j73J63o9n1N4J15R4j45
$$ 67 -127 28 -58 142 -98 79 90 -4 -320 32 -159 2 -173 -170 -11 -184 -21 -90 -141 -87 28 122 -23
4507b3J15l95M33j76O6p3j51j27J22K32q0P2J48L5k17j8J2M6k31L32J49k50j07
$$ -23 92 -303 130 -46 20 -53 -204 -331 -209 23 -57 15 163 198 -19 -37 -25 21 -210 122 271 21 -86
4530h6J92K2j74MJ04k05J98K5K07k89N9K5M7k35N9K46l1j85k53K01J67k7jk30
$$ -86 106 128 -46 -42 62 -143 55 80 287 -2 57 82 129 -106 -47 199 168 -17 -270 -69 98 71 70 -160
4554a60j3J43K35r7k39K93k90j46L74j35K1J93k29l5K60k36m5n3J90j50O6j41
$$ -160 -173 -30 205 108 -131 162 -128 -274 100 -35 -14 179 -50 -85 175 -61 -106 -159 31 -119 -53 -194
4576a94n3K31Q7k05K71k43P2M9n1N7l8l7J61k11N9p2k0rK20r5L10m16K87J4ol11
$$ -194 -247 -16 71 -134 137 -106 -34 15 -36 21 -17 -54 107 -104 -45 -117 -137 -146 74 -21 289 -127 160 174 168 -143
4602a43Q5K05l8n2j82K28J4P3l40J61J79j26j51n2K80k7K1q9J81j13j68K4j17
$$ -143 -58 147 109 57 -125 103 117 190 -150 11 190 64 -87 -139 141 114 135 46 227 114 -54 -30 -147
4625a47O7L29j73J40k16m8K1r0L78j67k06J79k05J78j50K56L9j88K2n9K8J21p
$$ -147 -80 249 76 216 0 -48 -27 -117 261 94 -112 67 -138 40 -110 146 185 -3 19 -40 -12 109 102
4648A02j18j06k4K78m03Q2J72J00l89K67mR8Or5O8k8J4J11l17J55o0J73j50J14
$$ 102 -16 -122 -146 132 -271 -189 -17 83 -306 -39 -43 55 61 -34 34 6 20 131 -186 -31 -91 82 -68 46
4672D6k0K3n2J21j44k5L8r2J95n4M7J03Jk8k84K65Ll8k03J54j84Q3j08K37Q0l22
$$ 46 26 49 -3 118 -26 -51 -13 -105 90 36 83 186 187 159 -125 140 143 105 -98 56 -128 -45 -153 84 164 -158
4698a58J33j16K55m9l9j36R6j74m2L35o0q5k02K91q7j24L57k33N0j72L48k01j15
$$ -158 -25 -141 114 65 26 -110 -14 -188 -230 105 45 -40 -242 49 -38 -162 195 -38 12 -160 188 -13 -128
4721a28k4L16l40L17j95n4K35o3j96K93j30j31J24J44j56m22K89P2K53o9k76k
$$ -128 -152 164 -176 141 -54 -108 127 64 -132 161 31 -100 24 168 12 -410 -121 -49 204 135 -141 -143
4743a43P5J5K27j69j17J36k3j50L7L88j47l33L03j99L47k45J6R7j35kK21j53m7
$$ -143 -68 -53 174 5 -112 24 1 -149 -112 276 129 -204 99 -100 247 2 18 115 -20 -22 199 46 -1
4766aq8K62N4k00k21L55j07R9k23o0M45k90N5q9Mn7K56o5j95Rl15M31j62l9oj10
$$ -1 -89 173 227 27 -194 161 54 153 -70 -130 315 25 80 -9 -5 -62 194 129 -66 -57 -372 59 -103 -142 -148 -258
4792b58L20K30k75J76j65k40K54m8l18L12p2j24K62j65j6n0N6L3k5R8j66N4P3
$$ -258 62 292 17 193 28 -212 42 -6 -324 -12 -84 -208 54 -111 -127 -177 -121 -88 -113 -15 -181 -127 -54
4815e4J26K0%j95K4J35k37m4L03m9O1q2J96j32k5k15Q7L5Q0Mk9J07j78K45o7n3
$$ -54 72 92 92 -103 -79 56 -181 -225 78 29 90 8 204 72 47 -168 -81 -46 34 38 9 116 -62 183 116 63
4841F3l4P4J79k14j10R0Nq0R2j13J90j99j8o5J7J11J5J86j86K37k90J84k73RO4
$$ 63 29 103 282 68 -42 48 53 -27 65 -48 142 -57 -75 -140 -123 -12 3 189 3 240 -50 134 -139 -130 -66
4866f6J06q7K66k63J45j8n4R4k02l9r7J95J46j23P3j00j8Kl5j66Q5K25j03K3J62
$$ -66 40 -47 219 -44 101 83 29 123 -79 -118 -215 -20 126 3 76 -24 -42 -40 -75 -241 -156 69 -34 -11 151
4891A51j91O4J4O3P2k30K61j13j6j49K10l02K85l11K45l6j15J02J74j22M3k24
$$ 151 -40 24 38 101 173 -57 204 91 75 -74 136 -166 119 -192 53 17 -98 4 178 56 99 -125
4913a25K16Q5k61M8j07K54j78J58q6R9R0o7q1l6mN8R0l18JN4R1r8K31O4n13J13
$$ -125 91 176 -85 -37 -144 110 -68 90 4 103 193 126 45 9 5 63 153 -165 -164 -110 -19 -117 114 178 -335 -222
4939b22R1j4OK74j8j01K8Q3p5Q0o2r7l8N4J10n3O2l48L20K35k42j75K09m1j28
$$ -222 -131 -145 -139 135 117 16 44 127 52 132 70 -27 -65 -11 99 46 108 -240 80 315 73 -102 107 66 -62
4964f2K1J27o2l5k67J47L30k33q4K33k0rK2j19j57J40n4P6m2K19lj27J12q2j81
$$ -62 -41 86 24 -11 -278 -131 199 -34 -118 115 95 86 108 -11 -168 -28 -82 -6 -48 171 168 41 153 71 -110
4989a10P6Q8l5n2L0L68l27K5k1rL2K5k80K86J4n3K2o0O8j50J45k08K22OJ02j51
$$ -110 -34 54 19 -33 -3 365 38 63 42 33 65 90 -190 96 110 57 79 19 87 -63 82 -126 96 102 204 53
5015E3l21K83k47K14j70K29k9J46k2k37o9K13k32K98jo4j92K32r6j59K11M3J01
$$ 53 -268 15 -232 -18 -188 41 12 158 136 -101 -170 43 -189 109 108 44 -148 84 -12 -171 40 83 184
5038A84j76m5k3J29j40mN4K31k87R9J70k21k7J5K50k05Q0j55K28j07Q1j23p4J51
$$ 184 8 -37 -60 69 -71 -75 -21 210 -77 22 192 -29 -56 -41 209 4 84 -71 157 50 131 8 -66 85
5062H5LK0N8L5l86M83n21K67J95j81k35K95J6k54L22k21j80J34L5N9j67J20J99
$$ 85 88 108 166 201 -185 298 -223 44 239 58 -177 118 134 -120 202 -19 -199 -65 -30 29 -138 -18 181
5085A81J68k92Mm9j86R2L3k6OL6j77J00L3N9p4J8Kk06M05l32Q8q0K4K6r4K30m8
$$ 181 349 57 61 12 -174 -82 -49 -75 -69 -33 -210 -110 -77 -18 -92 -74 -72 -278 127 -205 -117 -197 -173 -147 -241 -11 -59
5112e9J13k84J22N7j44L93k03r3P6j23O1J71K8k36K77p1j40j09K06M8K51m55l
$$ -59 54 -230 -108 -51 -195 198 -5 -98 -22 -145 -84 87 115 -121 156 85 -55 -164 42 90 341 -114 -117
5135a17K37j26K16k05jj5n1J65J25j77n8J80J03j62k20l9L1O0j07J02j3p8P9R3
$$ -117 120 -6 210 5 4 -11 -62 103 228 51 -7 173 276 114 -106 -145 -114 -54 -161 -59 -72 -150 -71 22
5159B2K1j00K94q4j8j64K40j64J07k36Q8m7N7R9j59K20k75J01K79j29k78J35L4
$$ 22 43 -57 237 153 135 -29 211 47 154 -82 6 -41 16 115 -44 176 -99 2 281 152 -126 9 43
5182D3r0l41M84oj57k02J92JM26l46J3K8K9N9j40J9K4j49O8J57j55J09qK02j88
$$ 43 -47 -388 96 90 -67 -269 -77 -76 350 4 17 45 74 133 -7 12 36 -113 -45 112 -43 66 58 260 72
5207G2j1o0R3L7j18n0l4J46J53o0l38K63j72Q1Mp0kp5J80P1j60N2j68Q6L4J99
$$ 72 61 1 94 131 13 -37 -71 75 228 168 -170 93 -79 2 6 -64 -66 -141 39 110 -50 2 -166 -80 -46 153
5233A53j15l84K22J43j22Q0K81l77PN2P6j99J98J58Rl47P1l0J44m9O4Q5k06J36
$$ 153 38 -346 -124 19 -103 -23 258 -119 -112 -60 16 -183 15 173 182 -165 -94 -124 20 -29 35 120 -86 50
5257E0k52L21l15J67k44K10o3P1J54L0k10J35j44J02j26P9K39k42J9R7J71j23
$$ 50 -202 119 -196 -29 -273 -63 -126 -55 99 129 -81 54 -90 12 -114 -35 204 -38 -19 78 249 126
5279A26J41l07J55J67j99p3L8j59J1j08k8K45K15k63J11m2r9J29j53J17q8j08
$$ 126 267 -40 115 282 83 10 48 -111 -100 -208 -236 9 224 -39 72 30 -69 60 -93 24 -64 -172
5301a72J48j66K96r0j24nJ43m2j44K26j80L2J10m75N93j63L0L5K4j19PJ88j17
$$ -172 -24 -190 106 16 -108 -113 30 -12 -156 70 -110 -78 32 -443 150 -13 17 52 76 -43 -36 152 35
5324C5J26j32k3k2J6Q0j65J52J56r3j42l05K47j38K54j7j65K36j44m9Q4J49J3
$$ 35 161 29 6 -16 0 80 -85 67 223 130 -12 -317 -70 -208 46 29 -136 100 -44 -93 -9 140 153
5347A53k82J7J27O9j5L9l51L75K8k60K65j97K7k44M26k27m6K99j53l46L22j2K8
$$ 153 -129 -112 15 84 69 108 -243 132 160 -100 165 -32 -5 -249 177 -50 -96 203 50 -296 26 14 42
5370D2pK15k36R3q0J84j53K45k62p9L3l7J01k28L07r3NQ1j54j31j42M09m6r7K28
$$ 42 35 250 14 107 27 211 58 303 41 -38 -5 -42 59 -169 138 45 50 131 -23 -154 -296 113 67 -30 198
5395A98k09p4K05k18j8m8M49m23J32o3J47l9o1J08k50J80Q9J71k76j51K20nj21
$$ 198 -11 -85 120 -98 -116 -164 285 -138 -6 -69 78 39 -22 86 -164 16 105 276 0 -151 69 64 -57
5418e7J79j19j9L02j61j19K4Ok1L6q9j5J77J09k64J94L2k84Pj56J57J59J32j22
$$ -57 122 3 -16 286 125 6 30 36 15 51 -38 -53 124 233 -31 163 195 -89 -82 -238 -81 78 210 88
5442H8r0L3K9j98L18l19K03J90m12J52J26k20k3l6J58Q5j89J26p4o5J4J74k59
$$ 88 -2 31 60 -138 180 -139 64 254 -158 -6 120 -100 -123 -159 -1 84 -105 21 -53 -118 -104 70 -189
5465a89J05M28l56j%j00L32k81K77j84l5n0K09j65j48J63r0Q8j41j26K18j50K71
$$ -189 -84 344 -12 -13 -13 -113 219 -62 215 31 -4 -54 155 -10 -158 5 -85 3 -138 -264 -46 -196 75
5488G5P9n6j6o1N0k40L66j99K35k68j02K55k84J94J39j06O3k30J75J07k98L45
$$ 75 154 98 82 21 71 -169 197 -2 233 -35 -137 118 -166 28 167 61 124 -106 69 176 -122 223
5510B23j89K3k27O4O6J64l50K80L9K0j9j81J30j04J84j83N8q4j21J10R4M1O3p1
$$ 223 34 57 -170 -106 -40 124 -226 54 93 113 94 -87 43 -61 123 -60 -2 -86 -207 -97 -3 38 101 30
5534C0j22j25K88k65N7P3K22k56P6J37j38O0j54K29o9M2K14l57O1j70K51J06Q6
$$ 30 -92 -217 71 -194 -137 -64 158 -98 -22 115 -23 37 -117 112 43 85 299 -58 3 -167 84 190 276
5557B76m29J17l0jJ00J1r3K39kk10j0L2J57j54J16j3j02L16j83j70M39m29P7k7
$$ 276 -153 -36 -66 -67 33 44 -49 190 188 -22 -32 0 157 3 119 106 4 320 137 -33 406 -23 54 27
5581B7q7K2L3j85rK66m2ok5l4K4J35j09K9p5k00Q9O8j68J79K1K5p3J98k30K04
$$ 27 -60 -38 -5 -190 -199 67 25 19 -6 -40 -16 119 10 39 -36 -236 -147 -79 -247 -68 -47 -22 -95 103 -127 77
5607G7j49j10K88k90K58r7kj08K61n8mj30J18J5P0k98J04J23J15k47r1n0J99N6
$$ 77 -72 -182 106 -184 74 -23 -25 -133 128 70 66 -64 54 69 139 -159 -55 68 183 -64 -155 -205 -6 50
5631E0j75K03p4K04m34M86j30j98o3J83J94k04M5P1km17K64j02J97j54J64j37
$$ 50 -125 78 4 208 -226 260 130 -68 -131 52 246 42 87 158 156 -261 3 -99 98 -56 108 -29
5653b9p0K5l7K56k08R4l1Q3q5k08j0N31m21q5J45K48J8k13N3P9r0j20o3K29j01
$$ -29 -99 -74 -111 145 -63 31 0 83 -2 -210 -220 311 -110 -195 -50 198 216 3 56 135 45 -75 -138 91 -10
5678a0J05j19N9M9j94m6J11R8j78M1J6q8k2O5j21L25n6k21L78l04o3J42r8K56
$$ -10 95 -24 35 84 -110 -156 -45 53 -125 -84 -68 -156 -178 -113 -234 91 35 -186 192 -112 -175 -33 -131 125
5702A25K54l19j64nj01J60J78k31L73k54J17p9j07p2K91J7j85M4r0R9J98l56N2
$$ 125 379 60 -104 -109 -210 -50 128 -103 270 16 133 54 -53 -125 166 183 -2 42 -48 51 249 -107 -55
5725e5j3L08l22no6O9n1J71L3m4k12L15k1j37R1n5J36j42j74J32K72l75M7K74
$$ -55 -68 240 -82 -87 -153 -84 -135 36 69 25 -187 128 107 -30 61 6 142 0 -174 -42 230 -145 -98 176
5749A76l10P3J22p3J46k26R6O2L0n0p4l00M0K64j33L3K13K14m30L73l88O9j01
$$ 176 -134 -61 61 -12 134 -92 4 66 96 46 -28 -328 -288 -24 -157 -124 89 303 -127 246 -142 -73 -174
5772a74J02NL7J15p1m7M8j51Q9L1k80L01J0J09M9r4J11j71N1K8k4J46l77J41r
$$ -174 -72 -67 -30 85 14 -33 15 -136 -47 -16 -296 5 15 124 173 79 190 19 70 98 74 220 -157 -16 -25
5797b5J4m7P6r6K45k47L18q8k44J58o7J69j04J54l12K1J69J8k52L34k06j74J77
$$ -25 -11 -58 18 -78 167 -80 238 150 -94 64 -3 166 62 216 -96 -75 94 112 -140 194 -12 -186 -9
5820iJ33k38M4J26k9J4K3lon4k4NM3k22M22k90L6J01jj69J95L4K1p8k12P7j28
$$ -9 124 -114 -70 56 27 41 64 61 55 1 -23 -18 25 -197 225 -65 -29 72 71 -98 97 131 152 74 -138 -61 -189
5847a89K39l56K26R7K21k09j54J86k48K7R4O9k09J85J57j3r5p7J20N1j44k1J21
$$ -189 50 -306 -80 17 238 29 -125 61 -187 -160 -66 3 -206 -21 136 123 28 -49 71 122 -22 -43 78
5870G8L7j13l7n1J78P1k00Q0K5oP6j88N2k1k6n5J22j22O2q5O5l7N6M4j5n8J06
$$ 78 115 2 -35 -86 92 163 -37 43 68 62 138 -50 2 -19 -45 -100 22 -100 -38 -123 -58 -95 -39 5 -10 -68 38
5897C8Qn6j24q4L40k1m3j45P9j27R2R7n0J34k51OL05k46O6r4Q7K08k49j07j8J74
$$ 38 46 -10 -134 -218 122 101 58 -87 -8 -135 -43 54 4 138 -113 -107 198 -48 18 -76 11 219 -30 -137 -155 19
5923A9j51K73j24m4o5j25L11j95j07K04%J33m5K7M3n4m5m6O6l6J49j3O1k53pj07
$$ 19 -132 141 17 -27 -92 -217 94 -101 -208 -4 -4 129 84 111 154 100 55 9 75 39 188 175 236 -17 -24 -131
5949a31o6P6K37N1m37M88m27L28k81L44r8J7j70j9q9K47J11n7j20j04L9K00j58
$$ -131 -197 -121 116 167 -270 218 -209 119 -162 182 84 101 -69 -88 -177 70 181 124 4 -100 -61 139 -19
5972a9n9k7J17r2J28j59n8N6r8L2M3J46k07Q8J14J28j24pmp2j95J03L24m3J6r0
$$ -19 -78 -105 12 -80 48 -111 -169 -113 -211 -179 -136 10 -197 -109 5 133 9 2 -2 -74 -269 -166 158 115 131 41
5998D1j09l3J90j31J94j16l7l1M08l29M8l13L14j04o9O5n6J70k88J02N6k61K16
$$ 41 -68 -101 89 -42 152 36 -1 -32 376 47 95 -218 96 -8 -77 -12 -68 102 -186 -84 -28 -289 -73
6021g3K89k12J21l2j66j7J66q2J38k6l12L82q5O2L4k36J26p9k09l2M06j21n6k60
$$ -73 216 4 125 93 -73 -90 76 -6 132 106 -206 176 91 153 187 -49 77 -2 -211 -243 163 42 -14 -274
6045b74K76J40q7j68m3M02j16K9l69K67k15J4L09k45P9j07Q7J79l55N39m59J23
$$ -274 2 142 55 -113 -156 246 130 159 -210 57 -158 -144 165 -80 -1 -108 -21 158 -197 342 -117 6
6067FRl2KK1l1M5k4k80K57L54l51K49m24J89j29j2K5l2J05R7k37L25l3l44K09
$$ 6 15 -17 -15 6 -25 20 -4 -284 -27 327 -24 225 -199 -10 -139 -151 -126 -158 -53 44 -193 132 99 -245 -36
6092c6PJ76o0J01j91Pn6L05k43K04l36L92q3j44l4n0J38j03j58J39m2J51k24K9
$$ -36 -29 147 87 188 -3 4 -52 253 10 214 -122 270 187 43 9 -41 97 -6 -164 -25 -67 84 -140 -111
6116a11J10k38N21l03j01J62m6j26J31k03J25J13r5J6K7j28L01j23L7K20m28L04
$$ -111 -1 -239 282 -21 -122 40 -6 -132 -1 -204 -79 34 -61 -45 -18 -146 155 32 69 289 -139 165
6138A65m0k50J41k1n4P2M0Pj38O3O1nL3q5j6K00j15q0K0J83q9k55NJ92l3j2j67
$$ 165 125 -125 16 -5 -59 13 53 60 -78 -15 46 41 74 -11 -27 173 58 -22 -2 181 92 -163 -158 34 1 -11 -178
6165a78K61J11j85k9k34J53j40N15m22Ko7L46k6l1j02j28K57k71J72J49l56j6
$$ -178 83 194 9 -20 -254 -101 -241 274 -148 -146 -213 133 107 76 -26 -154 103 -168 4 153 -203 -219
6187b19L05j33l08M31j42m4Ml4K16l69L13M9j33p6L33k17j4j29J91l7Q8Kj12k52
$$ -219 86 -47 -355 76 -66 -110 -106 -140 76 -293 20 69 -64 -140 193 -24 -38 -167 24 -13 75 77 -35 -287
6211b87K18k12J48On5R2N1K22n28K13k0J73l4p8j66L59k31J96J67j07J35k23o9
$$ -287 -69 -281 -133 -127 -182 -90 -39 183 -345 -132 -152 21 -13 -91 -257 102 -129 67 234 127 262 39 -30
6234c0j18O6k08L87nl82L05r6J27k6L23k53m6R8k06L6j20J20J77j09j56J40j39
$$ -30 -148 -82 -290 97 92 -290 15 -81 46 20 343 90 44 142 -64 -28 -148 -28 149 40 -116 24 -115
6257a15J5K27o2j58K48k48J85k80R0K38l4k16K42k52L21j19j8J26j15K3k23J84
$$ -115 -100 127 65 -93 155 -93 92 -188 -98 140 106 -110 132 -120 201 82 64 190 75 98 -125 59
6279E9J07l52J50J06q1j27J56k89M66k24o6m3J57q6l3rJ62Kj98m7K5K95o1R8k02
$$ 59 166 -186 -36 70 -11 -138 18 -271 195 -29 -95 -138 19 -67 -100 -109 53 55 -143 -190 -165 130 69 167 -35
6304c5m3J92k43L19ml23K04j30R0J77j72k3n5N9R4o3L6O2j30L1j74K43r3j22J81
$$ -35 -78 114 -129 190 186 -137 67 -63 27 204 32 9 -46 13 107 44 80 142 12 43 -131 112 19 -103 78
6329G8j06k8J2k3M2k44L69p6O8m0j04R3lL4j54m7l1J13J4J10k05m2M7j02J03K23
$$ 78 -28 -56 -44 -67 -25 -269 100 24 92 52 -52 41 38 72 -82 -129 -160 -47 -33 77 -128 -170 -123 -225 -122 101
6355A01l0l8k2J69j83J55k62j3J05lJ35O0k13j81J52K04l35N10j54j31N8l3p7
$$ 101 71 33 11 180 -3 152 -110 -123 -18 -21 114 174 -39 -220 -68 136 -199 311 157 26 84 51 -26
6378b6j1p7P0p9K33j13l0J28j37K14r4p3p9J55K09j47j82J71p0j47J99Q0j30j31
$$ -26 -37 -114 -44 -123 110 -3 -33 95 -42 172 78 5 -74 81 290 143 -39 132 62 -85 114 194 64 -67
6402f7J74r4j58K05r9J2m9j71J67J50l12K12J32k13lL1j44J65k48L21p6J96r5
$$ -67 107 13 -145 60 -39 -27 -76 -247 -80 70 -242 -30 102 -111 -114 -83 -227 -62 -310 11 -65 131 36
6425C6j68J52m7p7K7%J02p1N7J53m41L00l60J37K59j8k09K34n2M0q5k7K65l58
$$ 36 -132 20 -27 -104 -77 -77 25 -46 11 164 -277 23 -337 -200 59 41 -168 66 14 54 -31 -58 207 -151
6449a51N6J97o1NJ89j87M8j70K29Nk27O6l5k14M29r1j02m3J38j90J22mj47K36
$$ -151 -95 102 41 46 235 48 96 -74 155 160 -67 -1 -36 -250 179 88 -14 -57 81 -109 13 9 -138 98
6473I8J12j04k38J1K64j09N0j80o3L91k36K03l67l2L26j51P4L3j10J65l43K02
$$ 98 210 106 -132 -121 143 34 84 -96 -159 232 -4 199 -168 -200 126 -25 49 82 -28 137 -206 -4
6495dQL8K2Ll5j61K13k23K51j12L64l62j10p8J90l13K43P1k20L38k86K18r3k8
$$ -4 4 42 64 67 32 -129 84 -139 112 0 364 2 -108 -186 4 -309 -66 5 -215 123 -163 55 -38 -66
6519f6j51K15M8K3k15L51n9m1p1o2OJ64q7l00L69k14K40k78K03J6K3j64J33J9
$$ -66 -217 -2 46 69 -146 205 146 105 34 -28 -22 142 55 -245 124 -90 150 -128 75 91 114 -50 83 102
6543A02j72J90j75M5j38L60q7j10J01j54k63L61M6k69K58O3j50M9R2l57K60j13
$$ 102 -70 120 -55 -10 -148 212 125 15 116 -38 -301 60 106 -163 95 158 8 57 149 -208 52 -61
6565f1J5K3K57j44j7j1l3K8k74K41rj04j21j2K6K43j53J56J12j31p4J28l6n2j16
$$ -61 -46 -23 234 90 73 62 29 57 -217 24 15 -89 -210 -222 -196 47 -106 50 162 31 -43 85 49 -3 -119
6590a19j1j26M73l93J32J53j54J24O1P8k2l24m3R0L8j62M18j89k56M47p5j37k38
$$ -119 -130 -256 217 -176 -44 109 -45 79 140 218 196 -128 -171 -81 -43 -205 213 24 -232 215 140 3 -235
6613b35K92j45O3M5N2k90K65O3r9j35L35k63Q6J67k25M7P8j67p5K24j55j96L45
$$ -235 57 -88 -25 20 72 -218 47 110 11 -124 211 -52 34 201 -24 23 101 -66 -141 83 -72 -268 77
6636G7l0N8r2K02j90q4N7M9J69k65P7o9JN2j07J16J38j73j10J85k4M6j49M5N2
$$ 77 47 105 13 215 25 -59 -2 47 216 -49 28 -41 -40 12 -95 21 159 -14 -124 61 37 83 -66 -21 31
6661C1j45J39r0j44K49o2K83j92K87l46j76K17j36J39k1J74J8m10J85r0q3L62
$$ 31 -114 25 -65 -209 40 -22 261 69 356 10 -166 51 -85 54 33 207 225 -185 0 -90 -173 189
6683A89J29o6k16O7R3j96j10J37r0L22l96J66j82J85Q7j32j06J44J4n5j16L09
$$ 189 318 252 36 103 196 0 -110 27 -63 259 -137 29 -153 32 119 -13 -119 25 39 -16 -132 177
6705A77k39M4J49k01K02o0J8m2j66M1M1J1K8o8p2O9Lj81J73r8J81p6K16k19J2
$$ 177 -62 -18 131 -70 132 72 90 48 -118 -77 -36 -25 3 -65 -137 -68 -65 -246 -73 -171 10 -66 150 -69 -57
6730e7R7j18J05J8j53J63l0j45J25P7rj3Lj63K53r0j76J76L3k05j00J10KJ45r0
$$ -57 40 -78 27 45 -108 55 25 -120 5 82 73 60 63 -100 153 63 -113 63 96 -109 -209 -99 -97 48 -42
6755d2J30j05K23j69p0mj24J92J05l10J20j9K1m2P5r9L16K6j85j4k2j6K35k20
$$ -42 88 -17 206 37 -33 -37 -161 31 136 -174 -54 -73 -52 -94 -19 -118 198 224 39 25 3 -13 222 2
6779Bl2Q6j15j5j12Q7K3L1K56j96j13k2J39K6Pj2J27l40L46r8k2k29J70K28l03
$$ 2 -30 56 -59 -74 -186 -99 -76 -45 211 15 -98 -120 19 45 52 40 167 -173 173 75 53 -176 -6 222 -81
6804h1J69N0j76o5q2K00l8j70j56L99M5j25J73j5k19J08Ok32P5K39l5k60K6L33
$$ -81 88 138 -38 -103 -185 15 -23 -193 -349 50 95 -30 143 128 -91 17 23 -209 -134 105 70 -190 -164 169
6828A69o9k31K86k14L1l2M6J57m08L98NJ66q7m87J77J73j70M14k37K4o9J96j64
$$ 169 100 -131 155 -59 -28 -60 -14 143 -265 133 138 304 217 -270 -93 80 -90 324 87 111 42 238 74
6851G4j10l2J82k48N3J02k01J25J63j50o0J91K30m43L03k51O2M5k5p9p6O7nL8
$$ 74 -36 -68 114 -134 -81 21 -180 -55 108 -42 -102 89 319 -124 179 -72 -10 35 10 -69 -145 -78 -83 -45
6875d5p8NJ42J06j84J19oP7k11K54j67M3k11R5O0j08L0K1o5J01J63k24NK8k7P4
$$ -45 -123 -118 24 130 -54 65 59 136 -75 179 12 55 -156 -61 -1 -109 -79 -58 -123 -22 141 -83 -78 -50 -77 -3
6901cJ84m02J75R1J22q3J8j10P6k6Q4j49M1J59k54j18L01M0k38R2M5k6m0q1k00
$$ -3 181 -221 -46 45 167 84 102 -8 68 42 126 -23 18 177 -77 -195 106 146 -92 0 45 19 -21 -102 -302
6926c02L47j32N4P6j9K3j37p5K22J58j92L28l34n1P6k67L60j90pQ1o7J30l03K15
$$ -302 45 -87 -33 43 24 47 -90 -165 57 215 23 351 17 -34 42 -225 135 -55 -62 19 -48 82 -221 -6
6950fJ00pK7m8m5K8q2l2oQ1n3J47kj82m4J91M7r6j39R9Q5q8j14J9K49k45m7P5
$$ -6 94 87 114 66 21 49 -33 -65 -71 10 -43 104 102 -80 -124 67 114 18 -121 -22 63 -25 -139 -120 129 -116 -163 -88
6978h8J30j06J43j21j79K25j45m2M8J32Q6L8J6k91J04n5K19J32l04N2L6k10K96
$$ -88 42 -64 79 -42 -221 4 -141 -183 -135 -3 83 121 137 -154 -50 -105 114 246 -58 -6 30 -180 116
7001A16n1Qj46r1N6P5k27J50O4O1j55J29L7j6j71K39n3k2lq1M82m38p8q2M3%J85
$$ 116 65 73 -73 -164 -108 -33 -260 -110 -46 15 -140 -11 26 10 -161 78 25 3 0 -81 401 -37 -115 -197 -154 -154 31
7028C1j01j0L0k5O1l46L24j15n5K46k64J62o4l1M0J17qM3M5M6j17%M6Ln8J31j31
$$ 31 -70 -80 -50 -75 -14 -360 -36 -151 -206 40 -224 -62 -126 -157 -117 0 -8 35 80 126 9 9 55 58 0 131 0
7055@K2k2o8l5J25j23J25R8oj75j8K24k05J7k7j67m2M08k98k4o2J09J09k34J82
$$ 0 22 0 -68 -103 22 -101 24 122 116 -59 -77 147 -58 -41 -68 -235 -277 131 -167 -191 -253 -144 -35 -269 -87
7080h7j00J32K59j22J37m55K16K37l34K30k31J48k79J92J73K3j42n3K54q1J13
$$ -87 -187 -55 204 82 219 -236 -20 217 -117 113 -118 30 -249 -57 116 139 -3 -56 198 117 230
7101B30k91p7J21k99J55L58k85K4r7J76l0r2j62K42k3J86j25j67K42j70J3o0J16
$$ 230 -61 -138 -17 -316 -161 197 -88 -64 -161 15 -15 -107 -269 -27 -50 136 11 -156 86 -84 -71 -131 -15
7124a5J77k55J75p1J30j55k76L36k0l3p2J85p6j59qL3J63k0j04m8j14J90j24k6
$$ -15 162 -93 82 11 141 -14 -290 46 26 -7 -79 106 30 -129 -137 -104 59 39 -65 -113 -227 -37 -161 -187
7148a87L42K6o7j35OK27k20J58j50j94K46R1j17K36j46j66Kj04K55j18m2K23k03
$$ -187 155 181 114 -21 -15 212 -8 150 0 -194 52 143 26 262 116 -50 -48 -152 103 -15 -57 166 -37
7171c7Q2k26M07k50j50m2K57RJ31J0l27oP0K6O8n7j73j8LJ04J30l0o3K66k47J88
$$ -37 45 -181 226 -24 -174 -216 41 50 181 191 -136 -142 -72 -46 22 -35 -208 -226 -223 -119 11 -19 -82 184 -63 125
7197A25k82M7r5K28qP3n4q2p1K21k4j18P6O3o1J38k25M7k33J31L1r6R4k4K07l0
$$ 125 -157 -110 -205 23 15 88 34 -48 -119 102 78 -40 36 99 38 176 -49 -2 -235 -104 -73 -169 -75 -99 108 78
7223G8R5k75j5J42Pj00l0L3P1nK8J48m3J10j19l66M08m9n0Jj12R0o6J48r0J68
$$ 78 173 -102 -117 25 32 -68 -98 -65 6 1 29 177 134 244 125 -241 167 118 68 69 -43 47 -19 129 39 207
7249B07J5j67k19K06p6l8O4N8Q3n8j17J21k53j06K43j59L23l00J79k03M54l12
$$ 207 222 55 -164 42 -34 -72 -8 50 133 75 -42 79 -174 -280 -37 -196 127 -173 6 -197 257 -55
7271e5PlK3O2j04J54k06j42M10R6j3j48m01L29np6K84k12o9Q9L7j12j57L85j13
$$ -55 -48 -51 -28 34 -70 84 -122 -264 146 242 229 81 -320 9 4 -72 212 0 -69 20 57 -55 -212 173 60
7296F0J15j59M2j80K61j84L7p3O0k5k27K35pqJ56k3k45J36J0n8L28l59p0L36j31
$$ 60 175 16 58 -122 139 -45 -8 -81 -21 -46 -273 -38 -45 -53 103 80 -165 -29 -19 -77 251 -108 -178 158 27
7321B7l9J47k00R4J98j77LJ60k99O7RK33l43N9K27L1j43j00K5j57J32R9N6k61
$$ 27 -12 135 -65 29 227 50 53 213 -86 -19 -10 223 -120 -61 166 197 54 -46 -21 -178 -46 53 109 -152
7345a52J13N7K27l50M9J02j48L08P9q5j46k23J41K3O1J43k72O8j68r2L84K27l11
$$ -152 -39 18 245 -105 -56 46 -102 206 285 200 54 -169 -28 -5 56 199 -73 -5 -173 -265 119 346 35
7368C5M5J19k71J29K37k87p4J29j42l0j10K61N6j22p0K92j92J45j35j5l0r8J04
$$ 35 80 199 -72 57 294 7 -67 62 -80 -110 -220 41 97 -25 -95 197 5 150 15 0 -30 -128 -24
7391b4l4K18j30Q6mk55j0J3K19qj08k1r0j39N7K78j53J71N1m0q8m7P7m0j23N3
$$ -24 -58 160 30 116 112 -143 -153 -140 79 71 -37 -58 -148 -287 -230 48 -105 66 117 77 -11 -58 19 -21 -144 -91
7417i1N8N9j84K63j50j42JJ57j18J07N0OM8j4p6j65J71N4j1J69jj61l9O6l8L4
$$ -91 -33 26 -158 105 -45 -187 -186 -29 -147 -40 10 16 64 50 -26 -191 -20 34 23 192 191 30 -9 57 19 53
7443E3Jo3Q4J27n9k79K65j91J15N7r1p0j13L4M1q0K97k63J37N6o3r9K28l79J63
$$ 53 54 -9 75 202 143 -136 129 -62 53 110 19 -51 -164 -130 -89 -169 128 -135 2 58 -5 -104 124 -255 -92
7468i2J32m2k20O0J85J7lr1J14M3q2o8P7j9p9N3Nk6J86k00J10k32J75J7o0J82
$$ -92 40 -2 -222 -162 23 40 37 -54 60 103 21 -47 30 11 -68 -15 -10 -36 150 -50 60 -172 3 20 -40 142
7494A42j86L25k24M8Ol6j48K01k65M4j14J5L17m65N8M13k2j40L52k75k55L80j06
$$ 142 -44 281 57 105 111 75 -73 128 -137 -93 -207 -192 125 -340 -282 131 109 -31 321 46 -209 171 65
7517F5J22k54M9J54k68J14K09j82ol9k0R8j55L73j34j07n3N4M2J25O3j20r0j8
$$ 65 187 -67 -18 136 -132 -18 191 9 3 -36 -56 42 -113 260 126 19 -34 20 62 187 250 130 40 22
7541B2P6l19K80k2l8k38M45j04p7J16l67K26K19j16l1j00j20O9P0J11k85L16k10
$$ 22 98 -221 59 37 -1 -239 206 102 25 141 -226 0 219 103 72 -28 -148 -79 -9 102 -183 133 -77
7564g7R2l85K54L4q5L72k51k84M52n6k62K34J87l68J21K02p3j79J72r7PJ06j82
$$ -77 15 -370 -116 -82 -167 205 -46 -330 122 66 -196 38 225 -143 -22 180 107 -72 100 3 10 116 -66
7587f6J22Pl19K32J82k82P5J15j78J79k06K11J13l28J3J90j13J16J30J3k33K1
$$ -66 56 63 -256 -24 158 -124 -49 66 -112 67 -139 72 185 -143 -130 60 -53 63 193 206 -27 -6
7609fJ45j41k70J32NJ45p1M8k94M35M6Ql4k17m2J81k01K7J64O6j6Q0j72m4J6Q4
$$ -6 139 -2 -272 -140 -135 10 -61 -13 -307 128 174 182 148 -69 -111 70 -131 -104 60 126 110 190 18 -26 -10 74
7635G4N5q7o9J11n2r7K43j81r9O2J54k90P7O0R1N7k98K98k77K22k12lJ84r4j26
$$ 74 129 42 -27 84 32 -65 178 -3 -102 -40 114 -176 -99 -39 52 109 -189 109 -168 54 -158 -161 23 -71 -197
7660a97K60P9j30J61n9k92J51k49K32k09L54N8q6J96k02r2j0J58pjQ8j21p0K3
$$ -197 63 142 12 173 114 -178 -27 -276 -44 -253 101 159 73 269 67 -25 -35 123 116 115 203 82 12 35
7684C5q2j46K21j92J01j69L41M9k06N1m8J46N7j00j20n6J47K5j82j4K11j52j5
$$ 35 -47 -193 28 -164 -63 -232 109 158 -48 3 -45 101 158 58 -62 -118 29 54 -128 -142 69 -83 -98
7707i8P8R7R3j13k69K10M9p7O0K49l16J11q9o3J38J34j26J20k02k00L33J81m05
$$ -98 -20 77 170 57 -212 -2 47 -30 30 279 -37 74 -15 -78 60 194 68 188 -14 -214 119 300 -105
7730a05J63k27K18q8j17J82j62J73o8j2p7K36j64O8J54k38J48j27K35j29j62j40
$$ -105 58 -169 49 -39 -156 26 -136 37 -31 -43 -120 116 -48 20 174 -64 84 -43 192 63 -99 -239
7752b39J78J22n1k8J2k0j48J23O5k25K28%j39L6J69q8j2K44l35J15k44K85j47
$$ -239 -61 61 10 -18 -6 -26 -174 -51 14 -211 17 17 -122 -86 83 -5 -17 227 -108 7 -237 48 -99
7775i9L01k63q5J7R2K77j79k21K12r6R0j6k27K2K29k27J51m8k1Q3j94K68j62J74
$$ -99 202 -61 -146 -129 -37 240 61 -160 52 -44 46 30 -197 -175 54 -173 -22 -70 -91 -8 -202 66 -96 78
7799G8P0o7j85K76k64P3j43J94l7N0Q8J20l68J43K21j49k18J13rj30J23J24K1
$$ 78 148 81 -104 172 -92 -19 -162 32 -5 45 133 253 -115 28 249 100 -118 -5 -14 -144 -21 103 124
7822A24m4q4Nl67M35O2n4j71K48j8k00J57j82j42K73J8l73L57j00j41K56k02J87
$$ 124 80 -4 1 -366 69 131 77 -94 154 136 -64 93 -89 -231 42 60 -313 44 -56 -197 59 -143 44
7845D4Mj18J13k53L58p2p3m2m1J99j13mo2J13pO8j74J56k58j68M17j54J47Kj02
$$ 44 48 -70 43 -210 148 76 3 -39 -80 119 6 2 -60 53 46 114 -60 96 -162 -330 87 -67 80 82 -20
7870b0M6LL0j25J7O4k10L22l18L64n4L3j45J71o5j19L2j32K70r6J47j72j95O4
$$ -20 26 29 59 -66 -49 15 -195 127 -191 173 119 152 7 178 113 -6 26 -106 164 68 215 43 -152 -88
7894h8J20j68K74k46K3J69J5L4j32j93K70j02r0J32j45N7K71n43J21K19N9P6j43
$$ -88 32 -136 138 -108 -85 84 99 133 1 -192 78 -24 -114 18 -127 -70 201 -342 -221 -2 57 133 -10
7917a0o6J76k93K22lp4j43J38P0o6R6m4lk22K82mj89J38q3J76j0j33K2%J2p2J73
$$ -10 -76 100 -193 29 26 -48 -191 -53 17 -49 47 3 0 -222 60 56 -133 5 -78 98 88 -45 -23 -23 -11 -83 90
7944I0j24K27l46j50J16J49r7n3J56K8p7J09J68k95J79l8J08%k07J75j59J4J14
$$ 90 -34 193 -153 -303 -187 -38 -135 -188 -32 -4 -81 28 196 -99 80 42 150 150 -57 118 -41 -27 87
7967H7or2j23m1J95j81J05R0j9mN3m8j07K31k83K05j19j7J70j00r6K3M0K03j97
$$ 87 81 -11 -134 -175 20 -161 -56 34 15 11 64 16 -91 140 -143 62 -57 -74 96 -4 -100 -77 -37 166 -31
7992c1J64m2k6j15N1ro5K9j77K73o7k4J48j26N7R4j85j9L9J80k72P6J54j10J63
$$ -31 133 91 65 -50 1 -8 -73 -44 -221 52 -15 -39 109 -17 40 134 -51 -70 -31 149 -123 -47 107 -3 160
8017A60k17K23m73L27O3k24m8R0J81j7J0j02n3j1J29j62J37r3Q7M1j75K27j80
$$ 160 -57 166 -307 20 83 -141 -189 -99 82 65 75 -27 -80 -91 38 -124 13 -80 7 48 -127 100 -80
8040h0K49L2j12o7R1j11n3J75L1j90L52k54J35l12K41j24j53M24j23l28J38N5
$$ -80 169 201 89 22 113 2 -51 124 155 -35 317 63 198 -114 127 3 -150 274 151 -177 -39 16
8062A6j22J03lM2j09K61k06p0rPQ2j6L9k85K59j37J44p9N7Q0k43K49pk6k09L09
$$ 16 -106 -3 -6 36 -73 188 -18 -88 -97 -90 -8 -24 15 -270 -11 -148 -4 -83 -26 54 -189 60 53 27 -182 127
8088A27j12K38k99M5k75J01J47K24l02K4K90k98J86M4j51J15j13j73J12M8O6j31
$$ 127 15 253 -46 -1 -276 -175 -28 196 -106 -82 208 -90 96 140 -11 104 -9 -182 -70 -22 44 -87
8110h7q6L64l55N4J51j64K66k49m4O3K9j22J96j8K9m34L45J29J56j29n8K91k64
$$ -87 -173 191 -164 -110 41 -123 143 -106 -150 -87 -58 -180 16 -2 27 -407 -62 67 223 94 36 327 63
8133F3p1k26J41P0J44r7k1J05j84J1K5M1N1J0P3q8r9j38K25R8q6k03J95o0J58
$$ 63 -8 -234 -93 -23 121 24 3 108 -76 -65 -40 1 52 62 135 47 -52 -190 35 133 47 -156 39 -21 137
8158A37j99J3J79m7j83J0M23k26pO4j91J51k28K04j27M2R2n0m05N43k37L0J94
$$ 137 -62 -49 130 83 -100 -90 333 107 100 164 -27 124 -104 100 -27 15 107 57 -348 195 -42 -12 182
8181A82k39k6Q3K17l01O8J53j02M7k42
$$ 182 -57 -83 0 217 -84 -16 137 35 82 -160
8191a60
$$ Imaginary data points
##PAGE= N=2
##DATA TABLE= (X++(I..I)), XYDATA
0@%%%%%%%%%%%%%Qj6J6j6K4l2L2m0N1n9P2q8J04j20J36j56J80k08K40k72L08l51
$$ 0 0 0 0 0 0 0 0 0 0 0 0 0 0 8 -8 8 -8 16 -16 16 -24 27 -32 40 -48 56 -64 72 -84 96 -112 128 -144 164 -187
35a87L98m47N00n60O26o99P79q66R60j061J174j297J431j577J740j918K110k324
$$ -187 211 -236 264 -296 330 -369 410 -456 504 -557 617 -680 751 -826 914 -1004 1106 -1218
53a218K561k826L122l453L831m264M764n351O052o908P978r358J1220j3891J8087
$$ -1218 1343 -1483 1639 -1814 2017 -2247 2517 -2834 3218 -3690 4288 -5070 6150 -7741 10346
68A0346k5985O9567j79147J19195R9258k31925J84780j0142j06042J23660l3441
$$ 10346 -15639 53928 -125219 -6024 93234 -138691 46089 35947 -70095 53565 20124
79B0124o2348P7609k1360m0183L106N2760l1794j2287N7421p6577j2173P7803
$$ 20124 -42224 35385 14025 -26158 -23052 29708 -2086 -14373 43048 -33529 -45702 32101
91C2101p5487L5320N1654p6713M3420J8493n8668M0297j2926l5506K8464N812
$$ 32101 -43386 -8066 43588 -33125 10295 28788 -29880 10417 -2509 -38015 -9551 -3739
103c739L847Q180j3418j554P129m916m247K0320r615k2566K6293k282j2682J9300
$$ -3739 108 8288 -5130 -6684 445 -4471 -8718 11602 1987 -20579 5714 3432 -9250 10050
117A0050j9047k828K3937j1021K617J0858j4477j0189J4548M022k0696K3932J90
$$ 10050 -8997 -11825 12112 1091 3708 14566 89 -10100 4448 8470 -12226 11706 11896
130A1896l8539M8448j366m0405N3565l2609k7091O4530m8926r655N4585m8812
$$ 11896 -26643 21805 20439 -19966 33599 990 -26101 38429 -10497 -20152 34433 -14379
142a4379K594L4844k1359L113L872m930r355P528J5599l4903J8489J5969n0771
$$ -14379 -11785 23059 1700 4813 8685 3755 -5600 1928 17527 -17376 1113 17082 -33689
155c3689M2976O792m7643N4257j5758l0779N2473k8918j6372K4554k3331N505
$$ -33689 9287 16079 -31564 22693 6935 -23844 28629 -289 -16661 7893 -15438 -9933
167i933R509l533K527n598J2370j4303r80K7707l1587R074K1324l6050K3280R96
$$ -9933 -424 -3957 -1430 -7028 5342 -8961 -9941 17766 -13821 -4747 16577 -19473 3807 4803
181D803l3555L1925q356j0253L2961j6243k425J3010j9499K088O866m563L20L129
$$ 4803 -28752 3173 -5183 -15436 17525 1282 -1143 11867 -7632 -5544 1322 -3241 -2921 208
195B08M882n041L014q77j2233J3213N69o551K0494q825j0373J0219j3155k801
$$ 208 5090 49 3063 2186 -10047 3166 3735 -2816 17678 8853 -1520 8699 -4456 -7257
209g257J1412n878L33J2789q64j0851R373k036k0946J8248J698j6034K5962j0029
$$ -7257 4155 -1723 -1390 11399 10535 -316 9057 7021 -13925 4323 6021 -10013 15949 5920
223E920j5472K2956j8194m274J8676j6660O902R572j1110M531k708m188m355K348
$$ 5920 -9552 13404 -4790 -9064 9612 -7048 -146 9426 -1684 2847 139 -4049 -8404 -6056
237f056J0443j2474J1465P508k4830K0081k533k5407K8669j2143j2532L0995k0066
$$ -6056 4387 -8087 3378 10886 -13944 6137 3604 -21803 6866 -5277 -17809 13186 -6880
250f880j91K0208k4290O264J2111j5059O175L226n302o14K960J669r035R514L068
$$ -6880 -7071 13137 -11153 -4889 7222 -7837 -1662 1564 -3738 -4352 -1392 277 -8758 756 3824
265C824j4053J9486k069j5834K1125j1399j1507J9700j4694l333J6838j1222K513
$$ 3824 -10229 9257 7188 -8646 12479 1080 -10427 9273 -5421 -8754 8084 -3138 -625
278f25J1520p477p75M836m331m814N414j663o035Q779l457m453J0029o916j190
$$ -625 10895 3418 2643 7479 3148 -1666 3748 2085 -3950 4829 1372 -3081 6948 32 -1158
293a158J0067q161K004N504p740L5L26m206n17K452J529k213O569o91o734Q589
$$ -1158 8909 748 2752 8256 516 551 877 -3329 -3846 -1394 135 -2078 4491 3800 -2934 5655
309E655o881n782J1664j0408M96J0467j2935M883N447r540O308N05j467K141l687
$$ 5655 -1226 -7008 4656 -5752 -5256 5211 -7724 -2841 2606 -6934 -626 -121 -1588 553 -3134
324c134L986n842j350P413r689P036N061j0266J1489l553o966J0311r879J541
$$ -3134 852 -4990 -6340 1073 -8616 -1580 3481 -6785 4704 1151 -5815 4496 -5383 -3842
338c842O848r223Q904j258o004R856p004J533M952o686P143l953l210P051r140
$$ -3842 3006 -6217 2687 1429 -4575 5281 -1723 -190 4762 -1924 5219 1266 -1944 5107 -4033
353d033L974K477o702J2039m048l323J1069j1671M00N554j0136N636Q33m210O777
$$ -4033 -59 2418 -4284 7755 3707 384 11453 -218 182 5736 -4400 1236 2069 -2141 4636
368D636l196l5K677l537K375j783J34J980l650J621k548j348K068m042M970Q50
$$ 4636 1440 1405 4082 545 2920 1137 1271 3251 -399 1222 -1326 -2674 -606 -4648 322 1172
384A172m173P049j945l654K800l285j811j31R25k39n99O540n939j25R559j2998
$$ 1172 -3001 4048 2103 -1551 1249 -2036 -3847 -3978 -3053 -3292 -3891 2649 -3290 -3415 6144 -6854
400f854K999R672j4357P361M651j0500Q517k962m067O175l345K733q90J327M639
$$ -6854 -3855 5817 -8540 -1179 3472 -7028 1489 -1473 -5540 635 -2710 23 -867 460 5099
415E099r662O958N64j1718J3615n653n100J5679j1591J543R157j3095O963k45
$$ 5099 -4563 2395 2959 -8759 4856 -797 -5897 9782 -1809 -266 8891 -4204 2759 2514
429B514o568R557o152K482L836p700Q160n093m257J0691r274L095N116r271P882
$$ 2514 -4054 5503 -649 1833 5669 -2031 6129 1036 -3221 7470 -1804 1291 6407 -2864 5018
444E018l220n412P202n438K044K740l753N591m120j365L662p297M243P02n439
$$ 5018 1798 -3614 3588 -1850 194 2934 -819 4772 652 -713 2949 -4348 -105 597 -4842
459d842O385j511k246L048k284M33n89N54j67r30M274n796q74O598p402J695M667
$$ -4842 1543 32 -2214 834 -1450 -1017 -1606 -1052 -1219 -2149 2125 -3671 -4545 2053 -5349 -3654 1013
476A013m559M208n21k079L118j946o19k571K801K380p295Q157o92p828J2419o794
$$ 1013 -3546 662 141 -1938 1180 -766 -1385 -3956 -1155 1225 -6070 2087 1395 -6433 5986 -808
492h08l949J2979j0738J541O070q427O821l926k988O987o403O722k55p151J3160
$$ -808 -4757 8222 -2516 -975 5095 -3332 3489 -437 -3425 3562 -2841 3881 3626 -3525 9635
507I635r208m346J2726j1794L603M493j0582J0468j701n171N935n207M309j580
$$ 9635 427 -3919 8807 -2987 616 5109 -5473 4995 3294 -1877 4058 -1149 3160 1580
521A580l583R977j0012M99P502j3487R520K720j3437J3009j744o144R161p148
$$ 1580 -2003 7974 -2038 -1539 5963 -7524 1996 4716 -8721 4288 2544 -3600 5561 -1587
535a587j371M242n129J476J256J128o74k886N222k921j667M433o357L391L909
$$ -1587 -2958 1284 -3845 -2369 -1113 15 -659 -3545 1677 -1244 -2911 1522 -4835 -1444 2465
550B465o761L603J242m494J431k9J405J914n73o03n97L466k993l553L652j179
$$ 2465 -4296 -693 549 -3945 -2514 -2543 -1138 776 203 -400 -997 2469 -524 -4077 -425 -1604
566a604l52K457k25K878j808j568R25j064L109l480k79N901o980L543L253q818
$$ -1604 -1956 501 276 3154 1346 -222 703 -361 2748 -732 -1011 4890 -2090 1453 4706 -4112
582d112P645j210n614J0246n541o2M209r693O270L86o903Q698n302O24P475j0174
$$ -4112 3533 2323 -3291 6955 1414 1352 5561 -4132 2138 2524 -4379 4319 -983 -359 7116 -3058
598c058N601K618j0035N662m58k249M550m106M03J352o05K67l321N897k474n969
$$ -3058 2543 5161 -4874 788 330 -1919 2631 -1475 -1072 280 -325 -58 -3379 2518 44 -5925
614e925J1009n702m691Q893r429J260P938p829M241K011n671M587j127k291J391
$$ -5925 5084 -618 -5309 3584 -5845 -4585 3353 -4476 -235 1776 -3895 692 -435 -2726 -1335
629a335j162J875k248K021L901o324K370K121m208M424l52l506M040j138k013
$$ -1335 -2497 -622 -2870 -849 3052 -3272 -902 1219 -2989 1435 1083 -2423 1617 479 -1534
644a534J692Q01j216q14K613j052J673R01m539L386J3m379N894j853l235N428
$$ -1534 158 959 -257 -1071 1542 490 2163 3064 -1475 1911 1924 -2455 3439 1586 -1649 3779
660C779l601N39L320l917P47K11j250L168k146M92j032j315K847k716J910R73
$$ 3779 178 717 4037 120 867 1078 -172 2996 850 1342 310 -1005 1842 -874 1036 2009
676B009m143L668r13j906M540o002M54M335n367M411M07n235N179k869j336M497
$$ 2009 -2134 1534 621 -1285 3255 -2747 -2293 2042 -3325 1086 1493 -3742 1437 -1432 -2768 1729
692A729l901N04J272j719K572j388M83o12l315N309k059j695N934n958J09N300
$$ 1729 -2172 -1668 -396 -2115 457 -931 -448 -1060 -4375 934 -1125 -2820 3114 -2844 -2735 2565
708B565n587K166K456m821K556K296k244J078J35j454n60K724l14j899L341k574
$$ 2565 -3022 -856 1600 -3221 -665 1631 -613 465 600 -854 -1414 1310 996 -903 2438 -136
724a36j105M992m220M12L179m628K289K361k897K044q46j912J085Q27m85l87J372
$$ -136 -1241 3751 -469 -57 3122 -1506 783 3144 247 2291 1445 -467 618 1445 960 573 1945
741A945j227n08K945l071K2K469m411K700K173m896L225m35m024L915q89q18J296
$$ 1945 718 210 3155 84 106 2575 -1836 864 3037 -1859 1366 931 -3093 822 -67 -885 411
758D11q13O49j480K021o60l705M399k277j935O694o029j9N267o910L526L061o208
$$ 411 -402 247 -1233 788 128 -3577 822 -1455 -3390 3304 -2725 -2744 2523 -4387 -861 2200 -4008
775d008M483o61k772L429j570k04J07n81K009j816J837J187m240L982q54k579
$$ -4008 475 -186 -2958 471 -1099 -1303 -1196 -1777 232 -1584 253 1440 -2800 1182 328 -2251
791b251N034l812Q7L338m200K229J596l414K626q16k85J451j350J838j618j63
$$ -2251 2783 -1029 -942 2396 -1804 425 2021 -1393 1233 417 132 1583 233 2071 453 290
807B90K082k747J652O99k990L330j268r37K090k322Q83O26j606J836p85m04M62
$$ 290 2372 -375 1277 1976 -1014 2316 1048 111 2201 -121 762 1388 -218 1618 833 429 891
824H91j256J826j868j67J074j756J193j22l04J570k699J783N57l658M016j406
$$ 891 -365 1461 -407 -574 500 -1256 -63 -185 -489 1081 -1618 165 722 -2936 1080 -326
840c26k585M228k949j34K339k742J305J63l79N99j166K317j832j132L884m685
$$ -326 -2911 1317 -1632 -1766 573 -2169 -864 -701 -1080 -481 -1647 670 -1162 -2294 1590 -3095
856c095J662L194n908M414J292n274N358p41l064L666j622M9J09L3J341k712K808
$$ -3095 -1433 1761 -4147 267 1559 -3715 1643 902 -2162 1504 -118 -69 40 73 1414 -1298 1510
873A510k38l447N405l085j820O035n191N59M519n898L046J130l793L215j337o55
$$ 1510 1272 -2175 3230 145 -1675 4360 -831 -272 4247 -1651 1395 2525 -1268 1947 610 -45
889d5J443q81N37j131J032J209l714L085n9k928L513k046n85K489l492O46J575
$$ -45 1398 517 1054 -77 955 2164 -1550 1535 1476 -1452 2061 15 -570 1919 -1573 -927 648
906F48j763J062K4j5lk22L35j287O90j15j720K456j143m76K085k331P97P28j612
$$ 648 -1115 -53 -29 -44 -47 -269 66 -1221 -531 -646 -2366 90 -1053 -1529 556 -1775 -978 -250 -1862
925a862K214j417K30J782l151J973N21k300J941j420J231P69j861K750j916L6
$$ -1862 352 -1065 -835 947 -2204 -231 290 -2010 -69 -1489 -258 511 -1350 1400 -516 -480
941d80K264m388L870N38n079O003j611k825N349n004Q94L556m168J948M83j113
$$ -480 1784 -2604 1266 1804 -3275 2728 1117 -1708 3641 -1363 -469 3087 -1081 867 1350 237
957B37J618k634L042j258k091M507m394P75M421o649L107K117n608M835q20k754
$$ 237 1855 -779 2263 1005 -1086 3421 -973 -198 4223 -2426 681 2798 -2810 2025 1205 -1549
973a549L940k124k35J038j200Q53k241J440L92k773L627j649j972M806l653n20
$$ -1549 2391 267 32 1070 -130 723 -1518 -78 314 -2459 1168 -481 -2453 2353 -1300 -1820
989a820L900l997J233J059k989K372p5j343M54Q80K32r08O45M88j248J192r56
$$ -1820 2080 -1917 -684 375 -2614 -242 -317 -1660 -1206 -326 -94 -1002 -357 131 -1117 75 -881
1006h81j87J742k038R4P59K39L65r43J059R15j604J637r77o89K049k683P76J604
$$ -881 -1068 674 -1364 -1270 -511 -272 93 -850 209 1124 -480 1157 180 -509 1540 -1143 -367 1237
1024A237j553J184l64k65J582j925R09m87k90K444l149P98K312l415K227n15j624
$$ 1237 -316 868 504 239 1821 -104 805 318 28 2472 -677 121 2433 -982 1245 730 -894
1041h94L125k388n6J971j890J757j987m21L020l942J506J743l482L723j125k851
$$ -894 2231 -157 -213 1758 -132 1625 -362 -783 2237 -1705 -199 1544 -1938 1785 660 -2191
1057b191M076k912j024K871j862Q15J46q08J341j842J729j312j378L322k490k5
$$ -2191 1885 -1027 -2051 820 -1042 -227 -81 -889 452 -1390 339 -973 -2351 971 -1519 -1544
1073a544K926l315J452Q64l165L013j43j293J618p49O43o86r40J455j175K93P88
$$ -1544 1382 -1933 -481 383 -2782 231 88 -1205 413 -336 307 -379 -1319 136 -1039 -746 42
1090D2j226K995j022j370K073j409M6O43j310J410p46k67R43p99J179p22q28K285
$$ 42 -1184 1811 789 -581 1492 83 129 772 -538 872 126 -141 802 3 1182 460 -368 1917
1108A917j768J189O79k561J757j66k570K570j295l79J963j490J228N35j645L78
$$ 1917 149 1338 2017 -544 1213 1047 -1523 1047 -248 -627 1336 -154 1074 1609 -36 342
1124C42m94M53q2j075J218j033M55O78k004J834m18j478K305j091n0J234k390
$$ 342 -152 301 219 -856 362 -671 -216 462 -1542 292 -126 -1604 701 -390 -440 794 -1596
1141a596J321R9j780J803p26l73J230q09Q10M6q91O61j131R75K22j057J748j361
$$ -1596 -275 -176 -1956 -153 -879 -1252 -22 -831 -21 25 -866 -205 -1336 -361 -139 -1196 552 -809
1159h09RJ586j782R49K71j040R47K5j50P23j110P09l88O06Q92j760J246K14k194
$$ -809 -800 786 -996 -47 224 -816 131 156 6 729 -381 328 -60 546 1438 -322 924 1138 -1056
1178a056K652r84j216J951j715Q40J177j483J093l72r87J711j242J72N5j328J042
$$ -1056 1596 612 -604 1347 -368 472 1649 166 1259 887 -100 1611 369 541 596 -732 310
1195C10m19L46N91j242J479q98m96K117k858P33R36k699K260l5j543K068j676
$$ 310 -109 237 828 -414 1065 167 -329 1788 -1070 -337 599 -2100 160 125 -1418 650 -1026
1212a026J75J518j616R73k68p59J337j364R29m00j877K397j156J41K344k418R06
$$ -1026 -851 667 -949 24 -244 -1003 334 -1030 -101 -501 -2378 19 -1137 -996 1348 -1070 -164
1229a64J065k369J589o20q53J152q92J107L52o68J026j320N76O78j452J999r55
$$ -164 901 -1468 121 -499 -1352 -200 -1092 15 367 -301 725 -595 -19 659 -793 1206 251
1246B51n94K104k352N33J370k328J386Q59j090J276m46m82p9m93O25m79M20K23
$$ 251 -343 1761 -591 -58 1312 -1016 370 1229 139 1415 969 487 408 -85 540 61 481 704
1264G04q22J525m63j002J166j695K02R93q86J075k51o36N49q34O41m49n70J533
$$ 704 -118 1407 944 -58 1108 -587 -385 608 -278 797 546 -90 459 -375 266 -183 -753 780
1282G80j476N54J172k283R07j56q22J489j009N97Q61j568J203n96j064J799k011
$$ 780 -696 -142 1030 -1253 -346 -502 -1324 165 -844 -247 614 -954 249 -347 -1411 388 -1623
1299a623M51J631j635J263j57o32J051q79Q32k10q43J539j811R72O30k470K341
$$ -1623 -1172 459 -1176 87 -70 -702 349 -530 302 92 -751 788 -1023 -51 579 -1891 450
1316D50k07j672K981r14j055K371j996R1Q63j223M31n41Q94K81q35J287r39j48
$$ 450 243 -1429 1552 638 -417 1954 -42 49 912 -311 120 -421 473 754 -81 1206 267 119
1334A19J263j553J104L34k073J927n08j362J463o45k45P90k60N18p08L87n44n59
$$ 119 1382 -171 933 1267 -806 1121 613 -749 714 69 -176 614 354 872 164 551 7 -552
1352e52J020q59k20J283j321K77N86j184J397r57j94Q70q49M98k29l84O06q68
$$ -552 468 -391 -611 672 -649 -372 214 -970 427 -530 -724 146 -703 -205 -434 -818 -212 -1080
1370a080O70P46j177J117l52q01J103j214O02o1m44J591j249N31P94j910J716
$$ -1080 -410 336 -841 276 -76 -877 226 -988 -386 -447 -891 700 -549 -18 776 -1134 582
1387E82L8j974K456j190q98K068j426K96L20p59J345r20J199m8j426J951j588
$$ 582 620 -1354 1102 -88 -986 1082 -344 -48 272 -487 858 -62 1137 1089 -337 1614 26
1404B6j447K856k618P26K301k636K075M46k187J592j056j98Q09j059J170p38J72
$$ 26 -1421 1435 -1183 -457 1844 -792 1283 1729 -458 1134 78 -120 689 -370 800 62 234
1421B34M43j880J794J42k165K504m70q51J141j618j30R91j312N40L45p1N83k96
$$ 234 677 -1203 591 733 -1432 1072 602 -249 892 -726 -856 135 -1177 -637 -292 -363 220 -76
1439g6M42o08k79O90q72L79L87j240J095J12j099P51k92L1O77k95K58l54L50n09
$$ -76 366 -242 -521 169 -703 -324 63 -1177 -82 30 -1069 -318 -610 -579 98 -197 61 -293 57 -452
1459d52l80Q64m37K00M18o94J333l49n88N41m19K77j58q48J770l45n37Q63j109
$$ -452 -832 32 -405 -205 213 -481 852 503 -85 456 37 314 156 -692 1078 733 196 1059 -50
1478e0L85M34j165J058R2o29P53j016Q00m91o23J550j459R42Q23k500J896jk123
$$ -50 335 769 -396 662 754 125 878 -138 662 171 -452 1098 -361 581 1404 -1096 800 799 -1324
1497a324J929q65o96J951j634P38R31j453P04p53L56O57j919J376l00r44J922
$$ -1324 605 -260 -956 995 -639 99 1030 -423 281 -472 -116 541 -1378 -2 -302 -1246 676
1514F76j789M34J413j837J158O53j488J028q82l38R08p67M18j7l4Q97j000P39
$$ 676 -1113 -679 734 -1103 55 708 -780 248 -634 -972 -64 -831 -413 -430 -464 433 -567 172
1532A72pn67R84q92K8J052j238J80O04j123J567q20k28J609q19l90N84p05K41
$$ 172 165 -402 582 -310 -282 770 -468 -288 316 -807 760 -60 -288 1321 502 112 696 -9 232
1551B32k29j04Q33n97L18j54pL89o65N78l31j16R48j131P0N56j006M78j27k23
$$ 232 3 -101 732 135 453 299 292 681 16 594 263 147 1095 -36 34 590 -416 62 -65 -288
1571b88J174n86k66O08n98N9p66N2P63q05O64K21o60Q80p48k60O06o88J14K16
$$ -288 886 300 34 642 44 103 -663 -611 152 -653 11 232 -428 452 -296 -556 50 -638 -524 -308
1591c08l47Q49n02q1J55n14R30p48J27J086r83R2J99q37Q23m70k96J201m98N40
$$ -308 -655 194 -308 -389 -234 -748 182 -566 -439 647 -336 -244 -45 -882 -59 -529 -825 376 -122 418
1611D18K34o88M23n26m91P33m52O88N3m32P43n83lM59o46P83k29l78O82q72J33
$$ 418 652 -36 387 -139 -630 103 -349 339 392 -40 703 120 117 576 -70 713 484 106 788 -84 49
1632D9M89r26N98K77m54J023n27j88J44p37O41o59K3P19q77J153k79p76Q18p31
$$ 49 538 -388 210 487 33 1056 529 341 485 -252 389 -270 -247 472 -405 748 469 -307 511 -220
1652b20k23Q18r13N99J22j021Q72m80j37N86o82R22k00m82R48j131J11K84n53
$$ -220 -443 375 -538 61 183 -838 34 -446 -583 3 -679 243 43 -439 509 -622 -511 -227 -780
1671g80O40l74j41R65o86K51M08q98O84j11l49O33m83K34J67o21Q48l96Q5M61
$$ -780 -140 -514 -655 310 -376 -125 283 -615 69 -42 -391 242 -241 -7 160 -461 387 -9 76 537
1691E37o06M03n13J04M52o44L74K34m53P70k43k95P53r64L15L25p23L33k8J40
$$ 537 -69 334 -179 -75 377 -267 107 341 -112 658 415 120 873 -91 224 549 -174 159 131 271
1711B71j2k09K28l70J92M81p87P39jj073J193o44q95J412p51m7N09l51J89J22
$$ 271 259 50 278 -92 100 581 -206 533 532 -541 652 8 -887 525 -226 -273 236 -115 74 196
1731A96k41k58l05P27q21L82Q88j426O06M79j281J212j8q26P22j3k29J72p15M29
$$ 196 -45 -303 -608 119 -702 -320 568 -858 -252 227 -1054 158 140 -686 36 23 -206 -34 -749 -320
1751c20j84K67K51m83R34k79m86N46m95O0N94j060N80N31q19J041q33q5O01l72
$$ -320 -504 -237 14 -469 465 186 -300 246 -249 -189 405 -655 -75 456 -363 678 -155 -240 361 -11
1771a1L43L83n61N11m61k70N54m50J17m34K75M94k70N66m14n92P42q34J01N72
$$ -11 332 715 154 665 204 -66 488 38 155 -279 -4 490 220 786 372 -220 522 -312 -211 361
1791C61o77O49K79o28K79j64k84L28l1m8J50j75l2p12O39k64k00Q63n50k01R84
$$ 361 -316 333 612 -16 263 99 -185 143 112 64 214 39 7 -705 -66 -330 -530 333 -217 -418 566
1812E66r77k58O74q26M39K10k46J83L48l80l13P41q9p53J045l68p68J334o92m99
$$ 566 -411 -669 5 -821 -382 -172 -418 -235 113 -267 -580 161 72 -681 364 -4 -772 562 -130 -629
1832f29R32p94L83N54o41N33k7l54M1j37M26n13Q9Q40p76L84M36j022O60j0m97
$$ -629 303 -491 -108 446 -195 338 311 -43 -2 -139 287 -226 -137 703 -73 311 747 -275 385 375 -122
1853a22N24k36j94N83n31M21Q1m99M63m47L11J82o72L34k98k22K89l86N41R8j83
$$ -122 402 166 -28 555 24 445 526 27 490 43 354 536 -136 198 -100 -322 -33 -419 122 220 37
1874C7M06n64M7P01j055J90P7l51M17r7k03L09n3j72J64J09j03N1J55n59J41N13
$$ 37 443 -121 -74 627 -428 -238 -161 -512 -95 -192 -395 -86 -139 -311 -147 -38 -141 -90 65 -494 -353 160
1896A60p87j9Q29o69N13J33o45P33j17o91M49J11j4j27N33n35ML59m06K16O13
$$ 160 -627 -646 183 -486 27 160 -485 248 131 -560 -111 0 -14 -141 392 -143 -139 220 -186 30 643
1917F43p22R4Q63r86K38L96p77M23%j90M46k03R4k62L32j98k93M24j37n45J032
$$ 643 -79 15 878 -108 130 526 -251 172 172 -18 428 225 319 57 389 191 -102 322 185 -360 672
1938F72l06o06P48p06N7M83o01N73l43j4J74k88J56k74k50N14R9k12K48l95L24
$$ 672 366 -240 508 -198 -141 342 -259 314 -29 -43 131 -157 -1 -275 -525 -11 88 -124 124 -271 53
1959E3k37n78Q32o45M34K78p88O69pm86M55k29k04M88k34J38M3m76K23J79J60
$$ 53 -184 -762 70 -575 -141 137 -651 18 11 -475 -20 -249 -453 35 -199 -61 -18 -494 -271 -92 68
1980F8j3j58K69m14L74K28p71N30Q0m77O03r9J23J13k60J63K13n86J36P3N4k39
$$ 68 55 -103 166 -248 126 354 -417 113 193 -284 319 220 343 456 196 359 572 -14 122 195 249 10
2002A0k75M74O5k14J83m17O01J3p53N27J55l79J01j24j29K72p9j07J19K93m30
$$ 10 -265 209 274 60 243 -174 427 440 -313 214 369 -10 91 -33 -162 110 31 -76 43 336 -94
2023i4l23N42k64J86K25p48M04M10r76P04l3o26L37J36K27Kk59j44J20L1l43Q1
$$ -94 -417 125 -139 47 272 -476 -72 338 -638 66 33 -593 -256 -120 107 109 -150 -294 -174 -143 -486 -405
2045d05K19J81Mol73M21n6m49M16j77J4J90j21L94J36p89K90L06j5r2j53K86k86
$$ -405 -186 -5 -1 -7 -380 41 -15 -464 -48 -225 -211 -21 -142 252 388 -401 -111 195 180 88 -65 221 -65
2068f5O0n5k46M82K26n25N13j38m26Q74n96kJ13l07m5L75o7k5k77M10l18o8M90
$$ -65 -5 -60 -306 176 402 -123 390 252 -174 700 104 102 215 -92 -137 238 171 146 -131 279 -39 -107 383
2091C83n57J85K90m59L92k49k05L72m51K63J30k2l6j67j13L34n16K62m6j15J71
$$ 383 -174 11 301 -158 234 -15 -220 152 -299 -36 94 72 36 -131 -244 90 -426 -164 -210 -325 -154
2112a54J52k67N77p28K16R7l69M59k12j88M04l57J44L36k41J58J2m4K40n02L84
$$ -154 -2 -269 308 -420 -204 -107 -476 -17 -229 -417 -13 -370 -226 110 -131 27 39 -5 235 -267 117
2133A17j47m2J72k6j6J36j84L31l28j35M16l66J35J93qk72J65k00O5JK16j51q6
$$ 117 -30 -72 100 74 58 194 10 341 13 -122 294 -72 63 256 248 -24 141 -59 6 7 223 72 -14
2156a4L04l66J88k38j2M14k58j17N35l13k10O8k04P4lL57k94K58K62p38R7K37
$$ -14 290 -76 112 -126 -138 276 18 -99 436 123 -87 -19 -223 -149 -152 205 -89 169 431 -307 -210 27
2178B7n47K02J91m06Q62l49l80J03K6L5L9m3J5J08RJ36k40J73J25l62L33j71l0
$$ 27 -520 -318 -127 -533 329 -20 -400 -297 -271 -236 -197 -240 -225 -117 -108 28 -212 -39 86 -276 57 -114 -144
2201a44K57l24K76J37l41K28k72L64n8l37O20l11j71L38l48J88P2l88O00J07l24
$$ -144 113 -211 65 202 -139 89 -183 181 123 -214 406 95 -76 262 -86 102 174 -214 386 493 169
2222A69%j04q7K43q7nJ01n2m3k19M42k52j96J70N3m9L90m60J42k39J87k82k6J
$$ 169 169 65 -22 221 134 129 230 178 135 -84 358 106 -90 80 133 84 474 14 156 -83 104 -178 -204 -203
2246b03J90J02N8j55k01L16n11O73k3m74M36l28J22k00k1K25j28l0K33j58N9n5
$$ -203 -13 89 147 -8 -209 107 -404 269 246 -228 208 -120 2 -198 -219 6 -122 -152 81 -77 -18 -73
2268g3k94J98o6j7M56m79L61o5j50Q0p3L14k44o8L22j94j91N35k03j48M04m36
$$ -73 -367 -169 -235 -252 204 -275 86 21 -129 -49 -122 192 -52 -120 202 8 -183 352 149 1 405 -31
2290c1K18N0o48M33M6p2p8m8L76Mk66K84k47J70j54l42O99n36K82J03l19J77J25
$$ -31 187 237 -411 22 68 -4 -82 -130 246 250 -16 268 21 191 37 -305 394 -142 140 243 -76 101 226
2313B26l03K75m34L46J16l00K50k92j60L33l51q8L24m2K10k53j52L20k87K57k30
$$ 226 -77 198 -236 110 226 -74 176 -116 -276 57 -294 -382 -58 -100 110 -143 -295 25 -262 -5 -235
2334b35N8L26l40P8R6j42Q8Kj31J81k9p9O1J14J18k42r0J89j31L71j33k58K50
$$ -235 -177 149 -191 -113 -17 -159 -71 -69 -200 -19 -48 -127 -66 48 166 -76 -166 23 -108 263 130 -128 122
2357A22j52o6K33k34J03K67l87L22J65l85k3K10K8k54K37J40n04L80J1o3Qj02
$$ 122 -30 -96 137 -97 6 273 -114 208 373 -12 -35 175 203 -51 186 326 -178 202 213 150 158 56
2379E6q0K95k68J04K22l26K37n33K84p1q8M53k15O5J46l04j08K98m39L35j0j26
$$ 56 -24 271 3 107 329 3 240 -293 -9 -80 -168 285 70 135 281 -23 -131 167 -272 63 53 -73
2401g3m0j05M01k81j21K89l13J06L56l30j33J23j82J6J49Q4r5J94Q7L8k31J77
$$ -73 -113 -218 183 -98 -219 70 -243 -137 219 -111 -244 -121 -303 -287 -138 -54 -149 45 132 170 -61 116
2423A16m87J77L98l05K9m6J17o2N7oK96k40J91j76pK40k89j23L32j39J16j82J9
$$ 116 -371 -194 204 -101 -72 -118 -1 -63 -6 -12 284 44 235 59 52 292 3 -120 212 73 189 7 26
2446B6L18k15j27J69J04k25J64j14K49m51M5J43j8q5J24K7j0k5k28O7m0q5R1j3
$$ 26 344 129 2 171 275 50 214 100 349 -102 -57 86 68 -17 107 134 124 99 -129 -62 -102 -187 -96 -109
2470a09J21r0m2Q7N3j87m1J32j14K57j05o7N5m1k82L62j80MO9p5N8rP8J28k32
$$ -109 12 -78 -120 -33 20 -167 -208 -76 -190 67 -38 -105 -50 -91 -373 -11 -191 -187 -118 -193 -135 -144 -66 62 -170
2495a70Q1p1K21jp7L8j03N5M4M6j61J91j26J6L94n58J42K35k42O1J92k84M63k64
$$ -170 -89 -160 61 60 -17 21 -82 -27 17 63 -98 93 -33 -17 377 -181 -39 196 -46 15 207 -77 386 122
2519A22j49K91m25J82j13J17K59k86K63n7j40L5j34R4j08Pj91L9J98R5j66Q1K22
$$ 122 -27 264 -161 21 -92 25 284 -2 261 204 64 99 -35 59 -49 -42 -233 -194 4 99 -67 14 236
2542B36k31J99j49j82M3Pp1Qj63K71K0k76L72nk64K97l46J21K01k55P9k35K92
$$ 236 5 204 55 -127 -84 -77 -148 -140 -303 -32 -12 -288 84 79 -185 112 -234 -113 88 -167 -88 -323 -31
2565c1Q1m50L59rL41m89L22j75L1J3o2j21J90Q4r6K4n6K81l00N3RK9p7J36l4K48
$$ -31 50 -400 -41 -50 291 -198 124 -51 -20 -7 -69 -190 0 84 -12 12 -44 237 -63 -10 -1 28 -49 87 53 301
2591C01j95j03K73p4j47P8j68K85q0k91K53o7j38J86J24k2l5j1k28j94L39k02
$$ 301 106 3 276 202 55 133 -35 250 170 -121 132 65 -73 113 237 215 180 169 -59 -253 86 -116
2613a16R8L74m02j55M32l50Q3K53j66l11M44l65M06n32K89j24j13L22j11m5L50
$$ -116 -18 356 -46 -201 231 -119 -36 217 51 -260 184 -181 225 -307 -18 -142 -255 67 -44 -89 261
2634B61o27K59L10l50K17m10q0M92l07M8Q6j63K60J29j16k28J50J19j10o8M05
$$ 261 -366 -107 203 -147 70 -340 -420 72 -235 -187 -101 -264 -4 125 9 -219 -69 50 -60 -128 277
2655B77n29J91Mk19O12l75P3J77j91p4L6j92L86J50k29n2J51N3k56j00Q9k23K41
$$ 277 -252 -61 -57 -276 336 -39 34 211 20 -54 -18 -210 176 326 97 45 196 249 -7 -107 -18 -241 0
2678@L00j88P1Qj46k55O8K48j5k10K23j50j29J27P8k47O8J53J12l50Q3N4J02j71
$$ 0 300 112 183 191 45 -210 -142 106 91 -119 104 -46 -175 -48 30 -217 -149 4 116 -234 -151 -97 5 -166
2702a66J27j34J16m3R3k17M5K37j77Q1m9l8J75j67J51j3o9J76k99n1K33p6p4J88
$$ -166 -39 -173 -57 -100 -7 -224 -179 58 -119 -38 -87 -125 50 -117 34 21 -48 128 -171 -222 11 -65 -139 49
2726D9l0j25M41l60l5L15l18K54j71J66k28K74o4p3k20N42o77M61j33o9K55l00
$$ 49 19 -106 335 -25 -60 255 -63 191 20 186 -42 232 168 95 -125 417 -260 201 68 -1 254 -46
2748d6j5L77l96N0Pj38K49n0J37K00n20K90j06j91K16k26K82l58PJ6J80l18N26
$$ -46 -61 316 -80 -30 -23 -161 88 38 175 375 -145 145 39 -152 64 -162 120 -238 -231 -215 -35 -353 173
2771A73k94J84j64r0pO5P8K03k32n2J58j38o1j66N62k67N8k09L3M6R4p5O4Q5q8
$$ 173 -121 63 -101 -191 -198 -133 -55 148 -84 -136 22 -116 -177 -343 219 -48 10 -199 -166 -120 -26 -101 -37 48 -40
2796d0K48j56j93M14j29l45L00l8j04K70j9l35M75k16j11K3M6j88M69J6m88K62
$$ -40 208 52 -141 273 144 -201 99 61 -43 227 208 -127 348 132 21 44 90 -98 371 387 -101 161
2818A61L7l3J79n35M73o6j89M0J72k00M1l35M43l23L3K89k84j75K88j92j2K40
$$ 161 198 165 344 -191 282 216 27 67 239 39 80 -255 188 -135 -102 187 -97 -272 16 -176 -188 52
2840E2l74K86r8O2K24k63L8N6j95p4J57J89j64l47L92k97L21K0k05K11J60k32
$$ 52 -322 -36 -134 -72 152 -111 -73 -17 -212 -286 -129 60 -104 -451 -59 -356 -35 -15 -220 -9 151 -81
2862h1J69n4k27M30k91K7M7o2l6P0M8J19k67K01Pr0L49k17k20J33j05J50Q4n29
$$ -81 88 34 -193 237 -54 -27 20 -42 -78 -8 40 159 -108 93 100 10 359 142 -78 55 -50 100 184 -345
2886c45L35qj20J56K28r4jj18K02j49M4k10L29J15n80L26J7l7o0J01k26L4J70
$$ -345 -10 -18 -138 18 246 152 151 33 235 86 130 -80 249 364 -216 110 127 90 30 131 -95 -61 109
2909A09m02K60M5k27j09K50K0J00j20O0k0Q2l22K51K24k17n0l3o1J69K5p6k3N
$$ 109 -293 -33 12 -215 -324 -74 -54 46 -74 -14 -34 48 -274 -23 201 -16 -66 -99 -160 9 34 -42 -65 -60
2933f0l3L02k19p1j42K61l15RL33k18K21l95K51J28j23k9O5J02j29L51m20K22
$$ -60 -93 209 -10 -81 -223 38 -277 -268 65 -153 68 -327 -76 52 -71 -100 -35 67 -62 289 -131 91
2955I1p3K8K87j31j84J56K1k56N9N9K33k56K07J43n39J42J10k61N31m67O0J84
$$ 91 18 46 333 202 18 174 195 -61 -2 57 290 34 241 384 -155 -13 97 -164 367 -100 -40 144
2977A44m81M42j00j23R0k7n0J27q9J02j01r8P2q9K03j69K8L50k95p6J22k9jK30
$$ 144 -337 105 5 -118 -28 -55 -105 22 -67 35 -66 -164 -92 -181 22 -147 -119 231 -64 -140 -18 -47 -48 182
3001A82l86J56j37l6K62j63j05J37j01K04l83K32J74l60N47n73K83K08j18J67
$$ 182 -204 -48 -185 -221 41 -122 -227 -90 -191 13 -370 -138 36 -324 223 -350 -67 141 23 190
3021A90k37J26O0j92M5K45k50K46m51L83J48l76L62l26oQ0j40K36J1l93L17J83
$$ 190 -47 79 139 -53 -8 237 -13 233 -218 165 313 -63 299 -27 -33 47 -93 143 154 -239 78 261
3043B61j23j13K17k22m2l0J09j13K68k53K8P5j92Q8K9j99Q0M16m75L52j27k19
$$ 261 138 25 242 20 -22 -52 57 -56 212 -41 -13 62 -130 -42 -13 -212 -132 284 -191 161 34 -185
3065a85J47m9J2N9P0j23j99K45l5j99K27j32o3K00L1n7N1j61K04q8Q2M7P1k17
$$ -185 -38 -87 -75 -16 54 -69 -268 -23 -58 -257 -30 -162 -225 -25 6 -51 0 -161 43 -45 37 84 155 -62
3089f2Mk5J14j16L1K10q4j6o0M5J14j47m8J38o6K0K0K3J70n17L66k76L01oJ34
$$ -62 -58 -83 31 -85 -54 156 72 56 -4 41 155 8 -40 98 32 52 72 95 265 -252 114 -162 139 133 267
3114B67k73J10Q6j10q9q0Q1J22K23k82J12o4K7k22N3J57j46K26j70O4L7k22N1
$$ 267 -6 104 190 80 -9 -89 -8 114 337 55 167 103 130 -92 -39 118 -28 198 28 92 129 -93 -42
3137d2N1l25K95r5J64l0q2O6o8J87q2r3J86j47J01n6Qj97QQ2q8p9K20l7m5K28
$$ -42 9 -316 -21 -116 48 18 -64 2 -66 121 39 -54 132 -15 86 30 38 -159 -151 -69 -157 -236 -16 -53 -98 130
3163A30l91L77k7j27n7K84j31Q0j2j91k6Q4J42K6j50J84q3j89K81m6J85k21m4
$$ 130 -261 116 89 -38 -95 189 58 138 126 -65 -91 -7 135 161 11 195 112 -77 204 158 343 122 78
3186G8K91j05l55L01j45J15j57K06k94j2K20j50N9j6l14J84J93J55k72Kj2j6J70
$$ 78 369 264 -91 210 65 180 23 229 -65 -77 143 -7 52 36 -278 -94 99 254 -18 -16 -28 -44 126
3209A26k71j7J4k9J52J5J93k40J27k50J39P8l92J78L78j15k13Q1j55K53Qk84J87
$$ 126 -145 -162 -148 -177 -25 -10 183 -57 70 -180 -41 37 -355 -177 201 86 -127 -46 -201 52 60 -224 -37
3232c7J79k59P3r1J93k06ok4K06p1J00j51K06p1j83M58m41M52j94r0J38j41j16
$$ -37 142 -117 -44 -135 58 -148 -154 -178 28 -43 57 -94 112 41 -142 316 -125 327 133 43 181 40 -76
3255g6K52k18K12k15R1Pm0n0R9r9k7K7K37r0j88L12j80j29J45Q0o55L92J11k84
$$ -76 176 -42 170 -45 46 53 13 -37 62 -37 -64 -37 200 110 -78 234 54 -75 70 150 -505 -113 -2 -286
3279b86L36p7J83k62K69k27r8L45k68J41j66p0J62k28K6L15k03L4m8jJ41o4j40
$$ -286 50 -27 156 -106 163 -64 -162 183 -85 56 -110 -180 -18 -246 -220 95 -108 -74 -122 -123 18 -46 -186
3302a86K3L6R4Q8j6j70K11j54J7lR7J5k74K34k57J69J08P5M5O0l65J47J22pJ51
$$ -186 -163 -127 -33 55 39 -131 80 -74 -57 -60 37 52 -222 12 -245 -76 32 107 152 212 -153 -6 116 109 260
3327B60k49j15j03L8N5K14m5M7j79J70j45N0Q4O8l39J86R7j07J50j02K4om6Nr8
$$ 260 11 -104 -207 -169 -114 100 55 102 -77 93 -52 -2 82 150 -189 -3 94 -13 137 35 59 53 7 12 -86
3352h6J62o5j34j69J88o4J90L7J41k91J17k10P3k81K11M6J52n4l8k08J41j57J26
$$ -86 76 11 -123 -292 -104 -168 22 59 200 -91 26 -184 -111 -392 -181 -135 17 -37 -75 -283 -142 -299 -173
3375a73M1Q2J80l79J21j56L91l78J91M2r7L00p7K93l69J33l9J1k13K07l29J14
$$ -173 -132 -50 130 -249 -128 -284 107 -271 -80 -38 -135 165 88 381 12 145 106 117 -96 111 -218 -104
3397a04L36j45j13k3k0J47J80j9pk42m1L29l89O1K95j33o4r7J75Pl5m9k36L74
$$ -104 232 87 -26 -49 -69 78 258 239 232 -10 -51 278 -111 -50 245 112 48 -49 126 133 98 49 -187 187
3421A87j34k63L97m9j27J63l42N0L24l26O0P3k19J35q8R8j34O2K09n9R8k60O7
$$ 187 53 -210 187 138 11 174 -168 -118 206 -120 -60 13 -206 -71 -159 -61 -195 -133 76 17 115 -145 -78
3444g8pl1r5J60KM2N1k90J27R2P5k69P4M1mJ43j47Q5j4K14k51K81k37K05J28l19
$$ -78 -85 -116 -211 -51 -49 -7 44 -246 -119 -27 48 -221 -147 -106 -110 33 -114 -29 -43 171 -80 201 -36 169 297 -22
3470b2J8l4p1N9R9k22KN28l89J50n9MqR2J83j86Jk12K3j0J82m42L11J32k80K42
$$ -22 -4 -38 -109 -50 49 -173 -171 357 -32 118 59 63 55 147 330 144 145 -67 -44 -54 128 -314 -3 129 -151 91
3496I1M0j75J62j29K3j12J50O7k5k9j40K14j89q4J63j02n0L30j37j64O5l85N14
$$ 91 131 -44 118 -11 12 -100 50 117 92 63 -77 137 -52 -136 27 -75 -125 205 68 -96 -31 -416 98
3519I8j04L1j50l7J24N1q2oJ31j41J38j50K7K00q6J55l7l48O3J1R4J76q4P8R1
$$ 98 -6 25 -125 -162 -38 13 -69 -75 56 -85 53 -97 -70 130 44 199 162 -186 -123 -112 -18 158 74 152 243
3544B43o8j96j41N4J32L1k2n2j52L46j36J22k6Q0o2j84J57K48m57M4R9j46K66
$$ 243 175 -21 -162 -108 24 55 33 -19 -171 175 39 161 135 215 153 -31 126 374 -83 -39 60 -86 180
3567A80j46j78Q5rj14J45M6l8r2K05L3j97L21k55J81n7k97J70J23j43J20j43j06
$$ 180 34 -144 -59 -68 -182 -37 9 -29 -121 84 117 -80 241 -14 167 110 -187 -17 106 -37 83 -60 -166
3590a66M6J3O2j13J32J44k22J46q2J51k85j74J20Oj1L78k65J12K4q9k8J43m6R9
$$ -166 -120 -107 -45 -158 -26 118 -104 42 -40 111 -174 -348 -228 -222 -233 145 -120 -8 16 -73 -101 42 -4 95
3614I5j55n4qK33o1k90J27K96p3r0K23j55P6j47J4l6L%J38j19o3K5K88q1l1po8
$$ 95 -60 -114 -122 111 50 -240 -113 183 110 20 243 88 164 17 31 -5 -2 -2 136 17 -46 -21 267 186 155 148 80
$$ [...]
8191a6
##END NTUPLES=NMR FID
##END=
