##TITLE=1H_L3L30-SeO2-7d-f18
 CDCl3,8 sc, 
 2.03.2021
##JCAMPDX= 6.0         $$ Bruker NMR JCAMP-DX V2.0
##DATA TYPE= NMR FID
##DATA CLASS= NTUPLES
##ORIGIN= UXNMR, Bruker Analytische Messtechnik GmbH
##OWNER= root
$$ XWIN-NMR		Version 3.5
$$ Tue Mar  2 10:22:37 2021 Russian Standard Time (UT+4h)  she@DPX200
##.OBSERVE FREQUENCY= 200.1315066352
##.OBSERVE NUCLEUS= ^1H
##.DELAY= (6, 6)
##.ACQUISITION MODE= SIMULTANEOUS
##.ACQUISITION SCHEME= undefined
##.AVERAGES= 8
##.DIGITISER RES= 18
##SPECTROMETER/DATA SYSTEM= spect
##.PULSE SEQUENCE= zg30
##.SOLVENT NAME= CDCl3
##.SHIFT REFERENCE= (INTERNAL, CDCl3, 0, 15.7039)
##AUDIT TRAIL= $$ (NUMBER, WHEN, WHO, WHERE, WHAT)
$$ ##TITLE= Audit trail, XWIN-NMR		Version 3.5
$$ ##JCAMPDX= 5.01
$$ ##ORIGIN= Bruker BioSpin GmbH
$$ ##OWNER= she
$$ F:/spectra/data/she/nmr/H-F/1/audita.txt
$$ ##AUDIT TRAIL=  $$ (NUMBER, WHEN, WHO, WHERE, WHAT)
(   1,<2021-03-02 10:21:19.23 +0400>,<she>,<DPX200>,
      <created by zg, POWCHK disabled, PULCHK disabled
       configuration hash MD5:
       00 E9 B6 7A A2 85 ED C7 34 08 36 98 17 FE 4E 26
       data hash MD5: 16K
       08 F3 57 8F D4 AF CC E8 20 5E 6E 0C 8B F2 6F C3>)
$$ ##END=
$$ 
$$ hash MD5
$$ 3B 63 49 A2 46 EE 36 B4 AB 6C 13 38 84 CE 08 83
##$RELAX= 
##$RELAX= 
##$RELAX= 
##$RELAX= 
##$RELAX= 
##$RELAX= 
$$ Bruker specific parameters
$$ --------------------------
##$DU= <F:/spectra>
##$EXPNO= 1
##$NAME= <H-F>
##$PROCNO= 1
##$TYPE= <nmr>
##$USER= <she>
##$AMP= (0..31)
100 100 100 100 100 100 100 100 100 100 100 100 100 100 100 100 100 100 
100 100 100 100 100 100 100 100 100 100 100 100 100 100 
##$AQSEQ= 0
##$AQ_mod= 1
##$AUNM= <au_zg>
##$AUTOPOS= <>
##$BF1= 200.13
##$BF2= 200.13
##$BF3= 200.13
##$BF4= 200.13
##$BF5= 200.13
##$BF6= 200.13
##$BF7= 200.13
##$BF8= 200.13
##$BYTORDA= 1
##$CFDGTYP= 0
##$CFRGTYP= 5
##$CHEMSTR= <none>
##$CNST= (0..31)
1 1 145 1 1 1 1 1 1 1 1 1 1 1 1 1 1 1 1 1 1 1 1 1 1 1 1 1 1 1 1 1 
##$CPDPRG= <>
##$CPDPRG1= <>
##$CPDPRG2= <>
##$CPDPRG3= <>
##$CPDPRG4= <mlev>
##$CPDPRG5= <mlev>
##$CPDPRG6= <mlev>
##$CPDPRG7= <mlev>
##$CPDPRG8= <mlev>
##$CPDPRGB= <>
##$CPDPRGT= <>
##$D= (0..31)
0 1.2 0 0 0 0 0 0 0 0.06 0 0.03 0 0 0 0 0.0002 0 0 0 0 0 0 0 0 0 0 0 0 
0 0 0 
##$DATE= 1614666078
##$DBL= (0..7)
120 120 120 120 120 120 120 120 
##$DBP= (0..7)
150 150 150 150 150 150 150 150 
##$DBP07= 0
##$DBPNAM0= <>
##$DBPNAM1= <>
##$DBPNAM2= <>
##$DBPNAM3= <>
##$DBPNAM4= <>
##$DBPNAM5= <>
##$DBPNAM6= <>
##$DBPNAM7= <>
##$DBPOAL= (0..7)
0.5 0.5 0.5 0.5 0.5 0.5 0.5 0.5 
##$DBPOFFS= (0..7)
0 0 0 0 0 0 0 0 
##$DE= 6
##$DECBNUC= <off>
##$DECIM= 32
##$DECNUC= <off>
##$DECSTAT= 4
##$DIGMOD= 1
##$DIGTYP= 9
##$DL= (0..7)
0 120 120 120 120 120 120 120 
##$DP= (0..7)
150 150 150 150 150 150 150 150 
##$DP07= 0
##$DPNAME0= <>
##$DPNAME1= <>
##$DPNAME2= <>
##$DPNAME3= <>
##$DPNAME4= <>
##$DPNAME5= <>
##$DPNAME6= <>
##$DPNAME7= <>
##$DPOAL= (0..7)
0.5 0.5 0.5 0.5 0.5 0.5 0.5 0.5 
##$DPOFFS= (0..7)
0 0 0 0 0 0 0 0 
##$DQDMODE= 0
##$DR= 18
##$DS= 0
$$ [...]
##$SUBNAM2= <"">
##$SUBNAM3= <"">
##$SUBNAM4= <"">
##$SUBNAM5= <"">
##$SUBNAM6= <"">
##$SUBNAM7= <"">
##$SUBNAM8= <"">
##$SUBNAM9= <"">
##$SW= 16.9725356469052
##$SWIBOX= (0..15)
0 0 2 0 0 0 0 0 0 0 0 0 0 0 0 0 
##$SW_h= 3396.73913043478
##$TD= 16384
##$TD0= 1
##$TE= 0
##$TE2= 300
##$TE3= 300
##$TEG= 300
##$TL= (0..7)
0 120 120 120 120 120 120 120 
##$TP= (0..7)
150 150 150 150 150 150 150 150 
##$TP07= 0
##$TPNAME0= <>
##$TPNAME1= <>
##$TPNAME2= <>
##$TPNAME3= <>
##$TPNAME4= <>
##$TPNAME5= <>
##$TPNAME6= <>
##$TPNAME7= <>
##$TPOAL= (0..7)
0.5 0.5 0.5 0.5 0.5 0.5 0.5 0.5 
##$TPOFFS= (0..7)
0 0 0 0 0 0 0 0 
##$TUNHIN= 0
##$TUNHOUT= 0
##$TUNXOUT= 0
##$USERA1= <user>
##$USERA2= <user>
##$USERA3= <user>
##$USERA4= <user>
##$USERA5= <user>
##$V9= 5
##$VALIST= <valist>
##$VCLIST= <CCCCCCCCCCCCCCC>
##$VD= 0
##$VDLIST= <DDDDDDDDDDDDDDD>
##$VPLIST= <PPPPPPPPPPPPPPP>
##$VTLIST= <TTTTTTTTTTTTTTT>
##$WBST= 1024
##$WBSW= 4
##$XGAIN= (0..3)
0 0 0 0 
##$XL= 0
##$YL= 0
##$YMAX_a= 131869
##$YMIN_a= -159576
##$ZGOPTNS= <>
##$ZL1= 120
##$ZL2= 120
##$ZL3= 120
##$ZL4= 120
##$ABSF1= 10
##$ABSF2= 0
##$ABSG= 5
##$ABSL= 3
##$ALPHA= 0
##$AQORDER= 0
##$ASSFAC= 0
##$ASSFACI= 0
##$ASSFACX= 0
##$ASSWID= 0
##$AUNMP= <proc_1d>
##$AZFE= 0.1
##$AZFW= 0.1
##$BCFW= 1
##$BC_mod= 2
##$BYTORDP= 1
##$COROFFS= 0
##$CY= 11.3945322036743
##$DATMOD= 1
##$DC= 2
##$DFILT= <>
##$DTYPP= 0
##$F1P= 15.9154993809931
##$F2P= -4.1035820241983
##$FCOR= 0.5
##$FTSIZE= 0
##$FT_mod= 4
##$GAMMA= 1
##$GB= 0.15
##$INTBC= 1
##$INTSCL= 1
##$ISEN= 128
##$LB= 0.24
##$LEV0= 0
##$LPBIN= 0
##$MAXI= 10000
##$MC2= 0
##$MEAN= 0
##$ME_mod= 0
##$MI= 1.114404
##$NCOEF= 0
##$NC_proc= 0
##$NLEV= 6
##$NOISF1= 3.799351
##$NOISF2= 2.8
##$NSP= 1
##$NTH_PI= 0
##$NZP= 0
##$OFFSET= 15.70392
##$PC= 1
##$PHC0= -10759.75
##$PHC1= 10.00094
##$PH_mod= 1
##$PKNL= yes
##$PPARMOD= 0
##$PSCAL= 0
##$PSIGN= 0
##$REVERSE= no
##$SF= 200.130013532006
##$SI= 16384
##$SIGF1= 3
##$SIGF2= 2
##$SINO= 400
##$SIOLD= 16384
##$SREGLST= <1H.CDCl3>
##$SSB= 0
##$STSI= 0
##$STSR= 0
##$SW_p= 3612.71676300578
##$SYMM= 0
##$S_DEV= 0
##$TDeff= 0
##$TDoff= 0
##$TI= <>
##$TILT= no
##$TM1= 0
##$TM2= 0
##$TOPLEV= 0
##$USERP1= <user>
##$USERP2= <user>
##$USERP3= <user>
##$USERP4= <user>
##$USERP5= <user>
##$WDW= 1
##$XDIM= 8192
##$YMAX_p= 0
##$YMIN_p= 0
$$ End of Bruker specific parameters
$$ ---------------------------------
##NTUPLES= NMR FID
##VAR_NAME=  TIME,          FID/REAL,        FID/IMAG
##SYMBOL=    X,             R,               I
##VAR_TYPE=  INDEPENDENT,   DEPENDENT,       DEPENDENT
##VAR_FORM=  AFFN,          ASDF,            ASDF
##VAR_DIM=   8192,          8192,            8192
##UNITS=     SECONDS,       ARBITRARY UNITS, ARBITRARY UNITS
##FACTOR=    0.0002944,     1,               1
##FIRST=     0,             0,               0
##LAST=      2.4114304,     0,               0
##MIN=       0,             -159576,         0
##MAX=       2.4114304,     131869,          0
$$ Real data points
##PAGE= N=1
##DATA TABLE= (X++(R..R)), XYDATA
0@%%%%%%%%%%%%qJ6j6J6k4L2l2M0m8N6p2Q4r5J12j33J52j72J96k24K57k91L30
$$ 0 0 0 0 0 0 0 0 0 0 0 0 0 -8 8 -8 8 -16 16 -16 24 -24 32 -40 44 -51 61 -72 80 -92 104 -120 137 -154 176
34A76l74M20m71N28n90O56p29Q11q99R94j100J214j338J475j626J791j969K169
$$ 176 -198 222 -249 279 -311 345 -384 427 -472 522 -578 636 -702 773 -853 938 -1031 1138
52A138k394K640k917L234l591L999m476N041n720O554p604Q969j0830J3513j7714
$$ 1138 -1256 1384 -1533 1701 -1890 2109 -2367 2674 -3046 3508 -4096 4873 -5957 7556 -10158
67a0158K5216m2351J44211J4951k91445K72238r5819j21653K02152j14682n9651
$$ -10158 15058 -27293 116918 131869 -159576 112662 16843 -104810 97342 -17340 -76991
78g6991J45849q7740n566Q4610m9904n9234Q2192M747r5909R4324K5326j24501
$$ -76991 68858 -18882 -24448 60162 10258 -48976 33216 37963 -57946 36378 61704 -62797
90f2797R7776k5529r0480J34314n4530n9708J17663o0929J888O9246q8669p551
$$ -62797 34979 9450 -81030 53284 -1246 -60954 56709 -4220 -2332 66914 -21755 -29306
102b9306M0057k9954Q822K0458k1921j7342N3482m164n8472N3708q480m0673O3278
$$ -29306 10751 -19203 -10381 10077 -11844 -29186 24296 20132 -38340 15368 6888 -33785 29493
115B9493l7154k126N0977q8680J8749N1995o3748L8614K5332l9342K1186Q586
$$ 29493 -7661 -9787 41190 -47490 -28741 23254 -40494 -1880 23452 -15890 5296 13882
127A3882L216j5581k5714J1952m298K4111k270k8560M8309k5416k1506O0213n1784
$$ 13882 17098 1517 -24197 -12245 -16543 7568 5298 -23262 25047 -369 -21875 38338 -13446
140a3446o813N7116m7042Q720K4814l7277J3248J054k0632J4754K5442j464k5050
$$ -13446 -20259 36857 -10185 -1465 23349 -13928 -680 374 -20258 -5504 19938 18474 -6576
153f576K5325k944k9169M2919l9562l1280P2242l9174l746N5588o5800J5296L9217
$$ -6576 18749 15805 -13364 29555 -10007 -41287 30955 -8219 -11965 43623 -22177 -6881 32336
166C2336n0386K4426N934k3817K7101j1096j3084L068L403l51k1154L0794L443
$$ 32336 -18050 6376 12310 -11507 15594 4498 -8586 -5518 -2115 -2466 -23620 7174 10617
179A0617k0260M3538l6428k1083N0009m7714N958K9020n2590M3597J9199m6027
$$ 10617 -9643 33895 -2533 -23616 26393 -21321 -15363 13657 -38933 4664 23863 -22164
191b2164L1268p343j8206K6619j0459p397O961O700q739j2671K0722k0994j644
$$ -22164 9104 1761 -16445 10174 -285 -7682 -721 5979 -2760 -15431 5291 -15703 -17347
204a7347L7997l7662J5506L5374m6206K0662J971m0212L8475o303k1365K5597
$$ -17347 20650 -17012 -1506 33868 -12338 8324 10295 -29917 8558 2255 -19110 6487
216F487o064L487M966n295q98j1464K3671p626j9885L2571k2852n521K7518m1082
$$ 6487 423 3910 8876 3581 2683 -8781 14890 7264 -12621 19950 -2902 -8423 19095 -21987
230b1987J6390K4427l1975K8223J713k2406K3879j2302j4625K544n66Q962p280
$$ -21987 -5597 18830 -13145 15078 16791 -5615 18264 5962 -8663 -6119 -6685 2277 -5003
243e003J0211n70j1278K6157k1274j0042K8291l0911J6154J8121m3983K8169L012
$$ -5003 5208 4638 -6640 19517 -1757 -11799 16492 -14419 1735 19856 -24127 4042 7054
256G054k9773K9144j4170m242K7520j6421N311O32j0987P482j2937N232l287l531
$$ 7054 -22719 6425 -7745 -11987 15533 -888 4423 5055 -5932 1550 -11387 -6155 -9442 -12973
270a2973K7569k2568L154K3057l5266K1305O679l5258L5444o545j9761K9335k3304
$$ -12973 14596 -7972 -4818 18239 -17027 4278 10957 -24301 11143 4598 -15163 14172 -9132
283i132l216K0484j6417N423O616K636K512p383R228j7184j662J8758k7252J3896
$$ -9132 -12348 8136 -8281 -2858 3758 6394 8906 1523 10751 -6433 -8095 10663 -16589 -2693
297b693J5285k3347K6558n825k0693K4911j3636l439J1001j3064J1812n125l111
$$ -2693 12592 -10755 15803 9978 -10715 14196 560 -2879 8122 -4942 6870 1745 -1366
310a366P088j8486J7097J288j4294K6267j6369j180K0571l3224R871Q078k3745
$$ -1366 5722 -12764 4333 5621 -8673 17594 1225 45 20616 -12608 -2737 5341 -18404
323a8404K3447o001p276K0735j4660N387J115j3915J4202p043p85N891j1315J2824
$$ -18404 5043 -958 -8234 12501 -2159 3228 4343 -9572 4630 -2413 -3198 2693 -8622 4202
337D202r143o174J5955j7870J3091J0640k1134K0359o434j3662J8815k1042k80
$$ 4202 -4941 -11115 4840 -13030 61 10701 -10433 9926 3492 -10170 8645 -12397 -12677
350a2677J8385j5535Q349O891o522L737j637L085j0021K212J3120j7717J1001
$$ -12677 5708 -9827 -1478 5413 -1109 2628 991 4076 -5945 -3733 9387 -8330 2671
363B671L991k2640K6387r490j8602L5486j8441o127L0292k6071m26J4784j9433
$$ 2671 6662 -15978 10409 919 -17683 17803 -638 -6765 23527 -2544 -2970 11814 -7619
376g619M585L572l875N208K569K983r345Q356K813k0119J9712l720j8929K9373
$$ -7619 -3034 538 -3337 1871 4440 7423 -1922 6434 9247 -10872 8840 5120 -13809 15564
390A5564j4296j4306K6483k0202n59J8201j6971Q444P250r716K599k749l047l744
$$ 15564 1268 -13038 13445 -6757 -7316 10885 -6086 2358 9608 -108 2491 -258 -3305 -7049
404g049M344K104r960J7253j758j4967K1860j3882r504K2204j9629L529J4175
$$ -7049 -2705 -601 -10561 6692 4934 -10033 11827 -2055 -11559 10645 -8984 -5455 8720
417H720k0835J3953J839j6761J3694j460l024M873M22L999r184N546l70j5274
$$ 8720 -12115 1838 3677 -13084 610 -850 -3874 999 1421 5420 -3764 1782 1412 -13862
431a3862J7660p377q118K6139j8877N57K0943k6146R070R334k0595J4979O32q471
$$ -13862 3798 -3579 -11697 14442 -4435 -3878 17065 -9081 -11 9323 -11272 3707 4339 -4132
445d132R422n637l86j068L199M068j1068J5349k345j4110K0554j5256q415K0359
$$ -4132 5290 -347 -733 -1801 1398 5466 -5602 9747 7402 -6708 13846 -1410 -9825 10534
459A0534k1441R644J4697k2719J6668K410j6460J3223o651l229N675m887N128
$$ 10534 -10907 -1263 13434 -9285 7383 9793 -6667 6556 -95 -3324 2351 -2536 2592
472B592m310K214K284j1052J1655m701m433J7345j7039M065J2493k4051J3090
$$ 2592 -1718 496 2780 -8272 3383 -1318 -5751 11594 -5445 -1380 11113 -12938 152
485A52L610k0107J8153j709n910J3388r083n37K824m468L408l995L820l532P2
$$ 152 3762 -16345 1808 99 -5811 7577 -1506 -2043 781 -3687 -279 -4274 -454 -3986 -3914
500c914J2436j6968M273J3606k3514J4631J0148j9491J6263m791j0728J5105j1245
$$ -3914 8522 -8446 -4173 9433 -14081 550 10698 -8793 7470 2679 -8049 7056 -4189
513d189j470R165o890L408L014L650m942m217J1585j5290J550J8413k1280O943
$$ -4189 -5659 3506 -3384 24 3038 6688 1746 -2471 9114 -6176 -4626 13787 -7493 -550
527e50J0150j8442J6888m097j3488J9691j1217j651J5565j2437j556J988j756
$$ -550 9600 -8842 8046 3949 -9539 10152 -1065 -2716 12849 412 -1144 844 -912
540i12J093m587Q438m986k990J4504j2412K952M998j7352J6091l003j4128K3545
$$ -912 181 -4406 4032 -954 -3944 10560 -1852 1100 6098 -11254 4837 1834 -12294 11251
554A1251j2088j0173J8800j1429k36P695q695M575N56L99O25m400K229o985N771
$$ 11251 -837 -11010 7790 -3639 -3875 3820 -4875 -300 256 655 1280 -3120 -891 -7876 -2105
569b105N342j2625J5088k127j6421K3158p573j4434J7502j0714m72J2241j0949
$$ -2105 3237 -9388 5700 3573 -12848 10310 2737 -11697 5805 -4909 -5381 6860 -4089
582d089M965J236p559N921J632n94m354M045N278j2294J0729J526j8796J6269
$$ -4089 876 2112 -5447 474 2106 1512 -2842 1203 6481 -5813 4916 6442 -12354 3915
596C915o58j0533J7343r290k351J1452j3964M337O946j0646K804J898J270j399
$$ 3915 3257 -7276 10067 777 -1574 9878 -4086 251 7197 -3449 -645 1253 2523 1124
610A124n02N826j1620L848R395j3110R815Q33j3490J4389o130o057J1652j2603
$$ 1124 622 6448 -5172 -1324 8071 -5039 4776 5609 -7881 6508 378 -5679 5973 -6630
624f630K462J1318q957L126L55l214J264k860M343l685j302O661p798N611K362
$$ -6630 -4168 7150 -1807 1319 1674 -1540 -276 -3136 1207 -2478 -3780 2881 -4917 694 3056
639C056j0834J1051n062o331J6070j0432k167J0370j1320K784M505n935L007m34
$$ 3056 -7778 3273 -1789 -8120 7950 -2482 -4649 5721 -5599 -2815 1690 -4245 -1238 -1672
653a672J204J188M33J945q408N877K226j0652J3082l517r469J5809r076l466J2365
$$ -1672 -468 720 1153 3098 -5310 567 2793 -7859 5223 1706 -7763 8046 -1030 -4496 7869
668G869j1231K148O362o470M226l19k291jp90L858n639L611M073r934J0005m50
$$ 7869 -3362 -1214 5148 -1322 2904 2585 294 293 -497 3361 -2278 1333 5406 -4528 5477 5027
684E027j1273J3302p386n472J3685j0486J734P170j0245N374Q44n059M434k118
$$ 5027 -6246 7056 -330 -5802 7883 -2603 -869 6301 -3944 1430 2274 -2785 1649 -469
698d69J099q55m8L454p779M980R75r161J2993n595o447J4379j1716O29R844j3939
$$ -469 630 -225 -273 3181 -4598 382 1357 -7804 5189 -406 -6853 7526 -4190 -3561 6283 -7656
714g656P041K898r319R483l039k773M772m063K867k715J428L375p844Q490j911
$$ -7656 -615 2283 -7036 2447 -592 -3365 1407 -2656 211 -2504 -1076 2299 -5545 2945 1034
729A034p867J3147r328k061J2429j3055N297P123j2552Q194O24p194O319k127
$$ 1034 -6833 6314 -3014 -5075 7354 -5701 -404 6719 -5833 2361 2985 -4209 2110 -17
743a7J1R67p5K173n385N280j58p729J1463o520l961J3035j2071J547R204j2584
$$ -17 -6 961 886 3059 -2326 2954 2796 -4933 6530 10 -3951 9084 -2987 -1440 7764 -4820
759d820O357K888q170P019k269j669K946k574J985k871J506J866n976P456l146
$$ -4820 1537 4425 -3745 3274 1005 -664 2282 -292 1693 -1178 328 2194 -3782 3674 528
774E28n385J0400q548J27Q323j1665O095L904j0267R056j744o336P715l422j804
$$ 528 -4857 5543 -3005 -2878 5445 -6220 -125 3779 -6488 2568 824 -5512 2203 -1219 -3023
789c023L313j267q8j150L425l080j906P343p196J287P365j1175O403M089j1865
$$ -3023 290 -977 -1065 -2215 1210 -1870 -3776 3567 -3629 -2342 5023 -6152 251 4340 -7525
804g525J0035r9q905R811k889l180N423k755k53N46O88p88j350M803n352P08P586
$$ -7525 2510 2411 -6494 3317 428 -2752 2671 -84 -337 209 897 109 -1241 3562 -1790 -1082 6504
821F504j0622M511O497j2896R171K157j0526R737k730m998Q084n573l57M290m033
$$ 6504 -4118 393 6890 -6006 3165 5322 -5204 4533 1803 -3195 4889 -684 -1041 3249 -784
836g84R80J487K92k299n0M353o268K157N094r355N037J847p092Q274l849l859
$$ -784 196 1683 1975 -324 -374 3979 -2289 -132 4962 -4393 644 2491 -4601 3673 -176 -4035
852d035Q338o661R03M448n580J542L44p8L57k032L510l353J44N232p086M899O51
$$ -4035 4303 -2358 -1455 2993 -2587 -1045 -701 -779 -422 -2454 1056 -2297 -2153 3079 -4007 892 1543
869A543p913J0011m370n208J0984q485j120Q916o871J961K144l794K929j043O86
$$ 1543 -6370 3641 -729 -5937 5047 -3438 -4558 4358 -2513 -552 1592 -2202 727 -316 370
884C70l52j438K784l801L430K242p301O981j317n572R451m306l409N972m959J176
$$ 370 18 -1420 1364 -2437 993 3235 -4066 2915 1598 -3974 5477 1171 -2238 3734 -1225 -49
900d9K573l709K689j354N59J484j700K855m267J065L226o252N257l11o514Q360
$$ -49 2524 -1185 1504 150 709 2193 493 3348 -919 146 3372 -2880 2377 2066 -4448 3912
916C912m182j679P036p842K538L174o398O329j848m529M807l518J802P12k633
$$ 3912 -270 -1949 5087 -2755 -217 2957 -3441 2888 1040 -3489 1318 -2200 -398 314 -2319
931b319L766l746K177K842o157M915k633l518P634n449N8M604o545L964K103m811
$$ -2319 1447 -2299 -122 2720 -3437 1478 -1155 -4673 2961 -2488 -2430 2174 -4371 -407 1696 -3115
947c115M141j588p99K022j459J334k540J081J125l804O087j444m337Q119n536
$$ -3115 1026 -562 -1361 661 -798 536 -2004 -923 202 -3602 2485 1041 -3296 4823 -713
962g13o21O083q008L638J811o065O339j078k268K441k413L166j727j51L704o530
$$ -713 -1334 4749 -3259 379 2190 -3875 2464 1386 -882 1559 -854 2312 585 434 4138 -2392
978b392L811K767p740O352k548l822Q508o067R86N385p834M125J183m230K917
$$ -2392 1419 4186 -3554 2798 250 -3572 4936 -1131 -145 5240 -2594 1531 2714 -1516 1401
993A401k961J283J644l693M227k397q69L317m267K790O48l090M567m743m10N230
$$ 1401 -1560 -277 1367 -2326 1901 -496 -1365 1952 -2315 475 1123 -1967 2600 -2143 -2553 2677
1009B677o643K511K137l900M474j303o07K721m794J772J373k627J613j564J833
$$ 2677 -3966 -1455 682 -3218 1256 -47 -654 2067 -2727 -955 418 -2209 -596 -2160 -327
1024c27M19k345M600l301j771N465l294j09K444l170K249j435j576L895k707N3
$$ -327 92 -2253 2347 -954 -2725 2740 -554 -663 1781 -1389 860 -575 -2151 1744 -963 -910
1040i10K571n47O27j357J411k87l202L000q92j524L323k389P05J183k348L473
$$ -910 1661 1114 1741 384 1795 1508 -1694 1306 414 -1110 2213 -176 529 1712 -636 2837
1056B837k443j165M003k976L94L94j943K064k862R92L145m590L412J182l253L333
$$ 2837 394 -771 3232 256 650 1044 -899 1165 -1697 -705 2440 -2150 1262 2444 -809 2524
1072B524l532J01J903m298L890m6m121N967k540j875L377l443K536K29l168M035
$$ 2524 -1008 -907 996 -3302 588 542 -3579 2388 -152 -2027 1350 -2093 443 672 -2496 1539
1088A539k444j014J498k214K527k164R07M252n396L536J615o498N270j908l550
$$ 1539 -905 -1919 -421 -2635 -108 -2272 -1365 2887 -2509 1027 2642 -3856 1414 -494 -4044
1103d044N433l411J093L166m406K824N72j520J045j427K807j937j465M821n895
$$ -4044 1389 -2022 -929 2237 -2169 655 1227 -293 752 -675 2132 195 -1270 3551 -2344
1118b344J256M007o311N117J090m860O377k978k120M008m923P95K406k369J759
$$ -2344 -1088 2919 -3392 1725 2815 -2045 4332 1354 -766 3242 -1681 -886 1520 -849 910
1133I10o10J056L10k408K909k208n16K871l748K482K10m092M377k257j909M778
$$ 910 300 1356 1666 -742 2167 -41 -557 2314 -1434 1048 1258 -2834 1543 -714 -2623 2155
1149B155l386J324K395l255J544r10j241L93j340J900j093J210J762l974L287
$$ 2155 -1231 93 2488 -767 777 -133 -1374 -981 -2321 -421 -1514 -304 1458 -2516 771
1164G71J54m470N668k761k369N838n042J74L742n372K655J597k827L793m24r00
$$ 771 925 -3545 2123 -638 -3007 2831 -2211 -2037 1705 -3667 -1012 585 -2242 1551 1127 227
1180B27Q02j427N37k241J552J028l077M734p66l101N796m353j190N120n297J819
$$ 227 1029 -398 139 -2102 -550 478 -2599 2135 1369 -1732 4064 -289 -1479 3641 -1656 163
1196A63K517m097K627k33k386J888j90L74J45R09N98k187J777j307k957M055l189
$$ 163 2680 -1417 1210 977 -1409 479 289 663 808 1717 2315 128 1905 598 -2359 1696 -1493
1213a493K7M514m525K533J718m985L767q02l091M374k591l77K061k636Q22j65
$$ -1493 -1466 3048 -1477 1056 2774 -2211 1556 754 -2337 2037 -554 -931 1130 -1506 -684 -849
1229h49k20Q65n75K198j348o37K528m483R31J957m767M149Q79l004M381j596j821
$$ -849 -1069 -204 -779 1419 71 -566 1962 -2521 -1590 367 -4400 -251 628 -2376 2005 409 -1412
1246a412K519k047L15O47o38M18q27J227q66j357K861k308R82L326l464J653J127
$$ -1412 1107 -940 -625 22 -616 -198 -1025 202 -664 -2021 840 -1468 -486 2840 -624 1029 2156
1263B156l525K047j569p69K523j479J317Q81j183J552j889P12P74k979K900n12
$$ 2156 -1369 678 -891 -1660 863 -616 701 1582 399 1951 62 774 1548 -1431 1469 957
1279I57j844K743k340j7J404k067K523J26j317K117j917k59K88k017J206p06J19
$$ 957 -887 1856 -484 -501 903 -1164 1359 1485 168 2285 368 109 397 -1620 -414 -1120 -1001
1296a001K165j719J213O75k320J853j437k10J363k428J795L4j958K264j614l12
$$ -1001 1164 -555 658 1333 -987 866 -571 -781 582 -1846 -51 -17 -1975 289 -1325 -1637
1312a637J659r82J983l14j683K004k550j5J167k161K269q44O82L023l665J225
$$ -1637 22 -960 1023 709 -974 1030 -1520 -1535 -368 -2529 -260 -1104 -422 2601 -1064 161
1328A61J286l356K247k6j438K186k101J277L49j812K179j041L50J366j264K253
$$ 161 1447 -1909 338 312 -1126 1060 -1041 236 585 -1227 952 -89 261 1627 363 2616
1344B616j645k241K934l135L38K482k681K036J234j293J698k267M63N39k444K606
$$ 2616 971 -1270 1664 -1471 -1133 1349 -1332 704 1938 645 2343 76 539 1078 -1366 1240
1360A240q36p94J622k668K193p9k461L842j738r16L285k903J98j99k396K725j519
$$ 1240 404 -390 1232 -1436 757 678 -1783 2059 321 -595 2690 -213 -15 -214 -2610 115 -1404
1377a404Q4K662k395J020R90j663J340k251K18J971k443K141k61j851K187j893
$$ -1404 -1320 1342 -1053 -33 957 -706 634 -1617 -1399 572 -1871 270 9 -1842 345 -1548
1393a548J001J883k823K478J8k041K477k012j412J126j095J880M67j26J222j703
$$ -1548 -547 1336 -1487 991 1009 -1032 1445 -567 -1979 -853 -1948 -68 399 273 1495 -208
1409b08J214j24j811J758j882M60K198k379J298O07k463K049k3m09J874j301J72
$$ -208 1006 882 -929 829 -1053 -593 1605 -774 524 1131 -1332 717 694 285 2159 858 1030
1426A030n17l64O17k082O75L29l73L137j452p32J759k850Q62J135k380J528n34
$$ 1030 513 149 766 -1316 -641 -312 -685 2452 1000 268 2027 -823 39 1174 -1206 322 -212
1443b12o31J856j111K64j001l55K350j251P49P23k775J802j284j494K961k698
$$ -212 -843 1013 -98 166 -835 -1190 1160 -91 658 1381 -1394 408 -876 -2370 591 -2107
1459b107Q25K350j985K398p70k454K419j975k85K070j863J318j40j125K075j627
$$ -2107 -1282 1068 -917 1481 711 -1743 676 -1299 -1584 486 -1377 -59 -199 -1324 751 -876
1475h76O24K48q39K577j598p1J513m109J603J679k755K482N9p86K670j706l69
$$ -876 -252 -4 -843 1734 136 65 1578 -2531 -928 751 -2004 478 537 -249 2421 715 346
1492C46J037k576N30J175O5o37o93K400j694n83K304k339J077J484k608K329m82
$$ 346 1383 -1193 -663 512 577 -60 -753 1647 -47 -630 1674 -665 412 1896 -712 1617 1135
1509A135k625K084j795k14K400j056O72L92n75M16p72M5j106m58J575m85J57Q17
$$ 1135 -1490 594 -1201 -1415 985 -71 601 993 418 834 62 107 -999 -1457 118 -367 -210 607
1527F07j817J203k16r93K268j672j67K192j818k59m2n87K35n13J027J439q50K67
$$ 607 -1210 -7 -223 -1216 1052 -620 -787 1405 -413 -672 -714 -1301 -1066 -1579 -552 887 37 304
1545C04M7J12o78j527J692k14j614L047j136o33J610k005P59R52j335K027l57
$$ 304 351 463 -215 -1742 -50 -264 -1878 1169 33 -600 1010 -995 -236 716 -619 1408 1051
1562A051j302R73q99K3o89N48J150j148J515Q52k463J724p03j517K240k124M4
$$ 1051 -251 722 -177 -154 -843 -295 855 -293 1222 2074 -389 1335 632 -885 1355 -769 -725
1579g25J976j662J541n19j142J468j056M18L75k92R53j563l37J158k265J062O17
$$ -725 1251 -411 1130 611 -531 937 -119 299 674 382 1335 -228 -565 593 -1672 -610 7
1596Go23J614r71L86Q75k544P78j06q91J572q80L37R31j502J073p6j637J939o73
$$ 7 -616 998 27 413 1288 -1256 -478 -584 -1475 97 -783 -446 485 -1017 56 -20 -1657 282 -391
1615c91L39L41j344J312j156q93J820j354J353Q88j377J896j114r95J339j684
$$ -391 -52 289 -1055 257 -899 -1792 28 -1326 27 915 -462 1434 320 -675 664 -1020
1631a020K67R44r84J661n06m00R23j308P55o2p66K037j087j28O95j716Q91k17
$$ -1020 -753 191 -793 868 362 -38 885 -423 332 270 -496 1541 454 326 1021 -695 196 -21
1649b1r26J957l68J98Q43j220K78j85j274Q88q57O33Q14r23Q54l09q83J139j213
$$ -21 -947 1010 642 840 1683 463 741 556 -718 170 -687 -54 760 -163 691 382 -501 638 -575
1668e75O93K04p54J321j319J1M89j465J001K31p95J755m26l23O04j520K63j0l05
$$ -575 118 322 -432 889 -430 -419 70 -1395 -394 -163 -958 797 371 48 652 -868 -605 -615 -920
1687i20L92j94R14qp33J175j264k26J276j224R46Q07j772J060n70q60J146m63
$$ -920 -528 -722 192 184 -549 626 -638 -864 412 -812 134 941 -831 229 -341 -1201 -55 -518
1705e18M31P90n01J073q57l56J90j010P33J54l53J160o58L85M07j319P44j72m47
$$ -518 -87 703 202 1275 418 62 252 -758 -25 129 -224 936 278 663 1070 -249 495 323 -124
1724a24J343r28J24M29j251M21k44m19J417n77N82N29q08k01o99J37J60q79J311
$$ -124 1219 291 415 844 -407 14 -230 -649 768 191 773 1302 494 293 -406 -269 -109 -988 323
1743C23m5o48J162j030k59Q44j123N74K84j072J426n95p23P41r57O59j4N1J167
$$ 323 278 -370 792 -238 -497 347 -776 -202 82 -990 436 -159 -882 -141 -1098 -439 -453 -402 765
1762G65r68K97K68j594J046o90j51J137o12N03P31j068M61l20k37P46r26J043
$$ 765 -203 94 362 -1232 -186 -876 -1027 110 -502 1 732 -336 125 -195 -432 314 -612 431
1780D31j36q89J351j097k76J327j108P36M39o74J309q77n98M96r48M63m0K31J041
$$ 431 295 -594 757 -340 -616 711 -397 339 778 104 1413 536 -62 434 -514 -51 -91 140 1181
1799A181j274J192r0j742J441m08o13J060p31K85L53j296J051n23l14P94n03N03
$$ 1181 -93 1099 1009 -733 708 300 -313 747 16 301 654 -642 409 -114 -428 366 -137 366
1817C66J29m93O84j516n2Q92j220J170J13k75O75p60o9M77j527J486Lj068J221
$$ 366 495 2 686 -830 -882 10 -1210 -40 73 -202 473 -287 -356 121 -1406 80 83 -985 236
1836B36p05j25L27p80R71j10o47J298m20P1j08p50R60j008o2J302r97Q27P38j493
$$ 236 -469 -594 -267 -1047 -76 -186 -833 465 45 116 8 -742 218 -790 -852 450 -547 280 1018 -475
1856d75R29l90m17J059j090O22N41r91O67l17k68K86n07Q59L75p69J336j161j67
$$ -475 454 64 -353 706 -384 238 779 -212 455 138 -130 156 -351 508 883 114 1450 289 122
1875A22L60r43O01k24j40R25m71L15K58j156O10k13l55Q97p61P79l45q42N39j88
$$ 122 482 -461 140 -84 -224 701 230 545 803 -353 257 44 -311 586 -175 604 259 -583 -44 -232
1895b32l85N57RM96k58o42N88q07J85L91p20P00l9j58R53j104k54N55q30O47Q5
$$ -232 -617 -60 -51 445 187 -455 133 -674 -489 -98 -818 -118 -157 -315 638 -466 -720 -165 -995 -348 -263
1916b63k16O67o27K52J93o53P57o77R7J131p66J88N64j083J86n2o1R16m77L38
$$ -263 -479 188 -439 -187 6 -647 110 -567 -470 661 -105 83 647 -436 -250 -302 -363 553 76 414
1936D14Q5l38M05o40J0M10p03P15M26p07M23l25k38M01k57K80l45N03L09r29N44
$$ 414 499 161 566 -74 -64 346 -357 358 784 77 500 175 -63 338 81 361 16 519 828 -101 443
1957D43k05o33N28n04K94O05l66Q0M8n87K79k55K23j18j03N74o04P6M69j053L89
$$ 443 238 -395 133 -371 -77 528 162 242 290 -297 -18 -273 -50 -168 -271 303 -301 -225 244 -809 -420
1978d20M93m31O41n58k02N80o51O2L29n02P24j72J77P7o18L05n2m78J237q12n5
$$ -420 73 -358 283 -275 -477 103 -548 -486 -157 -659 65 -107 70 147 -471 -166 -218 -696 541 -271 -326
1999c26O97o17N14k03n34R85j039M42R46q08O63m65o07Q37p03K43M56l12N42N
$$ -326 371 -246 268 65 -469 516 -523 -81 865 57 720 255 -352 485 -218 25 481 169 711 716
2019G16n77L81o70M13K51j021J556r34n61J349r36k09P89j012P15L43p38M85o3
$$ 716 139 520 -150 263 514 -507 1049 115 -446 903 -33 -242 547 -465 250 593 -145 340 277
2038B77m15J53l83O7l2L79J68n51P85k74q40N76k10l94Q10j74P5J35p04J48J48
$$ 277 -138 15 -368 -301 -333 46 214 -337 448 174 -666 -90 -300 -694 116 -58 17 152 -552 -404 -256
2059b56j17J7Q8N03m06J43%m10jJ87j12N07j86J91L58q63K85Q9m90L08L89m37
$$ -256 -373 -356 -268 235 -171 -28 -28 -438 -439 -252 -364 143 -43 148 506 -357 -72 17 -473 -165 224 -213
2081b13P51m50J9j47K12j52k49O15k55K27K44p25J75N60j109P34M53r97Q20J51
$$ -213 538 88 107 -40 172 20 -229 386 131 358 602 -123 52 612 -497 237 690 -307 513 664
2101F64n71M33m31l26L20k6l60L98J74R9o53P06p55j61J139j060N20L95r15K20
$$ 664 93 526 95 -231 89 63 -297 101 275 374 -279 427 -328 -489 650 -410 110 505 -410 -190
2121a90K75p29O70j07l18L20Q3m42L26j15L1k40L25j29j90O95o07j78P13o31L0
$$ -190 85 -644 26 -81 -399 -79 4 -438 -112 -227 -196 -436 -111 -240 -430 265 -342 -520 193 -438 -408
2142d08Q40o45K41l7l18M88j9l65R1J90oK34k4q5mJ00k60p0L45m92Q42j88q81
$$ -408 432 -213 28 -9 -327 161 142 -223 -132 58 52 286 262 177 173 273 13 -57 288 -204 638 450 -431
2165d31Q91Lr07R31l10m33R06l07l51M74r9n89N37n7k68M7L47p17N31M62j321
$$ -431 460 463 -444 487 177 -256 650 343 -8 466 367 -222 315 258 -10 37 384 -333 198 660 -661
2186f61P90K10j081R94O0p57P36o05r1M80j78o8j0L50l99R2L88p65K37L53o09
$$ -661 129 339 -742 252 312 -445 291 -314 -405 75 -103 -171 -181 169 -230 -138 250 -515 -278 75 -534
2207e34K86K22n54P26k09o69R02o26N8M54j73J53R6j42o4j64K85l29K15N20o45
$$ -534 -248 -26 -580 146 -63 -732 170 -456 -398 56 -117 36 132 -10 -74 -238 47 -282 -67 453 -192
2228a92L63j6m57M22j93j65Q71n38j7L94n52QN02l86K88K6j20J89k26L55q13L91
$$ -192 171 155 -302 120 -73 -238 633 95 78 472 -80 -72 430 44 332 358 238 427 201 556 -257 134
2250A34Q6m77O21mp42J081m45m44P88q57j42O20o17L91J32k25J06k23K03k28K89
$$ 134 220 -257 364 360 -382 699 254 -190 598 -259 -401 219 -398 -7 125 -100 6 -217 -14 -242 47
2271D7j42j85J77K03p82P25l58l42O42r2j60L00l48L85M3p42P51k94o9L62j77
$$ 47 -95 -280 -103 100 -682 43 -315 -657 -15 -107 -267 33 -315 70 113 -629 122 -172 -241 121 -56
2292e6p8j70K20L51m88N00r9l05M82m25R4J97n76M42K77o36M05J11k95K61j27
$$ -56 -134 -304 -84 267 -221 279 180 -125 357 -68 26 223 -353 89 366 -270 135 246 -49 212 85
2313H5p8K92k5j23j78K45K5j4L22m17j7M08n96J92M69p35J15M35o09L74j77j12
$$ 85 7 299 274 151 -27 218 243 229 551 134 117 525 -71 121 590 -145 -30 405 -204 170 -7 -119
2335a19Q2p3K10o4N3k09j39L66l91m5M43m40m5O06m22J31j64r7M57k95r2p6J54
$$ -119 -37 -110 100 36 89 -120 -259 107 -284 -329 114 -326 -371 235 -187 -56 -220 -317 140 -155 -247 -323 -169
2358a69j12j05N11m98l9P16m68J17K20k79O2J17l29PL56m18M88l36R4m3K60l6
$$ -169 -281 -386 125 -373 -412 304 -164 -47 173 -106 -44 73 -256 -249 107 -311 177 -159 -65 -108 152 116
2380A16J02r8K82m63L60j03k44M76m06J32L41m23K13L12p70Q52m43o82P87m7o11
$$ 116 218 120 402 -61 299 196 -48 428 22 154 495 72 285 597 -173 679 236 -446 341 294 -317
2401c17N51j07R9M4k57J36j45K27n17K03J79m43L54M89r63M21J55m41M00K47o23
$$ -317 234 127 226 270 13 149 4 231 -286 -83 96 -347 7 496 -467 -46 109 -332 68 315 -308
2422c08L85l52p5L62k22n2J3K84k63k8J74M1J7Rl38J48j97P1L61j69j6J00or8
$$ -308 77 -275 -350 12 -210 -262 -249 35 -228 -256 -82 -41 -24 -15 -353 -205 -402 -331 30 -139 -155 -55 -61 -159
2446a59L00p7K4K02q8k74K63k42K01M0l85J28O81n75l71J026n23k3J07m07J61
$$ -159 141 64 88 290 202 -72 191 -51 150 190 -195 -67 614 39 -332 694 171 148 255 -152 9
2467IJ92l68K08K67l02M70j44j37l46M11M7o15M66j92n55R04k42m03O56n66K84
$$ 9 201 -167 41 308 6 476 332 195 -151 260 307 -308 158 -34 -589 315 73 -330 326 -240 44
2488D4N84q65J13j89J51k48K57nRJ0K54o1o4K17o69P11l99j93N08n74n9O56o03
$$ 44 628 -237 -124 -313 -162 -410 -153 -158 -149 -139 115 54 -10 207 -462 249 -150 -343 165 -409 -468 188 -415
2511d15N5N56m01L97k03j34K74l01j21K25rK73j01j62K07l9L18l42j4M73l78r
$$ -415 -360 196 -205 192 -11 -145 129 -172 -293 -68 -77 196 95 -67 140 101 419 77 63 536 158 149
2533A49K24n78K92J78n10N24J86m59M14R2m76J63o2l07J36K91k54RN34o13O4M22
$$ 149 373 -205 87 265 -245 279 465 6 420 512 36 199 137 -170 -34 257 3 12 546 -67 -3 419
2555D19l93J34M3m91M34Jn50K09L81k70k73N57m18J29Q7l32j3K90m42o3N22l24
$$ 419 26 160 203 -288 146 147 -403 -194 187 -83 -356 201 -217 -88 -1 -333 -346 -56 -498 -561 -39 -363
2577c63J53K44m33L57K79o38M62o6k26K72k53j43K27j62K20J6Q6l4O8J4j33K38
$$ -363 -210 34 -399 -42 237 -401 61 -5 -231 41 -212 -355 -128 -290 -70 -54 32 -2 66 80 -53 185
2599A85j70k32L91j49o6L95k39K65J9j12l71O03j44l96K08J36o10N60k20q6K83
$$ 185 15 -217 174 25 -41 354 115 380 399 287 -84 519 375 -21 187 323 -287 273 53 -33 250
2620B50n9m02O64j17m98L97n4l78K56j51k11M79j74L6K61j05o02N07m3j44j23
$$ 250 191 -211 453 336 -162 235 181 -197 59 -92 -303 176 2 38 299 194 -408 99 56 -88 -211
2641b11K49n31N12l5l80K88k8o4L83k74r7L01k22j00J61k90K48M6k04J52R7K10
$$ -211 38 -493 19 -16 -396 -108 -136 -200 183 -91 -188 113 -109 -209 -48 -338 -90 -44 -248 -96 1 211
2663B11n81L49J00k54K49k25J00J15k99L75j39k47O15o8n6J18j17k39j65K48k08
$$ 211 -370 -21 79 -175 74 -151 -51 64 -235 140 1 -246 369 301 245 363 246 7 -158 90 -118
2684a18k5L48O0j96K57m4l21M28n93J68L86l91r1K52j71L6J72k78j18L25J55n48
$$ -118 -143 205 265 69 326 282 -39 389 -204 -36 350 -41 -132 120 -51 -15 157 -121 -239 86 241 -307
2706c07M63k01k62L73k57k31N28k20j3K15M0k66J32j13l28M48j18q3P0J06l16
$$ -307 156 -45 -307 66 -191 -422 106 -114 -127 88 128 -138 -6 -119 -447 1 -117 -200 -130 -24 -340
2727c40J16K73o5r5L64k93N6r8m3jj06l13L79k07M01O9j69K20q4k24j58J99J51
$$ -340 -224 49 -16 -111 253 -40 16 -82 -125 -126 -232 -545 -166 -373 28 97 -72 148 64 -160 -318 -119 32
2750C2L67m14O9rJ57l08L13O0p5r4M41l64Q8J23p25Q5K99J11L2K60m91MJ34l07
$$ 32 399 -15 54 45 202 -106 207 267 192 98 539 175 263 386 -339 -254 45 156 188 448 -43 -39 95 -212
2774b12L64K1j95k28N12j57m81M66k64J04J18O3r3M02n33k41K51l01J63K51m16
$$ -212 152 173 -22 -250 262 105 -376 90 -174 -70 48 111 18 420 -113 -354 -103 -404 -241 10 -406
2795d06L39k6K75l69J90k17pj11K50PQ0j24K34j17p9k9K05k34Q7J79j0JM1j86
$$ -406 -67 -93 182 -187 3 -214 -221 -332 -82 -75 5 -119 115 -2 -81 -110 95 -139 -52 127 117 118 159 -27
2819b7j05K17k49K23n0P5R8J2K1j01J37m08M61N0j62k18L35k46K79n6m67O24j9
$$ -27 -132 85 -164 59 9 84 182 194 215 114 251 -157 304 354 192 -26 309 63 342 286 -181 443 424
2842D24j80k5J16n72L36j3m83N99Q4m22L29Qk14PP5k74K26kl20L56o3j34j29K7
$$ 424 244 219 335 -237 99 86 -397 202 286 -136 193 201 -13 -6 69 -205 21 19 -301 55 -8 -142 -271 -244
2866b44N3q2M28j3m93M81l46j00O9k76K87J35P7J03n0j03K33n14J73j3K06j89
$$ -244 -191 -273 155 142 -351 130 -216 -316 -247 -523 -236 -101 -24 79 29 -74 159 -355 -182 -195 11 -178
2888a78L48j85j71K74k1k35J70K15k23J37j23P2n4k39P0N29k92J3J77pQ7j31O
$$ -178 170 -15 -186 88 67 -168 2 217 -6 131 8 80 26 -213 -143 386 94 107 284 277 364 233 239
2911B39l80J94Lp1L23nl38k1R7j85M42l40J14J65l45M9ON0j8k94J80M2K83Mk95
$$ 239 -141 53 56 -15 308 303 -35 -56 41 -144 298 -42 72 237 -108 -59 -53 -3 -21 -315 -135 -93 190 194 -101
2936a01O7k66o2O1j13K39J19j09l28M04k7o3J32R2j09l4k9J22Oj84k56K23MK12
$$ -101 -34 -300 -362 -301 -414 -175 -56 -165 -493 -89 -116 -179 -47 45 -64 -98 -127 -5 1 -183 -439 -216 -212 0
2960@J1k00K82k42R9j80K08M5J21l1j20R4K82k97j4J72q6j00L02l23K90k28j75
$$ 0 11 -189 93 -149 -50 -230 -22 23 144 113 -7 87 369 72 58 230 144 44 346 23 313 85 -90
2983i0J20J88j78K31O5j73k3l4K6j24M3k67K71j11k6J16L05j60j58k4Lj63M18
$$ -90 30 218 40 271 336 163 140 106 132 8 51 -216 55 -56 -82 34 339 179 21 -3 0 -163 255
3006B55m44j1Q5j48J28k0k14K89K9j4J7J32l78l3o2pj3J82L39m14L09j42p9K33
$$ 255 -189 -200 -115 -263 -135 -155 -369 -80 -51 -65 -48 84 -294 -327 -389 -396 -409 -227 112 -302 7 -135 -214 19
3030A9k38J74Q6K0k97K08k57lK85j77K77J14r6J07j88L6J15k46j22K81j5M6K5
$$ 19 -219 -45 41 61 -236 -28 -285 -288 -3 -180 97 211 115 222 34 70 185 -61 -183 98 83 129 154
3053A54j46L6m5L4J63MJ09j63J17o8k38J27m4k44K13J95j37N6P2l27J39J46j97
$$ 154 8 44 -1 33 196 200 309 146 263 195 -43 84 40 -204 9 204 67 123 195 -132 7 153 -44
3076d4J2L09r5r0r0j4lk7k14K29O3r6Q0J20O3n34L04k14k93O06j6k80L27n19J56
$$ -44 -32 277 182 92 2 -12 -15 -42 -256 -27 36 -60 20 140 203 -331 -27 -241 -534 72 56 -224 103 -416 -260
3101b60L10m37K36Q2j71K45j53K98l64J58j89K55J07o2j1J4O1P6k85L8P8J25k0
$$ -260 50 -387 -151 -69 -240 5 -148 150 -214 -56 -245 10 117 55 44 58 119 195 -90 -52 26 151 131
3124A31k7r0J63J73K4k85j00J56k18J69K4P4J78l25N1J34J06k10L02k28j12j51
$$ 131 104 14 177 350 374 89 -11 145 -73 96 120 194 372 47 98 232 338 128 430 202 90 -61
3146f1M5J30j1J31n5r0N2J12j65j93P2j03J99j33r2K73j98l0j35m0L15L4k81K4
$$ -61 -16 114 103 234 179 89 141 253 88 -105 -33 -136 63 -70 -162 111 -87 -117 -252 -292 23 57 -224 -200
3170b00O3q5MO6j62J93j9k38K65J13K2j1N2pm46K71l0P2k4K02qk92N9K83n18L42
$$ -200 -137 -222 -218 -152 -314 -121 -140 -378 -113 0 22 11 63 56 -390 -119 -149 -77 -101 101 93 -199 -140 143 -375 -33
3196c3M04l29j6Q9k70L46p2j76J35J42n7J34P6l64NJ41k28lK33J51k05J30k10
$$ -33 371 42 26 115 -155 191 119 -57 78 220 163 297 373 9 14 155 -73 -76 157 308 103 233 23
3219B3L1l8j43J84J19j76j12K88j61k90K14J49n43K69K80k14J66o9k21K12k88
$$ 23 54 16 -127 57 176 0 -112 176 15 -275 -61 88 -455 -186 94 -120 46 -23 -244 -32 -320
3240c20K68r8J45q4m6j5l1J00j7j79J27R6j38L98k80m0K31j47nj38l0M24k70J04
$$ -320 -52 -150 -5 -89 -135 -150 -181 -81 -98 -277 -150 -54 -192 206 -74 -114 117 -30 -35 -173 -203 221 -49 55
3264E5j41K05m38L02J3j00K22J08j38j21J99l54K0J33J53J41j05P1j43J5l38L47
$$ 55 -86 119 -319 -17 -4 -104 118 226 88 -33 166 -188 -168 -35 118 259 154 225 82 97 -241 106
3286A06k7rL42j76p5K15l43j01k8Q6J94R0Q4k41kl0k59Q1Q2j66L6N5M9j68N1q5
$$ 106 79 70 412 236 161 376 33 -68 -96 -10 184 274 358 117 115 85 -174 -93 -11 -177 -141 -86 -37 -205 -154 -239
3312b39N6J21j56Q1K67j30Q3j85RQ6j92Q0j06j89K13J67J92l24J26K3j7J34j0
$$ -239 -183 -62 -218 -137 130 0 83 -102 -93 -7 -199 -119 -225 -414 -201 -34 158 -166 -40 -17 -34 100 90
3335I0q3K10q3j50P7m0J28l2j89K4qJ4NK20jr3k47J39M36N3j44m40l3L01j59J96
$$ 90 7 217 134 -16 61 21 149 117 -72 -48 -56 -42 -37 183 182 89 -158 -19 417 470 326 -114 -147 154 -5 191
3361A91N3k28L38l63P1J68l33K5K39n6j0K68k27p5%l99L65j47J55oO1k2j04j21
$$ 191 244 16 354 -9 62 230 -103 -78 161 105 95 363 136 61 61 -338 27 -120 35 29 90 68 -36 -157
3385a57j9l0J26J04L0j36M6k27J21J00j01q8J62j23K77q3k49J76j79J59q6l8M88
$$ -157 -176 -206 -80 24 54 -82 -36 -263 -142 -42 -143 -231 -69 -192 85 2 -247 -71 -250 -91 -177 -215 273
3408B73l91Q8J07l32M15k06j22K00O9q0K36j99Q2P9j89l1J81MP2k2k55K72j28
$$ 273 -118 -30 77 -255 160 -46 -168 32 101 21 257 58 140 219 30 -1 180 184 256 234 -21 251 123
3431A23j71N6j28M56k12j01L48m22J87j04JJ0K38j50j06j82K41j37k32J66M42
$$ 123 -48 8 -120 336 124 23 371 -51 136 32 33 43 281 131 25 -157 84 -53 -285 -119 323
3452C23l21l9J34k07K7j6j20J73k7q3J50N5l29R4k1k8M0K18k27q2L79j18k33J83
$$ 323 2 -37 97 -110 -83 -99 -219 -46 -73 -156 -6 49 -280 -186 -207 -235 -195 23 -204 -286 93 -25 -258 -75
3476g5j53P7P2MlNJ28L9j22k19J83pJ72L1l44K92L7L3m5j27n8J4N6J23r6P8J52
$$ -75 -228 -151 -79 -75 -78 -73 55 94 -28 -247 -64 -71 101 132 -212 80 117 150 105 -22 -80 -66 -10 113 17 95 247
3503B47p8j82O4J20r0j17J38Q5k09P3j53K04k9j30R3K13j97q1m7O9j33L3M7J25
$$ 247 169 -13 51 171 81 -36 102 187 -22 51 -102 102 73 -57 36 249 52 -29 -76 -7 -140 -107 -60 65
3527F5Q4j29k4k60q3K30o1P2J10l1P3j51l19L06J13k90J15J46j68R7J60m37J49
$$ 65 149 20 -4 -264 -347 -117 -178 -106 4 -27 46 -105 -424 -118 -5 -295 -180 -34 -202 -105 55 -382 -233
3550b33K50j54J66j91R8k37K98M5jn6j92K25J1J39k52L68r7j79J49k18L2R2k31
$$ -233 17 -137 29 -162 -64 -301 -3 42 41 -15 -207 18 29 168 -84 284 187 8 157 -61 -29 63 -168
3573a68K10J14j1m3mP2P2j22j13K19k82L14ok88j1K22P7k54j17O0K25k34M0o4
$$ -168 42 156 145 102 98 170 242 120 7 226 -56 258 252 -36 -47 175 252 -2 -119 -59 166 -68 -28 -92
3597i2n6J67K8j7L2Kj7k12j79N50M4l36O6k7n2J29q7o2RP2J00m04R2K8P2P9K92
$$ -92 -148 19 47 30 62 64 47 -165 -344 206 250 -86 -20 -47 -99 30 -57 -119 -110 -38 62 -342 -250 -222 -150 -71 221
3624B21j22q2k37J47J93l01l1J53O3J19l01L09k07j24l0J49K0N8jj6J4K6J95j83
$$ 221 99 17 -220 -73 120 -181 -212 -59 4 123 -178 131 -76 -200 -230 -81 -61 -3 -4 -20 -6 20 215 32
3648C2JQ5K1k15L16j31o0J46j79K4K78j0j32j31J17k0k95L05l21J5K02q1J31j18
$$ 32 33 118 139 -76 240 109 49 195 16 40 318 308 176 45 162 142 -153 152 -169 -154 48 -33 98 -20
3672b0oJ03j32k9O5n7L12k02q0r7J98m05L15j23J30l8l5M5p6L7j98L89l35MM63
$$ -20 -26 77 -55 -84 -19 -76 236 34 -46 -143 55 -350 -35 -158 -28 -66 -101 -56 -132 -95 -293 96 -239 -235 228
3697B28l02q3R7J43k9k38j9J58R5n8N6k19Q3J31Mm1o3o1L17p4j68J54j2k39J8
$$ 228 -74 -157 -60 83 54 -184 -203 -45 50 -8 48 -171 -88 43 47 6 -57 -118 199 125 -43 111 99 -140 -122
3722a22N3M17k11k42K59j5q6j23P7K18j96N1o0r8K02p6j37K46j74l9K08j09K3
$$ -122 -69 348 137 -105 154 139 53 -70 7 225 29 80 20 -78 124 48 -89 157 -17 -56 152 43 66
3745F6q8j67O0J9J93q5J8q8r5J64j70J70k07K93M2o01M87P3j17j32K08j54J4j7
$$ 66 -22 -189 -129 -110 83 -2 16 -72 -167 -3 -173 -3 -210 83 125 -476 11 84 -33 -165 43 -111 -97 -114
3769a14Q1k85K14L7j04J65j34j29K25N6n4k25J84J67lj73K20j04p1J16j5J01k5
$$ -114 -33 -318 -104 -67 -171 -6 -140 -269 -44 12 -42 -267 -83 84 81 -92 128 24 -47 69 54 155 130
3792A30J36k03L9Q7k94K42j23J12k63R4K01r6M2K9n5K7n2Oo7O9J01L0l68J38J82
$$ 130 266 63 102 189 -105 137 14 126 -137 -43 158 62 104 133 78 105 53 59 -8 61 162 192 -176 -38 144
3817A44j29p6K0R8M6j74J6N6j92K98k40L08k25J05j90K18J4p6M1k9J70l75j80
$$ 144 15 -61 -41 57 103 -71 -55 1 -191 107 -133 175 -50 55 -135 83 97 21 62 33 203 -172 -352
3840c52K60j60J40rK37o9k21j91L55lJ57l96J06N4p0K05k04L2L9J11P4k0P3j75
$$ -352 -92 -252 -112 -121 116 47 -174 -365 -10 -13 144 -252 -146 -92 -162 43 -161 -129 -90 21 95 75 148 -27
3864b7N6N4j90L93k56K8L9J31l26J16J09J7k7J22l70K41N4j87K23m54L57J9k29
$$ -27 29 83 -107 286 30 58 97 228 -98 18 127 144 117 239 -131 110 164 -23 200 -254 103 122 -107
3887a07K92l43K37N0p2j80J11k9j6J63j11k24L9K64N7r0j65J37K63k33l87K92
$$ -107 185 -158 79 129 57 -123 -12 -41 -57 106 -5 -229 -190 74 131 41 -124 13 276 43 -344 -52
3909e2rP5k7j41J96J21j61k32K52k55n6Q5J75j91L33k86k0j9K46k12j59M67j57
$$ -52 -61 14 -13 -154 42 163 2 -230 22 -233 -289 -204 -29 -220 113 -173 -193 -212 34 -178 -337 130 -27
3932b7M7L6m4J28L1nk11R1p1P3L7M5p3L16l14Q2r3m7M1j20K88m9K9K3j7O2k22
$$ -27 20 56 12 140 171 166 -45 46 -25 48 85 130 57 373 59 141 48 1 42 -78 210 161 190 213 196 258 36
3959C6K08k3j14j43J45k16J67k02K18j95L0J54r8M3M6q8J61j20l39L45j8j10J19
$$ 36 244 221 107 -36 109 -107 60 -142 76 -119 -89 65 -33 10 56 -32 129 9 -330 15 -3 -113 6
3982Fm8n3J75j72J09r5r8O7k9q6J65J79l69L29k75j69L70L1K0l8J00l59O0R5r8
$$ 6 -42 -95 80 -92 17 -78 -176 -109 -138 -224 -59 120 -249 80 -195 -364 6 37 57 19 119 -240 -180 -85 -183
4007a83K07j2P4L8N0k95K71j70J65k69M85k77Ko2P2J20j69j30M43k57q2p3J89
$$ -183 24 12 86 124 174 -121 150 -20 145 -124 361 84 86 24 96 216 47 -83 360 103 21 -52 137
4030A37P3j4l8m15K95m6J39j20qM7k2j38J1Q4k02R6O4j06P4L8N6M6j13j5J38k50
$$ 137 210 196 158 -257 38 -8 131 11 3 50 28 -110 -99 -15 -217 -121 -57 -163 -89 -51 5 51 -62 -77 61 -189
4056a89JJ96j77j42L20j21k1K63N8l25J02QK1j32M6l2M4p5j51L40l1m9L1O1k04
$$ -189 -188 8 -169 -311 9 -112 -133 130 188 -137 -35 -27 -6 -138 -92 -124 -80 -155 -306 34 3 -46 -15 46 -158
4081a58J51J99k75p5L03l45M90k04k46J98Kn2J04K%K72k71L53l67J55L5j88q6
$$ -158 -7 192 -83 -158 145 -200 290 86 -160 38 40 -12 92 94 94 366 95 448 81 236 271 83 -3
4104cm2J88k7R9k33j21N00l18j11L7j0lj6J41p4j43J09J45M1j33j42K02k00j6
$$ -3 -45 143 116 215 -18 -139 361 43 -68 -31 -41 -44 -60 81 7 -136 -27 118 159 26 -116 86 -114 -130
4128a30j7K25L3M7l81K70k49J97K1k07J74k77K19j25K10j61mJ15j09p6J31R0m1
$$ -130 -147 78 111 158 -223 47 -202 -5 16 -191 -17 -294 -75 -200 10 -151 -155 -40 -149 -225 -94 -4 -45
4151d5O3J17o6lj68J53K0q2N0n7J11K9p4r2j41J37K4K7Q4j6j86L06P0k65K79q9
$$ -45 18 135 69 66 -102 51 71 -11 39 -18 93 122 48 -44 -185 -48 -24 3 87 71 -115 191 261 -4 275 186
4177A86j02o2O0J20k56L03k12K2K65k22j91Q1J74j48kp4mK5j59K36J1Oj52P2J23
$$ 186 84 22 82 202 -54 249 37 59 324 102 -89 -8 166 18 16 -58 -62 -37 -196 40 51 57 -95 -23 100
4202A00k60K08q5j77J48r4R6m44J44J14J06Q1l9p1J88J66n3k66kJ56j99K09j07
$$ 100 -160 48 -37 -214 -66 -160 -64 -508 -364 -250 -144 -63 -102 -173 15 181 128 -138 -140 16 -183 26 -81
4225h1N0k15N0K28j0k97L50j95J35p6J49k27J63J70j0k34k05M47l86J97O7j46
$$ -81 -31 -246 -196 32 22 -275 75 -120 15 -61 88 -139 24 194 184 -50 -255 192 -194 3 70 -76
4247g6P3k2J14Rj11MK3N8M4j33J22l01K63J57k26K5n5R5K6k37L6O5J39j35k2J29
$$ -76 -3 -25 89 98 -13 -9 14 72 116 -17 105 -196 67 224 -2 23 -32 63 89 -148 -112 -47 92 -43 -65 64
4273F4J3j75L04l49j03J15o6J39j78J91j06J05q8J30Q5k46J00J86%l03K02k52
$$ 64 77 -98 206 -143 -246 -131 -197 -58 -236 -45 -151 -46 -134 -4 81 -165 -65 121 121 -182 20 -232
4295b32K30j50P6r6K03L9n7Rl1J3o4j85j28L26P8J79k89O9K56l31J64k61K89K60
$$ -232 -2 -152 -76 -172 31 70 13 22 -9 4 -60 -245 -373 -47 31 210 -79 -10 246 -85 79 -182 107 367
4319C67l29r2R8j19K02j77K03j03j74M03k40n3J80o8q3J60m6K6mj09j7o4q0L06
$$ 367 38 -54 44 -75 127 -50 153 50 -124 279 39 -14 166 98 15 175 129 155 151 42 25 -39 -119 187
4343A87mk20J37J63l51O7R2j28K23l15J77j55J45k70J25R6R8J49l98q2J46Q7j38
$$ 187 183 -37 100 263 -88 -21 71 -57 166 -149 28 -127 18 -252 -127 -31 67 216 -182 -264 -118 -31 -169
4366a69L8J75j70nJ81m5j15J22j95J30k12J77J80p0R7J85l85MJ12P3N2j75J62
$$ -169 -131 44 -126 -131 50 5 -110 12 -183 -53 -265 -88 92 22 119 304 -81 -77 35 108 160 -15 147
4389A47j48P6K49k50j84L7L64l18j27L4M9L7P3P8L6j19J97m46K81l9j41N50l63
$$ 147 -1 75 324 74 -110 -73 291 -27 -154 -120 -71 -34 39 117 153 34 231 -215 66 27 -114 436 73
4412G3m6R7k36J10J1J61j26j86J54j84l1J01L30k83J22j16o6J26j63q7n1L53k5
$$ 73 27 124 -112 -2 9 170 44 -142 12 -172 -203 -102 228 -55 67 -49 -115 11 -152 -239 -290 63 38
4435C8k14J30K25p3q0k28M8J53j13J41j26K06k48j7L80j48j56k8P8j46J78j20
$$ 38 -176 -46 179 106 26 -202 -154 -1 -114 27 -99 107 -141 -158 222 74 -82 -110 -32 -178 0 -120
4457a20J96m4n9K64k55N8M0j14J63j64M1J48l19J43N4N0j05o6PL26k31p8Q0j76
$$ -120 76 32 -27 237 -18 40 80 -34 129 -35 6 154 -165 -22 32 82 -23 -89 -82 244 13 -65 15 -161
4481a61J30L10l31q1K69j21M9j32m5L08l14J04j40M01k22j24k4Q7j4Jl7K65j42
$$ -161 -31 279 -52 -133 136 15 64 -68 -113 195 -119 -15 -155 246 24 -100 -124 -37 -51 -50 -87 178 36
4504C6j80L9M5p3K3K36j77J64j21J70k37p3K23Kl27N6R3j04L93m82L17K1p8J34
$$ 36 -144 -105 -60 -133 -110 126 -51 113 -8 162 -75 -148 75 77 -250 -194 -101 -205 188 -294 23 44 -34 100
4528A00k89J20N3Nj80J65J28o0J16k74K94j71M9j70Q4J63j61M5k5p4K19n5J04
$$ 100 -189 -69 -16 -11 -191 -26 102 42 158 -116 178 7 56 -114 -30 133 -28 17 -8 -82 137 82 186
4551A86j01j9J12k6J05k12j05K31j49m2L43m10Q8J14j95J28j24m2K61j14r2Q1
$$ 186 85 66 178 152 257 45 -60 171 22 -20 323 -87 1 115 -80 48 -76 -118 143 29 -63 18
4573A8j9j0J19j85q3j0M7k4K44k81L23j31J11j49j09K99k11K3j4j29K03r9R4P1
$$ 18 -1 -11 108 -77 -160 -170 -123 -147 97 -184 139 8 119 -30 -139 160 -51 -28 -42 -171 32 -67 27 98
4597I8j85Q9J18k13j7K13j67J82Rk20N1K70j27j13o3L36j93j41N7m9J08K04k50
$$ 98 -87 2 120 -93 -110 103 -64 118 127 -93 -42 228 101 -12 -75 261 68 -73 -16 -65 43 247 -3
4620cj10L70j46mj43M1K08l57J95j64K36J43k64J75k32M1J93k49K03l40K91r7
$$ -3 -113 257 111 107 -36 5 213 -144 51 -113 123 266 2 177 -55 -14 179 -70 133 -207 84 -13
4642a3r2J03j35J78l07K03j25P4k71L52J77l71M68k87P6k78N4RJ74R1r2j10p5
$$ -13 -105 -2 -137 41 -266 -63 -188 -114 -385 -33 144 -227 241 -46 30 -248 -194 -185 -11 80 -12 -122 -197
4665a97J98kj71j0K60k30L67l04j53J93RJ32q0p0N0O8l3q9J87l4r1N7J00j53J09
$$ -197 1 -1 -172 -182 78 -152 215 -89 -242 -49 -40 92 12 -58 -8 60 27 -62 125 91 0 57 157 4 113
4690A13K25j66j6M5l63K58L4j27P8j74J88kJ43k88J94q2j93K20J51k68M2P4m72
$$ 113 338 172 156 201 -162 96 130 3 81 -93 95 93 236 -52 142 60 -133 87 238 -30 12 86 -386
4713c86M17l8J37j59J33p4J1j87Lr5J83P3j53K53j53j67R5J85k86l2M10l18J89
$$ -386 31 -7 130 -29 104 30 41 -146 -143 -238 -55 18 -135 118 -35 -202 -107 78 -208 -240 170 -148 41
4736D1q2j13J41J5J08l40J31L51l54L36m8l47J12j46K33J64j98M0j15J33j27n4
$$ 41 -41 -154 -13 2 110 -230 -99 252 -102 234 186 -161 -49 -195 38 202 4 44 -71 62 -65 -119
4758a19J58k1J7R6J98k68J5n6j28K62k90J87o2N5l3nR0k66J95k13J92L79l04k1
$$ -119 39 18 35 131 329 61 76 20 -108 154 -136 51 -11 44 11 6 96 -170 25 -188 4 383 79 58
4782E8J46k18jl8K71k80j36K76k15J22n3j8K2J95P5k28j41K51j97J88j90N4J55
$$ 58 204 -14 -15 -53 218 -62 -198 78 -137 -15 -68 -86 -64 131 206 -22 -163 88 -109 79 -111 -57 98
4805I8j14M6J37j18k12m1J94Qk77K37r4J22J80k23J0j69L94k04P2J36m8j73J02
$$ 98 -16 30 167 49 -163 -204 -10 -2 -279 -42 -136 -14 166 -57 -47 -216 178 -26 46 182 134 -39 63
4828F3l22L39r2PJ20j12Nn6OK55J11k03Q3k27R9L52n58qN33m86J83j81L26j72
$$ 63 -259 80 -12 -5 115 3 8 -48 -42 213 324 121 204 -23 76 428 -130 -138 395 -91 92 -89 237 65
4852F5PQJ93j73j62J48p3J22j82J03j62r7Q6J98j80L4j0o1J60q2Q5r8J65l15J15
$$ 65 72 80 273 100 -62 86 13 135 -47 56 -106 -203 -117 81 -99 -65 -75 -136 24 -58 27 -71 94 -221 -106
4877a06K8pM6J8K49j62k17K37k23k2qP9K45k87M2M6P4k47J76O5r4j02N2L66p4
$$ -106 -78 -85 -39 -21 228 66 -151 86 -137 -159 -167 -88 157 -130 -88 -42 32 -215 -39 26 -68 -170 -118 248 174
4902A74k67J87lO1k10K35j87n4p2K36p1J22m7J7j35J5j17J13K04ql30L52k04J89
$$ 174 -93 94 91 152 -58 177 -10 -64 -136 100 29 151 104 121 -14 1 -116 -3 201 193 -137 215 11 200
4926B00j37m5N7j59K51L7j87k44K41%J15r4r0o9L3q3J19lOj24J94m0n3R3k06K84
$$ 200 63 18 75 -84 167 204 17 -227 14 14 129 35 -55 -124 -91 -174 -55 -58 -52 -176 18 -22 -75 18 -188 96
4952I6j53M3k59J18Q2l4J17r0K79m57K05j58K46p7j7rj98J62J17j94P9O7K7q5
$$ 96 -57 -14 -273 -155 -73 -107 10 -80 199 -258 -53 -211 35 -42 -59 -68 -266 -104 13 -181 -102 -35 -8 -93
4976i3j3L75l08K4J40r2j64J82j52M34k12N7m9l3j6J79P1k56j81J42j59P3N6N5
$$ -93 -106 269 -39 -15 125 33 -131 51 -101 333 121 178 129 96 80 259 330 74 -107 35 -124 -51 5 60
5000F0p6J25L5O6l9l27J61%j63J73J38j70l2m5K10j14J39l19M24m07M5K23J45
$$ 60 -16 109 144 210 171 -156 5 5 -158 15 153 -17 -49 -94 116 2 141 -178 246 -161 -116 107 252
5023B52l14j59K57qk14J21K02l03O6J8L8K2J1J43j29j45R6K03k32P1j61J34o3
$$ 252 -62 -221 36 28 -186 -65 137 -166 -100 -82 -44 -22 -11 132 3 -142 -46 157 -75 -4 -165 -31 -94
5046i4PJ47J99m36L75n6k81K04o2Q0j60K32j29j3J95k1l65O8j07P7J18k0l6L48
$$ -94 -87 60 259 -177 198 142 -139 65 3 83 -77 155 26 13 208 187 -178 -110 -217 -140 -22 -42 -78 270
5070B70l44K13m8j46r9J53j66J71J09k27O4K15p6j04k1oJ02J0j71J96j45J50n7
$$ 270 -74 139 91 -55 -154 -1 -167 4 113 -114 -50 165 89 -15 -36 -42 60 70 -101 95 -50 100 43
5093D3k8j55J6R5j21K13j90K92k59J50m59N14k93J41K2N6k66R2J73N7j34k07L20
$$ 43 15 -140 -124 -29 -150 63 -127 165 -94 56 -403 111 -182 -41 -19 37 -229 -137 36 93 -41 -248 72
5116G2q1k00K27J12o2Op8k86K29K19k44R5m3J83k12O4J57Jk01Q5J47k49J45j26
$$ 72 -9 -209 18 130 68 74 -4 -290 -61 158 -86 9 -34 149 -63 1 158 159 -42 43 190 -59 86 -40
5140d0K80n4k85K57k6l4m9j3m6n6J15m3m9P8J3j57J01k8m1K2l3j17J44j42K70
$$ -40 240 186 -99 158 132 98 49 36 -10 -66 49 6 -43 35 48 -109 -8 -36 -77 -55 -88 -205 -61 -203 67
5165F7j23l4k2M4N9j70K57%o9r8q7lJ17J41j12k58J20O4QO5J19k7J03j10q7k8
$$ 67 -56 -90 -112 -68 -9 -179 78 78 9 -89 -176 -179 -62 79 -33 -291 -171 -107 -99 -34 85 58 161 51 -36 -64
5191f4n8P7o7J85k96K1M42k30j35L12j3j03j13K25k30J47On2N3J15m03N3L57j03
$$ -64 -122 -45 -112 73 -223 -202 240 10 -125 187 174 71 -42 183 -47 100 106 54 107 222 -181 -128 229 126
5215A26l11K75k61K90K09l90J3j57J42J60k34J17K48k37j59K9LJ86R6j94J7j4
$$ 126 -185 90 -171 119 328 -62 -49 -206 -64 96 -138 -21 227 -10 -169 -140 -137 49 145 -49 -32 -46
5237d6M5q1q8L87l83NK49o7R3k54J33j81J44L3r2O5J15k50J38k37J19M5K7o2J15
$$ -46 -1 -82 -170 217 -166 -161 88 21 114 -140 -7 -188 -44 -11 -103 -38 77 -173 -35 -272 -153 -108 -81 -143 -28
5262b8p8j12J29J12k8n4N4l8j3j32J20j4J21j77J55J1Q0j86K52k14L0l0K31K4
$$ -28 -106 -218 -89 23 -5 -59 -5 -43 -56 -188 -68 -82 39 -138 17 28 108 -78 174 -40 -10 -40 191 215
5286B15j65O1j24m6N3j15K36k1k03K32r9l6J6l9M1k23K16l1nJ03J3j08q7K55l37
$$ 215 50 111 -13 -59 -6 -121 115 94 -109 123 24 -12 4 -35 6 -217 -1 -32 -37 66 79 -29 -116 139 -198
5311a98L72k21K7k14K50j32J99l6J3q6p0L02j56M5l62K89j1k99K28O4l7j82J86
$$ -198 174 -47 -20 -234 16 -116 83 47 60 -26 -96 206 50 95 -267 22 11 -288 -60 4 -33 -215 -29
5334b9J3J28p0O1j24k24K95k5k72K00o9k8K9K38k57L7J22j09K7P1K3n9j2Q9l4
$$ -29 -16 112 42 103 -21 -245 50 25 -247 -47 -116 -144 -115 123 -134 -97 25 -84 -57 14 37 -22 -34 55 21
5359B1L9j25M17r7j14L8l48J73M9J41k28K24k00K76J89m36j71M36j80k29L73m75
$$ 21 60 -65 352 255 141 179 -169 4 53 194 -34 190 -10 266 455 19 -152 284 104 -125 248 -227
5381b27K05n7J29j88p7L27r9j03r3N6Nj74M16j38MqJ5j78J63j68L3J62j50oJ69
$$ -227 -22 -79 50 -138 -215 112 13 -90 -183 -127 -122 -296 120 -18 -14 -22 -7 -185 -22 -190 -157 5 -145 -151 18
5406A8qJ09Oo1n7r0R2r2Q4j62K4K35o5l42K91nJ7P0k87L04j72NL63l26K04O6l75
$$ 18 10 119 125 64 7 -83 9 -83 1 -161 -137 98 33 -309 -18 -23 -6 64 -223 81 -91 -86 277 -49 155 221 -154
5433a54R7J02K1N6J9j05m8j1j7K80j59j52kJ96j52J88k54j5K35o4n0J27j07j34
$$ -154 -57 45 66 122 141 36 -12 -23 -40 240 81 -71 -73 123 -29 159 -95 -110 125 61 11 138 31 -103
5457a03J70j07J12n8K37n22K10L0j20J49j19J13M5j46J13K39m20n5L30k00J37
$$ -103 67 -40 72 14 251 -271 -61 -31 -151 -2 -121 -8 37 -109 4 243 -177 -232 98 -102 35
5478C5M1j11r0q3J35%j4K08k20Q9K06j34J47k52r7K69k5j18l6l6P9J82l6j25j3
$$ 35 76 -35 -125 -208 -73 -73 -87 121 -99 -10 196 62 209 -43 -140 129 104 -14 -50 -86 -7 175 139 14 1
5503AR1j28P6n5O1K09k33l4K4J36j05J0L8j89J15j5o2Q4J71l52K2R0P3Q6R3k46
$$ 1 92 -36 40 -15 46 255 22 -12 12 148 43 53 91 -98 17 2 -60 24 195 -157 -135 -45 28 114 207 -39
5529c9K89k14M9k17J24R3J9n8k01K01l1Q2p2j06lJ89J34j31k87pK16j35mJ03J7
$$ -39 250 36 85 -132 -8 85 104 46 -155 46 15 97 25 -81 -84 105 239 108 -179 -186 30 -105 -109 -6 11
5554A1j52J77n5j78rJ13J27r9m4Q0K21j39q5N2j24o4J46l1MQ0p4n6L17LJ2j40
$$ 11 -141 36 -19 -197 -206 -93 34 -65 -109 -29 192 53 -32 20 -104 -168 -22 -53 -49 31 -43 -99 218 221 233 93
5580I3J8K06n49K23k1J24M4k10O4P3j3k08J11K20k79j0J06L0l4Q7J82l38N7m3
$$ 93 111 317 -232 -9 -30 94 138 -72 -8 65 52 -156 -45 175 -104 -114 -8 22 -12 75 257 -81 -24 -67
5604f7L05l71rR3M9Q6M3j68J29j18l3Q2j30n7P5j12J8J45J27j35J49j54n6J53
$$ -67 238 -133 -142 -49 0 86 129 -39 90 -28 -61 21 -109 -166 -91 -203 -185 -40 87 -48 101 -53 -109 44
5628D4k65L18j67R1N2j20J19j59jJ49K65k08nl43K52K65m27L06j6j29R9l02J64
$$ 44 -221 97 -70 21 73 -47 72 -87 -88 61 326 118 113 -230 22 287 -140 166 150 21 120 -182 -18
5651a8j48J93j53J14K66k96J93j40n8k7R4Q5jl1l4J4J51r1m6j69K07k35K38M9
$$ -18 -166 27 -126 -12 254 -42 151 11 -47 -74 20 105 104 73 39 53 204 113 67 -102 105 -130 108 157
5675A57l77J03M8l8R7L3R7n3K4q4M7j66Q9K46m45K26K0N2j62Q2Q8O8j13P2M3l66
$$ 157 -220 -117 -69 -107 -10 23 120 67 91 7 54 -112 -23 223 -222 4 24 76 -86 -4 84 152 39 111 154 -212
5701b12K24MK50n13L77k40J30R0o4p7K33j27j2jn6j55J71K5%Lq3N6j56J40R9j91
$$ -212 12 16 266 -247 130 -110 20 110 46 -31 202 75 63 62 6 -149 22 47 47 50 -33 23 -133 7 106 -85
5727h5N5K3J67O5j30O6m0J23k56R3j61K43j50l58N69k24k65L38J59j87N3j1k11
$$ -85 -30 -7 160 225 95 161 121 244 -12 81 -80 163 13 -345 224 0 -265 73 232 45 98 87 -124
5750a24M7Q3J5r5j8K1q3n7J80M1j63K24j46Q8j29J86k07O8L4N2k58O0K49l2k42
$$ -124 -77 6 21 -74 -92 -71 -154 -211 -31 10 -153 71 -75 13 -116 70 -137 -69 -35 17 -241 -181 68 36 -206
5775b06J67M2m1j49Q7MQ2J17k46J52j05j70K65pl8l2q1L68l96L60k28rJ93n1N2
$$ -206 -39 3 -38 -187 -100 -96 -14 103 -143 9 -96 -266 -1 -8 -46 -78 -159 209 -187 173 -55 -64 129 78 130
5800A30j54J14j89M0J61k0l5r2J03q4L20k89P6j03pj20Q0J85l8n2Qm3K54j09j8
$$ 130 -24 90 -99 -59 102 82 47 -45 58 -26 294 5 81 -22 -29 -149 -69 116 78 26 34 -9 245 136 118
5825A18J30m29J73J03J4J29l82K70k14J01K4L3lk92k1J33J86N3Kl72L23k71o9
$$ 118 248 -181 -8 95 109 238 -144 126 -88 13 37 70 67 -225 -246 -113 73 126 128 -244 79 -192 -261
5848b61J95P3j50J64J15k58p2K11o9j40Q6J75n9J13k21K31j00P3j73J81k0j16
$$ -261 -66 7 -143 21 136 -122 -194 17 -52 -192 -106 69 10 123 -98 133 33 106 -67 114 94 -22
5870b2J18j3j20K29j98%P0J15J19l76m0K01J6j32J57kL4j05k3o6l8l2K07L4j55
$$ -22 96 83 -37 192 -6 -6 64 179 298 -78 -118 83 99 -33 124 122 156 51 28 -38 -76 -108 99 133 -22
5895b2k26L73N5l31J98k65K12q6P2J96l24K8J91n1K8P5l6k24n4J22L6j66J47N6
$$ -22 -248 125 180 -151 47 -218 -6 -92 -20 176 -148 -120 71 20 48 123 87 -137 -191 -69 -33 -199 -52 4
5919Dj76J66o0J59q8K1j28r3K46k35Q6PJ4K0J72l03K28l2j06L22l03K04K4l95
$$ 4 -172 -6 -66 93 5 26 -102 -195 51 -184 -98 -91 -77 -57 115 -188 40 8 -98 224 -79 125 149 -246
5943b46K33M7N6L16l02J9J07k39J73k5k11M55l85k1k33J78K59R3k19O4k13ok8
$$ -246 -13 34 90 406 104 123 230 -9 164 139 -72 383 -2 -23 -256 -78 181 274 55 119 -94 -100 -128
5966a28K7K28m8p7K0J9q7J8Q0j07k00K57j6m0K4J4j89M21l87J17P0j18L47k56
$$ -128 -101 127 79 2 22 41 -46 -28 52 -55 -255 2 -14 -54 -30 -16 -205 216 -171 -54 16 -102 245 -11
5990a1K44m75J12K62k94L24n3k93J64O8p0j77L12j07Kk9k48M25k51j36J88N6q1
$$ -11 233 -242 -130 132 -162 162 109 -184 -20 48 -22 -199 113 6 8 -21 -269 156 -95 -231 -43 13 -68
6013f8J32p9pj19K28j17K15k06K32l94K42J64j40j56R4Q5j57J60j39J2J37l8K1
$$ -68 64 -15 -22 -141 87 -30 185 -21 211 -183 59 223 83 -73 21 106 -51 109 -30 -18 119 81 102
6036A02n3j32K88j9o4l6l2J29k46L8Q4P5m32M36l24J13O2k1j0J32P9l44K97j97
$$ 102 49 -83 205 186 122 86 54 183 -63 -25 59 134 -298 138 -186 -73 -11 -32 -42 90 169 -175 122 -75
6060g5J06l9N8j47J19K16k83p7j06J18J10l1j0JN4j80L23n9p4mLM3k81J07K74
$$ -75 31 -8 50 -97 22 238 -45 -122 -228 -110 0 -31 -41 -40 14 -166 157 98 24 20 23 66 -215 -108 166
6085A66j64J01O2m10M55k16J26J05k02L5L4j87j9J35j64K57k42lK30j44j5M5l2
$$ 166 2 103 165 -245 210 -6 120 225 23 58 92 -95 -114 21 -143 114 -128 -131 99 -45 -60 -15 -47
6108d7K49n4k84K86k07j6K93m04K14J5L09k62R1k62Q4o0k45J85K20rr3j81J40
$$ -47 202 148 -136 150 -57 -73 220 -184 30 45 354 92 183 -79 5 -55 -300 -115 105 96 3 -178 -38
6131c8j37J43J13j53KJ06k30J95j20LK16m16J14L00k94J00j86M14l79K56j53K02
$$ -38 -175 -32 81 -72 -70 36 -194 1 -119 -116 100 -316 -202 98 -196 -96 -282 132 -247 9 -144 58
6153E8j61J7Q3j83K42J90k51P6j25J2J77k13M2J68RM6Pr0j8N1k20J32P9l5p2J24
$$ 58 -103 -86 -3 -186 56 246 -5 71 -54 -42 135 -78 -36 132 141 187 194 104 86 137 -83 49 128 93 21 145
6179A45nq5J1j46Q8j7j07K73Jj14l13L37%j73K15N8j30j11q9L52m32K68J03k01
$$ 145 140 55 66 -80 8 -9 -116 157 158 44 -269 68 68 -105 110 168 38 -73 -162 190 -242 26 129 -72
6203g2n0n4O1J8j8N9jP9P6j17n3Q9j85L47r1j55k3J04K60k45J32j35Q8r1j56N8
$$ -72 -122 -176 -115 -97 -115 -56 -57 22 98 -19 -72 17 -168 179 88 -67 -90 14 274 29 161 26 114 23 -133 -75
6229g5M8J3J86j63J46j54j17K62p7l7m5p3J26Q4QJ16j48l02K32J52q9j74J36o0
$$ -75 -27 -14 172 9 155 1 -116 146 69 32 -13 -86 40 124 132 248 100 -202 30 182 93 -81 55 -5
6253eJ0J83l9l5j25K61k64J07M7l14J66J6k04K77jJ24j85J48j0k57K34l2ol9o8
$$ -5 5 188 149 114 -11 250 -14 93 140 -174 -8 8 -196 81 80 204 19 167 157 -100 134 102 96 57 -11
6278a1n8n8O1Oj88N5q4J07J04M7R9j88lJ26j0O1q3k2%j75K30jr2q9o0K49j41Q0
$$ -11 -69 -127 -66 -60 -248 -193 -277 -170 -66 -19 80 -108 -111 15 5 66 -17 -39 -39 -214 16 15 -77 -166 -226 23 -118 -38
6306c8o0J05J52l1n3m6R2j8O8j87j3K54k65R6j15K61l37K30K1l07L79l5j42l6
$$ -38 -98 7 159 128 75 29 121 103 171 -16 -29 225 -40 56 -59 202 -135 95 116 -191 188 153 11 -25
6330b5R7j23n3Q7j63M10l00J02p5J11J22k49K05k25J58J71l71J24LL8k57L41j72
$$ -25 72 -51 -104 -17 -180 230 -70 32 -43 68 190 -59 146 -79 79 250 -121 3 6 44 -213 128 -44
6353d4n2K3R1J64m20M30k98K17j0k57J54l04M26k56J49j01k9m1L15j83n2J60q8
$$ -44 -96 -73 18 182 -238 192 -106 111 101 -156 -2 -306 120 -136 13 -88 -117 -158 157 -26 -78 82 -6
6376fk67L23k42J68n7j56J25O1m7p1N0Q0Q1j77L3K96j84K81l27J71j44o1J28Q2
$$ -6 -273 50 -192 -24 -81 -237 -112 -51 -98 -169 -119 -39 42 -135 -102 194 10 291 -36 135 -9 -70 58 140
6400A40p5q5L16m55K29J15j57J21k22p1R3O0j20K27J19k15m9n1O8L31l07q3K11
$$ 140 65 -20 296 -159 70 185 28 149 -73 -144 -51 9 -111 116 235 20 -29 -80 -12 319 12 -71 140
6423A40k08L5O8j20K64j85J59k08mJ31k6P4j98J45j99P2N8k8J24j66QK11j86j87
$$ 140 -68 -33 35 -85 179 -6 153 -55 -59 72 46 120 -78 67 -132 -60 -2 -30 94 -72 -64 147 -39 -226
6447b26o5M03M5k40J8L77m66J85n2j87K38K68l18J07q3j5P1m3P8j99K06l25L20
$$ -226 -291 112 157 -83 -65 312 -154 31 -21 -208 30 298 -20 87 4 -11 60 17 95 -104 102 -223 97
6470I7j68N0o1L32m03N1r9L26o0R8p6j29K13K7M0Kl33o6J01J65j98r9J36J27j2
$$ 97 -71 -21 -82 250 -153 -102 -201 125 65 163 87 -42 171 198 238 240 -93 -159 -58 107 -91 -190 -54 73 61
6495F1n3J80j52j10K09k47P2n3K0k8J84J9K7j01j7J09N6J14l10r8R2J6j43q0J24
$$ 61 8 188 36 -74 135 -112 -40 -93 -73 -101 83 102 129 28 11 120 176 290 -20 -118 -26 -10 -153 -233 -109
6520a09J00K54q5M9j92L13k59r8N8j43P0j6m2L1J65j12N7qQ9J07k44J13l28K12
$$ -109 -9 245 160 209 17 330 71 -27 31 -112 -42 -58 -100 -69 96 -16 41 33 122 229 -15 98 -230 -18
6544a8r0m7M4K69j50q4R5N3J3j12O9J2l8j45M1Km8K55j22K4j05N8J03j34J23n0
$$ -18 -108 -155 -111 158 8 -76 19 72 85 -27 42 54 16 -129 -88 -86 -134 121 -1 23 -82 -24 79 -55 68 18
6570A8k99J22J14J47j16J45l39j0K20j00K09j67j27J95J14l28J52j34J23j00K22
$$ 18 -281 -159 -45 102 -14 131 -208 -218 2 -98 111 -56 -183 12 126 -202 -50 -184 -61 -161 61
6591F1k4mj4n2j7QP9l52M84k90J35p4o0J33p8M6rP4L7l2N9j67K4M2J8L58l88o
$$ 61 37 33 19 -33 -50 -42 37 -315 169 -121 14 -60 -120 13 -65 -19 -28 46 83 51 110 -57 -33 9 27 385 -3 -9
6619iK44o2j35l9J57l00R8p9M9K00q0j05m9L78j87k95L78j13J3j73J61m3k0j76
$$ -9 235 173 38 -1 156 -144 -46 -125 -76 124 44 -61 -110 268 81 -214 164 51 64 -109 52 9 -11 -187
6643a87R6J19m0j29N4R0N7Q7l30O5n7L16jJ41k16j30q6K79J8q7k34J04q4J36n4
$$ -187 -91 28 -12 -141 -87 3 60 147 -183 -118 -175 141 140 281 65 -65 -151 128 146 59 -175 -71 -155 -19 -73
6668g3J13k69J37j4k45L20J63r0j02J53k51P1P3R7mJ44k93k2M2R4N5j82O9J26
$$ -73 40 -229 -92 -106 -351 -31 132 42 -60 93 -158 -87 -14 83 79 223 -70 -92 -50 44 99 -83 -14 112
6692A12L6n0k42k3N86m48m3p1L02k63K10j15L1RP6m2j78K85N6l5j69r6J25N3k60
$$ 112 148 98 -144 -167 419 -29 -72 -143 159 -104 106 -9 22 31 107 65 -113 172 228 193 24 -72 53 106 -154
6717a54K26j92m6k4K90k16O5K43l15P0J89k37K4N1N2l8k62M60k60K37M1l07nj03
$$ -154 72 -120 -166 -190 100 -116 -51 192 -123 -53 136 -101 -77 -26 26 -12 -274 186 -74 163 204 -103 -108 -211
6741b11J78j24J16P5J3j67m6k3J89J9k76K21J51j27K3n0n7L2n3J41Q6k56K60j14
$$ -211 -33 -157 -41 34 47 -120 -166 -189 0 19 -257 -36 115 -12 11 -39 -96 -64 -117 24 110 -146 114 0
6765@J21j46m3J73mm0k58K52n9J95q4j08J41j62Q5k3K3n8L0j86N27l17m1J70o9
$$ 0 121 -25 -68 105 101 61 -197 55 -4 191 107 -1 140 -22 63 40 63 5 35 -151 376 59 18 188 119
6790A19pj74K67j11k11J18J3k19J96K8Jr7J66j64M1k11K83j83j0K9O8M0N9k79
$$ 119 112 -62 205 94 -117 1 14 -205 -9 19 20 -77 89 -75 -34 -245 38 -145 -155 -126 -58 -18 41 -238
6814b38K24Q0q5O7n6K29j74k2K04k64j04M00l72K1J15m2j64NJ9K14j11J80j47
$$ -238 -14 66 -19 48 -8 221 47 25 229 -35 -139 261 -111 -90 25 -17 -181 -176 -157 57 -54 126 -21
6837b1o6J64K13k71k60J86K4O7O7j83K62j26O1j78K06O1j69k66K11K69k28R9j9
$$ -21 -87 77 290 19 -241 -55 -31 36 103 -80 182 56 117 -61 145 206 37 -229 -18 251 23 122 103
6860A03j83K7j18J59j3P4j2m6K4J2mP4j77j00K42k27K38k54K69l2j41l2J6j43
$$ 103 -80 -53 -171 -12 -25 49 37 -9 15 27 23 97 -80 -180 62 -165 73 -181 88 56 -85 -117 -101 -244
6884b44K70K1j05p4K94k30L8p9J52m9j5j55K70p0o3J45q2J25j47k3o5K83j8l3
$$ -244 26 47 -58 -132 162 -68 -30 -109 43 -6 -21 -176 94 24 -39 106 24 149 2 -21 -86 197 179 146
6908A46j75K62m7k08o7n5J8K32m0Lr9J06j65K38j3j8J05r5l9j54j68J93R2J66
$$ 146 -29 233 186 -22 -89 -144 -126 106 66 69 -30 76 -89 149 136 118 223 128 89 -65 -233 -40 52 218
6932B18k2k10K03j78M5k38J52J86r1k31J25k42K40j7r1K37p8k11L69r0l07J51
$$ 218 196 -14 189 11 56 -182 -30 156 65 -166 -41 -283 -43 -60 -151 86 8 -203 166 76 -231 -80
6954h0JJ13k84K4j58M12r2j62K93n1N9k34J04M9K3j18J65k00J77Lqo2K81k32N1
$$ -80 -79 34 -250 -226 -384 28 -64 -226 67 16 75 -159 -55 -6 17 -101 64 -136 41 44 36 -26 255 23 74
6979G4J81j71J0j32K5o9Q6j06J90P1j96r0K06l01J49J43j73K15J8q8J15l60J84
$$ 74 255 84 94 -38 -13 -82 4 -102 88 159 -37 -127 79 -222 -73 70 -103 112 130 42 157 -203 -19
7002a9L5J73j34J0J72l90L66j44Oj9r4k44K26n6Q9J96l45R2K79k96L40k46K5k1
$$ -19 16 189 55 65 237 -153 213 69 75 56 -38 -282 -56 -112 -23 173 -172 -80 199 -97 243 -3 22 1
7026AO9p4j19K91l16J16j10L7K69k08LL04k60o8LQ9l36M62k98J40j6J14k60K21
$$ 1 70 -4 -123 168 -148 -32 -142 -105 164 -44 -41 263 3 -65 -62 27 -309 153 -145 -5 -21 93 -167 54
7050E4p9J71k29j9K28o7N8j18o8R9n1J07j22m0J2J48R2r8O3j92j01N7R8OQ9%j16
$$ 54 -25 146 -83 -102 126 59 117 -1 -69 30 -21 86 -36 -76 -64 84 176 78 141 -51 -152 -95 3 9 98 98 -18
7077a8q9J98r7J58k06O6l6L99k89J9P4pk82J43l8k56J26J17M2n6j65m6L33k00
$$ -18 -107 91 -6 152 -54 12 -24 375 86 105 179 172 -110 33 -5 -261 -135 -18 24 -32 -197 -243 90 -110
7101a10L03p5k63J37j68J48j7R9J7j45N3q8j05J39L1J35o6L2K3j05j0j6K18j95
$$ -110 193 118 -145 -8 -176 -28 -45 54 71 -74 -21 -109 -214 -75 -44 91 25 57 80 -25 -35 -51 167 -28
7125b8M2J93k49j9K16k87N8J76k25k0J99k34J94j79K37m3p5P0j2pj30J08k03L80
$$ -28 14 207 -42 -61 155 -132 -74 102 -123 -143 56 -178 16 -163 74 31 -44 26 14 7 -123 -15 -218 162
7149A62l40J02j2J24P4j97M2j2l6p8K98l0k0j34q6L21k27k8J05rn6j5j01J50J3
$$ 162 -178 -76 -88 36 110 -87 -45 -57 -93 -171 127 97 77 -57 -143 178 -49 -77 28 19 -37 -52 -153 -3 10
7174A0Q8j09j2p1OJ38J67j25j54K13l70K46k05K82j18N0J0J7m0j66J44J0n1J35
$$ 10 98 -11 -23 -94 -88 50 217 92 -62 151 -219 27 -178 104 -14 36 46 63 23 -143 1 11 -40 95
7198I5k82K39oj73J56q4Q8J40j71j67l3L80k20NK35j30j4J01j33k00P6K1K58q1
$$ 95 -187 52 46 -127 29 -55 33 173 2 -165 -198 182 -38 -33 202 72 58 159 26 -174 -98 -77 181 100
7222A00j74R5m2J89k82P9N0k7N8j3M3k67J96k7J97j14Ll92M32l28M34m45K41q1
$$ 100 -74 21 -21 168 -114 -35 15 -12 46 33 76 -191 5 -22 175 61 64 -328 104 -224 210 -235 6 -75
7246g5K93l19J45j41j18J41l7J75k11K44j15J01Q1l78K66m1O8nk94M05l79J35
$$ -75 218 -101 44 -97 -215 -74 -111 64 -147 97 -18 83 164 -214 52 11 79 74 -220 185 -194 -59
7268e9k9K99k13k46J62N1J08Q4q6j09k5J08j15K93l84LK81j16Oj0J61j33K18k77
$$ -59 -88 211 -2 -248 -86 -35 73 157 71 -38 -63 45 -70 223 -161 -158 123 7 13 3 164 31 249 -28
7292b8J58l1j70J09J61l17K88k37K64m17M63k80j20J55JL87l52Oj99J35j32K21
$$ -28 130 99 -71 38 199 -118 170 -67 197 -220 243 -37 -157 -2 -1 386 34 40 -159 -24 -156 65
7314F5j23Q4j83k3K35Op7J00k57R7j00M11k74l13L51n2j24J66j7o4J94j11rj68
$$ 65 -58 26 -157 -180 55 61 -16 84 -173 -76 -176 235 -39 -352 -1 -53 -177 -11 -28 -92 102 -9 -18 -186
7338a86J56J04j06K0j20K6L60p2l06J32K7m0M2k9J41j05k30K28k13J24j83M90
$$ -186 -30 74 -32 -12 -132 -106 254 182 -124 8 35 -5 37 8 149 44 -186 42 -171 -47 -230 260
7360B60j35l26K58J14j76R6J59k23j29R8k7R7n5r6J91j07ql53N24k6l11J62J42
$$ 260 125 -201 57 171 -5 91 250 27 -102 -4 -31 66 11 -85 106 -1 -9 -362 162 136 -175 -13 129
7383A29%J03k60J85J25j27j48M4k34J16J57m2j99K14J71k97K52m67K16j00k6K34
$$ 129 129 232 -28 157 282 155 7 51 -183 -67 90 48 -151 63 234 -63 189 -278 -62 -162 -188 46
7405D6p9j7p2j39M98k89K34k84jK10k2N4j27J4P2jk67J12J66l5j10P2J40k51J32
$$ 46 -33 -50 -122 -261 237 -52 182 -102 -103 107 85 139 12 26 98 97 -170 -58 108 73 -37 35 175 -76 56
7430E6j86K15k57J81J38o6J10N0k51o7J75m1k15J32l5P0m8J55j43P2j64K66k13
$$ 56 -130 85 -172 9 147 81 191 241 -10 -77 98 57 -158 -26 -61 9 -39 116 -27 45 -119 147 -66
7453f6R8j41L67l12R5j19j2p2J59K01l58J92o5m1j15J25q8L3L7O6J09n7j04Oj96
$$ -66 32 -109 258 -54 41 -78 -90 -162 -3 198 -160 32 -33 -74 -189 -64 -152 -119 -82 -16 93 36 -68 -62 -258
7478b58Q3O2J93N0J74l99J17J20j00j25n0Q5M4l9L0q6j4k05K71q7P2K32k42p6
$$ -258 -175 -113 80 130 304 -95 22 142 42 -83 -133 -48 -4 -43 -13 -99 -113 -318 -47 -134 -62 170 -72 -148
7502a48K06o9NK3L8k11K10l2L8l1N7k77J38J87m12P4L16k34j4K00P2q7q2R8n5
$$ -148 58 -11 -6 17 55 -156 54 22 60 29 86 -191 -53 134 -278 -204 112 -122 -136 64 136 49 -33 65 10
7527A0n0N4p9K43J39n35J85J34j8j87M35k77k25L52q8p3k24J57L4j31K28J17k00
$$ 10 -40 14 -65 178 317 -218 -33 101 83 -104 331 54 -171 181 93 20 -204 -47 -13 -144 84 201 1
7550Aj03M4J53j30N8m1O6q7rJ75k28J08L6J1j33q4J46r7J44r5k53M16K7k29j0
$$ 1 -102 -58 95 -35 23 -18 48 -39 -48 127 -101 7 43 54 -79 -163 -17 -114 30 -65 -318 98 125 -104 -114
7575a14P2m0j6K85m7j36n3R1J28j98J24j1J07n4m14J37L11l14L47l44L1P5J34
$$ -114 -42 -82 -98 187 140 4 -49 42 170 -28 96 85 192 138 -276 -139 172 -142 205 -139 -108 -33 101
7598A01O3O0r0j36K79l01N6q9K48k26K9J10J13k31J82k91P2J60k54J93j13l8j3
$$ 101 164 224 134 -2 277 -24 32 -57 191 -35 -6 104 217 -14 168 -123 -51 109 -145 48 -65 -103 -116
7621a16J47j95MlJ13m4J77J4k68L6J65RJ41j17k07P5l4k4r1J12M9J51j45K37j27
$$ -116 31 -164 -160 -163 -50 -94 83 97 -171 -135 30 39 180 63 -144 -69 -103 -127 -218 -106 -57 94 -51 186 59
7646E9n3J71K40l39j33j21J0M7M12m18K68p2k7K25k73j40O2J55J0r7J11l02M09
$$ 59 6 177 417 78 -55 -176 -166 -119 293 -125 143 71 44 269 -4 -144 -82 73 83 -14 97 -205 204
7669B04k10qM6k5j42J50j0R4m7j14n4m5J58j49J35k20K61j4M8j87K4L20l69J71
$$ 204 -6 -14 32 7 -135 15 5 99 52 -62 -116 -161 -3 -152 -17 -237 24 10 58 -129 -105 215 -154 17
7693A7l1k6j48J29kL85l83j4M2J60j62Q6j57J47Q6j69p0K63r6k93L15o8mj19p5
$$ 17 -14 -40 -188 -59 -61 324 -59 -73 -31 129 -33 53 -104 43 129 -40 -110 153 57 -236 79 11 7 -112 -187
7718a87J72J31k20j38L9J24K24j95K13k60Q2J47j84K17k92O7L9oj8J35M9j52K70
$$ -187 -15 116 -104 -242 -203 -79 145 -50 163 -97 -15 132 -52 165 -127 -60 -21 -27 -45 90 139 -13 257
7741B57j97JK59k15K3j8op9L8J34j38k60J22J58p3J60k93Q7O1K57l56J78l5j77
$$ 257 60 61 320 105 128 110 104 25 63 197 59 -201 -79 79 6 166 -127 -40 21 278 -78 100 65 -112
7765a12J33J07j00p0L8j76L40k38q5J15J22l1K0K47l57Q2j44J31L0j27R3l22M53
$$ -112 21 128 28 -42 -4 -180 160 -78 -163 -48 74 43 63 310 -47 35 -109 22 52 -75 18 -304 149
7788A49j24j23L45k5j86j70L9L03rn8j16R5o8r7M0j58J87Q5l17N8L52j75P4J54
$$ 149 25 -98 247 222 36 -134 -95 208 199 141 25 120 52 -45 -5 -163 24 109 -208 -150 202 27 101 255
7812B55l6k39r2J33J92r2j93j10L49m1o5K19j98l37K01L0j93N0K1K6J61j53K49
$$ 255 219 -20 -112 21 213 121 -72 -182 167 126 61 280 82 -255 -54 -24 -217 -167 -146 -120 41 -112 137
7835A37M9j60k3j9P8q9n5J78J66j91Pj06K67k16J5l6J15q7JJ23l50M5K7J42M5
$$ 137 186 26 3 -16 62 -27 -82 96 262 71 78 -28 239 23 38 2 117 30 31 154 -196 -151 -124 18 63
7860F3k42J96m9J40j91J33Kp1o4K58k02J12k52J83r7j35K60n8J28J9k68k8J94
$$ 63 -179 17 -32 108 -83 50 52 -19 -83 175 -27 85 -167 16 -81 -216 44 -14 114 133 -135 -163 31
7883C1l1J2j57J74r5o7J37P2J42k44r2J50l4j16K25j77M8J37J73m6m14K35j11
$$ 31 0 12 -145 29 -66 -133 4 76 218 -26 -118 32 -2 -118 107 -70 -22 115 288 242 -172 63 -48
7906d8K11k26k2K68k80Q6j87J48k66J45R7P1o1RnqK04j88M6L7j15K1q1J68Q3k01
$$ -48 163 -63 -85 183 -97 -11 -198 -50 -316 -171 -74 -3 -64 -55 -60 -68 136 -52 -6 31 -84 -63 -144 24 107 -94
7932i4m7j19J91j09rL05k06O2r4J03J30j45J66J01k25Lr7q2K38k06K24n5JJ08
$$ -94 -141 -260 -69 -178 -187 118 -88 -26 -120 -17 113 -32 134 235 10 13 -84 -166 72 -134 90 35 36 144
7956A44l5o9J17j52k09K36m1N4l7Oj58j0J29M8K51k99q0L00l63P1J36R7j1j74
$$ 144 109 40 157 5 -204 32 -9 45 8 14 -144 -154 -25 23 274 -25 -105 195 -168 -97 39 136 125 -49
7980d9N9Q1j21J44p3K6j05Q8L4j13j45M6J78q7R7j95J00L8Q0N3j72J96j57k40
$$ -49 10 91 -30 114 41 67 -38 50 84 -29 -174 -128 50 -37 60 -135 -35 3 83 136 -36 160 3 -237
8004b37K33rJ4r6K17j34k55N64k80l6Q1j73Q3j30L83n96L25j28J53J19j26N1l
$$ -237 -4 -13 1 -95 122 -12 -267 297 17 -19 62 -111 -28 -158 225 -371 -46 -174 -21 98 -28 23 20
8027B0K0l1R3R5n08K14R3K02J4j98p3M7k92J10J25J32k69J82n1l8N6K37l69P4
$$ 20 40 9 102 197 -311 -97 -4 198 212 14 -59 -12 -304 -194 -69 63 -206 -24 -75 -113 -57 180 -189 -115
8051a15k22L50p7j35L01j34K39k11q8p7K23M5j26J30n3r0rR5j52oJ00j09K87k76
$$ -115 -337 13 -64 -199 102 -32 207 -4 -92 -169 54 99 -27 103 50 -40 -49 46 -106 -112 -12 -121 166 -110
8075a10J93j92J04J4M3J26l21KQ3J6J47j20L1J2p1N0J15k44J77q%l4N1j03m0L10
$$ -110 83 -109 -5 9 52 178 -143 -141 -58 -42 105 -15 16 28 -43 7 122 -122 55 47 47 13 64 -39 -79 231
8101B31j90q1l6N5J77j8m23O4J49j1j53L39j9n7n9J09O4l49K50K46k13K2P2o61
$$ 231 41 -40 -76 -21 156 138 -285 -221 -72 -83 -236 103 84 27 -32 77 141 -208 42 288 75 97 169 -492
8125d92L77OK78j23r6O5k8j88J58l3Ppj08J05o2Q8j02P3O6J38m8k21L8m5J02K31
$$ -492 -115 -109 169 46 -50 15 -13 -201 -43 -76 -69 -76 -184 -79 -141 -53 -155 -82 -16 122 74 -147 -109 -154 -52 179
8151A79Qj85K3R1r4k02K30q4j79K81o5R8J11m97L22j64Q7J82M2k92J54P2j34J6
$$ 179 187 2 25 116 22 -180 50 -34 -213 68 3 101 212 -285 37 -127 -40 142 184 -108 46 118 -16 0
8175@R7L1j18l4K8p8j86K75P3J41l39L7L13k86J61m87
$$ 0 97 128 10 -24 4 -74 -260 15 88 229 -110 -73 240 -46 115 -372
8191c72
$$ Imaginary data points
##PAGE= N=2
##DATA TABLE= (X++(I..I)), XYDATA
0@%%%%%%%%%%%%qJ6j6J6j7K5l2M0m8N6p2Q4r5J15j36J54j78K08k40K73l08L50
$$ 0 0 0 0 0 0 0 0 0 0 0 0 0 -8 8 -8 8 -9 16 -16 24 -24 32 -40 44 -51 64 -72 82 -96 112 -128 145 -163 187
34A87l98M50n06N67o38P14p96Q87r84J092j210J338j480J634j800J982k186K408
$$ 187 -211 239 -267 300 -338 376 -420 467 -517 575 -635 703 -777 857 -943 1039 -1147 1261
52A261k651K922l223L561l939M367m861N433o103O903p879R099j0674J2798j5845
$$ 1261 -1390 1532 -1691 1870 -2069 2298 -2563 2870 -3233 3670 -4209 4890 -5784 7014 -8831
67h831K0630k9624P9049k07895J32798J21587k57779K09996k1907j37975J56568
$$ -8831 11799 -17825 61224 -146671 -13873 107714 -150065 59931 38024 -99951 56617
78E6617k4270q2633J03514l9462o6727O0251M1765r9027M4797P1006j29455L8266
$$ 56617 32347 -50286 53228 13766 -52961 7290 49055 -49972 -5175 65831 -63624 -25358
90b5358O5860j19745J03170K2742j15355J09947p728p2379Q1090o4471m0125P3975
$$ -25358 40502 -79243 23927 46669 -68686 41261 33533 -38846 42244 -22227 -62352 11623
102A1623j7722q852K8237j5587j6626L5510J2819o4917L0518L2025n9552M6403
$$ 11623 -6099 -14951 13286 -2301 -18927 16583 29402 -35515 -4997 27028 -32524 13879
114A3879K381m7165N8268n1949k0840Q8537n0665q79N3504n1258N495K0346j6607
$$ 13879 16260 -30905 27363 -24586 -45426 43111 -7554 -8433 45071 -6187 -692 19654 3047
127C047q487k1782J9485J3077N330J0586l4375K8356O421m7407N2572j7515m2096
$$ 3047 -5440 -27222 -7737 5340 10670 21256 -13119 15237 21658 -25749 26823 9308 -32788
140c2788O7014k8207k7216M3849l3366k362K2554j9747J3758K2088o605k7689
$$ -32788 34226 6019 -21197 22652 -10714 -13076 9478 -10269 3489 25577 18972 -8717
152h717Q360J4614l6826K4160R2m7837O8980k752m7343O1099m0267k4797O4378
$$ -8717 -357 14257 -22569 1591 1683 -46154 22826 20074 -27269 33830 -6437 -31234 33144
165C3144m5224l978L3549l4393J7283L635k3695J1931M344L498j2077J5545K0049
$$ 33144 -12080 -16058 17491 -16902 381 4016 -19679 -7748 -3404 94 -11983 3562 23611
178B3611l4378K2478p316m4683N3149j6613k7896N2914l6630R687M5145n6269
$$ 23611 -10767 11711 4395 -40288 12861 -3752 -31648 21266 -15364 -5677 39468 -16801
190a6801J1659K0392l2622K4564P74j8078J1433L072m288j3085J6379K68j5825
$$ -16801 -5142 15250 -17372 7192 7966 -10112 1321 4393 105 -12980 3399 3667 -12158
203a2158L8207j9097j6719M5296m1125r179L0446m1273K4633K1079l5357K4093
$$ -12158 26049 6952 -9767 35529 -5596 -14775 15671 -25602 -969 20110 -15247 8846
215H846N507j2603Q675j0041j68n298J1044O402k8996K3901q33k6788L3957k1382
$$ 8846 14353 1750 10425 384 216 -5082 5962 12364 -16632 7269 6436 -20352 13605 -7777
229g777p003M2564l1692M810J9583l5081J4744J954k3220J2391M766P351k025
$$ -7777 -14780 27784 -3908 902 20485 -14596 148 2102 -21118 -8727 -3961 3390 1365
242A365j406Q037j6540J5218l562k5741L1870j3315r783L3181l8214O217K9329
$$ 1365 -41 7996 -8544 6674 3112 -22629 9241 -4074 -13857 19324 -18890 -12673 16656
255A6656l7124K0280R500k1268K8649j0985j2625J0998j5228P087k198j608J1612
$$ 16656 -20468 -188 9312 -11956 16693 5708 -6917 4081 -11147 -4060 -6258 -7866 3746
268C746q424K0013q005j8538L0186k5035l016K8463l7050J9054J7715l5811K4798
$$ 3746 -4678 15335 7330 -11208 18978 -6057 -9073 19390 -17660 1394 19109 -16702 8096
281H096m054j9276K9212j0347n398J4179m991L39r692K538m020j0089K3766j3909
$$ 8096 4042 -15234 13978 3631 -1767 12412 7421 7760 -1932 606 -3414 -13503 10263 -3646
295c646l355K8805k4518O788J1864l1679J9736J721j7662J8027r580K064N531
$$ -3646 -7001 21804 -2714 4074 15938 -15741 3995 5716 -11946 6081 -3499 -1435 4096
308D096j2287J1216j0363M895J5473k1632J6321j231k0024K3566k1270p277K7188
$$ 4096 -8191 3025 -7338 -2443 13030 -8602 7719 6488 -13536 10030 -11240 -18517 8671
321H671k2654J2339J2076k0319J9328o864j0105J1903j5561R442M277j0583J0964
$$ 8671 -13983 -1644 10432 -9887 9441 2577 -7528 4375 -11186 -1744 2533 -8050 2914
334B914q800M408L750j3973J8408o874l242K0245k2755O059Q880k3722J7329m746
$$ 2914 -5886 -1478 2272 -11701 6707 -167 -3409 16836 -5919 140 9020 -14702 2627 -2119
348b119j1777K6557j0432l315J3853j1414Q61J99j570k217l388J5029j1643k462
$$ -2119 -13896 12661 2229 -1086 12767 1353 2214 2413 843 -1374 -4762 10267 -1376 -3838
362c838J5444k2281J3284J0804k8663K8753q7k6458L0246j4939j8038K4728j4399
$$ -3838 11606 -10675 2609 13413 -15250 13503 13416 -13042 17204 2265 -15773 8955 -5444
375e444l435J4433o312M264K073j339n992m20Q510j7247Q250J1978k4718J9806
$$ -5444 -8879 5554 -758 3506 5579 4240 -1752 -2172 6338 -10909 -2659 9319 -15399 4407
389D407L833k7404K5987n005j5524K5051j2311m117J4175j3851p91K420l900J418
$$ 4407 8240 -19164 6823 1818 -13706 11345 -966 -5083 9092 -4759 -5550 -3130 -7030 -5612
403e612K321O489p648P199P723k0888J3585J119k0764K3495o642j1743K2654j6532
$$ -5612 -3291 3198 -4450 2749 10472 -10416 3169 4288 -16476 7019 377 -11366 11288 -5244
417e244R01J4592j9890R785P996j0057O402p49q7n463j414P209j3391J0619P834
$$ -5244 -4343 10249 -9641 144 8140 -1917 4485 3736 3649 -1814 -3228 3981 -9410 1209 9043
432I043j6932K1565o078j6968K4980j7840p107K1988j9875N625J2076j5525P923
$$ 9043 -7889 13676 7598 -9370 15610 -2230 -9337 12651 -7224 -1599 10477 -5048 2875
445B875l01n291M413r25N743q657M470P497k0157J3071J25j9429K3675q219o838
$$ 2875 2574 -2717 1696 771 6514 -2143 2327 9824 -10333 2738 2863 -16566 7109 -1110 -7948
460g948K3953k0928J610J4685k1910Q512L615j0528J0268l217O96J259l976O416
$$ -7948 16005 -4923 -3313 11372 -10538 -2026 1589 -8939 1329 -1888 -1192 67 -3909 2507
474B507r370N544N836j1799J4738p389j0396J9174j7986J58J7797k0550J1032
$$ 2507 -6863 -1319 4517 -7282 7456 67 -10329 8845 -9141 -8983 8814 -11736 -704
487g04J0944j5438J1529m101q361P891m510K491l57O9K716m640J0479q636o980
$$ -704 10240 -5198 6331 2230 -6131 1760 -2750 -259 -616 -547 2169 -2471 8008 -628 -7608
502g608K0113j6641m5K1099k1855M840Q542j7989J3587j497r473J3825m672j179
$$ -7608 12505 -4136 -4181 16918 -4937 -97 8445 -9544 4043 2546 -6927 6898 2226 1047
516A047M929j755k305o868R231n063p953K0980j3337p504K0366j7301M812R428
$$ 1047 5976 4221 1916 -4952 4279 -784 -8737 12243 -1094 -8598 11768 -5533 -721 8707
530H707j9884J6059K10j3691J7399q803r074Q598k520K415k279L776K070q824
$$ 8707 -11177 4882 5092 -8599 8800 -3 -9077 -479 -2999 -584 -2863 913 2983 -5841
544e841J2300n523q874J2120j3520O102J0464j9431J6705J476k0760J9989k682
$$ -5841 6459 936 -7938 4182 -9338 -3236 7228 -12203 4502 5978 -14782 5207 2525
557B525j0312J3088p431P2N069m058J616m242J517l87M27R995j1330M790Q665
$$ 2525 -7787 5301 -2130 -2058 3011 -1047 569 -3673 -2156 -2543 -2116 7879 -3451 1339 10004
572A0004k0220J4716N348k3447J6644J169j0816J5782p914l535P856q695M208
$$ 10004 -10216 4500 9848 -13599 3045 4214 -6602 9180 1266 -2269 5587 -3108 1100
585A100M226l440k038N50O188r297J457R566j8087Q644J1897j6698J1859K42j3344
$$ 1100 5326 1886 -152 398 6586 -2711 -1254 8312 -9775 -1131 10766 -5932 5927 6169 -7175
600g175J3749q240m411J2894j0338j30O116j695J4k915M625n617k758J3726j0816
$$ -7175 6574 -1666 -6077 6817 -3521 -3651 2465 770 784 -2131 2494 -3123 -5881 7845 -2971
615b971j44R063j5226Q565M572j3614J2474m498n120J4988q320l494N212n304
$$ -2971 -3115 5948 -9278 -713 3859 -9755 2719 -1779 -6899 8089 -231 -3725 1487 -3817
629c817K005n72J378J146m907P767l773j941P887j0822N414M516j1509J3444k705
$$ -3817 -1812 -2384 -1006 140 -4767 3000 -773 -2714 5173 -5649 -235 4281 -7228 6216 3511
644C511j1372J3141o451l955J0265o275J226K895j756K287k186J415n232O60Q114
$$ 3511 -7861 5280 -1171 -5126 5139 -1136 90 2985 1229 3516 1330 2745 -2487 -1827 6287
659F287j0505O049N575j4430J1955K24j1990J3642n612n832J1428o808o6L199
$$ 6287 -4218 1831 7406 -7024 4931 5155 -6835 6807 1195 -4637 6791 -17 -83 3116
673C116n275J602k45K744k013j250O675q307K713O154j3797Q682K324j2170J4016
$$ 3116 -2159 -557 -802 1942 -71 -1321 5354 -2953 -240 5914 -7883 799 3123 -9047 4969
688D969l953p558J2050q691q14P018p200L439Q30j889J986k371L445m795J47O636
$$ 4969 1016 -6542 5508 -3183 -3997 3021 -4179 -740 90 -1799 187 -2184 1261 -3534 -3387 3249
704C249r559P347L272j2536J2738l318q963J3999r907q89J1025j1126N076L303
$$ 3249 -6310 1037 4309 -8227 4511 1193 -7770 6229 -3678 -4567 6458 -4668 408 3711
718C711p410N590j916n95J836k163M993o099K498M790j0885R332o9r935J3693
$$ 3711 -3699 1891 -25 -620 1216 -947 4046 -2053 445 5235 -5650 3682 3613 -6322 7371
733G371o671m474J2782j1780J482P833j0385N181J541l820L196j967K033l123
$$ 7371 700 -3774 9008 -2772 -1290 6543 -3842 1339 2880 -940 2256 289 2322 -801
747h01M05M764q718O346J915j0586J2319m581p858J3447r630j018R542r924L904
$$ -801 -396 4368 -4350 1996 3911 -6675 5644 1063 -6795 6652 -2978 -3996 5546 -4378 -474
762d74L023o129M433k062j83O03j647L959m810K608K987q680Q858k364o807J1357
$$ -474 2549 -3580 853 -1209 -1392 -789 -2436 1523 -3287 -679 2308 -6372 2486 122 -6685 4672
778D672p647j172R752j0755M030N354j0073O562Q73n126M577o29q53j99J246O71
$$ 4672 -2975 -4147 5605 -5150 -1120 4234 -5839 723 1596 -3530 1047 418 -435 -634 612 1283
794A283m470O398k154m761R690q004o33J0040j1693L866P110j1358O531K822p812
$$ 1283 -3187 3211 1057 -3704 5986 -2018 -2651 7389 -4304 -438 6672 -4686 1845 4667 -3145
809c145N957p95k778K068k33J39j722K983j568l727Q138o154k410J0674j0872
$$ -3145 2812 2017 -761 1307 1074 1213 -509 2474 906 -2821 5317 -837 -3247 7427 -3445
824c445J650Q965j2499N518M183r677P370q84m831O192k960j394K839j006r74
$$ -3445 -1795 7170 -5329 189 4372 -5305 2065 1181 -3650 2542 -418 -1812 1027 21 -953
839i53j556M087k928k564P348o677k09P388q218M424J771p202P481k407m204P429
$$ -953 -2509 1578 -1350 -3914 3434 -3243 -3452 3936 -4282 142 1913 -5289 2192 -215 -4419 3010
855C010n135p94L498j733J226j693K398m43l061O188m346q15N644q398N449K804
$$ 3010 -2125 -2919 579 -1154 72 -1621 777 334 -2727 3461 -885 -1700 3944 -4454 995 3799
871C799r548R656j806p381J1129m750k943N821m740J346J174j520J536k605K547
$$ 3799 -5749 3907 2101 -5280 5849 1099 -1844 3977 -763 583 1757 237 1773 -832 1715
886A715j171o68M877o985K563M294q540O776Q30q289P287k323k577N196l907Q04
$$ 1715 544 -124 4753 -2232 331 4625 -3915 2861 3691 -4598 2689 366 -2211 2985 -922 -118
902a18J104j594K432k201Q17j056j996M979m893J105M352q005N672J476o910Q040
$$ -118 986 -608 1824 -377 440 -616 -2612 2367 -2526 -1421 2931 -5074 598 2074 -4836 3204
918C204m472k678P122o498K394K853o872M584p1j649L516l345K277o92j472M593
$$ 3204 -1268 -3946 3176 -3322 -928 1925 -4947 -363 -434 -2083 1433 -1912 365 -327 -1799 2794
934B794n749J537K772o013P050p19n270O970m551r7N545o132K262J613l611L169
$$ 2794 -2955 -1418 1354 -4659 2391 1672 -3598 3372 -1179 -1276 4269 -1863 399 2012 -1599 1570
950A570j182J08o65p26L279l304K865K225o751N572l18o038P633n219j455O469
$$ 1570 388 496 -169 -895 2384 -920 1945 4170 -2581 2991 2673 -3365 4268 -951 -2406 4063
966D063o417L387K863o063L614r39K28J553l738L673l517q25O003p284K536L375
$$ 4063 -2354 1033 3896 -2167 1447 508 736 2289 -1449 2224 -1293 -2118 3885 -3399 -863 2512
982B512p202P729j670m493P685p005o00N723o059K217P59j943L773l475J907R86
$$ 2512 -4690 3039 1369 -3124 4561 -2444 -3044 2679 -3380 -1163 -404 -2347 1426 -2049 -142 844
998H44l690M125k713l30L596m958L222n42l612O534l967j712O119m680K512J432
$$ 844 -2846 1279 -1434 -1764 1832 -3126 96 -446 -4058 2476 -1491 -3203 2916 -1764 748 2180
1014B180l790L059k908n55L651k902R04Q93l58K159k798K498l65m085N385j307
$$ 2180 -1610 1449 -1459 -2014 1637 -1265 -361 532 174 2333 -465 2033 1668 -2417 2968 1661
1030A661l343M116k830K93J279l033L864m98k168L391j138n69p84l62J268l325
$$ 1661 -1682 2434 -396 -103 1176 -1857 2007 1509 -659 2732 1594 1025 241 -121 1147 -2178
1046b178J882J653k770K841o99j528K664k397J193J97l470M345j646k162K262
$$ -2178 -296 1357 -1413 1428 729 -799 1865 -532 661 858 -2612 1733 87 -2075 187
1061A87k391J466J98j328M328l398q8L681m863J814l37k831M070k637R52L541
$$ 187 -2204 -738 -540 -1868 2460 -938 -1026 2655 -2208 -394 -731 -3562 508 -2129 -1177 2364
1077B364n627L943J182m906L974j733j86K341l740K804J10l231K851r84J175M19
$$ 2364 -3263 680 1862 -3044 930 -803 -989 1352 -2388 416 526 -2705 146 -838 337 756
1093G56j444M142l675n13M331o615K394K980n679N301n39k272M577l920q0K926
$$ 756 -688 3454 -221 -734 3597 -3018 -624 2356 -3323 1978 1439 -833 3744 -176 -256 2670
1109B670k975J196n37N22L64l191M279k416k591O520m593P67M817o717L239R64
$$ 2670 -305 891 354 876 1240 -1951 2328 -88 -2679 3841 -752 15 4832 -1885 1354 2318
1125B318n750M335j685j925M621k591N70J007r68J128k411J269J30k110L264k455
$$ 2318 -3432 903 -782 -2707 1914 -677 -107 900 -68 1060 -1351 -82 48 -2062 1202 -1253
1141a253k95K545l901K314J209l472M704j059j983L173l160n16J134j645J256
$$ -1253 -1548 997 -2904 -590 619 -2853 1851 792 -1191 1982 -1178 -1694 -560 -2205 -949
1156i49l67J187Q85j129K253k493M1K580m744L381J399n537N714j712l783N882
$$ -949 -1316 -129 756 -373 1880 -613 -572 2008 -2736 645 2044 -3493 2221 509 -3274 2608
1172B608l461o24M884l491J610J018k960J174j262M04m77j03L018k664J729K077
$$ 2608 -853 -1477 3407 -84 1526 2544 -416 758 -504 -100 -577 -680 2338 -326 1403 3480
1188C480n148L913j001m031N767k919j857M897m135J25K284k870J791P67o14N24
$$ 3480 -1668 2245 1244 -2787 2980 61 -1796 3101 -1034 -909 1375 -1495 296 1063 449 973
1204I73o28P26k508L54J109l930L941K97k809N104k880j249L963n032J591K210
$$ 973 345 1071 -1437 -1083 26 -3904 37 334 -2475 2629 -251 -1500 2463 -2569 -978 1232
1220A232m435L505m10k318L049j958r0J444q95J645m66N24j69k482K402k251j095
$$ 1232 -3203 302 -108 -2426 623 -1335 -1425 19 -876 769 303 827 658 -1824 578 -1673 -2768
1237b768M165l475J734L566m652K778Q49m086K902q79j276K437j237L88m11K98
$$ -2768 1397 -2078 -344 3222 -1430 1348 2197 -1889 1013 134 -1142 1295 58 446 35 333
1253C33N51j726K382rj871L779l071j086K590l678J212J289k286L051l99k15J497
$$ 333 884 -842 1540 1531 -340 3439 368 -718 1872 -1806 -594 695 -1591 1460 1061 846 2343
1270B343j978N63j083q38J946k240J095J565l397K607n47j864L055j782Q11J556
$$ 2343 365 928 -155 -993 953 -1287 -192 1373 -2024 583 36 -1828 1227 -555 256 1812
1286A812k865J714p96k181J786j355P52R17p10K398j349o62J729k678P28L55j415
$$ 1812 -1053 661 -135 -2316 -530 -1885 -1133 -216 -926 1472 123 -539 1190 -1488 -760 -405 -1820
1303a820K220j331K0J732k825J979N15j835K788p35k22N92k535J829q37j543K624
$$ -1820 400 -931 -911 821 -2004 -25 490 -1345 1443 708 486 1078 -1457 372 -465 -2008 616
1320F16j358J421Q87j203K427k304j455L184l283Q09K088k770J801m83o92J852
$$ 616 -742 679 1566 363 2790 486 -969 2215 -1068 -259 1829 -941 860 377 -315 1537
1336A537k015J269O95j168J774j515RO4l411L283n72j871M153k227N0K328k463
$$ 1537 -478 791 1486 318 2092 577 586 650 -2761 522 -50 -1921 2232 5 55 2383 -80
1353h0Q06j128j039J627j514J035Q32k061J878j457K39K215l123K054J098l362
$$ -80 726 -402 -1441 186 -1328 -293 539 -1522 356 -1101 -862 1353 -1770 284 1382 -1980
1369a980L408j745j936K009k270K095R10j745L068j578j088K154k473O63m19q99
$$ -1980 1428 -317 -2253 -244 -2514 -419 491 -1254 1814 236 -852 1302 -1171 -508 -927 -1826
1385a826K709j533N53J404k793J720j37n47K661k334K84J685l186J894m50k076
$$ -1826 883 -650 -97 1307 -1486 234 97 -450 2211 -123 161 1846 -1340 554 104 -1972
1401a972K216J42Q54R30j602R89j381k63R81j924J121J64j127K947j759n27J803
$$ -1972 244 386 1240 2170 568 1557 176 -87 894 -1030 91 255 -872 2075 316 -211 1592
1418A592k256J002J131j163Q09p70j086O01r24J069j229M60J560r80J831k68k981
$$ 1592 -664 338 1469 306 1115 345 -741 -140 -1064 5 -1224 -764 796 -184 1647 1379 -1602
1435a602K120j657o55K555k352M22J555j468J637q00n71M82r55K410n93j344J489
$$ -1602 518 -1139 -1794 761 -1591 -1169 386 -1082 555 -245 -816 -334 -1289 1121 528 -816 673
1452F73k333L51J173k156L057q24j008L133j410j45P86l623K186j74j069K601
$$ 673 -1660 -1309 -136 -2292 765 -59 -1067 2066 656 511 1297 -2326 -140 -314 -1383 1218
1468A218j091oQ32j585J738m94r26J502j278J643m14k181K140k471k05L898k796
$$ 1218 127 121 953 -632 1106 612 -314 1188 -90 1553 1139 -1042 1098 -1373 -1578 2320 -476
1485d76Q34J989k333J769p05k060J626j901M16J835j49q61o35J566m38j721K121
$$ -476 358 2347 14 1783 1078 -982 644 -1257 -841 994 845 -16 -651 915 477 -1244 877
1502H77n92j220K317k246L52J151l253J942K14j384K805j64q98P62r89q2n13j31
$$ 877 285 -935 1382 -864 -512 639 -2614 -672 -458 -1842 963 799 -99 663 -326 -408 -921 -1052
1520a052Mo20K142j01j216J342j329K32J388k014J688q3j805K408j109j367J334
$$ -1052 -1048 -1668 474 373 -843 499 -830 -598 790 -1224 464 381 -1424 984 -125 -1492 -158
1537a58p22Q89J02K62J540j245m33J08m94K20j297J210J285k375K411L61k228
$$ -158 -880 9 111 373 1913 668 235 343 -151 69 -1228 -18 1267 -1108 1303 1664 -564
1554e64K042j621O5J944j927P73P85k457J164j95p55Q17j93J369l94l41J456k782
$$ -564 1478 -143 -78 1866 -61 712 1497 -960 204 9 -746 71 -122 1247 853 512 1968 -814
1572h14N37N58k210K388o92p92K243j251j79O04j767J722k02p27R37r43N08l81
$$ -814 -277 281 -1929 459 -233 -1025 1218 -33 -212 392 -1375 347 145 -582 355 -588 -80 -461
1590d61j506J900q22J44J891j241P04l17q40J137j968l42J588j063J477J17r92
$$ -461 -1967 -67 -889 -745 1146 -95 609 292 -548 589 -1379 -1721 -133 -1196 281 398 -594
1607e94J597j412p3J278j852J326K52p65Q35j125K75L01j441K107K8k42J772k024
$$ -594 1003 -409 -482 796 -1056 270 522 -243 592 -533 -258 43 -1398 709 737 495 2267 243
1625B43O93o3j967J542n63n95J981j233Q22N65j561R58p83rQ76j207J266l82j458
$$ 243 936 873 -1094 448 -115 -710 1271 38 860 1425 -136 822 39 30 906 -301 965 583 -875
1644h75J583j447j62J674j490J365O08j166J190j517o86Q45j329Q31K19q0J237
$$ -875 708 -739 -901 773 -717 648 1256 90 1280 -237 -923 -78 -1407 -576 -357 -437 800
1661H00j195L80K51j277R89m22m24J123j015N67j41q65R83n59K98J484j299Q93
$$ 800 -395 -15 236 -1041 -52 -474 -898 225 -790 -223 -364 -1229 -246 -805 -507 977 -322 571
1679E71P8j371Q09p95n21J159o0K63O9N14k1j083O46j25o79J479o50m43J425j522
$$ 571 649 -722 87 -708 -1229 -70 -130 133 202 716 695 -388 258 133 -546 933 283 -160 1265 -257
1699b57M4O99j253J069M95m12J013q19J7k43q51N47o28M42R93p82R26k92o85P89
$$ -257 -213 486 -767 302 797 385 1398 579 596 353 -498 49 -579 -137 856 74 1000 708 23 812
1719H12j025J06O19j027J130l28j003R17j115K47Q89r30J208J09p84L73r17R3
$$ 812 -213 -107 512 -515 615 287 -716 201 -914 -667 222 -708 500 609 -175 198 -719 -626
1737f26J2o75J007k95K60J145j029K30J94j287J104o79j15J299j154M97J23r77
$$ -626 -614 -1289 -282 -577 -317 828 -201 29 223 -1064 40 -639 -754 545 -609 -112 11 -966
1755i66Q77l51K87P33q57J027m40p89P97j227N36O28p89J455k57l43Q86j093j15
$$ -966 -89 -440 -153 580 -277 750 310 -479 318 -909 -373 255 -534 921 664 321 1207 114 -1
1774aM52m70M11r4J72L62j456R10K45j149J407m05k46J163j052N4K57j148O76
$$ -1 451 -19 392 298 470 832 -624 286 531 -618 789 384 138 1301 249 303 560 -588 88
1793H8m15J97M21k19Q75j063Q5N21j589N72J035j435J273k58r04Q88r23N70J41
$$ 88 -327 -130 291 72 947 -116 -31 490 -1099 -527 508 -927 346 88 -816 72 -851 -281 -140
1812a40m00R82n05k15M64j018N45m05o46J336o15K67J280j406O99l07o24J221
$$ -140 -540 442 -63 -278 186 -832 -287 -692 -1338 -2 -617 -350 930 -476 223 -84 -708 513
1830E13j433N76J014j467J000J43p53O67o51K48Q34p31P81M0q05L64q89N84kp80
$$ 513 -920 -344 670 -797 203 346 -407 260 -391 -143 691 -40 741 781 -24 340 -549 35 33 -747
1850g47J736m75l42J037j291J41M69q67Q28m38l00R51p70J92q3m35R75m98M27
$$ -747 989 514 172 1209 -82 59 528 -339 489 51 -249 702 -68 124 41 -394 581 83 510
1869E10O66j324M91k45j054R99o99J69Q99n68N20k86m86P40j318M44Q81p26M48
$$ 510 1176 -148 343 98 -956 43 -656 -487 412 -156 364 78 -408 332 -986 -542 339 -387 61
1888F1n34O9M87r15K83N51o59O56P9J34k27q27M66k77k37J008k73NQ13n33J98
$$ 61 -473 -404 83 -832 -549 2 -657 -1 78 212 -15 -842 -376 -653 -890 118 -155 -150 663 130 328
1909C28l22p35R72o94M66N32m77M47l84k68O70r48P69M63n26P71q55m80P82q44
$$ 328 6 -729 243 -451 15 547 70 517 133 -135 535 -413 356 819 293 1064 209 -271 511 -333
1929c33N0N73l14J039o46j95O16j019N97m00n43P62l03K30N08o56k10J43j76M83
$$ -333 -283 290 -24 1015 369 174 790 -229 368 -32 -575 187 -116 114 622 -34 -244 -101 -277 206
1949B06l95K89k10J56K05l85o21N96n64L60O67o56N81k36l47K90q10O61l05J65
$$ 206 -189 100 -110 46 251 -134 -755 -159 -723 -363 304 -352 229 -7 -354 -64 -874 -213 -518 -353
1969c53N15l13J25j95o26R80m80p0J116o99Q0l63j52O82m86k87Q00m88M99J90
$$ -353 162 -151 -26 -221 -847 133 -347 -417 699 0 80 -283 -435 247 -239 -526 274 -214 285 475
1989D75m06K36m54K27J86n76P01k8n14R27j018K18M21r51R60j77l99J016o00l13
$$ 475 69 305 -149 78 264 -312 389 361 -153 774 -244 -26 395 -556 404 227 -172 844 244 -69
2009f9N82j028Q97m5o30J118p56K47L53o20k20l7k72Q51q75O85M85j605J512m75
$$ -69 513 -515 382 337 -293 825 69 316 669 49 -171 -208 -480 371 -504 181 666 -939 573 98
2029I8j033J439r37K58O59j038L52K2n18K46n6J44M12j95K37n21Q3O67j170P22
$$ 98 -935 504 -433 -175 484 -554 -202 -180 -698 -452 -508 -364 48 -147 90 -431 -348 319 -851 -129
2049a29L59n73O96l81j08L12o56J53N07j0M4L7O6M5m04L12l85R5M86o31L04K89
$$ -129 230 -343 353 -28 -136 176 -480 -327 180 170 214 251 317 362 -42 270 -115 -20 466 -165 139 428
2071D28l49N52o87J58L16m06K03L56n23K05K56l07K5m2J8m73N71N2n03O10m73
$$ 428 79 631 -56 102 418 12 215 571 48 253 509 202 227 185 203 -270 301 353 -150 460 -13
2092a3l73Q62p70n7R26q99P8O92q77M78k86k19M01PK5j56J2K51o52N52o4o48Q51
$$ -13 -386 476 -294 -351 575 -324 -246 446 -431 47 -239 -458 -57 -50 -25 -181 -169 82 -570 -18 -82 -730 121
2115A21l72l08J042j040j07Q58r10M65N52n11M34q6l30P3R1j76k1J84L63m23L43
$$ 121 -251 -559 483 -557 -664 194 -716 -251 301 -210 224 138 -192 -119 -28 -204 -225 -41 322 -101 242
2136B42m8p15Q82l10l06Q70n59LM95o41M31K2n82M30J7k1K68k55P5j51K05l09
$$ 242 194 -521 361 51 -255 615 56 59 554 -87 344 366 -216 214 231 210 478 223 298 147 352 43
2158D3q3M45m67L8P97j103K48M25r22O72O8o78J017j36q11M87K02p54M06K79l25
$$ 43 -40 405 -62 -24 773 -330 -82 343 -579 93 161 -517 500 364 -447 40 242 -512 -106 173 -152
2179a52Q8K64o61j31Q36q60J14P59j049Q07L42j165M03N88p25M75P9k99L91l7
$$ -152 -64 200 -461 -592 244 -616 -502 257 -792 15 357 -808 -405 183 -542 -67 12 -287 104 67
2199F7l00j37N96k28l42O53o20rQ67r37P24K58j084N97L42q70P72L1o10M37j66
$$ 67 -233 -370 226 -2 -344 309 -311 -320 547 -390 334 592 -492 105 447 -423 349 380 -230 207 41
2220D1Q0r1L35k64nM33j66k91M57n81M8K71n80P91k68n15O48k26m06P61n23J38
$$ 41 121 30 365 101 96 529 363 72 529 -52 -4 267 -313 478 210 -305 343 117 -289 472 -51 87
2242H7N6j90K46k82Qj02M5K30n78N52J1o27O81j93p77P29Q2q86J146l87r7M11
$$ 87 143 -47 199 -83 -75 -177 -132 98 -480 72 83 -544 137 -56 -833 -104 -22 -908 238 -149 -246 165
2264A65n30K45n6l7K56k76J26m96L43L68m53K19J33k40O16j31k92N62p42K5K77
$$ 165 -365 -120 -176 -213 43 -233 -107 -603 -260 108 -345 -126 7 -233 383 252 -40 522 -220 -195 82
2285H2j94N7L33k45M9J46l1K98l53K27l00J05K83l55R2k64o8N28o78L7N85n81
$$ 82 -112 -55 278 33 82 228 197 495 142 369 69 174 457 102 194 -70 -138 390 -288 -251 334 -247
2307b47O33J40m92NL6k01K58l7p5j17l1J86j5J48j25n45O90l75M4L33l89l40P34
$$ -247 386 526 34 39 75 -126 132 95 20 -97 -128 58 43 191 66 -479 211 -164 -120 213 -176 -516 218
2330B18n91K13O8j85K54r7O6j41J57k93l1J97J5l14O35m37j62M41j2k94M95k69
$$ 218 -373 -160 -92 -277 -23 -120 -54 -195 -38 -331 -362 -165 -150 -464 171 -266 -428 13 1 -293 202 -67
2352f7mJ11l00P3L3K52qj16L74m64N03J03q12P01l04l73O71k76P8J94m95N57m70
$$ -67 -71 40 -260 -187 -154 98 90 -26 348 -116 387 490 -322 379 75 -298 373 97 175 369 -126 431 -39
2375c9J58K45m00L21K77n88M62m85J04Q7k98N89k51k07M70n21k8L21k08j45J05
$$ -39 119 364 -36 285 562 -26 436 -49 55 142 -156 433 182 -25 445 -76 -104 217 9 -136 -31
2396c1o39N52M52p96L16J42M6p1j03j23Q2k4J55m00N06m31R9L39n21K12L17k24
$$ -31 -670 -118 334 -462 -146 -4 42 -29 -132 -255 -173 -197 -42 -442 64 -367 -268 71 -450 -238 79 -145
2418a45q4K08l33K75K66l77J12j59J8L79j66Q8N8k19J51k4R2p9N7P4k86K47J30
$$ -145 -229 -21 -354 -79 187 -190 -78 -237 -219 160 -6 82 140 -79 72 48 140 61 118 192 -94 153 283
2441B83k61K01n5m1n0R4P4O0r5k34K20J84l75L10q5k69M76j6n50M66j97n72O40
$$ 283 22 223 168 127 77 171 245 305 210 -24 196 380 5 315 230 -39 437 421 -129 337 140 -432 208
2464B08l13j8M74n30J11K71j78j47j45J93k67K22j7l74M90J13o35N07K52n77N60
$$ 208 -105 -123 351 -179 -68 203 25 -122 -267 -74 -341 -119 -136 -510 -20 93 -542 -35 217 -360 200
2485B00l17m06P11n25N3L88m38J24L31k01j64p6M08k67K27J75n56J11K74n09N69
$$ 200 -117 -523 188 -337 -284 104 -334 -210 121 -80 -244 -320 88 -179 48 223 -333 -222 52 -457 112
2506A12M7n76O75k97J40J43M5j90K91n38N47k08k36L00K30n46N20j43O2k11J16
$$ 112 159 -417 258 -39 101 244 289 99 390 -148 399 191 -45 255 485 -61 459 316 378 167 283
2527B83n2k21N60n73j37M25j10m68N33m11N5O28o15J19N50q93J94J33k81N2L38
$$ 283 231 10 570 -3 -140 285 175 -293 240 -171 -116 512 -103 16 566 -327 -133 0 -281 -229 109
2548A09Qm41L25k68K34K58m73l17O80o27K26K98l50o9N13l83J71J18oj13%j09
$$ 109 117 -324 1 -267 -33 225 -248 -565 115 -512 -286 12 -338 -407 106 -277 -106 12 6 -107 -107 -216
2570b16k06M09j78n6K92m6k1K78m12L24J88j97k37L80k52PQ9k43J86l7k26L79
$$ -216 -422 -13 -191 -247 45 -1 -22 256 -156 168 356 159 -78 302 50 57 146 -97 89 52 -174 205
2592B05J43J1n4k2j75K5j36j26M46K53m09K33l21o1L25l44l2J05J27k59K11k11
$$ 205 348 359 305 283 108 133 -3 -129 317 570 161 394 73 12 337 -7 -39 66 193 -66 145 -66
2614f6P1m8J48k27K83n9l67L81p2m12K31k0l50L85J65m49K85J78k61L27jk24j98
$$ -66 5 -43 105 -122 161 102 -265 116 44 -368 -137 -157 -507 -122 43 -406 -121 57 -204 123 122 -102 -300
2637c00L41o8p7J69m06L59P5l14K23K6m45O23o5j26j8j92J7K37j92J50K41J00
$$ -300 41 -27 -104 65 -341 18 93 -221 2 28 -417 206 141 15 -3 -195 -178 59 -133 17 258 358
2659C58k56J63k07pJ19J01l42L79k51j05K49P8l67L96j30k23M24j65N1j39k32
$$ 358 102 265 58 51 170 271 -71 308 57 -48 201 279 -88 308 178 -45 379 214 265 126 -106
2680a06q8j33K75J43KJ98k39J50j00l10K21j53k42L86Oj75J62q4r2K38J21l13
$$ -106 -194 -327 -52 91 93 291 52 202 102 -208 13 -140 -382 4 10 -165 -3 -87 -179 59 180 -133
2702a33K91j25j72pJ04l05Q0R4l3Q2J11k85M60q5l99N04k51l27M70p4o8J56J49
$$ -133 158 33 -139 -146 -42 -347 -267 -173 -206 -124 -13 -298 162 77 -322 182 -69 -396 74 0 -68 88 237
2725B37l58Q4J07Rj23P19l24m41K84k94K74j23j40L26n6J93j5r6pP9m36O6J50
$$ 237 -121 -37 70 79 -44 675 351 -90 194 -100 174 51 -89 237 181 374 359 263 256 335 -101 -35 115
2748A15O5P2k04O0j54J99j77K76n8n1j40K68l27l42L90n16R4O89l4j64K63m53
$$ 115 180 252 48 108 -46 153 -24 252 194 143 3 271 -56 -398 -8 -524 -430 259 225 61 324 -129
2770a29M2J78l33J4J60j24l63M38r7k2K29L8k83M11j11l31K98j60j38j4j51K03
$$ -129 -87 91 -242 -228 -68 -192 -555 -117 -214 -236 -7 31 -252 159 48 -283 15 -145 -283 -297 -448 -245
2792b45K48q1NL48j47m29N09j34j81M75l53NN7q3n4J29K0j9Q8O5J71P7m28J2j46
$$ -245 3 -78 -73 275 128 -301 208 74 -107 368 15 20 77 -6 -60 69 89 70 158 223 394 471 43 55 -91
2817i1K07M8j08QK60R4l6m28L11m88K36j94j56O29j82j71J59p7j59Q8M03k64Q8
$$ -91 116 164 56 64 324 418 382 -46 265 -223 13 -181 -337 292 110 -61 98 21 -138 -50 353 89 177
2840A77l2l19M2P7k35K77j2l76L47K39l12k38N74o76M6K21o2L67l22R3k78O30
$$ 177 145 -174 -132 -55 -290 -13 -25 -401 -54 185 -127 -365 209 -467 -421 -200 -262 105 -217 -124 -402 228
2862B28n93J0L71m3o2K19k24k25M87l69j80J6M15o2K64J0k0r6j01P9O3j14J43
$$ 228 -365 -355 16 -27 -89 130 -94 -319 168 -201 -381 -365 50 -12 252 262 242 146 45 124 187 73 216
2885B16p4O5J46k94rj3J26m0m8MJ14L7Pj85k3K48k56K82l3l88L37j55j61J05O0
$$ 216 142 207 353 59 50 37 163 123 75 79 193 230 237 52 29 277 21 303 270 -118 219 64 -97 8 68
2910F8p6P5n3j90l7L44l11M4L5l57M24P4k8j21M8l04J40m1J17j07K39l4J77N2
$$ 68 -8 67 14 -176 -213 131 -180 -136 -101 -458 -34 40 12 -109 -61 -365 -225 -266 -149 -256 -17 -51 126 178
2934A78k24r0m5j11J42k0J70J24O5l15m3J73k75K81J09k99J86K7O6n6j43L30n7
$$ 178 -46 -136 -181 -292 -150 -170 0 124 189 -126 -169 4 -271 10 119 -180 6 33 99 43 -100 230 173
2957A73K46j64J6k12J2r7J20k57J83M5K15k45K44K0k25j6P3J97k35J25nN9k29
$$ 173 419 255 271 59 71 -26 94 -163 20 65 280 35 279 299 74 58 131 328 93 218 213 272 43
2980D3n1k29L31J90l43N1K12k26R2k05k81L88J33l36K26O0J2j49J03K3m22J37
$$ 43 -8 -237 94 284 -59 -8 204 -22 70 -135 -416 -28 105 -231 -5 55 67 -82 21 44 -378 -241
3002b41Q8L2k2O5k74M60j67k92J21K08M2KJ42k81J53k91R8r6J80J03k59M37o2
$$ -241 -153 -121 -143 -78 -352 108 -59 -351 -230 -22 20 22 164 -117 36 -255 -157 -253 -73 30 -229 208 146
3025A46N5j82LK88j59j70K08j4k54J71m0j17K16N8Q9j96j4K38k20k54L54k56J71
$$ 146 201 19 22 310 151 -19 189 175 -79 92 52 -65 151 209 298 102 88 326 106 -148 206 -50 121
3048A21K28l95K86k07j51P3N8j45M7N2L67l71J66K2n75L74J2k53J05N82n33K67
$$ 121 349 -46 240 33 -118 -45 13 -132 -85 -33 334 -37 129 151 -424 -50 -38 -291 -186 396 -137 130
3070A30Kl16j3OM6O3L43m17J20kJ33l53J62J12l77N43k30m1o4J24j8j47L14k19
$$ 130 132 -184 -197 -191 -145 -82 261 -156 -36 -38 95 -258 -96 16 -361 182 -48 -89 -153 -29 -47 -194 120 -99
3094i9K09r5J07J8l06J70mk10L91m6j65K68p1p2P6p9q6P7o0K51Q3k99j02l0L61
$$ -99 110 15 122 140 -166 4 0 -210 181 135 -30 238 167 95 171 92 6 83 23 274 357 58 -44 -74 287
3119B87k46P4J05k28K78j96l5j43J19m09N28J7j13R5j42O2k41Lj09L78j18o9K67
$$ 287 41 115 220 -8 270 74 39 -104 15 -394 134 151 38 133 -9 53 -188 -185 -294 84 -34 -103 164
3142A64k72j71J67M3j83K78k02J03J92j18j15m6k34kL25q3J08K15l3j55K1k5j17
$$ 164 -108 -279 -112 -69 -252 26 -176 -73 119 1 -114 -160 -394 -396 -71 -154 -46 169 136 -19 2 -23 -140
3165a40l0J71l4J5R9j36K54j83k6J30n7L20l12N3m3r7k9r2J31J11J76k5q0J00
$$ -140 -170 1 -33 -18 81 -55 199 16 -10 120 63 383 71 124 81 -16 -45 -137 -6 105 281 256 176 276
3189B76J18o9k12j58P5k7L9rJ53M2n23L11n9K48J03M3m0j49k35L5O6j60L4J61
$$ 276 394 325 113 -45 30 3 42 33 186 228 -295 16 -43 205 308 351 311 162 -73 -38 28 -132 -98 63
3213F3K14m08J42j77J08l28K49P1k34J83j89K47%k16j40L69j95J05K68k65j72
$$ 63 277 -131 11 -166 -58 -386 -137 -66 -300 -117 -306 -59 -59 -275 -415 -46 -241 -136 132 -133 -305
$$ [...]
8191a3
##END NTUPLES=NMR FID
##END=
