##TITLE=1H_L3L30-SeO2-7d-f13
 CDCl3,8 sc, 
 2.03.2021
##JCAMPDX= 6.0         $$ Bruker NMR JCAMP-DX V2.0
##DATA TYPE= NMR FID
##DATA CLASS= NTUPLES
##ORIGIN= UXNMR, Bruker Analytische Messtechnik GmbH
##OWNER= root
$$ XWIN-NMR		Version 3.5
$$ Tue Mar  2 10:05:13 2021 Russian Standard Time (UT+4h)  she@DPX200
##.OBSERVE FREQUENCY= 200.1315066352
##.OBSERVE NUCLEUS= ^1H
##.DELAY= (6, 6)
##.ACQUISITION MODE= SIMULTANEOUS
##.ACQUISITION SCHEME= undefined
##.AVERAGES= 8
##.DIGITISER RES= 18
##SPECTROMETER/DATA SYSTEM= spect
##.PULSE SEQUENCE= zg30
##.SOLVENT NAME= CDCl3
##.SHIFT REFERENCE= (INTERNAL, CDCl3, 0, 15.7039)
##AUDIT TRAIL= $$ (NUMBER, WHEN, WHO, WHERE, WHAT)
$$ ##TITLE= Audit trail, XWIN-NMR		Version 3.5
$$ ##JCAMPDX= 5.01
$$ ##ORIGIN= Bruker BioSpin GmbH
$$ ##OWNER= she
$$ F:/spectra/data/she/nmr/H-F/1/audita.txt
$$ ##AUDIT TRAIL=  $$ (NUMBER, WHEN, WHO, WHERE, WHAT)
(   1,<2021-03-02 10:04:02.35 +0400>,<she>,<DPX200>,
      <created by zg, POWCHK disabled, PULCHK disabled
       configuration hash MD5:
       00 E9 B6 7A A2 85 ED C7 34 08 36 98 17 FE 4E 26
       data hash MD5: 16K
       0B BA 59 76 56 7D C7 F9 9F 53 D9 69 49 11 72 0F>)
$$ ##END=
$$ 
$$ hash MD5
$$ 95 C3 6D CE 53 C8 4D C9 81 50 13 12 3F 79 A4 50
##$RELAX= 
##$RELAX= 
##$RELAX= 
##$RELAX= 
##$RELAX= 
##$RELAX= 
$$ Bruker specific parameters
$$ --------------------------
##$DU= <F:/spectra>
##$EXPNO= 1
##$NAME= <H-F>
##$PROCNO= 1
##$TYPE= <nmr>
##$USER= <she>
##$AMP= (0..31)
100 100 100 100 100 100 100 100 100 100 100 100 100 100 100 100 100 100 
100 100 100 100 100 100 100 100 100 100 100 100 100 100 
##$AQSEQ= 0
##$AQ_mod= 1
##$AUNM= <au_zg>
##$AUTOPOS= <>
##$BF1= 200.13
##$BF2= 200.13
##$BF3= 200.13
##$BF4= 200.13
##$BF5= 200.13
##$BF6= 200.13
##$BF7= 200.13
##$BF8= 200.13
##$BYTORDA= 1
##$CFDGTYP= 0
##$CFRGTYP= 5
##$CHEMSTR= <none>
##$CNST= (0..31)
1 1 145 1 1 1 1 1 1 1 1 1 1 1 1 1 1 1 1 1 1 1 1 1 1 1 1 1 1 1 1 1 
##$CPDPRG= <>
##$CPDPRG1= <>
##$CPDPRG2= <>
##$CPDPRG3= <>
##$CPDPRG4= <mlev>
##$CPDPRG5= <mlev>
##$CPDPRG6= <mlev>
##$CPDPRG7= <mlev>
##$CPDPRG8= <mlev>
##$CPDPRGB= <>
##$CPDPRGT= <>
##$D= (0..31)
0 1.2 0 0 0 0 0 0 0 0.06 0 0.03 0 0 0 0 0.0002 0 0 0 0 0 0 0 0 0 0 0 0 
0 0 0 
##$DATE= 1614665041
##$DBL= (0..7)
120 120 120 120 120 120 120 120 
##$DBP= (0..7)
150 150 150 150 150 150 150 150 
##$DBP07= 0
##$DBPNAM0= <>
##$DBPNAM1= <>
##$DBPNAM2= <>
##$DBPNAM3= <>
##$DBPNAM4= <>
##$DBPNAM5= <>
##$DBPNAM6= <>
##$DBPNAM7= <>
##$DBPOAL= (0..7)
0.5 0.5 0.5 0.5 0.5 0.5 0.5 0.5 
##$DBPOFFS= (0..7)
0 0 0 0 0 0 0 0 
##$DE= 6
##$DECBNUC= <off>
##$DECIM= 32
##$DECNUC= <off>
##$DECSTAT= 4
##$DIGMOD= 1
##$DIGTYP= 9
##$DL= (0..7)
0 120 120 120 120 120 120 120 
##$DP= (0..7)
150 150 150 150 150 150 150 150 
##$DP07= 0
##$DPNAME0= <>
##$DPNAME1= <>
##$DPNAME2= <>
##$DPNAME3= <>
##$DPNAME4= <>
##$DPNAME5= <>
##$DPNAME6= <>
##$DPNAME7= <>
##$DPOAL= (0..7)
0.5 0.5 0.5 0.5 0.5 0.5 0.5 0.5 
##$DPOFFS= (0..7)
0 0 0 0 0 0 0 0 
##$DQDMODE= 0
##$DR= 18
##$DS= 0
$$ [...]
##$SUBNAM2= <"">
##$SUBNAM3= <"">
##$SUBNAM4= <"">
##$SUBNAM5= <"">
##$SUBNAM6= <"">
##$SUBNAM7= <"">
##$SUBNAM8= <"">
##$SUBNAM9= <"">
##$SW= 16.9725356469052
##$SWIBOX= (0..15)
0 0 2 0 0 0 0 0 0 0 0 0 0 0 0 0 
##$SW_h= 3396.73913043478
##$TD= 16384
##$TD0= 1
##$TE= 0
##$TE2= 300
##$TE3= 300
##$TEG= 300
##$TL= (0..7)
0 120 120 120 120 120 120 120 
##$TP= (0..7)
150 150 150 150 150 150 150 150 
##$TP07= 0
##$TPNAME0= <>
##$TPNAME1= <>
##$TPNAME2= <>
##$TPNAME3= <>
##$TPNAME4= <>
##$TPNAME5= <>
##$TPNAME6= <>
##$TPNAME7= <>
##$TPOAL= (0..7)
0.5 0.5 0.5 0.5 0.5 0.5 0.5 0.5 
##$TPOFFS= (0..7)
0 0 0 0 0 0 0 0 
##$TUNHIN= 0
##$TUNHOUT= 0
##$TUNXOUT= 0
##$USERA1= <user>
##$USERA2= <user>
##$USERA3= <user>
##$USERA4= <user>
##$USERA5= <user>
##$V9= 5
##$VALIST= <valist>
##$VCLIST= <CCCCCCCCCCCCCCC>
##$VD= 0
##$VDLIST= <DDDDDDDDDDDDDDD>
##$VPLIST= <PPPPPPPPPPPPPPP>
##$VTLIST= <TTTTTTTTTTTTTTT>
##$WBST= 1024
##$WBSW= 4
##$XGAIN= (0..3)
0 0 0 0 
##$XL= 0
##$YL= 0
##$YMAX_a= 109275
##$YMIN_a= -126901
##$ZGOPTNS= <>
##$ZL1= 120
##$ZL2= 120
##$ZL3= 120
##$ZL4= 120
##$ABSF1= 10
##$ABSF2= 0
##$ABSG= 5
##$ABSL= 3
##$ALPHA= 0
##$AQORDER= 0
##$ASSFAC= 0
##$ASSFACI= 0
##$ASSFACX= 0
##$ASSWID= 0
##$AUNMP= <proc_1d>
##$AZFE= 0.1
##$AZFW= 0.1
##$BCFW= 1
##$BC_mod= 2
##$BYTORDP= 1
##$COROFFS= 0
##$CY= 11.3945322036743
##$DATMOD= 1
##$DC= 2
##$DFILT= <>
##$DTYPP= 0
##$F1P= 15.9154993809931
##$F2P= -4.1035820241983
##$FCOR= 0.5
##$FTSIZE= 0
##$FT_mod= 4
##$GAMMA= 1
##$GB= 0.15
##$INTBC= 1
##$INTSCL= 1
##$ISEN= 128
##$LB= 0.24
##$LEV0= 0
##$LPBIN= 0
##$MAXI= 10000
##$MC2= 0
##$MEAN= 0
##$ME_mod= 0
##$MI= 1.114404
##$NCOEF= 0
##$NC_proc= 0
##$NLEV= 6
##$NOISF1= 3.799351
##$NOISF2= 2.8
##$NSP= 1
##$NTH_PI= 0
##$NZP= 0
##$OFFSET= 15.70392
##$PC= 1
##$PHC0= -10762.3
##$PHC1= 14.00094
##$PH_mod= 1
##$PKNL= yes
##$PPARMOD= 0
##$PSCAL= 0
##$PSIGN= 0
##$REVERSE= no
##$SF= 200.130013532006
##$SI= 16384
##$SIGF1= 3
##$SIGF2= 2
##$SINO= 400
##$SIOLD= 16384
##$SREGLST= <1H.CDCl3>
##$SSB= 0
##$STSI= 0
##$STSR= 0
##$SW_p= 3612.71676300578
##$SYMM= 0
##$S_DEV= 0
##$TDeff= 0
##$TDoff= 0
##$TI= <>
##$TILT= no
##$TM1= 0
##$TM2= 0
##$TOPLEV= 0
##$USERP1= <user>
##$USERP2= <user>
##$USERP3= <user>
##$USERP4= <user>
##$USERP5= <user>
##$WDW= 1
##$XDIM= 8192
##$YMAX_p= 0
##$YMIN_p= 0
$$ End of Bruker specific parameters
$$ ---------------------------------
##NTUPLES= NMR FID
##VAR_NAME=  TIME,          FID/REAL,        FID/IMAG
##SYMBOL=    X,             R,               I
##VAR_TYPE=  INDEPENDENT,   DEPENDENT,       DEPENDENT
##VAR_FORM=  AFFN,          ASDF,            ASDF
##VAR_DIM=   8192,          8192,            8192
##UNITS=     SECONDS,       ARBITRARY UNITS, ARBITRARY UNITS
##FACTOR=    0.0002944,     1,               1
##FIRST=     0,             0,               0
##LAST=      2.4114304,     0,               0
##MIN=       0,             -126901,         0
##MAX=       2.4114304,     109275,          0
$$ Real data points
##PAGE= N=1
##DATA TABLE= (X++(R..R)), XYDATA
$$ plain form
0 0 0 0 0 0 0 0 0 0 0 0 0 0 -8 8 -8 8 -8 16 -16 16 -24 24 -32 36 -40 48 -56 64 -73 87 -96 112 -127 143 -160
35 -160 182 -202 227 -254 281 -313 348 -385 427 -470 519 -573 631 -694 766 -843 929 -1024
53 -1024 1130 -1251 1387 -1542 1721 -1931 2179 -2484 2860 -3339 3974 -4855 6158 -8277 12271
68 12271 -22257 95900 109275 -126901 95733 16188 -88260 83906 -12005 -62298 63400
79 63400 -23370 -12222 63710 -7807 -32010 32997 15989 -23000 28195 31631 -26961 22892
91 22892 737 -45770 26648 -6300 -30185 38545 -8858 6377 47657 -21873 -5785 521
103 521 -35837 15780 2924 -26749 929 -5092 8474 3977 -18626 1238 -11648 -351 18456
116 18456 -12359 978 -15189 -27078 20409 -27330 -30549 36414 -15185 -8177 36716 -19201
$$ packed form
0@%%%%%%%%%%%%qJ6j6J6j6K4l2L2m0M8n6O8p6Q8j04J20j37J60j83K08k39K70l03
35a60L42l84M29m81N35n94O61p33Q12q97R89j092J204j325J460j609J772j953
53a024K154k381K638k929L263l652M110m663N344o199P313q829J1013j4435K0548
68A2271l4528J18157J3375k36176K22634p9545j04448J72166r5911n0293J25698
79F3400q6770J1148P5932p1517k4203O5007j7008l8989N1195L436n8592M9853
91B2892k2155m6507P2418l2948k3885O8730m7403J5235M1280o9530J6088O306
103E21l6358N1617j2856k9673K7678o021J3566m497k2603J9864j2886J1297J8807
116A8456l0815J3337j6167j1889M7487m7739l219O6963n1599P008M4893n5917
$$ plain form
128 -19201 -1732 13825 -37361 -1659 11832 -26252 11322 20496 -26973 749 31722 -15437
140 -15437 -8659 25653 -15986 5183 37986 -28555 -6179 23291 -35212 14338 29890 -33130
152 -33130 25636 30345 -19359 27941 4627 -29047 18795 244 -13115 17466 3030 -1865
164 -1865 10692 3806 -2547 4108 9745 -3615 4296 10570 -13181 5218 2666 -29114 4076 5057
178 5057 -11702 19864 1362 -8763 15330 -8429 -10460 -1604 -18401 -6077 2678 -1422 -3790
191 -3790 -6998 3058 -7641 -3768 9322 -15669 3113 12977 -22889 5911 -569 -31748 11496
204 11496 -4667 -17739 26398 -1501 -3693 20048 -14138 -3321 7687 -13934 -825 1635
216 1635 -552 5299 3325 5827 -5112 4479 11916 -5566 13819 6192 -9081 19046 -7040 -11881
$$ packed form
128a9201J7469J5557n1186L5702J3491l8084L7574R174m7469K7722L0973m7159
140a5437O778L4312m1639K1169L2803o6541K2376K9470n8503M9550J5552o3020
152c3130N8766M709m9704M7300k3314l3674M7842j8551j3359L0581j4436m895
164a865J2557o886o353O655N637j3360P911O274k3751J8399k552l1780L3190R81
178E057j6759L1566j8502j0125K4093k3759k031Q856j6797J2324Q755m100k368
191c790l208J0056j0699L873J3090k4991J8782R864l5866K8800o480l1179M3244
204A1496j6163j3072M4137k7899k192K3741l4186J0817J1008k1621J3109K460
216A635k187N851j974K502j0939R591P437j7482J9385p627j5273K8127k6086m841
$$ plain form
230 -11881 16152 -15477 2820 24186 -8703 15137 14968 -9901 11228 -3362 -9850 7331 -5848
243 -5848 1849 5611 -979 6477 -3038 2591 1450 -9641 11786 520 -9004 11729 -11910 -9903
257 -9903 7069 -17753 -1555 6691 -10744 11704 4324 -9862 4024 -8740 -9620 -3357 -8742
270 -8742 -677 -4325 28 3732 -8803 3386 -2247 -9517 9944 -6281 -3449 11720 -14100 -465
284 -465 4589 -18610 6683 3974 -7803 16782 2516 -1603 11401 -6640 -2813 2655 -5450 2108
298 2108 3709 5521 3029 2023 9147 -3829 2710 11355 -7478 9920 9453 -11831 11950 -266
312 -266 -14029 14017 -2946 -4449 18415 -1161 2267 10455 -6152 -1735 -759 -4565 -2251 -851
326 -851 4038 -4287 1575 6197 -11985 3743 5685 -14964 9108 2718 -15149 8139 -7450 -14192
$$ packed form
230a1881K8033l1629J8297K1366l2889K3840j69k4869K1129j4590o488J7181j3179
243e848P697L762o590P456r515N629j141j1091K1427j1266r524K0733k3639K007
257i903J6972k4822J6198Q246j7435K2448p380j4186J3886j2764q80O263n385
270h742Q065l648M353L704j2535J2189n633p270J9461j6225K832J5169k5820J3635
284d65N054k3199K5293k709j1777K4585j4266m119J3004j8041L827N468q105P558
298B108J601J812k492j006P124j2976O539Q645j8833J7398m67k1284K3781j2216
312b66j3763K8046j6963j503K2864j9576L428Q188j6607M417R76l806K314J400
326h51M889q325N862M622j8182J5728J942k0649K4072o390j7867K3288j5589o742
$$ plain form
340 -14192 5629 -8928 -4425 7410 -4791 2035 3078 -4663 -3609 -5904 -2819 -6379 -3316 4211
354 4211 -7011 1607 5043 -9094 5289 300 -6623 12493 -4503 -3543 12058 -12177 -1381
367 -1381 8228 -12527 5499 8551 -2942 11812 3913 -2033 6733 -1094 -3012 1361 3227 183
381 183 365 11145 -1987 -2241 13704 -6094 289 14112 -9159 6226 9696 -14231 6548 1676
395 1676 -13296 10181 908 -5396 11592 751 -2365 2007 -3840 -4333 -4428 138 -3432 -4019 7128
410 7128 -5438 -3594 6868 -12232 275 6990 -14618 5657 2921 -15400 6502 -4710 -14091
423 -14091 6330 -3825 -2843 6800 -3765 699 2310 -4122 -4062 -3912 -155 -3921 1680 6772 -7678
438 -7678 4555 6854 -9769 8516 1512 -9068 15116 -1297 -6251 13143 -8064 -3159 10721
$$ packed form
340a4192J9821j4557M503J1835j2201O826J043p741J054k295L085l560L063P527
354D211j1222Q618L436j4137J4383m989o923J9116j6996R60J5601k4235J0796
367a381R609k0755J8026L052j1493J4754p899n946Q766p827j918M373J866l044
381A83J82J0780j3132k54J5945j9798O383J3823k3271J5385L470k3927K0779m872
395A676j4972K3477r273o304J6988j0841l116M372n847m93r5M566l570n87J1147
410G128j2566J844J0462j9100J2507O715k1608K0275k736j8321K1902j1212r381
423a4091K0421j0155R82R643j0565M464J611o432O0J50L757l766N601N092j4450
438g678J2233K299j6623J8285p004j0580K4184j6413m954J9394k1207M905J3880
$$ plain form
451 10721 -7003 4225 10484 -1387 6723 4623 -2160 1187 1808 -65 -4037 4867 5726 -2839 8241
466 8241 713 -6793 9845 -1788 -3103 9814 -7887 -122 9780 -10431 -1424 2334 -8896 3532
480 3532 3584 -2634 2864 -751 -2265 -1571 -3504 -4151 -4410 890 -3648 -2925 5985 -6563 -4028 5665
496 5665 -10880 -186 7845 -10921 1481 1611 -10742 5865 -2510 -10337 5962 -1942 -1477 9171
510 9171 -1429 -3791 1483 612 -2293 -1887 2817 -2668 733 8232 -2600 2439 4580 -6191 8049
525 8049 3741 -5710 11253 -227 -6408 8553 -1632 -831 5522 -1515 3989 4550 2264 5450 -1710
540 -1710 -1807 -238 1010 3452 -4241 2152 4295 -5919 7414 3121 -10261 5039 -475 -4144 7488
555 7488 -6591 -3349 4067 -9607 766 3304 -8208 1601 2247 -2789 435 -1201 -2350 -5784
$$ packed form
451A0721j7724J1228O259j1871Q110k100o783L347O21j873l972Q904Q59q565J1080
466H241p528p506J6638j1633j315J2917j7701P765R902k0211R007L758j1230J2428
480C532N2o218N498l615j514O94j933o47k59N300m538P23Q910j2548K535R693
496E665j6545J0694Q031j8766J2402J30j2353J6607q375p827J6299p904M65J0648
510I171j0600k362N274q71k905M06M704n485L401P499j0832N039K141j0771J4240
525H049m308r451J6963j1480o181J4961j0185Q01O353p037N504N61k286L186p160
540a710r7J569J248K442p693O393K143j0214J3333m293j3382J5300n514l669J1632
555G488j4079L242P416j3674J0373K538j1512R809O46n036L224j636j149l434
$$ plain form
569 -5784 -3915 538 -3644 1129 -1418 -5186 4247 -3500 -1900 5506 -9863 -694 7656 -6375 2197
584 2197 423 -7594 3652 -932 187 5034 -4553 3606 4853 -2672 3428 -1701 -1062 2405 -2493
599 -2493 6067 3053 -3022 7124 44 -1144 6520 -962 1876 2153 -1819 6592 1157 -1983 2946
614 2946 -2467 1664 4181 645 3151 -2126 1368 3786 -3813 1160 -1606 -4518 4891 -1537 -464
629 -464 3489 -7548 1542 2621 -8102 3656 -340 -7101 4488 -2481 -4567 1997 -5312 -2418
643 -2418 601 -3099 1116 -507 -1620 -2292 -2881 1521 -3962 -2824 2414 -5071 1285 4163 -5535 1371
659 1371 -245 -4186 5006 -1209 -1717 3648 -2225 1273 2019 -1740 1874 -1055 2574 3764 -1306 5138
675 5138 650 -2023 6344 -2760 381 6145 -4229 3787 4878 -3527 5876 931 -3133 5704 -353
$$ packed form
569e784J869M453m182M773k547l768R433p747J600P406j5369R169Q350j4031Q572
584B197j774q017J1246m584J119M847r587Q159J247p525O100n129O39L467m898
599b493Q560l014o075J0146p080j188P664p482K838K77l972Q411n435l140M929
614B946n413M131K517l536K506n277L494K418p599M973k766k912R409o428J073
629d64L953j1037R090J079j0723J1758l996o761J1589o969k086O564p309K894
643b418L019l700M215j623j113o72n89M402n483J138N238p485O356K878r698O906
659A371j616l941R192o215n08N365n873L498P46l759L614k929L629J190n070O444
675E138m488k673Q367r104L141N764j0374Q016J091q405R403m945m064Q837o057
$$ plain form
690 -353 94 4288 -1810 383 1567 -528 535 -722 740 -649 412 2565 -3090 305 449 -5433
706 -5433 3068 -1437 -5208 4740 -3789 -3361 4791 -6408 -1662 2673 -6651 1434 528 -5545 1893
721 1893 -2110 -3581 954 -2613 -1063 -937 -817 706 -2582 1393 -523 -3925 3134 -1977 -2175 4802
737 4802 -3113 256 3986 -3730 2738 2039 -3167 3700 1177 -103 3186 -137 1632 902 1089 2962
753 2962 -959 3023 1909 -1477 5747 -1137 -1097 6968 -3957 1193 6315 -5408 4041 3716 -5629
768 -5629 5511 459 -4191 5282 -1692 -2012 3485 -1761 -811 1008 -414 -1944 -936 1336 -3677
783 -3677 -1104 2102 -5667 1083 1330 -7201 3562 -837 -6943 5214 -3253 -5055 4928 -5125 -2216
798 -2216 3060 -5060 538 1054 -3760 1207 -787 -1300 118 -858 595 -1960 939 1970 -3543 2978
$$ packed form
690c53M47M194o098K193J184k095J063j257J462j389J061K153n655L395J44n882
706e433Q501m505l771R948q529M28Q152j1199M746M335r324Q085r06o073P438
721A893m003j471M535l567J550J26J20J523l288L975j916l402P059n111j98O977
737D802p915L369L730p716O468o99n206O867k523j280L289l323J769p30J87J873
753B962l921L982j114l386P224o884M0Q065j0925N150N122j1723R449l25r345
768e629J1140n052m650R473o974l20N497n246R50J819j422j530J008K272n013
783c677K573L206p769O750K47q531J0763m399o106J2157q467j802R983j0053K909
798b216N276q120N598N16m814M967j994n13J418r76J453k555K899J031n513O521
$$ plain form
814 2978 1276 -3197 5025 -914 -1701 5497 -2939 735 5038 -3693 2533 3674 -2542 3014 1931
829 1931 107 2240 970 1735 402 1062 1455 -1057 2776 70 -1340 5321 -1990 -659 6015 -3873
845 -3873 525 4695 -5115 1477 2392 -5058 2528 -7 -3707 3431 -1137 -2554 2274 -1435 -2189 355
861 355 -548 -2594 -1653 719 -2744 -2019 1421 -3362 -159 1090 -4098 1495 -61 -4908 2999 -1810
877 -1810 -4062 3239 -2795 -1699 2075 -2325 797 470 -1337 2126 -365 226 1000 -1106 1144 -900
893 -900 479 2796 -2188 2530 2673 -2336 4418 1119 -1924 4542 -990 -285 4000 -2051 1515 2816
909 2816 -1418 2146 1611 -23 1314 639 1762 -805 421 1999 -2750 1715 1049 -3152 3471 -833
925 -833 -2099 4454 -3157 -1248 2981 -4976 26 1301 -4416 1450 -869 -2758 1174 -1975 -766
$$ packed form
814B978j702m473Q222n939p87P198q436L674M303q731O226J141o216N556j083
829A931j824K133j270P65j333O60L93k512L833k706j410O661p311J331O674r888
845c873M398M170r810O592R15p450P586k535l700P138m568j417M828l709p54K544
861C55r03k046R41K372l463P25L440m783L203J249n188N593j556m847P907m809
877a810k252P301o034J096L774m400L122l27j807L463k491N91P74k106K250k044
893i00J379K317m984M718J43n009O754l299l043O466n532P05M285o051L566J301
909B816m234L564n35j634J337o75J123k567J226J578m749M465o66m201O623m304
925h33j266O553p611J909M229p957N002J275n717N866k319j889L932l149J209
$$ plain form
940 -766 130 -2004 -151 -1817 -1032 -511 -3438 25 -1763 -2415 2217 -2242 -593 2415 -3484 597
956 597 656 -3214 1224 -1173 -1131 2020 -1735 598 1304 -1185 2242 -116 57 2450 -763 1874 726
973 726 -1678 3173 -843 346 3991 -1581 2440 3441 -1147 3011 219 -1427 3221 -1066 -135 2854
989 2854 -789 1259 1309 235 1217 -892 1677 694 -1325 1724 -925 -1367 713 -2423 442 386 -2673
1006 -2673 2705 -182 -2940 2184 -1999 -2121 -193 -3554 182 -599 -3008 1514 -1994 -1807 1682 -1947
1022 -1947 -416 -352 -1722 1167 -1843 -1181 636 -3564 42 963 -1623 2199 -214 97 2310 -2141
1038 -2141 850 552 -2874 1692 430 -374 1793 -127 1838 650 -356 3577 -74 29 2994 -1079
1054 -1079 1673 1111 -1835 2922 -430 -821 5264 -359 429 3141 -1228 1106 780 -1514 1118 -1249
$$ packed form
940g66Q96k134J853j666P85N21k927L463j788o52M632m459J649L008n899M081
956E97N9l870M438k397M2L151l755K333P06k489L427k358J73K393l213K637j148
973G26k404M851m016J189L645n572M021J001m588M158k792j646M648m287R31K989
989B854l643K048N0j074R82k109K569r83k019L049k649m42K080l136K865n6l059
1006b673N378k887k758N124m183j22J928l361L736p81k409M522l508J87L489l629
1022a947J531O4j370K889l010O62J817m200L606R21k586L822k413L11K213m451
1038b141K991k98l426M566j262q04K167j920J965j188j006L933l651J03K965m073
1054a079K752n62k946M757l352l91O085n623P88K712m369K334l26k294K632k367
$$ plain form
1070 -1249 -133 2006 -864 587 126 -463 596 -1389 1088 -41 -3253 1542 -1471 -2789 971
1085 971 -2914 -696 1092 -2214 1733 -666 -3141 1129 -2520 -2268 560 -2685 -636 -468 -1181 1184
1101 1184 -1648 -769 658 -1697 615 81 -870 754 -2093 355 1358 -2774 1340 1362 -841 3551
1117 3551 877 -374 1872 -1524 415 994 -974 1616 538 968 1886 304 2271 -247 180 3311
1133 3311 -896 1145 2594 -2728 1454 635 -2074 2917 -491 -276 3600 -846 513 1954 -2546
1148 -2546 -364 -429 -1586 699 -1009 -244 368 -913 573 -1069 -380 227 -1798 901 -481 -2643
1164 -2643 836 -3015 -2621 1058 -2720 66 1456 -2109 1341 109 -2741 481 -2119 -1848 588
1179 588 -1195 455 97 -909 843 -1006 538 749 -1142 1846 -126 -853 1993 -1678 -61 1393
$$ packed form
1070a249J116K139k870J451m61n89J059j985K477j129l212M795l013j318L760
1085I71l885K218J788l306L947k399k475M270l649K52K828l245K049J68p13K365
1101A184k832Q79J427k355K312n34r51J624k847K448J003m132M114K2k203M392
1117C551k674j251K246l396J939N79j968K590j078M30R18j582J967k518M27L131
1133C311m207K041J449n322M182q19k709M991l408K15L876m446J359J441m500
1148b546K182o5j157K285j708P65O12j281J486j642O89O07k025K699j382k162
1164b643L479l851L94L679l778K786J390l565L450j232k850L222k600K71K436
1179E88j783J650l58j006J752j849J544K11j891K988j972p27K846l671J617J454
$$ plain form
1195 1393 -1983 2330 2034 -560 3472 620 -329 2233 -865 280 1215 -527 1709 807 911 1646
1211 1646 -246 1555 312 -308 2057 -649 520 1692 -2215 704 181 -2067 2097 -198 -551 2443
1227 2443 -1362 -406 549 -2647 -495 -630 -1650 687 -1170 -378 279 -1240 93 -1135 -1306 750
1243 750 -1826 -73 -128 -2784 309 -1451 -2196 1421 -1225 58 1767 -1097 231 -493 -1775 207
1259 207 -1434 -334 1030 -1081 1350 671 -341 1964 -427 826 1713 -1087 1429 650 -961 1472
1275 1472 -534 97 1403 -184 2833 1464 146 2866 -343 -628 1418 -1681 756 906 -708 2212
1291 2212 -205 117 1722 -913 636 396 -494 981 -735 -451 -7 -2674 -153 -349 -1589 1186
1307 1186 -132 165 767 -1846 -164 -935 -3153 185 -1617 -1305 614 -1189 361 -26 -1830 807
$$ packed form
1195A393l376M313k96k594M032k852r49K562l098J145R35j742K236r02J04P35
1211A646j892J801j243o20K365k706J169J172l907K919n23k248M164k295l53K994
1227B443l805R56R55l196K152j35j020K337j857P92O57j519J333j228j71K056
1243G50k576J753n5k656L093j760p45L617k646J283J709k864J328p24j282J982
1259B07j641J100J364k111K431o79j012K305k391J253Q87k800K516p79j611K433
1275A472k006O31J306j587L017j369j318K720l209k85K046l099K437J50j614K920
1291B212k417L22J605k635J549k40q90J475j716K84M44k667K521j96j240K775
1307A186j318K97O02k613J682p71k218L338j802L12J919j803J550l87j804K637
$$ plain form
1323 807 -1185 -1366 1345 -1508 -730 -130 -1956 89 -746 -730 1294 -485 1063 1222 -283 842 -911
1340 -911 -918 662 -1290 1334 1723 -846 2202 1051 -548 2232 4 583 1488 -379 1917 279 -985
1357 -985 1232 -507 410 1421 551 2138 661 362 2076 -1458 -562 432 -1815 621 571 -566 1681
1374 1681 -841 -256 1473 -2015 162 570 -1721 425 -716 -1425 -26 -1977 -909 147 -1080 760
1390 760 -90 -490 -311 -1575 -455 -1585 -2338 727 -1324 -530 1820 -1524 113 561 -1898 1102 -186
1407 -186 -1291 1457 -887 -547 601 -1498 307 77 231 2094 338 1326 1128 -977 1090 -392
1423 -392 -797 1361 -621 1145 1645 1 2147 489 -425 1782 -117 776 1333 -650 573 128 -534
1440 -534 1001 -424 399 1321 336 1374 -15 -512 250 -1831 -101 -242 -1790 687 -134 -608 1306
$$ packed form
1323H07j992j81K711k853P78O00j826K045q35J6K024j779J548J59j505J125j753
1340i11pJ580j952K624L89k569L048j151j599K780k228N79R05j867K296j638j264
1357i85K217j739R17J011q70J587j477k99J714l534Q96R94k247K436n0j137K247
1374A681k522N85J729l488K177M08k291K146j141p09J399j951J068J056j227J840
1390G60q50m00J79j264J120j130p53L065k051P94K350l344J637M48k459L000j288
1407a86j105K748k344L40J148k099J805k30J54J863j756R88j98k105K067j482
1423c92m05K158j982J766N00j644K146j658r14K207j899Q93N57j983J223m45o62
1440e34J535j425Q23R22r85J038j389m97P62k081J730j41j548K477q21m74J914
$$ plain form
1457 1306 -1319 -876 545 -1656 -117 13 -1504 -209 -1108 -1148 -281 -1295 -429 -226 -174 538 -589 352
1475 352 -711 -2428 12 -935 -1218 1024 -894 466 1224 -1298 988 395 -1741 1306 434 -303 1262
1492 1262 -487 275 180 -682 1531 822 640 1885 542 1372 430 -774 1046 -864 252 1560 -274
1509 -274 1481 1152 -386 1909 -95 -484 1564 -783 569 977 -928 756 -254 -1144 134 -116
1525 -116 545 394 -143 1199 -955 -1199 300 -2147 -1140 -146 -1157 1053 -486 -1536 1541 -1154
1541 -1154 -1579 653 -1486 -569 -108 -1212 7 -1210 -1283 359 -669 -54 794 -31 773 -334 -92
1558 -92 -72 -1586 -50 -177 -385 1412 60 787 1574 -757 934 575 -1055 1818 294 -394 1838
1575 1838 -516 55 979 -314 1203 690 817 1912 202 544 581 -1184 185 -540 -116 1272 -400
$$ packed form
1457A306k625M43J421k201J539J30j517J295q99m0Q67j014Q66K03N2P12j127R41
1475C52j063j717K440r47k83K242j918J360P58k522K286n93k136L047q72p37J565
1492A262j749P62r5q62K213p09j82J245j343Q30r42j204J820j910J116J308j834
1509b74J755l29j538K295k004l89K048k347J352M08j905J684j010q90J278k50
1525a16O61j51n37J342k154k44J499k447J007R94j011K210j539j050L077k695
1541a154m25K232k139R17M61j104J219j217p3J642j028O15Q48q25Q04j107K42
1558i2K0j514J536j27k08J797j352P27P87k331J691l59j630K873j524o88K232
1575A838k354N71R24j293J517n13J27J095j710L42L7j765J369p25M24J388j672
$$ plain form
1592 -400 772 914 -888 507 145 -687 550 -827 188 111 -1168 52 -687 -486 297 -542 400 78
1610 78 -898 659 -1229 -1579 -22 -2079 -340 415 -1122 863 40 -1273 677 -983 -901 308 -1112
1627 -1112 202 105 -862 258 -796 -359 440 -354 965 963 365 739 -583 359 -196 -856 958 -174
1645 -174 655 1949 -352 641 995 -819 1082 493 -547 1669 -60 147 1009 -787 500 442 -129
1662 -129 1388 301 457 1100 -762 260 -351 -1058 619 -329 -96 1314 -364 247 144 -851 227
1679 227 -634 -500 382 -840 -248 -423 -1030 -250 -847 -817 212 -470 254 -17 -857 196 -1405 -1218 -18
1698 -18 -1347 271 482 -868 1100 49 -992 649 -971 -417 751 -801 397 233 -553 364 -443
1715 -443 -33 977 190 1290 858 157 851 -512 -64 523 -190 1008 697 176 1596 118 338 836
$$ packed form
1592d00J172J42j802J395l62q32J237j377J015p7j279J220p39K01P83q39R42l22
1610G8r76J557j888l50J557k057J739P55j537J985q23j313J950j660Q2J209j420
1627a112J314r7r67J120j054M37P99p94J319kn98L74j322R42n55o60J814j132
1645a74Q29J294k301R93L54j814J901n89j040K216j729K07Q62j796J287n8n71
1662a29J517j087J56O43j862J022o11p07J677r48K33J410j678O11j03r95J078
1679B27q61J34Q82j222N92j75o07P80n97L0J029o82P24k71q40J053j601J87J200
1698a8j329J618K11j350J968j051j041J641j620N54J168j552J198j64p86R17q07
1715d43M10J010p87J100m32p01O94j363M48N87p13J198l11n21J420j478K20M98
$$ plain form
1733 836 -751 808 277 -281 1037 5 -44 611 -794 355 379 -400 1252 -11 30 547 -1168 -159
1751 -159 -86 -1286 285 -325 -323 549 -674 24 -304 -1262 133 -679 -813 190 -678 -495 -288 -959 -263
1770 -263 -607 -552 406 -451 -39 -6 -884 -47 -969 -668 541 -1101 351 856 -947 677 322 -726 334
1789 334 -217 247 655 -191 708 443 -208 683 95 747 607 368 1326 303 14 916 -396 11 786
1808 786 -372 1030 431 234 1244 -394 139 713 -744 433 263 -494 236 -407 -467 151 -868 394
1826 394 191 -446 463 -412 -211 -120 -1198 -179 -545 -1173 704 -302 -515 421 -770 -546 -567 -939 226
1845 226 -676 -465 188 -642 -338 -357 -491 368 -586 171 1037 -504 421 16 -827 378 -391 -204 768 -336
1865 -336 745 1147 -458 602 103 -307 822 63 92 602 23 949 154 -48 845 -37 584 736 347
$$ packed form
1733H36j587J559n31n58J318j032m9O55j405J149K4p79J652j263M1N17j715J009
1751a59P3j200J571o10KQ72j223O98l28r58J395q12j34J003q68J83K07o71O96
1770b63l44N5R58q57M12L3q78Q37r22L01J209j642J452N05j803J624l55j048J060
1789C34n51M64M08q46Q99k65o51Q91n88O52j40k39R58j023k89R02j312M07P75
1808G86j158J402n99j97J010j638N33N74j457J177j70p57P30o43o0O18j019J262
1826C94k03o37R09q75K01R1j078J019l66o28J877j006k13R36j191K24k1l72J165
1845B26r02K11O53q30L04j9j34Q59r54P57Q66j541R25m05q43J205p69J87R72j104
1865c36J081M02j605J060m99m10J129p59K9N10n79R26p95k02Q93q82O21J52l89
$$ plain form
1884 347 826 199 -74 515 -767 257 655 -398 577 57 -142 763 -939 -285 498 -820 269 322
1902 322 -626 -12 -420 -197 -52 -792 -197 -263 -423 380 -636 -502 -456 -1138 -37 -224 -1078 365 -229 -509
1922 -509 415 -500 -425 -247 -895 259 -271 -16 397 -457 158 58 -372 465 -67 128 833 -46 828 340
1942 340 -178 535 -257 137 1059 16 630 735 -245 859 74 -221 1034 -100 254 740 -86 464 66
1961 66 -98 848 79 330 244 -372 461 -215 -272 341 -632 58 324 -177 515 -252 -495 261 -644 -460 -8
1982 -8 -726 158 -377 -404 278 -998 -405 -211 -599 89 -320 -620 285 -853 -287 -145 -1105 283 -69 -140
2002 -140 564 -429 -4 56 -613 366 12 -509 451 97 107 625 -298 -69 329 85 795 116 311 611 47
2023 47 562 214 -2 669 -47 421 964 -172 376 415 -422 587 127 64 483 -195 281 265 -382 265 -46
$$ packed form
1884C47M79o27k73N89j282J024L98j053R75n20j99R05j702O54P83j318J089N3
1902C22r48O14m08K23J45p40N95o6j60Q03j016J34M6o82J101j87q54J443n94k80
1922e09R24r15P5J78o48J154n30K55M13q54O15j00m30Q37n32J95P05q79Q74m88
1942C40n18P13p92L94R22j043O14J05r80J104p85k95J255j134L54M86q26N50l98
1961F6j64R46p69K51q6o16Q33o76n7O13r73O90K66n01O92p67k43P56r05J84M52
1982hp18Q84n35k7O82j276N93J94l88O88m09l00R05j138N66J42r60J388l52p1
2002a40P04r93M25O0o69R79l54n21R60l54J0N18r23K29L98k44P10o79J95L00n64
2023D7N15l48k16O71p16M68N43j136N48L9q37J009m60o3M19o78M76j6o47O47l11
$$ plain form
2044 -46 -284 345 -351 346 89 -623 77 -345 -734 237 -536 -74 95 -517 145 -655 -519 85 -814 -468
2064 -468 63 -549 -161 -195 -421 -5 -819 -204 115 -489 91 308 -125 -48 -680 -123 -2 -497 160 214 -206
2085 -206 676 47 -178 427 -167 260 299 218 681 29 155 445 -154 378 283 25 683 -17 456 388 -195
2106 -195 382 242 -61 525 185 -4 685 -398 65 108 -386 59 -229 -23 -26 -209 98 48 -552 3 -495
2127 -495 -144 223 -617 146 -220 -653 413 -704 -276 140 -752 -152 -49 -777 200 -278 -592 152 -290
2146 -290 -128 260 -573 -138 -174 -435 218 -504 -118 93 -48 289 39 68 219 -400 657 344 -230 638
2166 638 233 167 886 -95 237 612 -4 276 308 331 552 25 407 362 -169 356 -50 -121 508 54 -109 658
2188 658 -185 152 111 -49 414 -135 107 276 -532 -61 190 -470 276 -152 -242 31 -430 -250 -214 -258 -306 -294
$$ packed form
2044d6k38O29o96O97k57p12P00m22l89R71p73M62J69o12O62q00J36O04q99L46
2064d68N31o12L88l4k26M16q14O15L19o04N80K17m33P7o32N57J21m95O57N4m20
2085b06Q82o29k25O05n94M27L9q1M63o52J26K90n99N32r5k58O58p00M73o8n83
2106a95N77j40l03N86l40j89O89j083M63M3m94M45k88K06lj83L07n0o00N55m98
2127d95L51L67q40P63l66m33J066j117M28M16q92O00J03p28R77m78l14P44m42
2146b90J62L88q33M35l6k61O53p22L86K11j41L37k50K9J51o19J057l13n74Q68
2166F38m05o6P19r81L32L75o16K80L2K3K21n27L82m5n31N25m06p1O29m54j63P67
2188F58q43L37m1j60M63n49K42J69q08M71K51o60P46m28r0K73m61J80L6m4m8J2
$$ plain form
2210 -294 -180 -42 -370 -135 -181 -574 186 -279 -127 373 -447 58 28 -358 35 -229 -135 187 -117 116 293
2231 293 -358 197 293 -48 231 -252 306 349 -56 442 222 26 500 137 243 224 366 556 80 90 509
2252 509 -95 465 572 -73 514 55 186 584 -64 179 256 -368 496 -29 -179 249 -306 -350 147 -614 70
2273 70 -181 -496 369 -397 -306 -98 -348 -158 -133 -532 238 -163 -275 36 -301 -284 -186 -570 181 -363 -123 214
2295 214 -392 44 -41 -431 105 -296 -16 465 -238 176 206 -153 214 -5 187 327 -84 319 292 -303 482
2316 482 303 -193 251 190 171 451 300 381 181 274 507 -1 42 535 45 485 -35 -118 289 -417 163 346
2338 346 -354 321 -70 -338 135 -142 -15 -46 -527 49 159 -291 270 -388 -146 122 -347 -181 -43 -827
2358 -827 -9 -423 -263 344 -220 -81 -335 -35 73 -344 -42 61 -398 -70 -168 -192 77 8 56 160 -58
$$ packed form
2210b94J14J38l28K35m6l93P60m65J52N00q20N05l0l86L93k64R4L22l04K33J77
2231B93o51N55R6l41K79m83N58M3m05M98k20j96M74l63J06j9J42J90m76J0M19
2252E09o04N60J07o45N87m59J31L98o48K43P7o24Q64n25j50M28n55m4M97p61O84
2273G0k51l15Q65p66R1K08k50J90K5l99P70m01j12L11l37J7R8l84P51n44K40L37
2295B14o06M36q5l90N36m01K80M81p03M14L0l59L67k19J92J40m11M03k7n95P85
2316D82j79m96M44o1j9K80j51Q1k00R3K33n08M3M93m90M40n20q3M07p06N80J83
2338C46p00O75l91k68M73k77J27l1m81N76J10m50N61o58K42K68m69J66J38p84
2358h27Q18m14J60O07n64J39k54L00J08m17L02J03m59L28r8k4K69o9M8J04k18
$$ plain form
2379 -58 184 -98 -183 175 -219 99 183 -106 113 159 59 486 57 82 547 186 218 197 124 469 -38 -213 108
2402 108 52 346 352 -17 473 262 -15 400 -52 107 315 -319 -187 35 190 296 -381 11 7 -520 284 -217
2424 -217 -387 66 -521 -102 -76 -281 239 -378 -296 -86 -160 -134 155 -573 -109 -251 -260 -208 -417 -157 -79 -90 303
2447 303 101 -327 465 -269 24 -30 -165 -49 -96 -57 413 -362 350 400 206 526 351 98 281 -58 270
2468 270 323 -121 216 284 286 416 88 315 184 -47 305 282 -138 472 -1 2 467 -61 343 328 -165 88 4
2491 4 62 261 -244 -110 -212 -240 -166 -206 -138 -155 -254 89 -68 -568 -139 -364 -131 23 -516 -89 -8 -404 153
2514 153 -245 -342 17 -119 -206 -16 -247 -67 91 -419 -66 -64 223 143 26 288 -43 -106 306 -314 2 200
2536 200 -235 278 79 -153 522 217 258 497 -51 322 402 -287 194 72 42 269 -69 372 -29 274 321
$$ packed form
2379e8K42k82q5L58l94L18Q4k89K19M6j00M27m29K5M65l61L2k1p3L45n07j75L21
2402A08n6K94Ol69M90k11k77M15m52J59K08o34J32K22J55J06o77L92mn27Q04n01
2424b17j70M53n87M19K6k05N20o17Q2K10p4K6K89p28M64j42rN2k09K60P8j1L93
2447C03k02m28P92p34K93n4j35J16m7L9M70p75P12N0j94L20j75k53J83l39L28
2468B70N3m44L37O8KJ30l28K27j31k31L52k3m20O10m73LM65n28M04j5m93K53q4
2491DN8J99n05J34j02k8P4m0O8j7r9L43j57n00M29k25K33J54n39M27Q1l96N57
2514A53l98r7L59j36q7J90k31J80J58n10L53KK87q0j17K62l31o3M12o20L16J98
2536B00m35N13j99k32O75l05M1K39n48L73Q0o89M81j22l0K27l38M41m01L03M7
$$ plain form
2557 321 -97 152 354 -119 356 -11 14 456 20 -255 90 -70 137 100 21 -38 -4 -389 -119 -191 -305 -257
2579 -257 -178 -214 -412 40 77 -267 -62 -86 -281 -140 -85 -141 -118 -78 -137 -99 -448 374 11 -276 318 -116 47
2602 47 187 -277 236 152 -232 358 313 264 130 -158 290 -97 95 208 48 41 192 133 137 134 -36 476 272 118
2626 118 246 17 256 -355 -181 17 -102 201 -12 -69 496 103 -151 195 -454 -203 143 -175 185 -46
2646 -46 -353 -204 -247 -172 36 -339 174 14 -398 -27 -142 -306 -215 -414 -15 -147 -362 256 -212 92 39 -316
2668 -316 110 -120 -72 136 -147 -297 73 -113 112 234 147 115 -64 115 167 25 119 54 -48 496 165 183
2690 183 292 -85 504 282 104 348 232 -43 320 -54 45 188 -166 78 72 -15 197 -200 118 -123 -289
2711 -289 258 -94 -176 -123 -352 40 75 -93 218 -513 -245 -19 -282 -169 -249 -387 38 -10 -149 84 -260 -99
$$ packed form
2557C21m18K49K02m73M75l67K5M42m36k75L45j60K07l7p9n9L4l85K70p2j14M8
2579b57P9l6j98M52L7l44K05k4j95J41N5n6K3M0n9L8l49Q22l63k87N94m34J63
2602D7J40m64N13q4l84N90m5m9j34k88M48l87J92J13j60pJ51n9Mlj70N12k04j54
2626A18J28k29K39o11J74J98j19L03k13n7N65l93k54L46o49K51L46l18L60k31
2646d6l07J49m3P5K08l75N13j60m12L71j15j64R1j99L99j32k15O18m68L04n3l55
2668c16M26k30M8K08k83j50L70j86K25J22q7l2j79J79N2j42R4o5j02N44l31J8
2690A83J09l77N89k22j78K44j16k75L63l74R9J43l54K44oq7K12l97L18k41j66
2711b89N47l52q2N3k29L92L5j68L11p31K68K26k63J13q0j38M25m8j39K33l44J61
$$ plain form
2733 -99 97 -269 -115 -116 -120 -9 -304 -41 54 -56 146 112 65 211 -175 -60 260 -138 67 18 -122 327 -125
2756 -125 140 185 73 60 377 191 196 5 111 145 -224 179 195 -21 343 56 265 361 -126 326 215 -218
2778 -218 -18 -21 38 201 -134 39 52 -217 3 -19 -51 -429 -88 130 -152 -252 -214 -453 -180 43 -297 159
2800 159 104 -59 74 -326 -53 5 -223 -222 -163 -525 23 -244 -188 -6 -344 -57 26 -222 6 192 -271 -126
2822 -126 -326 -74 128 -17 292 29 36 254 -266 -132 264 -82 473 99 -125 356 143 -46 313 425 102
2843 102 -67 178 231 173 159 86 76 223 72 -71 56 116 -30 214 -239 130 13 -135 176 -243 -315 86
2865 86 -331 -231 -52 -249 29 167 -50 6 -119 -45 -296 -215 -9 -321 -147 162 -46 130 71 -74 231 -222
2887 -222 -501 -6 -246 -52 124 -261 11 26 -228 19 7 84 2 80 -4 -130 58 45 91 213 390 -140 342
$$ packed form
2733i9J96l66J54jmJ11k95K63R5j10K02l4m7J46l86J15L20l98K05m9j40M49m52
2756a25K65M5j12j3L17j86Nj91J06L4l69M03J6k16L64k87K09R6m87M52j11m33
2778b18K00lN9J63l35J73J3k69K20k2l2l78L41K18k82j00L8k39K73K23l40M56
2800A59n5j63J33m00K73N8k28JN9l62N48k67N6J82l38K87Q3k48K28J86m63J45
2822a26k00K52K02j45L09k63PK18n20J34L96l46N55l74k24M81k13j89L59J12l23
2843A02j69K45N3n8j4p3j0J47j51j43J27O0j46K44m53L69j17j48L11m19p2M01
2865H6m17J00J79j97K78J38k17N6j25P4k51Q1K06l12J74L09k08J76n9j45L05m53
2887b22k79M95k40J94J76l85K72J5k54K47j2P7q2P8q4j26J88j3M6J22J77n30M82
$$ plain form
2910 342 175 -4 337 -205 228 178 -149 283 279 152 439 55 185 276 173 117 185 145 239 -54 28 38 15 210
2934 210 -56 -109 69 -12 49 147 -363 -31 -192 -343 72 -117 -113 -80 -193 -217 -427 -254 -43 -28 183 110 -270
2957 -270 184 -37 -531 -138 -526 74 145 -229 137 184 -178 99 -198 -304 -28 18 220 1 192 80 0
2978 0 -48 -70 -46 279 165 59 250 -124 49 126 -25 104 172 53 327 251 164 285 7 196 363 -10 73
3001 73 -9 -214 192 -107 12 91 -49 -41 269 239 71 -201 140 -116 -79 2 -43 -361 -25 16 -120 -21 -450 -159
3025 -159 -305 -309 70 -142 -167 -184 -371 -141 -26 -56 32 6 -120 77 -161 -81 -190 -244 -89 -318 -155 152 4
3048 4 257 165 -12 198 -213 108 -92 -45 210 212 127 213 122 96 205 -165 76 -21 112 458 -44 10 114 260
3072 260 232 118 234 28 10 -265 102 4 15 -183 97 118 -70 180 -42 -144 35 58 -55 128 -141 -310
$$ packed form
2910C42j67j79L41n42M33n0l27M32mj27K87l84J30R1j03n6O8m0R4k93Q2J0k3J95
2934B10k66n3J78q1O1R8n10L32j61j51M15j89ML3j13k4k10J73K11J5K11p3l80
2957b70M54k21m94L93l88O00P1l74L66M7l62K77k97j06K76M6K02k19J91j12q0
2978@m8k2K4L25j14j06J91l74J73P7j51J29O8j19K74p6q7J21k78J89J67l73Q3
3001G3q2k05M06k99J19P9j40QL10l0j68k72L41k56L7Q1m5l18L36M1j36R9m29K91
3025a59j46mL79k12k5j7j87K30J15l0Q8k6j26J97k38Q0j09n4J55k29J63L07j48
3048DK53r2j77K10m11L21k00M7K55Kq5Q6r1k6J09l70K41r7J33L46n02N4J04J46
3072B60k8j14J16k06j8k75L67r8J1j98K80K1j88K50k22j02J79K3j13J83k69j69
$$ plain form
3094 -310 -112 -312 -119 -59 -247 -26 -50 -17 83 -98 -271 14 -116 -181 150 102 -110 -114 83 -95 -391 -2
3116 -2 -271 -223 91 -178 110 82 -51 138 26 -108 370 308 -122 350 2 44 177 26 102 312 456 197
3138 197 104 76 97 194 203 -344 112 -85 62 201 -11 -121 207 -85 -28 315 122 260 193 -45 -48 72 40 65
3162 65 78 103 85 85 -137 -278 -224 -138 -110 151 160 95 60 -177 -295 127 -207 -268 -215 -201 85 9 -181 -1 46 -492
3188 -492 -143 -171 75 69 133 34 125 -40 -121 -210 24 -115 89 352 -142 276 361 -164 24 36 89 192 324 105
3212 105 714 102 27 -95 -51 159 -78 20 -85 -25 -27 5 -80 126 -202 150 23 -60 198 -50 -205 -9 -213
3235 -213 31 239 245 -215 -81 16 -98 -192 -122 -220 -99 -32 -155 -99 -371 -197 2 -65 -423 -129 146 -208 -139
3258 -139 -25 -169 -135 -454 -101 165 -260 250 -31 -225 167 32 -184 176 16 30 78 204 -207 -37 208
$$ packed form
3094c10J98k00J93O0j88K21k4L3J00j81j73K85j30o5L31m8k12mJ97j78k96L89
3116bk69M8L14k69K88k8j33J89j12j34M78o2m30M72l48M2J33j51P6K10J44k59
3138A97r3k8K1R7Rn47M56j97J47J39k12j10L28k92N7L43j93J38o7k38lJ20l2K5
3162F5J3K5j8%k22j41N4Q6K8K61Ro5l5k37j18M22l34o1N3J4K86p6j90J80M7n38
3188d92L49k8K46oO4r9R1j65q1q9K34j39K04K63m94M18Q5n25J88J2N3J03J32k19
3212A05O09o12p5j22M4K10k37R8j05O0kL2q5K06l28L52j27q3K58k48j55J96k04
3235b13K44K08Om60J34R7j14r4P0r8J21O7j23N6k72J74J99o7l58K94K75l54O9
3258a39J14j44L4l19L53K66m25N10k81j94L92j35k16L60j60J4M8J26m11J70K45
$$ plain form
3279 208 236 105 276 158 -127 248 -72 42 58 -310 258 168 78 207 -37 14 43 39 -218 228 88 190 105
3302 105 182 -92 55 111 21 -76 180 -160 -70 -107 -223 -74 28 -125 -38 9 -156 6 -141 -2 17 -92 -326
3325 -326 -179 -174 -159 -421 78 -64 -145 -238 -370 58 -243 46 38 -37 -244 -41 -144 -164 47 5 162 223 -23 297
3349 297 67 118 29 149 33 66 81 464 -55 271 159 -20 206 115 -16 268 50 153 235 -112 2 200
3371 200 153 167 43 2 38 204 -49 -193 -4 40 -163 87 13 -68 -84 -161 -127 56 -103 -248 32 -491 80
3394 80 54 -111 -225 -81 -141 -161 -85 -237 -195 155 183 -71 -122 165 -12 43 -173 -81 -60 88 14 -160 -407 -117
3418 -117 291 -278 4 28 -237 -72 102 -107 -11 -30 120 143 167 139 -46 -11 -71 -66 145 -26 -106 94 0 120
3442 120 51 -2 22 211 -80 203 12 143 336 -165 -57 10 -164 177 -102 24 -33 15 21 -155 -217 82 -133
$$ packed form
3279B08K8j31J71j18k85L75l20J14J6l68N68r0r0J29k44N1K9mk57M46j40J02q5
3302A05P7k74J47N6r0r7K56l40R0l7j16J49J02j53Q7M7j65J62j47J39J9j09k34
3325c26J47NJ5k62M99j42q1r3j32M28l01K89qp5k07K03j03k0K11m2J57O1k46L20
3349B97k30N1q9J20j16L3J5L83n19L26j12j79K26r1j31K84k18J03Q2l47J14J98
3371B00m7J4j24m1L6J66k53j44J89M4k03K50p4q1j6p7L4J83j59j45K80n23N71
3394H0k6j65j14J44o0k0P6j52M2L50K8k54n1K87j77N5k16R2K1J48p4j74k47K90
3418a17M08n69K82K4k65J65J74k09R6j9J50K3K4k8j85L5o0NK11j71q0K00r4J20
3442A20o9n3K4J89k91K83j91J31J93n01J08O7j74L41k79J26n7M8Oj76o2K99k15
$$ plain form
3465 -133 178 26 -268 -218 -338 -115 -28 -19 -158 319 -57 40 99 -258 -57 -225 -157 50 -116 -128 -169 -152 -217 -18
3489 -18 -172 60 -158 280 -121 82 277 -28 17 136 -149 -1 115 -5 175 505 -150 -131 23 82 191
3510 191 -121 44 150 154 66 186 -59 244 61 218 6 98 369 -125 -16 58 -49 213 94 -134 147 10
3532 10 -148 -43 -47 -256 258 -97 -106 -64 -130 -71 -98 150 -196 53 10 32 -129 36 -338 -109 -133 -304 136 -275
3556 -275 -292 44 -96 179 -114 -254 59 -81 97 2 70 106 66 23 13 19 12 -232 -115 247 -50 26 239 172
3580 172 -76 361 -145 63 28 -17 99 250 -165 67 14 -201 62 65 191 68 -6 84 -42 -85 -80 32 312
3603 312 -131 40 26 81 -147 4 -308 74 -70 -119 122 -45 -131 -239 -2 -43 -58 169 -107 -69 -179 -197 -107
3626 -107 -57 -272 -51 -330 -166 -112 233 -124 135 -33 -22 -30 -186 -74 36 17 -291 139 235 110 -104 196
$$ packed form
3465a33L11j52k94N0j20K23Q7Rj39M77l76R7N9l57K01j68O8K07j66j2m1J7o5J99
3489a8j54K32k18M38m01K03J95l05M5J19k85J48J16j20J80L30o55J9J54N9J09
3510A91l12J65J06Mq8J20k45L03j83J57k12R2K71m94J09P4j07K62j19k28K81j37
3532A0j58J05mk09N14l55rM2o6N9k7K48l46K49m3K2j61J65l74K29k4j71M40m11
3556b75j7L36j40K75k93j40L13j40J78r5O8L6m0m3j0Opk44J17L62k97P6K13o7
3580A72k48M37n06K08l5m5J16J51m15K32n3k15K63LJ26j23p4R0j26m3NJ12K80
3603C12m43J71j4N5k28J51l12L82j44m9K41j67q6j08K37m1j5K27k76L8j10j8R0
3626a07N0k15K21k79J64N4L45l57K59j68J1qj56J12J10j9l08M30R6j25k14L00
$$ plain form
3648 196 31 -47 135 -66 205 60 -314 231 66 116 40 97 165 126 8 11 291 233 -26 256 -75 -109 -136 34
3672 34 -20 239 -7 163 50 104 -51 -26 54 -68 279 -163 -72 37 -150 -242 104 -161 11 -145 -205 -118 -147
3695 -147 -36 -235 0 -245 -79 -59 -168 -75 -173 -77 -130 -26 89 -181 4 181 -39 77 -258 -65 163 -128
3717 -128 3 70 -127 143 -166 -3 62 -62 -51 322 14 80 152 172 103 227 -112 -15 116 138 30 97 186 15
3741 15 96 -38 -11 72 42 -28 164 34 53 -84 243 -30 4 -119 169 -116 29 43 -173 -139 -57 -91 93 78
3765 78 -182 -81 -56 -75 -67 -242 3 -188 -107 67 -430 -2 -136 8 101 8 -37 -141 -153 -48 -16 -248 -116 -22
3789 -22 -11 62 -316 64 -42 -51 204 -54 -225 512 -52 -259 134 263 -67 1 134 23 -10 64 -187 229 205
3812 205 36 172 220 -46 70 182 -1 284 317 128 -172 82 64 42 11 239 109 -43 7 -107 -24 -182
$$ packed form
3648A96j65p8J82k01K71j45l74N45j65N0p6N7O8l9j18LK80n8k59K82l31l4k7J70
3672C4n4K59k46J70j13N4j55K5Q0j22L47m42R1J09j87r2L46k65J72j56o0Q7k9
3695a47J11j99K35k45J66K0j09R3r8R6n3J04J15k70J85J77k20J16l35J93K28k91
3717a28J31O7j97K70l09J63O5j24J1L73l08O6P2K0o9J24l39R7J31K2j08O7Q9j71
3741A5Q1j34K7Q3l0p0J92j30J9j37L27k73L4j23K88k85J45J4k16L4Q2l4J84j5
3765G8k60J01K5j9Qj75K45j91Q1J74m97M28j34J44R3r3m5j04j2J05L2k32J32R4
3789b2J1P3l78L80j06rK55k58j71P37n64k07L93J29l30O8J33j11l3P4k51M16k4
3812B05j69J36M8k66J16J12j83K85L3j89l00K54j8k2l1K28j30j52N0j14Q3j58
$$ plain form
3834 -182 97 53 -73 -25 0 -181 133 -248 44 6 -278 -116 -243 -53 -28 106 -219 -168 -166 -159 -26 -97 -125 -142
3858 -142 -198 -73 -264 -64 3 -204 65 -31 -142 17 -220 -98 46 -112 -64 39 69 64 132 -131 95 212 40
3881 40 224 89 80 102 217 240 1 175 -183 256 168 193 70 61 -52 29 -126 -82 -87 -8 -34 -73 -58 -174 48 -283
3907 -283 -86 210 -102 -72 154 28 -7 39 -167 -309 13 -150 -317 -17 -125 -27 -80 -126 -114 -106 -445 -183 201
3930 201 -237 -231 141 -317 -16 50 67 67 162 -45 -74 133 -146 160 -120 79 158 86 -12 -317 106 321 173 150
3954 150 46 -31 115 81 -15 211 -7 22 288 49 84 197 113 125 74 -136 45 -142 87 279 -67 50 19
3977 19 175 -161 -47 -32 -171 111 -9 -74 -135 141 -41 -113 -265 -98 -26 -195 -265 -153 -121 109 81 -194 16
4000 16 -91 -61 -92 -25 -115 -203 -15 -9 -155 69 -102 -202 175 5 -135 88 9 102 155 116 -75 154 -15 -75
$$ packed form
3834a82K79m4j26M8K5j81L14l81K92l8k84J62j27J90K5J34l25N1KPJ33p1k8j7
3858a42n6J25j91K00O7k07K69r6j11J59k37J22J44j58M8J03L0nO8k63K26J17j72
3881D0J84j35rK2J15K3k39J74l58M39q8K5j23rj13Q1j55M4nP9k6l9J5j16K22l31
3907b83J97K96l12L0K26j26l5M6k06j42L22j63j67L00j08R8n3m6J2Ql39K62L84
3930B01m38OL72m58L01O6J7%R5k07k9K07k79L06k80J99P9p2r8l05M23K15j48k3
3954A50j04p7J46l4r6K26k18K9K66k39L5J13q4J2n1k10J81j87K29J92l46J17l1
3977A9J56l36J14J5j39K82j20o5o1K76j82p2j52J67P2j69p0J12L2K30k8k75K10
4000A6j07L0l1O7r0q8J88Oj46K24j71j00L77j70j40K23p9R3N3l9j91K29j69o0
$$ plain form
4024 -75 -1 44 -113 56 134 -65 341 110 16 53 -185 150 272 39 83 326 163 35 300 67 162 -51 202
4047 202 119 186 104 -277 55 234 6 23 57 -59 71 -263 -168 -119 81 151 -348 148 -149 48 -456 168 168
4070 168 -109 -62 81 -147 -153 -8 92 -52 -81 -18 -99 -115 36 -138 -52 -93 133 160 -156 148 20 142 14
4093 14 24 96 182 153 373 265 175 -94 261 141 106 90 66 66 202 144 -175 202 -54 -121 211 -117 234 47
4117 47 102 -10 -4 -101 -82 -30 80 -175 -80 -7 16 244 47 45 88 74 47 13 -153 136 83 -255 -126 -142 -125 -78 42
4144 42 -273 -357 -63 75 -209 -138 72 33 -156 -63 -166 -97 -105 20 -39 -73 -123 115 -117 94 -15 -121 243 -34
4168 -34 -65 121 124 238 -6 -71 154 95 189 -60 247 -50 42 151 -35 174 0 14 -33 -61 46 239 -9 125
4192 125 43 13 79 -160 -26 72 25 72 -99 49 -379 -153 -208 57 64 125 73 76 -5 -1 -26 -277 -218 -29 59 -107
$$ packed form
4024g5P4M5j57J69P8j99M06k31r4L7k38L35J22k33M4K43j63j28K65k33R5k13K53
4047B02q3O7q2l81L32J79k28J7L4j16J30l34R5M9K00P0m99M96k97J97n04O24%
4070A68k77M7J43k28oJ45J00j44k9O3q1j6J51j74Q6m1K26K7l16L04j28J22j28
4093A4J0P2Q6k9K20j08r0k69L55j20l5j6k4%J36n8l19L77k56o7L32l28L51j87
4117D7N5j12Or7J9N2J10k55R5P3K3K28j97kM3j4k7l4j66K89n3l38J29j6J7M7J20
4144D2l15q4K94J38k84P1K10l9j89R3j03O9qJ25n9l4n0K38k32K11j09j06L64k77
4168c4l1J86LJ14k44o5K25n9R4k49L07k97R2J09j86K09j74J4m7k8J07J93k48J34
4192A25q2l0O6k39J34R8m7M7j71J48m28K26n5K65PO1n2Lq1Mk5k51N9J89Q8j66
$$ plain form
4218 -107 -145 -141 29 123 -65 -113 -116 -114 140 82 -405 -79 -82 108 83 -139 58 -107 -7 -167 8 250 -104 -141 -126
4243 -126 -285 75 -7 -66 -2 -91 96 -191 109 -101 240 170 251 248 -134 74 45 106 225 35 28 286 18 18 74
4268 74 119 1 -95 -152 -27 96 -63 50 265 53 -315 -8 80 92 -9 78 23 -81 -97 2 -355 -75 -122 -374
4292 -374 -82 -378 -63 127 6 -118 -41 -287 30 95 -177 94 61 -23 103 41 -7 -106 86 63 112 16 128
4315 128 381 -175 -5 141 166 -12 367 64 -66 87 -30 -29 286 -119 36 13 -266 46 -39 -156 261 78
4337 78 304 28 10 58 -35 21 129 -65 98 284 31 -112 -90 25 -203 -34 -279 -13 61 204 -148 -61 125
4360 125 175 6 70 -5 -192 -84 -82 -115 42 0 -196 -281 -15 72 19 42 21 -24 -11 -108 58 77 -127 35 -19 139
4386 139 -208 -11 129 -50 56 -121 222 -61 197 84 120 -4 77 237 180 -57 -58 138 203 34 -26 141
$$ packed form
4218a07l8MJ70R4j88m8lKK54n8m87L26lJ90k5k22J97j65J00j60J75K42l54l7J5
4243a26j59L60q2n9O4q9J87k87L00k10L41p0Q1ll82K08k9O1J19j90pK58k68%N6
4268G4M5j18r6n7J25J23j59J13K15k12l68L07Q8J2j01Q7n5j04j6R9l57K80m7k52
4292c74K92k96L15J90j21j24P7k46L17O5k72K71l3q4J26o2m8r9J92k3M9r6J12
4315A28K53n56J70J46K5j78L79l03j30J53j17JL15m05J55k3k79L12q5j17M17j83
4337G8K26k76j8M8r3N6J08j94J63J86k53j43K2J15k28J69k45K66P4J43l52Q7J86
4360A25N0j69O4p5j87J08Kl3J57m2j96q5K66Q7n3K3k1m5J3r7J66J9k04J62n4J58
4386A39l47J97J40j79J06j77L43k83K58j13L6j24Q1J60n7k37jJ96O5j69o0J67
$$ plain form
4408 141 104 2 -130 135 -153 -78 0 -267 -53 74 18 -46 -133 -186 251 123 -38 155 28 -21 63 -204 -209 106
4432 106 -32 -169 51 -254 -54 -98 -320 230 18 -72 -342 -12 -78 163 -20 118 121 195 -34 -46 -135 -54 -81
4455 -81 153 -30 -128 152 71 -108 -31 -162 144 24 -47 0 140 118 -22 24 -27 127 -67 71 70 -34 -24 279
4479 279 -98 -90 -62 157 -183 171 175 -216 381 241 254 114 10 116 81 -45 -231 101 24 -5 63 -123 -7
4502 -7 179 -27 -193 -142 -44 -6 -65 -114 -10 1 -131 51 -77 25 -261 -36 -157 56 -230 -30 9 7 -150 52
4526 52 124 -373 -167 -156 -6 -5 41 -210 31 137 -126 337 -64 117 171 -40 -201 11 44 -91 4 80 65 112
4550 112 84 191 171 -28 -251 -52 189 162 200 -199 -183 -56 -28 239 -114 -27 237 21 26 -31 -1 46 67 -39
4574 -39 -38 -100 29 -208 2 10 109 -11 240 -138 -183 45 -218 -140 21 -39 -91 -278 84 137 22 275 437 259
$$ packed form
4408A41l7j02j32K65k88P5P8k67K14J27n6o4q7n3M37j28j61J93j27m9Q4k67nL15
4432A06j38j37K20l05K00m4k22N50k12r0k70L30o6K41j83J38LP4k29j2q9Q1k7
4455h1K34j83r8K80q1j79P7j31L06j20p1M7J40k2j40M6n1J54j94J38jj04J0L03
4479B79l77QK8K19l40L54Ml91N97j40J3j40j04J06l5j26j86L32p7k9O8j86J16
4502gJ86k06j66N1R8L8n9m9J04J1j32J82j28J02k86K25j21K13k86K00L9kj57K02
4526E2P2m97K06J1J50JM6k51K41J06k63M63m01J81N4k11j61K12L3j35R5P6j5M7
4550A12k8J07k0j99k23J99K41k7L8l99J6J27K8K67l53Q7K64k16Nn7L0M7K1j06
4574c9Jo2J29k37K10QR9j20K51l78m5K28k63P8J61o0n2j87L62N3j15K53J62j78
$$ plain form
4598 259 -104 -121 -23 28 0 -107 -45 -59 2 163 -105 79 318 29 -149 -3 187 -50 84 235 207 57 70
4621 70 35 23 -126 86 17 -152 243 -200 133 26 0 125 117 -5 123 29 33 118 -12 13 -2 -88 29 -45 4
4646 4 222 148 -44 158 38 63 11 -307 166 138 75 76 92 -94 63 -234 -76 129 155 -262 27 -184 -117 170
4670 170 7 -102 33 -44 -65 12 73 129 -91 -88 -271 20 47 189 31 -100 -59 -94 9 238 2 217 -34
4693 -34 65 195 56 -37 -150 -65 111 -116 170 142 -42 -69 99 180 109 -107 -98 71 -17 -135 -85 -40 66 159 51
4718 51 -104 6 18 264 -210 142 -94 -136 263 50 -150 190 -128 57 48 -91 143 -95 40 -75 -116 -87
4740 -87 165 101 -118 -139 -20 118 -62 111 -114 97 3 -80 57 56 116 75 -132 90 -58 135 -59 123 187
4763 187 -23 47 170 -77 64 416 -40 135 -23 -120 -168 93 148 -31 182 16 -49 72 87 60 -45 11 93
$$ packed form
4598B59l63j7R8N1k8j07O2j4O1J61k68J84K39k89j78J46J90k37J34J51k8j50J3
4621G0l5j2j49K12o9j69L95m43L33j07k6J25qj22J28r4MQ5j30K5j5q6J17p4M9
4646DK18p4j92K02j20K5n2l18M73k8o3JJ6j86J57k97J58K05K6m17K89k11O7K87
4670A70j63j09J35p7k1P7O1N6k20Lj83K91K7J42j58j31M1l5J03K29k36K15k51
4693c4R9J30j39r3j13Q5J76k27K86k8j84k7J68Q1p1k16RJ69q8j18N0M5J06R3j08
4718E1j55J10J2K46m74L52k36m2L99k13k00L40l18J85rj39K34k38J35j15m1K9
4740h7K52o4k19k1J19J38j80J73k25K11r4q3J37jO0m1k07K22j48J93j94J82O4
4763A87k10P0J23k47J41L52m56J75j58r7m8K61N5j79K13j66o5J21J5k7j05N6Q2
$$ plain form
4786 93 -97 -52 74 -225 161 -44 47 -120 -53 218 167 215 30 73 -76 -205 -97 -34 24 -141 131 -62 -242
4809 -242 -66 58 120 -149 -93 6 278 -80 -141 -163 -59 -88 130 47 -173 14 71 -373 -22 -116 132 -153 246
4832 246 -77 59 -157 7 13 -39 -190 11 279 6 -94 158 130 46 159 -24 405 46 49 101 247 -15 132
4855 132 -103 -46 -123 -49 61 -133 49 -149 29 4 -34 -69 -91 -57 216 -66 5 -40 19 -59 58 -167 -54 -91
4879 -91 117 -58 -163 -6 0 -78 121 87 -148 -44 -293 -261 74 -203 21 129 -25 -16 -157 104 -69 -141 101
4902 101 -114 81 -63 -107 180 -42 -92 -31 228 -66 -7 114 71 -169 -110 118 96 0 120 123 193 38 -79 158
4926 158 11 76 167 -93 117 152 19 96 -80 26 -131 -53 -137 -144 -116 -75 47 30 -119 100 -171 -155 -22 141
4950 141 -52 25 -70 9 -197 219 -106 -171 30 141 -77 19 -43 -285 143 133 126 80 -138 196 -48 -104 -24 -115
$$ packed form
4786I3j90M5J26k99L86k05R1j67O7K71n1M8j85M3j49j29J08O3N8j65K72j93j80
4809b42J76J24O2k69N6R9K72l58o1k2J04k9K18q3k20J87N7m44L51r4K48k85L99
4832B46l23J36k16J64On2j51K01K68k73j00K52k8q4J13j83M29l59LN2J46k62J47
4855A32k35N7p7P4J10j94J82j98J78k5l8l5k2L4K73k82P1m5N9p8J17k25J13l7
4879i1K08j75j05J57Op8J99l4k35J04k49L2L35k77K24J08j54Rj41K61j73p2K42
4902A01k15J95j44m4K87k22n0O1K59k94N9J21m3k40N9K28k2r6J20LP0j55j17K37
4926A58j47O5R1k60K10L5j33P7j76J06j57P8q4pK8M1J22j7j49K19k71J6J33J63
4950A41j93P7r5P9k06M16l25o5K01J11k18R6o2k42M28j0pm6k18L34k44n6Q0r1
$$ plain form
4974 -115 -110 30 -47 -118 92 5 -50 -31 -217 -68 24 -50 6 -32 45 24 -57 -7 177 238 -60 -35 -21 -9 -98 153 207
5001 207 -139 78 50 77 67 211 248 161 -1 75 114 -149 -16 -20 -26 -33 -93 252 -45 144 -14 -59 29 -173 -4
5026 -4 -259 84 29 15 1 -100 53 -228 -36 -203 30 98 -57 -220 -59 23 160 162 -22 -16 -4 -162 95 200
5050 200 51 -47 32 67 158 -101 11 41 -108 -100 -69 73 77 -165 -67 -15 25 29 153 138 -4 35 179 91 162 -60
5076 -60 106 -259 143 -247 29 26 -144 -54 32 264 71 38 -168 183 -150 -125 -148 -87 27 -37 170 -127 1
5099 1 -168 -240 -7 54 147 -36 -56 -236 -61 -4 -183 -27 25 40 66 -13 120 -23 -6 -2 -112 -99 96 44 -98
5124 -98 379 -64 -60 98 -72 -205 97 90 83 -105 158 -26 66 -105 -39 386 -145 28 180 217 -200 2 10 71
5148 71 92 -72 -155 27 29 68 11 -9 -157 269 -78 35 -6 -38 152 -219 -221 -105 237 126 39 84 -14 -53 41 -85
$$ packed form
4974a15NJ40p7p1K10q7n5J9j86J49R2p4N6l8P7k1q1N0J84O1k98K5J4J2q9K51N4
5001B07l46K17k8K7j0J44L7q7j62P6L9k63J33mopo0L45k97J89j58m5Q8k02J69
5026dk55L43n5j4j4j01J53k81J92j67K33O8j55j63J61Q2J37Kj84OJ2j58K57J05
5050B00j49r8P9L5R1k59J12L0j49QL1J42Mk42R8N2M0MJ24j5j42L9J44q8P1k22
5076f0J66l65M02l90K76lj70R0Q6K32j93l3k06L51l33K5k3O1J14o4K07k97J28
5099Aj69p2K33O1R3j83k0j80J75N7j79J56N2J5K6p9J33j43J7Mj10J3J95n2j42
5124i8M77m43MJ58j70j33L02ppj88K63j84R2j71O6M25n31J73J52L7m17K02QO1
5148G1K1j64q3J82KL9n7k0j48M26l47J13m1l2J90l71kJ16L42j11q7M5r8l9R4j26
$$ plain form
5174 -85 -238 18 -6 41 -126 -117 -87 21 -106 -69 64 -108 -271 72 -24 36 137 128 -138 -131 -25 -27 -87 50 -22 39
5200 39 267 124 29 348 -104 26 -148 94 35 61 181 -123 30 166 -63 -54 -290 -180 11 23 -61 179 -89
5223 -89 18 56 99 149 -186 -50 117 92 -37 278 85 87 131 -151 141 110 334 -101 -119 -31 104 44 -23 69 -61
5248 -61 -165 3 208 -112 -62 76 139 89 121 -34 -148 -87 -132 -172 -122 -106 104 -77 277 140 -50 -311 -69
5271 -69 69 59 60 201 259 82 34 106 9 -88 -39 -45 266 101 -311 -44 59 63 79 23 -195 327 84 -92 -10 -119
5297 -119 -77 110 217 -61 22 204 -25 109 48 82 -62 -93 102 166 49 -12 -93 174 71 -248 -56 -7 106
5320 106 -51 81 113 252 162 -228 49 -35 -128 -94 -109 8 -37 -57 -96 106 77 -114 56 125 -147 -21 220 7
5344 7 -77 -161 -123 -47 -115 -241 2 -17 -40 11 -190 -14 -38 140 1 124 207 -8 -117 116 6 136 -167 113
$$ packed form
5174h5j53K56k4M7j67RL0J08j27L7J33j72j63L43r6O0J01rk66PJ06ko0J37p2O1
5200C9K28j43r5L19m52J30j74K42n9K6J20l04J53J36k29Rk36J10J91J2q4K40k68
5223h9J07L8M3N0l35J36J67k5j29L15j93KM4k82K92l1K24m35j8Q8J35o0o7R2j30
5248f1j04J68K05l20N0J38O3n0L2j55j14O1m5m0N0J6K10j81L54j37j90k61K42
5271f9J38j0JJ41N8j77m8P2r7r7M9oL11j65m12K67J03MJ6n6k18N22k43j76Q2j09
5297a19M2J87J07k78Q3J82k29J34o1L4j44l1J95O4j17o1q1K67j03l19J92M9J13
5320A06j57J32L2J39r0l90K77q4r3L4j5J17m5k0l9K02k9j91J70O9k72J26K41k13
5344Gq4q4L8P6o8j26K43j9k3N1k01J76k4J78j39J23Q3k15j09K33j10J30l03K80
$$ plain form
5368 113 174 209 42 197 85 67 -166 50 -29 5 48 -209 207 218 -121 -79 -36 3 169 -123 -169 144 98 -189
5392 -189 -42 15 -99 59 -43 333 67 114 52 -117 55 -89 -135 225 -135 -264 51 -183 21 66 -84 -37
5414 -37 -41 -49 -139 101 -51 -297 -41 94 70 -48 -72 -78 221 29 22 102 156 207 -28 -79 -203 -15 147 -224 16
5439 16 189 86 248 -107 15 183 56 -3 -64 -32 -16 103 98 14 102 150 17 -142 -110 -86 -159 -69 -197 122 -176
5464 -176 -33 156 -149 273 35 142 -109 5 13 -190 -156 20 -209 -105 -79 -76 474 368 112 55 -164 -171 87
5487 87 -36 -105 -151 113 -32 178 99 72 -168 30 94 12 -40 69 62 38 -170 152 229 40 -82 185 15 -1
5511 -1 88 122 438 -124 128 -129 97 240 11 233 79 90 45 30 -71 -44 -63 277 -122 -42 -39 66 -107 66
5535 66 49 49 217 -12 37 44 -1 -185 -46 11 13 -5 -62 -113 -111 -97 -178 -169 -36 169 20 -428 -47 330 -68 -175 62
$$ packed form
5368A13O1L5j67J55j12j8k33K16p9L4M3k57M16J1l39M2M3L9J66k92m6L13m6k87
5392a89J47N7j14J58j02L76k66M7o2j69J72j44m6L60l60j29L15k34K04M5j50M7
5414c7mqr0K40j52k46K56J35k4j18k4oK99j92pQ0N4N1k35n1j24J88J62l71K40
5439A6J73j03J62l55J22J68j27n9o1L2J6J19nq4Q8M8j33j59L2K4p3R0j28L19k98
5464a76J43J89l05M22k38J07k51J14Qk03L4J76k29J04K6LN50j06k56n7k19pK58
5487H7j23o9m6K64j45K10p9k7k40J98O4q2n2J09pk4k08L22P7j89j22K67j70j6
5511aQ9L4L16n62K52k57K26J43k29K22j54J1m5j5j01K7j9L40l99Q0LJ05j73J73
5535F6j7%J68k29M9Pm5j84J39N7Kj8n7n1KJ4q1RJ33K05j49m48L81L77l98j07K37
$$ plain form
5562 62 195 -94 -245 54 84 -162 91 -64 -5 50 -6 -38 146 -57 194 -10 91 145 288 -255 9 -217
5584 -217 41 70 -10 133 -19 58 158 -98 169 39 160 132 138 48 342 175 -166 122 143 142 15 220 -39
5607 -39 204 32 -2 -18 354 52 -146 25 -172 -172 -371 -122 -60 -36 -180 4 -69 3 62 -27 -375 132 -165 -61
5631 -61 276 -31 97 -164 -75 -6 157 -142 -146 98 -35 158 -208 -96 201 154 -99 1 -258 119 53 130 18
5654 18 33 133 52 132 75 45 -100 -60 24 -13 62 -108 -86 169 -41 -186 -72 -190 -5 224 -91 132 -94 -127
5678 -127 18 -267 -124 -156 400 -9 -170 152 127 237 66 -115 102 -129 102 -44 -99 -65 -210 41 7 -52
5700 -52 44 81 -138 94 40 -130 106 -25 111 232 156 -25 41 -169 204 -14 42 -25 195 -177 -144 1 -115
5723 -115 -193 -97 -63 -150 -185 -114 35 14 -11 249 -29 -66 133 283 -49 -9 90 -42 -10 10 81 293 -75 222 291
$$ packed form
5562F2J33k89j51K99L0k46K53j55N9N5n6l2J84k03K51k04J01N4J43n43K64k26
5584b17K58K9q0J43j52P7J00k56K67j30J21k8Or0K94j67l41K88K1jj27K05k59
5607c9K43j72l4j6L72l02j98J71j97%j99K49O2K4j44J84p3P2N9q9l48N07k97J04
5631f1L37l07J28k61Q9O9J63k99mK44j33J93l66J12K97m7k53J00k59L77o6P7j12
5654A8J5J00q1Q0n7l0j45M0Q4l7P5j70K2K55k10j45J14j18J85K29l15K23k26l3
5678a27J45k85J43l2N56m09j61L22k5J10j71j81K17k31K31j46n5L4j45K51l4n9
5700e2R6L7k19K32n4j70K36j31J36J21p6j81O6k10L73k18N6o7K20l72L3J45j16
5723a15p8R6L4q7l5P1J49k1k5K60k78l7J99J50l32M0R9j32L2K0P1K12l68K97O9
$$ plain form
5748 291 -74 -119 -141 -62 207 102 -36 -41 228 -23 -37 -132 24 107 -65 -81 2 45 210 -12 47 -17 -236 -21
5772 -21 -116 -38 187 100 -58 -140 83 -77 71 -125 19 -262 -69 135 175 17 -137 -24 -29 24 -162 -160 156 -338
5796 -338 -132 107 298 179 45 38 216 86 -90 -47 26 -4 -37 -71 49 133 8 19 -178 -72 182 44 -114
5819 -114 77 250 113 38 -46 367 114 18 0 72 -17 51 319 -34 91 -246 -173 212 11 20 329 183 -104
5842 -104 -141 -53 108 -49 -175 58 -36 -180 160 76 -56 16 223 247 -47 -103 80 68 124 -63 166 -54 -290
5865 -290 128 184 -169 48 151 -180 -25 64 -123 -62 46 -83 -32 264 -68 42 174 -142 -71 -78 -159 8 325
5888 325 191 42 68 178 196 72 47 -86 120 -99 31 162 -89 31 176 124 285 113 49 -169 73 14
5910 14 145 -22 -43 133 -5 -165 178 118 -82 -26 -246 60 -137 -81 -76 66 -108 -419 -198 45 -185 40
$$ packed form
5748B91l65m5k2P9K69j05j38nK69k51j4r5J56Q3j72j6Q3M3J65k22N9o4k19K15
5772b1r5P8K25q7j58q2K23j60J48j96J44k81J93K04M0j58j54J13nN3j86KL16m94
5796c38K06K39J91j19j34pJ78j30j76M3P3l0l3l4J20Q4j25J1j97J06K54j38j58
5819a14J91J73j37p5q4M13k53r6j8P2q9O8K68l53J25l37P3L85k01RL09j46k87
5842a04l7Q8J61j57j26K33r4j44L40q4j32P2K07K4k94n6J83j2N6j87K29k20k36
5865b90M18N6l53K17J03l31J55Q9j87O1J08j29N1K96l32J10J32l16P1pq1J67L17
5888C25j34j49K6J10J8j24k5j33K06k19J30J31k51J20J45n2J61j72o4k18K42n9
5910A4J31j67k1J76j38j60L43o0k00N6k20L06j97N6NJ42j74l11K21K43k30K25
$$ plain form
5932 40 -118 51 -76 -10 63 -116 -16 -4 -197 69 -102 -1 5 -105 43 -2 244 -103 106 15 -33 230 167
5955 167 -40 54 228 8 -7 -101 42 43 121 121 209 -129 86 142 -34 74 119 76 122 317 40 46 -87 -33 72
5980 72 -126 191 40 -33 -262 77 155 -26 106 -32 56 -126 -196 -93 -30 -103 112 -248 13 215 -135 -35
6002 -35 103 -136 -66 -102 116 -91 -52 -25 112 151 -85 -54 -109 275 -72 -47 -168 132 -61 75 156 -177 112
6025 112 31 58 70 -73 240 102 -121 120 94 93 -19 -115 25 -12 -62 -3 99 9 -94 67 -201 361 -70 136
6049 136 12 87 -246 -17 -254 -219 -87 -140 141 -72 -199 -9 9 87 91 -14 -9 53 -184 274 0 -203 -92
6072 -92 22 -16 201 -159 54 31 -226 1 127 -172 86 87 -77 9 -91 43 81 -65 258 141 -161 -187 35
6095 35 17 46 62 60 -15 116 -16 139 -37 -56 36 142 261 -233 -54 170 67 -182 -28 78 -34 90 87 11
$$ packed form
5932D0j58J69j27O6P3j79J00J2j93K66j71J01Oj10J48m5K46l47K09r1m8K63o3
5955A67k07R4J74k20j5r4J43JP8%Q8l38K15N6j76J08M5m3M6J95k77Oj33N4J05
5980G2j98L17j51p3k29L39P8j81J32j38Q8j82p0J03O3p3K15l60K61K02l50J00
6002c5J38k39P0l6K18k07L9K7J37L9k36L1n5L84l47K5j21L00j93J36Q1l33K89
6025A12q1K7J2j43L13j38k23K41k6jj12r6J40l7n0N9J02r0j03J61k68N62m31K06
6049A36j24P5l33K29k37L5J32n3K81k13j27J90J8P8Mj05NO2k37M58k74k03J11
6072i2J14l8K17l60K13k3k57K27J26k99K58Jj64Q6j00J34L8j46L23j17l02k6K22
6095C5j8K9J6kp5J31j32J55j76j9R2J06J19m94J79K24j03k49J54J06j12J24lp6
$$ plain form
6119 11 46 75 109 35 355 87 -142 -157 15 -108 -198 19 96 -39 -63 -7 -158 -116 86 -102 -153 -152 69 34 -21
6144 -21 -128 -33 -98 -13 -156 196 35 -99 161 29 -334 -155 104 -19 9 -5 -208 137 73 -204 -231 -151 49
6167 49 8 78 106 31 129 -30 -59 -97 -302 56 36 247 9 13 -73 -48 -127 -197 162 16 99 7 148 61 199 -25
6193 -25 36 -48 -106 -85 -120 -121 -75 57 103 -193 -74 -92 -17 116 25 160 90 -206 -176 86 -76 72 -141 -180 30
6218 30 13 125 -226 113 -34 195 126 124 13 162 -199 -48 0 -111 -98 -275 2 -55 158 -141 -86 131 -31
6241 -31 -168 44 -69 201 45 -1 90 92 -30 44 -54 171 150 42 72 -226 -76 138 196 -19 230 -60 -75 -118
6265 -118 -68 211 -35 105 -168 -111 136 171 -79 84 56 -106 222 -162 150 -57 -25 146 -74 311 -103 -8
6287 -8 49 42 -10 47 30 37 -136 -51 72 108 -153 303 -148 -16 -93 250 80 -213 -56 -130 -135 -26 -18 -178 -92 105
$$ packed form
6119A1L5K9L4p4L20k68k29j5J72j23r0K17P7j35k4N6j51M2K02j88n1JK21l5n5
6144b1j07R5o5Q5j43L52j61j34K60j32l63J79K59j23K8j4k03L45o4k77k7Q0K00
6167D9m1P0K8p5R8j59k9l8k05L58k0K11k38Mq6K5p9p0L59j46Q3r2J41q7J38k24
6193b5O1q4n8K1l5jM6J32M6k96J19j8P5J33r1J35p0k96L0K62j62J48k13l9K10
6218C0j7J12l51L39j47K29o9kj11J49l61J51M8j11J3j77K77n7K13k99N5K17j62
6241c1j37K12j13K70j56m6R1Kj22P4r8K25k1j08L0k98J50K14N8k15K49k90j5m3
6265a18N0K79k46J40k73N7K47L5k50J63k8j62L28l84L12k07L2J71k20L85m14R5
6287hN7pn2N7j7Pj73Q5J23L6k61M56m51J32p7L43j70k93J57p4nJ09Qj60Q6J97
$$ plain form
6313 105 51 -4 -44 -150 34 -18 123 -24 93 -119 119 -95 38 -240 -56 148 80 246 -14 13 219 23
6335 23 182 -1 99 -288 66 -103 207 102 5 252 -231 141 22 81 -100 95 136 -18 23 -55 195 -116
6357 -116 -80 -72 -110 -31 -66 -12 -289 -5 -83 211 145 8 -41 47 -69 -101 38 52 -123 35 -200 -106 16 69 199
6382 199 -44 -101 21 -71 77 -261 58 211 -177 169 -9 -97 -32 -76 90 -234 -85 24 56 278 58 -34
6404 -34 66 147 274 11 199 34 101 -116 155 -36 15 329 166 -11 8 -14 -60 139 -244 90 34 178 28
6427 28 34 -341 -76 331 175 -85 62 118 19 117 -159 33 64 -117 -65 -152 80 -26 -125 -5 -60 -103 -37 -139
6451 -139 81 -32 -214 192 -128 181 -7 -118 -50 88 -147 -83 22 -143 91 3 4 9 42 127 -194 42 70
6474 70 69 -27 -92 21 192 -19 -70 18 -165 227 -107 71 149 -38 182 265 -170 222 20 -11 29 -228 109 111
$$ packed form
6313A05n4n5m0j06J84n2J41j47J17k12K38k14J33k78J84K04o8J66k60K7K06j96
6335B3J59j83J00l87L54j69L10j05r7K47m83L72j19N9j81J95M1j54M1p8K50l11
6357a16L6Ql8P9l5N4k77K84p8K94o6j37m9Q8j16l2J39J4j75J58k35R4J22N3J30
6382A99k43n7J22r2J48l38L19J53l88L46j78q8O5m4J66l24J49J09L2K22k20r2
6404c4J00Q1J27k63J88j65O7k17K71j91N1L14j63j77J9k2m6J99l83L34n6J44j50
6427B8Ol75K65M07j56k60J47N6r9R8k76J92L1j81N2q7K32j06r9J20n5m3O6j02
6451a39K20j13j82M06l20L09j88j11O8J38k35O4J05j65K34q8JNL3Q5l21K36K8
6474G0jr6o5J13J71k11n1Q8j83L92l34J78P8j87K20Q3m35L92k02l1M0k57L37K
$$ plain form
6498 111 152 86 -200 15 -191 -37 184 152 -18 -121 8 14 -25 203 -154 -92 35 81 60 -306 -14 -97 7
6521 7 -215 -6 176 -14 -161 156 86 -308 -82 129 -195 44 17 187 -80 -119 -51 -95 -2 142 -214 -238 4
6544 4 -29 52 -8 88 211 5 89 -145 -98 211 -9 96 -27 68 56 160 170 79 121 109 219 106 45 -123 17
6569 17 175 70 -176 -131 62 291 -244 11 35 94 87 -7 2 126 66 -228 114 -74 34 -204 70 -63 -165
6592 -165 -42 44 -140 68 -215 91 -11 168 13 -39 -48 -159 143 -301 -159 77 89 -121 -191 -268 55 54 14
6615 14 -60 -61 -33 -92 -123 -253 45 88 -156 -82 4 64 -127 -89 280 47 213 60 -27 226 198 4 213 -62 -51
6640 -51 49 -99 -58 117 64 66 32 0 184 5 -148 68 190 -93 94 -26 -128 83 -94 102 -107 42
6662 42 169 -221 202 95 144 22 -39 129 -115 -138 65 -23 -24 -21 -91 -144 91 22 -165 -216 41 131 -8 86 -50
$$ packed form
6498A11M1o6k86K15k06J54K21l2j70j03J29Ol9K28l57O2J27M6k1l66K92q3J04
6521Gk22K09J82j90j47L17p0l94K26K11l24K39k7J70k67l9O8m4R3J44l56k4K42
6544Dl3Q1o0R6J23k06Q4k34M7L09k20J05j23R5j2J04J0r1M2j2J10j13o1j68J40
6569A7J58j05k46M5J93K29n35K55K4N9pr4RJ24o0k94L42j88J08k38K74j33j02
6592a65J23Q6j84K08k83L06j02J79j55n2rj11L02m44J42K36J2k10p0p7L23jm0
6615A4p4jK8n9l1j30K98M3k44P4Q6O0j91L8L69k33J66j53q7K53k8j94K09k75J1
6640e1J00j48M1J75n3Kl4l2J84j79j53K16J22k83J87j20j02K11j77J96k09J49
6662D2J27l90M23j07M9j22o1J68k44k3K03q8jLp0n3K35o9j87n1K57R0j39R4j36
$$ plain form
6687 -50 44 -53 -26 -156 0 24 168 200 166 283 134 54 -49 -41 -80 -26 28 -60 10 -74 -10 144 -127 83 -24 11
6713 11 221 299 129 293 41 -13 -27 -23 -6 -129 46 7 -190 2 44 231 -73 133 93 -167 32 -22 -60 23
6737 23 -178 -29 54 -7 88 -170 33 -22 122 144 277 36 164 -67 194 137 23 61 -23 -91 97 127 -234 122
6761 122 49 -87 136 -65 -71 -8 33 207 -97 126 197 -68 122 89 -262 25 -78 53 -27 -117 -37 -153 -63 -328
6785 -328 66 -89 -85 -12 258 53 -132 -19 128 116 124 -167 50 -11 -98 13 72 203 -22 20 -81 82 315
6808 315 -128 -45 204 120 161 -7 -72 34 -6 116 236 -110 169 7 -35 149 -224 167 -84 -117 111 -33
6830 -33 113 99 -17 30 -110 -149 -29 -105 -31 -43 152 -45 118 -71 -344 -37 -2 -77 -89 -62 94 -156 204 -57
6854 -57 -324 112 46 -162 86 -103 -50 -55 291 -82 -138 171 -207 7 63 72 -85 304 -62 11 9 -44 -45 -100 30
$$ packed form
6687e0R4r7K7j30J56K4J44L2l4J17j49q0j03Ql9N4N4q8P0q4O4J54k71K10j07L5
6713A1K10P8j70J64k52n4j4MJ7j23J75l9j97J92M2J87l04K06m0k60J99n4l8Q3
6737B3k01J49Q3o1R5k58K03n5J44K2J33k41J28k31K61n7j14L8q4o8J88L0l61L56
6761A22p3j36K23k01oO3M1J74l04K23P1k65J90l3l51K87j03J31q0r0Q0j16R0k65
6785c28L94j55MP3K70k05j85J13J47j2Qk91K17o1q7J11N9J31k25M2j01J63K33
6808C15m43Q3K49q4M1j68o5J06m0J22J20l46K79j62m2J84l73L91k51l3K28j44
6830c3J46j4j16M7j40l9J20p6P4j2J95j97J63j89k73L07L5p5j2K7J56k50L60k61
6854e7k67M36o6k08K48j89N3nL46l73n6L09l78K14N6Rj57L89l66P3kn3jn5J30
$$ plain form
6879 30 -118 -90 -60 51 -60 -3 -255 60 163 163 -68 -146 8 -55 148 75 -131 46 -38 -205 -95 -6 -182 -219
6903 -219 -103 52 24 -257 -30 -284 148 -136 36 -137 -26 64 40 -12 -72 -11 7 246 191 2 -47 -166 37
6926 37 119 -119 -132 -115 142 314 -175 87 91 74 -49 151 -101 160 46 71 -106 -110 -16 95 182 -13 -158 232
6950 232 -88 -136 4 237 134 15 276 -17 295 207 14 19 218 173 -79 41 66 102 237 7 -146 44
6972 44 -45 -2 46 259 -51 214 -17 -94 83 27 39 -16 -226 -74 21 -138 -163 197 -255 -97 99 -38 -83 -6
6996 -6 -75 87 -94 -208 150 -224 -19 250 78 133 -85 148 42 -63 -307 -270 145 74 -129 -110 227 -17
7018 -17 370 -128 175 123 55 99 293 4 -221 -94 -43 -76 292 75 -205 21 151 -143 -89 -217 -30 139
7040 139 -76 -129 -107 64 -73 -8 -95 56 181 -125 -41 100 -102 -77 262 -111 -22 297 -118 -94 135 72 -3
$$ packed form
6879C0j48K8L0J11j11N7k52L15J03%k31p8J54o3K03p3k06J77q4j67J10Q9j76l7
6903b19J16J55k8k81K27k54M32k84J72j73J11R0k4n2o0O1J8K39n5j89m9j19K03
6926C7Q2k38j3J7K57J72m89K62Mj7j23K00k52K61j14K5j77mR4J11Q7j95j45L90
6950B32l20m8J40K33j03j19K61k93L12q8j93NJ99m5k52J20K5L6J35k30j53J90
6972D4q9M3M8K13l10K65k31p7J77n6J2n5k10J52R5j59k5L60m52J58J96j37m5P7
6996fo9J62j81j14L58l74K05K69j72N5k18K33j06j05k44L7M15p1k03J9L37k44
7018a7L87m98L03n2o8M4J94k89k25J27N1l3L68k17k80K26J30k94N4j28J87J69
7040A39k15n3K2J71j37O5q7J51J25l06Q4J41k02K5L39l73Q9L19m15K4K29o3p5
$$ plain form
7063 -3 147 -34 -139 -91 -202 133 110 10 -83 -41 199 99 18 -11 55 55 189 -14 -77 -82 -99 98 -135 -138 -186 -192 -22
7090 -22 -82 53 39 -21 -121 19 -83 208 127 -205 82 194 -49 -133 -129 -89 149 4 171 -159 -78 -69 -49 25 -222
7115 -222 52 93 30 -69 74 -23 -108 -146 122 -25 30 109 23 -324 -108 -59 106 -132 -149 -71 105 -113 53 -200
7139 -200 -15 36 -46 254 40 -150 126 -45 -133 4 -6 39 -155 273 98 76 -38 57 198 -23 -75 68 -110
7162 -110 168 -147 -87 -153 25 -141 123 75 103 -58 70 123 171 107 215 -164 -37 -93 56 15 -85 200 177
7185 177 -264 127 -17 34 -27 221 172 -187 2 -103 126 20 -67 61 6 140 147 -150 77 35 -51 -122 -97 -20
7209 -20 -43 -69 81 64 156 -225 272 277 -200 225 -175 -172 56 -173 -16 162 7 117 156 19 25 104 -78 76
7233 76 -76 -72 152 164 240 86 213 52 126 126 133 64 -65 -81 118 126 -10 -24 73 -37 -61 74 -28 -56 189 -241
$$ packed form
7063cJ50j81j05M8j11L35k3j00r3M2K40j00q1k9O6%J34k03o3nj7J97k33lm8oJ70
7090b2o0J35j4o0j00J40j02K91q1l32K87J12k43q4MM0K38j45J67l30Q1RK0P4k47
7115b22K74M1o3r9J43r7q5l8K68j47N5P9q6l47K16M9J65k38j7P8J76k18J66k53
7139b00J85N1q2L00k14j90K76j71q8J37j0M5j94M28j75k2j14R5J41k21n2J43j78
7162a10K78l15O0o6J78j66K64m8K8j61J28N3M8o4J08l79J27n6J49m1j00K85k3
7185A77m41L91j44N1o1K48m9l59J89j05K29j06q7J28n5J34Pk97K27m2q6p1K5P7
7209b0k3k6J50j7R2l81M97Nm77M25m00LK28k29J57J78j55J10L9j37OP9j82J54
7233G6j52MK24J2P6j54J27j61P4%Po9j29j6J99Qj36j4R7j10k4J35j02k8K45m30
$$ plain form
7259 -241 -32 40 167 -185 38 -31 154 -33 153 -41 68 -21 118 41 -29 17 73 71 149 -167 28 120 -83 -198
7283 -198 95 5 36 -22 16 100 60 -107 223 -237 115 -72 -168 43 174 77 -69 -226 -213 192 130 -71 126
7306 126 22 -114 14 -185 146 8 -70 140 85 -231 -27 -121 -4 -240 -101 164 -88 -41 70 -4 -20 -34
7328 -34 197 -98 -112 55 -68 -149 -227 -138 46 22 24 -173 -85 -42 44 -104 -75 136 63 69 39 144 103 -81 -33 32
7354 32 -147 -179 225 202 4 57 25 -43 177 163 14 -90 29 -33 269 -68 -12 99 129 80 34 110 172 -31 -55
7379 -55 112 69 -12 12 -21 149 32 -38 3 3 5 0 -103 63 15 133 -67 -61 77 -204 182 223 180 5 -69 -90 -128
7406 -128 20 56 -77 10 -22 -137 41 -217 149 106 -61 -111 64 -73 -107 134 165 11 -247 147 -129 231
7428 231 -145 67 120 -169 96 46 -54 117 5 -198 182 -134 -213 -92 42 203 -52 160 13 -132 28
$$ packed form
7259b41K09P2J27l52K23o9J85j87J86j94J09q9J39p7p0M6N6kP8l16J95R2k03j15
7283a98K93r0L1n8L8Q4m0j67L30m60L52j87r6K11J31r7j46j57J3M05o2k01J97
7306A26j04j36J28j99L31j38p8K10n5l16K04r4J17k36J39K65k52M7J11p4j6j4
7328c4K31k95j4J67j23q1p8Q9J84k4Kj97Q8M3Q6j48K9K11p3Ol0J05m1j84M8O5
7354C2j79l2M04k3j98N3l2o8K20j4j49j04J19o2L02l37N6J11L0m9m6P6O2k03k4
7379e5J67m3q1K4l3J70j17p0M1%Knj03J66m8J18k00OJ38k81L86M1m3j75p4k1l8
7406a28J48L6j33Q7l2j15J78k58L66m3j67n0J75j37l4K41L1j54k58L94k76L60
7428B31l76K12N3k89K65n0j00J71j12k03L80l16p9J21J34J61k55K12j47j45J60
$$ plain form
7449 28 147 250 207 57 -181 -162 381 43 228 -127 -136 131 -56 256 -174 -122 103 -40 -73 227 294 -80 -17
7472 -17 -150 -102 107 -304 -191 -35 -83 -211 -108 -96 -137 -115 -344 53 42 -101 -154 -103 202 176 -84 60 -109
7495 -109 -105 173 443 4 73 -289 -204 -105 -141 -50 -80 -84 158 -173 34 -211 -56 96 49 -196 -18 38 -11 -86 201
7520 201 11 -92 -42 59 -18 216 23 218 -20 49 70 -46 -78 233 212 -114 8 96 103 -31 -116 -1 3 29
7544 29 26 34 -36 -108 105 -47 29 18 -63 -143 31 169 -135 69 93 -160 -45 132 -165 -36 -11 -80 71 -30 113
7569 113 32 20 -85 321 -83 137 206 3 -40 0 40 203 108 -67 -130 58 -119 52 -64 26 224 126 -120
7592 -120 115 -42 -164 104 220 -78 -99 41 26 258 -77 84 -91 97 -49 50 -67 -136 176 -38 61 225
7614 225 -320 26 190 -104 95 -213 -248 12 30 63 -115 140 78 -58 -84 -227 -44 -91 -13 -6 50 0 -75 176
$$ packed form
7449B8J19J03m3j50k38J9N43l38J85l55rK67j87L12m30N2K25j43l3L00O7l74O3
7472a7j33M8K09m11J13J56m8j28J03J2m1K2k29L97j1j43n3N1L05k6k60J44j69
7495a09MK78K70m39O9l62Q5R9l6R1l0mK42l31K07k45J55J52m7k45J78N6m9p5K87
7520B01j90j03N0J01p7K34j93J95k38O9K1j16l2L11k1l26J22Q8Pj34q5J15MK6
7544B9lQp0p2K13j52P6j1q1q0J74J38l04K04K4k53J15J77k97J29K5o9J51j01J43
7569A13q1j2j05M06m04K20O9k03m3M0M0J63r5j75o3J88j77J71j16R0J98r8k46
7592a20K35j57j22K68J16k98k1J40j5K32l35J61j75J88j46R9j17o9L12k14R9J64
7614B25n45L46J64k94J99l08l5K60J8L3j78K55o2j36k6j43J83m7P8PN6n0p5K51
$$ plain form
7638 176 30 162 167 -40 -89 128 121 -11 -138 34 -174 -256 197 118 -19 31 -229 -25 -100 201 281 101 -52
7661 -52 -40 -185 -208 159 51 130 165 119 -79 21 42 255 -145 -27 -183 -29 -176 41 -111 -78 -20 13 258
7684 258 -90 44 60 -201 83 35 -230 73 -174 71 48 90 -114 274 -75 -73 -191 11 -145 -67 -79 -193 65
7707 65 -164 139 114 29 215 11 -42 -101 -137 -11 106 143 72 -175 74 -252 72 -22 278 88 23 -188 99
7730 99 -84 -5 119 -137 -91 -108 23 -28 31 73 299 -26 176 67 93 -31 53 -72 -144 -5 88 -146 -144 120
7754 120 21 41 256 24 -66 -128 106 -41 -140 -23 -44 68 130 79 278 192 -55 -47 -96 -55 -122 -57 -280 9 -65
7779 -65 68 -384 72 -60 -9 44 -188 -10 -6 -89 -214 -10 118 -83 20 49 274 -35 -279 75 138 -48 -43
7802 -43 71 119 -104 -72 145 -68 -115 -147 166 -81 181 -101 193 91 102 176 -161 130 -45 313 -46 27 -199
$$ packed form
7638A76j46J32Nk07m9K17pj32j27J72k08q2M53p9j37N0k60K04p5L01Q0j80j53
7661e2J2j45k3L67j08P9L5m6j98J00K1K13m00J18j56J54j47K17j52L3N8L3K45
7684B58l48J34J6k61K84m8k65L03k47K45k3M2k04L88l49Kj18K02j56P8j2j14K58
7707F5k29L03k5q5J86k04n3n9l6J26J17L7p1k47K49l26L24r4L00j90o5k11K87
7730I9j83P9J24k56M6j7J31n1N9M2K26l25K02j09K6j24Q4j25p2J39R3k34KK64
7754A20r9K0K15k32r0o2K34j47r9J17k1J12O2n1J99q6k47Qm9M1o7O5k23K89p4
7779f5J33m52M56j32N1N3k32J78Mq3j25K04J28k01J03K9K25l09k44L54O3j86N
7802d3J14M8k23L2K17k13m7l2L13k47K62k82K94j02J1P4l37K91j75L58l59P3k26
$$ plain form
7825 -199 111 138 34 -29 -99 24 -102 -168 -48 49 -161 86 99 -213 23 22 -29 37 -72 62 -64 149 85 124
7849 124 -109 -251 15 154 48 9 99 -109 23 23 -100 37 -43 -35 -50 -174 26 152 26 -48 98 133 59 -81
7873 -81 -85 84 53 -228 189 207 209 -68 -29 53 81 282 4 150 -142 97 -68 -165 145 3 119 -22 174 -13
7897 -13 79 -29 22 12 -126 1 -96 89 77 214 -167 -193 55 279 -28 76 45 -73 -140 -52 -195 66 -9 -134
7921 -134 91 -33 290 64 -6 -41 26 -213 184 -141 37 -48 -18 -114 134 -67 180 54 -11 -28 -192 188 -292
7944 -292 53 -57 87 321 -20 263 165 -195 142 -41 50 -26 204 36 73 -235 16 5 -167 99 -195 -122
7966 -122 -37 55 -109 -50 104 30 -31 81 121 -198 53 114 180 -1 -152 75 -208 -55 36 233 -86 -8 198
7989 198 -105 71 85 157 -278 218 17 100 -215 -222 70 -77 -31 264 137 -41 160 -4 163 -89 -90 -204 -123
$$ packed form
7825a99L10K7j04o3p0J23j26o6J20R7k10K47J3l12K36jn1O6j09J34j26K13o4L9
7849A24k33j42K66J39j06l9R0k08J32%j23J37q0Qj5j24K00J26j26p4J46L5p4j40
7873h1mJ69l1k81M17J8Kk77L9Q2K8K01k78J46k92K39j65r7L10j42J16j41J96j87
7897a3R2j08N1j0j38J27r7J85j2J37l81k6K48K24l07J04l1j18o7Q8j43K61p5j25
7921a34K25j24L23k26p0l5O7k39L97l25J78q5L0r6K48k01K47j26o5j7j64L80m80
7944b92L45j10J44K34l41K83r8l60L37j83R1p6K30j68L7l08K51j1j72K66k94P3
7966a22Q5R2j64N9J54p4o1J12M0l19K51O1O6j81j51K27k83J53R1J97l19P8K06
7989A98l03J76J4P2m35M96k01Q3l15pK92j47M6K95j27j78K01j64J67k52jj14Q1
$$ plain form
8012 -123 -136 127 -170 113 -61 31 -21 -73 -123 56 114 -151 -27 50 -153 74 -74 197 -78 202 73 47 130
8035 130 70 117 18 168 117 -77 200 148 151 75 -47 13 -49 106 -131 30 -31 -82 -27 -114 -167 4 -47 -320 88
8060 88 -11 -1 -30 109 -76 72 8 66 -224 -100 152 -29 -102 31 76 -7 65 -36 -33 -160 -303 261 -68 -37
8084 -37 -93 54 334 108 112 200 88 90 -27 147 168 20 -25 -72 -28 139 84 59 3 -180 -109 -85 -105 -99 8 171
8110 171 116 203 -21 -147 -176 29 50 33 114 -294 120 -11 76 -24 -70 -370 -276 20 190 75 164 -353 71
8133 71 -108 -49 11 20 186 -84 15 -82 -17 -119 190 -165 119 -129 -47 -197 -57 -51 -160 212 96 176 175 -146 62
8158 62 -204 -52 87 172 -105 7 -58 34 -154 -192 92 -321 44 -140 355 -171 150 77 127 170 -3 -92 -115
8181 -115 -194 88 -19 -144 -46 95 -19 -128 172 -91
$$ packed form
8012a23j3K63k97K83j74R2n2n2n0J79N8k65J24P7k03K27j48K71k75K80j29k6Q3
8035A30o0M7r9J50n1j94K77n2Lp6j22O0o2J55k37J61o1n1N5q7n3J71n1k73M08
8060H8r9J0k9J39j85J48o4N8k90J24K52j81p3J33M5q3P2j01Lj27j43N64l29L1
8084c7n6J47K80k26MQ8j12Kj17J74K1j48m5m7M4J67n5k5n6j83P1K4k0OJ07J63
8110A71n5Q7k24j26k9K05K1j7Q1m08M14j31Q7j00m6l00R4K96J70j15Q9n17M24
8133G1j79N9O0RJ66k70R9r7O5j02L09l55K84k48Q2j50J40Oj09L72j16Q0jl21K08
8158F2k66J52J39Q5k77J12o5R2j88l8K84m13L65j84M95n26L21p3N0M3j73q9k3
8181a15p9K82j07j25R8J41j14j09L00k63
8191i1
$$ Imaginary data points
##PAGE= N=2
##DATA TABLE= (X++(I..I)), XYDATA
$$ plain form
0 0 0 0 0 0 0 0 0 0 0 0 0 0 0 8 -8 8 -8 10 -16 16 -24 24 -32 38 -41 49 -57 70 -80 89 -104 119 -136 153 -175
35 -175 196 -223 247 -279 310 -344 383 -425 471 -522 578 -638 703 -776 855 -941 1036 -1141
53 -1141 1259 -1389 1536 -1702 1889 -2107 2358 -2659 3019 -3462 4025 -4766 5784 -7289 9767
68 9767 -14829 51417 -115429 -9617 89162 -125338 50287 35233 -84540 50026 23310
79 23310 -42988 57514 -2619 -48806 19915 24550 -31075 4305 25974 -36835 -14433 11586
91 11586 -49642 11200 21024 -36301 29219 12590 -24054 31968 -26274 -39989 7302 -28345
103 -28345 3184 19022 -29608 1578 9511 521 7026 -19243 -2559 4143 -4634 18292 -10452
116 -10452 -14093 -818 -21961 19525 5234 -27353 43396 14520 -21795 36208 -6503 -22836
$$ packed form
0@%%%%%%%%%%%%%Qj6J6j6J8k6L2m0M8n6P0p9R0j06J27j50J69j93K23k55K89l28
35a75L71m19M70n26N89o54P27q08Q96r93J100j216J341j479J631j796J977k177
53a141K400k648K925l238L591l996M465n017N678o481P487q791J0550j3073J7056
68I767k4596O6246j66846J05812R8779k14500J75625j5054j19773J34566k6716
79B3310o6298J00502o0133m6187O8721M635n5625L5380K1669o2809K2402K6019
91A1586o1228O0842R824n7325O5520j6629l6644N6022n8242j3715M7291l5647
103b8345L1529J5838m8630L1186P933q990O505k6269J6684O702q777K2926k8744
116a0452l641J3275k1143M1486j4291l2587P0749k8876l6315N8003m2711j6333
$$ plain form
128 -22836 21032 -21885 -6960 32751 -9861 6044 31654 -15155 -5355 36454 -4180 -18800
140 -18800 27285 -449 -11115 33080 -17706 -25563 32826 -15014 -2943 44145 -24232 1469
152 1469 39865 -28339 -1583 11860 -38394 7119 14213 -20144 12134 7243 -11965 4447 81
165 81 -8701 -2459 3430 -6813 -8425 4058 -15001 -9968 5377 -23872 -1884 19608 -11134 8771
179 8771 6781 -20845 5214 -5650 -20417 1451 -8841 -3574 12161 1347 -1304 -3173 3901
192 3901 1614 -5088 11702 -5028 -5276 18328 -15680 -5386 15283 -21746 10342 21297 -13365
205 -13365 25098 13753 -15246 17172 -6280 -12896 14970 -6299 -646 13182 2539 7695 4529
218 4529 3602 -665 307 13320 -4116 1280 9167 -15354 6929 1749 -20692 15308 -857 -7448
$$ packed form
128b2836M3868m2917J4925L9711m2612J5905K5610m6809R800M1809m0634j4620
140a8800M6085k7734j0666M4195n0786p857N8389m7840J2071M7088o8377K5701
152A469L8396o8204K6756J3443n0254M5513P094l4357L2278m891j9208J6412m366
165H1q782O242N889j0243j612J2483j9059N033J5345k9249K1988K1492l0742J9905
179H771j990k7626K6059j0864j4767K1868j0292N267J5735j0814k651j869P074
192C901k287o702J6790j6730k48K3604l4008J0294K0669l7029L2088J0955l4662
205a3365L8463j1345k8999L2418k3452o616K7866k1269N653J3828j0643N156l166
218D529r27m267R72J3013j7436N396P887k4521K2283n180k2441L6000j6165o591
$$ plain form
232 -7448 26684 -6834 -5071 13464 -19526 -4584 -151 -17341 5537 -736 -5148 6910 -4810
245 -4810 -552 -3203 -6385 1728 -10357 2328 3962 -17130 3354 -5133 -17310 10110 -6619
258 -6619 -5890 15870 -6541 2914 8051 -15633 -1223 -2383 -10372 3653 -632 2907 5257 1033
272 1033 7607 -3783 518 6854 -7217 9181 4527 -7478 13222 -5364 -6439 14650 -8778
285 -8778 5029 18163 -5418 12210 8976 -9382 7268 -3387 -7475 7308 -1013 2931 7786
298 7786 3565 3190 -1537 4542 -1960 -4615 9756 -6102 -2323 10017 -15111 -135 6181 -17689
312 -17689 8626 6395 -11872 13416 52 -11929 4747 -9789 -10042 42 -5776 -1966 -313
325 -313 1965 -2494 -4509 4806 -9330 -4465 9438 -13250 -360 8863 -17219 1830 3146 -15014
$$ packed form
232g448L4132l3518J763J8535l2990J4942M433j7190K2878o273m412J2058j1720
245d810M258k651l182Q113j2085J2685J634k1092K0484q487j2177K7420j6729
258f619P29K1760k2411R455N137k3684J4410j160p989J4025m285L539K350m224
272A033O574j1390M301O336j4071J6398m654j2005K0700j8586j075K1089k3428
285h778J3807J3134k3581J7628l234j8358J6650j0655m088J4783q321L944M855
298G786m221l75m727O079o502k655J4371j5858L779J2340k5128J4976O316k3870
312a7689K6315k231j8267K5288j3364j1981J6676j4536k53J0084n818L810J653
325c13K278m459k015R315j4136M865J3903k2688J2890R223k6082J9049J316j8160
$$ plain form
339 -15014 8310 2788 -5017 12389 -173 -2609 4916 -5298 -3414 -1062 316 1601 334 8616
353 8616 932 170 10516 -4452 2406 8986 -6153 9242 3788 -9337 11660 -3813 -7165 15177
367 15177 -4804 1685 15905 -3458 5026 5433 -8007 2149 -543 -5253 1873 2963 1549 -1445
381 -1445 6312 222 -8569 8450 -2348 -9754 11434 -7546 -7352 9695 -15165 -3921 7817
394 7817 -14436 4589 7051 -10734 6075 744 -10815 -1193 -5401 -5895 -2505 -11 345 -4311
408 -4311 5260 -545 -8222 6945 -5473 -5832 11504 -9354 -1713 10554 -13587 2377 6761 -12148
422 -12148 8974 7256 -3682 9311 -62 -2358 4505 -3338 -2046 952 3990 3104 2786 9585 -2555
437 -2555 -163 11138 -6966 2463 9083 -9620 9616 5999 -12224 9908 -462 -8806 13276
$$ packed form
339a5014K3324n522p805J7406j2562k436P525j0214J884K352J378J285j267Q282
353H616p684p62J0346j4968O858O580j5139J5395n454j3125K0997j5473l352K2342
367A5177j9981O489J4220j9363Q484M07j3440J0156k692m710P126J090j414k994
381a445P757o090q791J7019j0798p406K1188j8980J94J7047k4860J1244J1738
394G817k2253J9025K462j7785J6809n331j1559R622m208m94L390K494L56m656
408d311R571n805p677J5167j2418l59J7336k0858P641J2267k4141J5964M384j8909
422a2148K1122j718j0938J2993r373k296O863p843J292K998L038q86l18O799j2140
437b555K392J1301j8104R429O620j8703J9236l617j8223K2132j0370q344K2082
$$ plain form
450 13276 -1654 -1983 11783 -3610 -1349 2348 -6540 -2211 159 -1461 -3157 1789 5600 -5141
464 -5141 247 1414 -10839 3744 1789 -10132 5421 -4895 -8609 8703 -8616 -8303 6576
477 6576 -5899 345 6446 -5322 -1203 -1136 -5241 -2045 -2770 -2347 -1436 2200 1291 -2385 5471 -1217
493 -1217 -6490 7841 -3610 -3458 11988 -6222 -3072 8896 -7075 3450 6839 -8349 7888
506 7888 6815 -2629 8651 731 -5887 3068 2667 -134 -41 4489 2273 246 8447 -190 -2453 6200
522 6200 -4501 2592 7293 -8173 4719 3507 -10939 5797 1964 -5461 5350 -1305 -561 3730
536 3730 -2763 -243 -4307 -5970 -289 -911 1424 -3396 -2790 4675 -5795 -579 4099 -12507 -385
551 -385 4140 -8099 3649 -3093 -8962 5596 -5490 -2937 7303 -6002 -855 5195 -3649 -777
$$ packed form
450A3276j4930l29J3766j5393K261L697q888M329K370j620j696M946L811j0741
464e141N388J167j2253J4583j955j1921J5553j0316l714J7312j7319L13J4879
477F576j2475O244O101j1768M119O7m105L196p25M23R11L636r09l676P856o688
493a217n273J4331j1451J52J5446j8210L150J1968j5971J0525L389j5188J6237
506G888j073r444J1280p920o618Q955m01k801R3M530k216k027Q201q637k263Q653
522F200j0701P093M701j5466J2892j212j4446J6736l833p425J0811o655P44M291
536C730o493K520m064j663N681o22K335m820O06P465j0470N216M678j6606J2122
551c85M525j2239J1748o742n869J4558j1086K553J0240j3305N147O050q844K872
$$ plain form
565 -777 -590 -2626 -2524 -1535 4194 790 1022 2996 -3207 3929 2375 -3436 6831 -3339 -2964 11929
581 11929 -2394 -1455 5895 -5319 4224 5939 -907 6453 -1026 438 7093 -3208 275 1361
595 1361 -2544 4329 150 2896 4990 -5392 3224 2209 -5314 4465 -516 -3130 2445 -3288 1842
610 1842 948 -6143 729 -1780 -1507 3598 -1897 -1480 -2624 -3258 2224 -4958 -3527 512 -5395 2802
626 2802 749 -4958 2332 -5574 -2975 5178 -7475 -541 3993 -7880 2317 2152 -6234 2647 -1118
641 -1118 -2801 3910 -316 893 1653 -1793 105 -524 2400 604 -2071 5191 312 396 7485 -2908
657 -2908 -564 5044 -2686 4690 3657 -3098 4783 463 -186 4309 -1340 1507 1975 986 4807 -1293
673 -1293 1330 2073 -4641 3854 117 -3908 5687 -2968 -1341 5519 -5387 345 2021 -6747 2494
$$ packed form
565g77J87k036J02R89N729l404K32J974o203P136j554n811J0267j0170L75J4893
581A1929j4323R39P350j1214R543J715o846P360p479J464O655j0301L483J086
595A361l905O873m179K746K094j0382Q616j015p523R779m981k614N575n733N130
610A842q94p091O872k509K73N105n495M17j144o34N482p182J431M039n907Q197
626B802k053n707P290p906K599Q153j2653O934M534j1873J0197j65q386Q881l765
641a118j683O711m226J209P60l446J898o29K924j796k675P262m879Q4P089j0393
657b908K344N608p730P376j033o755P881m320o49M495n649K847M68r89L821o100
673a293K623P43o714Q495l737m025R595q655J627O860j0906N732J676q768R241
$$ plain form
688 2494 502 -4390 2459 -2837 -3216 868 -2303 -1445 -1413 -1056 -542 -1900 533 -3311 -3120 1324 -4999
705 -4999 -12 1818 -6251 2843 264 -5687 4882 -2599 -4536 5490 -3850 -845 4683 -4488 1226
720 1226 2410 -3194 2692 625 -414 2212 464 2197 -187 936 2700 -2220 3197 2905 -2261
735 -2261 5538 609 -1638 6047 -1454 317 4947 -2750 2363 3167 -1493 2856 445 -202 1589 -595
751 -595 2028 -636 -155 2483 -3226 2077 500 -4991 4515 -1976 -4460 6028 -5402 -2299 4975
766 4975 -7022 -20 2691 -7227 2292 335 -5649 2319 -1395 -3672 87 -1065 -2265 -1599 853
781 853 -1906 -2805 2483 -3416 -1911 4148 -5488 562 4092 -6745 3525 1993 -6370 5364 57
796 57 -3987 5918 -1738 -440 4700 -2585 1341 2669 -1099 2030 917 1413 813 689 3900 -1414
$$ packed form
688B494j992m892O849n296l79M084l171Q58L2L57N14j358K433l844J91M444o323
705d999M987J830q069R094k579n951J0569p481j937J0026r340L005N528r171N714
720A226J184n604N886k067j039K626j748J733k384J123J764m920N417k92n166
735b261P799m929k247P685p501J771M630p697N113Q04m660M349k411o47J791k184
751e95K623k664M81K638n709N303j577n491R506o491k484J0488j1430L103P274
766D975j1997P002K711r918R519j957n984P968l714k277L759j152j200O66K452
781H53k759q99N288n899J505O059r636O050L530j0837J0270j532q363J1734n307
796E7m044R905p656J298N140p285L926J328l768L129j113M96o00j24L211n314
$$ plain form
812 -1414 1597 4086 -2663 3142 2826 -3478 5025 127 -2608 5699 -2165 -637 5179 -2705 134
827 134 2623 -1768 858 -69 -608 -235 -959 668 -1951 17 563 -3325 2213 -881 -4645 4085 -2973
844 -2973 -4552 4323 -4622 -3149 3429 -5385 -839 2279 -4653 1482 521 -4412 1363 -356 -3136
859 -3136 266 -228 -1896 -1246 1428 -302 -1822 2476 -523 -880 3209 -2205 55 3028 -3569 2401
875 2401 2412 -3590 4023 1551 -1983 4358 597 432 3048 -807 2174 1502 -496 2206 -79 1056
891 1056 1343 263 3282 -690 573 4029 -2504 1498 2444 -3908 2370 723 -2977 2912 -1314 -1437
907 -1437 2870 -1969 -370 1423 -1869 -293 -807 -456 -1603 -2307 608 -2886 -1429 1898 -3661 467
923 467 1021 -4600 1961 -1528 -4653 2837 -3489 -2536 3231 -3712 -99 1376 -3262 1438 -240 -1800
$$ packed form
812a414L011K489o749N805l16o304Q503m898k735Q307p864J528N816p884K839
827A34K489m391K626r27n39L73p24J627k619J968N46l888N538l094l764Q730p058
844b973j579Q875q945J473O578q814M546L118o932O135r61m933N775j719k780
859c136L402m94j668O50K674j730j520M298k999l57M089n414K260K973o597N970
875B401J1o002P613k472l534O341l761j65K616l855K981o72j998K702k285J135
891A056K87j080L019l972J263L456o533M002R46o352O278j647l700N889m226j23
907a437M307m839J599J793l292J576n14L51j147p04K915l494J457L327n559M128
923D67N54n621O561l489l125P490o326R53N767o943L613J475m638M700j678j560
$$ plain form
939 -1800 1496 -1331 270 -61 -1262 1441 -1203 368 2174 -1156 3191 1115 -1153 3604 -1100
954 -1100 -353 3467 -2097 1358 2150 -921 3429 394 177 3203 -1094 1472 1712 -789 2453 -431
970 -431 -41 1866 -2180 2006 1054 -1408 3530 -808 -930 2874 -2661 -89 324 -3476 1330 -329
986 -329 -2362 2330 -1171 -1000 909 -1520 -533 -1339 -855 166 -2824 -296 -644 -3011 302 -1728 -1088
1003 -1088 1680 -2667 635 1132 -3717 824 -710 -3369 880 -1628 -79 1949 -2035 1624 797
1018 797 -2078 2817 97 -969 1467 -880 1265 520 -977 2407 -517 586 3873 -384 1865
1033 1865 1722 -792 2878 -679 -474 2732 -1847 1195 2771 -717 2055 855 279 1546 -1242 2292
1049 2292 746 -2374 1807 -972 -1038 1702 -2566 953 595 -2381 3374 -94 -3427 1880 -2083 -2232
$$ packed form
939a800L296k827J601l31j201K703k644J571J806l330M347k076k268M757m704
954a100P47L820n564L455P92l071M350l035k17L026m297K566K40k501L242k884
970d31L90J907m046M186r52k462M938m338j22L804n535K572M13l800M806j659
986c29k033M692l501J71J909k429R87q06M84J021k990K528l48k367L313k030O40
1003a088K768m347L302M97m849M541j534k659M249k508J549K028l984L659q27
1018G97k875M895k720j066K436k347K145p45j497L384k924J103L287m257K249
1033A865j43k514L670l557K05L206m579L042J576l488K772j200n76J267k788L534
1049B292j546l120M181k779o6K740m268L519l58k976N755l468l333N307l963j49
$$ plain form
1065 -2232 471 -2800 5 -501 -1396 1614 -1394 -1500 -82 -1573 -126 -1345 -1143 158 -3360 0
1081 0 425 -3295 1399 -285 -1410 2670 -1064 138 1068 -3502 1048 188 -2435 2089 -306 -288 2420
1098 2420 -128 1826 535 -592 2230 119 739 1712 -1005 1523 -34 114 3320 -765 1540 3628
1114 3628 -637 2112 1706 -2031 1051 -810 -743 2243 -553 902 1489 -202 1136 -283 265 39
1130 39 -1838 1847 -954 -1871 1509 -3128 -1187 1293 -2682 1340 927 -2466 2285 -910 -2605 768
1146 768 -3348 -2057 329 -1976 372 -143 -1200 318 -1184 -322 -533 -1302 288 -1536 -174 680
1162 680 -2475 315 -362 -2356 2435 127 -573 3071 -1191 151 1697 -2684 558 933 -1194 2261
1178 2261 640 765 1923 -441 1560 606 266 1831 -486 1420 1471 -1165 1779 24 -837 2989
$$ packed form
1065b232K703l271K805n06q95L010l008j06J418j491J447j219K02J301l518L360
1081@M25l720M694j684j125M080l734J202R30m570M550q60k623M524k395J8K708
1098B420k548J954j291j127K822k111O20R73k717K528j557J48L206m085K305K088
1114C628m265K749m06l737L082j861O7K986k796J455N87j691J338j419N48k26
1130C9j877L685k801r17L380m637J941K480l975M022m13l393M751l195j695L373
1146G68m116J291K386k305K348n15j057J518j502Q62k11p69J590j824J362Q54
1162F80l155K790o77j994M791k308p00L644m262J342J546m381L242L75k127L455
1178B261j621J25J158k364K001r54l40J565k317J906N1k636K944j755q61L826
$$ plain form
1194 2989 -257 844 3400 -1308 1153 1011 -2711 941 -462 -1321 1523 -201 311 778 -971 591
1210 591 -1257 -638 -79 -1736 578 -937 -2139 552 -2171 -1520 1021 -2410 736 823 -2307 996
1226 996 -1170 -2360 442 -2561 -1015 649 -1383 812 393 -772 864 -982 -102 106 -1268 904
1242 904 -433 -387 1138 -1698 654 1403 -1161 2537 1219 -218 2722 -413 -232 763 -1233 1120
1258 1120 787 113 2638 348 974 1849 -559 1306 342 -250 2206 -770 363 1195 -1482 787 291
1275 291 -459 2194 -167 1127 1273 -1794 657 -930 -2482 727 -1320 -637 1288 -1132 651 123
1291 123 -1790 633 -1529 -1271 351 -1536 -373 -1038 -1778 222 -1927 -643 1214 -1307 935 358
1307 358 -1294 471 -2042 -1196 -92 -2194 820 821 -822 1949 148 -183 1228 -1449 996 1103 -1124
$$ packed form
1194B989l246J101K556m708K461j42l722L652j403q59K844j724N12M67j749J562
1210E91j848O19N59j657K314j515j202K691k723O51K541l431L146Q7l130L303
1226I96k166j190K802l003J546J664k032K195m19j165J636j846Q80K08j374K172
1242I04j337M6J525k836K352P49k564L698j318j437K940l135J81R95j996K353
1258A120l33o74K525k290O26Q75k408J865r64n92K456k976J133Q32k677K269m96
1275B91p50K653k361J294J46l067K451j587j552L209k047O83J925k420J783n28
1291A23j913K423k162K58J622j887J163o65p40K000k149J284J857k521K242n77
1307C58j652J765k513Q46J104k102L014Jj643K771j801l31J411k677K445J07k227
$$ plain form
1324 -1124 1906 287 -771 1304 -497 669 1255 173 2353 1165 611 1798 -712 -97 -124 -919
1340 -919 1789 260 1054 2377 -837 911 1300 -1528 1208 207 -1115 1130 -623 100 367 -1857
1356 -1857 561 163 -625 1228 -123 152 -108 -1816 369 -1769 -2591 700 -1251 -364 1211 -1244
1372 -1244 356 -713 -1910 1117 -1632 -1459 822 -1935 -523 51 -1662 232 -823 -530 1378 -300
1388 -300 429 312 -784 -247 -1150 -342 342 -1165 1669 929 -326 2631 -216 -724 2035 -1009 701
1405 701 1381 -1340 1502 691 -835 1706 125 453 1738 505 1915 767 -170 792 -1069 213
1421 213 456 -1059 1284 751 171 1664 -648 90 637 -1586 600 -200 -1347 600 -1185 -803 99
1438 99 -1363 365 -157 -721 832 -536 -285 -711 -2177 -779 -1559 -1050 604 -1439 389 507 -1312
$$ packed form
1324a124L030j619j058K075j801J166N86j082K180j188n54J187k510O15k7p95
1340i19K708j529P94J323l214J748L89k828K736j001j322K245j753P23K67k224
1356a857K418l98p88J853j351K75k60j708K185k138q22L291j951Q87J575k455
1372a244J600j069j197L027k749J73K281k757J412N74j713J894j055K93J908j678
1388c00P29j17j096N37r03Q08O84j507K834p40j255K957k847n08K759l044J710
1405G01O80k721K842q11j526K541j581L28J285j233J410j148r37R62j861J282
1421B13K43j515K343n33n80J493k312P38N47k223K186q00j147J947j785L82R02
1438I9j462J728n22n64J553j368K51m26j466J398p80N09J654k043J828J18j819
$$ plain form
1455 -1312 687 -896 -1716 566 -948 -418 788 -1374 -250 170 -783 769 155 201 969 511 992
1472 992 -212 -118 240 -1384 718 1143 -550 1999 1172 158 1958 -484 268 1729 -1305 686 1658
1489 1658 -627 1078 142 -201 1117 -179 1088 1130 -25 1205 2 -478 -134 -1759 162 -83 -444
1506 -444 1831 -376 -93 1075 -1461 -106 -129 -2093 366 -570 -1069 440 -1573 -948 114 -1322 -92
1523 -92 294 -92 148 -969 -57 -954 -2255 12 -1053 -1158 1589 -244 623 552 -1641 757 -332 -1826
1541 -1826 1266 -101 -428 1192 -159 532 14 -763 1700 588 330 1752 397 530 171 -471 755
1558 755 -446 606 1684 103 1840 968 -128 1660 -795 -225 1196 -1120 889 1105 -1061 1282
1574 1282 -15 -1059 958 -185 301 700 -533 566 -744 -1190 -80 -1363 -411 181 -626 916
$$ packed form
1455a312J999j583q20K282j514N30J206k162J124M20r53J552o14M6P68m58M81
1472I92j204R4L58j624K102M25j693K549q27j014J800k442P52J461l034J991R72
1489A658k285J705r36l43J318j296J267M2j155J230j203m80L44j625J921k45l61
1506d44K275k207K83J168k536J355k3j964K459r36m99J509k013O25J062j436J230
1523i2L86l86K40j117R12q97j301K267j065j05K747j833Q67p1k193K398j089j494
1541a826L092j367l27J620j351O91n18p77K463j112k58J422j355J33l59o42J226
1558G55j201J052J078j581J737q72j096J788k455N70J421k316K009K16k166K343
1574A282j297j044K017j143M86L99j233J099j310m46J110j283R52N92q07J542
$$ plain form
1590 916 -719 -633 502 -1564 -1004 111 -1532 -421 -442 -754 62 -1190 -580 -2 -948 371 33 62
1608 62 215 -1365 250 -392 -1782 894 -421 -227 1702 -232 411 850 -1003 691 278 -662 1354
1625 1354 18 132 1372 -182 570 510 221 1441 570 736 1046 -78 413 -44 -196 615 -285 915
1643 915 942 -42 1524 56 -644 1127 -904 -83 764 -918 360 252 -1080 412 -735 -646 455
1660 455 -442 516 -54 -901 73 -1383 -1105 -385 -1474 -93 290 -528 703 -601 -885 -115 -1744 -472
1678 -472 -313 -740 276 -426 -397 135 -971 -125 8 -235 780 8 185 275 -1017 108 -228 -646 1007
1697 1007 104 193 1486 -318 638 959 -1117 845 393 -438 1464 243 332 964 -385 486 694 -10
1715 -10 1082 512 387 745 -557 254 -209 -472 1027 -320 788 874 -406 850 -307 -966 132 -865
$$ packed form
1590I16j635Q6J135k066N60J115j643J111k1l12Q16j252O10N78r46J319l38K9
1608F2J53j580J615o42j390K676j315J94J929j934O43M39j853J694m13r40K016
1625A354j336J14J240j554P52o0k89J220q71J66L10j124M91m57j52Q11r00J200
1643I15K7r84J566j468p00J771k031Q21Q47j682J278j08j332J492j147Q9J101
1660D55q97R58n70q47R74j456K78P20j089J381L83q18J231j304k84P70j629J272
1678d72J59m27J016p02K9N32j106Q46J33k43J015p72J77R0j292J125l36m18J653
1697A007r03Q9J293j804R56L21k076J962m52q31J902j221Q9O32j349Q71K08p04
1715a0J092n70j25L58j302Q11m63k63J499j347J108Q6j280J256j157o59J098r97
$$ plain form
1733 -865 -217 328 -1043 254 -173 -1018 96 -1012 -553 639 -606 141 -141 -1080 -238 -1070 -1061 119
1751 119 -1004 280 576 -437 286 -499 -752 133 -1010 44 -3 -572 790 -89 -379 391 -230 351
1769 351 600 127 791 89 -80 674 -619 283 260 -326 1661 501 169 1783 -392 -18 984 -479
1787 -479 513 583 -65 922 84 202 637 -525 556 372 46 780 -355 447 90 -908 203 -338 -624
1806 -624 688 -225 488 357 -673 270 -601 -1118 190 -750 -495 314 -966 -153 -208 -950 -10 -695 -325
1825 -325 320 -521 -36 -376 -871 -201 -795 -356 325 -709 728 238 -720 645 -533 -572 211 -361 329
1844 329 367 -338 549 13 -113 306 9 792 370 355 1059 -88 -286 962 -633 390 669 -41 1037
1863 1037 480 381 1114 -479 103 476 -417 360 160 -80 509 -153 20 273 -505 177 70 -156 365 -409
$$ packed form
1733h65O48N45j371J297m27q45J114j108M59J192j245P47k82r39Q42q32RJ180
1751A19j123J284K96j013P23p85k53Q85j143J054m7n69J362q79k90P70o21N81
1769C51K49m73O64p02j69P54j293R02k3n86J987j160l32J614k175L74J002j463
1787d79R92P0o48R87q38J18M35j162J081j84l26P34j135Q02l57r98J111n41k86
1806f24J312r13P13j31j030R43q71n17J308r40K55Q09j280Q13n5p42R40o85L70
1825c25O45q41M85l40m95O70n94M39O81j034J437m90r58J365j178l9P83n72O90
1844C29L8p05Q87n36j26M19k97P83m22j5P04j147j98J248j595J023K79p10J078
1863A037n57r9P33j593N82L73q93P77k00k40N89o62J73K53p78O82j07k26N21p74
$$ plain form
1883 -409 -210 -265 -737 178 -692 -361 471 -581 -94 22 -761 -11 -796 -1064 397 -976 -353 518 -839
1902 -839 -490 -235 -545 107 -546 -160 318 -415 376 -213 -936 189 -434 146 1035 -335 853 455 -274
1921 -274 527 -22 -316 369 -30 595 760 174 595 78 58 911 91 707 597 3 933 -68 -53 543
1941 543 -391 424 595 -30 1125 -138 -31 458 -545 113 89 -783 328 113 -452 574 -525 -622 -160
1960 -160 -244 -154 -70 -665 -58 -602 -144 -317 -920 121 -642 -457 450 -701 -193 -182 -714 -58 -366 -561 287
1981 287 -466 -106 337 -565 290 -253 -481 688 13 40 208 -431 421 117 -249 660 -66 260 1012 200
2001 200 578 124 -138 526 -63 340 668 -312 635 748 -360 660 -59 107 730 -131 407 407 -292 461
2021 461 -276 -42 309 -319 637 18 -58 929 -458 -308 217 -925 -158 -14 -563 163 -490 -799 199 -474
$$ packed form
1883d09J99n5m72R15q70L31Q32j052M87J16p83P50p85k68J461j373O23Q71j357
1902h39L49K55l10O52o53L86M78p33P91n89p23J125o23N80Q89j370J188l98p29
1921b74Q01n49k94O85l99O25J65n86M21n17k0Q53q20O16j10n94R30j001J5N96
1941E43r34Q15J71o25J155j263J07M89j003O58k4q72J111k15n65J026j099r7M62
1960a60q4R0Q4n95O07n44M58j73o03J041p63J85R07j151N08J1n32O56l08j95Q48
1981B87p53L60M43r02Q55n43k28J169o75K7J68o39Q52l04l66R09p26L26P52q12
2001B00L78m54k62O64n89M03L28r80R47J13j108J020p19J66O23q61N38%o99P53
2021D61p37K34L51o28R56o19p6R87j387J50N25j142P67J44n49P26o53l09R98o73
$$ plain form
2041 -474 -351 -73 -876 -28 -203 -205 20 -650 -333 -296 -661 227 15 -317 281 -340 -198 -17 -789 -279 -221
2062 -221 -294 328 -150 88 388 -303 503 173 68 800 1 277 762 179 227 161 117 531 -129 498 904
2083 904 -269 610 313 -260 491 51 39 490 -58 225 400 -461 300 232 -129 245 -267 490 -27 -453
2103 -453 394 -348 -147 156 -512 -109 -210 -437 27 -546 -494 -165 -823 -262 -59 -373 17 -476 -337 -348 -824
2124 -824 -163 -276 -341 95 -85 -65 114 -505 68 -43 -471 508 -102 -79 372 -390 -71 268 -494 479 278
2145 278 31 739 159 126 407 -52 351 189 304 613 45 417 83 -196 419 89 -60 763 -95 502
2165 502 476 -422 294 -28 -362 545 -218 92 355 -337 256 -10 -234 311 -412 -169 195 -292 -34 -37 -534
2186 -534 145 -534 -118 83 -692 93 -212 -485 67 -172 -250 -4 -521 -229 -88 -379 -19 -350 -378 94 -378
$$ packed form
2041d74J23K78q03Q48j75kK25o70L17L7l65Q88k12l32N98o21J42J81p72N10N8
2062b21p3O22m78K38L00o91Q06l30j05P32p99K76M85n83M8o6m4M14o60O27M06
2083I04j173Q79k97n73P51m40j2M51n48K83J75q61P61o8l61L74n12P57n17m26
2103d53Q47p42K01L03o68M03j01k27M64n73N2L29o58N61K03l14L90m93J39j1m76
2124h24O61j13o5M36j80K0J79o19N73j11m28R79o10K3M51p62L19L39p62R73k01
2145B78k47P08n80l3K81m59M03j62J15L09n68L72l34k79O15l30j49Q23q58N97
2165E02k6q98P16l22l34R07p63L10K63o92N93k66k24N45p23K43L64m87K58lm97
2186e34O79o79M16K01p75P85l05k73N52k39p8K46n17K92J41k91L60l31k8M72m72
$$ plain form
2207 -378 77 -114 -85 221 -141 281 425 -339 587 380 -266 444 86 386 489 58 305 290 -115 776 197
2228 197 292 465 -213 214 337 -158 478 233 255 280 -60 250 142 39 195 -11 -82 176 65 132 23 -354
2250 -354 361 -126 -185 193 -477 -48 -13 -620 77 -315 -627 13 -487 -232 181 -596 -92 -204 -304 103 -239
2271 -239 -113 102 -599 12 -197 -218 249 -331 -271 284 -86 77 -30 -261 256 -233 -211 -21 -144 176 130
2292 130 -193 589 -82 142 404 -73 424 346 68 493 285 373 332 -34 464 396 -83 607 203 65 333
2313 333 -98 143 259 -437 368 176 11 141 79 300 166 -402 136 -230 -132 290 -328 9 -151 -483 332
2334 332 -425 -402 242 -466 -362 -51 -656 -359 -459 -394 20 -621 -158 183 -446 21 19 -606 113 -257 -267 -8
2356 -8 -441 53 34 -87 217 -60 -8 270 -139 375 -68 -230 464 64 43 614 174 343 214 310 618 -7
$$ packed form
2207c78M55j91K9L06l62M22J44p64R26k07o46P10l58L00J03m31K47j5m05Q91n79
2228A97R5J73o78M27J23m95O36k45K2K5l40L10j08j03J56k06p1K58j11O7j09l77
2250c54P15m87n9L78o70M29L5o07O97l92l12O40n00K55M13p77N04j12j00M07l42
2271b39J26K15p01O11k09k1M67n80O0N55l70J63j07k31N17m89K2J90j23L20m6
2292A30l23P82o71K24K62m77M97p8k78M25k08Q8m1l66M98o8m79O90m04j38K68
2313C33m31K41J16o96Q05j92j65J30o2K21j34n68N38l66R8M22o18L37j60l32Q15
2334C32p57K3O44p08J04L11o05K97j00O5M14o41M63L41o29M67ko25P19l70j0K59
2356hm33M94j9j21L04k77N2K78m09N14m43j62O94m00k1N71m40J69j29R6L08o25
$$ plain form
2378 -7 16 586 -100 464 407 -218 380 24 190 263 103 264 346 -278 260 253 70 105 -394 67 279 -192 343
2401 343 86 26 356 -325 94 -231 -476 147 -109 -291 -106 -271 -540 -118 -308 53 -173 -108 -5 -521 -15
2422 -15 -539 -171 -178 -382 -384 239 -179 -198 -38 -139 460 144 -211 295 3 27 117 -10 110 -87 166 370 155
2445 155 357 519 -297 323 -73 316 319 218 236 298 92 271 364 177 637 -11 121 194 -136 166 -125 98
2467 98 20 -417 170 217 -225 283 -151 -298 121 -442 201 73 -314 -25 -144 -396 113 -153 -222 -64 -529
2488 -529 -205 -112 -493 -159 -143 -217 -187 -238 -63 -149 -260 -42 -316 -152 -75 -435 -29 -80 -510 274 -231 -335 288
2511 288 -122 195 251 14 392 -15 -254 373 -49 91 49 174 480 584 248 258 173 395 -6 -118 411
2532 411 160 -107 543 -259 341 149 -136 224 179 -296 297 241 -3 -77 -171 -169 114 -168 274 -97 -34 -2 26
$$ packed form
2378gK3N70o86N64n7o25N98l56J66P3j60J61Q2o24N38pj83L5m99M61K12m71N35
2401C43k57o0L30o81M19l25k45O23k56j82J85j65k69M22j90L61k26O5J03n16N06
2422a5n24L68pk04kO23m18j9J60j01N99l16l55N06k92K4R0j27J20j97K53K04k15
2445A55K02J62q16O20l96L89Lj01J8O2k06J79R3j87M60o48J32P3l30L02k91K23
2467I8p8m37N87M7m42N08m34j47M19n63O43j28l87K89j19k52N09k66o9J58m65
2488e29L24R3l81L34J6p4L0n1J75q6j11K18k74J64P7l60M06n1m30P84n05j04O23
2511B88m10L17N6k37L78m07k39O27m22J40m2J25L06J04l36J0q5K22m01j12N29
2532D11k51k67O50q02O00j92k85L60m5m75N93n6k44p4r4KK83k82M42l71O3L2K8
$$ plain form
2555 26 152 -173 -178 107 -268 -73 -28 -567 71 -162 -348 -57 -51 -212 207 -395 -38 -144 -168 -45 -46 -30 -132
2578 -132 63 214 -231 26 258 -181 -177 -58 -335 253 162 -71 245 -57 179 287 24 200 334 14 367
2599 367 -2 74 152 -191 -30 362 232 356 193 281 219 -105 256 128 -445 411 -114 -81 339 -142 -77 105
2621 105 -33 52 79 -278 8 -142 -118 -308 -266 -12 -418 -135 170 -168 -97 32 -548 -52 -315 -256 23 -72
2643 -72 -281 -118 -321 -247 -179 -282 -74 -86 -145 111 -163 -30 -274 -136 158 -77 299 202 -136 89 103 -41
2665 -41 83 -92 -153 320 66 282 289 -153 413 -25 213 344 -50 458 456 -13 299 311 -95 128 148 288 174
2688 174 230 387 -155 -119 70 -283 49 71 -273 88 -317 -15 92 -93 -81 190 27 -78 -308 -153 -51
2709 -51 -271 -168 -62 -169 64 -252 -125 -20 -179 -129 60 -604 -2 23 -74 133 -376 -43 -35 -252 234 75
$$ packed form
2555B6J26l25nK85l75J95M5n39O38k33j86K91Oj61M19o02L57j06k4J23jJ6j02
2578a32J95J51m45K57K32m39MJ19k77N88r1k33L16l02K36J08k63J76J34l20L53
2599C67l69P6P8l43J61L92j30J24j63Q8o2l24L61j28n73Q56n25L3M20m81O5J82
2621A05j38Q5K7l57K86j50K4j90M2K54m06K83L05l38P1J29n80M96k63N9K79r5
2643g2k09J63k03P4O8j03K08j2n9K56k74J33k44J38K94k35L76r7l38K25J4j44
2665d1J24j75o1M73k54K16Pm42N66m38K38J31l94N08km69L12J2m06K23K0J40j14
2688A74N6J57n42L6J89l53L32K2l44L61m05L02J07j85J2K71j63j05k30J55J02
2709e1k20J03J06j07K33l16J27J05j59N0J89o64O02K5r7K07n09L33Qk17M86j59
$$ plain form
2731 75 -116 206 171 79 57 -251 114 101 224 -38 67 198 230 344 338 109 -4 386 -121 124 237 41 309
2754 309 134 -116 92 -66 260 300 -44 -23 308 88 -13 -254 -56 232 3 285 178 -80 317 -292 -51
2775 -51 -142 -408 -261 -210 -174 3 -46 -232 46 -140 -199 -60 -57 -22 -138 -261 98 -324 27 -106 -133 166 -16
2798 -16 412 242 -420 -6 32 -157 103 57 28 270 12 176 142 -129 52 215 -220 317 -82 167 273 29
2820 29 -4 20 193 94 192 415 97 25 165 -27 -66 -22 83 313 160 -172 312 335 -279 227 49 17 71 5
2844 5 47 -61 -183 142 -223 -13 98 -197 34 -136 -286 -4 -283 -329 -171 -230 -280 -132 -236 1 -61 -243
2866 -243 -186 -5 -191 -27 -236 -281 -93 -57 -326 -148 231 -128 90 312 172 199 201 -233 459 88 -256 350
2888 350 -15 171 86 105 232 264 132 -47 271 203 237 199 104 122 1 225 109 183 343 -83 227 54 1
$$ packed form
2731G5j91L22l5r2k2l08L65j3J23k62J05J31L2J14ok29j13L90n07K45J13j96K68
2754C09j75k50K08j58L26M0l44K1L31k20j01k41J98K88k29K82j07k58L97o09K41
2775e1r1k66J47N1L6J77m9j86K78j86n9J39LL5j16j23L59m22L51j33k7K99j82
2798a6M28j70o62M14L8j89K60m6k9K42k58J64l4k71J81J63m35N37l99K49J06k44
2820B9l3K4J73r9R8K23l18p2J40j92l9M4J05K30j53l32M84K3o14N06j78l2N4o6
2844EM2j08j22L25l65K10J11k95K31j70j50K82k79m6J58n9n0J48j04K37o2j82
2866b43N7J81j86J64k09m5J88L6k69J78L79l59K18K22j40K7Km34O92l71l44O06
2888C50l65J86q5J9J27L2j32j79L18o8L4l8r5J8j21K24j16P4J60m26L10j73n3
$$ plain form
2911 1 -9 -97 -230 343 -140 -67 277 74 178 36 -143 28 -167 -151 7 -72 72 -210 -176 -330 -159 -221 22
2934 22 49 46 -402 -430 85 -246 -252 -288 -221 -133 130 -6 115 2 -262 -12 46 161 6 -215 1 45 35 159
2958 159 -319 424 -192 -71 279 -101 -23 275 -202 101 -68 39 125 209 405 211 99 295 105 416 401
2979 401 11 195 -30 -122 280 108 -110 323 -7 -70 431 -49 39 95 -355 -46 52 -49 288 4 121 110
3001 110 -189 -10 -137 -80 73 -47 -209 -93 -170 -145 -441 -124 -375 -318 19 139 -171 124 -209 -487 -37
3022 -37 -280 -2 9 115 92 110 3 168 -101 117 51 -35 205 -260 75 345 -125 125 78 -58 44 128 -112
3045 -112 423 37 -45 153 117 -20 152 106 333 85 -70 95 -13 338 -98 8 296 92 113 149 -189 -58
3067 -58 -72 -319 221 -63 -36 169 -120 -169 41 -295 -250 -151 -48 -2 57 -36 -209 -170 8 -364 -271 67 -291 10
$$ packed form
2911Aj0q8j33N73m83P3L44k03J04j42j79J71j95J6J58p9J44k82L4j54J71o2K43
2934B2K7lm48k8N15l31ol6O7Q8K63j36J21j13k64K50N8J15j55k21K16M4j0J24
2958A59m78P43o16J21L50l80P8K98m77L03j69J07Q6Q4J96j94j12J96j90L11j5
2979D01l90J84k25r2M02j72k18M33l30o3N01m80Q8N6m50L09R8j01L37k84J17j1
3001A10k99J79j27N7J53j20j62J16p7K5k96L17k51N7L37J20l10K95l33k78M50
3022c7k43K78J1J06k3J8j07J65k69K18o6q6K40m65L35K70m70K50m7j36J02Q4k40
3045a12N35l86q2J98l6j37J72m6K27k48j55J65j08L51m36J06K88k04K1L6l38J31
3067e8j4k47N40k84K7K05k89m9K10l36M5R9J03M6N9r3j73L9J78l72R3L38l58L01
$$ plain form
3091 10 -215 -436 21 -383 -371 193 -218 122 53 -112 -9 221 -284 -247 45 -39 129 113 240 215 185 -37 -79
3114 -79 278 329 -57 185 -62 35 253 80 219 244 90 317 126 60 199 -30 105 33 -140 98 155 -186
3136 -186 67 52 40 113 -111 23 -183 155 180 -268 43 -169 -296 -157 -69 -364 -100 -70 -161 119 -273 -199 106
3159 106 -454 -64 -146 -103 -4 -166 29 -294 -188 -165 -70 47 -22 -176 54 -16 -237 132 -261 -10 98 -5
3181 -5 98 155 -6 31 91 -144 136 220 50 254 113 285 -171 15 62 71 -45 375 58 297 60 -214 283
3204 283 -56 74 170 -36 236 238 37 300 -149 -7 -81 -133 2 -135 13 -14 -288 17 0 -111 331 127
$$ packed form
3091A0k25k21M57m04J2N64m11L40o9j65J03K30n05L7K92q4J68j6J27k5l0k22m2
3114g9L57N1l86K42k47R7K18j73J39K5j54K27j91o6J39k29J35p2j73K38N7l41
3136a86K53j5j2P3k24J34k06L38K5m48L11k12j27J39Q8k95K64L0r1K80l92P4L05
3159A06n60L90q2M3R9j62J95l23J06K3R5J17o9j54K30p0k21L69l93K51J08j03
3181eJ03N7j61L7O0k35K80Q4j70K04j41J72m56J86M7Rj16M20l17K39k37k74M97
3204B83l39J30R6k06K72Kk01K63m49J42p4n2J35j37J48k7k74L05j7j11M42k04
$$ [...]
8191a31
##END NTUPLES=NMR FID
##END=
