##TITLE=1H_L3L30-SeO2-7d-5
 CDCl3,8 sc, 
 2.03.2021
##JCAMPDX= 6.0         $$ Bruker NMR JCAMP-DX V2.0
##DATA TYPE= NMR FID
##DATA CLASS= NTUPLES
##ORIGIN= UXNMR, Bruker Analytische Messtechnik GmbH
##OWNER= root
$$ XWIN-NMR		Version 3.5
$$ Tue Mar  2 10:12:02 2021 Russian Standard Time (UT+4h)  she@DPX200
##.OBSERVE FREQUENCY= 200.1315066352
##.OBSERVE NUCLEUS= ^1H
##.DELAY= (6, 6)
##.ACQUISITION MODE= SIMULTANEOUS
##.ACQUISITION SCHEME= undefined
##.AVERAGES= 8
##.DIGITISER RES= 18
##SPECTROMETER/DATA SYSTEM= spect
##.PULSE SEQUENCE= zg30
##.SOLVENT NAME= CDCl3
##.SHIFT REFERENCE= (INTERNAL, CDCl3, 0, 15.7039)
##AUDIT TRAIL= $$ (NUMBER, WHEN, WHO, WHERE, WHAT)
$$ ##TITLE= Audit trail, XWIN-NMR		Version 3.5
$$ ##JCAMPDX= 5.01
$$ ##ORIGIN= Bruker BioSpin GmbH
$$ ##OWNER= she
$$ F:/spectra/data/she/nmr/H-F/1/audita.txt
$$ ##AUDIT TRAIL=  $$ (NUMBER, WHEN, WHO, WHERE, WHAT)
(   1,<2021-03-02 10:10:53.29 +0400>,<she>,<DPX200>,
      <created by zg, POWCHK disabled, PULCHK disabled
       configuration hash MD5:
       00 E9 B6 7A A2 85 ED C7 34 08 36 98 17 FE 4E 26
       data hash MD5: 16K
       03 C0 07 0D 92 29 3C 2A CB 78 29 EE E2 1C E6 5E>)
$$ ##END=
$$ 
$$ hash MD5
$$ 0B 7D A8 1E 6E 4E B9 9D CE 68 DF E4 A1 F4 B3 C0
##$RELAX= 
##$RELAX= 
##$RELAX= 
##$RELAX= 
##$RELAX= 
##$RELAX= 
$$ Bruker specific parameters
$$ --------------------------
##$DU= <F:/spectra>
##$EXPNO= 1
##$NAME= <H-F>
##$PROCNO= 1
##$TYPE= <nmr>
##$USER= <she>
##$AMP= (0..31)
100 100 100 100 100 100 100 100 100 100 100 100 100 100 100 100 100 100 
100 100 100 100 100 100 100 100 100 100 100 100 100 100 
##$AQSEQ= 0
##$AQ_mod= 1
##$AUNM= <au_zg>
##$AUTOPOS= <>
##$BF1= 200.13
##$BF2= 200.13
##$BF3= 200.13
##$BF4= 200.13
##$BF5= 200.13
##$BF6= 200.13
##$BF7= 200.13
##$BF8= 200.13
##$BYTORDA= 1
##$CFDGTYP= 0
##$CFRGTYP= 5
##$CHEMSTR= <none>
##$CNST= (0..31)
1 1 145 1 1 1 1 1 1 1 1 1 1 1 1 1 1 1 1 1 1 1 1 1 1 1 1 1 1 1 1 1 
##$CPDPRG= <>
##$CPDPRG1= <>
##$CPDPRG2= <>
##$CPDPRG3= <>
##$CPDPRG4= <mlev>
##$CPDPRG5= <mlev>
##$CPDPRG6= <mlev>
##$CPDPRG7= <mlev>
##$CPDPRG8= <mlev>
##$CPDPRGB= <>
##$CPDPRGT= <>
##$D= (0..31)
0 1.2 0 0 0 0 0 0 0 0.06 0 0.03 0 0 0 0 0.0002 0 0 0 0 0 0 0 0 0 0 0 0 
0 0 0 
##$DATE= 1614665452
##$DBL= (0..7)
120 120 120 120 120 120 120 120 
##$DBP= (0..7)
150 150 150 150 150 150 150 150 
##$DBP07= 0
##$DBPNAM0= <>
##$DBPNAM1= <>
##$DBPNAM2= <>
##$DBPNAM3= <>
##$DBPNAM4= <>
##$DBPNAM5= <>
##$DBPNAM6= <>
##$DBPNAM7= <>
##$DBPOAL= (0..7)
0.5 0.5 0.5 0.5 0.5 0.5 0.5 0.5 
##$DBPOFFS= (0..7)
0 0 0 0 0 0 0 0 
##$DE= 6
##$DECBNUC= <off>
##$DECIM= 32
##$DECNUC= <off>
##$DECSTAT= 4
##$DIGMOD= 1
##$DIGTYP= 9
##$DL= (0..7)
0 120 120 120 120 120 120 120 
##$DP= (0..7)
150 150 150 150 150 150 150 150 
##$DP07= 0
##$DPNAME0= <>
##$DPNAME1= <>
##$DPNAME2= <>
##$DPNAME3= <>
##$DPNAME4= <>
##$DPNAME5= <>
##$DPNAME6= <>
##$DPNAME7= <>
##$DPOAL= (0..7)
0.5 0.5 0.5 0.5 0.5 0.5 0.5 0.5 
##$DPOFFS= (0..7)
0 0 0 0 0 0 0 0 
##$DQDMODE= 0
##$DR= 18
##$DS= 0
$$ [...]
##$SUBNAM2= <"">
##$SUBNAM3= <"">
##$SUBNAM4= <"">
##$SUBNAM5= <"">
##$SUBNAM6= <"">
##$SUBNAM7= <"">
##$SUBNAM8= <"">
##$SUBNAM9= <"">
##$SW= 16.9725356469052
##$SWIBOX= (0..15)
0 0 2 0 0 0 0 0 0 0 0 0 0 0 0 0 
##$SW_h= 3396.73913043478
##$TD= 16384
##$TD0= 1
##$TE= 0
##$TE2= 300
##$TE3= 300
##$TEG= 300
##$TL= (0..7)
0 120 120 120 120 120 120 120 
##$TP= (0..7)
150 150 150 150 150 150 150 150 
##$TP07= 0
##$TPNAME0= <>
##$TPNAME1= <>
##$TPNAME2= <>
##$TPNAME3= <>
##$TPNAME4= <>
##$TPNAME5= <>
##$TPNAME6= <>
##$TPNAME7= <>
##$TPOAL= (0..7)
0.5 0.5 0.5 0.5 0.5 0.5 0.5 0.5 
##$TPOFFS= (0..7)
0 0 0 0 0 0 0 0 
##$TUNHIN= 0
##$TUNHOUT= 0
##$TUNXOUT= 0
##$USERA1= <user>
##$USERA2= <user>
##$USERA3= <user>
##$USERA4= <user>
##$USERA5= <user>
##$V9= 5
##$VALIST= <valist>
##$VCLIST= <CCCCCCCCCCCCCCC>
##$VD= 0
##$VDLIST= <DDDDDDDDDDDDDDD>
##$VPLIST= <PPPPPPPPPPPPPPP>
##$VTLIST= <TTTTTTTTTTTTTTT>
##$WBST= 1024
##$WBSW= 4
##$XGAIN= (0..3)
0 0 0 0 
##$XL= 0
##$YL= 0
##$YMAX_a= 145166
##$YMIN_a= -178745
##$ZGOPTNS= <>
##$ZL1= 120
##$ZL2= 120
##$ZL3= 120
##$ZL4= 120
##$ABSF1= 10
##$ABSF2= 0
##$ABSG= 5
##$ABSL= 3
##$ALPHA= 0
##$AQORDER= 0
##$ASSFAC= 0
##$ASSFACI= 0
##$ASSFACX= 0
##$ASSWID= 0
##$AUNMP= <proc_1d>
##$AZFE= 0.1
##$AZFW= 0.1
##$BCFW= 1
##$BC_mod= 2
##$BYTORDP= 1
##$COROFFS= 0
##$CY= 11.3945322036743
##$DATMOD= 1
##$DC= 2
##$DFILT= <>
##$DTYPP= 0
##$F1P= 15.9154993809931
##$F2P= -4.1035820241983
##$FCOR= 0.5
##$FTSIZE= 0
##$FT_mod= 4
##$GAMMA= 1
##$GB= 0.15
##$INTBC= 1
##$INTSCL= 1
##$ISEN= 128
##$LB= 0.24
##$LEV0= 0
##$LPBIN= 0
##$MAXI= 10000
##$MC2= 0
##$MEAN= 0
##$ME_mod= 0
##$MI= 1.114404
##$NCOEF= 0
##$NC_proc= 0
##$NLEV= 6
##$NOISF1= 3.799351
##$NOISF2= 2.8
##$NSP= 1
##$NTH_PI= 0
##$NZP= 0
##$OFFSET= 15.70392
##$PC= 1
##$PHC0= -10758.42
##$PHC1= 9.200941
##$PH_mod= 1
##$PKNL= yes
##$PPARMOD= 0
##$PSCAL= 0
##$PSIGN= 0
##$REVERSE= no
##$SF= 200.130013532006
##$SI= 16384
##$SIGF1= 3
##$SIGF2= 2
##$SINO= 400
##$SIOLD= 16384
##$SREGLST= <1H.CDCl3>
##$SSB= 0
##$STSI= 0
##$STSR= 0
##$SW_p= 3612.71676300578
##$SYMM= 0
##$S_DEV= 0
##$TDeff= 0
##$TDoff= 0
##$TI= <>
##$TILT= no
##$TM1= 0
##$TM2= 0
##$TOPLEV= 0
##$USERP1= <user>
##$USERP2= <user>
##$USERP3= <user>
##$USERP4= <user>
##$USERP5= <user>
##$WDW= 1
##$XDIM= 8192
##$YMAX_p= 0
##$YMIN_p= 0
$$ End of Bruker specific parameters
$$ ---------------------------------
##NTUPLES= NMR FID
##VAR_NAME=  TIME,          FID/REAL,        FID/IMAG
##SYMBOL=    X,             R,               I
##VAR_TYPE=  INDEPENDENT,   DEPENDENT,       DEPENDENT
##VAR_FORM=  AFFN,          ASDF,            ASDF
##VAR_DIM=   8192,          8192,            8192
##UNITS=     SECONDS,       ARBITRARY UNITS, ARBITRARY UNITS
##FACTOR=    0.0002944,     1,               1
##FIRST=     0,             0,               0
##LAST=      2.4114304,     0,               0
##MIN=       0,             -178745,         0
##MAX=       2.4114304,     145166,          0
$$ Real data points
##PAGE= N=1
##DATA TABLE= (X++(R..R)), XYDATA
$$ [...]
1806g7J299j112N39p8j096R63k35j16J48p70N27n18l64O56o14M76Q03j087J087
1825D31m42o16R92j452J99K41r33J018k52J10J117q79K31Q7p35O80p03L22J2n84
1845a156Q90o50L17J119j442J069L08j016R64n51n66J238j085K5N77l37N54J47
1863D05J28L26m92K54N1m83L06o53O40n2p19J530l90r39J546j381M72Q27j381
1882eO62J6q45Q30m20n03P09m99M37L21j18K30p80K26lr56P50n94P8J117r04M96
1904B45L88j084N05L7j018J312n60j6L89p93K17P3m97O13N9L24q9k05O31r24M1
1925c52J39j079J237j81j25J070n23q2K56p17N13k57j47L03R1J02k86j39N67p32
1945c42L70L60n98R04l07n03Q14j290j31O86n00R82J04o41O28l12k93n7m52L61
$$ y = [-77, 1222, 110, 649, 571, -525, 438, 203, 87, 235, -535, -8, -526, -890, -234, -848, -372, 431, -656, 431, -11, -627, 365, -1087, -888, -647, -1580, -562, -814, -704, 413, -466, -235, -148, -883, -203, -906, -584, -572, -1156, -266, -916, -599, 520, -922, 147, 455, -561, 403, -148, -714, 524, -561, -536, 41, -296, 258, 405, 533, 859, 367, 621, 672, 189, 495, -158, 482, 430, -289, 1241, 851, -88, 1458, 77, 549, 1376, -5, 657, 673, -172, 658, 238, -265, 444, -55, 382, 703, 585, 815, 35, 261, 258, -698, 52, -542, -464, 653, -251, 245, 633, -451, 54, 91, -927, 385, -175, -191, 198, -595, -378, -305, -802, -189, -130, 194, 105, -100, 531, -393, -352, -213, -1292, -55, -236, -361, 709, 186, 104, 360, -357, 156, -101, -248, 55, 146, 248, -38, -177, 390, -342, 28, 388, -210, 694, 387, -116, 698, -592, -723, -37, -537, 445, 549, -92, 536, 224, -69, -126, -578, -217]
1965b17k01K18J72m17N78l92m09N84p02K81R50j063O74K52j316O75m11j69Q29
1984h4m38O5Q48q56L25l2l39K92m13Q9J78M77J66l54q1N6o33J053k02m11J000
2005G06m37m71N55m13p5M43l82M02K39j56N92l62j63J4l44J89J45K9J29l04K34
2026E70l32L7J39m03M57J16m88Q12n58k31M03q24K04L66j50J44l1o9j94j04M2
2047i4j31j86L41o35N06O05j077R75m10m52R12r59L16L48o18N27l36l46N89n13
2067f38K54K39l38N76j63k68N72j096N24J10o67R36l38K39N35o49M58R9p95O61
2087B51m31j29M02k59L13Jl75K61J04j79K03K9K12o8m73M85n88J5J91k83O91j21
2109B52k35R35r70o6K57l17j81M47l73J09J33j5J3k45L71n98M36K16n13M39j60
$$ y = [-217, -418, -200, -28, -445, 133, -259, -668, -84, -786, -505, 445, -618, 56, 308, -1008, -333, -744, -913, -84, -522, -457, 391, -465, -140, -172, -511, -219, -632, -543, -365, 112, 278, -76, -157, -101, -734, 319, 117, -294, 706, 269, -202, 353, -60, -135, 308, -74, 328, 567, 411, 1003, 641, 478, 492, 148, 337, 482, 511, 640, 336, 570, 238, 275, 414, 11, 468, 584, 96, 908, 350, 119, 522, -302, -98, 268, 118, 262, 231, 162, -32, -136, -94, -225, -411, -70, -705, -199, 406, -671, 304, -106, -558, 354, -605, -289, 59, -559, -32, -368, -714, -125, -638, -384, -145, -483, 93, -70, -338, 234, -862, -338, -228, -895, 41, -297, -58, 477, -172, 286, 385, -410, 251, -180, -309, 93, -166, 147, 148, -227, 34, 138, -41, 162, 191, 403, 335, -138, 347, -241, -226, -35, -318, 373, 252, 17, 952, -18, -84, 173, -144, -325, 122, -251, -142, -9, -24, -11, -256, 115, -483, -47, 169, -344, 95, -65]
2130f5m10M16m18k64O56l40N75J4n63P61m30j57M00q82L85K44q1L33l4j8L74o09
2152a13L76j43k44P61o05L90N8p69O14q6n04J063n84K81L51n34M55m80n18P29
2172D98m01J66K31j34J27o7k6M3m23M12k43n45P29k64j8K15p69M52J12m78O50
2193B67q3l76K21m00J65j8n72R5K16K30K9Q4J66l18j87J12l39L86o1j89M30k39
2215c81n1L08k57k7N4n7M33o1j79J77l76K89l63J60M15l22M18K86m61M18k58j05
2237F0K5k55K95K42o56P48q9l85M74m14J03L08lJ5n1l42L44n73K1M12n62P65l46
2260A36J34O28r01J09K08o71M52j56j79O51n13K58J6j84J81m15J58K05m75N62
2280B04j8n11M05o70L51L98l91O58n49j38N60l01j54J46m46K15K54l0K26k14M1
$$ y = [-65, -475, -59, -477, -741, -85, -425, 150, 164, -399, 362, -68, -225, 175, -707, -322, -78, -159, 174, 140, 122, 496, -113, 263, 120, -124, 637, 32, 422, 480, -289, 325, 239, -265, 798, 214, 495, 846, 312, 767, 287, -231, 498, 97, 263, 494, 360, 487, 420, 394, 437, 14, 426, 183, -362, 367, 103, 85, 300, -469, -17, 95, -383, 267, 184, -192, 29, -371, -206, -224, -796, -701, -485, -255, -226, -142, 24, -294, -481, -369, -708, -322, -383, -572, -142, -381, -432, -124, -381, -408, -354, -411, 22, -39, -218, -41, -417, -128, -491, -331, 84, -238, 180, 466, 5, 423, 165, 60, 85, -170, 125, 367, -289, 459, 370, -15, 459, 45, 148, 456, 453, 468, 417, 75, 419, -154, -133, 279, -283, 482, 136, 270, 898, -3, 106, 314, -357, 95, -61, -240, 411, -102, 156, 172, -12, 169, -246, -88, 117, -358, 204, 186, -325, 80, -590, -239, 159, -232, 426, -123, -261, 299, -2, -156, -10, -456, -241, 13, -17, 209, -5, 36]
2301C6k5J17j0l97N30k6l71M33j74k39M35n17M87L34p92M29K77l95K72l38o5j21
2323a20J02J71j35n1M83m72K86j12m59N23m20j98L64l31J27M64l91j02J06j14
2343b79L93n15J11L37m87L0Q5J22l9l78L46L8m5R2j0k29L09n02j23N30m19M13
2365b20J19j47L74k69k12N41p7j21m3K48l13J13K43n19K49M4k11O27K98k71J34
2386E87j76n67M17k36Q2M5J81O9j03K20k3J42k92l05M55j97j77J71Ml54P15n91
2408F7j18M97n21M66J61m81J67k82l03L82l34n6K55K86m1k05j02J96o41O26k44
2429b25q5N52m26j6K14l12j47L98k94M36j89k61K79k47J26j93K43m5n4L92j17
2450B9N3K03l03r2L29n33N3M31p40Q02q9l66K40K55l07K24m5J0O9Kl13J99j39
$$ y = [36, 11, 128, 118, -279, 251, 225, -146, 287, 113, -126, 309, -208, 279, 613, -179, 250, 527, 132, 404, 66, 1, -120, -18, 153, 18, -33, 450, -22, 264, 152, -307, 216, -204, -402, -38, -369, -242, 222, -169, -271, -165, -279, 114, -401, -290, 47, -440, -410, -325, -203, -242, -620, -274, -236, -281, -189, -199, -428, -119, -621, -744, -214, -633, -220, -101, -248, 126, -143, -355, 186, 109, -12, -55, 193, -120, -7, 236, -283, -34, 10, -201, 426, 724, 453, 587, 411, -156, 261, 25, 107, 152, 333, 402, 299, 519, 496, 638, 346, 41, 496, 299, 122, 293, 297, -57, 658, 67, -51, 446, -75, 391, 552, 71, 238, -44, -347, 35, -299, -355, -100, 186, 145, -60, -162, 34, -607, 19, -225, -310, 242, -184, -200, 14, -298, -445, -47, -341, 95, -94, -355, -76, -323, -197, -390, -147, -192, -246, 146, 29, 82, 285, -18, -110, 219, -314, -261, 170, -570, 232, 143, -223, 17, 272, -35, 189, 144, 154, 223, 225, -88, 111, -28]
2473b8n5J13K12l93L11L68o85K84j02r8K5l2j61L83m50K85j3r2mL02L9l75L2J45
2497A1j34M1k34k49O22m29j31Q22n86J13M47p75K75J18k75K26j85Q2M04l38L46
2518A71J13l54J09l56J76M25l73J89k42J05M21m20K88J26j31L04j97l22N73l59
2538B46j46L97l60k1J28j69L97j45k41L18k30L95n78P2L51k97K21J66n32L19k69
2559B2k59N18l25nK99k36K2k61p6K39l18R7L7R5K38j85O9m14j63N65m49p6N07
2582e9l46J26Q1J5q2l7P3J00l00J46N0K5N5l29L89J57j89L25l93k2N19o75N08
2605A37M4p88N93J33j18L45k34j75N52n64K31n7k31K89k16K14L1j47J54k77l9
2626a23L32r9J52j3l94M43l07l72P00j7m91N92m08J66m2J24l21J03j52J1K37j80
$$ y = [-28, -83, 30, 242, -151, 160, 528, -157, 127, 25, -73, -48, -80, -241, 142, -308, -23, -36, -128, -132, 170, 209, -166, -134, 11, -123, -82, -316, -565, 57, -372, -503, 319, -267, -154, 293, -482, -207, -89, -364, -138, -323, -241, 163, -175, 171, 284, -70, 39, -317, -141, 284, -89, 100, -142, -37, 384, -36, 252, 378, 247, 551, 354, 32, 605, 246, 100, 497, 137, 116, 244, 75, 472, 327, 86, 404, 174, 569, -9, 63, 414, 117, 338, 504, -28, 291, 22, -237, 281, -44, -49, 250, 14, 36, -225, -301, -62, -380, -283, -246, -151, 87, -98, -29, -443, -606, -41, -490, -566, -59, -405, -279, -198, -183, -265, -302, -229, -129, -429, -283, -233, -208, -153, -482, -93, 64, -125, 200, -193, -215, 304, -371, 137, 181, -607, -14, 119, 1, 346, 112, -63, 489, -75, 156, 99, -132, 157, -59, 155, 186, 39, 193, -84, -123, 209, 110, 262, 249, -145, 298, -9, -381, 319, 302, -189, 403, -5, 161, 119, 243, -78, 25, -127, -116, 121, -59]
2648e9l2j75M47l18J74m8l02M57r5l79L56j92RL09k62J52N2p8q2L57o1p3r0N9
2672A26j99Q2J14o4K19l33R2O2K7n8K29k46L68l14L44k27j28j8O8j78L89n0J0
2695C15j45j12M18q7l76K34l50k11N35l33L04j33j32P6mj05J03l7O0j76k3J11
2717f8j75K01k09k8J85k08j19L22l83P8K84k36L71No35L51l8N6O3P6j78J14m4
2740b15M5J59L9j38O9M2L2j0K9j96M43k83kK38m3j52M01m17Q1J71q4J34n4R2p0
2765C11k9L5l47L82j8j76L64n36L36L14n38K45P9l57J69l09r9P89o85k3K41m0
2787A08r8j30J42j50j16K31k47l06P65k61k66N39n34N18j85k20K15k38l26O79
2807A20l90L31j47j19L88j07j78J32j62k4J59j25P6l04J18K63j25K35N4m16L56
$$ y = [-59, -91, -266, 181, -137, 37, -11, -313, 144, 49, -330, 26, -166, -157, 152, -110, 42, 94, 16, -66, 291, 230, 157, 67, 126, -73, 9, 123, 59, 278, -55, 37, 99, 126, 68, 297, 51, 419, 105, 449, 222, 94, 76, 144, -34, 355, 305, 315, 170, 58, 476, 389, 13, 247, -103, -314, 221, -112, 192, 59, -73, 3, -1, -106, -3, -40, 20, -156, -179, -68, -243, -42, -251, -279, -94, -302, -421, -99, -482, -404, -120, -356, 15, 20, -615, -264, -302, -246, -183, -107, -285, -171, -215, -170, -11, 28, -110, -41, 1, 33, 23, 52, -144, 299, 16, 14, 252, 209, 57, 458, 41, 122, 293, 209, 343, 289, 381, 311, 282, 317, -30, 352, 334, 158, 522, -14, 322, 636, 98, 343, 422, 65, 234, -75, -174, 615, -70, -93, 148, 108, 10, -120, 22, -128, -244, -13, -260, -566, 199, -62, -328, 211, -323, 195, 10, -210, 5, -233, -559, 120, -270, 61, -86, -205, 183, 76, -102, 30, -132, -156, 3, -122, -46, -350, -232, 31, -94, 141, 195, -221, 135]
2828A35m0q3k4k2Q9J08j70K69o7q2k30R3K13j35P4L5r5J58k65j07J71j32q1K04
2852A6J09j13J3l12L01k33J07k4r2m3m2Q2M0l15N96q5k80K20j35M3Q4l41N4K7
2876c23o0L54k97J26L29l14q9K02l40L9J52K8P8o8N2L13k35L50k56j2L74k95Q0
2899A88J7j48k35L57m48N27n2J5J55rj38J31k24L0r1n9K64K7L22l42j53J75j19
2922A90J09J06j73j05p5R7L44n86K7o8K37L6J02l01j66K73k4j51r0J04j12J49
2944g7k6k22J93Q4j09M5oN3l12J22r9J77q4J06l22K37n2Q5K38j21j7M0l85M86
2968C4k33O9L30k49p5J21k84N81l56p6J76j36J32K6k65J15J25p9K31n6K04j3n12
2991a90L79l75J50K42k24J92K23o03K64Mj08K96k52LK26k24m6j95J71p2j70M34
$$ y = [135, 95, 12, -12, -34, 55, 163, -7, 262, 195, 113, -117, -24, 189, 54, 128, 163, 68, 226, -39, -146, 25, -107, -188, 16, 125, 12, 25, -287, 14, -219, -112, -136, -228, -271, -313, -231, -191, -506, 90, 5, -275, -55, -190, -147, -63, -404, -350, -323, -383, -29, -326, -200, 129, -185, -274, -72, -412, -373, -221, -193, -115, -183, -131, 182, -53, 297, 41, 29, 403, 108, 188, 205, 57, -178, 179, -269, 258, 206, 221, 376, 367, 229, 360, 136, 166, 75, 16, 280, 307, 629, 287, 134, 309, 190, 299, 405, 232, 127, 52, 149, 493, -93, -66, -134, 103, 139, 241, -60, -226, 47, 23, -128, -218, -114, -226, -77, -103, -325, -132, -48, -157, -112, -118, -65, -377, -255, -354, -177, -261, -155, -477, -240, -292, -207, 31, -90, -107, -67, -452, 34, -199, -130, 200, -49, -124, -3, -287, 294, -62, -138, 38, -98, 34, 60, -205, -90, 35, -44, 187, 131, 335, 322, -190, 189, -186, -36, 206, -18, 174, 397, -206, 58, 62, -46, 250, -2, 1, 227, 3, -43, -238, -67, -139, -309, 125]
3013A25j82J63J07l07K83j28k03Q1k40J57J86l7j54J21L8k08L8Q5J97m4o9j25
3035a16N6J29k71K47Q8k83L94k61O5K78l59J8L60k97N1K21j31K19j19j93JR8Q
3058B03j91L91m8m29N69n27K57%k56J54L59k77L0r9nq3k59M8K40o6K20k85n8K09
3082I7k41J32J89j48l93J37J60Q3l66J64N4j69J47j81N0P8K7J21j52J02m57N58
3104hk04k47L01p6pJ15k85N18k71J23k25K14o9N4J88k24J22o6Q3J36J11k41J99
3127B41k46K07k42r9JJ06K28L20n13M58j67l31L65k09q0J70q1q3J03m3r3J75j43
3150D4K94l5o1K8rk39n3P2N8k37K57O5j60K21m14O9J17k46J99J96k55L11k71k61
3174c10L05L9k32L99j81o3O7L61o31J08O2n2O6J63m44K30K04O4l0J51l52M36n55
$$ y = [125, -57, 106, 213, -94, 189, 61, -142, -61, -301, -144, 42, 5, -149, -28, 10, -198, -160, -75, 122, 78, 9, -116, -60, 69, -202, 45, 133, -150, 244, -17, 48, 326, -33, -15, 345, 48, 99, 320, 189, 408, 289, 96, 97, 195, 203, 12, 403, 355, -74, 495, -32, 225, 225, -31, 123, 482, 205, 235, 136, 131, 48, -211, -163, 77, 11, 231, -54, -112, 97, -144, -12, 177, 29, -364, -227, -67, 16, -350, -186, -132, -301, -154, -335, -285, -207, -180, -59, -211, -109, -566, -8, -212, -459, -158, -234, -241, -126, -411, 107, -164, -41, -266, -52, -121, -67, 121, -103, 19, -47, 36, 172, 283, 42, 241, -5, 202, -40, -139, -138, -32, 196, 516, 3, 461, 294, -37, 328, 119, 39, 209, 128, 45, 148, 105, 12, 187, 44, 338, 303, 242, 270, 261, 22, -31, 41, 99, -138, 119, 184, 24, 245, -169, -100, 17, -229, -30, 166, -89, 222, -49, -310, -5, 34, -198, 201, 20, -43, 24, 385, -246, -138, -76, -128, -62, 101, -343, -113, 91, 155, 125, 276, -76, 360, -195]
3197a95j00M63k50j42M77l38L4M28j43j62M8l89N83J2q3N6l64J46q8k8KJ2L50
3220C29j38l07J66k57K65j45j03J07R4q4k6k6R3K5q2k40j45N12q9J2l9k60K05
3243a33k36M5J94j14l1K73l32K71k9j0j02q0N1J09o5L33N7n04K61Q9k81J84k10
3266b60K39K32l34L95m1j73J93j81K53J8j02P8Ok73m1O0J60k65o8L21j3J08P3
3289C85k30J56k03n7K41j61R4R4k77o1K82k62J62M8j45P6j09pk00K56k14k51N25
3312A42l32P6K88k71L4J82n62L39N5k69K8K18P0j41K7J26j97j37J92L35l27jJ1
3335a14J44j93pJ10l44N63j14k8J22j51j14K82n88O2M63j17J69j76J2Q2p1Q1j38
3358f5L12j33j10M7O7n1J04j09R1K71l23j30K77k85L27j86k06L50m93J55LJ8k46
$$ y = [-195, -295, 168, -82, -224, 253, -85, -51, 377, 234, 72, 120, -269, 314, 326, 243, 299, -65, 81, -7, -35, -33, -21, 329, 191, -116, 50, -207, 58, -87, -190, -83, 11, -73, -99, -125, -32, -7, -89, -329, -474, 38, -51, -39, -78, -338, -133, -369, -324, -130, -244, -275, -2, -334, -63, -92, -102, -204, -284, -233, -124, -189, 144, 201, -303, -42, 47, -234, -50, -260, -21, 211, -123, 272, 231, 58, 251, 70, 323, 341, 239, 317, 323, 50, 9, 69, 229, -36, -104, 217, 204, 312, 385, 155, 311, 108, 51, 292, 131, 225, 319, 42, -19, 263, 1, 163, 211, 66, 142, 33, 26, -174, 82, -132, -383, 142, -190, -114, 174, -97, -63, 119, -443, -104, -49, -318, -290, -72, -2, -143, -116, 10, -187, -324, -132, 203, -124, -125, -114, 30, -163, -170, -60, -404, 159, 45, 17, 139, -12, -126, 156, -432, -370, 93, -24, 145, -31, -19, 63, -8, 73, -65, 247, 114, 4, 51, 118, 67, 171, 62, 153, 424, 101, -29, 248, -37, 290, 104, -102, 248, -245, -90, -87, -69, -315]
3381c15L70k63K95N6j78k15k1J9J5L28k07J44q4j56N9P7JJ00p3o8m6J81q6K7q6
3406a26J8l2r5L68oJ39k31M5j90K17R3j89N9Q1J57k11J43j88jJ94p4K26k15J50
3430C32P9k11k58m9L23k18J70K38k5j82j49J58j36j5n7k8O6K2j61R1P0mJ5j32
3454f1J8q5Q5k02o4Q1K0J32LJ57l04J33M1j22K01j37r8R6l73M54q5k7R8J0j37
3479a66j15K9O0j16J82M1J56j05j15N8J15Nl7J96k03O1P6j45K23k13j82K35r4
3502e4J05J37k08J01k8j25o3L60j75j40L07j17k00N24n27J37L76l57J9N5n0J4
3524I1k1r1K00l16O9l6L76k78RJ10p1L4N6k48K11j85J15L2m2n5nR3j72J63j88
3549a49Q7J63j67O9P9j86Nj21L24L5K59k92j8Rp1K7q7k04J60K16Q6j76LNj84L31
$$ y = [-315, 55, -208, 87, 143, -35, -250, -271, -252, -237, 91, -116, 28, -56, -212, -153, -76, -75, 25, -48, -116, -162, 19, -67, -40, -126, -108, -140, -235, 133, 127, 266, 35, 80, -110, 107, 200, 11, 70, 151, 308, 97, 240, 52, 51, 245, 171, 397, 182, 332, 411, 200, -58, -107, 216, -2, 168, 406, 381, 199, 50, 208, 72, 57, 0, -28, 38, 60, -101, -10, 60, 56, 71, -61, -43, -128, -43, -245, -309, -228, -208, -76, -73, 84, -220, -87, -46, -168, 33, -104, -202, -106, -479, -25, -110, -137, -39, -29, -166, -281, -252, -192, -308, -126, -85, 71, -34, -149, -91, 24, 29, -8, 188, -15, 46, 122, -23, 200, -13, -195, 40, -54, 51, 188, -20, 81, 53, -72, -135, 225, 50, -90, 217, 100, -100, 424, -103, 34, 410, 53, 72, 127, 77, 91, 70, -21, 179, -137, -68, -104, 272, -6, 3, 113, 42, 76, 132, -116, 95, -90, 25, 57, 15, -40, -45, 48, -124, 39, -149, -62, 101, -66, 3, 82, -104, -99, -220, 104, 139, 398, 106, 88, 97, 26, 53, -34, -238, -78, 138, 224, 48, 51, 56, -128, 203]
3575B03K9r1p5k3J71l0k65J9J24J61j32J2N3J0J84j22oj53Rj5k18J68p5K75l77
3600a64L46k67j0J34j80O4J96l29L28k39j14K8p5M89o03J12L23k88L08j60l90
3621d91L61o0j02K4j39K39K42n2j1j92j11L5J44J71k72J87Q0k53J90J62l95N05
3643B62p3k74L9K20q3P9l82L02L5k26K88O8j89K02j35J55j36%l5j98M19k04j33
3666AK39Q8j71l3k13J38r5J47J47k51k2J32j23N8J9o9K07k53J75j13k32L17l63
3689b70M8L32m26M34k66K06l6l38P3K68j29k6M8k90J75j2K51j59j15L72J0k74
3711a24j7J94j9n0k2q0j08N3J11k0P7OJ90j19j99J72J97j53m9L9k9O4mj30j13
3736a33K20j7j27J47K55r8k50l9q6m3M3OM5MK23j68J33k50K36j05k69K98j10M2
$$ y = [203, 232, 141, 66, 43, 214, 184, -81, -62, 62, 223, 91, 103, 156, 166, 350, 228, 222, 69, 78, 63, -155, 13, -62, 213, -164, 182, -85, -95, 39, -141, -77, 119, -210, 118, -121, -235, -207, -282, 207, -396, -284, 39, -249, 59, -101, -491, -130, -190, -292, -268, -407, -168, 74, 22, 11, -181, -292, -257, -113, 58, -214, -27, 53, -200, -10, 152, -243, 262, 189, -85, -46, 174, 91, 170, -212, 90, 125, -101, 187, 255, 66, 268, 133, 288, 152, 152, 117, -81, 338, 134, 1, 240, 328, 157, 124, -89, 49, -46, 101, 248, -3, -25, 107, -16, 42, 61, -8, 199, -54, 121, 8, -224, 93, -270, -222, 110, -316, 118, -148, 58, 22, -316, -243, 25, -104, -130, -82, -372, -197, -209, 42, -117, -232, 140, 150, -124, -141, 53, 34, -16, -38, -118, -226, -173, -62, -82, -5, 1, 191, 72, -127, 45, 242, 89, 40, 79, 50, 114, 110, -20, -133, 87, 70, -57, 90, 345, 247, -3, -42, -128, -171, -128, -122, -77, -73, 150, -18, 115, -135, 101, -4, -273, 25, -85, -43]
3760d3J1j89J72K4r5j39K70J22j55k84K48N8l63J7K68j69L51K09k71J30m02q1
3782c11M83l45K55O4j49K67k30k01M12m13K67J77l94K06m5J14m1k7P0L8k78J10
3804B9K04JR1l9J42k11k61J24J5r8K35j84jK00j79q9J4J98j63J10KR6j43j38K25
3829A80l38L4K13j88R9J86m07K22J37l25j34L03j15j75J23K02j09M5j09j66K47
3850g5j61j11L36M7j64j61L5J96Jm7k11M66j02j31K09l04J1N7M3K9N2k39L9J59
3874b6JJ1m8K86k12j6k4J19l72L42K2k22L04nn2p3J92Q0k86k16J31m2P8j27L00
3899A45p8j86J72M10m13q5J35jk97j11L7K36j62K06J23j81M7j26K07l3l3k7j55
3922a70J95r2k43L42r3r2O0J93J14k40lq4p2Q4P1K06k05K15j80J41J18r1n9J22
$$ y = [-43, -32, -221, -49, -25, -120, -259, 11, 133, -22, -306, -58, 0, -363, -346, -78, -247, 104, 313, 42, 172, -230, -311, 172, -173, 82, 146, -3, 264, 34, -167, 245, -168, 99, 276, -118, 88, 43, 157, 116, 89, 159, 197, -81, 29, 233, 234, 325, 286, 428, 217, -44, 80, 95, -3, 232, 48, 47, 247, 68, -21, -7, 191, 28, 138, 140, 236, 93, -45, 180, -158, -124, 89, -99, 0, 186, -221, 1, 138, -187, -321, -18, -133, -308, -185, 17, -92, -47, -156, -322, -75, -236, -347, -11, 36, -128, -289, -254, -58, -57, -104, -315, 151, 49, -82, 127, -177, -166, -109, -66, -37, 15, -224, -185, -26, -25, -14, -62, 224, 12, -4, -28, 91, -281, 61, 83, -139, 165, 160, 108, 35, 227, 307, 21, -195, -64, -106, -28, -155, 145, 67, -119, 53, 463, 50, -35, 100, 99, -198, -309, -272, -36, -198, 8, 131, -50, -3, -129, 78, 45, 12, -15, -170, 25, -67, -310, 32, -61, -153, -93, 100, 214, -26, -29, -113, -185, -101, -30, 176, -29, 186, 6, 147, 265, 174, 115, 237]
3946B37l3J2R1k70K8p7N3k57K73J08P0m2j3J96j45j88m0J06q8J49j79J99M3q8
3970A45j98J46j67J70p5J40j91q5M0j35J93J5j4J31j84pJ20m73M48Q9m24J07l0
3993b39j76J76M0J48J24k81N3Q3o8j10N29k82rn7J76j42O4j25j7P0l5M1K6k25
4017b36K53l25K37J52l5J11j16j4p1K03k65J70k6q2J82KK92n84K09j53J85K34
4039C23k03l53M15P6k69J87k42j12K43J37j58K3p0P8p5J04O4m37J00R7o7P3nJ01
4063C0R1N8j34k49j65J61Q6qK42l37K09Jj0lj13n5L69k62Pj1Q9Q5j25j23N4J69
4089E6j78J79O2J56l21K10j9L6k2p7j11J17J2p7k8J57L5k92l3K15Nr6Q0o7q9j78
4115b68K91J13k72J24j3p3O7j28J51j85j2p4K56J72j09l47M39m67K40k42K09q
$$ y = [237, 204, 216, 307, 37, 65, -12, 41, -216, 57, 165, 235, 193, 180, 376, 231, 43, 3, 109, 21, 170, -9, 190, 233, 145, -53, 93, -74, 96, 21, 161, -30, -115, -75, -210, -17, -2, -16, 115, -69, -76, 44, -429, 19, 108, -316, -209, -239, -415, -239, -199, -51, 73, -208, -155, -72, -140, -250, 279, -3, -12, -69, 107, -35, 29, -96, -113, -43, -78, -37, -11, -236, 17, -308, -71, 81, 46, 157, 41, 27, -44, 159, -106, 64, 38, -44, 138, 140, 432, -152, 57, -96, 89, 323, 120, -233, 182, 258, -11, 176, -66, -178, 65, 202, 44, 67, -3, 75, 0, 104, 168, -269, -169, -72, -139, -66, -71, 30, 121, 179, 45, -204, -369, -208, -122, -130, 112, -225, -16, -15, -25, -28, -141, -196, 173, -89, -82, -93, -4, 81, -44, -167, -113, 56, -122, 57, 119, 275, -46, 164, 145, 181, 159, 82, -29, 88, 100, 23, -5, 152, 187, -105, -138, 77, 82, -14, 66, -1, -90, -268, 23, 136, -136, -12, -25, -98, -31, -159, -8, -193, -205, -279, -23, 149, 40, -307, 132, -335, -95, -337, -128, -136]
4137a36n3J51L1k10j67Q6J99l4j6m9K03J4j65O0j57K32l07J86rr1K64j2q0p1L8
4162i3j36M24k70L2K71l7O6k80M7K6J40R6j94k3K5K62k13k1j93K40j19K0p3M7
4186D4R9J24j90m0p1K32j08J86j26J31j72J7J1pQ6k42O4N6O6k17M8np1J95j4l29
4212b33K42p0J9J33j37J02k70q6L49k99J81O3J54n4k20J6q2K06j85K44j8j10j99
4235b54M23j83p9J43q6R4J3j63O9j59K83j31j0J67k08J59J08j49J81r0k23J52
4257E7rn9J70j73n3q2R2K96r6k74J92P6k4j85j0kj24J14N4k13J7K65r7j44K22
4282A0j92J02O5j20K64k84L26j93r1J16k80K68J7j35Q9M8J01k00oJ55k1M2j80
4305i9LJ22J57j94J87m0L3o7L5Q4r4l25L64j82n7J74j29J82p7j37K74J4j66K40
$$ y = [-136, -189, -38, -7, -217, -384, -298, -99, -133, -149, -198, 5, 19, -146, -86, -243, -11, -318, -132, -141, -232, 32, 20, -60, -131, -93, -229, 195, -75, -43, 228, 191, 257, -23, 24, 50, 190, 286, 92, 69, 94, 356, 143, 122, -71, 169, 50, 70, -3, 44, 143, 267, 77, 37, -34, 198, 90, 276, 150, 281, 109, 126, 137, 130, 216, -26, 38, 94, 160, -57, -9, -14, -85, 110, 96, -233, 9, -61, -42, 91, -46, 56, -214, -300, 49, -250, -69, -6, 148, 94, -126, -110, -192, 14, -171, 73, 55, -55, -254, 169, -14, -93, 50, -36, 58, 71, -92, -23, -182, 101, -30, -40, 127, -81, 78, 186, 37, 218, 128, -95, 57, 48, -11, 159, -14, -67, -149, -57, 239, 143, -131, 61, 137, 113, -72, -82, -84, -208, -94, -40, -253, -236, 29, -68, -212, 10, -182, -80, -15, -135, 129, -155, 171, -22, -113, 3, -277, -9, 8, -127, -38, 10, 111, -89, -95, 60, 39, 81, -99, -96, 26, 183, -11, 176, 136, 169, 102, 137, 221, 127, -198, 166, -16, -73, 101, -28, 154, 77, -60, 214, 228, 62, 302]
4329C02k43j2J45j84j15Q2O5J30j00l5j30L11k99J08M2j42K00j61o6j11J69j13
4351a57K51k04l0K08j15q8J7P4j33L13j04KK4r6J1j35j06J86q2K13m37M49p7l22
4375c38K63R1P7l98K06q0Q7m3J10j24J19J58j82Q0k75K11J25k04K04l50N02j50
4397H9o7j4k49L6J18K10L6P9j86r6j42rJ74pJ03l7j6o2J11k83L62k74L1n8n3K58
4423E4j99L8J90k23r5L33j30Nj29j5K90m8j72J71k04N0J87j09K81j74j36L6KO4
4447F7j41n0L3J93k29R9j16Q1m2PQ1P7K4p2n9J77P1k01J32j13j60K72j10m7K86
4472B60j65kj64K51j42J24o0j01K3nq4L72m03J63qJ8k27NK55J4l12J53Q8m0R8
4497A11j19Kk74L34j93K86k64j59J62pj90l5L30n9J28j53j34Q4r7K59m7qp5J66
$$ y = [302, 59, 47, 192, 8, -107, -25, 40, 170, 70, 35, -95, 216, -83, 25, 67, -75, 125, -36, -102, -213, -44, -157, 94, -110, -140, 68, -47, -135, -118, -44, -177, 136, 32, 34, 58, -38, -27, -162, -268, -82, -164, 49, -388, 61, -16, -338, -75, 16, 93, -305, -99, -179, -92, -135, -25, -149, -30, 128, -54, 26, -249, -38, 87, -117, 87, -263, 239, 89, 22, 8, -241, -205, -87, 123, 159, 238, 52, -44, -186, -195, -21, -28, 75, 38, 22, -40, 71, -212, 150, -124, -93, -151, -204, 54, -145, -107, 83, -140, -235, 98, -32, -27, -156, -171, 119, 71, -101, 70, -134, -84, 103, -6, 275, 101, -35, 1, 3, 67, -74, -124, -91, 102, -127, -28, -144, -63, -105, -98, -17, 60, 84, 12, -47, 130, 201, 0, 132, 19, -141, 131, 21, -26, 260, 95, 93, -71, 180, 38, 162, 102, 1, 24, 19, -65, 307, -96, 67, 59, 77, -150, -145, 110, 124, -188, -35, 53, 13, 111, -8, -6, -280, 54, -139, 147, -117, -276, -114, -121, -311, -346, -16, -75, 53, -100, -234, -150, -247, 12, -35, -43, -118, 48]
4521D8J22n45K59J66J17m80R3L42l82J01O9l9j9J38K22j2k89j23O4J05J75q6m9
4544cK54j53lq4J24j73L8K76k42J22j89J00J30j92l6K33r1J92l71K97J05m00J73
4567A07L2q0J36p7p1p7J30j36L01l51K89j53j42R4j20J39M7j37j86K34l1j30M13
4590B31j54J25l3l84N7L62j42o1j20P1K04k73J39r6K05l0j59J86n0N3m9k01J21
4613BK61j47jK6J1Q9k18MJ4m2J66Pl49K67j72J41J0j6n5n8PQ2j05J99j36J44j54
4640b3m9M6J06k55K22P0n32K58J65j22o9q1K38k7P3j33o0K46K9k09K15j54m5J39
4664D8q4n7k7J06j47J35j0R9q7J15l6k28R5J63j02N8J0j35J78k85K18N5K9k64
4688a53L49j52L05k82K8j25l7JK62j87J80j25M3M6k78L24l11L13p9j07j51M14
$$ y = [48, 170, -375, -116, 50, 167, -313, -220, 122, -260, -159, -90, -129, -148, -10, 212, 200, -89, -212, -148, -43, 132, 46, -3, 251, 98, 95, 11, 135, -38, 0, 276, 34, 156, -33, 67, 197, 5, -31, 202, 111, 303, -68, 229, 334, -66, 107, 139, 59, 195, 118, 47, -30, 100, -36, 265, -86, 203, 50, -92, 2, -118, 21, 68, -69, -255, -21, -52, -182, 231, 77, 202, 169, -215, -158, 204, 62, 1, -119, -48, 156, -117, 22, -74, 131, 101, -58, 128, 78, 131, 82, -119, 2, 263, 116, 115, 141, 152, 241, 23, 27, 41, -1, 165, 172, -177, 90, -82, 59, 69, 53, -2, -60, -53, 29, -76, 123, -13, 131, -23, -72, -26, 80, -175, 47, 117, -415, -157, 8, -114, -183, -264, -26, -53, 20, -113, -173, 73, 102, -107, 108, -46, -91, 48, -36, -93, -120, -14, -161, -26, -36, 63, -24, 91, 55, -173, -78, 85, -17, 41, 51, -84, 94, -191, 27, 82, 111, -153, 196, 44, 349, 67, 95, -30, -67, -66, 196, 9, 189, 64, 107, 153, -125, 199, -112, 201, 122, 15, -136, 278]
4710B78m11K18K4j03J61P9k42j72J35J96k06JM5j1k2K12k41Q6L6k19R7r3P5j90
4734b67N33k89j41Q2j20J42L2J5j33K71l40K35j6q8L4j00m5K35j30j8J74J04l26
4757a56o3K05j42R8K14k02N0K4RJ82j54q1P0k45N0K26k83L69j00k4j61O6J71n3
4781G0k8k6O5O4J38j39N0k49m2J16j49K98p6J6n4K5p4k89J2L19j07P2j12K44j19
4806B5n6K0j36K65j33r0J79k8r0J49R4k83n8J43R5j90J84n7n6QJ30l73K56j30
4830a32L80k64R2L8O1Jo6o6lM8r6N2J11J7l51K84q3J7L3J35j54q8M7J97j04m4
4856F2k10J56J36N6l75K86j6N5k88O0oLJ92j44K7k4J9l22P4R7J38kj32J85j39
4881a12L41k66j88K09k78J06J77O8l92L91m9l10J58n5j06K00J39j50K54J3m27
$$ y = [278, -133, 85, 109, 6, 167, 246, 4, -168, -33, 163, -43, -42, 3, -8, -30, 182, -59, 27, 63, -156, -59, -152, -77, -267, 266, -23, -164, -82, -202, -60, -28, -13, -146, 125, -215, 20, 4, -84, -50, -150, -195, 40, -90, -108, 66, 170, -156, -219, -14, -156, -58, 156, -46, 4, 28, 37, 219, 65, -16, 54, -191, -141, 85, -198, 171, 71, 47, -114, -48, 123, 70, 42, 16, 81, 145, 283, 144, 194, -55, -97, 19, -130, 168, 92, 108, 54, 79, 5, -284, -272, 47, -60, 12, -100, 144, 25, -31, -11, -147, 118, -15, -105, 74, 46, -44, 105, 199, -84, -142, 1, 96, -94, 90, 33, -23, -15, 115, -258, -2, -132, 248, -16, 76, 114, 175, 176, 110, 44, 41, 89, -7, 45, 156, 173, -178, 106, 23, 40, 73, 208, 54, -34, 13, 210, 106, 62, -148, 8, 144, 200, -175, 111, 95, 150, -138, -78, -84, -81, 111, -33, -6, -30, -11, -333, -259, -162, -24, -26, -158, 27, -112, 229, -37, -225, -16, -294, -188, -11, 57, -335, 56, 7, -303, -145, -200, -306, -106, 33, -117, 137, 150, -277]
4902b77M23l21J68K87m33j68L14o0J53k56Q1j0J92J29l16j0k4k8L40p7k61L08
4924A54PQj79Ln9J6K91j12J05k09N0o2l9j6j71J06K65j64J5r2J08Mo0J19p9L1
4950D0n2P9k46J25R4j25J29R4nk79J15n6NN0O0j03J4J30r0j06K55j10k4Q0n6j32
4976a14J79j7J1j2Nk24M5J42k61L7P4L25k25K40k56J99J2r9Oj62J42J8j74K05
5000I6j72j18R4J69j69N5P7j67R6j24J76n6M4pn9J56j07p4j43J12K19l60J7J44
5024a01j46%L20k37j12L70j44q0J97N8l24n8J04o3J84K1J06J19j25k12J22n0j5
5047f6K26p1q7j2j32K76k87J17M75o69M11j81j80r2M36j32k1L6j8L73k69J38r2
5070A79l72L33M4l10Q6J98k28J54j27J6r9J82O4j23R8k29L42l22M5N7m91N09j34
$$ y = [-277, 146, -175, -7, 280, -153, -321, -7, -67, 86, -170, -89, -99, 93, 222, -94, -104, -128, -156, 184, 107, -154, 154, 161, 169, -10, -7, -66, -50, 241, 129, 234, 25, 75, 13, -26, -42, -213, -107, 158, -6, 9, -83, 25, 29, -31, 88, 9, 40, -12, 67, -179, -54, 40, -85, 44, 138, 133, -146, -31, -87, -82, -32, 28, -75, -61, 69, -21, -127, 128, 18, -6, 74, 18, -114, 65, 48, 59, 47, 52, -172, -127, 15, -246, -209, -135, 190, -35, 205, -51, 148, 160, 61, 67, -95, 47, 65, -109, 96, -76, -194, -100, 69, -100, -45, 32, -135, -39, -163, 13, -43, 1, -6, -65, 91, -16, -90, -233, -121, 98, -262, -245, -101, -247, -247, 73, -164, -276, 94, -50, -130, 67, 125, -199, -257, -153, -216, -32, -11, 95, 214, 89, -123, -1, -51, -66, 160, 89, 2, -10, -142, 134, -153, -36, 439, -230, 181, 0, -180, -272, 164, 32, 11, 47, 29, 402, 133, 271, 179, -193, 140, 184, -126, -40, 158, -70, 84, -43, -27, -126, 56, 120, -3, 95, -134, 208, -114, -69, -12, -503, 6, -128]
5093a28J58n7qlP0P3k68Q7J4P8k25M46k87j75J80J6mr3O6J07K64l84p0M7j46K32
5119a0PJ26j46j06J98q6k4M1j58K71j58J6O1j24J41O6o0k05J44P1k36J39R2O2
5143A22l5j77O2P6j85J83j20k17J56J21K34m39K60p2j02L31k16M1L0q5l2J51J3
5166A00r8k68L39j01Jj6N4p8p9n9J08L7J28l55K41j46J42J5l09J58k1J49rJ66
5190I9j04R2O3o7k7j01L94n06j00L96m3Q6j56R0k40J48J21Jm3j56K89k49K7Q5
5214I9J38j05J74j03r7J73k83J82q2j99K38K9j11J57j1l82Q2J55j55KJ75j12l6
5237g2m9pn1L07o03L68M7j0R9J59l29L39k62k17J95j22J86k09J26J0N3q4K80l14
5261a60J07R6k00O1K14k79P0J5M6Q3n2n4K27m40R5J23r6P2J79k73L21L5n02L05
$$ y = [-128, 30, -27, -35, -38, 32, 105, -163, -76, -62, 16, -209, 237, -50, -225, -45, -29, -33, -126, -60, 47, 311, -73, -143, -96, -242, -10, -3, 123, -23, -129, 69, -17, -41, 0, -158, 113, -45, -29, 32, -92, 49, 115, 55, -150, -6, 65, -171, -32, 60, 122, 87, -90, -28, 48, -137, 46, -74, -291, -135, -14, 220, -219, 41, -31, -133, 198, -18, 23, 53, -32, -64, 87, 100, 2, -266, 73, -28, -27, -43, 11, -67, -146, -205, -97, -60, 68, -287, -46, -192, -50, -35, -344, -186, -207, -58, -67, 99, -5, 87, 150, 83, 56, -45, 349, -157, -257, 139, 96, 182, 26, 116, -124, 24, 145, 146, 103, -53, 236, -13, 14, 99, 237, 132, 306, 203, 106, 279, -4, 178, 96, -103, 135, 164, 53, 210, 199, -183, -101, 54, -101, -99, 76, -36, -72, -121, -128, -179, 128, -475, -107, -60, -70, 29, 188, -141, 198, -64, -281, -86, -208, -22, -231, -105, -95, -42, -126, 154, -160, -53, 43, -157, -96, 118, -161, -91, -76, -30, 53, 1, -53, 174, -266, -171, -48, -144, -72, 107, -166, 155, 190, -312, -7]
5285gJ37m1k9JJ38m30K47K19l64J41J18j14n9j32J95j2k41L28k43P6J01O0M7j9
5309A17j54O1m9K50j0k76q7P6J45qq7j07k9J27N0j34N5J9J41r4o3j1N3rp4J71
5335G3j48j97k7L53j48nr7J07N5P0l61K13KL34l33J56J1j37J03OJ1J51l34P6J88
5360A22j65j94K91J6k26J79Rj14M25k00j13j5Q0K8n3J16j35J20k03P8j28P7k8
5383c3M9PN8k23K19r2j74M4m4M75k15j56J0J65k8k09K65j46n7L02l32N7K66j50
5407E8k74J56j29K98k9j80J98Pn8j29J92n7lK1j17q6P3K51k53j16J53J05J15p2
5431A24j02oJ00j12mJ07jm7L2j37J71j54r9J51K81l95R5j4J80r3J9j48J8M6J28
5456A40j75J14k83L50j70q3J22o2O1K31j61l87M06k55L3j7J39p6J13o9K8Qj0j33
$$ y = [-7, 130, 89, 60, 61, 199, -231, 16, 235, -129, 12, 130, 16, -43, -175, 20, 8, -233, 95, -148, -72, 29, 89, 136, 117, -37, 24, -25, 225, 215, -61, -148, -72, 73, 65, -22, -129, -158, -31, 19, -115, -60, -41, 100, 6, -57, -68, -15, -24, -98, 73, -75, -272, -299, 54, -94, -99, -196, -89, -34, 36, -325, -112, -110, 224, -109, 47, 58, -79, 24, 30, 41, 192, -142, -66, 122, -43, -237, 54, 70, -156, 23, 32, -82, 343, 143, 30, 15, 95, 123, 70, 186, 51, 171, -32, 46, -82, -5, -33, 16, 23, 81, -142, 77, -15, -189, -145, -189, 286, 71, -85, -75, 90, 62, -147, 118, -28, -85, 217, -115, -58, 208, 58, -216, -60, -189, 109, 80, -100, 98, 105, 47, -82, 110, 53, 50, 71, -46, -132, -59, 192, -61, -177, -24, 81, 196, 124, 22, 16, 116, 4, 0, 107, 106, 59, 91, -46, 125, -29, -128, 23, 304, -91, 4, -10, 170, 77, 96, -52, -34, 12, 140, -35, 79, -204, 146, -24, -107, 15, -47, 14, 245, 84, -303, 103, -152, -119, -136, 3, -73, 40, -29, -1, 7, -3, -136]
5480a36n0L4lP9o3J03k4P2l47K68M8J02k40L2J54J2j45o7J80j07rR9J27j36k2
5505c9K89m12K20m7m2K24q0j08O9k2j18J14n5J15j04l83N26k13M3m4M7L82k93
5528F9r0n3m7L69m11J42J03k17K6K2J14N8K1r5m3j27J55j19N0J70k22k10K67r7
5552a65L17k0k25M7J52k07J9j69J51L18n29K90j1l1K58j22r6J07k04N1J20OJ59
5575B16j75Q6K4j30n5k2O9O2k10K44K37pk45r1P7J1Q8j53R9k17Or8K10q8J40K01
5601B79m67Q3L38k13K90l85m0K09j44j78J55J00p7K13p5J14j83l24J71K17j61
5622g8R1k9P4j16Q0j19J61k2J37l24K26J15k71Q0j39K56r7j68l1J44j93j75N20
5645A22j04K2j33J4J16j14P5n3j34K75M2k79K16j33J09o1j46N23l34r2j6L24m31
$$ y = [-136, -186, -152, -155, -76, -139, -36, -60, 12, -335, -67, -19, 83, -157, -125, 29, 41, -104, -171, 9, -98, -107, -8, 119, -17, -39, 250, -162, 58, 11, -31, 193, 113, 5, 74, 52, -66, 48, -7, 108, 4, -379, 147, -66, -23, -67, -20, 362, 69, -21, -74, -121, 248, -163, -21, 82, -135, -109, -87, 27, 85, 106, 11, -32, -159, -4, -123, -73, 97, -125, -335, -68, -165, 152, 132, -93, -46, 106, -101, -82, -251, -100, 218, -311, -21, -32, -63, 195, 73, -23, 84, -120, -69, 51, 57, 216, 41, 127, 151, 21, -34, -56, 13, 75, -135, 109, 346, 339, 94, 3, 80, 91, 179, 26, 125, -92, -86, -184, 26, -62, 78, 279, -188, -105, 233, 20, 310, -75, -115, 94, -50, -228, -73, 27, -50, 163, 88, 202, 19, -305, -134, 83, -78, 13, -16, 58, -58, 22, -97, 64, 42, 179, -145, 81, 196, -75, 5, -134, 122, 25, -143, -174, -30, -223, -398, 122, 18, 40, -93, -79, 37, -77, -2, -55, -189, 86, 128, -151, 65, -68, 41, -20, -166, 357, 23, -69, -85, 239, -192]
5668a92L79n2k72R7J16k26M29j93j01j13O4k25L21k7r9J9J30J1j6R6n6p5o5R3
5692D3p1j33J48J51j41N3q4K62k06j31J59J23k27p1J15J28p1m8K6M5J59k23K35
5715B41k69rq6o6L64j27j46j85K43jj07R4K2j9P7On1J21o5N1J40J25k71r9K7K08
5741B18j09m8m3n2N7l7M9J77j96J50l7k08r3O4M8J01J39j66k2Q8m4k41J82j36
5765a59J08M7p2K2r6J16q7J24j21q3J40J1J16k81P5J54J41j45r9J01k48J14r0
5788b12J03Q4r1k3K09j06J98k92Q0O0K86l77k0K9J39lj41O4J46J09j24M3j71J79
5812A69j97K25o8r2K1J87j30j24k6P5K5r2j15Q0Q1r6J21k30M67k68J2nM8j40J12
5837D0J20l67L76R2m26lM4m7qK83j51NR8j5P2o7r6j15k8L15o6q0j95J74j6J72
$$ y = [-192, 187, 135, -137, -40, 76, -150, 279, 86, -15, -128, -64, -289, 32, 5, -94, -75, 55, 66, 50, 146, 90, 15, -50, 43, -28, -161, -13, 138, -3, 50, -34, 228, 22, -109, 50, 173, -54, -125, -10, 118, 47, -1, 25, 70, 229, 6, 241, -28, -37, -123, -189, 175, 48, -98, -283, -40, -41, -148, -54, -32, -51, 26, 32, -19, 102, 37, 88, 228, 353, 82, -17, 10, 218, 109, 61, 18, -34, 23, -14, 35, 212, 16, 166, 129, -79, -172, -108, -60, 41, 180, 14, -8, 80, 36, -205, -23, -159, -51, -4, -76, -54, -150, -34, -121, 3, -118, -201, -61, -50, 66, -215, -140, 14, 155, 10, -89, 12, -236, -122, -212, -109, -25, -116, -139, 70, -36, 162, -130, -50, 10, 296, -81, -101, -72, 67, 64, -77, -13, 133, 242, 118, 161, -10, 169, -28, 197, 129, 37, 58, 245, 115, -9, -35, 40, 65, -27, -142, -62, 19, -77, 44, -186, 281, 13, 25, 20, 68, -72, 40, 160, -207, 169, 261, -165, -168, -124, -171, -179, 104, -47, -42, 56, 41, 113, 46, -50, -165, -193, 122, 56, -24, -219, -45, -61, 111]
5863A11k63J98O6j1P1k71M5J61j40J29k09J23N0p4q3K17k78J82J3Q1k38K79k08
5886d9J17k42L60j01j2n5J72k9n7m8p4Q1q4J11o8o2J97j2k86N1k24K44J6m7Q0
5911b1M7j23j8J21r4k67K02m3K94j58l8J25q0m6p9J01K4K23k62M6Q8k73Q3R1k11
5936b68L22Q8P6m12K56j02L8K31m31L21j36k11J82Q4l5j5l9j05K76j9k05K02j40
5959d2J38j05M3N6j52R8O5J9l9N9j45Q6o0J76J30m84M21j62j23J57L8o1j67J33
5983G9k56K01l6m8j47J55j55L53k62K7p3J81J19j36J44k24K8k08N05l03j36J42
6005e0M5J05q9j14P3j81J76kj64j9J12J01l8KJ6K11k10K6p0J71J02k99O0j04K0
6030a20K38q4r0K1k74J84J34K1j63K42k83K56L5k88R8J4J23o4N1j37K48l14J31
$$ y = [111, -152, 46, 112, 101, 172, -99, -54, 107, -33, 96, -113, 10, 60, -14, -97, 120, -158, 24, 37, 118, -120, 159, -49, 68, -174, 186, 85, 73, 18, 190, 161, 104, 56, -18, 63, -21, 90, 22, -40, 157, 145, -141, -90, -314, -70, -54, -101, -21, 26, -97, -115, 6, -88, -355, -153, -196, 98, -60, -98, 27, -53, -99, -178, -77, -53, 170, -92, -46, 42, -231, -148, -57, -268, 54, 142, 218, -194, 62, -40, -2, 229, -202, 119, -17, -228, -46, 38, 3, -12, -51, -156, 120, 101, -104, 98, -42, 96, -9, 34, 90, -62, 36, 101, 120, 81, 140, -5, 81, 21, 197, 327, -157, 264, 102, -21, 136, 174, 113, -54, 79, -177, 24, -12, -60, -207, -52, -207, 146, -116, -89, -162, 19, 138, 2, 146, -78, -50, -258, 247, -56, -192, -50, -5, 100, 11, -103, -30, -211, -35, -37, -201, -220, -108, -7, -45, -43, -27, 184, -26, 0, -70, 101, 203, -96, -36, -140, -120, 118, 34, -56, -35, -309, -125, 9, 30, -133, 109, -174, 82, 117, -171, -73, -59, 64, 0, 51, -86, 162, -152, -21]
6053b1L7k48K53J1j80j34J11L5P4O2n9o2k7J00k15M25m6j35P9p8J57L6j89m4Q1
6078B3r5K09k3p4P1k75J08J86j69j33K00J78j22J88l01M9J25j47J21n0J84k63
6100a0n6J23J49j52m9N0K8q3j8k1J75k20L31k78J5j89J91K41k40j58Q9j21j14
6123c17M23k4o2l1r5J34J2q7J15J1q4n9K30k75J76K1j09r6j19J57K27l68J93J49
6147A22j93J22r9p1J77j12o0J85J46m65r8M20k8j50k11J43K47j20K11j38N1o7
6169A2J45j16J50p6r1K4j8J72j09J5l1N1J36k24PN7l4j00J64l13R6J75No0j61
6194a24K49j39N6p5j9J60kRj04J40l52K57j2j06M32o96J33K70j68N0J82l3j19
6217a1R9k23K06j82k7K47l3k78R6QJ04j13L08m64R1K37k60J00k68M82l00K73N4
$$ y = [-21, 16, -232, 21, 32, -148, -282, -171, -136, -62, 0, -59, -121, -148, -48, -263, 162, 116, -19, 60, -18, 139, 175, -14, -58, 23, -72, 137, 114, 40, 111, -164, -56, 130, -39, -172, 28, 206, 84, 272, -29, 20, 145, -2, 119, 69, 253, -10, -66, 57, 206, 54, 5, 55, 83, 0, -18, -39, 136, -84, 247, -31, -16, -205, -14, 227, -13, -171, -82, -203, -317, 106, 82, 20, -11, -106, 28, 40, -47, 68, 79, -5, -64, 166, -109, 67, 88, -21, -117, -236, -79, 148, -220, -27, 122, -71, 51, -48, -119, 58, -54, -114, 71, 217, -248, -346, 74, 46, -104, -315, -172, 75, -45, 166, 28, 79, 12, 157, 41, 191, 115, 24, 48, 30, 202, 93, 108, 77, 128, 264, 40, 47, 104, 70, -30, 134, -179, -83, 92, 97, 37, -124, 125, -14, 42, -33, -52, 108, 106, 115, 11, 151, -201, 56, 44, -62, 370, -326, -193, 77, -91, -41, 141, 108, -11, 88, -135, 71, -111, -138, 109, 76, -202, -106, -98, 6, -107, 201, -263, -172, 65, -195, -95, -363, 119, -181, 92, 146]
6240A46R4j89qMk40L21j01l85M70k85L27j70M0n5j29N9O6N6r7M1J52k99M68j01
6264A85k85L37l11K35j41n0j31K17n7J44l47K40o6j60M6O5J20n7J62j14j74O9
6286g3N9P1j99J37k9j49K27j83J23j07K95j93L9k61K08j46K79p8l89L38k78J76
6308a33L29o3l0p5k4l8N5j0J92l1r0j27j54r0L06l2J13r0J01J70l00l5L5L9K4
6333D2J04j64Q0k33K24n9l1o8J42j02O0r0J16j28J46o6K30j69l8K16J84k48q0
6356F8j8J51j0j95J3j26J20J5M4j34nJ1M4N8q0J87l1m3j40O9M8o4J20j97n0J01
6382d4J3J03N9J2j83j43K70j17O0O4k29K27k66K81k1o8M9j10Q0j34o7J43n8N8
6406b1M1M7k83J44M7j10K82K3m08J96k0J15Qk90L02j29R0K2j70J81q9K09P7m16
$$ y = [146, 240, 51, 43, 47, -193, 128, 27, -358, 112, -173, 154, -16, 24, -31, -160, -101, -35, 21, -76, -35, 117, -182, 286, 185, -100, 237, -74, 161, 20, -30, -161, 56, -1, 143, -204, 36, -30, -190, -144, -79, 41, -16, 146, 32, -142, -73, -14, 57, -142, -5, -34, -183, 44, -139, -16, -123, 172, -21, 18, -243, -35, -181, 98, 20, -369, -31, -309, -133, 196, 133, 103, 28, 4, -34, 21, 11, 203, 172, 82, -45, -199, -289, 17, -15, 98, 8, 109, 279, -21, -56, -21, 18, 42, 146, -18, 62, -171, 53, -6, -37, -105, 37, -65, -5, -95, 21, -107, 39, -27, 203, 34, -4, 212, 396, 148, 68, 50, 201, 191, -4, 9, -117, 3, 18, 62, -72, -77, -66, -22, 36, -44, 143, 112, 69, -71, -2, 46, -18, 102, -95, -145, -44, -31, 72, 131, 143, -40, -183, 87, -30, 30, 94, -135, 92, -174, 107, 86, 18, 67, -43, 37, -97, -164, -21, -79, -21, 20, 67, -216, -72, -25, -135, 147, 170, -238, -42, -62, 53, 61, -229, 73, -56, 34, 56, -114, 67, -22, 187, 264, -152]
6430a52K81p4k01J12j31K97q6Pj7j03L26l37J51k84J65O4r6p3n9K08j98J96j04
6453a08N0%L1Kk0j32J78N9k0q5J2k5P4Lj5J24j28j74J67K21k05j20R1M6K12r7
6479A41J23j51Po8L3k0M5m9j87J6o1J41p6J6K2l41N10j47O1N7j58K9L9J15k04
6504a07j7K18m40L09j71L36L1k97q8L48j5j45km4L96m86r3l7L55O7k83qJ00j41
6528b14L01o8n7J3J40l18J70J15j31q2J17J14q8M6N9j17k82M37N8m29L50r8o2
6551b6J1n2J65l5r5O7J17j94J11k05J17Q8l3R4k37K33L7k21PQ8k3j37r0K81j15
6576d7k15J39J42q5LK56j05J25k45J35p7k2J3k3l73N41l88N92l78k25M30k7k52
6599h6Q4Q2j55J98j93J45m9l9P4j7o9j03K42K6R8j0j21q2l7J0R1m9l04K91J20
$$ y = [-152, 129, 55, -146, -34, -165, 132, 46, 53, 36, -67, 259, -78, 73, -211, -46, 18, -78, -151, -210, -2, -200, -4, -108, -58, -58, -27, -25, -45, -177, 1, 60, 40, -45, -33, -58, 16, 19, 4, 128, 0, -174, -7, 214, 9, -111, -20, 26, 238, 141, 264, 113, 120, 52, 85, 65, 110, 61, -126, -110, -171, -30, -106, -90, -68, -409, 101, -46, 15, 72, -86, -57, -18, 97, -107, -124, 94, -346, -37, -208, 128, 159, -138, -226, 122, 107, -38, -40, -84, 312, -174, -267, -304, 51, 118, -165, -173, -73, -214, 87, 19, -38, -25, 115, -203, -33, 82, -49, -131, -14, 100, 12, 58, 117, 0, -282, 155, 213, -216, 134, 36, -26, -15, -67, 98, 63, -32, 35, 152, -42, 69, -136, -19, 69, 36, 130, -107, 126, 163, -58, -51, 37, 14, -123, -213, 68, -47, -262, -123, 19, -66, -63, 193, 88, 213, -32, 103, 26, 4, 17, -6, -379, 162, -226, 366, -12, -237, 193, 166, -86, -2, 80, -75, 123, -70, 75, 26, -13, 61, 44, -25, -128, 114, 140, 238, 228, 107, 25, -12, -2, 89, 40, -264, 27, 147]
6624A47p8j14J41m49L41J56k65K0P0L3K9p5K2O5j08J09j21J95l07J32o8J86K00
6647B61l5k52J97j51Nn1P8k16J06Nj03J67k12J98pMJ33l03J64j39K47j53J38k8
6671E3J3j52J75n7k87K91j64M0o6N0K02J29j05j82P6J69l31P4k66M94j55q9K20
6694A32k38Q4J82L5o5Q0m58M00k65L6p8K51J9jj90j02P1J28r1P4K1L2l21Q4J90
6719A0m8L23k50O7p8P8J10m99J74j28K52j23r0J47r1Q6K98k49k07K37J32k14K92
6742B29m24R8K1q3K45K2j15j45n9K99o1PJo2Q6p0J4j24L2K06k8k46K77Mk06K79
6768A97j45O9k13J09l7j36K06k46Q6J14L5Jj14J13mk3L26m25J61K5p1j10K50k85
6792a17l3O9P0M0l2K85m04K26j13K2j49K09k25J34o3m1k4Q4p7L36o7j13k1k19
$$ y = [147, 69, -45, 96, -353, -12, 144, -121, -101, -31, 2, 31, -44, -22, 43, -65, 44, -77, 118, -189, -57, -125, 61, 261, 226, -26, 171, 20, 25, -26, 52, -164, -58, -53, -156, 11, -201, -3, -10, -6, 127, -176, -12, -151, 96, -57, 81, 53, 66, -86, 89, 32, -255, 36, -128, -88, -154, -104, 98, 227, 122, -60, 16, 185, -146, -72, -338, 156, 1, -88, 132, -106, -22, 160, 195, 130, 210, -248, 152, -113, -77, -155, 96, 115, 114, -76, -178, -107, 21, -70, 4, 25, 57, -264, -180, 10, -38, 285, 35, 102, 24, 102, 212, -287, -113, -241, 11, -112, -202, -55, -146, -60, 238, -11, -218, 19, 151, -63, 229, -195, -97, -76, -159, 86, 108, -7, -152, -211, 88, 27, 34, 35, -27, 59, -11, 3, -121, -89, 117, 89, -157, 120, 124, -82, 197, 52, 121, -92, 17, -20, -156, 50, -196, -110, 4, 39, 40, -74, 39, 35, 12, 338, -87, 74, 99, 28, -82, 168, -117, -150, -81, -11, 29, -3, 282, -122, 104, -9, 13, -136, 73, -152, -18, -81, -122, -146, -62, -139, 197, 130, 17, -4, -223]
6816b23J54K2J13j18J43j48k6P2P2j86O5P9p8J06Q8j65K08k30R3n7M1q6P1K24
6840B34o5k46n0R2J96J8j94J08j09k14K21K90l28K25k8j76M1J4j24J61J4N7j92
6863e5J44O3Q2l72J57Rr9J54N1j93J03O3l6rj02O4L5k62K67k87K23J04j4k89K51
6888E2K45l96K59Mk36k25K75O2j55J37J48k0o1k58LK92j56QJ62k53J21p0M1m4
6912f5o8K79k89K96k30J70k91J59j24K79l14m3K04J5J16pK1j34J20l4j49K95q1
6935A25l00J02p2J16O0Q6n2r5Q5j20J41j44L11k20K12l25J18R3J7j46J70n0r1
6958B1n6O7nk08K00L6k01K78l11R6L8J75j05J69k60k3Q2rJ45M2j79k03K14n8J25
6983G0Ol17K75Q7j80J39j53J67j27J81l47K24l8j04J77r5L02j75k16J63J89k75
$$ y = [-223, -69, -47, 66, -52, 91, -57, -83, -11, 61, -125, -60, 19, -59, 47, 135, -30, 178, -52, 41, -16, 25, -61, 10, 234, 169, -77, -127, -35, 161, 179, -15, 93, -16, -230, -9, 281, -47, 178, 150, -26, 15, 29, -95, 66, 80, 137, -55, 89, 152, 234, -138, 19, 28, -71, 83, 134, -59, 44, 107, 71, 62, -40, 24, 59, -203, 64, -223, 0, 104, 90, -199, 52, 297, -99, 160, 164, -72, -297, -22, 40, -115, 22, 170, 150, 89, -169, -166, 126, -30, -22, 140, -113, 8, -62, -21, -65, -133, 146, -143, 153, -77, 93, -198, -39, -163, 116, -198, -241, -37, -22, 94, 87, 108, -26, 94, 60, -89, 206, 125, -175, -73, -145, -29, 31, 117, 65, -30, 55, -65, 76, -68, 243, 23, 235, -90, 28, 121, 138, -8, 162, 112, 21, -35, 32, 27, -181, 19, 55, -146, 132, -179, -83, -45, 130, 25, 194, -66, -89, -7, -16, 129, 171, -8, -211, 3, -55, 70, 76, -241, 34, 121, -59, 80, -73, 94, -33, 148, -199, 25, -13, -117, 60, -35, 267, 92, -124, 39, 228, -47]
7005d7J65j20M7J68j86M9k4R4M2l64Q2K34q0p0j14l7K91j5j64J42j1k2N1k45J36
7030Bn2J78j62J56q8j29K14k37K58j19J83k67q7K5K11nj76Jj61J70J57o8j98J14
7054h0K77k35J18r2j9m0p1M0j2J21j91L42k56K00N8o2n5k77J65j63R5J85j53K08
7078A03j30KL6o5K80j68J6l1k1L7mj1j33K40j99R4k1o8J02k03K04j86K20L1j28
7103cq9J45j05J9k4r8K90j95j52J78K42j88Q7k14J14j36K99k26M2l14L39r4K50
7126A67j94q3L12k12K29l56K18j37L34l19O3j42K28k56K74RR5j64j91J76Pk14
7148a56J63J03o1j98k5J82p7K00j91J0R4O8q4j20J7L3K4k44R3O9Q4Q9q9K5k18
7173b09J56n2P2Q0P8R9j42j58M7K2r7j44J68j02Q2K12j22J54N6n04M71k64K36
$$ y = [-47, 118, -2, 45, 213, 27, 76, 52, 146, 188, -176, -94, 140, 60, -10, -124, -161, 130, 115, -49, 93, 82, 60, 111, -134, 2, -50, 128, -34, 122, 34, -95, 119, -118, 140, 21, 204, -63, -150, -125, 86, 81, -95, -94, -255, -85, 72, 4, -194, -80, 197, -38, 80, -12, -31, -71, -142, -102, -114, 7, -184, 158, -98, 102, 160, 98, 43, -234, -69, -232, -137, 48, -105, 103, -27, -25, 11, -54, 226, 58, 74, 43, 22, 59, 55, 44, -89, 151, -48, 46, 25, -43, 59, -144, 60, -126, 94, 125, -3, -92, 53, -52, -33, -57, -155, 135, -60, -212, -34, 208, 20, 107, -107, 7, -129, 170, -56, -14, -328, 11, -83, 167, -27, -110, 202, -10, 219, -137, 81, -56, 278, -41, 22, -120, 108, -148, 126, 135, 230, 66, -125, 51, 58, -156, 7, 110, 49, -149, -174, 8, -69, 131, -60, -50, 44, 112, 28, -92, -75, -42, -18, -262, -169, -100, -16, 73, -16, 9, -209, -53, -105, -33, 47, 125, 224, 82, -76, -29, -7, -104, -248, -80, -182, -100, 112, -10, 144, 200, -304, 167, -97, 139]
7196A39l24J3J86pj12lR4k49R9K98o3k75K08j42J24J19j83K9K9L78o10M49J01
7219B98k50R8j7j61J96j03N7J6k35M3J69l01M3J01K27j77J04j2k14P2J53j74p6
7242a43J84L1jj59j4J4J62K04k95j23K51l42K01o1k6J29k34K52k61J34J6N9J5
7265gQ6r4n4r0R0J91r7o5n0J49L9o1j5k8Q6o4l8n0J38L9l9J04l09L57l27R3O4
7292D8N9l36K71r4J11k00Q6K9J81k02P3O7Q7l19p3K69j74R5J14k29J43K6M8j97
7316a17J84j73O3J82j4l76K53l0k54R5J66P9k23J04K30k68N6J57J47j91j3j6J71
7339B12k40Qj48K23j60M4J96j97k84K53J43%j10L0N5K0%j48K7L6J03P3J41k95
7363a8J38j40N7l0q0L70k42P1k00p4JK7L48kj11j46J27k2p6m8R6j79J87Q3k63
$$ y = [139, -185, -172, 14, 7, -105, -108, -14, -263, -164, 134, 71, -204, 4, -138, -14, 105, -78, -49, -20, 358, -252, 197, 298, 48, 146, 129, -32, 164, 61, 118, 134, -101, -58, 111, -190, -147, -46, 181, 4, 108, 96, -118, -46, 107, -67, -143, 41, 72, 71, -88, -102, -88, 74, 278, -17, -140, 111, -231, -30, -91, -117, 12, -222, 30, -231, -97, -81, -22, -7, 79, -15, -69, -159, -69, 122, 25, -40, -90, 59, 98, 37, 22, -6, 80, 16, -22, -72, 66, 105, 66, 170, -139, 218, -109, -16, 48, 107, -229, 42, -52, 59, -141, -55, -26, 155, -47, 26, 93, 180, -139, -212, 57, -117, -22, 92, -137, 6, 32, 80, -117, 67, -106, -43, 139, 125, -251, 2, -28, -282, -187, -21, 58, -165, -61, 169, -99, -43, 114, 261, 70, 57, 41, 212, -28, -20, -168, 55, -105, -61, 135, -62, -346, -93, 50, 50, -60, -30, 25, 45, 45, -103, -76, -40, 63, 136, 277, -18, 120, -20, 37, 7, -73, 297, 55, 126, -74, -148, -147, -120, 228, 226, 115, -31, 96, 74, -2, -50, 46, -133, 54, 137, -126]
7388a26P6r5L92j28j85j58J45pK9p8J68K98k57o0j39K48j91O0n5J80j62Pj25J54
7412iJ25k14K29j85j23L1K62M0j58J72l66K85L5l64L23p6o2J90j63j54L86m50
7434b46K61Q7k10M3Q7q6j55J67l0N2k35J09K46J75l17J28Q1m3k65J54p1J2K42
7457A86k96K68q7J31k26j27K4J03J6p0K3r8J87n7L20l95J65j3nK0l7M8k42Q6J20
7482D4lj39N1J26o9n5Q0j12j1l7J1K38l80K05J20K3o4J46k07K36k06m0j20K23
7506F0M5j15k6K67j39j65kJ27r1p0J16k59M12k35p2L3K70j76L9J13k30J08mK01
7530B07k10M0R2j3k29j00K17k3M0k98L39j16k8J66n6k2P0l9o7M0j02J30K07l08
7554f3J1K65l9k99mJ14J42l79K70Q4l13K99l1k65J55J6Q5j58J03K02k48J53q4
$$ y = [-126, -50, -145, 247, 119, -66, -224, -79, -86, -57, -135, 33, 331, 74, 14, -125, 123, -68, -8, -63, 117, -45, -38, -163, -9, 116, -98, 131, -54, -177, -146, 116, 156, -2, 170, -196, 89, 124, -240, 83, 7, -55, 135, -28, -182, 204, -246, 15, 102, -108, -65, 22, -64, -219, -52, -82, -30, -265, -156, 90, 265, -52, 76, 157, 114, -151, 3, -68, -56, 186, -110, 158, 71, 202, -24, -151, -127, -24, -8, -78, -55, -153, 34, -23, 297, -98, 67, 54, 49, 69, 32, 80, -162, -76, 44, 41, -98, -47, 79, 10, -45, 35, -77, -88, -125, -114, 124, -256, -51, 69, 92, 28, 174, -33, 203, -3, -43, -163, 60, 105, -10, -36, 231, 92, -73, -75, 52, -39, -109, 7, -252, 160, -75, -147, -114, 156, -20, 19, 132, -98, 10, 6, 207, -3, 37, 129, 116, -113, -213, 4, -19, 21, -277, 62, -54, -82, 84, 28, 6, 76, 37, -30, 10, -92, 38, 245, -63, -52, 213, 174, -125, -129, -15, 127, -252, 18, 102, -211, 88, 57, -208, -53, -37, 48, -110, -7, 195, -53, 100, 16]
7577A6L57l06J6qM9j39J96k14L9q1J85P1j92L1j60L5J95j04j63K98j56oJ09K8
7601I6l69K67J87k5J5j06lm8m05K74K18l54K76J22k19j03K31K6j78j52K71L53
7623C74m54k9OR6J11L9nl06J30J73j2J14m9j09j26n5K7O1OP5k91K43k21J58J8
7648b6j5Q1k03J75p2j8K8Q8j26P2K59k32j53K5J47J57j94n8K4L4j40K24k28J70
7672A9m1L8O6l16J5J39J50j07O2j37K1j14K20j39J78k10pR4K23j74k5j04M16l9
7696B28l24NP3QJ05n6R7J57m50L8N8K3j8p3q2J2K75j19o9L70l49Q7k93K98J68
7721A69j62KM4J56j30N9j89R6r6j58K2J12m4J91J12Nn1j26R7j35L0m4L18l29K56
7746B05O8l15J64j00NK36m13Q4L6j57L30k15L3K91l8l01ko3J28j67J49L0q0P7
$$ y = [16, 373, 67, 83, 75, 124, -15, 181, -33, 6, -75, 110, 181, -11, 20, -140, -105, 90, -14, -177, 121, -35, -41, 68, 96, -273, -6, 181, 156, 171, 65, 62, 14, -391, -117, 101, -253, 23, 145, -74, -177, 54, 80, -98, -250, 21, 374, -80, -109, -103, -7, 104, 143, 138, -168, -38, 135, 123, 237, 188, 79, -47, -102, -75, -14, -8, 67, -224, 19, -202, -44, -26, -41, 40, -163, 12, -60, -78, -50, 38, -88, -16, 243, 11, -142, -117, 30, 187, -7, -65, -41, -7, -147, 77, -151, 19, -22, 16, 82, -234, -219, -80, 70, -37, 25, -112, -91, -205, 15, -124, 54, -156, -163, -69, 154, -20, -45, -149, 267, 228, -96, -91, -18, -10, 95, 39, 136, 293, -157, -119, -61, -38, -56, -129, -211, -199, 76, -43, -112, 258, -91, -4, -297, 1, 169, 7, 9, 53, 209, 79, 138, -51, 45, -51, -209, -187, -75, -119, 72, 184, 189, 138, 12, 109, -26, 4, -40, 278, -51, 205, 273, -42, 122, 22, 27, 263, -150, -66, -30, -187, 143, -72, -39, 252, 214, -87, -89, -152, -24, -191, -42, -12, -92, -15]
7770a5o2nJ60r8J16j3k0L1k03J86j63n9J3q1L40k62M6M9J91q5L1JJ4M3j90L18
7796B83l48P2j51l8K17j00M9noL7K6O5q7J43k02P2M7J8k74J71Oo5O4N4Q2l96L18
7823E2r2p4L9k4J96P4p9M2l05K44o0l6j07L6J00l32M28J1Lj52J24j75pM4j26L23
7849A47n6k37j63M32l89r4M41l51L39j01J7j95K38j6J2k13L16j8l19P0L33r1j40
7872c8J79j23N6j04Q8o5q6m6Q2n0K01J20m07J9J93J08k37Q4J58j21m0R5J6n2j33
7897a03J08J4k4L27l68M0J5N3J12k23L80k34k59r1L93j56J87j33k05K88j73K40
7919A88k20J81q4k22J35q0J06o1ok6J59j27J29k80J41J84j18p0J07J5J17j02j57
7942i1K24j22K70n33L44p6J96l71K49l7j42j05K54j45J24k54L59l83J90R1r3P9
$$ y = [-15, -77, -82, 78, -20, 96, 83, 63, 94, -109, 77, -86, -145, -132, -213, 127, -135, -89, -40, 151, 66, 97, 98, 112, 155, -35, 283, -65, 7, -144, -182, 35, -65, -16, -21, -27, 10, 36, 101, 14, 157, -45, 27, 74, 92, -182, -11, -5, -70, -6, 48, 130, -266, 52, -40, -114, -75, -99, 97, 171, 92, 134, -171, 73, 13, -23, -130, -94, 6, -326, 102, 113, 116, -36, 88, -87, -94, -50, -176, 147, 91, -146, -309, 123, -266, -360, 81, -270, 69, -32, -15, -210, 28, 12, 24, -189, 127, 109, -210, -140, 193, 102, -38, 141, 18, 74, -30, 58, -7, -93, -139, -57, -107, 94, 214, -193, -174, 19, 127, -110, -26, 132, 11, -29, 66, 82, 30, -103, 5, 19, -5, 322, -46, -6, 9, 62, 174, -49, 331, 97, -162, -253, 140, -16, 171, 38, -167, 121, -52, 188, -32, 149, 65, -157, -22, -102, 4, -57, -63, -89, 70, -57, 72, -208, -67, 117, -1, -71, 36, 51, 168, 66, -91, 133, 11, 281, -252, 92, 16, 212, -159, 90, 53, -89, -194, 60, -85, 39, -215, 144, -239, -49, 42, -51, 28]
7964B8o8m1J44j0nJ4k51J85q1J65j16L8Q6J46j64jQ6l5p8j19P9p1j8J24K9k6R7
7991A37j80o3J90l07K89n7r9o4J77k40M59l32k32K85p3K02Q2j70j03o5Q8J2N6
8014hO7Oq2j19kP2J04Jr1O8j87J42k62L16nO5O8l26Q9L6M7O9J45j3k57R4K9Q8
8042A54j35J65j16N9k42J8K00m08M25p9n0R5L5j78j7R7rk43J22J23M4j28q0K47
8066I9r6l06K25J3K2K79l29J2K17j03n9k49L01j16J83Q1k53K77l77J00k71K99
8088e1l5J09j27J95n6n9pK3J17M0j99R4j22O5Q9m1O2j15q3k3K47k49J14O7J61
8113B16K2n9j58j26P4k34O2Q5P5J3J35j23P2Nj39O4p3J43j07K05rL8l27j50J47
8138a49J17K10m12J79J78j19m3l9J43n1O3q0k7p4p1J49L31q4j80k33m9K67J3j50
$$ y = [28, -40, -81, 63, 53, 48, 62, -189, -4, -85, 80, -36, 2, 88, 234, 70, 69, 155, 120, 42, -77, 2, -69, -87, 37, 66, 40, 137, -43, -106, 84, -223, 66, 9, -90, -154, 23, -217, 242, -90, -322, -37, -110, 92, 174, 4, -99, -164, -76, -64, -8, 59, 65, -17, -136, -138, -66, 38, 39, -52, 16, -171, -29, -291, 25, 20, 85, 153, -173, -84, -48, -1, 68, 213, 200, -57, 37, 66, 154, 19, 184, 68, 127, -115, -97, 103, -305, 120, 41, -9, 86, 121, -57, -74, 23, 14, -229, -107, 16, 60, -68, -148, 99, 3, -303, -78, -65, -43, 236, -93, -81, 136, 33, -26, -275, 26, -90, 93, 174, -79, 198, -179, -79, -350, -51, -86, 23, -104, 91, 35, -24, -31, -8, 109, 149, -50, 44, -78, -13, 76, 35, 97, -18, -101, -124, 123, -126, -12, 55, 216, 238, 179, 21, -105, -31, -265, -203, -118, -43, -30, 105, -18, 54, 59, -80, -16, -89, 54, -53, 152, 143, 181, -146, -296, -149, -32, 178, -234, -55, 123, 4, -39, -78, 65, 14, 77, -3, -30, -104, -175, -26, 305, 221, 41, -192, -241, 26, 39, -111]
8162a11K03J16l00MM3j38P1j06J13R0Pn0Ok12J26J85P9k06N1K68q6kk19K59J20
8187C11j86j0j40J84
$$ y = [-111, 92, 208, -92, -88, -45, -183, -112, -218, -105, -15, -8, -58, -52, -264, -138, 47, 126, -80, -29, 239, 153, 151, -68, 191, 311, 125, 115, -25, 159]
8191A59
$$ Imaginary data points
##PAGE= N=2
##DATA TABLE= (X++(I..I)), XYDATA
0@%%%%%%%%%%%%qJ6j6J6k4L2l2M0n2O0p2Q8j04J20j40J64j91K20k52K88l28L73
34A98m22M76n36O03o76P55q43R40j044J159j286J422j570J731j909K104k316K552
52A338k813L099l417L775m176M632n154N758o469P317q350R642j1308J3555j6775
67i346K1830l1348Q2597k05620J43543R1225k71626K53126l8479j19368J67196
78H3730p0354n9900R9703o0433j5953K7799J0226l2164K1873K8442p0892J5498
90b2425K0087m8610P6812l3835j7776R1958p9107p80M6670r4462N1595J5713o3354
103e7514O1410n675j5508L9200j9555K968p443j4990L989m889K8582m826q099
116b350P238m5752L0495K3092l9785M5190j316j8601L9016m1970q707K1942m1220
$$ y = [0, 0, 0, 0, 0, 0, 0, 0, 0, 0, 0, 0, 0, -8, 8, -8, 8, -16, 16, -16, 24, -28, 32, -40, 48, -56, 64, -76, 88, -103, 117, -135, 153, -175, 198, -224, 252, -284, 319, -357, 398, -445, 495, -549, 610, -676, 746, -824, 907, -1002, 1102, -1214, 1338, -1475, 1624, -1793, 1982, -2194, 2438, -2716, 3042, -3427, 3890, -4460, 5182, -6126, 7429, -9346, 12484, -18864, 63733, -141887, 1656, 92881, -178745, 74381, 35902, -83466, 83730, 13376, -46524, 53179, -7254, -23207, 4592, 14818, -17346, 4527, 32969, -37923, -22425, -2338, -50948, 25864, -7971, -25747, 66211, -12896, -13676, 32994, -61468, -9873, 5840, -57514, 3896, -1779, -17287, 21913, 2358, 5326, -2117, -17107, -13118, -18007, 10575, 5749, -2350, 4888, -40864, -10369, 12723, -27062, 18128, 16812, -1789, 37227, -4743, -13450, 8492, -32728]
129c2728J4287K5374k789P574J056O158k8253L472L1469m1555J7396K3410m1194
142a6323L1582j4498l6454N1052j3863p588L1506k5381Q750p02j3019J6733k5391
155a3596J1371M534l4606M2860k952k0788M0119l7893J315M0449m7992J1732J7115
168A1668l8202K7801N474k5520K0844J569j5789Q175J4464q006L64J4509l0318
181a2967p49K4170l5554J7527K6080l3384K9487J691l8656L4562k499j9440K8236
194A8504j4792j2555J8399j3431p135J6307k434m827J9557l973j2282K0985k0479
207A844j8252K8900j9799K525K9320l3710J0891J6458l2800K3250O655k2984K3882
220A6180p310j9421J5804l566j3405Q849N681j2681J1126J3480k3270J4333J2294
$$ y = [-32728, -18441, 6933, 4144, 11718, 12774, 18932, -9321, -5849, 25620, -15935, 1461, 24871, -16323, 15259, 761, -35693, 15359, 1496, -6092, 25414, 33, 8783, 8081, -4938, 11795, -13596, -2225, 2309, -32297, 10563, 7611, -13177, 26942, -10951, -9636, 30813, -17179, -5447, 11668, -26534, 1267, 6741, -18779, 2065, 3634, -12155, -3980, 10484, 2478, 2842, 17351, -12967, -13716, 10454, -25100, -7573, 18507, -14877, 14610, 16301, -22355, 12207, 9708, -9732, 18504, 3712, -8843, 9556, -3875, -11010, 5297, 2863, -1964, 17593, 13620, 1338, 22323, 1844, -16408, 12492, -7307, -4782, 24538, -9172, 1719, 18177, -14623, 8627, 15282, -7702, 16180, 8870, -10551, 5253, 1687, -11718, -2869, 2812, -9869, 1257, 14737, -8533, 5800, 18094]
233A8094l5897J7434L199l2810L2727j84k6295L3801o574j8772K4008j4189r243
246a4701J9318j1260l48J3404j4752q86M230j5021R281J1852o226J2214K709j2353
260b539L508n805r286O425L760j205K907Q068n247m738J1919j0772k308J8089
274A2776j3839Q14J0997j6410N885j03q268J1906n431O872P389j1600J3944o844
288H088j2018J4947j6518k473J5197j2593P938P963p987N603m017j651R97m352
302h76N339k420q76J781o566K041l407J770O419m789J1091j560j0086J1457j4594
317e276o382J4902j4666N478J2351j2609P943J999o667N008k113J49j536R50k29
332f98p775J0002n709n279J8444j5099M044J7279k4338J4664N813k5590K4118
$$ y = [18094, -17803, -369, 2830, -29980, 2747, 2563, -23732, 10069, 3495, -15277, 8731, -5458, -14701, 4617, -6643, -6991, 6413, -8339, -9225, -4995, -20016, -10735, 1117, -5109, 7105, 9814, -2539, 969, -4836, -14122, -7697, -3937, -5142, -2235, 5833, 586, -4152, 7767, -3005, -5313, 12776, -1063, -249, 10748, -5662, 223, 120, -8148, 3758, -1673, 5199, 12588, 988, 14932, 8088, -3930, 11017, -5501, -7974, 7223, -5370, 2568, 10531, 2544, 8147, 4130, 2479, 3476, -876, 4463, 2043, 1167, 2948, -3618, -1577, -4984, -3214, 3205, -1584, 9507, 7947, -2139, 9318, -5276, -11658, 3244, -11422, -5944, 6407, -6202, 1741, 3740, -2927, 2081, -32, 117, -1419, -469, -698, -8473, 1529, -4180, -9459, 8985, -6114, -2070, 15209, -9129, 5535, 11348, -14242, 9876]
345I876p937j7974K5182j2910m407J8749r238J858L462j132k961n643J1743j2797
359d129j491J7783k4369J3418J2245k9511K8440j922k5107L2506j7977r955K5212
372A5143k5346N987J1570k0135J5040j51q772R393j740J221l962M099m93j4464
386a2610J3991q532p610K4044j9542N799J7603k8193J7628K749k2898K3269r109
399c411p566J6485j3516M140K525n862O465n049Q844k071l715J3160j7475N322
413a724O645k2813K1840k007j3446K6593j6619J50J6073k2218J2911p50j4014
426i379J8209r948L096O708j2827J2178r831J91J4156j7115J4318O33j5774J9870
440A4485j6562l465J6081k0991J4201N723j3514J8085j2148j981J0729j9162J1899
$$ y = [9876, 1939, -16035, 9147, -3763, -8170, 10579, 1341, 3199, 6661, 5529, 2568, -3075, 8668, -4129, -5620, 12163, -12206, 1212, 13457, -16054, 12386, 10464, -14643, 17863, -114, -10069, 15143, -10203, -4216, 7354, -12781, 2259, 2108, -6664, 2729, 989, 2210, -1752, 2347, 1854, -12610, 1381, -7151, -14761, 9283, -10259, -4460, 13143, -15050, 2578, 5327, -17571, 5698, -3411, -10977, 5508, -8008, -3868, -1343, -7205, -740, -5789, 3055, 984, -2731, 10429, -7046, -1724, 4921, -17892, 3948, 1941, -11505, 15088, -1531, -1381, 14692, -7526, 5385, 4635, -9379, 8830, -1118, 1978, 8686, -4141, 8037, -1794, -1603, 12553, -4562, 9756, 10389, -5385, 14485, -2077, -5542, 10539, -10452, 3749, 9472, -4042, 14043, 1895, -86, 10643, -8519, 3380]
453C380j130j1328J8679j1567N09J0121j7452R725J044p859J1638p535J815L400
467C440r567Q242o471m620Q568n962Q050J321n615P415j0034K136M217j0988J0742
482H74m031m893J6439j3328J196J0198j6549R404N375r595Q390l839j959L325
496A007l731L357m403K095L908n160J1299o323n372J2829j5256M200R412j8260
510a0398J3784K35j1404J9769j1563n244J4253j5615N844P970j1486O449k840
523b46j192L970o577N211l251j008Q224o930N480k041q825J1530q654j152J0762
538E301j4338P085M760j0128J3554p259o332J2751r682J032O727q702J420L161
552f50M84j269K70K079o047N040L011n782R073p103m747J2872j1192O71Q634j1686
$$ y = [3380, 2250, -9078, 9601, -1966, -1457, 8664, -8788, 937, 1981, -5878, 5760, -1775, 40, 3440, -6127, 2115, -4356, -8976, -408, -6370, 1680, 3001, -2614, 4801, -5233, -3097, 1120, -9868, 874, -3157, -8050, 8389, -4939, -3743, 6455, -10094, -690, 4685, -4910, 3480, -359, -2318, 1007, -2724, 633, -3770, -1675, 2233, -2927, 8372, 2049, -3323, 9506, -5750, -1550, 7862, -10398, 3386, 3621, -7783, 11986, 423, -4821, 9432, -6183, -339, 7631, -3855, 2594, -246, -1438, 2532, -4045, 1166, -2085, -3093, 5131, -1799, 3681, 1640, -7185, 4345, -4309, -5461, 5301, -9037, -1952, 2808, -7320, 6234, -1025, -7357, 5394, -4288, -3256, 3471, -5231, -3811, -650, -166, -1435, -1165, 914, -5133, -93, 2918, -2864, 6209, -894, -5641, 7231, -3961, -3290, 5344, -6342]
568f342Q268N258p890O844m572m000O760k683j507L237q4m098K580N727q295L011
584B214M455r535Q632R62r548J0218o969l314J2068j0986pP796r500N972L759
599F217o916M704k334m856M617j697m141N132M75m459O077l50q288M927m14l889
615e195Q080l027m511N859n299j720O499n398j016O859l143j371O480o304k381
630e588O188o266K702N368r311N631K550p555R164k674n286P533n226Q88M411
645B529n751M831j151k577M422m050J594P22j613O100l804L15K500q004N485J53
661A701m658P711m243q0N636p182K326J634n576N564n61j703K562l288j92L08
677d1jP06o93J927k157N03K566n664L654N06n851P371l954l141P494o570K678
$$ y = [-6342, 1926, 7184, -706, 6138, 1566, -2434, 4326, 1643, 136, 3373, 3289, -809, 1771, 7498, -797, 2214, 6669, -2866, 5766, 6728, -2820, 7398, 429, -2885, 9183, -1803, -1810, 5986, -3514, 2458, 6217, -699, 4005, 1671, -3185, 1432, -265, -4406, 726, 1201, -3258, 2819, 2469, -5819, -892, -1306, -5195, 2885, -142, -4653, 1206, -4093, -5813, 686, -4712, -5728, 1131, -2012, -3383, 3097, -3207, -5588, 600, -5666, -2964, 2404, -6907, -1276, 1274, -6281, 2883, 209, -5077, 2456, -2770, -1882, 2529, -3222, 1609, 458, -2119, 2303, -1747, -153, 569, -1044, 5056, 1252, 1567, 4067, -3937, 1548, 1701, -2957, 4754, 511, 431, 6067, -1115, 1211, 2845, -2731, 2833, 2272, 569, 3131, -157, -349, -41, -42, 664, -29, 1898, -259, 244, 2810, -2854, 800, 1306, -4545, 2826, -1128, -4269, 3225, -3345, -667]
694f67M476q038O389k416m888P728n851J783M588o738N196j244l978N646m436
709b450K051L188m071M187l591l44K616n244O394j496l169Q575q580K418N845
724F329j1181R526r54q825J2447p972k294J0058r983M620L796p935O291k457k075
739f09L903l403K635j807j19K309o677N777j381m530R997p063O0O483j1230N438
755b17J365p771R469l588k787O184o503K290M56k179L441k615K291j731k169M804
771G40o581L729L033q377R612l418n521J1489r392J622P485j1608P468L46p930
786g303R522m063n40N698n467L183j486j349L209l687M726j331k762O259p819
801c210K986M681r105R784j251o711J0833r032l96P707j0533O898K565q642Q748
$$ y = [-667, 3809, -4229, 2160, -256, -5144, 2584, -3267, -1484, 3104, -3634, 1562, 318, -3660, 1986, -2450, -399, 2789, -1282, 2905, -686, -1030, 1586, -3658, 2736, 1240, -1929, 6646, -1934, 484, 6329, -4852, 4674, 3720, -5105, 7342, -630, -2924, 7134, -2849, 1771, 5567, -2368, 3923, 1466, -609, 3294, -109, 2526, 719, 600, 2909, -3768, 2009, 628, -3902, 6095, -968, -908, 5575, -5655, -217, 1148, -6623, 2846, -742, -3529, 2655, -3848, -1558, -1102, -3281, 160, -2455, -164, -1895, -4064, 740, -5841, -2112, 921, -7456, 2156, -1262, -6783, 4706, -4686, -3064, 4421, -7187, 281, 627, -7303, 2219, -1844, -2384, 3314, -2153, 1030, -456, -1805, 1404, -2283, 2443, 1112, -1650, 4609, -3210, -224, 4457, -4648, 5136, 3885, -2826, 8007, -1025, -1421, 6286, -4247, 2651, 5216, -3426, 5322]
816E322l652k756O532n998K643J325m360L572j910n54J501j928K338k418J269
831I26J513m747M827j627k879O024n976R62L637p727N340P19n021O723k852j752
847a910L690m330J990l19j519K837k040J789o47j818M055m622J989L873o668N577
863A927p47n545O983m535j82N724o560L956J183n286N796k373l45K743m063L037
879A713j791j208L824m173L471L57m091N863n292j6N852q222N322K274p827P303
895C359l663l809P721n636R47N111o078J854J107l562J869Q3q3k09L56L24j828
912b137K345j468j349L448l751J177K636n043L919l42l609M703j746j337L367
927H13k820Q42J570j936J141l68k60M3j03J409j099J065J250j667J128n25j037
$$ y = [5322, 1670, -1086, 5446, -552, 2091, 3416, -944, 2628, 718, 164, 1665, -263, 2075, -343, 926, 2439, -2308, 2519, 892, -1987, 4037, -1939, -977, 2660, -5067, 273, 992, -4029, 2694, -158, -1910, 1780, -2550, -560, -879, -2398, 439, -1601, 188, -459, -2277, 1778, -2844, -855, 3018, -3650, 1927, 1180, -4365, 2618, -1917, -2099, 3625, -2935, 1021, 2204, -3082, 2714, 341, -4, 2739, -1324, 1713, -78, -1286, 2538, -1635, 1836, 2193, -1898, 3965, -1327, -1343, 4509, -3713, 1609, 3883, -3944, 3359, -304, -4113, 3608, -2028, -1081, 4030, -2048, -194, 913, -2649, -780, -697, -780, -989, -633, -309, -2137, 208, -1260, -2609, 839, -2912, -1735, 901, -4142, -223, -565, -4174, 529, -1217, -2554, 813, -2007, -1165, 405, -1531, -390, -758, -1018, -975, -1078, 331, -768, 297, 1547, -120, 1008, 483, -554]
944e54J229p61J179J055j988J072m26m57J840o23M7P24o77K31k12m66%r28J343
963A628L80m15J020q70r61J003j44m55R42j425m88J052j574P88O36j472J728m40
981I33j355J710k386N49K082l284J201J40k211K653p39J80J276l248J954R5k106
998b556L404k737j124L139k857J803J921m199J847J113j784K248N67k127j81M97
1014a026q1p04J927m37j028K863j881k10J942k595J383J386k983K263r1k303K782
1031A207q98n88J492j105K12K129j875o32J038j571n13K401m6j904J821p76j288
1048h96L019j583j085J994l282J198K437l343J538L38k203J797j91k14J18o8N10
1065H4r87J008q60j990L714k798LM836o036K669L154o622N422o53n499P493l846
$$ y = [-554, 675, -86, 1093, 2148, 160, 1232, 806, 349, 2189, 1566, 1613, 2337, 1660, 1891, 1679, 1213, 1213, 285, 1628, 2008, 1593, 2613, 1743, 782, 1785, 1641, 1186, 2128, 703, 215, 1267, -307, 481, 1117, -355, 1373, 933, -422, 1288, -1098, -549, 1533, -1751, -550, -410, -2621, 32, -707, -527, 749, -2499, -545, -450, -2556, 848, -1889, -3013, 126, -2731, -928, 993, -3206, -1359, -246, -2030, 218, 785, -1342, -1523, -1026, -1107, -1811, 116, -321, -1349, 1514, -367, -577, 1365, -1230, 153, 1539, -1444, 819, 728, -1575, 1207, 309, -279, 1213, 108, 320, 2449, 574, -58, 980, -591, -1104, 1297, 1251, -653, 1168, 392, -896, 2123, 540, -545, 1449, -1833, -635, 1802, -1541, -3, 335, -1868, -71, -262, -476, -358, -426, 84, -903, 105, -755, -2745, 969, -1829, -1826, 3010, -3026, -357, 2797, -3825, 1597, 944, -4555, 2938, -908]
1082i08p45N154o070J686K706l985L942l49j449J431j924J940j459L38J924l823
1098a591L559J22l063O045n371j22N059o675L854J582n554O130k784k222M787
1113C756m618J675K153l342K421j517k81P93j714K540k591o7K774l743L330j38
1129A431l825M046l432j70L635m199K467m99k492L717k786Q54J478l312L245r67
1145h09j390K607l572J914k36k211M889l565P64L743n622L305M85m641N490k244
1161a093j322L864l708J793Q83k255L161j933K38K250l214K912q70k238K770k508
1177a270Q81K067k447L217j194j083K752l420J193J193l267L197j093q01K692
1192B617k604R76K06j898K855j659J75K380l871J785J18l521L175o18j198K815
$$ y = [-908, -1653, 3501, -2569, -883, 1823, -2162, 1780, 1431, -18, 1413, -511, 1429, -30, 308, 2232, -1591, 1968, 2090, -973, 5072, -299, -421, 4638, -2037, 1817, 3399, -2155, 3975, 1191, -1031, 3756, -862, 813, 2966, -376, 2045, 528, 247, 1040, -674, 1866, -725, -792, 1982, -1761, 1569, 1431, -2394, 1652, -1780, -1950, 1685, -2514, -47, -546, -3038, 679, -2107, -1253, 225, -3087, 158, -809, -2199, 408, -3164, -1250, -1486, -3697, 1192, -2373, -1609, 2134, -3488, -183, 302, -4339, 1151, -1093, -2415, 1449, -2259, -466, 417, -1838, 1323, -610, -372, 1878, -1336, 1576, 706, -1532, 1238, -1270, -389, 1678, -769, 2448, 1254, 171, 2923, -497, 696, 1889, -1378, 1819, 726, -75, 2617, 13, 989, 1195, -703, 2152, 493, 668, 3048, -823, 962, 1080, -2441, 734, 116, -1082, 1733]
1208A733j383L77q1j042Q56j863J145J93j654K662j346k48J669k363J394j9j582
1225a552L129k021j58J867l927K247N56k651L440o76m00J689j477J060j107k62
1241b43R27k392K690j23k475L954k446n35L341l782K135J568l679L186j399j728
1257a001K630k368M94K088k289J361O18j124Q94q65l5o50j61N92j415J253M69
1274D91j656K035q38j268K246j701j72J573k388P71M00j677J252m2n36J180k28
1291e58l27P29j018l84M75l15l07M63k66J27M90j02J02Q58m15j01O32j134J48
1310i03M51o99O99N60n45Q92L02n17L00O3m54M01j81lJ45J58r8%j75O80k06O24
1332A494p7L63m79m37No77j49J306j307N18J668j896J249J18j827J424r30p33
$$ y = [1733, 350, 727, 646, -396, 460, -1403, -258, -65, -1719, 943, -403, -651, 1018, -1345, 49, 30, -1552, 1577, -444, -602, 1265, -2662, -415, 141, -2510, 930, 254, -146, 1543, 66, 1126, 19, -243, 684, -1708, 982, 859, -1616, 2338, -108, -643, 2698, -1084, 1051, 2619, -1060, 2126, 727, -1001, 1629, -739, -245, 1843, -446, 915, 1533, 409, 1303, 438, 403, -247, -408, 184, -1231, 22, 491, -1165, 870, 32, -1236, 1010, -691, -863, 710, -1678, -907, -507, -2184, -932, -974, -1510, -330, -558, -885, -156, -1174, -1558, -1083, -1398, -1705, -1242, -1508, -1381, -891, -993, -891, -33, -448, -549, 83, -1051, -903, -452, -1151, -452, 108, -437, 455, 757, 240, 540, 603, 149, 550, 369, 366, 511, 669, 571, 571, 396, 1076, 870, 1494, 1417, 1780, 1301, 864, 869, 192, 43, 1349, 42, 560, 2228, 332, 1581, 1699, -128, 1296, 366, -367]
1350c67J777j282l5P65j413O43l34j74J688j115J79Q81j549k52o31O5Q1l04J553
1369A76k69k16J492j579l52J241k648J351O92j589J560J62j493J138q9r3O68m77
1387c25J044o26l41O92j237l23L89l14J025J31Q40K06p41Q15j121r87J477j395
1405g91N28J325j428P54K96j153R04Q6l87N32J28K10j433J9M04j400P20O77p32
1424g41J723n54L90K15k208J083o60j007K052j700M12J344k122J681K81j434J515
1441B70r15O85l65p62J394k181J86J760k618K293Q58j766K935j659m43J232k449
1458a545J446K00j623K554j872O74J818j737J425m54q59J814j661J111m25k083
1474a217K727j655l9K618k642J593J084k577K161p18j418J549j679N87K97r61
$$ y = [-367, 1410, 128, 93, 858, -555, 88, -246, -420, 1268, 153, 332, 1213, -336, -588, -1219, -1154, -1073, -1377, 176, -93, -309, 1183, -396, -748, 493, -2155, -804, -112, -1701, -141, 21, -1472, -334, -423, -516, 152, -325, 719, 93, -248, 444, -793, -1116, -727, -1041, -16, 115, 955, 1161, 420, 1235, 114, -873, 604, -791, -263, 1062, -366, 388, 684, -469, 435, 521, 134, 666, 794, 1004, -429, -410, -6, -1406, -686, -9, -741, 982, 428, 818, 1033, -1175, -92, -752, -1759, 293, -1407, -995, 349, -1773, -92, 189, -1245, 270, -645, 40, -325, -1087, 307, -1874, -1688, 72, -2546, -253, 605, -1161, 1774, 115, -328, 904, -1545, -99, 101, -1522, 1032, -840, -166, 1652, -85, 1340, 886, 27, 1841, 180, 1291, 866, -1217, 1510, -145, -184, 2434, -208, 1385, 2469, -108, 2053, 1335, -83, 1466, -213, 374, 671, -290]
1490b90J369r48P85Q25j467J493j382l88J600k744J296J51j862K533r22o52J940
1507A337k349R67R21j857J477j047q57R50j106O07J06o91J635r42O73J146k027
1524a057J049n78j667J847j539N61J768j488J229L53j422J244q98pQ27r57R40
1541B05o70l92J010j237R41M50j234K406o97l49J760k922L19N17j823K317k02
1558C99p32K240j561J47J235k087O38r6m2N14p77Q01j031l00J145j679J358J000
1576A172j478K055o17j914J649k321L26J124j307J452j7j11J092j076M1m49q02
1593a181J217r40J164j00j389J849j515m21K731k292O73K443l057J508k0k419
1609a749J683o84n40J845j77O16J93l28o9p24L46n79J97R15j053Q12P0j329K006
$$ y = [-290, 1079, 131, 916, 1741, 274, 1767, 385, -3, 1597, -1147, 149, 300, -1562, 971, 49, -603, 1337, -1012, -45, 876, -981, 496, -551, -1408, -458, -1564, -957, -851, -1542, 93, -849, -176, 970, -1057, -8, -586, -2253, -406, -1945, -1384, 384, -1104, 125, 478, -944, 300, -598, -605, 222, -735, 205, -465, -857, 153, -1084, -143, 307, -927, 1479, 782, 433, 2193, -729, -410, 107, -1716, 601, 399, -333, 1907, 346, 493, 1728, -359, 279, 183, 141, 655, -122, 679, -352, -652, 493, -1186, 172, 1172, -306, 1749, 1132, -782, 867, -1454, -1128, -4, -1311, 141, 124, 13, 1105, 29, 70, -379, -1181, 36, -904, 260, 160, -1229, 620, -895, -1316, 1415, -877, -204, 2239, -818, 690, 670, -1749, -66, -750, -1290, 555, 378, 994, 1187, 859, 790, 66, 412, -167, 30, 945, -108, 704, 774, -555, 1451]
1628A451r29q16K604j976k30J918k373M93R96k234R91O51l04Q57l3j81m98nj76
1647B06p40K85p3p46R04j87k85Q77q03M38K87q16O81k37j037Q97q73l50M28J99
1667i45J2O26j13j73J91L15o49J2N31j365K47Q31j026J020O62r25J164k46m55
1686b86P62j016L7N03p65P68j0j07Q49q17K58M60p03J244o65n4K83q53N51K9j210
1707g42J339k40k18J395o90K18L53q51o4n24r1P03l65M95k87K51L89j247Q06J6
1727F46j009J469o50o63J048j595L4R66j312Q70Q14p43R87m57q70M39q00k25M78
1746e73J26J74K68K64m22j71N65j043N78P77j183R15R9j083P64n01m71J176m49
1765a90M86P92o08M31n57o94j12k46O39j42K10J181j093L94N51j488J135n80m51
$$ y = [1451, 522, -294, 2310, 334, 104, 2022, -351, 142, 1138, -1096, -105, 546, 242, 1099, 1066, 885, 387, 382, 206, -534, -249, -322, -1068, -164, -351, -636, 241, -562, -124, 163, -653, 28, -209, -1246, -349, -1222, -1572, -1144, -945, -933, -307, -420, -593, -402, -87, -736, -724, -193, -1558, -1311, -480, -1506, -486, 176, -749, 415, 169, -286, 476, -540, -503, 0, -765, 3, -7, -114, 735, -82, 176, 636, -67, 1177, 512, 458, 741, -112, 439, 468, -742, 597, 357, 139, 1534, 844, 1062, 1415, 564, 500, -24, -115, 588, 223, 718, 431, 682, 1071, -176, 630, 646, -363, 1106, 456, -207, 841, -754, -720, 246, -1066, -196, 618, -125, 862, 405, -465, -26, -826, -1051, -573, -447, -273, -5, 259, -163, -334, 231, -812, -234, 543, -640, 275, 374, -709, 55, -446, -917, 259, -190, 296, 1088, 480, 911, 354, -340, -452, -698, -59, -201, 9, 1190, 97, 491, 1042, -446, 689, 109, -342]
1784c42J517j508M91O59j830J060j75n73J538m85L30J57j121L23o27l21N04q18
1802a221J143J07n44J342j205k66P53j185N71Q1p74J279q23k75N81p83Q54J96
1820a69n72J281j062K15M6q29O62l35l85J121m27P27K30n48O92n44m00O03q02
1839d96K95M24l33M87m78O08Q5l85J062p70n9R66j301L82K23q56M94M4m34Q32
1859G90l52L22L82m26L03n49j4R9n94K91k16Q7N62o27O53J95j242J148p92q04
1879g84J432j118l14J142j165M65N88j030R87l09Q5K04l20P9q09j39O84q89M51
1898g60J013j064J196m13l69P94j106J96N08j119Q91N2k11O50n03l73P75l10L50
1917A97J43%K15q03L63n18J17N11o97N51N22n62P74l67q79O75n53J04O22n81M15
$$ y = [-342, 1175, -333, 158, 817, -1013, 47, -128, -701, 837, 352, 682, 839, -282, 41, -586, -907, -403, -1221, -78, 29, -515, 827, -378, -644, 109, -1076, -505, -424, -1198, 81, -742, -1017, -436, -1219, -365, -169, -741, 540, -522, -307, -261, -1090, -428, -763, -1148, -27, -454, 273, 503, -45, 647, 103, -297, 306, -496, -201, 223, -110, 377, -101, 507, 592, 207, 1269, 499, 440, 1406, 105, 487, 710, -146, 348, 392, -42, 790, 438, 760, 1142, 716, 1019, 470, 456, 555, -39, 252, 36, 123, 685, 58, 711, 906, -336, 812, 20, -784, 648, -470, -784, 358, -807, -342, 246, -784, 203, -106, -21, 183, -137, -58, -867, -1006, -322, -1211, -760, 253, -811, 385, -28, -397, 397, -709, -513, -5, -1124, -233, -181, -392, 258, -245, -618, 157, -153, 197, 340, 340, 555, -248, 115, -403, -286, 225, -472, 79, 601, 39, 813, 446, -433, 242, -311, -207, 415, -166, 249]
1938B49pj09j5k25J84o5OQ02j017L32M05j216N07k95n75J462o64L22Q26j307L00
1959a00j66n71M63k67K84J95j70N61m42j68N70j110R06J57n89J286p91n76R09
1978C81j063K97N22l60P99l4m67J012q01n90N55n28L07o5J85K89L6J86m55rL06
1999E03k36K14L90n97L49l30l83Q94m74m38Q55l26J8O75p52pp0m51oJ73Lj22J09
2022iK24j33K41l00l28P93p62l8L12m45J53L32r98O93l29j36N37m16K21N3p9N3
2044c61j59l56N37n03N76r5LO87j050M44K40r17P10l5l20J027p95K00L86p97Q06
2065B28l13j23Q33m84KJ8n04N64l51n10Q65n32P36K28m15O78o13m74O14n24J00
2086B3K15m92Q67l04P4L1l38l6L28k83K03l9r7J04m64J21k84k36Q10m83M12N09
$$ y = [249, 242, 133, 118, -107, 77, 12, 18, 820, -197, 135, 540, -676, -169, -464, -1039, 423, -241, 81, 907, -400, -100, -266, -837, -374, -641, -357, -162, -332, 229, -213, -381, 189, -921, -15, 142, -447, 839, 48, -528, 381, -682, -385, 137, -223, 576, 542, 75, 1087, 286, -304, 251, -277, 30, -35, 150, 439, 475, 661, 206, 197, 503, 267, 481, 871, 274, 623, 293, -90, 804, 330, -108, 747, 421, 439, 1114, 362, 355, 285, -166, -172, 1, 4, -118, -9, 215, 82, 323, 23, -305, 488, -274, -312, 0, -445, -292, 40, -958, -265, -594, -730, -193, -609, -388, -335, -414, -361, -520, -876, -339, -842, -266, -361, -358, 329, -721, -277, -37, -954, -244, -279, -599, 428, -367, -167, 219, -578, 228, -85, -208, 625, 141, 143, 161, -343, 221, -130, -640, 225, -307, 429, 657, 242, 920, 307, -167, 447, -77, 23, 238, -254, 613, 309, 383, 414, 76, 40, 368, 85, 288, 249, 152, 256, -208, -87, -371, -607, 203, -280, 132, 641]
2108F41p22L60k02n23q0M11k63M00j4K27j26k96J23PJ18j45r2K15m67K25J55l98
2130d46N60j04m34R19j43l88P18p30J23J14n77N32l1j18N68m08K77J00l02O0k16
2151G4L09j43l74Q21m35m85P26r09M12L68o81Q46R9o80O21p68j75M52p03M59R7
2172f9m04J038q23N0K37p26O13m53M6J88m29M28O7n97O58n06J11N32n68M45k4
2193a86n27N60l91j48L00r9k0K65Q1L99k09k86Jn2K94l67K56L11k27J63K00l95
2215g7L87k19M7K60l56K27J32j88J63n37M45L3l63N36m4J08L75p41O9K85m82K33
2237B93j91j38O85m35J41n7l44Q9j50J9M95m13K16j46l39K97l68L18L33n82O79
2258D02q6o69M85l44m69P70n36M28R1m60O21j41n95M31l29J81J81k97M04m67K63
$$ y = [641, -81, 279, 77, -446, -526, -115, -378, 22, 8, 235, 109, -187, -64, -57, 61, -84, -176, 39, -428, -203, -48, -446, 114, 10, -424, 495, 352, -36, 682, -48, 75, 189, -388, 144, 113, -5, 563, 155, 432, 532, 230, 290, 74, 383, 240, -134, 687, 252, -233, 493, -416, -4, 364, -317, 529, 628, -52, 569, -199, -374, 78, -625, -166, -69, -473, 565, -258, -208, 29, -697, -84, -537, -491, -303, -732, -304, -237, -834, -176, -682, -571, -39, -607, -162, -186, -713, -153, -544, -692, -392, -491, -511, -246, -165, 234, 25, -261, -260, -312, -18, -385, -129, 182, -45, 118, 318, -77, 310, 91, 138, 398, 42, 269, 401, 213, 376, -161, 284, 317, -46, 490, 446, 554, 929, 188, 257, 542, 60, 293, 102, -36, 649, 214, 355, 298, -46, 43, -107, -88, 407, -6, 210, 64, -275, 22, -346, -28, 305, -277, 402, 316, -353, 132, -212, -681, 89, -447, -19, 72, -388, 233, 92, -503, -72, -401, -220, -39, -336, 68, -399, -136]
2279a36K5j46K59r0j03L45k75L17M76o57L42k90k27K68l50K03M34m61M70k18q0
2300A06J87l20K11l15l4M12l32K93M9k91J39k00mM76m52J47Q6l81K88k80j2J08
2322a19O7j7m1j8J29k69m1J89n69L51j27j34P52n45J7M33m26J09K36j29R2k10
2344b70j5K58m37M00l84J61K99Q3K9K57m66K66K34m66L15l17q2K75j87M07K97
2365F57n68L49M9m59L25J40k86M4K6M3j5J9k21K07M00l60K26J68p71L04K37p85
2387b71M41o9o2L43k27j38J61J97n20k9K72l05J17Q3k44N3J70o13O09n2n03R62
2409C75m88p5K64q31O62j72k54P2L30k24K74M9J38k70n4K50n75K74K60l66L30
2430c1L04o73N90m58m0N56k64P7k9l03M86k69l11N66k09M53l96K37O8m13K49K0
$$ y = [-136, -111, -257, 2, -88, -191, 154, -121, 196, 672, 15, 357, 67, -160, 108, -242, -39, 395, -66, 404, 186, 106, 293, -27, 184, -131, -165, 247, -85, 208, 257, -34, 105, -95, -99, 377, -75, 72, 158, -223, 65, -215, -227, -119, -52, -69, -110, -128, 1, -268, -309, -120, -689, -338, -465, -599, 153, -392, -375, 58, -368, -259, -23, -152, -60, -270, -285, -27, -464, -64, -448, -287, 12, 95, 124, 381, -85, 181, 415, -51, 264, -53, -135, 140, -47, 360, 657, 89, 438, 487, 28, 353, 493, 207, 251, 277, 320, 305, 324, 103, 310, 710, 350, 576, 744, -27, 277, 514, -271, 170, 101, 39, 382, 155, 17, 178, 375, -145, -174, 98, -207, -90, -7, -251, -198, -28, -641, -32, -84, -587, 375, -113, -188, 76, -755, -93, -265, -519, -447, -117, -341, -67, -18, 120, -150, -204, 46, -529, -255, 5, -361, -31, 273, -400, 190, -268, -308, 248, -16, 61, 32, -271, 215, -54, -365, 201, -8, 445, 49, 286, 354, -59, 190, 210]
2452B10l08J47j55m1N12m61K47Rk10R7J96k72K29j33k43J23J02k27j06J60J25
2473Aj57J34K97m52L83n43p8L38l23K24R1j02M85n43J75O2J14l48K84k48P2K80
2495A46j76o8m7J32j33L66m1o1K51K9m53M70l33k77N72o06J65M16m56L78K40l80
2517A34K86l93K54j04j41NJ30J06Q0k06r7K47L8K32o55L29K05r34P27k38l47M42
2539A00k87RL75k19J1J13k74Qk26N5J5m4M74n29O8K90q8j31K8k83O7K95j59K20
2563a12k87N2P2P3k33K68R3j88j82M80m45L38j60O5j4LJ72J70j45j07M5k38K71
2586iJ83n2k58K02q1Q6J63K54o24K84K16q5k3o8k46L76m61R2M11m71J49M44l00
2609A82J51J24n26J29J15k43K58J7k63K41j12K37k11j1R3n83M60L9r2M45o24P1
$$ y = [210, -98, 49, -106, -147, 365, -96, 151, 160, -50, 47, 243, -29, 200, 67, -176, -53, 49, -178, -284, -124, 1, -156, -22, 275, -177, 206, -337, -415, -77, -400, -176, -85, -187, 298, -245, -70, -8, 106, -242, 42, -206, -134, 146, -30, -98, -145, -13, -146, 220, 179, 118, 369, 398, -55, 415, 82, -195, 377, -229, -64, 352, -104, 274, 514, 134, 420, 27, 281, 177, 36, 41, 171, 277, 357, 151, 54, 301, 339, 571, -84, 245, 450, -484, 243, 5, -342, 100, -187, -178, 197, -22, -11, 102, -172, -164, -390, -335, -320, -364, 110, -419, -351, -61, -149, -280, -252, -535, -468, -173, -332, -112, -399, -347, -275, -202, -435, -167, -74, -262, -444, 36, -409, -71, -231, -166, -180, -177, -5, 165, 20, -87, -42, -280, -9, 174, 122, -136, 66, -15, 71, 234, 488, -136, 148, 364, 279, 256, 188, -58, 318, -143, -51, 360, -111, 38, 482, 182, 333, 457, -69, 60, 175, -68, 190, 207, -56, 185, 73, 310, 99, 88, 181, -402, 58, 97, 5, 450, -174, -103]
2631a03J42n45O20j22rL87l53O6J91q16J38L75j89J46k05J80L8R6p7k97M06J59
2653B28m21L30j21k54M28j28j29K36j8K24k08j29n0K09M1k44J48p4q8J73pr4K45
2676B97k23j32K78k04k9K55k03p9o8J14K53l36M7J19l07K15k33q8J22l5J44J72
2698G9k49p6J4n6M67k59o1J51l25K63J69k73P2m6j51K80m93M19j6L0J26l93L03
2721b5l0j66K63R4k47K94K1l91N52m62j8L72m13M00j46n1K82k29j5K11j3J3J59
2744D55j82j78J64R3l67L16J87k64J04p5r2K0J06j89J77j09j12j20K26k77K52
2765A35j6j79O4K39n28L38q5l03L82l32J51J30l89J29K87j64K83j67m49K36l9
2786b77J76J0p6J4J61k74N8p4K09k7o3K22j36j50L16m79R4K37k40N62r1j08J65
$$ y = [-103, 39, -506, 114, -8, -17, 370, 17, 83, 274, -542, -404, -29, -218, -72, -277, -97, -59, 37, -40, -337, 69, 228, -193, 137, 16, -238, 190, 62, -67, 169, 151, 375, 167, 38, -12, 197, 238, -6, 142, 68, -20, 153, 146, 52, 297, 74, -58, 220, 16, -13, 242, 39, -40, -108, 6, 259, -77, -30, 89, -218, -3, -236, -324, -202, -237, -93, 79, -170, -246, -232, -288, 179, -80, -141, 10, -315, -52, 117, -156, -84, -130, -281, -1, -494, -75, -91, -61, 65, -328, -25, -55, -221, 42, 136, -111, 183, 204, -187, 365, -97, -115, 257, -156, 244, 98, 47, 329, 100, 85, 296, 283, 296, 455, 273, 95, 259, 352, -15, 301, 488, 224, 328, 253, 161, 181, 287, 98, 275, 166, 54, -66, 160, -117, 135, 119, -60, 4, 243, -285, 53, -32, -335, 47, -285, -134, -4, -393, -264, 23, -141, 142, -25, -474, -238, -277, -101, -91, -167, -153, 8, -266, -208, -282, -73, -100, -163, 59, -77, -227, 89, -390, -296, -59, -299, 263, 172, 64, 229]
2809B29l45k9K51k83K12K17k17Q6l18L45rk12K75n8q3J98j69J41k69k84J54J62
2831fL4O0j31Q7n5J30j02j1J14o3j1J69k57j9J94l73k7L06l87M63l11n9J35k80
2855d00J59K17l18J82J93k07L37k09J73k36RJ56k93M3K79j12j24K61j43K71l03
2876f5L01K26j21j68o8j67L03l65K70J3N8Mj01K14O4l88K62q0k22L37j06m10M44
2899B35k69J60J05m7L02n6k83J07k88P8J25k15L2K0m1j05P4q0j15J96M2p2Qn5
2923a42k58J92Q1k37J84n1n2QJ30j55K04L1l96RJ18P7Q5l8O6k2r3j88L07r8j08
2948c46L33j15J6m2N2k76K97N2J08lj0R7j37J79q4j05J54k70K52k6J49J29m20
2971a6n1K74j07J08J7l6J1k55j06K55j47J77R0l19L13j94K15J50o18O2K83k25
$$ y = [229, -116, -145, 106, -177, 35, 252, 35, 121, -197, 148, 139, -73, 202, 144, 61, 259, 90, 231, -38, -322, -168, -6, 28, 88, -43, 44, -11, 119, 17, 6, 120, 57, 46, 215, -42, -61, 133, -240, -267, 39, -348, 115, -196, -255, -120, -400, -241, -24, -342, -160, 33, -174, 163, -46, 127, -109, -100, 56, -237, -194, 85, -27, -151, 110, -33, 238, -65, 236, 462, 341, 173, 105, -62, 241, -124, 146, 159, 217, 221, 120, 334, 398, 10, 272, 192, -30, 307, 201, -209, 235, -34, 126, 231, 184, 486, 430, 147, 254, -34, 44, 169, -46, -14, 6, -35, -140, -66, -146, -261, -65, -23, -95, -87, -142, -400, -208, -127, -364, -180, -231, -283, -275, -145, -300, -96, -65, -461, -452, -334, -257, -172, -210, -144, -166, -259, -447, -140, -238, -346, -13, -128, -112, -154, -102, -378, -81, -29, 79, 76, 66, 163, 26, 205, 121, 16, 170, -100, 152, 126, 275, 404, -16, -67, 207, 100, 208, 225, 189, 200, -55, -161, 94, -53, 124, 214, -105, 208, 14, 229, 379, -239, -177, 106, -119]
2993a19K35j04l8K68j43j27L2l3l3J08j22j06R5o6J86l45K37J5n5J04j02K34k66
3016a45nJ27q2J28O6k3L25k34n7k17J8J90K28j12o5P5j55k33L52K08l23o8J57
3039A55mL10k18l63K69R8j12J2l17J73J77l22J93N2n3N4q7m6N1J24k06j47J06
3062a01P2l09N48l45r7N26k31p2O0l04O6p2l09L42K62j85n3j2j74L58l09R8k5
3085b66K90k2l13m8J48j5J39p0J23P3J08j10J28m38P1K51j26j39K82kK1N6j27
3108A4O3M8n3N1J25o9N6J32k93J50J9RN3O1k4j95J83k81K3J49M5k18J46k14K73
3133B53j26k92L97l5j51j9J89k93J47j32K16N6j92j10K46m6j53J95j99r8j62J99
3155a10j32l6J97j15K08j24k92O83j51k75N60n74p9L24m73J53L29m47M84K1k16
$$ y = [-119, 116, 12, -26, 242, 99, -28, 4, -29, -62, 46, -76, -182, -87, -153, 33, -312, -75, -60, -115, -11, -113, 121, -145, -150, -23, -105, 23, 89, 66, 391, 157, 100, -117, -99, 91, 319, 207, 142, 217, 62, -171, 181, 389, 66, -2, 155, 151, 461, 243, -120, 149, 247, 135, 147, -170, 3, 180, -142, 51, 103, 50, 104, 17, -29, 22, 146, -60, -207, -101, -29, -338, 210, -135, -232, 294, 63, -9, 51, -253, -187, -259, -568, -226, 36, -149, -202, -214, -388, -30, -339, -241, -266, 24, 2, -311, -359, -211, -226, -87, -157, -34, 39, 147, 37, 165, -273, -202, 49, -77, -216, 66, 64, 85, 141, 14, 77, 125, 72, 123, 248, 179, 235, 367, 74, 224, 243, 252, 305, 366, 342, 147, 330, 49, 72, 221, 266, 48, 194, -20, 253, 127, -165, 232, 197, 46, 27, 216, -77, 70, -62, 154, 210, 18, -92, 154, 108, -45, 150, -49, -147, -309, -110, -242, -278, -81, -196, 12, -112, -404, 279, 128, -147, 413, -161, -240, 84, -389, -236, 93, -354, 130, 151, -65]
3176f5M21l64k61L78k55J79j94M09l3j85J96k39l2L93k28k4m6k08L93l11L0N3
3198Gp4pL90q7j16K30m30N4J01k93L30k58P8k4r3J7j86K11J08k80K72m5l17M43
3222C1m20L1L19k62M0J28R2oJ08k51ON6k4J45k06k3K32J39p3Rl17K42Q7M1j33
3247iL77l57J15J22l08J54J14j22L38r1o5K49k12j44m3j13J23J18p1J10j81p5
3269B9J34K54k27M7j15K45k83J5j05J05L5q7k85K79J39K7j17j1M1k44K05R4l18
3292a43J00J00J6l05L4j17j7o1L45j68JJ41k00J67j44J28Q5m3N0r9j10J35j09
3315b14J24K1k79K78M3k92L42L7j79j11M02j50j49Q6N0J01jk8l36L81j33k01O17
3338D09n40R3M04m74K91q9l55N95m86J31K19k64J80K9K6L0j04p4M2j27L10j66
$$ y = [-65, 356, -8, -269, 109, -146, 33, -161, 248, 215, 30, 226, -13, -45, 348, 120, 96, 50, -158, 235, -76, -46, 7, -67, -74, 316, 229, 113, 343, -87, -33, 68, -225, 105, -153, -75, -99, -192, -175, -361, -150, -42, -322, -50, -95, -412, 31, -389, -358, -39, -301, -261, -133, -41, -47, 61, -190, -184, -128, -152, -7, -213, -236, -4, 135, 62, 71, -246, -4, 83, 124, -9, 368, 11, 126, 248, -60, 94, 208, 86, 424, 333, 268, 517, 305, 161, 118, 5, 128, 246, 175, 285, 104, 29, 163, 417, 190, 237, 122, 367, 84, 99, -6, 99, 134, 47, -238, 41, 180, 207, 90, 79, 120, -124, 81, 175, -143, -43, 57, 73, -232, -198, -315, -332, -393, -48, -216, -215, -74, -274, -107, -251, -123, -38, -81, -31, -130, -240, -105, -214, -90, -69, -348, -70, -27, -319, 23, 60, -119, -230, 172, 22, -127, -41, 9, 110, 109, 81, -255, 126, -7, -208, 409, -131, -38, 366, -108, 183, 94, -261, 334, -152, -21, 198, -66, 114, 143, 169, 199, 95, 21, 63, -64, 246, 80]
3360H0k35M00j98M7p8k83M07j12l02L61n5l37L43k47J36m6L6o5q5M50q2j45n6
3383f6J45k08J0K5nO0j34K79r1N9Q4k25L37k52m7L64k20N4q0J93m57K44K07n7
3407B19J35k28k2K02Nj77K6L1j39K69m14K22K02k07M8q8j17K44Q1k30P1j19q2
3430f8P0q3M4J11J27J09m86J23P4l05K02m0m1K86j61j24Q0l7l52J73j61J64J18
3453a77Mj32j45K60k85J99o7n8L52P1k10K58r4j49r2N2o7L75r8R6Qm6n3J33k23
3478h8Q4K32n47L87o4j68L33J16k61j9K97J9j43L23l10N5k89J21J11Lm0M2pk5
3502A62J9k01J32k4K03j82k03J68k68L98k40J09L02m53j2J05O1j11K20m92L67
3523F0P1m24K86l06J57JO8pJ3K3k4j87L0K26k22L30j85q6L08j57J12k9q0O6o9
$$ y = [80, -155, 245, 47, 94, 16, -267, 140, 28, -274, 87, 32, -305, 38, -209, -73, -119, -83, -148, -233, 217, 135, -10, -66, 79, -129, -119, -94, -99, -39, -173, 106, 15, 74, 158, -67, 270, 18, -29, 335, 115, 169, 89, 282, -175, 69, 276, 219, 354, 126, 104, 306, 311, 134, 160, 191, 52, 321, -93, 129, 331, 124, 172, 84, -33, 211, 292, 62, 133, 14, -68, 2, -81, -37, 74, 201, 310, -176, -53, 21, -284, -82, -122, -163, 123, -38, -162, -82, -119, -471, -298, -459, -295, -177, -173, -305, -450, -190, -475, -276, -343, -401, -49, 22, -188, 70, -24, -173, -265, -213, -280, 95, -3, 93, 101, 55, 2, 135, -88, -4, 228, -319, 68, 4, -164, 169, 285, 24, 5, 302, 321, 178, 501, 191, 246, -43, 78, 189, 192, 152, 194, 187, 162, 181, -20, 112, 88, 291, 109, -94, 74, -194, 204, -36, 73, 375, -78, -90, 15, 76, -35, 185, -307, 60, 131, -293, -7, -313, -156, -155, -87, -94, -81, -58, -82, -269, -239, -13, -235, 95, -90, -176, 132, -25, 87, 58, -22, 44, -25]
3548b5mJ12mq0R7j69Q4K60q7k96L5L44n6J4r5P2j88j3n0K2j08L03K79m76J16j7
3574G0k57J71j6J62l01K86k09r1J43j06K00k48L20l4j0j93R3k59J09j79Q3L4J49
3597h3J59L8m2k52O5j8j38J14j4m5K17j36M3J27l44J57N3j58L57j09j34J18j13
3620a38K60j32M8R8k71K79p8K77l4j48j23J06j65K36J10j52L18k82r6O0m8n5R5
3643A65j48K84j70J21J41j72j77o6K07rj61L44p4k68J14k10J68o0K49O3l30j11
3665a00M37p11M11J21r4j09J90l09R9N1j98J54j7o0l7J53o1O0J9j47j01K08K3
3688a8o1Q9j29J08K59k60N4j82J52o8k59L54K46m36q1K53j86J78k9j2K43k11J93
3711A97j01j03j19k80K64j9L06J52j55J10q9m45J91Q7p7Q6J41r8j71m7R6K11j32
$$ y = [-25, -29, 83, 79, -1, 96, -73, 11, 271, 184, -112, -77, 267, 211, 225, 130, 202, 14, 1, -49, -27, -135, 168, 447, -29, 87, 70, -187, -16, -32, 130, -171, 115, -94, -185, -42, -148, 52, -196, 124, 90, 80, -113, -20, -279, -170, -349, -266, -232, -83, 76, 114, 72, -180, -115, -133, -271, -157, -171, -216, 1, -135, -92, 35, -309, -152, -99, -257, 100, -9, -143, -25, -138, 122, -10, 38, 136, -135, 144, 66, 343, 309, 161, 38, 144, -21, 215, 325, 173, 491, 209, 113, 173, 125, 70, 165, 17, 301, 131, 252, 393, 221, 44, -22, 185, 176, 15, 359, 285, 17, 131, -79, 89, 29, 278, 341, 11, -100, 337, -374, 37, 158, 64, -45, 145, -164, -65, -14, -212, -58, -75, -135, -172, -19, -80, -20, -1, -148, -249, -41, -18, -79, 10, -119, -11, 248, -12, 42, -140, 12, -56, -315, 39, 285, -151, -232, 21, -165, 13, -16, -28, 215, 4, 197, 96, -7, -126, -406, -142, -161, 145, 297, 142, 252, 163, -282, -91, -4, -81, 5, 146, 48, -123, -170, -74, 137, 5]
3734El48N56l27J11p6N6J25l40P1n7J08J0k86N18k14M2J5j11K04p5J9j40k5J88
3758B9N6l80N18k63J17m0m2k2O2r9J37j52J66l59L01J07j17l8J63R7j61oj59L46
3782B61k99J84RL2J25J5q4j62L25m93J60l64L07J95k01J29j5o9R5j53K1OJ44j69
3806aJ61J8j19j68K32k29Q0r3M0R1n9n2l7K9o2k17r7K13J23m3j89J85N5o0J71
3831b8r6K1j51M82m80M8j27J37K14m5j73K56j58J84m9j35j75K64p5L7L2M6j84
3854a55J68j49K67o2K6po3J58O2N4j53n3j57J87j76K39k22J59R0j36k8m3k8M1
3878A9n8K07K1m46M72j00J42j97j0j06K41N0j11Q4m04O1N5K07p8nko9j78K98K8
3903A21j06qk92K56j43R1J67n0L8LO2j07Q3m3j71j17J4R7M07j19k14j11J83M4
$$ y = [5, -343, 213, -114, -3, -79, -23, 102, -238, -167, -224, -116, -106, -392, 126, -88, -46, -31, -142, 62, -13, 6, -134, -159, 29, 85, -295, 223, -40, 77, 37, -5, -27, 35, -64, 73, -79, 87, -272, 29, 136, 19, -19, 144, 241, 80, 74, -85, 261, -38, 146, 155, 187, 312, 327, 243, 81, 406, -87, 73, -291, 16, 211, 10, 139, 124, 55, 150, -3, 18, 24, 168, -1, 160, 178, 59, -109, 123, -106, -26, -119, -79, 12, -47, -99, -136, -107, -169, -386, -483, -270, -147, -190, -379, -194, -139, -199, -28, -124, -103, -254, 228, -252, -204, -331, -194, 20, -25, -198, 58, -100, 84, 35, -100, -275, -11, -86, -49, -17, 29, -155, 13, -136, 131, 69, 95, 88, 25, 183, 245, 299, 146, 93, -64, 123, -53, 186, -36, 123, 213, 77, 49, 6, -22, 19, -39, 168, 189, -257, 215, 115, 257, 60, 50, -56, 185, 235, 124, 208, -196, -135, -80, 127, 49, 44, 42, -27, -205, 93, 121, 15, 7, -285, -29, -172, -81, 86, 36, 74, 77, 139, 32, 115, 72, -99, -216, -202, -105, 302, 183, -31, -142, 41, 85]
3927H5J17N0j26k3o6k8Lj68J11J45j32L12k44j48L40k54m7R6J20rK5j90J16n4
3951C1r7r3L26k19K55R1l61O5j01j6K04j99j15K32j47lJ03j10J31j48j01Q4P4
3974a14P6k4l44K62Jj45K37L1Oj43M1J54m18L28n3J25k02K70k82K58j4j57J90
3997H3p9j98K57rJ91k26k23L79k11N0K46j96J03k28K22l6J08q9j19L93n96K66
4019H8n0J30q2J48l3m7M5o7j71K53m66P7K33r3n0K53j64j1K00j59k09L89j83m3
4043a2R5k70J17j09L6K69k29j02J14R7M2k10K02p2j54k4K63m9j01K87l65o7K43
4066Al92P29n24J96J99p0J19l17P8R7k59N7L62k37K83j61l24K41p3j40J22j6K16
4089A87P6p5j07R3l22K33r4PJ15j74J59j40J39Pk52J75j10Q0nl7J84j04k09j41
$$ y = [85, 202, 252, 126, 103, 37, 9, 12, -156, -45, 100, -32, 280, 36, -112, 228, -26, -73, 23, 143, 134, 159, -31, 85, 31, -66, -159, 167, -52, 203, 294, -67, -2, -103, -119, 85, -114, -229, 3, -144, -147, -44, -154, -23, -171, -272, -188, -114, -38, -62, -406, -144, -143, -288, -51, -20, -14, -157, -116, 38, -380, -52, -105, 20, -182, 88, -194, 64, 50, -107, 83, 4, -194, 63, 54, 245, 19, -204, 175, -36, 14, 260, 64, 167, -61, 161, 125, 233, 144, 25, 418, -178, 88, 38, 168, 86, 234, 201, 154, 199, 132, -39, 214, -252, -175, 58, -35, -85, 168, 4, -7, 193, 34, -175, 214, 31, -12, 83, -187, -70, -179, -143, 126, -103, -205, -91, 6, 48, -162, 40, -32, -186, -210, 53, 4, -97, 190, -175, -242, 1, -391, 338, -186, 10, 209, 139, 258, -59, 19, 116, -143, -86, 276, 39, 322, 161, -163, 78, 5, -135, -13, -29, 187, 263, 188, 81, 174, -148, 85, -9, -2, 113, -61, 98, -42, 97, 104, -148, 27, -83, -3, -8, -45, 139, 35, -174, -315]
4113c15K36j51M74m49J46o9k04J65J88j6j52J62m1k06L6L86m71J08l4K96j06O9
4135E2n0K20j39q0L2J76k75j06L69j89p3RL50k59J02k6R0k31J94k31J06K82k97
4158B6J1K41K03l84J45j79J09k57K2R0K06k17J01j9j61pJ40N8r6o8M5J04J39k87
4182c5Oj05J60j10R4J9j84J75q1J28j70M3l6N8k31L16j09j61K68k03o8N9J13r0
4206a44K07j28o6L8K01l12M15m2k96l5J33j54J49k30L74k16O3j55K99j98k4K96
4228A75n04L48n6J54j48j09K3m4L87J5m82K41J39N1j92%j17K05m7r3J63%n0j73
4252a14K36j76KJ74O8k40K7n8R5j66R1K6O4p9J96k09J42j5n5J17P2j85m7P7l7
4277FJ51o8N8j02k7j17M2M0j04N7L0K53l05L5j2K85k60J5Q2R2J24j69n8N3o1j61
$$ y = [-315, -79, -230, 244, -205, -59, -128, -332, -167, 21, 5, -147, 15, -26, -232, -196, 190, -281, -173, -207, 89, -17, 52, 2, 222, 83, 3, 35, 211, -64, -170, 199, 10, -63, -54, 296, 37, 139, 113, 203, -28, 166, -65, 41, 323, 26, 37, 278, 481, 97, 242, 63, 172, -85, -63, 27, 233, 16, 117, 98, -63, -70, 70, 128, 32, -36, 9, 113, 252, -35, -29, -134, 26, -84, 10, 29, -155, 20, -61, 67, -103, -60, -96, -38, -269, 47, -62, -223, 45, -158, -226, -167, -54, -144, 63, -65, -131, -93, 108, -204, 211, 169, -127, -162, -29, -183, -34, -264, 110, -106, -43, -198, 101, -97, -121, 175, -329, 19, -37, 117, -31, -140, -117, -161, 226, 241, -241, 0, 139, 190, -2, -2, -119, 86, 39, -54, 109, 109, 59, -114, 122, -54, -52, 122, 190, -50, -23, -81, 14, -152, -61, -35, 29, -50, 146, -63, 79, 64, 9, 126, 198, 13, -34, 43, 6, 157, 89, 147, 45, 18, -99, -57, -17, -121, -64, -34, 219, -86, -51, -63, 222, -38, -23, 59, 151, 275, 106, 48, 101, 40, -121]
4303a21J85J1J3k19O3Q6J7j79J48J97l17J77P2J35l16M1L5m6R1K5p2K27p1j87
4327ej1j67P0L8L45k14J96j78j5r1Q4j21p2k7J8J37l8Mr1Nm7J97kj44J03k39K45
4354b0P7l17L12j14J20k9l36K94K11p3j65j52j43M33J04j54j86M53j68k21J57
4375H3p6J87m1J7k6O6k09J78l1j54K86l32K13K97n17N9P6j36K98l17K95k11J12
4398A17p8M25m32j12k2J54M3k08j03M00l91K12Jl9J99k79Q5r7j02J42KJ55J70
4421B42j89k0J1KL2m7l1Q9r7k8J07O1k50m3o4J34J46j42K6J39j92N0r5L19l69
4446b09M07L6k37P7j80K89k17J95j12j45J83No9R4m04L95l05K17M9P0n4J59q3
4469A61j54j1j11P8P7o5l9J11k47J28j00mJ6J26Qjj54L40j20j99p4M04j98P8o9
$$ y = [-121, 64, 75, 88, -131, -68, 18, 35, -144, 4, 201, -116, 61, 133, 268, -48, -7, 28, -18, 73, 98, 26, 253, 182, -5, -16, -183, -113, -75, 270, 56, 252, 74, 59, -32, 52, -69, -141, -168, -150, -13, -51, -47, -138, -133, -180, 17, 15, -129, -26, -265, -20, 57, -260, 52, -62, 58, 29, -307, -13, 198, 125, -40, -192, -335, 98, 202, 48, -138, 315, 147, -74, 83, 7, 194, 153, 170, 144, 210, 1, 179, 148, -6, 280, -52, 161, 458, -59, 0, 76, -60, 238, -79, 216, 5, 117, 39, 464, 32, -80, -102, 52, 95, -113, -216, 184, -207, 5, 6, -33, 166, -113, -28, -125, -227, -85, -83, 72, 242, 53, 33, 44, 46, 78, 31, 0, 89, -8, -36, 71, 132, -118, -161, -225, -91, 55, -87, -61, 78, -114, -64, -159, 160, -209, 198, 234, -3, 74, -106, 183, -34, 161, 49, -96, 87, 92, 23, 117, -287, 108, -197, 20, 69, 139, 85, 244, 161, 7, -4, -115, -37, 40, -25, -64, 47, -200, -72, -172, -176, -160, -34, -26, -27, -181, 159, 39, -160, -234, 170, -28, 50, -19]
4494a9j09K13k12J47j6m8k9P8j00K97j79M9l5j9n1K5J52k54J04j19J06M4K3R6
4518A44K49k00l26L76l18N8PK4L4l8M8j65J86O2m5K1l5q7K03j20k4R9J09r4j05
4543F3R6j51N3L2j12k93K03J61K33l97R0J33l25K37j17%J17p7M9j14K34N2j22
4566D5N2n0j0N7J57k10K8k95O9K63m77K9L1J92l6L7K09J54o3k02J52j9j49q1r2
4591b09K46k0k24L71Kk42Q0J83N4l16p5J78m8o9l9j3q7M11Oq8O3r9K50m01j7L57
4617B54j44k70K63k62J84NpQ3O3j93L1O6j05o8J23j64L7P0j57Q9LO0p4J89l9j89
4643a52m6L4J66jo9K0Q3J1k35j36M98k04P6Q5J0j01J43l26K50j56n2n2L32j52
4667B6L5P4M6OJ1K7N8k31J10n0j24R1p3J68j82J08M0j10J14j97M9J56lj72r8K16
$$ y = [-19, -128, 85, -127, 20, 4, -44, -73, 5, -95, 202, 23, 72, 37, 18, -33, -8, 144, -110, -6, -125, -19, 25, 48, 144, 393, 193, -133, 243, -75, -17, -10, 14, 48, 10, 58, -107, 79, 141, 96, 117, 82, -5, 198, 78, 54, 153, 262, 168, 63, 159, 8, 61, 93, -19, -312, -109, 52, 285, -112, -22, 111, -214, 23, -94, -94, 23, -54, -5, -119, 115, 167, 45, 97, 47, 37, 94, 251, 41, 69, -226, -157, 106, -371, -342, -311, -119, -155, -118, 91, 245, 182, -20, 132, 113, -36, -117, -209, 37, 17, -207, 164, 166, -76, 4, 187, 241, -75, -150, 28, -20, -89, -128, -141, -228, 183, 189, 101, 164, 65, 315, -86, -103, 254, 110, -160, 103, -159, 25, 30, 23, 106, 169, -24, 7, 73, -32, -100, 23, -141, -104, -34, -191, -102, -99, -39, -113, 76, 37, -152, -198, -164, 2, 1, -68, -48, 35, 46, -189, -325, 173, -31, 45, 130, 140, 39, 182, -144, 106, -50, -102, -154, 178, 26, 61, 135, 181, 187, 198, 225, 283, 52, 162, 112, -12, 79, 6, 174, -8, 100, 140, 30, 144, -53, -4, 152, 149, -23, -121, 95]
4693I5j38O8J92n1k08J22j71N7k99N11k62n2r7L29j97lO7J14j34K23k08l2O8l1
4717c7j84J13N1k23Q7L80j89j98J4J85J91l20J10j63J44k0qJ58j48J08qk02J83
4740B4J00L2k30L1J14j12n5K06l8k4n8mm5p4K20J73n1q2L8r4J79m47K82M0j95
4765g0J30Oj00K90k87J07k36J44L15j0k07J4o5ol4K07l32J15O9k88J30O4L16k10
4789F2N0j28k9Q2J02k66K02R9k22J23k64J34p2J86O4J42n24M98m03K10j7r5K81
4812B15r3j01P7j44N8K09k78K14k01J62L2k11O6q5P0K18j28j28R3J00k09J6J61
4835A13j62N1p9n0P9m7K19kp2r1J78q6N4j68j09M4J53j04M1J13l18L92k00M5k92
4860b98K92P4k55L16m21K93k58K4j4N3J13J98N0l59J58j6J2j5J58l33L26r9p8
$$ y = [95, -43, 25, 217, 166, -42, 80, -91, -34, -333, 178, -84, -136, -233, 96, -101, -104, -37, 77, -57, 166, -42, -74, -6, -37, -221, -108, -57, -280, -193, 187, -2, -200, -186, -1, 190, -130, -20, -183, -39, -59, -67, 91, -57, 51, 43, -159, 24, 124, 156, -74, -43, 71, -41, -96, 110, 72, 48, -10, -14, -59, -133, 87, 260, 209, 127, 165, 71, 250, -197, 85, 125, -70, 60, 66, -34, 256, -31, 76, -160, -16, 299, 289, 82, 96, 31, 25, -9, 198, -134, -19, 50, -238, -108, -44, 272, 62, 112, -16, -45, 37, 139, -127, 75, 174, -48, 75, -189, -55, -127, 59, 123, 265, -259, 239, -164, 46, 29, -66, 215, 122, 21, 98, -46, 12, 221, -57, 157, -44, 118, 150, -61, 5, -80, -10, 208, 80, -48, 45, 145, -64, -48, 113, -49, 2, -77, -127, -48, -95, 124, 122, 50, -41, 137, 51, 105, -63, -172, -128, 25, -79, -38, 75, -243, 149, -51, -6, -298, -6, 68, -187, 129, -292, 1, -257, -233, -247, -194, -81, 117, 167, -192, -34, -50, -38, -53, 105, -228, 98, -1, -79]
4883g9L08j75JJ39k89P0j62K23K45l09r9J31k12L75j57M7J61n9m6K7K8J50j50
4906A68m0j49r2K85k59J6J70l38K8L18j54Q5r4K43k13J30j29r0O0K20l13J11j16
4929a53J92j96O8L01l30J13k51K33m2p1L46k87J99k41R7k83K80P4j82j24J39J77
4951E9k47K22j66n2J69p6N6J41j24p8K06j74r4L0M4O8J1l5J08P4k4j03p7Q1K04
4976B23j14k11M58n41K13L1j64p3J44K4k88K50q1J56k90L44o2r5J72j89R8l32
4998c27K90J4m3P1o5k07K62m9k5m8J1M5P5K03l95J16K54j80J24k77p6K18J48j50
5022a1r0K87j44j10J48l43L41n9L1ro0K0Pl7m5M0J25J33j19k40J24J71K4J1j91
5047Dj23J07R6R0l0k20M0L63k96L9j66R3K1J26j37K11k17m7K47q4k77K71j8j75
$$ y = [-79, 229, 54, 55, 194, -95, -25, -187, 36, 281, -28, -127, 4, -208, 167, 10, 57, 218, 159, 113, 140, 168, 318, 168, 128, -21, -113, 172, -87, -71, 99, -239, -211, 107, -47, 38, -56, 187, -26, 104, -25, -115, -55, 165, -148, -37, -153, 39, -157, -89, 212, -118, -5, -256, -23, -65, -136, 210, -77, 122, -119, -22, -305, -25, 49, -133, -257, -118, 59, -188, 34, -132, -184, -15, -91, -35, 106, -18, -96, 110, -64, -158, -128, -84, -16, -5, -40, 68, 142, 118, 15, -62, 19, 223, 109, -102, 356, -185, 28, 59, -105, -178, -34, -10, -298, -48, -129, 27, -263, 81, 19, -76, 96, -93, 5, -327, -37, -23, -66, 5, -60, -267, -5, -54, -79, -127, -116, -71, 4, 207, -188, -72, 182, 2, 126, -151, -227, -9, 139, -11, -101, 186, 42, -68, 80, -263, 78, 19, 50, 41, -19, 1, 8, -29, -74, -34, 91, 224, 105, -135, -11, 160, 184, 195, 4, -119, -12, 84, 174, 144, -76, -36, 327, 31, 70, -96, -3, 18, 144, 7, 218, 1, -46, 201, 117, -160, 111, 93, -82]
5071h2k18L35J9m4J48r3k28K42k33j54K81J20j30kk60K91J4QM4j53j75J45K22
5094I7j07Q4m1q2l4j3K28j56m7J23k69L23M5j89n4oJ85R7k52J46pJ78p8j15j11
5119e5K79r4j71O0L2J01j48o4j16K77R6J01j50j87j67M13j3k43KJ24Lk00K72p4
5143G8P7k3j4K10k49P1Nj12r9K18j48R0j03K96l76J51J25M8l46K11N6j18k88k4
5167b64M49k63j21K91k22J35N1r4j25Q0j04J82J33j64j75j21N00q8j64L3J55k12
5189a08N3oJ44l6O9J73J00m91L17j58J6j60K03j94L81j26j78K16M4k41j21J69
5211F6Qn9J94j28q8j45K53k3j99k2M5j45K68J50k6p0j15k23k8K57r6j07J68Jq8
5236a52J41J28j65R1j00J14j27KO2k3jL35m09j08J62J00J13j98O4N7n8r4J85q
$$ y = [-82, -300, 35, 54, 10, 158, 65, -163, 79, -154, -308, -27, 93, -37, -39, -299, -8, 6, 14, 58, -95, -270, -125, 97, -10, 74, 33, -49, -83, -96, 132, -24, -71, 52, -217, 106, 151, -38, -92, -98, 87, 184, -68, 78, 71, 249, 171, 56, -55, 224, 130, -41, 19, 51, 152, 4, -60, -176, 101, 197, 298, 148, -39, -206, 207, 194, -49, -47, 77, 80, -120, 152, 78, 155, 132, 118, 328, 79, 150, 155, 43, -56, 162, 14, 104, 1, 297, -79, 72, 197, 245, -101, 110, 166, 48, -240, -264, 185, -78, -199, 92, -130, 5, 56, -38, -163, -83, -187, -5, 128, -36, -211, -332, 168, 80, -84, -51, 104, -108, -55, -61, 83, 47, 116, 289, 389, -102, 215, 57, 73, -87, 116, -78, 303, 177, -1, 215, 259, 18, -103, 66, 74, 15, 209, 81, -7, -152, 101, 78, -121, -143, -98, -243, 25, 175, 149, 79, -36, -259, -287, -30, -126, -233, -65, -64, -152, -11, 117, -48, 43, -57, 57, -70, -68, -6, -29, -30, 305, -104, -212, -50, 50, 163, -35, 29, 86, 28, -66, 119, 111]
5260A11J00l05k1j0K21q1j40J41QQ2j44N7r2j9J74J66k35L11l62QP2j32Q4k4J14
5285H4j36L4k1J60j50j26J51J6KlJ05r8q2K6l8o6J14N9P9m7J26k45j63M99n14
5310b34L08P1k08L0j94L56j84J37n9J82m63J49R2k74K25J69l07J7K35k34K94k09
5332a01J64r8J64o5P1pk10P4J8M9l02J96K48k13J52j29j38K36N9j7j94l1L70k77
5356A9j05L13j78J37j89J83l76M8J47m1K10m0l01K59l05O8K2l8O3P0J83k02m7
5379a00J11N8q2J3p1n5J42j69J65k92L32k5q9K71l44L5j9k8J68J38j70J5j85K81
5403A00L2p6L10j79k06L60j39K5j96K1J24j31P9m2K7l31K50o6J99k52K45p9j33
5426e8J36LM9O4k33m3M9J70o8j71L10M3j14j46PJ65j82lK38l21J79p4q0K3j6O6
$$ y = [111, 211, -94, -115, -125, 96, 15, -125, 16, 24, 106, -38, 19, -73, -92, 82, 248, 13, 324, -38, -30, 42, -90, -6, -30, 84, -52, -18, -39, 121, -29, -155, -4, 12, 14, 11, 116, 18, -64, -38, -76, -142, -28, 31, 110, 63, 189, -56, -219, 280, -234, 74, 145, -63, -33, -227, 129, -55, 82, 23, 205, -258, -109, -17, -291, -66, 103, -204, -187, 48, -186, 108, -101, 63, -35, 129, 64, 135, 128, -82, -8, 10, 59, -243, -47, 201, -12, 140, 11, -127, 109, 168, 151, -43, -74, 296, 19, -86, 227, 49, 186, -3, 180, -196, -148, -1, -42, 168, 128, -173, 86, -219, -151, -129, -167, -104, -34, 149, -53, -100, 11, 69, -13, 0, -71, -126, 16, -153, 12, -280, 52, 27, -62, 209, -135, -100, -119, -147, 21, 159, -11, 4, -181, 100, 132, 56, 366, 187, -19, 341, 202, 227, 31, 52, 176, 45, 124, 82, 109, -222, 28, -38, 161, -91, 154, 75, -58, 78, 81, 130, 194, -39, -82, -33, 137, 69, -102, 208, 251, 137, -9, -2, 163, -19, -22, 216, -105, 74, 0, -80, -57, -73, -7]
5452gK44k49K59q0k61m9K1J60m4j61J49K06k38M2j31J28j8l3k8K6K5k3j18L92
5476B12l74j02J38J51J21j08j5J7j51J56J06q4p4J09M0m4j54Q6j3j06J03k4R6
5499H6j58J27j18p1N7J67o3j59J52J53k63J84o2N4J9J93m34K11o3j92P0K74Lj61
5523FJ74j13N2p3J00j35R3l80K16J03J25l30K32j91L9K43l13L02j68l5J09o1O7
5546F2k44K04j9p0Q9m7K04l43l8J82n4M8K34j19j73L8J2lK36k53J70J09j34K48
5570C39l40R1q2R7R2j56k0o3j5J92J5n8q8o1j01P3N8P5q8P9k34K47k29K92R9m55
5596b41o3M3K41k16K30m1p0O1N4o0l4q9J52K8P9l2O1l0k67J57R6P3k52J42j09
5621h7O7K9q7N0QJ09j81l5k38L57L20k98J35k65o5K76l52K09J12k5l3K02j19k81
$$ y = [-7, 237, -12, 247, 167, -94, -143, -122, 38, -6, -167, -18, 188, -50, -8, -139, -11, -29, -62, -90, -64, -39, -62, -180, 212, -162, -264, -126, 25, 146, 38, 23, 40, -111, 45, 151, 67, -7, 102, 142, 98, -56, 30, 17, -89, 14, -10, 86, -72, 55, -63, -134, -77, 90, 27, -132, 20, 173, -90, 94, 32, 86, 105, 298, -136, 75, 12, -180, -110, 164, 167, 6, 180, 67, 119, 46, 146, 11, 104, -276, -60, 43, 168, -162, 70, -121, -82, 161, -152, 150, -18, -53, 56, -5, 62, -182, 22, 3, -67, 22, -25, 179, -164, -202, -20, -74, -26, 208, 89, -84, -46, -34, -37, 199, -54, 116, 225, 91, 339, -1, 90, 8, 105, 197, 41, 21, -42, -57, 135, 150, 92, 4, -57, -158, -85, -27, 48, -40, 39, -195, 52, -177, 115, 214, -241, -304, -261, -20, -236, -6, -47, -117, -56, -2, -62, -96, -185, -33, -5, 74, 42, 103, 73, -194, -37, 59, 132, -120, 22, -87, -20, 9, -78, -28, -20, 89, -92, -127, -365, -8, 312, 14, 149, -116, -181, 95, -257, -48, 64, 39, 6, 208, 89, -192]
5645a92L36j00k73L09N9l41L78j5M3r8m3k16j29K43K83Q2j36J91l90j02K46p4
5667F1j46P2J5k60K16M8J55r8m0j08QmJ70j51O6Oq3J6j86K45R3J3n2p2L5J42j73
5694a2j5lJ30J45j80J41j88m0O3j52J92j13O2k12J30K30k78R9J1o4J79l11J01
5717h5pR5l0Q0Q2p3o1n2p5J22n5K66k20P7k37L8P1l6j2N8P1j92K79l69J82qJ40
5744D9j94N1k36J68L4J7J08m8Q7K56l26n3L5J52j14j53L8L1J64k79L10j25k0k32
5768b80M14j66M7j88m9J85K34m28L03J19k2O8j86L2k11j0L21j2n8L7k48M22k48
5791G6K4k75K40m6K66o4m4j89m2J16J67j19j41L6k03M6J17M4j6O7k00MJ53J11
$$ y = [-192, 144, 44, -229, 80, 139, -202, 176, 161, 204, 106, 63, -153, -282, -39, 244, 326, 190, 381, -9, -111, 135, 61, -85, -13, 2, -258, -42, 6, 161, 63, 23, -85, -77, -81, 89, -62, 4, 10, -73, -57, -243, 2, 95, 108, 56, -16, 19, 161, -12, -27, -30, 100, 245, 65, 206, 18, -22, 41, -111, 81, -32, 30, -182, -52, 178, -100, -1, 10, -54, 125, -186, -85, -92, 3, -27, 53, 135, 62, 1, -51, -126, -4, -59, 207, -13, 64, -173, -135, -64, -100, -112, -54, 17, -175, 104, -265, -83, -91, 49, -145, -94, -330, -162, -128, -111, -3, -51, 36, 292, -34, -87, -52, 100, -14, -167, -129, -98, 66, -213, 97, -28, -48, -280, 134, -32, 15, -173, -222, -37, 197, -231, 72, 191, 169, 237, 51, 83, -128, -138, 183, 171, 113, 150, -98, 324, 76, 100, -175, 65, 19, 285, 221, 177, -12, -54, 62, 229, 110, -31, 5, -198, -152, -35, 9, -7, 60, -140, -136, 17, 128]
$$ [...]
8191b2
##END NTUPLES=NMR FID
##END=
