##TITLE=1H_L3L30(feb2021)
 CDCl3,8 sc, 
 12.02.2021
##JCAMPDX= 6.0         $$ Bruker NMR JCAMP-DX V2.0
##DATA TYPE= NMR FID
##DATA CLASS= NTUPLES
##ORIGIN= UXNMR, Bruker Analytische Messtechnik GmbH
##OWNER= root
$$ XWIN-NMR		Version 3.5
$$ Fri Feb 12 10:22:44 2021 Russian Standard Time (UT+4h)  she@DPX200
##.OBSERVE FREQUENCY= 200.1315066352
##.OBSERVE NUCLEUS= ^1H
##.DELAY= (6, 6)
##.ACQUISITION MODE= SIMULTANEOUS
##.ACQUISITION SCHEME= undefined
##.AVERAGES= 8
##.DIGITISER RES= 18
##SPECTROMETER/DATA SYSTEM= spect
##.PULSE SEQUENCE= zg30
##.SOLVENT NAME= CDCl3
##.SHIFT REFERENCE= (INTERNAL, CDCl3, 0, 15.7039)
##AUDIT TRAIL= $$ (NUMBER, WHEN, WHO, WHERE, WHAT)
$$ ##TITLE= Audit trail, XWIN-NMR		Version 3.5
$$ ##JCAMPDX= 5.01
$$ ##ORIGIN= Bruker BioSpin GmbH
$$ ##OWNER= she
$$ F:/spectra/data/she/nmr/H-F/1/audita.txt
$$ ##AUDIT TRAIL=  $$ (NUMBER, WHEN, WHO, WHERE, WHAT)
(   1,<2021-02-12 10:21:32.85 +0400>,<she>,<DPX200>,
      <created by zg, POWCHK disabled, PULCHK disabled
       configuration hash MD5:
       00 E9 B6 7A A2 85 ED C7 34 08 36 98 17 FE 4E 26
       data hash MD5: 16K
       8C AD D7 EC CD D5 C4 8E 53 F4 29 B8 A6 22 99 44>)
$$ ##END=
$$ 
$$ hash MD5
$$ 2A 43 29 FF 73 D4 3B 83 E3 67 F1 A7 76 49 27 35
##$RELAX= 
##$RELAX= 
##$RELAX= 
##$RELAX= 
##$RELAX= 
##$RELAX= 
$$ Bruker specific parameters
$$ --------------------------
##$DU= <F:/spectra>
##$EXPNO= 1
##$NAME= <H-F>
##$PROCNO= 1
##$TYPE= <nmr>
##$USER= <she>
##$AMP= (0..31)
100 100 100 100 100 100 100 100 100 100 100 100 100 100 100 100 100 100 
100 100 100 100 100 100 100 100 100 100 100 100 100 100 
##$AQSEQ= 0
##$AQ_mod= 1
##$AUNM= <au_zg>
##$AUTOPOS= <>
##$BF1= 200.13
##$BF2= 200.13
##$BF3= 200.13
##$BF4= 200.13
##$BF5= 200.13
##$BF6= 200.13
##$BF7= 200.13
##$BF8= 200.13
##$BYTORDA= 1
##$CFDGTYP= 0
##$CFRGTYP= 5
##$CHEMSTR= <none>
##$CNST= (0..31)
1 1 145 1 1 1 1 1 1 1 1 1 1 1 1 1 1 1 1 1 1 1 1 1 1 1 1 1 1 1 1 1 
##$CPDPRG= <>
##$CPDPRG1= <>
##$CPDPRG2= <>
##$CPDPRG3= <>
##$CPDPRG4= <mlev>
##$CPDPRG5= <mlev>
##$CPDPRG6= <mlev>
##$CPDPRG7= <mlev>
##$CPDPRG8= <mlev>
##$CPDPRGB= <>
##$CPDPRGT= <>
##$D= (0..31)
0 1.2 0 0 0 0 0 0 0 0.06 0 0.03 0 0 0 0 0.0002 0 0 0 0 0 0 0 0 0 0 0 0 
0 0 0 
##$DATE= 1613110892
##$DBL= (0..7)
120 120 120 120 120 120 120 120 
##$DBP= (0..7)
150 150 150 150 150 150 150 150 
##$DBP07= 0
##$DBPNAM0= <>
##$DBPNAM1= <>
##$DBPNAM2= <>
##$DBPNAM3= <>
##$DBPNAM4= <>
##$DBPNAM5= <>
##$DBPNAM6= <>
##$DBPNAM7= <>
##$DBPOAL= (0..7)
0.5 0.5 0.5 0.5 0.5 0.5 0.5 0.5 
##$DBPOFFS= (0..7)
0 0 0 0 0 0 0 0 
##$DE= 6
##$DECBNUC= <off>
##$DECIM= 32
##$DECNUC= <off>
##$DECSTAT= 4
##$DIGMOD= 1
##$DIGTYP= 9
##$DL= (0..7)
0 120 120 120 120 120 120 120 
##$DP= (0..7)
150 150 150 150 150 150 150 150 
##$DP07= 0
##$DPNAME0= <>
##$DPNAME1= <>
##$DPNAME2= <>
##$DPNAME3= <>
##$DPNAME4= <>
##$DPNAME5= <>
##$DPNAME6= <>
##$DPNAME7= <>
##$DPOAL= (0..7)
0.5 0.5 0.5 0.5 0.5 0.5 0.5 0.5 
##$DPOFFS= (0..7)
0 0 0 0 0 0 0 0 
##$DQDMODE= 0
##$DR= 18
##$DS= 0
$$ [...]
##$SUBNAM2= <"">
##$SUBNAM3= <"">
##$SUBNAM4= <"">
##$SUBNAM5= <"">
##$SUBNAM6= <"">
##$SUBNAM7= <"">
##$SUBNAM8= <"">
##$SUBNAM9= <"">
##$SW= 16.9725356469052
##$SWIBOX= (0..15)
0 0 2 0 0 0 0 0 0 0 0 0 0 0 0 0 
##$SW_h= 3396.73913043478
##$TD= 16384
##$TD0= 1
##$TE= 0
##$TE2= 300
##$TE3= 300
##$TEG= 300
##$TL= (0..7)
0 120 120 120 120 120 120 120 
##$TP= (0..7)
150 150 150 150 150 150 150 150 
##$TP07= 0
##$TPNAME0= <>
##$TPNAME1= <>
##$TPNAME2= <>
##$TPNAME3= <>
##$TPNAME4= <>
##$TPNAME5= <>
##$TPNAME6= <>
##$TPNAME7= <>
##$TPOAL= (0..7)
0.5 0.5 0.5 0.5 0.5 0.5 0.5 0.5 
##$TPOFFS= (0..7)
0 0 0 0 0 0 0 0 
##$TUNHIN= 0
##$TUNHOUT= 0
##$TUNXOUT= 0
##$USERA1= <user>
##$USERA2= <user>
##$USERA3= <user>
##$USERA4= <user>
##$USERA5= <user>
##$V9= 5
##$VALIST= <valist>
##$VCLIST= <CCCCCCCCCCCCCCC>
##$VD= 0
##$VDLIST= <DDDDDDDDDDDDDDD>
##$VPLIST= <PPPPPPPPPPPPPPP>
##$VTLIST= <TTTTTTTTTTTTTTT>
##$WBST= 1024
##$WBSW= 4
##$XGAIN= (0..3)
0 0 0 0 
##$XL= 0
##$YL= 0
##$YMAX_a= 172152
##$YMIN_a= -229121
##$ZGOPTNS= <>
##$ZL1= 120
##$ZL2= 120
##$ZL3= 120
##$ZL4= 120
##$ABSF1= 10
##$ABSF2= 0
##$ABSG= 5
##$ABSL= 3
##$ALPHA= 0
##$AQORDER= 0
##$ASSFAC= 0
##$ASSFACI= 0
##$ASSFACX= 0
##$ASSWID= 0
##$AUNMP= <proc_1d>
##$AZFE= 0.1
##$AZFW= 0.1
##$BCFW= 1
##$BC_mod= 2
##$BYTORDP= 1
##$COROFFS= 0
##$CY= 11.3945322036743
##$DATMOD= 1
##$DC= 2
##$DFILT= <>
##$DTYPP= 0
##$F1P= 15.9154993809931
##$F2P= -4.1035820241983
##$FCOR= 0.5
##$FTSIZE= 0
##$FT_mod= 4
##$GAMMA= 1
##$GB= 0.15
##$INTBC= 1
##$INTSCL= 1
##$ISEN= 128
##$LB= 0.24
##$LEV0= 0
##$LPBIN= 0
##$MAXI= 10000
##$MC2= 0
##$MEAN= 0
##$ME_mod= 0
##$MI= 1.114404
##$NCOEF= 0
##$NC_proc= 0
##$NLEV= 6
##$NOISF1= 3.799351
##$NOISF2= 2.8
##$NSP= 1
##$NTH_PI= 0
##$NZP= 0
##$OFFSET= 15.70392
##$PC= 1
##$PHC0= -10758.94
##$PHC1= 14.80094
##$PH_mod= 1
##$PKNL= yes
##$PPARMOD= 0
##$PSCAL= 0
##$PSIGN= 0
##$REVERSE= no
##$SF= 200.130013532006
##$SI= 16384
##$SIGF1= 3
##$SIGF2= 2
##$SINO= 400
##$SIOLD= 16384
##$SREGLST= <1H.CDCl3>
##$SSB= 0
##$STSI= 0
##$STSR= 0
##$SW_p= 3612.71676300578
##$SYMM= 0
##$S_DEV= 0
##$TDeff= 0
##$TDoff= 0
##$TI= <>
##$TILT= no
##$TM1= 0
##$TM2= 0
##$TOPLEV= 0
##$USERP1= <user>
##$USERP2= <user>
##$USERP3= <user>
##$USERP4= <user>
##$USERP5= <user>
##$WDW= 1
##$XDIM= 8192
##$YMAX_p= 0
##$YMIN_p= 0
$$ End of Bruker specific parameters
$$ ---------------------------------
##NTUPLES= NMR FID
##VAR_NAME=  TIME,          FID/REAL,        FID/IMAG
##SYMBOL=    X,             R,               I
##VAR_TYPE=  INDEPENDENT,   DEPENDENT,       DEPENDENT
##VAR_FORM=  AFFN,          ASDF,            ASDF
##VAR_DIM=   8192,          8192,            8192
##UNITS=     SECONDS,       ARBITRARY UNITS, ARBITRARY UNITS
##FACTOR=    0.0002944,     1,               1
##FIRST=     0,             0,               0
##LAST=      2.4114304,     0,               0
##MIN=       0,             -229121,         0
##MAX=       2.4114304,     172152,          0
$$ Real data points
##PAGE= N=1
##DATA TABLE= (X++(R..R)), XYDATA
0@%%%%%%%%%%%Qj6J6j6K2l0L2m0M8n6P0q3R7j14J32j52J76k03K33k65L02l42L85
34B04m36M89n46O13o85P63q48R41j044J156j276J408j554J713j888K080k290K523
52A323k781L069l393L758m174M655n215N877o677P662q907J0537j2766J5997k1086
67a2121L0229n1235J73624L1655l77357L75783j41762j94464K92118j55058o0135
78h8723K03363j67862N413J55387j09742o8865J26061l4665o9262J26666l9859
89C7912q6160R3816r3287O922R5278j19731P0934N0123r7301J09202m5384o4920
101d2596R7157r8563O708R0755j00805L2912M8664p0767M6654J8266o9086L3095
113g606M3079n1966R452O3375p9216l4385Q7709o0246j9370R0700p1684J5194
$$ y = [0, 0, 0, 0, 0, 0, 0, 0, 0, 0, 0, 0, 8, -8, 8, -8, 14, -16, 16, -24, 24, -32, 38, -45, 52, -62, 70, -82, 94, -109, 124, -141, 161, -181, 204, -232, 257, -289, 324, -361, 402, -446, 495, -549, 607, -669, 739, -815, 898, -990, 1090, -1200, 1323, -1458, 1611, -1782, 1976, -2198, 2457, -2758, 3119, -3558, 4104, -4803, 5734, -7032, 8965, -12121, 18108, -33127, 140497, 172152, -205205, 170578, 28816, -165648, 126470, -28588, -88723, 114640, -53222, -47809, 107578, -2164, -71029, 55032, 20367, -48895, 77771, 37912, -48248, 45568, -47719, -40797, 54481, -65250, 5684, 55807, -41494, 67708, 22324, -42596, 54561, -44002, -37294, 53461, -47344, -14432, 34232, -36535, 10119, 28385, -40701, -7606, 35473, -16493, -7041, 56334, -22882, -57267, 30442, -29804, -49174, 41526, -30158, -14964]
125a4964R3116j04078K1089O3820j40080M6395R2587j00893M2910M7616q8943
136d1425L5449K5958m8366L6253R275l4986L6955K1205n6203N931J7198n5602
148d8358M0156L8188m1878M4964j8647l2006N3342n8948J3936L9601p7827P0643
160B3166L870o5347Q4712o1363k1995Q6252p9735K9922M8394p8169M3168Q468
172B1343m5971K2297l029q307K607K7596n683k4116M7500m5096j6366O2195p7455
185d2485K8088M7615p6469P0635p258o3481P1824m8523p276N9882n1717K8960
197I795O837l9691L4690k6333p072K2315j3613K3994j431N843o48l2884K4801
210F603k2971n177M6939m5122K6147K5861o3007N0137n894n0897O6293k3230k2979
$$ y = [-14964, 78152, -25926, -4837, 58983, -81097, -34702, 57885, -43008, -98, 47518, -41425, -5976, 19982, -28384, 7869, 17144, -17842, 19113, 40318, -15885, -9954, 7244, -48358, -8202, 29986, -11892, 33072, 14425, -17581, 35761, -23187, -9251, 30350, -47477, 23166, 27036, -38311, 46401, -14962, -36957, 49295, -30440, -518, 47876, -30293, 12875, 21343, -24628, -2331, -5360, -13667, -11060, 16536, 10853, -13263, 34237, -10859, -27225, 34970, -42485, -14397, 33218, -43251, 27384, 20126, -43355, 28469, -20054, -27330, 32552, -19165, 9795, 16632, -23059, 11631, -14702, -21774, 541, -13072, 10922, 9491, 15334, 14686, -18198, 6603, -16368, -21545, 25394, -19728, 6419, 32280, -30727, 19410, 13516, -37381, 28912, 5682, -17297]
223a7297N5955l9818j4608L1761l1004j113K9606r850l847K6297j1659k2151K8844
236B1116k3627k6662M9618k9493j4078O0486m6778j739M9524o2649K1249L4506
248C1473o4041M5993J3407o0706N1684j2910m4925N0773j7094j4046M3338j6681
260F265o693J8310j9398j5830J2688k970j8627L2453J986l0676M4236k1424k9966
273b9646N6479m2699J094N3299o4173K8932J9376o8472N2462q317l4920O2001
285B5416k4522m243L4029l4946L898M403j5200K707M806J1086j8590J8131J0193
298A7168m2012M3189r488l5053O3949m0449j0306N4545o7074J9190K7622n7688
310c6407M4315K736k4836L8960j7974k262P947j8062O590r178P033J297p705K1706
$$ y = [-17297, 38658, -1160, -15768, 15993, -15011, -16124, 13482, 3632, -215, 26082, 14423, -7728, 21116, -2511, -29173, 20445, -9048, -23126, 37360, -9418, -11157, 38367, -24282, -3033, 31473, -32568, 13425, 26832, -33874, 17810, 4900, -40025, 10748, -6346, -20392, 22946, 6265, -428, 17882, -1516, -17346, -4658, -7628, -26255, 6198, 8184, -22492, 21744, 320, -29646, 26833, -15866, -14772, 38527, -25646, 3286, 22662, -45810, 6652, -1665, -36585, 25416, 894, -3349, 30680, -4266, -368, 4035, -11165, -8458, -3652, 7434, -11156, 6975, 17168, -24844, 18345, 8857, -26196, 37753, -2696, -13002, 41543, -25531, -6341, 21281, -36407, 7908, 10644, -14192, 24768, 6794, 4532, 12479, -5583, 1007, -8171, -1138, 159, -7546, 14160]
324A4160k1753L672J7246l2289K7369l31k0690L9153l1713l957K6394m7914K4172
337f481J3521l2890M0961n778j8515K9055k2425q365J6778j6065J413J2352k365
350A196r464Q545N165k2224J8408Q598k4196K8566l166k4924L0026k1140j7812
363b2422L6921k8078o17M0124l1263N913K1999l3713J3116O340k2861K2757l929
376D287j2318J8620p488q468P072J291n950M473J2238j3798M128Q739k9851K1236
390D211q88k8810M4793j8426j6020M7865m1498J362K9750m7575K5953J0792l1259
403a9750L2317j0150j2715J6561j2026K188j535P679k18j0047K3917k5623n005
416a4407K8570l9877K3076J7393l8699M1953j2853k3823M1442l6721k36K5962
$$ y = [14160, -7593, -3921, 13325, -18964, 8405, 8074, -12616, 26537, -5176, -9133, 17261, -30653, -6481, 7040, -25850, 15111, 9333, -9182, 19873, -2552, -10917, 5861, -10204, -8791, 3561, 1196, -8268, 277, 5442, -16782, 1626, 10224, -13972, 14594, 11428, -13496, 16530, -4610, -22422, 14499, -13579, -14196, 25928, -5335, 578, 22577, -11136, 1980, 8320, -14541, 8216, 4287, -8031, 10589, 3101, -5367, 1705, 2996, -2954, 1519, 13757, -41, 4087, 12826, -17025, 4211, 3323, -25487, 19306, 880, -15140, 32725, -8773, -7411, 22339, -25236, 717, 11509, -19750, 12567, 2417, -10298, 6263, -5763, -3575, -5110, 2569, 2351, -7696, 16221, -9402, -14407, 14163, -25714, -2638, 14755, -23944, 18009, 5156, -18667, 22775, -13946, -14182, 11780]
428A1780k9552K0720L799j4089J4600j3740N382J898m180J0483j3591J4572k261
441E821j7592K5516k3364k033K7213k9025K1974Q366l0997L0401j1642j8086K7478
454A4030k1500J303J7442j4777J0346M64j1580O492j807K334O46j657M969r880
468c175M865K786j1084O583k650k052J4819p454j101P401j6607N444M396q558
482f387Q840p699N77J3142j4044O626N298k1559J7500J553r122J5542j5521j358
496f612J1948j6173R998K284j0384J0431m52N063m210n558R393j8653J1937R340
510H352k1963K2911j0290j0396L1039l0403O256K1633l5922K8128M630k6118K3797
523A1654j8398k289J9605j9551J2393K468j0252J2280k428J760j1355p00J2172
$$ y = [11780, -17772, 2948, 6747, -7342, 7258, -6482, -1100, 798, -3382, 7101, -6490, 8082, 5821, -11771, 13745, -9619, -11652, 15561, -13464, 8510, 16876, -14121, 16280, 4638, -13448, 14030, -7470, -6167, 11275, -3502, 6844, 7308, -4272, 2220, 413, 2747, 3393, 1736, 6705, -3175, 1690, 4476, -6608, -25, -2675, -4727, 10092, 2638, 1537, 8938, -7669, -2225, 2171, -6387, 2453, -5246, -4669, 8473, -5571, 1055, 6353, -15206, 2294, 3847, -5275, 10267, -5254, -6612, 5336, -10837, -839, 1445, -8939, 1492, 1040, 6103, 1893, -3665, 5728, -12925, -988, 8352, -13611, 9300, -990, -11386, 19653, -10750, -4494, 17139, -18783, 9345, 13975, -12143, 11654, -6744, -9033, 10572, -8979, 3414, 5882, -4370, 7910, 5482, 7242, -4113, -4813, 7359]
536G359j9630K0876J003k5606K8959j8727l280L3660m0876J4437K0418l8515L1321
549A1399J225l0793K2256r504k984J6614r285Q79O62l20j129J3Q376k1329Q173
564e747J6348k5806J9937N315k9758K5358m297j3655K7937k0939m377K3452k1751
577g983K576J4809k0135K658J3912o800R70O214p476j930Q902q241m62J0749j6077
592h314N413J8463k2916O449J2611k5331J7131R537k2766K0571o854j6637K8201
605A5558j6479q715K3044k0831L727J9187j6501L243K089q731N224K325j412l413
619a685M208j752o013J6139j2089q177K1322k0524N490J9272k7432J2755L968
632E482k1049K4480r581q583J8304j5548O060N875j0404O921q878O032K534r821
$$ y = [7359, -12271, 8605, 9608, -15998, 12961, -5766, -9046, 24614, -16262, -1825, 18593, -19922, 11399, 12624, -18169, 4087, -5417, -8401, 8213, -1072, -193, 469, 149, -980, -967, 7409, -13920, -5747, 10601, -15205, 4732, 10047, -19711, 5647, 1350, -12305, 15632, -5307, -9684, 13768, -7983, -5407, 9402, -10733, -8075, 5837, -963, 7, 6221, -1255, -3185, 5717, -2524, -2986, 7763, -8314, -2901, 15562, -7354, -905, 11706, -13625, 3506, 13043, -9723, 10848, 3994, -12643, 15558, -921, -9636, 13408, -7423, -3696, 15491, -1010, 2233, 4322, -4409, 815, 3140, 1728, -1685, 2523, 771, -5242, 10897, -1192, -9369, 11953, -8571, -3081, 16191, -11241, 1514, 5482, -15567, 8913, -668, -9251, 9053, -6495, -435, 5440, -4964, 1957, -6921, -889, 1645, -8176]
646h176J5456j2583j007J4863j9014J3547J481j9296K4969j2076l861J8197k2947
659a0447Q774O350j4682J8468j0663k706J3723j4561R535n77r335J0769q316M903
673A235L753r698J0890p554l73Q809j2643J0511k811p336J5156j1846P60J0022
687H875j7484J1659K342j2514J5288q426l873J2736j3195M308N174j0497P595
700A988J60n489N980l913p36J561o62J358m71O32j131J52K864o587J984N585j0215
717f940Q809N27j1043J3753n978p757J5678j2087n96J5353j8431P366Q887j6179
731h638J1407J85r537J1136n522M95K316j271J649l756N015k158n799J2349j0508
746b637m42J3408j8444J1019L572j5922J8796p207q039J7136j5535M049P307j2896
$$ y = [-8176, 7280, -5303, -6310, 8553, -10461, 3086, 4567, -14729, 10240, -1836, -5697, 12500, -10447, -1673, 4677, -10005, 8463, -2200, -4906, 8817, -5744, 3791, 3214, -6121, 4648, -3668, 1235, 4988, -4710, 6180, -1374, -1747, 7062, -5581, 4930, 2119, -5217, 9939, -1907, -1147, 8875, -8609, 3050, 5392, -7122, 8166, -260, -4133, 8603, -4592, -284, 4890, -5607, 1988, 2148, -3341, 2639, -1274, -2010, -449, -1111, 247, -224, 408, -723, -571, 2293, -4294, -2310, 3275, -6940, 1869, 2396, -8647, 5106, -872, -8629, 7049, -5038, -5634, 9719, -8712, -1346, 7541, -8638, 2769, 2954, -6583, 4553, -969, -474, 1842, 571, 2220, -1536, 3479, 1321, -4478, 7871, -2637, -3079, 10329, -8115, 2904, 6476, -9446, 9350, 2143, -5896, 11240, -4295, -246, 7061, -5835]
760e835Q748j613l245O786p086O007l170k866Q610j2199R655j453j0648J7318
774I009j3521j366J7163k1383J1105N640j7418J9052q326p928J7578j5551J192
787d754Q655j0338N491N3o15l60K29M304o786M773J589j0333J2797o389o823J6474
803G967j4514K265J1503j6284J0981K837j2706J4180o100o548J3273r674m86P609
817D303p532K626M047l927K669j1k478R84J687j852j343L869l877j519P371n118
833a01r77O986q175L298M796j0026Q342o07j0176J2701o198n100J2586j0447J785
848a313O511r258P556j180n595O512n518J182J324k025M916q373N915K088j0917
863h175J4304o521o106J4547j5827N979Q737j7575J4376k302j0928J6161q632
$$ y = [-5835, 2913, 1300, -1945, 4841, -2245, 3762, 592, -2274, 6336, -5863, 3792, 2339, -8309, 9009, -4512, -5878, 11285, -10098, 1007, 6647, -10771, 8281, -45, -7973, 9605, -5946, -4754, 3901, -6437, -946, -893, -1508, -1868, -1639, 2665, -4121, 652, 2241, -8092, 4705, -1684, -8507, 7967, -6547, -4282, 7221, -9063, 1918, 4755, -7951, 6229, 129, -6419, 6854, -2820, -3306, 4303, -3229, -603, 3444, -483, 2186, 2175, -303, 681, 2368, 516, -827, 3042, -835, -2354, 5017, -101, -1078, 5908, -2267, 1031, 5827, -4199, 4143, 3536, -6640, 6061, -137, -5237, 7349, -3098, -1313, 5198, -4060, 3496, 2316, -3279, 3233, -2285, -1103, 221, -1804, 3112, -5261, 654, 2742, -8175, 6129, -392, -6498, 8049, -7778, -1799, 6938, -10637, 3739, 1437, -9491, 6670, -1962]
876a962m57O842r031N272j432n51L379n049N578n242K165N819j2595J2184j813
891C107j2689J9413j2394k462J6736k0144R291P256j8702J7543k359j1917J5445
904H124q422l174Q802o482Q28J881j279j022J927L082o828M971Q40r803J1358
919D803k934p921J2690r667j978J1693j1201M027N172j0541Q310j95n849O123
933B532m551j779L558k120K458j222l93K190l127L469J48m592M876l819j166O858
949C320p169J796L997p385O921P12n504P473m717q95N037o733K462M30l148N363
965A960k571J319J784l122M194k970J094J252o898P735k870m487R454r827K993
980i60O706r973J1465l332q519J2857r859M84O680j2203Q141j874l988J2786j0771
$$ y = [-1962, -2419, 4423, -4608, 664, -768, -1319, 2060, -2989, 2589, -2653, -488, 5331, -7264, 4920, 3107, -9582, 9831, -2563, -5025, 11711, -8433, 858, 8114, -10588, 6955, 4596, -7321, 8124, -298, -3472, 5330, -1152, -324, 1557, 278, -744, 1183, 4265, -2563, 2408, 3248, -6555, 4803, 1869, -6052, 6638, -3029, -5007, 6686, -4515, -488, 4684, -5857, 2453, 2258, -3591, 2532, -2019, -3798, -240, -2360, 98, -1124, -1517, 673, -2454, 1015, 1163, -3429, 1447, -2372, -3538, 3320, -3849, -2053, 1944, -5441, 1480, 2192, -3312, 4161, -556, -1451, 3586, -3147, -685, -255, -3403, 1960, -611, 708, 2492, -630, 3564, 594, 1688, 2940, -3958, 3777, 907, -3580, 5874, -3953, -960, 5746, -4227, 7238, 3906, -4613, 8244, -1615, -1131, 5549, -6654, 1487, -387, -4375, 8411, -2360]
995b360J977O181j0313Q825j409n958N934o792J941L198l376J926l160M692o81
1010F25k560R386j0891P67Q076j4130R762J064j3222J5308n620m208J3785j2308
1024d166K198P353j0112O316N76o349L845k256J596L84j339K474j972M117n89
1039B076k390N969q820K28Q093j0186M455L728r117R295n81n732R504o807l337
1054c622R920n589k240M265m126j478L944k09j563K007L63k864N845q12p415O621
1070C047l729n305J2132p850m093J1435r071K511P850j2138O416K279j0032J0218
1084C670k632o748P697m261j403N075j132j183L67K658l354Q53L253r053O074
1099a19K183r604J3314m832q595J4886r838o50J0922j3089N864L087q602R041
$$ y = [-2360, -383, 5798, -4515, 4310, 2901, -3057, 2877, -3915, -1974, 1224, -2152, -226, -3386, 1306, 625, -1935, 7451, -3440, -2673, 5403, -8727, 1035, 2099, -11123, 4185, -1435, -5643, 8142, -4166, -1968, 5385, -4727, 1589, 2165, -4184, -339, -2595, -999, -615, -1954, 520, -1452, 2665, 2076, -314, 5655, -3165, -2937, 5156, -5030, -575, 3153, -5964, 3331, 2750, -2982, 6522, -285, -3622, 6298, 709, -1531, 2734, -1392, -2870, 1074, 865, -698, 1309, 1672, -1192, 4653, 3841, -3574, 3047, -682, -5987, 6145, -1705, -5798, 5637, -3434, -923, 6927, -5211, 1205, 3484, -6548, 3670, 1038, -5710, 1987, -2274, -3677, 1398, 266, -917, -550, 2108, -1246, -393, 2860, -6193, -119, 2064, -7540, 5774, 942, -7653, 7233, -2605, -3255, 7667, -5422, 442, 3529, -5073, 3968]
1113C968m080k878N142l882M001j385K65K278o507O691k436n129Q916q027K528
1128e35O913j0466Q585j502p599J0738o959p41O276p828M191N26l620N288m990
1143a723J758J757l099N250n206J040K291p202P317k279m741P605m249K6O560
1158E105q388L575K79m761N248k375j275K563j963j64J439k56Q33r67L77L134
1174B404l642K310j698k506L223k425M42L186k951K553J630k873J864j676o61
1189h20R84j874K434q43k571M730l682J688L232n486O412j555m770P581o981m60
1205a981N059p222M588J271l873N907l005P61K444n338L931k644j239L680n664
1220c325M141n34l853P031n304K063M639q137P025k000o146Q127p763K50O088
$$ y = [3968, -112, -2990, 2152, -1730, 2271, 886, 1151, 3429, -3078, 3613, 1177, -3952, 4964, -3063, -535, 6378, -4088, 4497, 2995, -4604, 6134, -825, -1566, 4710, -3118, 1073, 1599, -2021, 3267, -1723, 35, 1792, -1307, 3943, -1263, -223, 2068, -5134, 2183, -96, -4837, 2768, -1481, -1455, 5105, -3283, 292, 571, -4190, 1058, -1317, -2592, -29, -1992, -2156, -717, -973, -140, -1107, -730, 2404, -1238, 1072, -626, -3132, 91, -2334, -1892, 1294, -1657, 896, 2526, -347, 1517, -159, -820, 164, -1710, 724, -119, -2690, 2040, -1642, 46, 3278, -2208, 4204, 2649, -2121, 5460, -1521, -1981, 3078, -4144, 444, 1715, -2158, 3749, 744, 1505, 3949, -1389, 2542, -102, -1341, 2339, -3325, 816, 282, -3571, 3460, -1844, 219, 4858, -3279, 3746, 1746, -4400, 3727, -4036, -3786, 2302]
1235B302p446O289K63l551N668m023N36Q43l069M105m999K057J999o494P875l939
1251a584k580R700o953P67O610r819O195r63n901N955l125j135M761l195K972
1266A705j04r90J682k894K176j305j513L171l657J404J772m721N366n22k464N740
1282D846l634j068L500n505J406J469m481L980J38k160L855j246j151J527j718
1297b42Q39m98m80O10j993J117n34j299L498k864J286L474n076L440L39n450M441
1314F08l003j385N308m575K846J941m695N040k752n79K855m204K931k24k408L904
1330A608m162K012J298l101M723k188m9L756o785M208K50o139P145l460q99O093
1346D310o554M702K77n798O682l828j134M431m571L639j399k632M576l936J587
$$ y = [2302, -5144, 1145, 1408, -2143, 3525, -498, 38, 881, -2188, 1917, -3082, -1025, 974, -5520, 2355, -1584, -4164, 5536, -1417, -650, 5960, -3859, 2336, 1373, -4528, 1427, -1698, -2833, 1928, -1267, 1705, 1601, 611, 2293, -601, 1575, 270, -1243, 1928, -1729, -325, 1447, -3274, 2092, 1570, -894, 4846, 1212, 144, 3644, -1861, -455, 1014, -3467, 513, 651, -1509, 2346, 1100, -51, 1476, -242, 597, 99, -381, 229, -1764, -647, -1181, -2480, 1018, -1846, -560, 2914, -2162, 1278, 1617, -3833, 608, -2395, -3780, 1528, -3047, -201, 1740, -2955, 2085, -667, -1246, 1609, -2595, 336, 112, -2296, 1608, -2554, -542, 756, -2345, 2378, 190, 141, 3897, -2888, 1320, 1570, -4569, 2576, -884, -1783, 4310, -2244, 2458, 2735, -3063, 3619, -209, -1343, 3088, -1483, 2156, 757, -1875, 2701, -1235, 352]
1361C52J925k433L817m399J018L076o922M449o23l601O683m009K98M606p356L523
1377D04Q30m690N134k309j048K814l339J915N32j472J662j751K484j31k301K968
1393A702l672n84K684l383L558J535m247M946j851k036L034k828j9J606k763K370
1409E2M01j936J981r55K77J56J84K241k164n44K125l598K027k66k750M372k233
1426f30M76M661m772P84J946m697L718j065k389M535l635N03K052l088K540l84
1442E55J8K277l067K263k043j947L413m601J707K464m936O803k215k290N152o184
1458b631J701K395m843L900j223l060N486m372K840L20k599M621l995K382J860
1473B782n587L901k427l705P337m222J089L252m351M441p35k904K542k912J251
$$ y = [352, 2277, -156, 3661, -738, 280, 3356, -3566, 883, 260, -3341, 3342, -667, -369, 4237, -3119, 404, 1234, -3456, 1678, -631, -1679, 1135, -2204, -289, 243, -1229, 433, -1318, 1166, 1035, -1266, 1702, -1970, -2554, 130, -3253, 305, 1840, -2407, 2539, 688, -1348, 1686, -1142, -1161, 445, -2318, 52, 453, -1483, 498, -457, -180, -24, 160, 2401, 237, -307, 1818, -1780, 247, -19, -2769, 1603, -630, -154, 4507, -265, 519, 2465, -2232, 1486, 421, -1968, 2567, -1068, -565, 1487, -1601, 939, 555, 573, 2850, -217, 2046, 3, -1944, 1469, -3132, -1425, 1039, -3897, 2906, 691, -1599, 3553, -2631, -930, 1465, -3378, 522, -701, -3761, 1725, -2647, 193, 513, -2086, 2535, -1460, 922, 2782, -2805, 1096, -1331, -5036, 2301, -1921, -832, 2420, -1931, 2510, 1775, -1129, 1413, -1499, -248]
1488b48J350j971K030k283RK295k721L475r59j267M155m554J653J988n740L076
1504B88l03k017M575k140k66K931l306J741m32k247J859j331J625L91k111R47
1520B04j594L44K716k496J261J965l449K636j805k007K014j647m07L832j767K22
1536B2J376k585P94L08l20l63j100J362q06O04L45l144L754K88k645M718k074
1553E34k048N055o009J705J458n427N342j7k797M609j361j266J481l080K301q84
1569d04N91J459l727M124k371o44L208m790L168K578m718N047k173l628M378l712
1585a614J071J818k908L780j257Q7J09k386K208j819l00L200l972L160O83n490
1601c630O022k255k925N903m451J641L307n987K194N40l806K536P22n85J547r50
$$ y = [-248, 1102, -869, 1161, -1122, -1113, 1182, -1539, 1936, 977, -290, 3865, -689, 964, 2952, -2788, 288, -15, -2032, 2543, 403, 137, 3068, -238, 1503, 1071, -1176, 683, -648, 977, 1368, -743, 204, -1390, -1046, 1670, -826, 435, 2400, -1049, 1587, -218, -2225, -211, -1858, -2265, 1567, -200, 22, 1398, -1187, -393, -85, -405, -768, -1868, -506, -1312, -708, -363, -3507, 247, 535, -2110, 2608, 534, -1514, 3541, -2468, -763, 695, -4732, 610, 593, -2204, 2405, 1044, -222, 1259, -1821, 480, -404, 187, 1646, -2081, 2043, -328, -972, 2236, -2554, 614, 3192, -1526, 3521, 1348, -2280, 2098, -1614, -543, 1275, -1633, 2147, 890, 977, 1086, -1300, 908, -911, -1211, 1989, -1983, 1177, 1860, -3630, 2392, 137, -2788, 3115, -1336, 305, 3612, -2375, -181, 359, -3447, -911, -189, -774, 773, -177]
1617a77J101j174P50j361j145K886k214P84K847m922K441J319m010L981l5k789
1633a718M529k509p57K081l142K63J550j210J759p1m34J261k47j406m56M94J069
1650A056j470J300M24k020J838j538r28M100l665M71K883k718J602m58l034J668
1666d89m1l09K099q20Q58l72p82K35k077K156q23j309L240l544J262K061m461
1683c116K824O46l050M942k902o49L338m543J684L40k853L777r34N3K055k739
1699a127J572p03j013K783k754J579L73k433L121k134n29K670l546K620Q53k167
1715h35K911k252p2J122k728K259o86k94K973k856J676Q68l602L142j604j363
1731a341L742l208J207J465l558K459p87q83K718j746P01O27j459M90j309M43
$$ y = [-177, 924, -250, 500, -861, -2006, 880, -1334, -550, 2297, -2625, -184, 1135, -2875, 1106, 1071, -1718, 2811, 302, -455, 1626, -1516, -1253, 297, -913, 846, 775, 341, 1602, 1355, -51, -507, -13, 1056, -414, 886, 1310, -710, 1128, -410, -1338, 2762, -903, -432, 2451, -267, 1335, 877, -2157, -489, -530, -839, 1260, 440, 1298, 926, 144, 379, -1698, 458, -365, -1674, 1566, -1978, -716, 1345, -3116, -292, 354, -2696, 2246, -656, -1305, 2033, -2510, -826, -486, -3339, 438, -496, -443, 1612, -1127, 445, -258, -1271, 1512, -1242, 337, 710, -1723, 1398, -736, -1265, 1405, -2141, 479, 1332, -835, 2076, -176, -248, 874, -1854, 405, -281, -575, 2398, -458, 1218, 2086, -1516, 1626, 22, -1341, 2401, -807, 400, 1865, -1693, 766, -21, -904, 1814, 68, 769, 1396, -63, 427, -882, -439]
1747d39K79q42J324L70q02J404j610n20J445k280J823M46j587K062r07j761K234
1764F39k145J180K04K22P66r64l8L48j342J087o39o08K671j756M27J440k580J619
1782E31Pk536L649k231M4K172k474O84R27k281K322p78O39P92j840K223k222q34
1800a206K519k429J959k55j896L945k379p1J579l363K143O77k231K259j088n61
1816c98J379k961K074J69p48J491j311J288k01k426J776j268J96J933k959K385
1832D19M53k291K319j393j036K528k425J697L20j114J284j770M56R86j873K048
1848F08p43q2J797k983J455M68k238K028p85n67K581q31r20P81j148J688q02j024
1866g17J655l02j67N58j192N93p00LJ145j042J302K30r95R18j371l8J108j514
$$ y = [-439, -160, -1002, 322, 692, -110, 1294, -316, -836, 609, -1671, 152, 598, -989, 1073, 166, -1595, 639, -1506, -326, -122, 100, 866, -98, -136, 212, -1130, -43, -682, -1290, 1381, -375, 52, 1492, -1088, 531, 538, -1998, 1651, -580, -536, 1636, -838, -154, 773, -1508, 814, 36, 675, 1467, -373, 1850, -372, -1206, 1313, -1116, 843, 588, -1308, 2637, 258, 187, 1766, -1597, 546, 1223, -1008, 1251, 163, -398, 981, -1980, 94, 263, -485, 1006, -305, 983, 782, -1644, 132, -1136, -940, 993, -1966, 419, 872, -1419, 900, -493, -1529, 999, -1426, 271, 591, -523, 761, -1009, -553, 433, -1440, 608, -135, -217, 1580, -1403, 52, 520, -1718, 310, -475, -1042, 1539, 708, -212, 569, -579, 1109, 307, -717, 938, 636, 469, 1027, -165, 428, -272, -269, 876, -166, 1136, 1366, 371, 1289, -82, -120, 988, -526]
1884e26J497L30j230O46l8j045J139j407J392n05p38K132j940l14J771k152J078
1901I0j8q99K409j903l6J338j884O0J643k082J653j126N06J335k468J346m72l73
1919h81J365j132Q38L02j798L076k517m75K326l475K653M74k240K905j912l68
1935h59J616k124J255P10j093J355n16J65p9j184J530j136k7J446k201J751P15
1952A324k627K718q16q35K412k883J356L89j198J245p99r28J440m79M06p9m65
1969A81J94j119R37m61m96J883j464j46J968k684R78J115k776J939O20j804J798
1986F63r38o30J278p29j45O44l14J65J68J7j44o56O18q32O92P43j271J143M01
2005H73j969J980r01p37J855j736P10J237k032J126%j391J934j106N35M48q51
$$ y = [-526, 971, 1301, 71, 717, 679, -366, 773, -634, 758, 253, -485, 1647, -293, -607, 1164, -988, 90, 72, -827, 1582, -321, -357, 981, -903, -843, 800, -1282, 371, -755, -249, 1086, -1382, -36, -508, -881, 484, -648, 190, 492, -1306, 1770, -747, -1222, 1104, -2371, 282, 756, -1484, 1421, -491, -859, 757, -1367, -112, 598, -495, 860, 344, 509, 430, -754, 776, -360, -387, 1059, -1142, 609, 1324, -1303, 1415, 599, -236, 2176, -707, 649, 1038, -160, 1085, 286, -642, 798, 319, 725, 646, 181, 375, -744, 193, -268, -764, 1119, -345, -491, 1477, -1207, -229, 886, -1890, 49, 669, -1135, 663, -275, -905, 373, -356, -501, 143, -171, -6, 162, 179, 35, -621, -3, -835, -143, 600, -671, 472, 873, -1096, 884, -17, -754, 1101, -635, 75, 1312, -720, 406, 406, -985, 949, -157, 378, 826, -25]
2022b5J116j267N58L66j340J600o34n81J887k265N30J548k564J682K01j864K391
2039A339j212n99J077j198O76l05j18J072j343J129m38q66J908k076O44J245k621
2056a686K195o7k170K603j744m2J517k028J629j11j016J260r71L40M26j083J384
2073D36r14M06O21j520J302l92r80J986j566K20J511j909R36K63j370J129K66
2090D25p62Q49l41K36j4p18Q18n44M08Rm68J176o99l48N74j265O95P97j558J931
2110A201l99j122J286j090p0O54o03K09K30o67L87j15K92n8o83J181j166J47J061
2129F75j634R10N92j946J811n45p79K376k370P96P40j534J805j469n74J525q00
2146d21k69O60q79J589m55p53J084j448J697j566Q9J811k630J334J708k074J110
$$ y = [-25, 1091, -176, 382, 748, -592, 1008, 374, -207, 1680, -585, -55, 1493, -1071, 611, 812, -1052, 1339, 127, -472, 605, -593, 83, -222, -340, 732, -611, 518, 80, -786, 1122, -954, -310, 935, -1686, 509, 442, -1728, 875, -869, -911, 606, -1422, 207, 96, -920, 340, -631, -291, 135, -948, 436, -478, -72, 549, -971, 331, -61, -1041, 945, -621, -401, 1110, -799, 137, 400, -970, 159, 425, -337, 512, 171, 407, 393, -325, 493, -51, 357, 366, -102, 1074, 375, 27, 601, -664, 31, 828, -730, 1201, 802, -320, 966, -124, -194, 460, -143, 66, 296, -371, 16, -99, 193, 135, -548, 633, -533, -386, 675, -959, -49, 543, -1403, 408, -137, -916, 1460, -910, -114, 626, -908, 897, -572, -1146, 379, -421, -690, -30, -909, 680, 225, -528, 556, -892, 805, -761, -672, 1139, -1491, -157, 1551, -523, 587]
2163E87j18j309K488j839Q34M78j661R39n73Q6K74q6J0K61m15J557j881M70K53
2182C55k077K428k78j216J204q93M62K59j110J195j99k03J62m71M54n98N56j08
2200g8n69j121K031j559J920q00j519K403j050q04J367j509O71O42j049N48J44
2217c32j136J574q60P00M78j252J169n76l46O93n30l0J114j353J246o38l6K97
2235A82n98J121m81n87Q74m94k38J055j288R19m7m45M39n49O72j13j007J167p49
2254a67P8Q81j292J014J5n91J000j110K64R36j540P67J07j024J129o23p25J615
2272G34j600R56L29r53J153j281L46M88j327J813j335J65P1m82N90M02p86J120
2290D03j08r22J394j438L90R7m63O69l89LQ95j272R59po72J202j539R94P24j452
$$ y = [587, 469, -840, 1648, -191, 643, 1121, -540, 399, -174, -88, 186, 100, 110, 371, -44, 1513, -368, 102, 355, -1722, 706, 428, -788, 416, -477, -15, 244, -866, 329, 130, -73, 89, -382, 72, -526, 30, -78, -647, -1768, 263, -1296, 624, -176, -1695, 708, -342, -1146, 221, -1288, -617, 25, -1024, -476, -332, -1468, 106, -754, -54, 424, -828, 341, -235, -581, 112, -418, -448, 666, -687, 559, -79, -115, 182, -416, 705, 224, -363, 511, 17, -221, 834, -454, 465, 418, -27, 412, -137, 535, 422, -585, 582, -167, -89, 792, -500, 514, 529, -62, 938, -172, 92, 1028, -512, 255, 362, -662, 467, -156, -881, 734, -866, 90, 419, -534, 619, -662, -316, 172, -1155, 658, -677, -512, -441, -923, -333, 69, -717, 403, 295, -627, 767, -671, -281, -184, -647, 22, -367, -364, 531, -741, 218, 211, -461, 741, -798, 196, 920, -532]
2310e32J088q55m98J354p73K46L5m34R33q31J06P15j708J302R10j343J093j041
2328b33J3J358j765J002O4q08l4K07l3Q16r11P41o4o44J49l27N63j14m13M50n23
2349e06M14L85j104M96j30r71J305O7k79P70k47j96O04j402R46n96k59J253q67
2368c17M10K7q36K58O9m58J215o51J141k69j507J082r27J116N17j408n27K091
2386A026j869J348j050R5R75q80L20L63n79J224j049l47O59n86J221q73n67J302
2404G33j402N33N21q21J114j82o55L24k05m76O94j159P28l19J06J121r51Q73j10
2423D67j018L21L17J68k38o83P07q0j008J575j318P5N19j98M51M18p17M36j026
2442h32j71N34n58K19L10M39Ql19R82n95m69J17lP2j05O05j14k23m74J313n37
$$ y = [-532, 556, -299, -797, 557, -216, 30, 65, -369, 564, -267, -161, 554, -1154, 148, 1058, -285, 808, -233, -220, 1138, -627, 375, 439, -369, -403, -196, -229, 587, -324, 417, 353, -291, -142, -469, 94, -20, -433, 17, -506, -92, 293, -811, -315, -445, -1416, -111, -44, -323, 447, 200, 4, 608, -794, 152, -444, -703, 550, -317, 93, 120, -716, -458, -389, -847, 368, -283, 858, 589, -918, 164, -763, 353, 870, -538, -1065, 1026, -843, 505, -545, -450, 525, -355, -35, 328, -251, 973, -76, -423, 236, -350, 871, -2, -569, 733, -669, -136, 385, -436, 678, 496, -159, 165, -40, -516, 178, -981, -253, -572, -466, 655, -296, 577, 467, -551, -230, 87, 255, 17, -666, 41, -39, -1047, 528, -790, -715, -196, -394, 57, 475, -242, 194, -832, -1003, -469, -1027, -808, -498, -59, -51, -370, 612, 17, -452, -335, -338, -266, -371, 234, 120, -103, -577, 736, 199]
2463A99j02j51k94L89R33j354n84Q75n45P83O3J107j486L71j3N9l34M78j397J157
2483A54p37j74J044m62J49O05j258J009O06j397P70j64n40P22q10J64M51K50k98
2502H4k67L45K1p70J249j444J139l17o89J025m72j041J032k93K77P52n33p46O90
2521D2o15O24l42n2J73k44Q51m15K65k57o71R40j29r58J214q56P13L95l41l1M21
2542G27q02P3n6M40L25l49J63n29l3K38k59M03K05n51M87k78n75P15j059O11L87
2563B83q09R81j43o15K96o8m35Q55o30L87j52j81K61o00J01K35k41P26n07K39
2583a7M08p23M77j28o63N84j91J8O01p41M41K65q45P11n74M23K54n30K79M7o50
2604e54P15o57K38O78o38P47j39k92N79o66m3K38n45M70L46m51N29n78J12N0j64
$$ y = [199, 97, -54, -348, 41, 974, -380, -964, -89, -634, 149, 212, 1319, -167, 204, 191, 250, -84, 394, -1003, 154, -583, -757, 287, -175, -26, 579, -679, 330, 936, -461, 309, 145, -395, 327, -483, -319, 132, 382, 84, -183, 162, 183, -587, 662, -782, 357, 40, -649, 376, -96, -1137, -105, -398, -121, 631, 98, -648, 42, -573, 51, -291, -343, -170, -414, 437, 22, 287, 30, -641, 299, 170, -788, 426, -430, 283, 678, 337, 306, 727, -75, -2, -58, 382, 707, 358, 521, -8, -41, 197, -62, 341, 546, -5, 482, 204, -371, 344, -715, -104, 283, -526, 455, 312, -303, -7, -75, -510, 345, -285, 102, -50, -231, 30, -570, -469, -234, -475, 251, -256, -17, 391, -332, 145, 17, -646, -62, -253, -235, 366, -375, 66, 331, -514, 197, -377, 46, 300, -230, 49, 96, -554, 161, -496, -258, 420, -218, 529, 390, 98, 677, 11, -32, 206, -339, 131, 477, 26, 555, -23, 89, 139, -25]
2625b5M22j56jL46r44N62l27l35Q51n09J74P48r08L72l2r34R91n36o3L44m79N02
2647F3k10o8L90n21M54j26k13Q97j002j05N61r85M92L44o47J056M4o68O78r52
2667e18R0M28k21Q7J75k61L36j36j2j05L15R2p86Q88Q1n84M44p00QP10o40M79
2689A70O86j016O98j35n79N51l79k29L91j59J92n3k16M08l96K13r0o4L82o03K4
2710b04L67r17Q56m18k11R89n66mQ67j127L79J88o09L86l22K85K32n22M02l20
2730b69k45N93l47K07K50m36N04n08l64P11n58K47J87m91O43J14k40N76p03J83
2750E4K14o42R03m36RM28q48M86J58p87P85j91M8L97p66N36m14j63L42n5J38J94
2772C90m39L80k28J29K36q56P13l0n08N08j81j62L11o99M04K06m37K67J3j44P3
$$ y = [-25, 397, 241, 240, 586, -358, 204, -123, -458, 393, -116, 58, 806, -102, 270, 238, -696, 295, -241, -304, 40, -439, 63, -147, -215, 175, -346, 108, -18, -231, 666, -336, -441, 120, -865, -373, -29, -676, 380, 424, -244, 434, -518, -428, 0, -221, -134, 41, -220, 116, -20, -32, -137, 178, 270, -516, 372, 453, -131, 313, -387, -379, 331, -309, 170, 856, -160, 538, 403, -176, 375, -4, -233, 158, -1, 191, 138, -78, 330, -66, 147, 57, -7, 375, -228, -204, 163, -754, 102, -316, -527, 462, -104, -108, 759, -368, 11, 199, -410, -24, -346, -61, 171, -351, 51, -269, -514, 79, -268, -61, 189, -247, 257, -251, -615, 96, -462, -215, -28, -519, 124, 238, -2, 574, -129, 54, 268, -374, 529, 93, 102, 530, -318, 168, 326, -461, 324, 133, 181, 578, -188, 348, -66, -229, 113, 58, 196, 390, -49, 331, 103, 232, 468, -388, 325, 295, -213, 295, 114, -48, 263, -436, -32, 174, -263, 4, 17, -127, -54]
2793e4j87j25j1J91M86k92n8J39n15M27m18lN78p18O25O8m51N11m96l26R00o80
2815d09K26M03m39J47r4l05M15k95K41K29Rn6n0j88K22l28N05L9m78N80l01J28
2837B01L03j102O47L43o29Q98k61n65K77l52K93P8m18N42J26j2k8k85O0j11k30
2858b25J253j154K64n02J41R45j055o56J187n93k19J137j661Q38J6p32N08L13
2876a95l2p9J223K99m56m63m21Q5L32o76M01M97j185P80n32J43N34p46K35M96
2896B40r6j49M30q36M15J42K31o19k0M18M22l74n5rl82q9l57P47K76L78l05l44
2918F4j26M55m43O95n72j0jj97N20j79n24M62k63l02Q46p05j1Q54p05J40k39l57
2940e98P60j3k78J19j21N46p66J14L08l32K81p2l6K39q05O95k10m56R28n80k14
$$ y = [-54, -241, -366, -377, -186, 300, 8, -50, 89, -426, 1, -417, -420, 158, -560, 65, 133, -318, 193, -303, -629, 271, -409, -183, 220, -219, -72, -166, -471, -56, -351, -110, 119, 128, 72, 22, -166, 56, -272, 233, 272, -206, 374, 73, 201, 504, -598, 49, 392, -237, 661, 400, -165, 112, -240, 53, 131, -287, 255, 381, 369, 341, 56, 116, 5, -225, 1028, -126, 138, -364, -223, 722, -333, -989, 198, -395, -614, 523, -1138, -300, -284, -1016, -508, -195, -227, -306, 917, 1216, 760, 297, -124, -39, 293, -383, 18, 515, -670, 110, -422, -279, 255, -491, -256, 240, 144, -5, 425, -411, 4, 146, 377, -242, -262, 156, 578, 204, 149, 140, -242, -331, -688, 59, 335, 713, 408, 64, -62, 393, -50, 645, 73, 63, 62, -135, 385, 206, -318, 144, -119, -421, 425, -280, -291, 563, -142, -2, -241, -598, 162, 149, -129, -10, -131, 415, -351, -237, 71, -261, 20, -52, -88, 151, -654, 41, -169, -625, 303, -277, -491]
2961d91P42m88k42P52p14L72M84n80M61j49m59K13q3J58rJ54j50K55p2r8k20M04
2983B40k99L13K45n43P6O06q56L77J17o01O64k08L5P7l92L71Q9m85L27j10K75
3004C18j79N0k6m18M92ro39P78n10M6Q15p48P1L17q06M94k52j96O75m20qJ77j36
3027a14j63j50J36J30p0M1o4J05M08n62l5M43o01O95l46J8J35L36n83N16n16K99
3049E8K99m33L27j60l07N99n08R8NJ72L1k17J81K09l31L27l88j8N46m87J67J83
3071C53n00L37j84J33L07m71J20Q5l11M98o73L33K54n16L23J99m10K32k81M5J09
3092a8n00M41j11j04N04k74q0N2k95M57l23j98L64j74L18P8n34K89M9k39Q61j101
3114e38N60J87n77M91J97n54M82k26J02L28n52M65k47j38J48k79K57K69j55L35
$$ y = [-491, 251, -237, -479, 273, -441, -69, 415, -165, 296, 147, -312, -99, -182, -24, -33, 121, -29, 226, 154, 56, -164, 240, -59, 254, 499, -44, 32, 638, -218, 159, 276, -325, 339, 131, 166, 243, -149, 222, 311, -174, 153, 43, 318, 139, 189, 163, -255, 237, 228, -411, 367, -143, -97, 718, -30, 41, 358, -448, 46, -206, -402, 273, -147, -155, 22, -114, -277, -427, -291, -161, -231, -190, -254, -149, 259, -303, -338, 105, -496, 199, -147, -129, 6, 342, -241, 275, -241, 58, 357, -76, 251, 91, -216, 383, -125, -27, -22, 150, 181, -36, 145, 354, 23, 350, -38, -56, 490, 3, 170, 353, -147, 190, 6, 139, 446, -25, 95, 180, -131, 367, -306, 27, 281, -235, 88, 287, -123, 109, -172, -127, -18, -518, -77, -188, -292, 212, -62, -142, -90, -385, 72, -251, -449, -85, -259, 59, 137, -397, -108, -59, -298, 563, -538, 22, 209, -368, 123, 320, -234, 248, 22, 124, 452, -100, 365, 118, -20, 128, -151, 106, 375, 220, 555]
3134E55p80L56J95l43L13j40k90O21l40R8K0m6j26J41j88J87j78L61j47k53J09
3155A25n09L8M96l93P65n42m35J033n21K30r5j65k59L99k28M64n71k58M59l43
3175c10M66m85M47l97nj40J16J46J54q12K08J218j031l00R44k01M20o56p6Q56
3195E62m29j49R2k69Q4K41k0N4n93L30M98o42n6N6L52J89j52j22q2k66M62j60
3217b0J97N56r33M59m6n4j22N5j06K4q6R4J43k1l0j43K46j42o89P52l62j23K60
3240i1k91O09k63k53O44n90q7n1QL89J41j76LoR5nk40M75k72J16K12p56k60Q60
3264B11p64P71l39pJ05n20O65m22J72M97m46K82K07j18n8J66m65O72p80KM10n84
3286c43L38K58k81J13K28j69L63l11ln79J47J7N95r7n49K47M34o33J05K42m81
$$ y = [555, -225, 131, 326, -17, 296, 156, -134, 487, 147, 245, 265, 219, 93, 234, 46, 233, 55, 416, 269, 16, 125, -384, -346, 150, -243, 522, -20, -455, 578, 57, 287, 192, 27, -232, 167, -61, 403, -168, -426, 33, -310, 156, -329, 118, -279, -284, -424, -308, -162, -8, -820, -612, 606, -425, -725, 219, 18, 438, -218, -294, 562, 133, -16, 76, -193, -109, 132, 112, 166, -427, -97, 401, -241, -297, -241, 111, 300, 148, 26, -56, -322, 140, -20, 177, 733, -200, 259, 213, 159, 37, 92, -14, 10, -76, 18, 161, 140, 110, -33, 213, 71, -618, 134, -228, -351, -91, -382, 227, -36, -289, 355, -235, -322, -373, -365, 24, 165, -11, -8, -14, 81, 76, -164, 311, 39, 155, 367, -389, -649, 211, -553, 218, -121, -128, -23, -543, 122, -300, -128, 369, -77, 205, 412, 294, 236, 402, -63, 609, -171, -169, 241, -343, -5, 253, -28, 85, 313, 144, 507, 196, 193, -386, -239, -222, 373, 276, -273, -26, 408, -225, -120, 122, -359]
3307c59M8l93O40k16P2PK71p87O89M01k82p58N86J45o83K29J81K57K92q0n29L6
3329b33P17q70L51m87K53R3k33k15J65L54M54k72l64O60l02m1m45M24O2K75j518
3350a172J592n41O9N31k59m8K94O2o06K52m63O3j28O50n8r1K38n39o07P28K36
3371B03j80l86M29L94l52P43q87K49r5k57K71L32j9r00O94p81R23o80N49k30p04
3392f84J295j46r59O72o18P42J7p39P47k11o36O17p97M19N41j154R98J2J34o66
3412d16M23k68K18q3L83n90O10L07r78J005m14r37J172p36K00L93l37O82k39n72
3432a77R4M59n85J27j39J10M75n81J00k31J69K73j39J02M7J07n4J34j73j97R8
3453A9K54n43M13k36j19M01k24j1K20k98RL86m99N9L86p34K44L79m38K6J99L4
$$ y = [-359, -311, -704, -64, -280, -208, -201, 70, -717, -28, 373, 91, -667, -81, 64, -619, -390, -209, 48, 340, 260, -269, -233, 484, -386, -35, -522, -269, -176, -409, -624, -459, -105, 349, 77, -287, 373, 71, 30, -415, 9, 71, 346, -1172, 420, -121, -52, 479, 220, 172, 466, 528, -78, 174, -289, -226, -354, 296, 238, 147, 385, -154, -761, -33, 203, 23, -363, 66, 460, 108, 851, -36, 213, 118, -139, 132, 464, 445, -455, 239, -542, 381, -299, 250, 20, -684, 611, 465, -494, 178, -440, 302, 319, -420, 327, 116, -520, 97, -700, -281, 260, -894, 104, 116, 250, -416, 7, -261, -43, -126, 257, -333, 277, 584, -394, 611, 197, -740, 432, -304, -104, 289, -48, 634, 395, -177, -83, 376, -209, -82, -221, -111, 364, -217, -117, -348, -179, 94, -45, 57, 104, 211, 157, 291, 118, -79, 19, 273, -270, 143, -93, -212, 189, -35, -46, 174, -124, -115, 271, -228, -169, 217, -517, -273, 106, -332, -306, -107, -73]
3475g3N3k30J27m39P3L54K5l13J27J38j82K81j47J94j08K30K98n00J72j90k16
3496c26O00p39J90N24j65K30l8k50K80j09j12j7L02k14j20K60k46k45M29m25R3
3517i8M67o54M55j09k77L33rm04O41m06j49N00l3m73M19o0m07R5L12l32l6K10
3539a5k24M30k84o7L87l28jK65m18K3J30k88K01J54j85M18m24r6N61n03J22L3
3561a09K39q1k51K35j15K31j76j84J42N9j04K75k09J00L70k92j08J47l52J51K06
3582A74j66K7K46k71L11n21K61m9K5K4M7O6k32OK01k34R0L5j73M46l30k3q4q0
3606b04K54k6l84L20J3K5m0j0J8j32o6L12P8l55J33pm7K0j17J82rK04k59j77N10
3631B36n78L17J32n18J84O90p61N52k22l12M42l16L0M13l33Q9K38m03mK49J93
$$ y = [-73, -20, -250, -123, -562, -489, -135, -110, -423, -296, -158, -340, -59, -206, -12, -120, 110, 408, -92, 80, -110, -326, 274, -465, -275, 249, 84, 314, 276, 26, 306, 197, 85, 68, 370, 156, 36, 296, 50, -195, 234, -191, -98, 369, -285, 170, 61, -216, 117, 108, -296, 345, -61, -210, 290, 257, -216, 203, 143, -264, -169, 143, -189, -225, -15, -239, 191, -93, -160, 227, -101, -102, 163, -255, -232, -102, -390, -189, -35, -220, 198, -226, -322, 239, -264, -142, -109, 130, 49, -202, 33, -82, 149, -27, -211, -69, -10, -114, 161, -48, 52, 422, 130, 22, 169, -183, -32, 174, 8, 35, 281, 10, 321, -200, 61, 12, 37, 61, 108, 174, -58, -52, 149, -85, 5, 40, -133, 313, -17, -40, -124, -204, 50, 24, -360, -40, -27, -2, -42, -52, -34, -166, -232, 80, 158, -197, -64, -71, -118, -98, -215, -33, -42, 162, -97, -274, 236, -342, -25, 107, -411, -227, 463, -298, 254, 32, -280, 162, -154, -124, 289, -44, 45, 283, -120, -124, 125, 318]
3652C18l92J44J93m17M40l64j03L53j5l4K00k43k33K86o9j03L0n2K31m1n7K7j47
3675d8p6J77j07k65M04L6k60J24J62j93K10k07p2K01k16o8M15m32J09M04l02l5
3697c9r6k07J90K1p1J93o0k16M93j51l18M31k89r3J15J76k68L86k61j13J57J88
3719A68l82L85J11n73N02m70L91K2p0m6K62l09J31J16j75P5J7q1P4J15k35r5K31
3742A64l3k8J07k66K5M1j25L38k88J23j44k3J34N5j55K14j49j92L18k51J77J62
3764B04j99o1M0j72K81j05j04N9lN5J01k76J09o3K54l52J31P7k12K09K01p4LJ8
3788A21j40R8k10p8J63j03L7o5j82L53M7J6p8J03j99K63j78R1j88L51J40l60J39
3811A41k45M40k71K4M3J66j68Q7j43l51L61j51j12N04m63k1k2m8N8J57L2J46L8
$$ y = [318, -74, 70, 263, -154, 286, -78, -181, 172, 157, 123, 323, 80, -153, 133, 64, -39, -9, -61, 170, 129, 72, 99, -48, -124, 53, -54, -319, 85, 121, -139, -15, 147, -46, 164, -43, -115, 86, -130, -198, 217, -215, -106, 298, -4, -39, -135, -342, -152, -131, -202, -9, -69, -285, 208, 57, -261, 170, -119, -212, -97, 79, -189, 197, -64, -177, -20, 168, -214, 171, 282, -291, 211, -259, 132, 154, 84, 38, 300, -9, 122, 238, 63, 138, 155, 74, 148, 263, 28, -67, 164, 131, 103, 210, -56, -31, 10, -115, 223, -65, 58, -86, -109, 25, 80, -75, 139, -10, -202, 116, -135, 42, 204, 5, -56, -16, -188, 93, -12, -116, -57, -60, -5, 96, -180, -71, -134, 120, -232, -101, -24, -236, -27, 174, 100, 103, 121, -19, 79, -131, -209, -46, -149, -112, -177, -359, -6, 41, 57, -21, 82, -117, 146, -32, 59, -129, 222, 362, 2, 141, -104, 336, 65, 89, 132, 298, 130, 217, 74, -277, 84, -67, -179, 325, -138, -159, -181, -229, -171, -14, 18, 164, 202]
3834B02l87l6O3J00j28J29J19k64L27m19K61N5j57j4N8J12j84J49k0J58k31J0
3856i7J14k5j13L12J8l70j09M74k68%k4J65K63k72j26n1K55l87M35l50K58J2k67
3879a53J65J17p3K33j19K4M7k71J58n2K79k05k9j27J99k05J2J36j90O9j38L68
3901B45l25j03J83J24q0j20J66l59K16J2Q8r2J3l3k24J90k32J81jJ47n3p1L0K46
3925A48l15J74K6k53Mj37K69J40K03k54o5k07N05k64j01K37N2k44J27l60K91N5
3947C1K13l09K26n1k30L19j96k59J95M31m04M76l92j55J03K03K9L1k06o4L43l93
3969e9K17L4m41M09l66K96K55l28J95n92M37J20n02L11j26K65k21k27N39k79o
3990f9m54O42j38L93m99j02L04n6L2o3k14K10m4q6L22q6l2Q2j36Q4j56J90m43
$$ y = [202, -185, -221, -158, -58, -186, -57, 62, -202, 125, -294, -33, 22, -135, -149, -91, 21, -163, -14, -34, 124, -107, -97, 17, -8, -121, 191, 209, -161, -270, 204, -64, -64, -88, 77, 340, 68, -58, -109, 146, -241, 194, -156, 102, 114, -153, 12, 129, 56, 289, 170, 194, 241, -30, 128, 76, 355, 150, 121, -6, 193, -12, 0, 136, -54, 15, -123, 245, -80, -183, 0, 124, 44, -76, 90, -269, -53, -41, 47, -45, -32, -65, -289, -99, -331, -150, -151, -4, -57, -128, -98, 148, -167, 7, 33, -220, -216, -353, -84, 56, 259, 5, -60, -267, 238, -26, -127, 110, 162, -82, 45, -315, -24, 31, 244, -65, 161, 110, -120, 199, 3, -256, -61, 370, -34, 442, 50, -105, -2, 201, 230, 261, 55, -9, 334, -59, 158, 192, -249, 160, -206, 90, 345, 17, 212, -380, 57, 177, -325, -14, -140, 125, -96, -323, 216, -63, -69, -523, 119, -19, 374, -125, -227, 77, 21, 53, -10, -224, -14, -58, -144, 178, 92, 60, 142, 6, 90, -66, 124, -319]
4013c19J40j31L18q0K58l93L20j63j22L76l39p0L44O4L0m53j33O76j50m40M90
4034B23R3K71k21m92L20R44q87j00n7r09J755j050J99j40n1J32n34M40O64l37
4054B63J48o76l91R69p88O5K26k42j19J06N80m54N39m33J54J50L83l64j77no10
4075f76O17j93M02n00N94k45J40M6k60m38P52j25j58J84l47o3P7M82k41o58N92
4096a8K19L5J23l59qJ55m6j92L50j41K59n15p9M06j03K41n1j52K48k25N4k87J68
4119H2j12n8J89J79m94J75K09l23p5J73Q3r2J49k62K8K11m10L67j37M1Q5n3l11
4142c56K55J00K84l02N8P3j01QK7l09M5L84n5j49R1j30o8P3j54L03j11L3QO5k10
4167a38J15K24j39j04j34J63lR5k35M03k17k75M14l6J88l59J45o9JJ16j16K0L4
$$ y = [-319, -179, -310, 8, -72, 186, -207, 113, -50, -172, 204, -135, -205, 139, 203, 233, -220, -353, 323, 173, -267, 223, 316, 587, 366, -126, 194, 1138, 251, 151, 94, -815, 940, -110, 89, -51, -102, 30, -504, -64, 600, 263, 411, -265, -656, 313, -475, -410, -184, -426, -545, -439, 141, -313, 226, -207, -53, 97, 480, 116, -61, -66, -676, -59, -252, 150, -350, 244, -1, 139, 185, -75, -513, 239, 114, -44, 140, -207, -270, -193, 289, 48, -610, -18, 201, 236, 359, 0, -8, 147, 101, -91, 259, 118, 377, -138, -217, 189, 86, 327, 276, 124, 372, 147, 201, -86, 82, -30, -88, 101, 280, -214, -39, 170, -153, -228, -55, 28, -64, 85, -177, -149, 62, -348, 19, -118, -77, 8, -45, -356, -101, -1, 283, -19, 39, 112, 11, 19, 46, -263, -218, 166, 111, -38, 53, -77, -145, -72, -226, 77, -34, -1, 7, 72, -138, -23, 201, 62, -42, -176, -13, -16, 79, -156, 247, 30, -245, 169, 133, 321, -38, 107, 38, 39, 155, 39, 59, 93]
4190I3j49J04K07l96J91j02J61M0k35M4J15k25J11L9M3k22J32k35L56J17r8j58
4212f7P0m9p0J38j27J78j2j15j6n6JK20l26K54J48l30K4Q5q5k41M80n1j57J68
4236F4r2%K7L96m73J83j54p1L15k57J23n6LJ24l5j85M15j16j84K48l59L21m16
4259a79J73r0L0K1k0j4K8J36J0kj20K46o9j77J78k15l9J9L08k99K15j20j32pk86
4284d05M85j56J91j96P1N5L2j09J71j50J70j65j31K48j6k05J17j68J97j34L1K87
4306B20q4j25J08j29P9j11P1L30m82K31q0l2J16J1m34L24m7j10L3qK30K55l82
4329a6J48j42j54L70j35L7j05K67j06j59J26q4J72k47j24M9j52L16P4p3k03J67
4351B6N8k74M66l07N1m39N93K3L23L8p21M84n88J02K52L99k87m95J44K53J81j90
$$ y = [93, -56, 48, 255, -141, 50, -52, 109, 149, -86, -42, 73, -152, -41, -2, 41, -181, -49, -284, 72, 189, 91, -67, 3, -46, -116, 22, -105, 73, 61, -54, -70, -126, -125, 95, -231, 23, 171, -159, -135, -50, -135, -376, 104, 53, -104, 64, -28, -28, -1, 395, -78, 105, -49, -120, 195, -62, 61, 5, 8, 132, 97, -88, 327, 211, 27, 275, -84, 237, -179, -6, -96, -66, -45, -65, -79, -51, 85, 95, 93, -27, 219, 150, -27, 151, -64, -103, -84, 224, -75, 140, 20, -112, -119, -405, 80, -76, 115, -81, -10, 45, 77, -32, 139, -11, 159, -6, -137, 111, 95, -110, 7, -161, 36, -98, -67, 220, 136, 11, 119, -10, 69, -42, 29, 359, -123, 108, 28, -4, 112, 123, -311, 13, -34, -144, -111, -119, 111, 366, -16, 132, -10, -164, 206, 71, 108, 3, 270, 164, 5, 131, 47, 219, -28, -152, -103, -255, 61, 135, 62, -141, 26, 84, -190, 276, -31, 20, -419, 174, 197, 520, 558, -163, 321, -267, -165, 87, 486, 199, -296, -152, 101, 282, 92]
4373I2n43Q06n75M37k30r9j25L04n21N15K30n97J66K48L5l65K6M2M36P63j054
4394iO8K16l69j56o9J97J44K33l38k39M02J05k5K5k58K69m31K03O83j041m0K21
4416b09L23J27J75m19j4J25j25J5l1N90o24J51n60P93m73LL76L2m16L01K50k95
4438I5l18J57p0N99n03l40M22K29k20M2j79j7j11M0N04p87K57J29J62j86J89J58
4460B52L4Q4l32K99n95N72m54K17N1j1q8k06Q2J12mL30j74k61O3K07N06o65L17
4483C36m08J07J10j02L19j21n33L30r4j38O62l94k09N92m09q0K39k81L42l34J10
4504D4l5j3P1l19J33J47Rk16r1K70k98K99N0r1r1p7N7N65k56m78K93k07k99M43
4528i0K02k63q3L25o7q1R4l0L44p68M41J57k5m39N43l21N5L73o72L87K88n68q5
$$ y = [92, -451, 355, -220, 217, -13, -112, -237, 67, -454, 61, 291, -306, -140, 108, 143, -222, -196, -154, 282, 1045, -9, 59, 275, -94, -250, -319, -122, 22, 255, -83, -322, 80, 185, 160, 185, -73, 196, -235, -32, 651, -390, -430, -209, 114, 241, 416, -3, -17, 108, -17, -2, -33, 557, -67, 84, -476, 317, -156, -153, 223, 255, -161, 140, 390, 95, -223, -66, -136, 463, -40, -380, 42, 271, 51, 93, -86, -103, -214, -174, 330, -457, -200, -71, 91, -95, 94, 252, 286, 370, 38, 337, -258, 314, -140, 77, 128, 117, 29, -177, -95, 17, 13, 343, 169, -92, -29, 178, 684, 19, 336, -72, 35, 145, 43, 362, 241, -292, 38, -56, -194, 468, 74, -135, 457, 48, -32, 207, -74, 268, -66, 44, 9, -4, 67, -252, -119, 28, 37, -179, -270, 0, -298, 1, 51, -40, -131, -208, -151, 414, 158, -320, -27, -234, -533, -90, 112, -151, -234, 91, 24, -57, 37, 7, 351, -417, 24, 181, 156, -283, 260, -61, -6, 367, -305, 82, 370, -198, -283]
4551b83K92l50N59L3l11P75q02j96L26k52L97j8m67j43R07k69K08m93J95O60n35
4572B33lk82J80K07J58j057J86N82n1o20j7O19M10j011P06n64P1N58p05M88M82
4593E70m40l20J4j29R40m85L03P8o64N26n41l44R75r52N70J62o81O91n25L1o4
4614b85L78J7j2J47o80O04l91K71J71j06k7L73l87O2J23K21j92j37j86L08n35
4635b63N63m17j07J66P04n37L90o45N18k24L59k49l73N46l58K35p76j13J047k94
4655A72n92N40j403J223k13MK87L7k7l72l55Q2R93n56R13Qj245N18m0N8l91O30
4677B71m67PJ66N25n68L7J19k9l2K87j38o7J46j10j45l00O43n5m78j45N22m32
4699b43J80l3l1L8j02P6q1M46k72K29m11J37jJ30o9j25J87j61J24K7k05K05p2
$$ y = [-283, 9, -341, 218, 251, -60, 715, -87, -283, 43, -209, 188, 170, -297, -440, 467, 198, 406, -87, 108, 768, 233, 230, -52, 128, 335, 493, -564, -378, 204, 153, -467, -484, 135, 545, -466, 240, -324, -253, 305, -400, 88, 570, 130, -190, -176, -305, 635, 150, 453, 531, -133, 393, -148, -492, 483, -469, 101, 263, -418, 273, -252, -221, -285, 93, 110, 98, 245, -435, 169, -222, 49, 220, 114, 87, 460, 73, 135, 258, 479, 287, 150, -36, 272, -263, 300, -117, -224, -58, 646, 109, 499, -146, 372, 148, 507, 258, -115, 431, 73, 308, -468, -581, 466, 172, -420, 120, -1283, -60, -273, -269, 18, 55, 28, -344, -699, -617, 376, -180, 733, 741, -504, 14, -26, 32, -359, 271, -196, -189, -23, 502, -66, -29, 90, 61, 29, 316, 178, 111, 257, 147, 2, -298, 345, 290, -188, -333, 189, -243, -63, -96, -127, -89, -191, -115, -196, 250, -22, 207, -204, -67, -68, 62, -7, -132, 55, -106, 18, 45, -160, 45, -27]
4722b7n3l3o0K23k23J20qp2m1K32k39O0J26l1Qj66L5K7J1J33q9mn7J22j01O4O8
4749B5j49K29l22K06K2j99N1Q0J38k26k18L65J13M5j84K55j87l3r8P2p8M1K73
4772B21m50M79k76m4J49j92J77o0J14j6J32k54J51j19J52j60K1J67j47L0k49J08
4794f6p7J18J76j91r2k1L84k86j22K56r1J39M7k77J02J26k26Q8J98l07K28j24
4816a8n5k17K76q5JK53k58J77K3l46J17Q7J62o5j3J35j20j79J20P0k91K0n7L31
4840F8j08J23n2J03j33L9N0j70k0j6O8J8l7L37j42n0L8q2k20M99k10r3P3j31j29
4865a77J44J28p3L8j81L86m39J96J98k61O0Rj8M3P7l33J56J27k74j89L35n3J50
4888D9L4j04J48p6j80J56K49k62m4R1Jk32J79q3o4K08j49l0rJ21r5J25kJ54k43
$$ y = [-27, -80, -113, -173, 50, -173, -53, -61, -133, -174, 58, -181, -121, 5, -26, -18, -184, -149, -122, -111, 22, -67, -71, -128, -6, -107, -43, 25, -124, 105, -217, -11, 11, -188, -137, -57, 81, -145, -363, 2, 115, 160, -24, 231, 44, 11, -87, -15, -93, -52, 221, -229, 250, -26, -70, 79, -113, 64, 4, 118, 102, 234, -20, 131, 12, 164, 4, 25, 192, 45, 75, -174, -66, -143, -25, 151, -40, -132, -153, 231, -55, -177, 79, -12, 127, 174, -103, -1, 125, -101, -13, 185, -122, 106, -18, -73, -290, -14, -99, -98, 155, -103, 74, 97, -249, -132, -45, 117, 52, 39, 174, 54, -125, -5, 65, -226, -206, -263, 68, -40, 83, 31, 134, 1, 40, 90, -80, -100, -116, -48, -30, -67, 270, 128, 78, 116, 34, -186, 313, 103, 10, 83, -48, -177, -33, 95, 22, 60, -121, 265, -174, 22, 220, -41, 19, 28, 10, 53, 130, -203, -47, 80, -194, -383, -48, -101, 49, 83, -21, 127, 51, -129, 27, 276, 14, -30, 61, 62, -170, 9, -74, -138, 70, -79, -109, -118, 3, -92, 33, 31, 185, -58]
4913e8K66m42N05k53M5j33J62J7K2Jm0P4k6k45K59M8k18P4L6q2k07K26O1M9k92
4938a51k1J26K33k13n8N1J27p6n5J59K17l60J08p1l35R3N39k60n7J36k09k26L20
4961A7k2k81L20O5l15K59LO9j90LQ2j44K1k85K28K99mj77J28j67J01j04J55Q5
4985A46k15L49n05K25n2n8J72Q9j69J32l6o6k8J22m8j89K82m27K28M9J03j14J41
5008A31R9o9j11l1o1J48ok52J44PQ1Rj96OK78j53r5p3L0K17N8k52k8O9k05p6M55
5035A24m0k32O0k9J44N5k86K63k0j47J28j1m3J00j24J69O5j71N1P5j00Q8J10l25
5059i6Qk7J53qj01Q1Q1k4K04j35p3j44J13O6P5j05q1Q8J52k14L87l18n2k33K69
5084F6j34J2K61k28J30M6k69M6K8P5N2j61QJ73j44L19m37J54J90j78k1N2j32o5
$$ y = [-58, 208, -234, 271, 18, 63, -70, 92, 109, 131, 132, 92, 166, 140, -105, 154, 202, -16, 58, 94, 12, -195, 31, 92, 141, -151, -172, -46, 187, -26, -84, -33, 94, 18, -37, 122, 339, -21, 87, 16, -319, -226, 313, 53, -4, 132, -77, -303, 17, -5, -286, 34, 99, -216, 43, 46, 115, -75, -72, 10, -134, -113, -398, -170, 129, 125, -52, 76, -91, 10, -94, 61, 146, -69, 280, -225, 0, -52, -110, 62, 151, -18, 114, 78, 12, -16, 106, 58, -131, 151, -276, -48, 1, 104, -10, 131, 230, 161, 50, 19, -42, 106, 100, -152, -8, -1, 80, 89, -107, -101, 177, 24, -71, -144, -114, 103, 161, -91, -119, -50, -255, -331, 124, 84, -148, -88, -117, 27, 82, -204, 59, 39, -108, 20, 9, -34, 66, -58, 111, 176, 5, 56, 131, 31, 119, 229, -96, -88, -115, 38, 30, -71, 10, 91, 67, 271, 136, 63, -81, 32, 98, 173, 68, -13, 75, 227, 13, 400, 82, 30, -203, 66, -68, -56, 205, -23, 107, 153, -116, -70, -42, 33, 85, -76, -68, 105, -39, 280, -157, -3, 187, 9, -12, 40, -92, -157]
5108a57K18n3P1Nk40Lr4J97j93L74j34j9O0L07m44l6K5l0L27k68K01k69Q6K63
5132B00k48K18n09K06J35j4P4j17j34J57J82l17P0p0J72J12L3j66J91k11o3J91
5154I2m7K9P8K1k31RJ09Pl45N08l25K95j66j45J23N7p7q1K20o9j14K4k8j31L2
5179a55NO3Mj7K9l1P7m5J03r9M5N2j91J59mJ69k07K1j3Q8l50M73j93L5j75J68
5205A1m9M9j47M4nM6Q9p9j18J63Q2P1j73K73j55r9J12j7J6J1k2J14J7j31l2k27
5231a56N7K30m6l17M71j91L7p5j04P4P3q6j5j11J11K87j30j86K73m9j34Mj45K20
5255I2o0j23j35J19O5o4K2J4j63LK61r3j9J22J71j01k68O7L3J76o0N3k04p6R1
5280g7K36l22K17j34Q9J79q7k36K31M0j94K03j5rO3k57J71o9J21R1m1k25J87p
$$ y = [-157, 61, 8, 79, 84, -156, -153, -247, -50, -243, 131, -3, -22, 38, 345, -99, -135, -110, -140, 187, -81, 120, -149, -63, 200, -48, 170, -339, -133, 2, -12, 62, -55, -189, -32, 150, -167, -97, -167, 5, 117, 150, -16, 175, -36, -99, 92, 45, 74, 152, 173, -58, -49, 60, 67, -278, 230, -95, 200, 34, -111, 12, 69, -8, -89, 131, 62, -52, -28, -56, -187, -155, -150, -87, -83, -100, -71, -102, -25, -70, 33, -66, -21, 31, -160, -1, -5, 164, -43, -22, -35, 53, -297, 176, -17, 18, -157, 11, -38, 11, -136, -92, -97, -51, 38, -41, -159, 4, 86, 157, -16, 257, 102, 3, 115, 98, 114, 125, 103, 217, 234, 103, 71, -156, -99, 131, 85, -232, 239, 48, 85, 10, -94, -20, 53, -33, -48, -159, -48, 239, 109, -77, 196, 147, 13, 17, -128, 92, 32, -91, -226, -107, -42, -106, -84, -70, -233, -230, 31, -62, -81, 41, 212, 111, -157, -90, -57, 119, 59, 112, -92, -168, -77, 159, -163, 54, -80, 9, 188, 101, -135, 96, 136, -58, 145, 130, 121, 184, -73, 98, 29, 150, 241, 200, -25, 162, 155]
5304A55N8o2j72J8M0O4j7N6o4n7p8n3J48J11o2k25K55j86J07N7k38J21K31j26
5328H1k85L07j02K2j00M2O2O7l64L22J31k47n6O5j9L7J51j78o0K58O4l87J24j91
5352b56J22O0K15j4j47j54L40j14j94N67n72L05l44J58l6J13j51L7J97j48J6N8
5374E8L8J03j3K3q4k48J64R0l52K22jo3J97r3j01L5j13J67J48l42L09k23R1k71
5398b59q0L76o2L2j11k2J45L9k82K45N6j17n0L03k31J3j64J77j9q7mJ04J17k56
5422a37L43qk38j36J63k45K02k37N10j89Q6j46K9j73M8L08l5L8k35R5n5j26M8
5445i0J2J3J49j92J37J0Km1J8K1k37K69n0n1J22j25n2K80k46J85j47p2M2l0J39
5470F6R0k3r3N7l1Qk08J8K5J83j06K14j15r7k6J40k95J94P9j35r4N10o41J07J68
$$ y = [155, 213, 151, -21, -3, 37, 101, 84, 140, 76, 19, -59, -112, 36, 147, 85, -140, 115, -71, 36, 93, -145, -24, 207, 81, -204, 103, 1, 23, -77, -35, 27, 94, -270, 52, 183, -64, -120, -55, -74, -37, 114, -64, -124, 134, 198, -189, -65, -256, -134, -74, 141, 127, -20, -174, 166, 52, -142, 425, -147, 158, -186, -28, -64, 49, -102, -65, 132, -16, 0, 58, 96, 199, 186, 209, 125, -123, 41, 131, -221, 1, 0, -63, 134, 41, -60, -25, -138, 29, 177, -165, 144, -79, 12, -259, -339, 37, -25, 7, -104, -126, 19, 58, -224, 21, 77, -40, -90, 213, -18, -5, -169, 8, -11, -98, -102, 2, 119, -137, 206, 198, -40, -176, -13, -258, -56, -293, 217, 28, 114, -32, -3, -176, -128, 180, 145, 183, -52, 43, -12, -138, -90, -78, -65, 84, -108, 29, 39, 41, 0, 18, 39, -198, 71, 21, -30, 92, -33, -85, 195, -51, 134, -13, -85, -43, -73, 66, 156, 133, 40, 97, 66, 74, -134, -116, -91, 92, -14, 200, 85, -12, -38, 102, -193, 1, 80, -55, -149, 361, -280, -173, -5]
5495eL3J12j19m18L03k04M90n69L76J11j50K1L6m4N4K6k72J91l20N08L94p83L65
5518A36k7J73m75N62j77l4o06M84j66J90k18j17j04N66J73l26J40k03O17p30J32
5539a0r8O6p0M81J73m25j74j70P1L85p55R21l38L22k64m22R45p39p9Q1N4n84J001
5562C72M7m57j58j23K66k74J22J43M95j34m85kj81M57K7j03K48J80p96K58K05
5583A07m10O88o31k77J81L76J36k76L40r73J010q26O48P20p36P23o95l46J634
5602A393j269p60J006P4o23K89p61J172p79J38N82l0M35r44K53L20m4n62K78j88
5622b0M06M8l91N83n62m27k8M14K33q58J52R72l82J2p74M77L26r7m12J039r40
5643b29Q42o72M97j54n80r5L59p6k03M48p1m4l47M14j10L19m9r2l1j94J01Mj00
$$ y = [-5, 28, 140, 21, -397, -94, -298, 192, -377, -1, 110, -40, -19, 17, -27, 27, 53, -219, -28, -348, 160, 554, -229, 136, 109, 282, -193, 369, 192, 158, -448, 36, -130, 60, -158, -275, -379, 187, 360, 34, 174, -29, 588, -142, -10, -108, -42, -112, 369, 542, 117, -57, -227, -156, 229, -526, 395, 57, 379, 115, -307, 638, -101, -180, -99, -45, -629, 372, 419, -38, -196, -319, -53, -327, -205, -62, 433, 299, -186, -188, -369, 88, 115, 12, 260, 440, -356, -98, 107, -303, 385, -246, -523, -342, 34, 170, -106, 234, -739, 271, -555, 93, 813, 77, 800, 105, -241, 1393, 124, -636, 370, 444, -179, 110, -651, 521, -258, -120, 462, 432, 867, -77, 176, 496, 452, -110, 168, -20, 386, 434, 43, 626, 64, -363, -391, 23, 256, -602, -450, 522, 140, 152, -622, -145, 181, 84, -328, 711, -229, 613, -59, 438, 284, -296, -391, -32, -108, -311, 137, 66, 22, -325, 89, -21, 298, 249, 157, 126, -68, 33, 37, -63]
5666f3K50j08m7PK25k89L9K24j0k87R4mR9k9J53j42l20J88R5j02J02O9l19L06
5690A31N1l51L9L25l3q8J23l63P9m5J00J5m7nJ78j12M7O3m5Mj04l3q6j27Q4M9
5716a51j18K09L5j60J89j2oR5k05K34m7o5M5k41J01K02j60QK50j45nl7N2R2j12
5741D8m1j64K73P9l04K87j87J50p3l6J1j76J88J74j97j05l5J37k48J51K77q0k95
5764a66K12M7j71q0J66k8q5K4l5J08J6l03L86k14n0J97J17k41j90K30K83m26L52
5787A49j28p7j69L88r6j94J18p1J07K7j81O7K61k38J25r5Pk3J24j34j62L75j84
5810dp6R9M3l7n1J92j40J20K12l82m5O0j90L41k14Q0qJ21n1J0k54K84r3j71J28
5835b6r8P2J81n7L3o4p5J80j14J63O0k08Q1j18q6R2Q8j62J63j22M1k18J61j2Q0
$$ y = [-63, 187, 79, 32, 39, 264, -25, 14, 238, 228, -59, 35, 31, 130, 101, 254, 112, -208, -20, 75, -27, 75, 144, -175, 131, 182, -169, -130, 195, 162, 74, 197, -166, -87, -132, -32, -17, -64, -69, 109, -3, 44, 107, 62, 66, -38, -71, -157, -284, -200, -151, -269, -60, -25, -185, 4, -8, -14, 81, -124, 110, 63, -2, 43, -198, -97, 105, -55, -47, 203, 58, 53, 16, 68, 160, 48, 7, -157, 116, 195, -109, 178, -9, 141, 68, 32, 43, -133, 55, 229, 32, -73, -108, 29, -219, -68, 209, 129, -166, 46, 93, -78, -158, 8, -20, -105, -81, -116, -8, 8, -295, 91, -123, -173, 24, 141, -100, -290, -60, 223, -203, 149, 21, -56, -225, 163, 67, -127, -9, -80, 27, 54, -127, -60, 201, -37, 88, -7, 0, -23, 101, -33, -195, 180, -4, -80, 19, 62, 25, -26, 166, 26, 146, 358, -24, -69, -9, -199, 142, -72, 8, 0, 121, 70, 80, -174, 110, 17, -154, -26, -124, -52, 129, 72, 105, 41, -34, 146, 32, 195, 255, 47, 128, 10, -76, 16, 104, -58, 105, -17, 24, -194, -33, -45, 35]
5860C5r5J37j7Q0m4k91J16o2K74J47l04j39J85L2k39J94J05L7j05r5J01j73pL3
5884i5j1O0K30l7J03k84l6K40k26q0K33j22j9J24J77j77K21l62o1K05j65J49J20
5907A87j08p1j21J49l5K3j08L79l44J7J35j10p3K30o3k56K16j2Q1q5j4J18K57
5930C92n35J57L4j69K3P8J41O5j77L6m49M51j43M4k51j31L15K70k3n13M96m2k37
5953a68P92m67l50n5M24q04J068l24l18l12J432r99j96o73J418j80q19K70K27
5972c4R29j229L63J95l8K72j48k91P39m13K12o2j26n6N1l69K30l41J15mr3P39
5994F41q05K83K4m0l90O60m11Q1J69j4o0l47L20l26L81l53J86J9o7L14l44J20
6016D1J07j08J03k22p4J04q7J19J19l%p7nJ17pk54K8K12J93l32R5J9R9N9j15l23
$$ y = [35, -60, 77, 60, 140, 96, -195, -79, -141, 133, 280, -24, -163, 22, 54, -185, 9, 114, 151, 46, -49, 52, -121, -128, -95, -106, -46, 184, 147, 250, -34, -70, 170, -56, -136, 97, -25, -44, 80, 257, 80, 301, -61, -122, 83, -82, 67, 187, 79, 8, -113, 36, 1, 24, -84, 295, -49, -32, 103, -7, -80, 150, 87, -169, 47, 35, 116, 31, 17, 135, 392, -143, 14, 48, -121, -98, -20, 121, 186, 9, 45, -404, 47, -96, -52, -303, -434, -119, 151, 128, -385, 111, 69, -168, 624, 157, -193, -248, 176, -628, 440, 116, -202, -514, 918, -81, -277, -950, 468, 288, -531, -261, -34, 895, -334, 29, 224, 186, 458, 310, 19, 758, 345, 557, 495, 369, 313, 364, -5, 225, -116, -1, -5, -98, 641, -164, 119, 143, 103, -287, 373, -38, 43, 212, 198, 138, -209, 111, -215, 166, -187, -1, 18, -49, 265, -79, 41, 148, 40, 143, -79, -153, -49, -136, -17, 102, 99, 99, 22, 17, 134, 127, -127, -99, 113, 306, -26, 69, 88, 187, 246, 131, -192]
6042a92J02L20l61J86N6k1k11J6j03L80k24J13J34k53Q6J84l43Q8J34k97J21J21
6064C6j08K05q9lk13J30J94j68j9M8q5O3k6l8N6j14K42l41J70k1p1J45J83o5l74
6089b63K88J30k76J58L7j96K6Q1P3QJ48j41R5m41K65J91J52n85K51o5%J00MQ3
6113A23N9k7j81j05K98n8k6j0l4k90J77J70m0j87K71j23R2k50K65o4j28m3J09
6136bj06K3J63k59L82j27m3k81J5J97K58j84J41k26Lj59O4J1K39j79J38j8k22
6159a72J31J47j28K0J10L5Ql05J91K7R6j82O1j42N4P1m3Q5k86J22o3K95L9j62
6183IP1j08J73j72Nl4O8p5J95j74K97k68k58L07L0j24p0K31j04j0Q8L0l06pJ63
6208d3PJ54j74P9L13m04n4K7J02M7k02k2J89R3K2k10j21L18j30P5O9j50Jj49J15
$$ y = [-192, -90, 230, -131, 55, 111, 90, -121, -105, -208, 172, -52, 61, 195, -58, 28, 212, -131, -43, 91, -206, -85, 36, -72, 133, 44, 41, -172, -42, 152, -16, -35, 13, -72, -9, -35, -73, -17, -131, 111, -230, -60, -81, -152, -7, 176, 111, -263, 25, 155, -121, 37, 74, -122, -96, -15, 58, 66, 214, 73, 168, -273, -8, 183, 335, -250, 1, -64, -64, 36, 40, 123, 182, 155, -26, -131, 167, 109, 83, 73, 39, -251, -74, 96, 56, -131, 140, 17, 109, -141, 124, 60, -68, -111, -2, -108, -85, 78, -181, 201, 74, 31, -250, -235, -38, 220, 36, 177, -49, -46, -205, -141, -130, 109, -70, 68, 50, -172, -41, 106, -22, -2, 108, 143, 151, -154, 37, 64, 160, -22, 39, -103, -49, 22, -21, 64, -222, -100, -163, 132, 171, 9, 80, -28, 145, -27, -22, -56, 12, -63, 132, -42, 255, -13, -271, 36, 66, -58, -128, 103, -1, -11, 77, 107, -199, -206, -43, -36, 118, -56, 23, 336, -68, -122, -95, 7, 54, -148, -170, 19, 112, 134, -76, -197, 121, -9, 66, 135, -15, -14, -163, -48]
6233d8J65k77J56rl7J76o2k45K44p2J3Jr8K94k56J62k66R3L3j09K02k7PP9p3o9
6259b3o3J32J20j34r1J55j30J61R6n38L76l4J70K8l56K11R8J65o6j83m8q5J24
6282H5k93J47k34M80j23P2j3j10l46P59l55O5l12o1J96l25J50N00m80o4K36l4
6304f0K08k08j2jK83j37l7q1J01j65r5J18j37L81j63K95j06l05r7J97R7J4l88
6327b98L52J32j97P7O8k59L61j20j67j45N4L07p9j5p9j95R2O5p8J03N7K04k03
6350C7K10k13r1K3k7O2J35j20N2m34M69K7r3k03MK88j3J00l31K19j43P7O4o2n1
6375a4J09J1m8j13lj05J14p1K93k40N0L8k01K56L5l9k2K7j11o3K30j74Q1Qj83
6400a35M80k53ll13L69k50J59P4j5l18K64q8J52Lk02m6K31r6m1L57j75j09L32
$$ y = [-48, 117, -160, -4, -13, -50, 126, 64, -181, 63, -9, 4, 5, -93, 201, -55, 107, -159, -66, -33, -142, 60, 33, 40, 119, 46, -23, -86, 46, 166, 32, -59, 96, -34, 127, 223, -315, 61, 27, 197, 225, -131, 80, 178, 343, 277, 94, 46, -39, 85, -208, -61, -295, 185, 62, 134, 121, 11, -335, 424, 69, 134, -178, -239, -43, -368, -218, 282, -198, -262, -26, -60, 148, -60, -72, -73, 210, 73, 36, -45, 56, -109, -204, -86, -223, 158, -5, 290, 184, -121, -218, -21, 76, 90, -298, 54, 186, -11, 66, 134, -125, 236, 116, -51, -196, -142, 165, 86, 71, -8, -203, -111, -46, -124, -21, 36, 240, 37, 247, 34, -57, -34, -61, 1, 136, 16, 68, -366, 103, 130, 37, -166, -162, 126, 113, 213, -118, 101, -42, 35, 99, 37, -14, 95, 106, 58, -55, -58, -163, -49, -120, 173, -67, -17, 21, -180, 76, 111, 72, 50, 77, -34, -97, 133, -41, 40, 48, -135, 345, 92, 89, -224, 145, -105, 54, 128, 113, -205, 59, -29, 123, 126, -76, -122, 109, 13, -28, 329, 154, 45, 377]
6423C77k7l02J67j07N0k96J24j22L88m60K15R2j95K95k65J80k88J14L2J01j5o7
6445ij4j26J75j19J04L3j82L4L01L8j28j51J04J4l38L73p1L6J87q2k43J50J16
6468B02j05j55K7K7Q4r4R2m09K25K54l09q5J27Q0J38m11M39q5p3O3K45m2k02L7
6492G0j31K54r7j9j91K92n2j37K4j29K28N0q1j08J72k67K78l48K20k49J98j04
6514a27J24j37o3K04K12k28O6j62L38j5l21K91l44K12L1j77J0J00O5K2j13j37
6536a49K40Q7k75R6n6r7K38k9k11M2J43P6Pj41K3j23J41j20K94k68J63j65K27
6559A43k0n0J66j62k11P6O9j4lm3j6J44k78J87K04k81J12j14J71l3K03k56r5K95
6583A94k50K4K88l31n5l0k5L22j23J4R1k25Q3j96K04j02J23J23j97M1P1l04K75
$$ y = [377, 350, 48, 215, 108, 158, -138, -14, -136, 252, -208, 7, 99, -96, 199, -66, 114, -174, -60, -28, 73, 58, -9, -23, -149, 26, -93, 11, 44, -138, -104, 197, 235, 107, -44, 60, 74, -264, 109, 38, 74, 261, 179, -64, 86, 202, 97, -58, -31, -4, 80, -14, 78, -331, -106, 148, -161, -246, -119, -39, 99, -312, 127, 42, -31, 32, 277, 235, 33, 70, -61, 193, 96, 77, -114, 178, 126, -11, 13, -116, 112, 162, 81, -27, 145, -122, 156, -192, 28, -221, -23, -127, -3, -140, -203, 1, 213, -15, 51, -111, 227, 212, -109, 182, -162, 50, 81, -96, -86, 14, 79, 101, -12, -149, 91, 178, -97, -1, -57, -154, 84, 55, -156, -114, 29, 105, 112, -29, -6, -129, 12, -108, 186, -82, 81, -84, 143, 123, 73, 239, 77, -134, -58, 11, -3, -6, -49, -65, 79, -199, -12, 192, -89, 23, -91, 80, 47, 250, -6, -101, 194, -56, -32, 256, -75, -130, -160, -185, 137, 14, 28, 119, -106, -23, -219, -15, -117, 6, 129, -68, -27, 44, -260, 15]
6606A5L6j3k44L16j53O8o9k5P7k50P6J44k10K48K90k55j12q4J03J62K3j09j4K9
6630D9j95J24J24k21J64J00k82L6K01r9N7k15J24N3J63k90O1L09j23k4j51J01
6652F6R4k39J58RK7mj75k4mP3l8K04n2j97jk21K40O5j55k1O1O1Q4O7j07m2j09
6679a80J98j3K3l3j04Q3N3N7j29j3J71k96r0J43R1O5J4j41J22J18M8n9j95j76
6703b43L25K29l41Q5N5j30J06k7j5Pk6k67L11l8j68M1j10K26j16J25j52K57J3
6726A47l8k23J01P8M8rk27J22j11j86N2L15q8J30r7ko4j50K28Q3j41Q4j36M84
6750D00l78M3j68k7N7q9J97j21P4N9j33J1M7j26K63k01J53k04J40m9n4J48K4J05
6774A71M4p4r8ok9l57L88rP9k20J42r1k3M9M9J37k33l4K15q1p8J80j63l2QK0j69
$$ y = [15, 51, 38, -206, 110, -43, 25, -44, -69, 8, -242, -166, -22, -232, 16, 306, 51, -61, -145, -42, 120, 143, 34, 20, 49, -146, -22, 102, -119, 45, 145, -137, -101, 100, 1, 58, -157, -33, 20, 183, -107, -46, 263, 140, 116, -35, 66, 160, -79, 79, 88, 115, 111, -64, -88, -92, -19, -57, 147, 95, -102, -103, -324, -84, -19, -174, -195, -134, -73, 11, 78, -29, -71, -180, 18, 5, 28, -5, -109, -26, 27, 84, -45, -58, 113, -183, -273, -130, -39, 26, 40, -101, 21, 139, 187, 128, -67, -243, 82, 311, -30, 55, 110, -20, 86, 59, 44, 51, 25, -242, 69, 31, -137, -96, -206, 20, -96, 29, -123, 134, 147, 109, -114, -13, 65, 113, 104, -123, -1, -112, -298, -246, 69, -19, 111, 14, 12, -52, -202, 26, 109, -32, 52, -84, 400, 22, 65, -103, -130, -73, -162, 35, -86, -12, 47, -86, -75, -28, -154, 109, -92, 61, -143, -3, -52, -106, 42, 66, 171, 215, 141, 43, 37, 8, -349, 39, 30, 109, -111, 31, -60, -83, -34, 15, 152, -81, -115, 100, 19, -59, 121, -42, -74, -66, -46, -215]
6801b15J49r0M82n02J36r6Q6j33K38J05k05J4j46L68j17N8k62M56k27J5k52J14
6823b4J9J58l11m8O1J30P3j12J28O3j1l0J84j77j43L17m53K22k32J76N4l1J93
6846B06j99oP4J07j91l7R3J36j11l1n1o4M9J23q6K06l47L97k59q8K57k04J30n0
6870E4q9J99j9l6l7k7L1l2k96J47J28K26k6k23l20K16l9L21k67j51M26j32P5k50
6894a21J0J32Q6l19K49M2k38K53q2O4k18J98j66J49N8l7j59Q9Mp0J71l6K4J08
6918A91k98J35j29J73m3k58P3J62n6r3K01j25K52k29r5J64k1K0l0J70l92K88j51
6941i1p9J55k0q5J36p7q1j31L22k7k26J96p9J0K50j79J3J03l74J46j24Q8K29l30
6965b55J78J44N8k6j81J84J88m29L2K12j15J0pL7j52Q9J73k31J25p5J06P6o1j29
$$ y = [-215, -66, -156, 326, -176, -40, -136, -50, -183, 55, 160, -45, -31, -177, 191, 74, 132, -130, 326, 99, 114, -138, -24, -5, 153, -158, -206, -145, -15, 58, -54, 74, 137, 126, 96, 280, 103, -40, 277, -176, 46, -186, -10, 44, 13, 206, 7, 1, 75, 182, -9, -46, 47, 183, 72, 41, -10, -74, -25, 98, 12, 218, -129, 268, 9, -79, 178, -26, 104, 54, -35, 164, 145, 109, 72, 45, 76, 44, -252, -105, 23, 249, 223, 0, -320, -104, -143, 178, -89, -240, 186, 54, 129, -121, -111, 21, 107, -212, 37, 79, -159, 94, 12, 76, -142, 56, -110, 39, 97, 60, -99, -10, -6, -76, 95, 59, 83, 191, -107, 28, -101, 72, 29, -229, -156, 6, -50, -143, 58, -67, 185, -44, -139, 25, 4, 24, -6, 164, -228, 60, -91, -170, -15, -35, -120, 16, -61, -142, -273, 49, 22, -204, -8, -87, -77, 173, -6, 7, 110, -264, -118, -242, -154, 75, -255, -77, 67, 125, 99, -82, 102, 290, -139, -107, 105, -10, 0, -7, 30, -122, -33, 140, -91, 34, -41, 65, 141, 80, -49]
6989d9K2M21m05J08j67l0P1M4k3K0r9J46K28l07n6J27l7j48O3R3J25K4l62K36
7013D5J92l67L40r7k7j77O1j5j52J11K46j25j18L48n10N74m89M14o7j28n3l3j84
7036b11L22Q1k34J00J8j79R9J05p1K4L2j12J69j20l3n1K51l32l4P8J44j23j24
7059b01L43k90K53j59K64k25J3J15M3j61p6J71o7j08J45J02l24O2j25L61q2q5
7081c1OJ28L1l07K80l59N4K04N4j80N2j28O6J97j74LPk9M9O1J56j3k49J24J49
7106A51mj72p0J07K7j85o3j03L72L0l67J55M7j4K72l34J20j04R7N1L7j8k27PM0
7131a48O9J64j46j67L34Lj68L44n39J65R2J32j8l3j19K93j70P9j86J89k79m3M6
7154a06j76M60p5k60L85l34r6O6Q5M22q6j48N5l45P2J07NJ9o6K48m12ln31M03
$$ y = [-49, -27, 394, -11, 97, -70, -100, -29, 15, -8, 12, -87, 59, 287, -20, -76, 51, 14, -134, -71, 22, 147, 171, -191, 45, 237, -130, 210, 113, 86, -91, -30, -45, -197, -86, 160, 35, -83, 265, -245, 329, -160, 254, 187, 59, 6, -27, -211, 111, 192, -42, 58, 76, -103, -4, 101, 30, 54, 86, -26, 143, 23, -10, -61, 190, -142, -176, -98, 46, -77, -201, 142, -148, 105, -54, 210, -15, -2, 113, 156, -5, -81, 90, 23, -85, 60, 162, -162, -100, -225, 136, 54, -31, -25, 103, 134, -173, 107, -252, -198, 6, 60, -120, -68, -196, -130, 67, -107, -104, -97, -126, -77, -16, 140, 127, -122, 2, 151, 147, -25, -95, 12, 39, -146, -209, -312, 60, 90, -277, -122, -75, -89, 183, -151, -31, -135, -38, 13, 50, 32, -195, -188, -148, -79, 85, -61, -228, 106, 109, -59, 285, -254, -89, 3, 135, 117, 84, -35, 258, 88, 167, -19, 170, -109, -152, -106, -282, 178, 103, -157, 228, -106, -202, -136, -51, 371, 285, 137, 192, -153, -81, 26, 31, 50, -16, 232, -180, -183, -714, -311]
7178c11J38K15o67O16O4N1j70J45k43J64L6o8l66M38J0J14j29j07Q2L11l37K07
7200A93J28o37N71k26k9n3J56Q2j33J99m56J81n7Rj21J12j56M69l13K65j95k48
7222b59L40k24M45n72M17j22l3K59l54J04M0p5J89K33k66k46J86K42l06q5J8K43
7244A74k51J71Q8K4j51K43j17L7j14k20J0l95M31m39R86o76J40K99J30m47r9J32
7266d4k9p4L06m41m39M85K43k03L01j47j38J57K34l45J24J03l06O85l18k86N50
7287D18k71n81N25R2j36l47N56n82N38m9m17K7O30k66K37m15N00m12L40k49l09
7308a71J71J0l77n2L18P60n36m75L69j4n31k89N97K58m92P04l29L42n5m39K65
7329C4n1n10n9O44n77R30j027P82j24l30k88l74R35r1l99K43N67o2l37L31J66
$$ y = [-311, -173, 42, -625, -9, 55, 106, -64, 81, -162, 2, 38, -30, -396, 42, 52, 166, 37, -70, 12, 323, -14, 193, 321, -316, 255, 29, 0, -53, 103, 185, 52, 251, -205, -24, -81, -72, -193, -81, -237, 232, -81, 184, -11, -259, 81, -143, 302, -270, 147, 25, -8, 251, -103, 1, 41, -34, 155, 388, 122, -124, 62, 304, -2, -87, -69, 174, -77, 94, 182, 206, 55, 298, 181, 218, 104, -116, -106, -501, -70, -509, 477, -199, -59, 240, 370, -77, -176, -44, -73, -147, 159, -282, -721, -236, 7, -196, 105, -42, -180, -23, 211, -134, -10, 93, -213, 472, 154, -132, 418, 147, -434, 91, 183, 47, -300, 256, -326, 212, 163, -254, -227, 403, 137, 374, -41, 459, 47, 387, 138, -171, 0, 10, -367, -419, -101, 659, 123, -352, 17, 3, -528, -817, -220, 38, -454, 250, -79, 263, 208, -231, 34, -17, -527, -586, 58, -519, 411, -616, 166, 42, -288, -576, -950, -15, -106, -505, -262, 305, 243, -94, 237, 403]
7350D03n21J07O28o76M70j382Q25K30n37P97o69k49K07O20Qk78J5O7k38N46o99
7371c26K4l58j23J210l86j84o4M08m41n83J095j166O73N30l75r9j161J388l33
7390b71j29J339m56N32j800J079l72q96J580m04q7l61M84m95M98L9p95J120j255
7409f50J553q34n59K11N22q63N3K95L70p0R18j752O49O8M56j94j86m94N12j23
7429a18j59J277p08n54L03j9l63Q22n15o3KM79n12L93o11L02N6j45P23j036O20
7450A74q49Q66m38O83o04N8K0J07J56M81q73j56k24K4J128m39j136J122J90L79
7470F69q70N1q4J036r37L97l43N00j147M51P59m97l67J99n62J204q79j69J710
7489A121k048O50j73L67q3R2K25l58J81O28n24m1m70N62J20j278J218N43p15L33
$$ y = [403, -118, -11, 617, -59, 411, -971, -146, 84, -453, 344, -325, -574, -367, 253, 261, -17, -2, 65, -173, 373, -326, -302, -660, -783, 427, 41, -143, -207, 201, -240, -823, 272, -894, -221, 309, -66, -165, -1326, 62, -271, -400, 939, 483, 1015, -785, 294, -78, -974, 606, 202, 115, -246, 238, -257, 241, 280, -515, 605, -650, 903, 69, -490, -279, 243, -620, -567, -272, 98, 28, 946, -806, -157, -89, 367, 173, -13, -507, 5, -118, -277, 1000, 292, -262, 41, 22, -341, 481, -34, -97, -95, 384, -128, 265, -346, -44, 12, -133, 590, -446, 174, -675, 191, -247, 436, -168, -110, -90, 17, 173, 654, -219, -375, -599, -575, 553, 114, -1022, 100, 290, 669, -201, -150, -234, 802, -135, 262, -81, 419, -728, -277, 482, -15, -382, -183, -745, 459, -420, -589, 1121, -927, -277, -450, -83, -166, -74, 151, -207, -26, 602, 78, 37, -433, 129, 249, -1029, 189, 732, 17, 350]
7509C50o78R62r28K0J111n72L49Jl73p94P67n72J29M05p07R46o07j73K45K48L84
7530E13m45l04Q70r29Q72R6q60L02k33L1j27m32J036L81J28q61l38K08J81M99
7550E88q32P85j286J263K13p98m77O94j84n49J796p48J59j01p92M85p0p08J33
7569d29k6K14k32K0J748l44p77p85J073n74k20L54L51k8j05K55o86O07J03q28
7589c09J78K94r8r15R19J55M44k39n39l12K83L12n26J075n01K11J91j134K97P27
7609E13r33O37q20j63P70O6m13l0O82l45j58j03j13R71j517O09N74r93Q46o30
7629e50o03P49N10k22L86o11l79R78L00o45K82j66J15j75m34P37q3o01O98J4K16
7650E16Q9n72m86K06N59J66j74L75M3j014n2J07P9L59k14J272r73j6r98O95K98
$$ y = [350, -328, 634, -294, -274, 837, 265, 614, 615, 242, -552, 215, -357, -228, 177, -530, 416, -191, -364, -119, 129, 513, 68, -236, 634, -295, 577, 673, -187, 115, -118, -87, -214, -646, 390, 771, 899, 38, -300, -92, 89, 588, -244, 541, -745, 518, 731, -67, -544, 150, -34, -583, 1213, 465, 624, 523, -269, 216, 146, -562, -429, -455, -241, -473, -453, 1295, 951, 174, -611, 462, -112, -332, 22, 373, 345, 240, 495, -191, 416, 519, -309, -131, 163, 65, -850, 69, 224, 668, 429, -110, -422, -139, 173, -353, 722, 221, 432, 623, -511, -214, 513, -420, 217, -603, -766, 4, 70, -343, -373, 309, -36, -194, -297, -410, 561, -956, -347, 227, -766, 80, -550, -1153, -404, 106, -116, 270, -341, -720, 258, 558, -87, 195, 29, 144, -31, -465, 272, 189, -412, 286, 300, 516, 605, 33, -453, -247, 312, 478, 304, 679, 722, -292, -344, -237, -158, 201, -13, 1259, 286, 270, -728, -33, 265]
7671B65J6Pn60R20q91J540j612M53j19j47L02l72k82P38j13n42N69J01l18n17
7691e62R15m46O60k35j70n92M15l64L80P40j130R09q85L49N05k36n4R4q44k2O64
7712I1m00j6P40L39j09p41J093p72Mk6K68m6j50n8l36O70r07K32N4J35l40Q96
7734F21k99m45k84N22l57J31O89p9j33k02m73n7M26l13L42l91P9K48j76K87l07
7755a71K21l77L82L68l08R6k21Q4J6J05p21O05j89L22Pl36L17o9M14p18N01n57
7777b29M51k63o23O93o88M31P63l88R1j04m74M61N0j10J12n27OJ116n46J12k64
7798G0m2M47n63n4m09J169m17l27J81l48j13O30N59r84k96J88K74j71L41K1K45
7819D01o69R19l55J78n95J72J60m17J24J05m4m85J09K55M14j40k90K08l12L98
$$ y = [265, 281, 288, -272, 648, -243, 1297, -315, 138, 19, -128, 174, -198, -480, 258, 145, -397, 172, 273, -45, -562, 353, -93, 567, 332, 162, -430, -15, -379, 1, 741, -389, 520, -365, -16, 489, 253, 199, 293, -551, -573, 91, -309, -325, 415, 754, 645, -96, 997, 225, 229, 203, 471, 425, 275, 217, -119, 551, -356, -124, -70, 65, -275, 621, 322, -123, -407, 115, -242, -111, 578, 499, 366, 164, -309, -366, 60, -253, 89, -302, -223, 25, -151, 136, -171, 50, -327, 55, 423, 115, 211, -10, 74, 90, 195, -526, 79, -110, 212, 219, -117, 200, 131, 545, -173, 328, -229, 222, -41, -664, 29, -659, -228, 535, 147, 238, 134, -340, 121, 171, 61, 173, -354, -348, 768, 222, 334, 70, 28, 475, -88, -142, -551, 618, 201, -126, 55, -293, -406, 224, 783, -201, -497, -309, -35, -206, 135, 156, 401, -268, 651, 296, 474, -121, 51, 211, -206, -82, 23, -21, -506, -397, -142, 272, 132, -158, 50, -262, 136]
7839A36m48J71M19j0Qj50P7q51N46L43J1j2L18r53L98J03k03J40M11l19K1M59
7861F15o68m04J3L5N90L6P32m44l49n21j50Q20k24M5L46J11j149J6O74m99J30
7882b45J54L2K29j084P49j76M47j75M93rr81L29K00J47L27p50J10Q2n27l24J395
7903D23pn16J013j236O20n79NL11m65M04k40Q50o26j32K64q2J93m58J65L3J6K47
7925B03k61q2M68o24L90J49j29k27O85m84l72J45L94k35R1j53Q3ml26J83oM24
7947C12l41N19n93j11j69O81l91m4N40n43J2N7J90M0j75j30k25K78K0o2K33n2
7969D6J44k21j03K59N0l04j9J26j23P3K49l37O4p9J63j08MJ60j25R4K3N4j97J65
7993E8M8l49K42k6O3l27K13J7L4J31q2p7MJ51j71k1R5J21k21J73q2K87m19J94
$$ y = [136, -312, -141, 278, 268, 276, 126, 203, -648, -102, 241, 252, 240, 558, -395, 3, 106, -97, 43, 454, 135, 156, 615, -53, -457, -444, -409, 181, 217, 949, 505, 156, -365, -515, 305, 81, 126, 472, 583, -566, -550, 124, -375, -245, -91, -59, 170, -914, -165, -341, 106, -69, 424, 415, -566, -237, -37, 110, 437, -313, -203, -121, -648, -972, 423, 416, -100, 913, -323, 297, -282, -277, 34, -431, -27, -267, 583, -43, -175, 89, 7, 200, -258, -93, -60, -44, 203, -58, -140, 328, -296, 94, 243, 114, -113, 572, 88, -284, -139, 255, 20, 111, -42, 41, 37, -289, -106, -112, 312, -29, 490, -103, -214, -383, 298, -93, -137, 403, -140, -128, -71, 119, 159, -16, -146, -371, -93, -73, -135, 98, 46, 190, -31, -134, 125, 175, -129, -148, -22, -145, -72, 177, -160, -96, -175, -12, -120, -116, 44, -81, 13, 36, 90, -107, 58, 106, -243, -1, -27, 36, -291, -78, -61, -27, 104, 22, -55, -51, 100, -71, -92, 3, 124, -97, 76, -6, 281, -138, 56]
8017E6N5k21J17m4r6R5J82r4j13j33K86j42J08K2O5j53O5J40l7k16J47k7l09K53
8041Fj7J70l8k7j14oj96K16k2N0n9J95k81k0M21j59M8J4m79J36K56j75j09P6P3
8066d1m3N1j12K26k25R6l7K67k81j70J60L22k32J08j92j24L27k21K3J85k16J34
8088Ej18J33j63k6J3M29j43j12m02N85Q5r1j67r6j6P2K19Ql81j1K63k07k22M43
8112A00l43M17l01m6K89l92K68J94k19J44l3q6o4j65K53Q6q5O3p9K11j72P9l52
8135b33L42j09j62K68J25j29O2L1j29p8Q7r8L9p0M9M4n0k5K79p5k59J36J07k06
8159e4Q5l20K96j16L06k16M6j53J50k4Q7n4j90L09j90q5m6K18J9k17k4J05Q2J21
8183A35j24M2k19K19k54J82K9J17
$$ y = [56, 111, -110, 7, -37, -133, -38, 144, 50, -63, -196, 90, -52, 56, 78, 143, -10, 55, 195, 158, -58, 89, 62, -247, 6, -11, 159, 121, 94, -20, -26, -222, -6, -28, 22, -37, 158, -123, -143, 278, 119, 167, 181, -298, -162, 94, -81, -190, -114, -41, -84, -33, -145, 81, -144, -48, -85, 182, -99, -269, -109, 213, -19, 89, -103, -227, 100, -121, -98, 87, -129, 5, -113, 20, -143, -169, -156, 273, 130, 18, -384, 201, 286, 195, 28, -68, -84, -12, 207, 215, -166, -177, 86, -121, -343, 100, -243, 174, -127, -173, 116, -276, -8, 186, -33, 111, 78, -8, -72, -237, 16, 102, 17, 80, 1, 212, 40, 119, -233, 109, 0, -162, 106, 231, 102, 164, 195, 66, -12, 75, -23, 16, -54, -5, 39, -11, -36, 243, 168, -91, 45, 152, -54, 31, -289, 7, -109, 197, -19, 27, -126, 24, 0, 87, 33, -157, 152, -38, -123, -169, 49, 68, -149, -173, -68, 14, 135, 11, 53, -166, 53, -201, -19, 10, 127]
8191A27
$$ Imaginary data points
##PAGE= N=2
##DATA TABLE= (X++(I..I)), XYDATA
0@%%%%%%%%%%%Qj6J6j6K4l2L8m6N6p0Q4j00J16j34J58j87K19k52K88l30L78m31
33b29M89n54O25p05P92q86R91j105J230j367J516j679J856k050K265k498K751
50A442l029L336l676M051m468M936n462O057o742P537q472R590j0955J2665j4881
65h071J7881k2194K9021m2009J09952k61280J68277J54746l75444L05761j4152
76F2488j89054K18985p0085j12890J92398q3387j06842J19210K4428j13651R1549
87C3149J2350j30791Q1055k072o1652J32369p9721j2547J10652j13293L7868L1978
99C9345j20893R5327k4805n6663J21888o7310k9576R2636o7759N576M8721o7615
111c1128J1643O0072m5570k0717N8537m5476n9133R4424q789o0058R3759k7106
$$ y = [0, 0, 0, 0, 0, 0, 0, 0, 0, 0, 0, 0, 8, -8, 8, -8, 16, -16, 22, -24, 32, -38, 46, -54, 62, -72, 86, -101, 118, -134, 154, -176, 202, -229, 260, -294, 331, -374, 418, -468, 523, -582, 648, -719, 797, -882, 974, -1076, 1189, -1309, 1442, -1587, 1749, -1927, 2124, -2344, 2592, -2870, 3187, -3555, 3982, -4490, 5100, -5855, 6810, -8071, 9810, -12384, 16637, -25372, 84580, -176700, -8423, 146323, -229121, 76640, 62488, -126566, 92419, 22334, -90556, 101842, 18455, -88387, 30823, 55251, -58400, 33149, 45499, -85292, -4237, -6309, -67961, 64408, -15313, -27860, 82792, -30501, 7367, 39345, -81548, 13779, -11026, -67689, 54199, -13111, -42687, 49949, -17810, -12234, 36487, -31128, -19485, 40587, -4983, -25700, 32837, -12639, -71772, 22652, 13863, -46195, 47564, 20458]
123B0458m8555R8212p2839n0178R9983r4287r868J39086q7296k1886Q6065q3260
135b4365j525O5676n2049J1925L2310m2610J5920K6040n2052j2570M4119l1979
147b1160J3174O1141n0883N248J5975n7395M6288j6081l1231O9893n9287J6834
159g484N7205r1625N3220M490p1986R7805l8583l4734Q2425p4480J513M9125n9041
172c2150J8409J8897j3926R504J3644K840l5275K7008p080m6591O8895l4579k4181
185c4585Q4222o8352J4611M6357q9827N5338O810n1509P5145l4821j6002L8681
197B6068n0913K2709O615k5744L7637r237O154P775j8496N663k9526J3740J1351
210C796k3349M8995k2322j6872M8299n8697J3388L7353o4675M6713J5975n6208
$$ y = [20458, -28097, 70115, -2724, -52902, 47081, -47206, -57074, 82012, -5284, -27170, 58895, -24365, -25890, 39786, -12263, -338, 31972, -10638, 5282, 31322, -20730, -33300, 10819, -21160, -7986, 53155, 2272, 7520, 23495, -33900, 12388, -3693, -34924, 34969, -24318, -7484, 49721, -41904, 11316, 15806, -56180, 41625, 3042, -31692, 50733, -23747, -22234, 26891, -32150, -13741, 5156, -8770, 734, 14378, 17218, -18057, 8951, 1871, -44720, 24175, -10404, -34585, 49637, -18715, -4104, 42253, -47574, 7764, 14574, -36935, 38210, 3389, -12613, 26068, -24845, -2136, 4479, -21265, 16372, 7135, 13289, 21064, 2568, 8231, -21295, -7555, 3796, -19553, 29442, 7120, -9752, 38547, -20150, -6762, 30591, -34084, 12629, 28604, -27604]
222b7604M9951j4875m1265M4065j2743j4169L6037n614j6645J7282n474k9992
234b1046J9043J463l4121M3284K756l9059N5408j8565m0281N9478l7939j9526
246b9105O1539n4044O854M7783o7445K4610K8409n8908M3279J5811l7467L9857
258B1173n913k9129J8894j2408j7263J6664R419j3907J9042J6856l7938K2706
270H196R116m8609M7920n089l8161O2208m2073j7719N5014o3853K3613L9719n5343
283b5061M9824L416m1680L8257k6448j5972K3060j5468N560Q472O932r416k332
296h56K2695l6752J6205K4503n2639M6041j998n1040O0728l6960k2538O1937n0453
309b1127J5475L7392m5370K8579k729k7122J9970j7692K045P089k791J2358j2505
$$ y = [-27604, 22347, 7472, -33793, 10272, -2471, -16640, 19397, 13783, -2862, 14420, 8946, -21046, -2003, -540, -34661, 8623, 11379, -27680, 27728, 9163, -31118, 28360, -9579, -29105, 32434, -21610, -14756, 33027, -34418, -9808, 18601, -40307, 2972, 18783, -18684, 21173, 15260, -13869, 5025, -7383, -24646, -7982, 1437, -12470, 6572, 23428, -14510, 8196, 17312, -31297, 16623, 11534, -26627, 35581, -6492, -24211, 30803, -33050, -9437, 30282, -25061, 24763, 28179, -13501, 24756, -1692, -17664, 5396, -10072, -4512, 3960, 10892, 1476, -856, 21839, -14913, 1292, 25795, -26844, 19197, 17199, -33841, 26887, -10073, -32611, 29326, -21127, -5652, 31740, -13630, 14949, 12220, -14902, 5068, -12624, -10579, -3490, -6281, 6077, -6428]
322f428J4588o938j5648K7880k3886P413K1999l5002K5134n912l0115L8793k8318
335a6440o48M1717l6932J9815J6983l8919K2564o311k2038K3817o181o074J6666
348H019k274j0735M263R306j5996O979J9334k5090J0525J3499l4963J8826L585
361E278l0517L7522l347k4133M1771j8498k0209L1685k6904n163K4656k4472J2388
374E7J1648k1493J5106Q52j4473R168L140n023j55J0889r192r584J5462k0682
388a4280M224K2295l2353K7792J0885m0649M1249j6452l1599M6736l3211o52L7643
401B1628l8202J7056J1166k8284K0590n191n349Q427j269N495j3783J3816o154
414e4k1965L5771k0296m823L9565m0690J6399J7073m5456L6691r195k6592M2110
$$ y = [-6428, 8160, 1222, -14426, 13454, -10432, -3019, 18980, -16022, 9112, 3200, -26915, 11878, -16440, -17088, 24629, -12303, 7512, 24495, -14424, 8140, 1829, -20209, 3608, -2573, -8647, 8019, 5745, -4990, -727, 8579, -7417, -438, 18896, -6194, 4331, 17830, -17133, 1693, 5278, -25239, 12283, 8936, -15197, 26574, 8076, -12133, 19552, -7352, -12515, 12141, -12331, 57, 11705, -9788, 5318, 6170, -8303, 865, 4005, -1018, -1173, 9716, 524, -9060, 6402, -14280, -10056, 12239, -20114, 7678, 18563, -22086, 19163, 2711, -28888, 17848, -15363, -16015, 21628, -16574, 482, 11648, -16636, 3954, -1237, -6586, 1841, 572, 6067, -7716, 6100, -54, -22019, 13752, -6544, -11367, 28198, -12492, 3907, 20980, -24476, 12215, 3020, -23572, 18538]
427A8538k1316p94K1767k4902J1342k452o410J2502r827Q114n611n38J0295k2431
441a1723J7520k491j9515L5596j8329m043K6137l6476J3829J1723l1307K5538
453F459l321j5599K6161j3236k169Q807j5363N736L952j849K844n064M522n539
467c659j459P754r296J952O914n353J0438l293j0558R204j1186j014J3605j0091
481f042M428K470o664J4159r201m962J2273j7179Q071J4798j9861J1723m084j2609
495a2680J8854r661j87J2748j3369P862M087m885M16j1315J0496p229l83K0764
509A5518k2739Q232J0059k4706K8005j1232j7215L3525k7762L836K6511l7326
521a5294J5084L845j8633K6900j2358k844J4699j6530R033J328p201l034n057
$$ y = [18538, -2778, -3572, 18195, -6707, 4635, 2183, -4227, 8275, -1552, 6562, 951, 413, 10708, -11723, 5797, 3306, -16209, 19387, 1058, -2985, 23152, -13324, 505, 12228, -19079, 6459, 3138, -12461, 13700, 464, -1705, 7102, -8261, -2525, 1427, -422, 2422, -2642, 1880, -3659, -5118, 2636, -6660, -4708, 2206, -3147, 7291, 3998, -6560, 2644, -8542, -9556, 4049, -6042, -1614, 856, -5808, 8351, -850, -5812, 6461, -10718, -2647, 12151, -7710, 4013, -71, -12680, 6174, -3487, -3674, 9074, -4295, 3567, 7654, 2769, 3185, -8130, 2366, -4863, -5246, 15518, -7221, 1011, 11070, -13636, 14369, 3137, -14078, 19447, -8315, -4479, 22032, -15294, -210, 3635, -14998, 11902, -456, -3300, 11399, -5131, 3902, 5230, -1971, -5005, -10062]
534a0062J6630j1102K688J5668l0104J7608O061k4314L5118k2267j3777L9574
546B1721l4994P443K3949l9919J6933J0107j5203J9688o847p213O242l743J059
559g77k003N765j0009l221K4851j9632Q74K0584l2163J3994J6022k5791K1659
572A0153m597k0241K7198j2087j1248K2102j4641m776J9687o105n920O441n392
585E74m633Q862l147o508J2009p504m785K0366j5783q662K2063j9390K580K1209
599A7251k4797O808J0262k4561K2169j74k2477K4919q608j1043K4506j4257p969
612g971J0844q894L623N341l550k254J615J919o551R661k014j6295K1120o245
626C49j1699K5576k1139l561J9978k2630J3809P215k0886J9783n954p836J4488
$$ y = [-10062, 6568, -4534, -1846, 13822, -16282, 1326, 7387, -16927, 18191, -4076, -17853, 21721, -13273, -5830, 18119, -21800, -4867, 5240, -9963, 9725, 2878, -4335, 1907, -1836, -777, -2780, 2985, -7024, -10245, 14606, -5026, -4152, 16432, -15731, -1737, 14285, -11506, 10153, 5556, -14685, 12513, 426, -10822, 11280, -3361, -8137, 11550, 5445, -475, 5966, 574, -4059, 4803, 1656, -4852, 7157, -347, -5132, 15234, -549, -9211, 12852, -6538, -3958, 17251, -7546, -738, 9524, -15037, 7132, 6958, -15519, 9400, 792, -10251, 14255, -2, -7971, 2873, -6021, -2398, 2943, -607, -2861, -1246, 673, -5878, 3783, 1769, -14526, 6594, 349, -11350, 14226, -6913, -10474, 9504, -13126, 683, 7898, -12988, 6795, 841, -6995, 7493]
639G493j2328L322l0k059J0015j1752Q633Q51j3418J8815j2400r08J5916k3072
653a0922J5254M914j9872K1335j2323o153J8976j6617Q521L730j4043J6041r110
666b69k062R548j3801R406l46m634R337j0796M732K360r014J2104q196m73Q916
681F812j3422J1486k529j0721J4971j2180K020J2166j5990R372K124j3101J5111
694F119p301m419J1320j1186L759N089p782N022n58k648K490r67N84k34J002j612
710a322k69L605m503j415P171p664L232P904j3150O839N346j4894J5086l242j0540
725g816J8123j0504n349J6789j5830J806J0415j3537R562M3n772O142k600j018
739D54j97m95L458p919J0146k702r375J6810j3117k062J5741j8154R047O582j8159
$$ y = [7493, -4835, -1513, -1543, -3602, 6413, -5339, 3294, 4145, -9273, 9542, -2858, -3766, 12150, -10922, 4332, 9246, -10626, 10709, -1614, -7767, 11209, -5408, 3113, 6843, -7200, 8841, -269, -2331, 7217, -6584, 2822, 2476, -2158, 7179, -3617, 1115, 3475, -5539, 6565, -1631, -2104, 6812, -6610, 4876, 2347, -8374, 6597, -5583, -3563, 8603, -7387, 1985, 4109, -8992, 6119, -1182, -5601, 5719, -5467, -1708, 3381, -4401, 621, 63, -2585, -95, -1062, -478, -712, 290, -1322, -1591, 2014, -2489, -3904, 3267, -4397, -1165, 6739, -6411, 428, 5774, -9120, 5966, 2724, -7816, 10307, -197, -5546, 11243, -4587, -2781, 7634, -5903, 3659, 3702, -2070, 4072, 1472, 454, 257, -238, 3220, -4699, 5447, 2745, -6630, 10180, -2937, -4999, 10742, -7412, 1635, 8217, -9942]
754i942J6777o642q480J6183j2718M003M770q806P554m205R2M292q246Q374n460
769b454r33P878j3634J0174J197j3398K0829j3229k791J7779k1622J0736O139
782F671j8593J7270n361r302J5036r115J317M950m167K848j879K872k959j423
796a835N753r487O439M233j3410J5497n101r734J7968j2738P20J2167j6489Q191
810B174L879j3193J2375k794p503J1235n325k358O812m532L97J398l096Q52J298
825A619j855j266K892q15l332N739r58n393P419m487k840Q495q672J490O184j2124
841g904Q567K737j0857J1623l086o742J0633q150R18N479q718N757j230k517M976
856A486m112M252l825r74Q772j1414P194L798j4167J4281o133o392J6814j5816
$$ y = [-9942, 6835, 193, -8287, 7896, -4822, -819, 3951, -4855, 2699, -1506, -1414, 2878, -5368, 3006, -2454, -3387, 4491, -9143, 1031, 2228, -11170, 9659, -3570, -6361, 11418, -10204, 532, 6671, -11922, 5348, -13, -9315, 5721, -3394, -2077, 2873, -1294, 1554, -325, 2547, -412, -1835, 3918, -5569, 870, 5103, -8307, 7190, 2089, -7645, 10323, -2415, -1695, 10472, -6017, 2174, 6053, -7140, 5235, 2441, -5062, 6173, 848, -1510, 5302, 770, 1167, 2565, -531, 321, 1619, -236, -1502, 1390, 575, -2757, 2982, 2024, -3369, 4050, -437, -3277, 5218, -3454, -1964, 4220, -7904, 663, 3400, -7457, 4166, 1080, -5662, 4971, -3179, -2261, 3218, -5500, 257, -973, -3490, 1486, -2626, 1626, -2199, -3173, 5599, -5815, 1379, 5177, -8990, 5291, -842, -7234, 9580, -6236]
870f236M336J0236j6893J2750L00j0160J1062o925M4M394m950N041l633J797M83
885A646m443R115r160K358Q612j6877J3342R61j5083J9403j1619m985J8427j8781
899g084P067R846j8972J2291Q49j1517J1503l633l581M716j866j47L77K302m582
914b431j92N813q988N813M830j2698R889n98r594J3830o175m187J0191r944K618
929a823O201r213M689J07m763N907q80j99J419k428K572j858L91K430n731L094
945h5J032m250O937l246l121P709o070J846N386q405M960k3n840O679m395j528
961b414N391m059L858J89k509L467l814J925j18l478L874n644L310L492q289Q480
977C661l182m658J1925r209K465M924j4246J0891j551q467J1658r391J733P543
$$ y = [-6236, -1900, 8336, -8557, 4193, 4493, -5667, 5395, -1530, -1486, 2908, -2042, 2999, -634, 1163, 1646, -2797, 6318, -2842, -484, 8128, -8749, 4593, 5554, -9529, 9874, -1745, -6730, 11697, -7084, -17, 9829, -9143, 3148, 3997, -7520, 3983, 350, -3231, 1485, -381, -528, -151, 2151, -2431, -2623, 3190, -5798, 15, 4845, -7853, 2036, 1438, -8156, 5674, -501, -4688, 5503, -4441, -1823, 4378, -4835, -146, -39, -4802, 1105, 225, 26, 1445, -983, 1589, -269, 122, 2552, -3179, -85, 947, -3303, 3634, 388, -2733, 4976, -1094, 752, 6138, -2267, 2693, 2670, -3170, 3509, -886, -2414, 2977, -1082, 2776, 2965, 456, 3923, 109, 2034, 1916, -1562, 2312, -3332, -22, 3470, -4819, 3661, 479, -4179, 7746, -1463, 1002, 5926, -8320, 2571, 1020, -7447, 4211, -5180, -3447, 4096]
991D096q864J0458m482p194J1349r357K518M904r856N973j579k518O880l965O07
1006a030L88Q86K867n558N754m642o540J2752r507K95J0986j4682R560N012j2637
1021f096J3153n694p612J2939q761o3O505q641L292J862j076K863k898K118k58
1036A633N86J498n103L700l541m035J0538o355k047Q964q497M178M864r309N998
1051C072r55p974R594j962o448N541j585k777M681P50k524R63J126k803K183R17
1067A799p171L925K456p962R190M35r820J1537l642n557J2130j0008j923R524
1081D913j0654N459M367j1196P946Q22m939O103q00k457J56J836j211k278M390
1096B457n745Q29Q117j0045O636M174j3949J2620r80j0440J3866r013k377J0588
$$ y = [4096, -4768, 5690, 1208, -5986, 5363, -3994, -1476, 3428, -6428, -455, -2034, -4552, 2328, -1637, -1030, -642, 244, 3111, -2447, 3307, -1335, -7875, 4877, -4630, -4335, 6651, -8031, 1529, 6541, -6096, 7057, 1363, -6249, 6690, -2071, -2134, 4371, -4270, -978, 884, -192, 2671, -227, 1891, 1633, 2219, 3717, -1386, 2314, -1227, -5262, 5276, -1079, -3126, 5838, -2659, 1519, 6383, -2926, 3072, 2117, -5857, 3737, 1775, -4673, 868, -717, -3494, 1187, 1937, -587, 376, 1502, -1301, 882, 1799, -5372, -1447, 1009, -6953, 2237, 2672, -7148, 4389, 747, -4810, 7320, -2688, -4611, 4913, -5741, -282, 4085, -7111, 835, 1657, -3282, 2821, 2021, -436, -280, 1556, 345, -1933, 2457, -3288, -2459, 5658, -4387, 2249, 6423, -7526, 5094, 4114, -6326, 7540, -1473, -3850, 6738]
1110F738j0212M630K641p887P033k058L02J833l824L567m570J533L613q436P955
1125B858j922m784J0400q449P63N709j1042P978P31p772Q969n381q06N318n931
1140c361M394j506j601M262m456L143j648l609N769n948K446M676p550O875J30
1155B016n374P317n837j670N691o154L942J284m677N618l016r2K890l324K853
1170A467q7j758K517l072j0J389l942M016L63j376L649j836p32L805m807J481
1186A067O3k393J848q16M24J567l224L972j075j813N241n442J103L173p495M977
1202A177j198n200P644m047m4O123n715M128o09m463M647m964O74J955m009M948
1218A047l067K01M426o138O092j201m132P572p011R06L837r553P649j227n209
$$ y = [6738, -3474, 1156, 3797, -4090, 2943, 885, 1187, 3020, -804, 2763, -1807, -274, 3339, -5097, 2858, 936, -3848, 6552, -1897, -1134, 4575, -6467, 1511, 2242, -5530, 3439, -1942, -2748, 2570, -3361, 1033, -473, -2074, 2188, -2268, 875, -773, -4382, 1387, -4561, -2115, 2561, -4989, 1886, 2016, -3358, 3959, -1878, -3548, 2143, -4011, -69, 1215, -3462, 2156, -860, -952, 1938, -1386, 1467, 1380, -378, 2139, -933, -943, 446, -3496, 520, 883, -493, 3156, 1320, 588, 4393, -414, 1067, 1130, -1263, 585, -231, 193, 1760, -1464, 2508, 1433, -380, 4861, -581, 522, 3695, -3800, 1177, -21, -5221, 2423, -1624, -1668, 4455, -1260, 2868, 2259, -2204, 2443, -2521, -1847, 108, -3901, 1047, -2020, -1819, 2607, -3531, 2561, 1360, -2772, 4800, -2211, -1305, 2532, -7021, 628, -599, -5808]
1233e808R837n318P85N333o698L658o72l364L385l942L140p10k268N561n560L546
1249I05L309q229R505l356n425R437q160n27N487q587N976K308m798N911k398
1264A358p58J920j995Q16k121K33R67k830L430j908p93L855l990K440L200n481
1280a657L893r25m553M294l240j315M475l616J948L175l861K360M28l016J630
1295B0r66l93J011j397R83r13L12J440j838K999o94j876M517m260k75L269n656
1312c717K691J516l701O108k328j195M587n409K284J378m603M150k377o9K783
1327B098l502L016j009j467M134l710K115J466m249M345m528m14N146p218N307
1342A530J656n235O985m513j003M889p672L867J218n069O009k993m29K599m798
$$ y = [-5808, 4029, -1289, -504, 4829, -1869, 1789, 1117, -2247, 1138, -2804, 336, -374, -2642, 2919, -2641, 905, 4214, -4015, 5490, 2134, -3291, 6146, -2014, -2541, 2946, -5641, 335, 2643, -2155, 3756, 1358, 600, 2520, 525, 1341, -780, -547, 420, -2410, 1020, -888, -1681, 2174, -1816, 624, 3824, -1657, 2236, 1311, -3242, 1052, -2188, -3503, 972, -2644, -696, 2479, -1382, 978, 1406, -1610, 20, -946, -1339, -328, -1725, -742, -1655, -1343, 97, -1741, 1258, 564, -1312, 3205, -1055, -1330, 1939, -3717, -1026, 490, -3211, 2897, 569, -626, 3961, -1448, 836, 2214, -2389, 1761, -616, -685, 2098, -1404, 1612, 603, -864, 3270, -440, 1675, 3141, -1108, 3237, -1291, -1705, 3441, -3777, 1530, 3186, -2049, 4936, 423, -580, 4309, -3363, 504, 1722, -3347, 2662, -331, -760, 1839, -2959]
1357b959M455q11j970M253m115J560j199k001M811n272J199M350n776N477Pm809
1373b800N400n125K87M670n859K835J667l820L477j658l72J667j591J700m52k55
1389b29J526k966J375n27j880M002k858K052L145m868J949J347m447L033j82k171
1405a699K947j709M10K247k505O96R54j626J890r67Q92j173j365J949k417L22
1421a154K186k595L602K39l409M870l512k613M114m486J298L182m480L868r25
1436A85k617M576k721P8K161k469J976k065M38J1l077L594j392j537N790m415
1452a484K734J541n835M134k096k850N919m539J598K834m769M407j487r78L163
1467B292l358K959o14k418L761m587P83K847n457O466j277k990O722n176R86J822
$$ y = [-2959, 1496, 685, -1285, 2968, -1147, 413, -786, -2787, 2024, -3248, -2049, 2301, -3475, 2002, 2009, -2800, 2600, -2525, -2238, 2432, -3427, -592, 1075, -2745, 732, -926, -1298, 369, -1222, 478, 26, -229, 1297, -1669, -294, -821, -2701, 1301, -1557, 495, 3640, -1228, 721, 2068, -2379, 654, 472, -1699, 1248, -461, -51, 2196, -309, 387, 1341, -285, 1605, 638, 1530, 357, -1008, 941, -1476, -1154, 1032, -1563, 2039, 2278, -1131, 3739, 227, -2386, 1728, -2758, -1460, 1722, -2758, 1110, 185, -2432, 2144, -577, -499, 1662, -807, 1169, -896, -458, -447, -3524, 70, -1322, -2859, 2931, -1484, 1250, 2791, -3044, 1090, -1006, -3856, 2063, -2476, -878, 1956, -2813, 1594, 107, -871, 2292, -1066, 1893, 1279, -1139, 2622, -1965, -1182, 1665, -3792, 2674, 1397, -1593, 5129, -47, 939, 2761]
1483B761n485L361K1j931L326k910J441J28k189L586k389J426J262m207M362j786
1499G77l099L684m571J858L259l956M184k50m511M212k751j05J822k620J209N69
1515b89j028J927k467J366M42j084K728r82j213J978k862N45J082l223K379k94
1531i95o79L943j551j818K060j632m03P56k12O82k97l61J135k080J957j705k5
1548a225L304l579L498M47m548L952l046k116N647m456K055L820m882M213k242
1563H42k110K287j423J166L20k389K914k032N14Q91l172M590k334j249N153m902
1579i34N46K242o374M998m1l041M917l614J510J874l227J287k385J022J284k057
1595a993M018k481j156M259o151L355K545o137N877j057l776N561m865k2L714
$$ y = [2761, -2724, 637, 658, -1273, 2053, -857, 584, 712, -1477, 2109, -280, 1146, 2408, -1799, 2563, 777, -2322, 1362, -3209, -1351, 1908, -2048, 2136, 1886, -2625, 1587, -1164, -1269, 553, -2067, -858, -289, -1317, 610, -1857, -491, -49, -1133, 1595, 613, -600, 1378, -1484, -939, 143, -3080, -701, -995, -1674, 2269, 718, -1100, 960, -672, -1075, -319, -531, 151, -146, -507, 628, -1452, 505, -1200, -1225, 2079, -1500, 1998, 2445, -2103, 1849, -1197, -3313, 2334, -2122, -67, 3753, -1129, 3084, 842, -1268, 1019, -404, 762, 1082, -1307, 1607, -425, 89, 980, -2192, 2398, 64, -1185, 3968, -934, -388, 1854, -4520, 478, 437, -2604, 2313, -1301, 209, 2083, -1144, 143, -2242, -1220, 64, -1993, 2025, -456, -1612, 2647, -3504, -149, 2396, -3741, 2136, 1079, -2697, 2864, -2001, -2023, 1691]
1610A691l636K200J110j810J976j542M75l80m23K21j628L062n49j825L398l136
1626g96j06L256l699J862K769n177L380L3l129K583j896m48K799j327P71J649
1642B524j681k93J17o60o96L62J472j419J39J362k555J667M88l008K788K13k539
1659a719L825k569q17K492l621J362K128k849J710Q92p35N37j731O73m49j54J606
1676E81k289K846l89k548L794l545N29L512m827L176O24m681N082l169r75M324
1692B045l168J687J548k633K755k230l21J253k760L044j271l21K571k768J315
1707G46O93k626L026j502q1K289l215J261Lk075K218j830J306J504k257K744j700
1724E04q15J693l416J580J684l233L831j647j617K887l139J008J614k282K304
$$ y = [1691, -1945, 255, 1365, -445, 1531, -11, 464, 84, -339, -118, -1746, 1316, 767, -1058, 2340, -796, -902, 2354, -1345, 517, 3286, -1891, 1489, 1522, -1607, 976, -920, -1368, 1431, 104, 875, 2524, 843, 550, 667, 7, -689, -327, 1145, -274, -135, 1227, -1328, 339, 827, -2181, 607, 820, -1719, 2106, -463, -1280, 1212, -2409, -1047, 1081, -1768, -58, 834, 99, 636, -1095, -422, -871, -1025, 581, -1708, 1138, 749, -1799, 1995, -1550, -1021, 2491, -2336, 840, 1464, -3217, 1865, -1304, -2279, 2045, -1123, 564, 2112, -521, 2234, 4, -317, 936, -1824, 1220, -51, -372, 2199, -569, 746, 1439, -1187, 1839, 337, 256, 2545, -670, 591, 594, -1481, 737, -1093, 213, 1717, -540, 2204, 504, -311, 1382, -2034, -454, 1230, -2003, 1828, 181, -1436, 1451, -1688, -680, 934, -1348, 956]
1739I56m93j227J682k035L3N84j174J785n67Q60Q23k201Q23j55j572K302j083
1756f59K18P79q53L98K86j129J450l86r0J478j072N1Q6j384J299j374N5J749j634
1775g32K427j254j110K608k835K33K144k469J836K56k182K949j571r75J601j614
1791f88J442O7n92J103k159R22L06j901J599m01K26J863k333J108O17k908K737
1808A008j577o15K949l494K526j19k474K938k446N54J555j780J753j426l0J207
1824E29l183J944Q20j926L061n38j183J749k548J970o5k398L126j484l79J445
1840I40j460P94m03r77J787p67Q35O89j692J451j207j159K178k488J975J020j981
1857d65J531m23j123J706j178L52M44j036J093l72k32P8j145N67J70k47J516r54
$$ y = [956, 463, -764, 918, -1117, -1084, -500, -1674, 111, -456, 404, 1227, -974, -151, -306, -1878, 424, -659, -441, 338, -515, -117, 169, -960, 490, 104, 14, 1492, 420, 471, 557, -827, 472, -902, -847, 902, -732, 1695, 441, -669, 1939, -896, -663, 1481, -988, 848, 1104, -1078, 1871, 300, -675, 926, -688, 754, 821, 229, 1332, -827, 95, 401, -1500, 99, -302, -76, 1787, -546, 562, 1179, -1729, 1008, -569, -1184, 1765, -1729, 797, 678, -1796, 1142, -1304, -750, 805, -975, 778, -648, -678, 529, -2654, -710, 110, -1816, 1245, 707, -476, 1273, -1275, 695, 630, -1768, 1358, -126, -505, 940, -520, 274, -129, -1106, 681, -86, 749, 1438, -254, 1197, -10, -1169, 1009, -1479, 496, 1516, -465, 1066, 643, -480, 1226, 48, 400, 844, -192, 901, 529, 297, 375, -770, -203, -33, -280, 1236, 282]
1875B82o0K56j743L02Q37j593K204p61m12J608j556k0J466j789R04L05o01Q58
1893D87j466J277j217j54J021j109J114P49k376K665p53j935K015j804K61K196
1909I71j283M80j46j008J550r03m84J434j334J751o53oN04k143J982r6j998L451
1927B069k311q71K990k389J233N62l753L961j301j82J549k738K638j316K56m34
1943c7n96J703L00k597K965k235L16Q30j826J289R80k146K171j488M8J155j647
1960h15M35P96q28J169k63p9p95o12Q33m79M18L76q62J456k60j586J746j402n58
1979a310K405k220Q97J440k400J267K03j349J623j62q99J100n73k6K87l1k45m43
1997d36P53m13K40Q34q17l9R37j851J329K70j637J828n55q82J759j717K02P67
$$ y = [282, 222, 478, -1265, -963, -126, -1719, 485, -276, -688, 920, -636, -656, 810, -979, -75, 230, -371, 487, -979, 298, -919, -1073, -52, -1161, -47, 702, -1674, 991, 238, -1697, 318, -1486, -1225, 971, -312, 168, 22, -986, 564, -339, -823, 611, -723, 1028, 375, 369, 873, -1270, 712, 616, -1382, 2069, -242, -1113, 1877, -512, 721, 1283, -2470, 1491, 190, 8, 1557, -1181, 1457, 141, 397, -37, -633, 1070, 1370, -1227, 1738, -497, -181, 649, -1177, 112, 1092, -1054, 1117, -371, -323, 832, -815, -380, 416, -412, 757, 494, 415, -380, -992, -159, -638, -220, 156, -706, 750, 490, -1096, 650, -752, -1310, 1095, -1125, -228, 1212, -1188, 79, 282, -1067, 556, 394, -505, 595, 22, -4, 283, 252, 7, -436, 317, -96, 144, 978, 161, 122, 1059, -792, 537, 807, -830, 998, 443, -439, 1320, -397, -195, 572]
2015E72j191J437k12q51R74q21K2q5n04J260j406M87R30j762J806p36j228K418
2033A110k057J46J757k559J801l7j585J768j079NR45q29R70r35K09N65j521J727
2051D01n35j087K228k021M65J646k644J818l17j111K122j256q8J024j618J233
2067B60m7q20J072q00P25k8n10J260j314K01R93j663J553l25j079J793j276r3
2085i8J329j861Q85N70r75Q27n75k52O53Ml71K82k88J68r15J174n56o82J169n10
2105b2r85K255j786O11P63j874P75L81j748K211p00m35R42j041M85L9L56k11q86
2124h70O69J13m54R67j054J07O18j062R72O56j023Q45m88o28J829j517P7R91j270
2143e22Q25m73L7N46n82L06l28l71J431j687J100m1j157K082j145j075K312j671
$$ y = [572, -619, 818, 606, -245, 729, -92, -70, -155, -659, 601, -805, -318, 612, -1150, 656, -80, -1308, 1110, -947, -801, 956, -1603, 198, 161, -1424, 344, -735, -730, 215, -614, 356, -579, -370, 195, -1326, 401, -134, -1221, 1007, -1014, -549, 1097, -1547, 271, -46, -1157, 965, -291, -379, 645, -973, 260, 213, -607, 465, -335, 390, 362, -148, 1112, -202, -1, 992, -671, 882, 557, -522, 1271, -5, -98, 1231, -630, 255, 825, -150, 677, 102, -150, 503, 507, 136, 418, 130, 298, -617, 557, 1, -681, 488, -22, -1007, 1248, -538, 73, 836, -1038, -263, 118, -1630, 581, -119, -554, 388, -653, -168, -129, 227, 16, -870, -201, -88, -542, 425, -629, -522, 96, -966, 6, 662, -361, 484, -4, -632, 1197, -320, -243, 748, -522, 303, -170, -133, 413, -169, 137, -191, -562, 869, -818, 282, 241, -916, 1166, 21, -1054, 1258, -413]
2161d13J057K78o83j26L92j113J251q11M68O74j556J291o92K20P92j690J542j355
2179d74n03J703k079J97J415j918J357K25p47J578j59j185J834k153P89N70m16
2196C4N5j057P30n6P8P97j109K98J326k284K230j511r18K189p64k25J141j680
2214g26R98K52j436J145L25l28R34j223K21K14l42k76l9R60Np81R82j579J475
2233G81q9j521N06J306j244O95O41j469Q13l81k9L89l08l91K68j85N93p37K48
2252a14P1j203J200o21N56Q86j232N74O3j283J498q23m94J080j102K01Q85j056
2270i14J418o92O9O61j388P27J2l71J656k372J115R05j781J879j601Q34N02j479
2288h20P39K26q97J307n11j099J846r63j84J325j731J717j053l51K227k268J462
$$ y = [-413, 644, 922, 239, 113, 505, -608, 643, -168, 300, 974, -582, 709, 17, 237, 1029, -661, 881, -474, -977, 726, -1353, -1156, 259, -1659, -302, -77, -824, 754, 595, -590, 1244, -909, -120, 450, 34, 89, -968, -238, -294, -216, 581, -528, -230, 1096, -1188, 1042, -469, -1387, 802, 38, -187, 954, -726, 272, 524, -912, 233, 558, 230, 1164, -59, 162, 376, 34, -242, -281, 679, 684, -97, 885, -694, 781, 692, -829, -323, 983, -261, 434, 1075, -394, 419, 38, 9, 398, 90, -301, -33, -218, 375, -362, -114, -43, -1246, -46, -667, -111, 775, -457, 117, 180, -1103, 395, -428, -922, 158, -944, -743, 142, -914, 504, -188, -119, 542, -846, -119, -107, -478, 1178, -1194, -79, 826, -955, 924, -677, 157, 659, -820, -81, 145, -752, 555, 44, -1055, 791, -172, -356, 969, -762, 955, -98, -449, 1778, -490, 972]
2305I72q81J3J095j783J281n19j77J001k77j018P49j072J164oj242J469p99Q12
2323G82j34j158k63J361j261J049r90M31R52r92K13P8o91J054J95j220J491j159
2341b62q9J20K35k15J09P19k66q90J947j427m3Q75j399M00Q64j056N95k27j014
2360a024J852j333K34J243o04L64j28k69K04K62j11j252N94Q98o76o11Q67j081
2378e71M55J001j521J198n65j06P02p74Q78r85l46J494o81k94J350j585P61O22
2396A033j796Q05p26O60L51k63K85o28n56J210j424J549l98j303J902q04m88O20
2414B9l56j5J315r09L74j269M24M53o04M00j75l70P11J16l32M74j197J183l16
2433f4p06K056k76j059J35o15J065q59k62J429n25j045J316l63K30Q1q59L66M22
$$ y = [972, 91, 104, 1199, -584, 697, 178, 1, 1002, 725, -293, 456, -616, 548, 542, -700, 769, -30, 782, 648, -510, -773, 588, -673, 376, -614, -183, 769, -223, -10, 68, -623, 431, 626, -594, 897, -262, -351, -231, 4, -211, -102, 617, 351, -539, 1408, -19, -62, 813, -586, -186, 678, -378, 217, -10, -1024, 828, -505, -271, 972, 368, 732, 604, 335, 539, 801, 690, -562, 32, 930, 254, -357, 510, -571, -116, 885, -636, 562, -3, -109, 593, -181, 697, -288, -634, 860, 179, -115, 1235, -350, 411, 1033, -763, 42, -684, -24, 327, 64, 349, -279, -835, 375, -1049, 500, 102, -1201, 701, -103, -591, 29, -327, -342, 973, 64, 438, -831, -407, 46, -558, -158, -333, -703, 8, 124, -208, 266, -931, 252, -64, -770, 1286, 1010, -49, 86, -529, 536, -323, -585, 844, 319, -726, 590, 227, 457, 538, -321, 45, 467]
2452D67r14Q21k86J35m16N12P70j557J033K06o73j57M48K07j01j294J365o26l02
2471c62Q43k39K50l29p1l92k29k93O51R2r4L22j076J224l4j416J602k70j34M30
2491D75r39Q6j40o13J046l07J43Q56j096J038j047K86Q2q13P00j35k26J810k068
2510h62M1J092p97P9R28l73P53j163m98J101r16K72j46J223l21j93Q9%n40R44
$$ y = [467, -447, 374, 88, 223, -193, 319, 1089, -468, 565, 771, 98, -59, 389, 596, 495, -799, 566, -60, -362, 481, 242, 492, 163, 92, -300, -529, -822, -171, -79, -173, 149, -927, 297, 263, -1153, 449, 179, 45, 475, -464, -378, -518, -1131, -85, -392, -249, 607, -489, 549, -498, -212, -130, -943, -243, -378, -604, 1206, -862, -821, 271, -526, -447, 481, 108, 861, -302, -800, 301, -615, -343, -489, 734, 413, 220, 309, 309, -231, 713]
$$ [...]
8191a25
##END NTUPLES=NMR FID
##END=
