##TITLE=1H_L3-5MeOTr-b
 CDCl3, 8 sc, 
 29.12.2020
##JCAMPDX= 6.0         $$ Bruker NMR JCAMP-DX V2.0
##DATA TYPE= NMR FID
##DATA CLASS= NTUPLES
##ORIGIN= UXNMR, Bruker Analytische Messtechnik GmbH
##OWNER= root
$$ XWIN-NMR		Version 3.5
$$ Wed Dec 30 10:45:00 2020 Russian Standard Time (UT+4h)  she@DPX200
##.OBSERVE FREQUENCY= 200.1315066352
##.OBSERVE NUCLEUS= ^1H
##.DELAY= (6, 6)
##.ACQUISITION MODE= SIMULTANEOUS
##.ACQUISITION SCHEME= undefined
##.AVERAGES= 8
##.DIGITISER RES= 18
##SPECTROMETER/DATA SYSTEM= spect
##.PULSE SEQUENCE= zg30
##.SOLVENT NAME= CDCl3
##.SHIFT REFERENCE= (INTERNAL, CDCl3, 0, 15.7039)
##AUDIT TRAIL= $$ (NUMBER, WHEN, WHO, WHERE, WHAT)
$$ ##TITLE= Audit trail, XWIN-NMR		Version 3.5
$$ ##JCAMPDX= 5.01
$$ ##ORIGIN= Bruker BioSpin GmbH
$$ ##OWNER= she
$$ F:/spectra/data/she/nmr/H-F/1/audita.txt
$$ ##AUDIT TRAIL=  $$ (NUMBER, WHEN, WHO, WHERE, WHAT)
(   1,<2020-12-30 10:43:20.73 +0400>,<she>,<DPX200>,
      <created by zg, POWCHK disabled, PULCHK disabled
       configuration hash MD5:
       00 E9 B6 7A A2 85 ED C7 34 08 36 98 17 FE 4E 26
       data hash MD5: 16K
       04 0F 00 7B 00 72 1B A8 A1 87 51 FE 5B 63 B2 AF>)
$$ ##END=
$$ 
$$ hash MD5
$$ 65 3E D3 2D 98 ED 69 09 27 5C AE 8E 88 98 EE D1
##$RELAX= 
##$RELAX= 
##$RELAX= 
##$RELAX= 
##$RELAX= 
##$RELAX= 
$$ Bruker specific parameters
$$ --------------------------
##$DU= <F:/spectra>
##$EXPNO= 1
##$NAME= <H-F>
##$PROCNO= 1
##$TYPE= <nmr>
##$USER= <she>
##$AMP= (0..31)
100 100 100 100 100 100 100 100 100 100 100 100 100 100 100 100 100 100 
100 100 100 100 100 100 100 100 100 100 100 100 100 100 
##$AQSEQ= 0
##$AQ_mod= 1
##$AUNM= <au_zg>
##$AUTOPOS= <>
##$BF1= 200.13
##$BF2= 200.13
##$BF3= 200.13
##$BF4= 200.13
##$BF5= 200.13
##$BF6= 200.13
##$BF7= 200.13
##$BF8= 200.13
##$BYTORDA= 1
##$CFDGTYP= 0
##$CFRGTYP= 5
##$CHEMSTR= <none>
##$CNST= (0..31)
1 1 145 1 1 1 1 1 1 1 1 1 1 1 1 1 1 1 1 1 1 1 1 1 1 1 1 1 1 1 1 1 
##$CPDPRG= <>
##$CPDPRG1= <>
##$CPDPRG2= <>
##$CPDPRG3= <>
##$CPDPRG4= <mlev>
##$CPDPRG5= <mlev>
##$CPDPRG6= <mlev>
##$CPDPRG7= <mlev>
##$CPDPRG8= <mlev>
##$CPDPRGB= <>
##$CPDPRGT= <>
##$D= (0..31)
0 1.2 0 0 0 0 0 0 0 0.06 0 0.03 0 0 0 0 0.0002 0 0 0 0 0 0 0 0 0 0 0 0 
0 0 0 
##$DATE= 1609310600
##$DBL= (0..7)
120 120 120 120 120 120 120 120 
##$DBP= (0..7)
150 150 150 150 150 150 150 150 
##$DBP07= 0
##$DBPNAM0= <>
##$DBPNAM1= <>
##$DBPNAM2= <>
##$DBPNAM3= <>
##$DBPNAM4= <>
##$DBPNAM5= <>
##$DBPNAM6= <>
##$DBPNAM7= <>
##$DBPOAL= (0..7)
0.5 0.5 0.5 0.5 0.5 0.5 0.5 0.5 
##$DBPOFFS= (0..7)
0 0 0 0 0 0 0 0 
##$DE= 6
##$DECBNUC= <off>
##$DECIM= 32
##$DECNUC= <off>
##$DECSTAT= 4
##$DIGMOD= 1
##$DIGTYP= 9
##$DL= (0..7)
0 120 120 120 120 120 120 120 
##$DP= (0..7)
150 150 150 150 150 150 150 150 
##$DP07= 0
##$DPNAME0= <>
##$DPNAME1= <>
##$DPNAME2= <>
##$DPNAME3= <>
##$DPNAME4= <>
##$DPNAME5= <>
##$DPNAME6= <>
##$DPNAME7= <>
##$DPOAL= (0..7)
0.5 0.5 0.5 0.5 0.5 0.5 0.5 0.5 
##$DPOFFS= (0..7)
0 0 0 0 0 0 0 0 
##$DQDMODE= 0
##$DR= 18
##$DS= 0
##$DSLIST= <SSSSSSSSSSSSSSS>
$$ [...]
##$SUBNAM2= <"">
##$SUBNAM3= <"">
##$SUBNAM4= <"">
##$SUBNAM5= <"">
##$SUBNAM6= <"">
##$SUBNAM7= <"">
##$SUBNAM8= <"">
##$SUBNAM9= <"">
##$SW= 16.9725356469052
##$SWIBOX= (0..15)
0 0 2 0 0 0 0 0 0 0 0 0 0 0 0 0 
##$SW_h= 3396.73913043478
##$TD= 16384
##$TD0= 1
##$TE= 0
##$TE2= 300
##$TE3= 300
##$TEG= 300
##$TL= (0..7)
0 120 120 120 120 120 120 120 
##$TP= (0..7)
150 150 150 150 150 150 150 150 
##$TP07= 0
##$TPNAME0= <>
##$TPNAME1= <>
##$TPNAME2= <>
##$TPNAME3= <>
##$TPNAME4= <>
##$TPNAME5= <>
##$TPNAME6= <>
##$TPNAME7= <>
##$TPOAL= (0..7)
0.5 0.5 0.5 0.5 0.5 0.5 0.5 0.5 
##$TPOFFS= (0..7)
0 0 0 0 0 0 0 0 
##$TUNHIN= 0
##$TUNHOUT= 0
##$TUNXOUT= 0
##$USERA1= <user>
##$USERA2= <user>
##$USERA3= <user>
##$USERA4= <user>
##$USERA5= <user>
##$V9= 5
##$VALIST= <valist>
##$VCLIST= <CCCCCCCCCCCCCCC>
##$VD= 0
##$VDLIST= <DDDDDDDDDDDDDDD>
##$VPLIST= <PPPPPPPPPPPPPPP>
##$VTLIST= <TTTTTTTTTTTTTTT>
##$WBST= 1024
##$WBSW= 4
##$XGAIN= (0..3)
0 0 0 0 
##$XL= 0
##$YL= 0
##$YMAX_a= 163999
##$YMIN_a= -174617
##$ZGOPTNS= <>
##$ZL1= 120
##$ZL2= 120
##$ZL3= 120
##$ZL4= 120
##$ABSF1= 10
##$ABSF2= 0
##$ABSG= 5
##$ABSL= 3
##$ALPHA= 0
##$AQORDER= 0
##$ASSFAC= 0
##$ASSFACI= 0
##$ASSFACX= 0
##$ASSWID= 0
##$AUNMP= <proc_1d>
##$AZFE= 0.1
##$AZFW= 0.1
##$BCFW= 1
##$BC_mod= 2
##$BYTORDP= 1
##$COROFFS= 0
##$CY= 11.3945322036743
##$DATMOD= 1
##$DC= 2
##$DFILT= <>
##$DTYPP= 0
##$F1P= 15.9154993809931
##$F2P= -4.1035820241983
##$FCOR= 0.5
##$FTSIZE= 0
##$FT_mod= 4
##$GAMMA= 1
##$GB= 0.15
##$INTBC= 1
##$INTSCL= 1
##$ISEN= 128
##$LB= 0.24
##$LEV0= 0
##$LPBIN= 0
##$MAXI= 10000
##$MC2= 0
##$MEAN= 0
##$ME_mod= 0
##$MI= 1.114404
##$NCOEF= 0
##$NC_proc= 0
##$NLEV= 6
##$NOISF1= 3.799351
##$NOISF2= 2.8
##$NSP= 1
##$NTH_PI= 0
##$NZP= 0
##$OFFSET= 15.70392
##$PC= 1
##$PHC0= -10760.03
##$PHC1= 8.80095
##$PH_mod= 1
##$PKNL= yes
##$PPARMOD= 0
##$PSCAL= 0
##$PSIGN= 0
##$REVERSE= no
##$SF= 200.130013532006
##$SI= 16384
##$SIGF1= 3
##$SIGF2= 2
##$SINO= 400
##$SIOLD= 16384
##$SREGLST= <1H.CDCl3>
##$SSB= 0
##$STSI= 0
##$STSR= 0
##$SW_p= 3612.71676300578
##$SYMM= 0
##$S_DEV= 0
##$TDeff= 0
##$TDoff= 0
##$TI= <>
##$TILT= no
##$TM1= 0
##$TM2= 0
##$TOPLEV= 0
##$USERP1= <user>
##$USERP2= <user>
##$USERP3= <user>
##$USERP4= <user>
##$USERP5= <user>
##$WDW= 1
##$XDIM= 8192
##$YMAX_p= 0
##$YMIN_p= 0
$$ End of Bruker specific parameters
$$ ---------------------------------
##NTUPLES= NMR FID
##VAR_NAME=  TIME,          FID/REAL,        FID/IMAG
##SYMBOL=    X,             R,               I
##VAR_TYPE=  INDEPENDENT,   DEPENDENT,       DEPENDENT
##VAR_FORM=  AFFN,          ASDF,            ASDF
##VAR_DIM=   8192,          8192,            8192
##UNITS=     SECONDS,       ARBITRARY UNITS, ARBITRARY UNITS
##FACTOR=    0.0002944,     1,               1
##FIRST=     0,             0,               0
##LAST=      2.4114304,     0,               0
##MIN=       0,             -174617,         0
##MAX=       2.4114304,     163999,          0
$$ Real data points
##PAGE= N=1
##DATA TABLE= (X++(R..R)), XYDATA
0@%%%%%%%%%%%Qj6J6j6J6k4L2m0M8n6O4p2Q8j04J20j44J68j92K22k53K87l24L66
$$ 0 0 0 0 0 0 0 0 0 0 0 0 8 -8 8 -8 8 -16 16 -24 24 -32 32 -40 48 -56 64 -80 88 -104 118 -135 152 -172 194
34A94m14M67n23N84o54P31q13R02r99J107j224J351j490J643j811J994k196K419
$$ 194 -220 247 -276 308 -346 385 -428 474 -525 582 -642 709 -781 862 -949 1045 -1151 1268
52A268k667K942l250L600l998M454m984N610o363P287q450R962j2019J4989j9638
$$ 1268 -1399 1543 -1707 1893 -2105 2349 -2635 2975 -3388 3899 -4551 5411 -6608 8381 -11257
67a1257K7945m7006J61897L2420l38616K58688j3920r3143J04470r6331K0038
$$ -11257 16688 -30318 131579 163999 -174617 84071 70151 -22992 81478 -14853 5185
78E185O0929j16674R2008k746r4128O5140J2633k5253j0226l0331P6094K985r8874
$$ 5185 66114 -50560 41448 38702 -55426 9714 22347 -2906 -13132 -43463 32631 35616 -63258
91f3258K4825R4694l9988p1776N4039K1727m3315L7302q682k6930J3119j3659
$$ -63258 -38433 56261 16273 -55503 -1464 20263 -23052 14250 5568 -21362 -8243 -21902
103b1902N9189j6998j02427R0417L3861p1828L7081l2858J1172P5677j01110N842
$$ -21902 37287 20289 -82138 8279 42140 -29688 7393 -25465 -14293 61384 -39726 -33884
115c3884R3721p6326K737M2858n4776K9924K3745m1709J1293j0366m018N5352
$$ -33884 59837 -16489 -13752 29106 -25670 4254 27999 -13710 -2417 -12783 -16801 38551
127C8551m1519o3035O8794K0424m8640J7893j9544J305N6889n0486n195M3841
$$ 38551 -2968 -66003 2791 23215 -25425 -7532 -27076 -25771 31118 -19368 -24563 19278
139A9278m4766L7104J4562n0001N0299j9355l912N5860q8499L0072Q5907j01421
$$ 19278 -25488 11616 26178 -23823 26476 7121 3209 59069 -29430 642 86549 -14872
151a4872O460M6349l8581L8520k8869m1311N8162j4233j9469J7660k6535l696
$$ -14872 -8412 37937 -644 37876 9007 -32304 25858 11625 -7844 9816 -16719 -20415
163b0415K7847P643l6963j3419M1883j388j2913j1942o690N1820k8829l6398O1158
$$ -20415 7432 15075 -21888 -35307 6576 5188 -7725 -19667 -26357 25463 -3366 -39764 21394
176B1394k7159j1954M1833m5456J4507K2986k7029L1584l3602j4005O5418l2639
$$ 21394 -5765 -17719 24114 -21342 -6835 16151 -10878 20706 -12896 -26901 38517 5878
188E878j6064J0869j7723N1038j9411n0143N3022q444k1111L3595k6778j3285
$$ 5878 -10186 683 -17040 33998 14587 -35556 17466 9022 -12089 21506 -5272 -18557
200a8557K6874k164q413r491j539J7222O650k7670j1931M3881k590l8555J9327
$$ -18557 8317 6153 -2260 -11751 -13290 3932 10582 -17088 -29019 14862 12272 -26283 -6956
213f956P308L38J0725k3068J0228P654r202L1356k4210k5759M2563j857r541m339
$$ -6956 352 690 11415 -11653 -1425 6229 -2973 28383 4173 -21586 20977 19120 9579 5240
227E240j8919L5217K722l7390J4864O808n448K907j0547l75K811M572j023j4293
$$ 5240 -13679 21538 24260 -13130 1734 8542 3094 6001 -4546 -4921 -2110 2462 1439 -12854
241a2854L965N648J0102o514k9699K5991J8892k1469J292j6110K0252K8708m9965
$$ -12854 -8889 -3241 6861 347 -29352 -3361 15531 -5938 -4646 -20756 -504 28204 -21761
254b1761J4298K2857l7940M0072j435m4965L9967j815j0423J6642l3217J9015
$$ -21761 -7463 15394 -22546 17526 16091 -28874 11093 9278 -1145 15497 -17720 1295
266A295K5500l2472J395K514Q883J1513l2042N653J6957j2130Q182j0052j0032
$$ 1295 26795 -5677 -4282 -1768 7115 18628 -13414 -7761 9196 -2934 5248 -4804 -14836
279a4836J3083K937J994j7624m852K2680j288m326j4065p1L4509j7662j7168K1409
$$ -14836 -1753 1184 3178 -14446 -19298 3382 2094 -2232 -16297 -16368 18141 479 -16689 4720
293D720o696R913R76j9958K2149m516n934K1420k9482q62L4239j6330j3577j127
$$ 4720 -1976 7937 8913 -11045 11104 6588 654 22074 -7408 -8270 25969 9639 -3938 -5065
307e065O766J9326k0693j6335J9833J608n621K159q003l692J4956K873j5734J630
$$ -5065 1701 21027 334 -16001 3832 5440 -181 1978 -6025 -9717 5239 8112 -7622 -5992
321e992L166M617J2606k6416l264L4432j6937r214P974j0786K3282o493k4664
$$ -5992 -2826 1791 14397 -12019 -15283 19149 2212 -7002 972 -9814 13468 6975 -17689
334a7689K4325q262j854K0427k9633K516K1322r855N266j5219l377K9640j2743
$$ -17689 6636 -1626 -3480 16947 -12686 -10170 11152 1297 6563 -8656 -12033 17607 4864
347D864j4088N752K874R829j0524o818N762j646Q655q375q129Q323m075J3979
$$ 4864 -9224 -3472 -598 9231 -1293 -8111 -2349 -3995 4660 -3715 -11844 -3521 -7596 6383
361F383r911k3723L3105P11j9108J4137j4041J2350J8017k7684R169N259m341
$$ 6383 -3528 -27251 5854 6565 -12543 1594 -12447 -97 17920 -9764 -595 4664 323
374C23K1088k3137l496K4490j7601R384J325k5431K5112N695k1720M558k301O610
$$ 323 21411 -1726 -5222 19268 1667 11051 12376 -13055 12057 17752 -3968 590 -1711 4899
388D899N480j7246o59R441K715m566p357L424L394M401j460j0891M420O780M036
$$ 4899 10379 -6867 -7526 1915 4630 64 -7293 -3869 -475 3926 2466 -8425 -4005 2775 6811
403F811l985j8104J5732J4004j9824K046O4r68J4989j5442o358J3081o755O971
$$ 6811 2826 -15278 454 14458 -5366 -3320 -3256 -4224 10765 -4677 -11035 2046 -4709 2262
417B262j369j5178J1701P373m667n149n008J1756M931q148o532L444J2965p227
$$ 2262 893 -14285 -2584 4789 122 -5027 -10035 1721 6652 -1496 -8028 -4584 8381 1154
431A154o784N889o285R830J852j4726Q468m234O108J2526l1006J0092K3643k1469
$$ 1154 -5630 259 -6026 3804 5656 -9070 -602 -4836 1272 13798 -17208 -7116 16527 -4942
445d942O993k770o809K5200j5648o010J3950j4215J7406J119k4744J7578J954
$$ -4942 2051 -719 -7528 17672 2024 -3986 9964 -4251 13155 14274 -10470 7108 9062
458I062l831O308k0539R701J4747j6070j379j531L679O871j1262J26j240K591
$$ 9062 5231 11539 -9000 701 15448 -622 -2001 -3532 147 7018 -4244 -4118 -5358 -2767
472b767J0218j5016p03Q697m085R198j0650n394J5936p856N547k815j7342K6467
$$ -2767 7451 -7565 -8268 429 -3656 5542 -5108 -10502 5434 -2422 3125 310 -17032 9435
486I435j307k0967J5295p705L000J3421k2299M876R301p353J1012j3193o557K1666
$$ 9435 8128 -12839 2456 -5249 -2249 11172 -11127 -6251 3050 -4303 6709 -6484 -13041 8625
500H625o150o310J094m264J3946O70j6043L791J0112r87m213j311k446O039O838
$$ 8625 2475 -3835 -2741 -7005 6941 7611 -8432 -4641 5471 4484 271 -1040 -3486 2553 9391
515I391j2493j102Q219m499P319m213j2860J5624K565q770K374n336Q351M971
$$ 9391 -3102 -4204 4015 -484 6835 2622 -10238 5386 7951 -819 1555 -3781 4570 9541
529I541j1935L678j93O52R575j1808n472J0302J347j125p439k753Q448L692o822
$$ 9541 -2394 1284 1091 1743 11318 -490 -5962 4340 5687 4562 -2877 -5630 2818 6510 -312
544c12j0135Q707Q005j0263K509l676l606J7884j0014j0830J1728k749P096l340
$$ -312 -10447 -1740 6265 -3998 -1489 -5165 -8771 9113 -901 -11731 -3 -2752 4344 1004
558A004j4682J8278j914p654J1817j6245N515J7049j9422L951M055q895J6088
$$ 1004 -13678 4600 2686 -4968 6849 -9396 -3881 13168 -6254 -2303 1752 -7143 8945
571H945p635j1656J2801j529J100o08r226Q360L638k528k261o794R901N504r128
$$ 8945 1310 -10346 2455 926 2026 1418 -7808 552 4190 1662 -599 -7393 2508 8012 -1116
586a116k542J326P479K32q245J375n60P945J824j7375Q678Q082q523O120p710
$$ -1116 -3658 -2332 5147 5379 -2866 -1491 -2051 5894 7718 -9657 -979 7103 -1420 4700 -3010
601c010k935J5495p694m498K578l442J1216m065j0562Q097M74P06P34p763L192
$$ -3010 -5945 9550 1856 -2642 -64 -3506 7710 3645 -6917 1180 1654 2360 3094 -4669 -1477
616a477M550p90k206m145K593L682J733n926o970J2545J877j0462L546k562M479
$$ -1477 3073 2283 77 -4068 -1475 2207 3940 -1986 -8956 3589 5466 -4996 -1450 -4012 467
631D67O441j3135L174M338l592R524j0855n616J6072n334j747m66p370J4765j575
$$ 467 6908 -6227 -3053 1285 -2307 7217 -3638 -9254 6818 1484 -263 -729 -8099 6666 5091
646E091j2474P611j450K434L794j0308K768M382o96J052o584K092M832j572R50
$$ 5091 -7383 228 -1222 1212 5006 -5302 -2534 1848 1152 2204 -4380 -2288 2544 972 1922
661A922p859K879J0247p420k872J178J196O594o939j878L818l917R897l626j3057
$$ 1922 -5937 -3058 7189 -231 -3103 -1925 -729 5865 -1074 -2952 866 -3051 6846 3220 -9837
676i837J2905K490o145K783o810N348P175r180m21J581P48N439o451l411M970
$$ -9837 3068 5558 -587 2196 -4614 734 7909 -1271 -1692 -111 637 6076 -375 -3786 1184
691A184J258J678m948m560P834L337o428l010L917J224n1J019o126j14R486m041
$$ 1184 2442 4120 -828 -5388 2446 5783 -645 -3655 262 1486 1435 2454 -3672 -3786 5700 1659
707A659m303L47l04P400l527p472N176J296J054n56p186N083M092l212k59m974
$$ 1659 -2644 -2297 -2601 4799 1272 -6200 -1024 272 1326 770 -6416 -1333 2759 -453 -712 -5686
723e686M018O659o446l032J488L494K740n149j148k3M088M506j0271K80P610l664
$$ -5686 -1668 4991 -1455 -4487 -2999 495 3235 -1914 -3062 -3085 1003 5509 -4762 -4482 3128 -536
739e36L870m600n387J2120k776m040J742m766J0265j304j0188Q995l337k28R428
$$ -536 3334 -1266 -6653 5467 2691 -1349 393 -4373 5892 4588 -5600 3395 58 -170 9258
754I258j3291M46J0510n187J496m671k348J2024n010n938L226p39M947k367n446
$$ 9258 -4033 -3587 6923 1736 3232 -1439 -3787 8237 3227 -2711 515 -224 4723 2356 -3090
769c090L928q75K243J206p583J384N164J227m771n769Q074K819n923k9k092M087
$$ -3090 838 -37 2206 3412 -4171 -2787 2377 3604 -1167 -6936 1138 3957 -1966 -1995 -4087 0
785@L924q201J253J844j293N854n266m778O607O94K98k911m824P674K998n964
$$ 0 3924 -4277 -3024 -1180 -2473 3381 -1885 -6663 -56 638 936 -1975 -6799 875 3873 -2091
801b091j728J385M040Q54n244j063M832J222k743N49j750k23P359l246o990N206
$$ -2091 -3819 -2434 1606 2460 -2784 -3847 985 2207 -536 13 -1737 -1960 5399 2153 -4837 369
817C69K253R84j682p093P501L709n916J366l493L457O238r040N75L750l910O163
$$ 369 2622 3606 1924 -5169 2332 6041 125 1491 -2002 1455 7693 -1347 -772 2978 -932 5231
833E231l112o411O272Q68p6k558n081P523J733m862j286j532O830O9q291L668
$$ 5231 2119 -4292 1980 2848 2772 214 -4867 2656 4389 -473 -1759 -3291 3539 3608 -4683 -1015
849a015R51l02K406m983N27J092J037L872r399j53J0432n471j423o14j649Q923
$$ -1015 -64 -366 2040 -2943 -2416 -1324 -287 3585 -5814 -5967 4465 -1006 -2429 -3043 -4692 4231
865D231m698n563O590k655K092K205p100L821J866k41K044p397K527P824n135
$$ 4231 -467 -6030 560 -2095 -3 2202 -4898 -1077 789 548 2592 -4805 -2278 5546 411
880D11k100K58J167N034m124m072L554K087K8k583p84J334J121K300l326l098
$$ 411 -1689 -1431 -264 4770 646 -3426 128 2215 2243 -340 -1124 210 1331 3631 305 -2793
896b793M172K775j778l901R8N797j042l645J44K27L496r03m187J702L08Q35J714
$$ -2793 1379 4154 2376 -1525 -1427 4370 3328 -317 -173 54 3550 2647 -1540 162 470 1305 3019
913C019m629j293L858K010k950m480L317L415k131j432k291K616L678l873j444
$$ 3019 -1610 -2903 955 2965 15 -4465 -1148 2267 136 -1296 -3587 -971 2707 -1166 -2610
928b610K39J616L043l884j481K130m30M481m050n673Q240N38l786M38k485N003
$$ -2610 -2371 -755 2288 -1596 -3077 -947 -1377 3104 -946 -6619 1621 2159 -1627 -1189 -3674 1329
944A329J529o005K634%K73L531m930J99K236n30L940n175k906P399o85k854r82
$$ 1329 2858 -3147 -513 -513 -240 3291 -1639 -1440 796 266 4206 -969 -3875 3524 2839 -15 -997
961i97m74M612j298k754K33p63M416q68m922K307M08J881R11o468K370M653j270
$$ -997 -1471 3141 1843 -911 -678 -1441 2975 2107 -2815 -508 -100 1781 2692 -3776 -1406 3247 1977
978A977j746l939M263M735n704j087J312O82L259m260j432L467j791J725j52m288
$$ 1977 231 -3708 555 5290 -414 -1501 -189 493 3752 -508 -1940 1527 -264 1461 1309 -2979
994b979J746L093K24m369j491N412J05l323k63MK707j22k121J74j254L391J439
$$ -2979 -1233 1860 2084 -2285 -3776 1636 1741 -1582 -1845 -1841 866 744 -1377 -1203 -2457 934 2373
1011B373m922L27J397K536J627q175K013P597l721k372l07P31M951l916k529K846
$$ 2373 -2549 -2222 -825 1711 3338 -4837 -2824 4773 1052 -1320 -1627 -896 4055 139 -2390 456
1027D56j071L046j105m467L083Q28M08J86n391L472M040l586j655k25K943J163
$$ 456 -615 2431 1326 -3141 -58 770 1178 1364 -4027 -555 3485 -101 -1756 -1981 962 2125
1043B125l786J203l14j05M067l781j372K424m71L331l198m166N934J071k075j257
$$ 2125 -1661 -458 -772 -877 3190 -591 -1963 461 -10 3321 123 -4043 1891 2962 887 -370
1059c70k349O001L93n690K029K45J279K281n802K94M208j563L39k043j560L898
$$ -370 -2719 3282 3675 -2015 14 259 1538 3819 -1983 -1689 2519 956 1295 -748 -2308 1590
1075A590R02l112k241J806L678j989l731J293K465m78j243k40o41J218J910j969
$$ 1590 2492 -620 -2861 -1055 2623 634 -3097 -1804 661 183 -1060 -1300 -1941 -723 1187 -782
1091g82j272N54J389K557l325k766M444J826k324k004J01L425l46j903m61q47
$$ -782 -2054 -1500 -111 2446 -879 -3645 799 2625 301 -1703 -1602 1823 1477 -426 -887 -1734
1107a734L165M65l762K09J025J650L57m443R32L252Q3j165l657L165L728m049
$$ -1734 1431 1896 -1866 -1657 -632 1018 1375 -3068 -2136 1116 1199 34 -3623 -458 3270 -779
1123g79N37N46j395M715k294l067L397j430K155O43n508L272K097j631Q71m857
$$ -779 -242 304 -1091 3624 1330 -1737 1660 230 2385 3028 -2480 792 2889 1258 2129 -2728
1139b728L384L849n581Q94N04j588M668l216k871L276n03J667j610l577M231K91
$$ -2728 656 4505 -1076 -182 322 -1266 3402 186 -2685 591 88 1755 145 -3432 799 1090
1155A090j024p28l348M793J464m874P65J13J560J017m004J121J424l99K146l201
$$ 1090 66 -662 -4010 783 2247 -2627 -1862 -1749 -189 828 -3176 -2055 -631 -1030 1116 -2085
1171b085r67L907l36K09k107j170N503q71l648J551L84J191K26k929O82Q24O31
$$ -2085 -3052 855 519 728 -1379 -2549 2954 2083 -1565 -14 370 1561 1787 -1142 -460 364 995
1188I95M04l003o10L458L19k413j358J437K488n00l093K10L417l1r05n71o87K506
$$ 995 1399 -1604 -2214 1244 1563 -850 -2208 -771 1717 1217 -1876 -1666 1751 1720 815 244 -443 2063
1206B063R91k399m71N33J821R26m155J30K268kj07l096l38M118j473k179P1o3
$$ 2063 3054 655 184 717 2538 3464 -691 -561 1707 1705 1598 -1498 -1836 2282 809 -1370 -1299 -1362
1224a362K094o63j745J01l32L135m67m324K217J874l88m5l540K151L096k930K03
$$ -1362 732 69 -1676 -1575 -1907 1228 761 -3563 -1346 528 140 95 -3445 -1294 1802 -1128 -925
1241i25j310O64L588l168r87J694r03L364j945l363M034K98m03L39l337L361K662
$$ -925 -2235 -1571 2017 -1151 -2138 -444 -1347 2017 72 -3291 743 1041 638 977 -2360 1001 3663
1258C663l259n28k35J771J882l877mJ631n87J699k286k115K825Q85j114j519q64
$$ 3663 404 -124 -359 1412 3294 -583 -587 1044 457 2156 -130 -2245 580 1465 351 -1168 -2032
1275b032L082O58j944j114P12K743n52k350O82Q63J146k71k163k9K106Q21j717
$$ -2032 1050 1708 -236 -1350 -638 2105 1553 -797 -115 748 1894 1623 -540 -569 1537 2358 641
1292F41j886R52J608k77j810j372J513J743j308k170L17K160qj629k20k82J925
$$ 641 -1245 -293 1315 1038 -772 -2144 -631 1112 -196 -2366 -2049 111 103 -1526 -1746 -2028 -103
1309a03J189k967r5J646Q39O04l007k01L646q79q47r09k57L164r00k039J010o78
$$ -103 1086 -1881 -1976 -330 509 1113 -1894 -2095 1551 672 -175 -1084 -1341 1823 923 -1116 -106 -784
1327g84K188N79l832J379J867m10N23k913Q91K962j555n92j000K77L108k216j687
$$ -784 1404 1983 -1849 -470 1397 987 1510 -1403 -512 2450 895 303 -697 -420 2688 472 -1215
1344a215J397l56J578q38k727J628J041M26j097k541K751J694j879l15q92J744
$$ -1215 182 -174 1404 566 -2161 -533 508 934 -163 -2704 47 1741 -138 -453 -1345 399
1360C99J802k571m43J154M58J130j697j213J383Q86L13k153j254L012K11k235
$$ 399 2201 -370 -813 341 799 1929 232 -981 402 1288 1601 -552 -1806 1206 1417 -818
1376h18k24O7J211N83j877q49R59J394l67j552N1P71J248l92j832M00J739P45
$$ -818 -1042 -975 236 819 -1058 -1907 -948 446 79 -1473 -1422 -651 597 205 -1627 -1227 512 1257
1394A257j609j471J775J425o03j031j388K360J590k699k36N09M52J513j909j339
$$ 1257 -352 -1823 -48 1377 774 -257 -1645 715 2305 -394 -630 -121 331 1844 -65 -1404
1410a404J517Q20O19k377r75L017l34q23o42j036K843J47k774J128j13O87R59
$$ -1404 113 933 1552 -825 -1800 1217 883 60 -582 -1618 1225 1372 -1402 -274 -387 300 1259
1427A259k229L07Q66L46J103k820j34L203j261j32q25q83L646j002k771J425Q5
$$ 1259 -970 -663 203 549 1652 -1168 -1302 1901 640 508 -317 -1200 2446 1444 -1327 98 183
1444A83J141O6k618Q90Q61O12m4l164J045L271j958j278Q3L19K001j626j654J051
$$ 183 1324 1390 -1228 -338 523 1135 1091 -2073 -1028 2243 285 -993 -910 -591 1410 -216 -1870 -819
1462h19O54O02o58j907J561R26m49o36j349J387J748j411o65K83M26J477o66j880
$$ -819 -165 437 -221 -2128 -567 359 -90 -726 -2075 -688 1060 -351 -1016 -733 -307 1170 504 -1376
1480a376Q99J591J44j242j310J431J590j070j219n25J322J743j951j843J655P63
$$ -1376 -477 1114 1258 16 -1294 137 1727 657 -562 -1087 235 1978 27 -1816 -161 602
1496F02K24j213j849K554J295j838l24n59J796J409k700K46Q40N7J852k515j000
$$ 602 826 -387 -2236 318 1613 -225 -549 -1108 688 2097 -603 -357 483 540 2392 -123 -1123
1513a123K949q57l22L5j687K159N38k062O83j556J822J427l489N71P70k03K066
$$ -1123 1826 969 647 682 -1005 1154 1692 -370 313 -1243 579 2006 -1483 -912 -142 -345 1721
1530A721l294p87L497r29n2j408q58L549j204j846R79q98K395J54l730J992P43
$$ 1721 -1573 -2360 1137 208 156 -1252 -2110 1439 235 -1611 -632 -1530 865 1019 -2711 -719 24
1547B4k80O64k848J165K718j899m8n73M38K340j865l16Q65q25K409p74k650K065
$$ 24 -256 408 -2440 -1275 1443 -456 -504 -1077 -639 1701 -164 -480 385 -440 1969 1195 -1455 610
1565F10L51j17M05k226R65J710j107p32p84Q66J877k104q22R27K60J331j441j630
$$ 610 961 844 1249 -977 -12 1698 591 -141 -925 -59 1818 -286 -1108 -181 79 1410 -31 -1661
1583a661K060J047r18k97j106J368J635j328j566N59J476K83j915n14J324l6o4
$$ -1661 399 1446 528 231 -875 493 2128 800 -766 -207 1269 1552 -363 -877 447 411 347
1600C47p64j027J249O02j224l52k90Q10J332j520j144J491O13K25j348n68J784
$$ 347 -417 -1444 -195 407 -817 -1169 -1459 -649 683 -837 -1981 -490 123 348 -1000 -1568 216
1617B16K25n73j47j198J897J107k585L83L05N61J168k179n41J955NO8j449l81
$$ 216 441 -132 -279 -1477 420 1527 -1058 -675 -370 191 1359 -820 -1361 594 599 667 -782 -1163
1635a163K715p41r91N14p99K154q5k354J143L27K04O53k385M21J422l82o4j506
$$ -1163 1552 811 -180 334 -465 1689 1604 -750 393 720 924 1577 -808 -387 1035 653 589 -917
1653i17KK269j013q69j12k3J816p50j734Q80P73M44j55j635Q55J062j43n66j201
$$ -917 -915 1354 341 -528 -640 -663 1153 403 -1331 -451 322 766 611 -1024 -169 893 750 184 -1017
1672a017R75J545j201j306L80O63O61j138r87Q27O35J52q99j025J159J228o04
$$ -1017 -42 1503 302 -1004 -624 39 700 -438 -1425 -598 37 189 -710 -1735 -576 652 48
1689D8j153j15J244R10r97j288R32J127j11p68n83O00J406q55q97j62R00J195
$$ 48 -1105 -1220 24 934 -63 -1351 -419 708 597 -171 -754 -154 1252 397 -500 -662 238 1433
1707A433j202j369J118M71O18q64j463J537J086j139n61l12J133J170j711k39
$$ 1433 231 -1138 -20 451 1069 205 -1258 279 1365 226 -335 -647 486 1656 -55 -294
1723b94J49O18J256k093p35J466K76k30r06p65J936J90j426K1m00J188Q51j778
$$ -294 -145 473 1729 -364 -1099 367 643 413 -493 -1258 678 868 -558 -537 -937 251 1102 -676
1741f76j4M37Q09N99k167J69J705l73j48r85k41J980m42j187r6J81J068l09j310
$$ -676 -690 -253 556 1155 -1012 -843 862 489 341 -644 -885 1095 653 -534 -630 -449 619 310 -1000
1760a000K33N71Q43l36j771P18J541n49p49o70N60J458n55j309N62N72N52l92
$$ -1000 -767 -196 647 311 -1460 -742 799 250 -499 -1169 -609 849 294 -1015 -453 119 671 279
1778B79r19K73R89J93o86r21K66J689n85j263J06R18N24m48j449P71J165l73m89
$$ 279 -640 -367 622 815 129 -792 -526 1163 578 -685 -579 339 863 415 -1034 -263 902 529 40
1797D0r17N67J297m95r08n1L13J597j079j322R45N37K46n93j253J176J021j055
$$ 40 -877 -310 987 492 -416 -467 -154 1443 364 -958 -13 524 770 177 -1076 100 1121 66
1815F6j38n73P10J199j341m12%M27J272j333j183J486M25j29q20j148K008K04
$$ 66 -72 -645 65 1264 -77 -489 -489 -62 1210 -123 -1306 180 605 476 -344 -1492 516 720
1833G20j139J08p70J160Q15j662l0N83K52N31j123o01J474R1j89r56l95J696k07
$$ 720 -419 -311 -1081 79 894 -768 -798 -215 37 568 -555 -1156 318 409 220 -736 -1131 565 358
1852C58q32p1j01J013L03j503J49P24K19M29j227k86J565J18n09p65L2J393j35
$$ 358 -474 -545 -646 367 670 -833 -684 40 259 688 -539 -825 740 858 349 -416 -384 1009 874
1871H74j273K15L03P16j15j351P6J327j11m32o99j34J730l41j325O1M50R79l64
$$ 874 -399 -184 119 835 720 -631 -555 772 661 229 -470 -604 1126 785 -540 -479 -29 950 586
1890E86j316O71N28M5J58j440L54J308o96k05l93k31J448m61j398O31J75P98n54
$$ 586 -730 -59 469 514 672 -768 -414 894 198 -7 -400 -631 817 356 -1042 -411 -236 562 8
1909Hj484J123N90l17J73j466P72J575j240k77j25Q7J618j249j065J255K11M19
$$ 8 -1476 -353 237 -80 93 -1373 -601 974 -266 -543 -668 -581 1037 -212 -1277 -22 189 608
1927F08q72j069J811J80p62r1p39J118R10j612K73L1J76J294j494m39J178q1O09
$$ 608 -264 -1333 478 658 -104 -195 -934 184 1094 -518 -245 -214 -38 1256 -238 -677 501 420 1029
1946A029q86r63K035k82p00j4q14J112O61j518J73J2N17Q27j819k18J292J61n
$$ 1029 143 -820 1215 933 233 219 -595 517 1178 -340 -167 -155 362 1189 -630 -848 444 605 600
1965F00j292k33J902m65j008J34q5J221k45j504M54Q44N7l1j572N99J283n25m96
$$ 600 -692 -925 977 512 -496 -362 -447 774 529 -975 -521 323 380 349 -1223 -624 659 134 -362
1984c62n03K20J237o06r08M07M24J82o1r67M93P37p6o0q81K74J276n75l79m81
$$ -362 -865 -645 592 -14 -922 -515 -91 91 30 -937 -444 293 217 157 -724 -450 826 251 -128 -609
2004f09J88J440m11j346N84N66L09n98j036J059O56l98m06p11P48J256j173n29
$$ -609 -421 1019 608 -738 -154 412 721 123 -913 146 802 404 -2 -713 35 1291 118 -411
2022d11N88K53Q64j111j054J393K35l90n78l39J143J75r51R5l46N47P60j038l68
$$ -411 177 430 1294 183 -871 522 757 367 -211 -550 593 768 -183 -88 -434 113 873 -165 -533
2041e33K99L07N71r36p39J096M46m40p67j53J383O1q11l98R8Q78M41j440l13Q65
$$ -533 -234 73 644 -292 -1031 65 511 71 -696 -849 534 595 -216 -614 -516 362 803 -637 -950 -85
2061h5N70k11j293K35J206q6p98l86M55P98l85l33j02M03N92l73o03m0Q36J87
$$ -85 485 274 -1019 -784 422 336 -462 -848 -393 405 20 -313 -415 -12 580 207 -396 -436 400 587
2081E87o28m90L09O37M10p24n29O57N54l04q50m3Q44M10p86m73K17J000j00p30
$$ 587 -41 -531 -222 415 825 101 -428 229 783 479 -371 -414 430 840 54 -419 -202 798 698 -32
2101c2n36O79N17P8j299P2Q99J70n94m86L87O44k15n01k59M44O91l04r63K05N42
$$ -32 -568 111 628 706 -593 -521 378 548 -46 -532 -145 499 284 -217 -476 -32 659 355 -608 -403 139
2122A39K78j94j125N57P90k69m97m74O09P22m50n38o2K27R45o98q26O06N30K68
$$ 139 417 223 -902 -345 445 176 -321 -795 -186 536 86 -452 -514 -287 658 -40 -866 -260 270 538
2142E38o19q29O58Q88n34n01j36P39M35p56l60L32M42M05p81p55Q40O77k84p15
$$ 538 -81 -910 -252 636 102 -399 -535 204 639 -117 -477 -145 297 702 -79 -834 6 683 399 -316
2162c16k50Q18N18q15l36K33O10J22o71l01P07K43j59m24m76P72M68p33l51J4
$$ -316 -566 252 770 -45 -381 -148 462 584 -87 -388 319 562 403 -21 -497 275 743 10 -341 -327
2182c27Q49J63q32k25K58N60R3j195J21Q85J90m54l93j90R08J93r44k1R1P35r8
$$ -327 522 685 -147 -372 -114 446 539 -656 -535 350 540 86 -307 -497 411 604 -340 -361 -270 465 367
2203C67j086J92P99Pj22o84j61J007j66l38l08L3R52k40q89J58L02O30k87r72
$$ 367 -719 -527 272 279 157 -527 -688 319 153 -185 -493 -460 492 252 -637 -479 -177 453 166 -806
2223h06M41O79j81J8p99L22J168p79n07j6M00Q47n79r26N35M98M03o02r71Q16
$$ -806 -365 314 133 151 -648 -326 842 63 -444 -460 -60 787 208 -718 -183 315 718 116 -855 -39
2243c9O45m12k54l55O63N88n23o52L34L77L62q20l99P84J92P7n99o10Q18M81n22
$$ -39 606 194 -60 -415 248 836 313 -339 -5 372 734 -86 -485 299 491 568 -31 -641 177 658 136
2264A36m52q7N76M95q08l99N53J79K23n39n35P71J16j41n96l13Q11N60r01j81
$$ 136 -316 -403 173 668 -140 -539 14 193 416 -123 -658 113 229 88 -508 -821 -10 550 -351 -532
2284e32L72L24K22q74k13Q30Mp3n48k33Q34L14n82m33oP45L63r96J49L96J24J5
$$ -532 -160 164 386 -488 -701 129 133 60 -488 -721 113 427 -155 -588 -594 151 514 -482 -333 63 187 202
2306B02p57K27P23j29j56m47O3J006k89n33k9J75O68j92j050L72O23Nj19p38L75
$$ 202 -555 -328 395 266 110 -337 -274 732 443 -90 -119 56 724 532 -518 -146 477 482 363 -375 0
2327@O95l18l87k35N0Q57m01n33K49J54L82l10q01N49O37k55l32n85M21Q38n44
$$ 0 695 377 -10 -245 -195 662 261 -272 -23 131 513 203 -598 -49 588 333 1 -584 -163 675 131
2348A31m23j62K62P47p49m08M55P0K34n31n46P98N45l77l83l58R04L93q76j24
$$ 131 -292 -454 -192 555 -194 -602 -147 -77 157 -374 -920 -122 423 46 -337 -695 209 602 -274 -398
2368c98O2L32M48o64k81M52L14r1l41m64N87O46n43m14KP84J37q13j70M90K73
$$ -398 -336 -4 444 -220 -501 -49 265 174 -167 -631 -44 602 59 -355 -353 431 568 -245 -415 75 348
2389C48j9m93j47O87K86l45n65L1O17L32p66j94J48O95j97o34J6M10K37k35m92
$$ 348 329 -164 -311 376 662 317 -248 -217 400 732 -34 -228 -80 615 418 -216 -200 210 447 212 -280
2410b80M4P42l03l70n0N8M48on36p1K43M55j15o42K14K15Q4j86m57J32O05r7m39
$$ -280 -236 506 203 -167 -217 -159 289 283 -253 -324 -81 374 259 -383 -169 46 130 -56 -513 -381 224 127 -312
2433c12j14K55M87j37p14MM97N30o38m96M42M85p2n27j88N19O14n82m73K64M07
$$ -312 -426 -171 316 179 -535 -531 -34 496 -142 -638 -196 289 217 -310 -498 21 635 53 -420 -156 251
2454B51J65n25k74M73K08k2m39k49N18L19l26k20k1M27J90m34o8l5N75n8l96k08
$$ 251 416 -109 -383 90 298 276 -163 -412 106 425 99 -121 -142 285 475 41 -27 -62 513 455 59 -149
2476a49K80M19m16l63L5N29J00k48p56N14M42k05k66l86N47N30o01m95K63L08
$$ -149 131 550 134 -229 -194 335 435 187 -569 -55 387 182 -84 -470 77 607 6 -489 -226 82
2496H2J93m90k90N16J60J98o31k02M82L04m87k7j11P9N91m24k59J73K17J22l98
$$ 82 275 -215 -505 11 171 369 -262 -464 18 322 -165 -192 -303 -224 367 -57 -316 -143 74 196 -202
2517b02l39M99K57L0m86k85P27K46n61pk03N35L58j053K7M89K75p0o88Q1O29P2
$$ -202 -541 -42 215 245 -241 -526 201 447 -114 -121 -324 211 569 -484 -457 32 307 237 -451 -370 259 331
2539C31k61k24MP55l25n06J25K16K84j96o68K36L80J37Q4n99J34L42j07k01j74
$$ 331 70 -154 -150 605 280 -226 -101 115 399 203 -465 -229 151 288 372 -227 -93 249 142 -59 -233
2560b33J83N64k61o55M00KK80q2p60K78O53q0l77m48K93R02o65l53J89j31O83
$$ -233 -50 514 253 -402 -2 0 280 198 -562 -284 369 289 -88 -536 -243 659 -6 -359 -170 -301 382
2581C82j80q54M73K10J69k65n46M47L64k81k41O1K28M86n87j57K61p4N43n06n96
$$ 382 202 -652 -179 31 200 -65 -611 -164 200 -81 -322 -261 -33 453 -134 -291 -30 -104 439 -67 -663
2602f63P60J35k55K3m37N13J98l72p1j5K09N82q76k13N95M6K85m49m66Q92R5m10
$$ -663 97 232 -23 0 -437 76 274 -98 -169 -184 25 607 -269 -482 113 159 444 -5 -471 421 516 106
2624A06j96j75N34K77n62J10q5K34L61j030K10N73j97K5m35q3O98j52k52j01n3
$$ 106 -90 -265 269 546 -16 94 9 243 604 -426 -216 357 160 185 -250 -333 365 213 -39 -140 -193
2645a93O29j33m94K02j5K35O3p47K11M56k96J11m35j80Q94j45m72r7K48M33k26
$$ -193 436 303 -191 11 -4 231 294 -453 -242 214 -82 29 -406 -586 308 163 -309 -406 -158 275 49
2666D9o52L54L02n4L8m88K71M37j81k41l7Q8M71l32n03K82L01P6k0p04N80L00
$$ 49 -603 -249 53 -1 37 -451 -180 257 76 -165 -202 -114 357 25 -478 -196 105 181 161 -543 37 337
2688C37k01j16l68L50N90m58l13o4M28K96k77m42M03N7J61l16m19M81K50k96j07
$$ 337 136 20 -348 2 592 134 -179 -243 185 481 204 -238 165 222 383 67 -352 129 379 83 -24
2709b4k07N31K26o21j36J62J90P7k94k97M73K04k69j67l00P85mo17K05l1K59K19
$$ -24 -231 300 526 -95 -231 -69 121 198 -96 -393 80 284 15 -152 -452 333 329 -288 -83 -114 145 364
2731C64m75l69M91K10j05m81K0M87j24j00k70r4Q83k75m27r9L38K71k5l85o3M73
$$ 364 -111 -480 11 221 116 -365 -345 142 18 -82 -352 -446 437 162 -265 -364 -26 245 220 -165 -228 245
2753B45L9k01m52L38M13k08l71j5K45L89j69n35K11L16O8q3o34L30M11j12j29
$$ 245 284 83 -369 -31 382 174 -197 -212 33 422 253 -282 -71 245 313 230 -404 -74 337 225 96
2774I6l71M42L13l84p7l2J10K97j32n33K14M09k12m48N9K95L75m46j94l9K40K32
$$ 96 -275 167 480 96 19 -13 97 394 262 -271 -57 352 140 -308 -249 46 421 -25 -219 -258 -18 214
2796B14j93m49L74J53L0k9m52K67K67j03k70j23L51N5j31l13K73J77J12l06j33
$$ 214 21 -428 -54 99 129 100 -352 -85 182 79 -191 -314 37 92 -39 -352 -79 98 210 -96 -229
2817b29P0K02p1j75l7J24L76l10j70P1L22J57k80k99J63L26J71m66p2L93j35p5
$$ -229 -159 43 -28 -203 -240 -116 260 -50 -220 -149 173 330 50 -249 -86 240 411 -55 -127 266 131 56
2839E6k67qN11m4k76j40K23LR2j94k38N00J24k02k05j37L75J18l77o3Q6K15J9
$$ 56 -211 -219 292 248 -28 -168 55 58 150 -44 -282 218 342 140 -65 -202 173 291 -86 -149 -63 152 171
2862A71k58l32M02K95k45k40R3J85J78k97j51j08M65J9m74m0L55K55j26k98J68
$$ 171 -87 -419 -17 278 33 -207 -114 71 249 -48 -199 -307 158 177 -297 -337 18 273 147 -151 17
2883A7J36p9j65j20j9N62l48k02J27N3K18o4m55J69K85r1n5j88kK45p5p9r8J5
$$ 17 153 74 -91 -211 -230 332 -16 -218 -91 -38 180 116 -339 -170 115 24 -31 -219 -221 24 -51 -130 -228 -213
2907b13M90l07k08J45J21L93r4o67L21K85k24m8k82K65M41m29j29j5J07M82m39
$$ -213 277 -30 -238 -93 28 421 327 -340 -19 266 42 -6 -288 -23 418 -11 -140 -155 -48 434 -5
2928ej32L03N3j12j54m5K41J04k21p4r9J94K11k06l05J83K12J66k68l41L78o9
$$ -5 -137 166 219 107 -47 -92 149 253 32 -42 -141 53 264 58 -247 -64 148 314 46 -295 83 14
2950A4R0m9n83M75K97l33ln9J83J99n70L2L94j05J42m20r5P16k77j47J3l61P30
$$ 14 104 55 -528 -53 244 -89 -92 -151 32 231 -339 -307 87 -18 124 -296 -391 325 48 -99 -86 -447 283
2973B83n6m56N8K62P0j21m42L74J76j84K18j89j74N42l16k46K71j23L79k45l25
$$ 283 227 -229 -171 91 161 40 -402 -28 148 -36 182 -7 -181 361 45 -201 70 -53 326 81 -244
2994b44L15N3N1J95m82K54L7p9J1l18J13N13k00m72J87J27K69k76l73L29K9J19
$$ -244 71 124 175 370 -112 142 179 100 111 -207 -94 419 219 -253 -66 61 330 54 -319 10 39 158
3016A58k22l46K47M29l67Nm4J14K60m33L8K76k28K41k40k14L04p3J43Rn18M41
$$ 158 -64 -410 -163 266 -101 -96 -140 -26 234 -199 -161 115 -113 128 -112 -326 -22 -95 48 57 -461 -20
3038b0L26l97J28k29J91L01m16j54K95q2J01k65o0M26O1k90j01K9N78j09n44K54
$$ -20 306 -91 37 -192 -1 300 -116 -270 25 -57 44 -221 -281 145 206 -84 -185 -156 422 313 -231 23
3060B3l3Q5J54l92l5L91l5O3m94J86N75n11j3n3j84M45j90n0J53J32N4n9k88Q3
$$ 23 -10 75 229 -163 -198 193 158 221 -273 -87 488 -23 -36 -89 -273 172 -18 -68 85 217 271 212 -76 7
3084GJ25N4o6n19K73K37j25j27k7K00J47k40k49K55Q4Q3j95J8lK45Nk08j89P5
$$ 7 132 186 120 -399 -126 111 -14 -141 -168 32 179 -61 -310 -55 29 112 -83 -65 -68 177 182 -26 -215 -140
3108a40L18l21k5K33nK8k8l53K76J26m6p7k93J97K27j65m7J22j28K90k70n6J31
$$ -140 178 -143 -168 65 60 88 60 -293 -17 109 63 -14 -307 -110 117 -48 -95 27 -101 189 -81 -137 -6
3131fJ16L1p5l38K58L85m41J50k20K37L26l81j96J94P8J27l07q6J64M8j73Q3r7
$$ -6 110 141 66 -272 -14 371 -70 80 -140 97 423 42 -154 40 118 245 -62 -148 16 64 -109 -26 -123
3154a23K11J43k63l4P2J56N1l40M7K26p0J6N6m29L88L2k33k4Q0M6J8j87q6K12
$$ -123 88 231 -32 -66 6 162 213 -127 -80 146 76 92 148 -281 107 139 -94 -118 -38 8 26 -161 -247 -35
3178c5J30r9j36l1L18k47Rj66L8K65K22m19K8J31Om0j16M5J95l5q3j92l1L45l2
$$ -35 95 -4 -140 -171 147 -100 -91 -257 -219 46 268 -151 -123 8 14 -26 -142 -97 98 63 -20 -212 -243 102 70
3203G0j36j09RL27Ll16Q6J18J51j17l43J83L27j25j03j88k2L66j35j70J07Q5J61
$$ 70 -66 -175 -166 161 164 -152 -66 52 203 86 -257 -74 253 128 25 -163 -185 181 46 -124 -17 68 229
3226B29m3k76J10J34j20K7r4P3P1ln3j64K10J40l22j21J09J35J09k13j04J02K32
$$ 229 186 -90 20 154 34 61 -33 40 111 108 55 -109 101 241 -81 -202 -93 42 151 -62 -166 -64 168
3249A68k09p3P1n2L18l95J92j20K11Jk51r6J11J57L9j08k80M33P8k31o2p8J81
$$ 168 -41 -114 -43 -95 223 -172 20 -100 111 112 -139 -235 -124 33 72 -36 -316 117 195 -36 -98 -176 5
3272EJ04j91m3O2P8J70m42O8J91J01p1k8j44J02J35j74j06L23j97K57k92N0K39
$$ 5 109 -82 -125 -63 15 185 -257 -189 2 103 32 4 -140 -38 97 -77 -183 140 -57 200 -92 -42 197
3295A97k2j65k24J91J84L8k34l3L1J82j54j28kJ30J13q1q9K3P1Jk26J78J4J55
$$ 197 175 10 -214 -23 161 199 -35 -68 -37 145 -9 -137 -139 -9 104 23 -66 -43 28 29 -197 -19 -5 150
3319A50p7k26n0K14M8l1k91J44J60j43J14k73J14L19j40j87J78k29L55jm81K88
$$ 150 73 -153 -203 11 59 28 -263 -119 41 -102 12 -261 -147 172 32 -155 23 -206 149 148 -333 -45
3341d5n7K46p4k36j9P5R0J97l01L8M72m00q9J16k8K37m30L6K41l1N2j9l03L25
$$ -45 -102 144 70 -166 -185 -110 -20 177 -124 -86 386 -14 -103 13 -15 222 -208 -172 69 38 90 71 -232 93
3365I3J24k40J49k77L22j20j63o3K28N6J03l16p3K01J20k02Q2j74l0L46k48mj4
$$ 93 217 -23 126 -151 171 51 -112 -175 53 109 212 -104 -177 24 144 -58 24 -150 -180 166 -82 -86 -100
3388a00K80l0j83k74L81j3k5l32N9L72k9k71p3M9K32J76k73j01pL21r3k75J59
$$ -100 180 150 -33 -307 74 61 36 -296 -237 135 106 -165 -238 -189 43 219 -54 -155 -162 159 66 -209 -50
3411e0L8J0mk83J65K04M8j34j8J25m4Q8k59K6N3K21o9j88j56L88j97j7m8p9L62
$$ -50 -12 -2 -6 -289 -124 80 128 -6 -24 101 57 145 -114 -88 -35 186 117 -71 -227 161 -36 -53 -101 -180 182
3436A82j28j04k6N6J85j63l04L34N0J02k09j96M09J33l89k1J17j6J74o0j88J73
$$ 182 54 -50 -76 -20 165 2 -302 32 82 184 -25 -221 188 321 -68 -89 28 12 186 126 -62 111
3458A11k7J70k18j72K48j63J01J33l28R5K05k82J35q6J09K9pj85K19j58J79k92
$$ 111 84 254 36 -136 112 -51 50 183 -145 -50 155 -127 8 -78 31 60 53 -132 87 -71 108 -184
3480a84M8L29k08n7l9L4J12K71l69k7m1K56j34j87J56J92j60L3j35m9L39J8k17
$$ -184 -136 193 -15 -72 -111 -77 35 306 -63 -90 -131 125 -9 -196 -40 152 -8 25 -110 -159 180 198 -19
3503a9J00j07O2j27r1J58j08L34rm05J61J29K2nj51PK37j31nj75R9L17k99K5o4
$$ -19 81 -26 36 -91 -182 -24 -132 202 193 -212 -51 78 100 95 -56 -49 188 57 52 -123 -24 293 -6 19 -45
3528d5J42R6q2q8j36J17L7j44r1J40J48q4p2k9J73O0k05k5P6L4K9j45l0k4K77
$$ -45 97 193 111 23 -113 4 41 -103 -194 -54 94 10 -62 -91 82 142 -63 -88 -12 22 51 -94 -124 -148 129
3553A29k52o1J3O0K59k37k46L82P6J97k84r5mJ46J3k80J30Q1j80K36j33N8l9L
$$ 129 -123 -184 -171 -111 148 -89 -335 47 123 320 36 -59 -63 83 96 -184 -54 27 -153 83 -50 8 -31 -28
3577b8J7j60Q1L29k39j03J68o9P6J3r1j59K34Q1o9k5m6K52l02J1K6j17L33j09
$$ -28 -11 -171 -90 239 0 -103 65 -4 72 85 -6 -165 69 150 81 56 10 262 -40 -29 -3 -120 213 104
3601A04k44J49M0l1r3N6J6L04j18k46K0K23o3j61M1j91K33J06j74o1RJ19J11j97
$$ 104 -140 9 49 18 -75 -19 -3 301 183 -63 -43 180 117 -44 -3 -194 39 145 -29 -90 -81 38 149 -48
3625d8mJ05q1J95m12R4K59n9l8m2LnJ81k63m0J68%L8k80K06l0J62j45j10lJ89
$$ -48 -52 53 -28 167 -245 -151 108 49 11 -31 -28 -33 148 -115 -155 13 13 51 -229 -23 -53 109 -36 -146 -149 40
3651D0j8J6j49Q3M5j09J84j73K13M4l13O5K03J50k65j35J19K14j25K8k70K2K07
$$ 40 22 38 -111 -28 17 -92 92 -81 132 176 -137 -72 131 281 16 -119 0 214 89 117 -153 -131 76
3674G6j4L0j18K5K56k84O2j72RJ92j27q4J11K33j1k60J00J12q5qr9Kn6J77p6p
$$ 76 62 92 -26 -1 255 -29 33 -139 -130 62 -65 -149 -38 195 184 -76 24 136 51 43 -56 -54 -110 67 -9 -16
3700a6j35J54L61l34k03K08O4j27J20j92J14O9q7j45q8J49K27j14j00j7N3o5J31
$$ -16 -151 3 364 30 -173 35 99 -28 92 -100 14 83 -4 -149 -237 -88 139 25 -75 -92 -39 -104 27
3723B7k12J78J72j77M4o4J66K3k35L7L0K6J49l11J16J42j11P2j59O0J94l0qj01
$$ 27 -185 -7 165 -12 32 -32 134 157 -78 -41 -11 15 164 -147 -31 111 0 72 -87 -27 167 137 129 28
3747B8j50K66rk58J36q0J39L1j61o8K46j24P3j91J04K97j37j02J1j58K27r1k36
$$ 28 -122 144 135 -123 13 -67 72 103 -58 -126 120 -4 69 -122 -18 279 142 40 51 -107 120 29 -207
3770b07J49P2k4P8j28kJ20P1j79p6K9K92k78q4j09L36r4qn9q9R6J06r4r9J85L9
$$ -207 -58 14 -10 68 -60 -62 58 129 -50 -126 -97 195 -83 -167 -276 60 -34 -42 -101 -190 -94 12 -82 -181 4 43
3796D3km8k50L21j5r3q3J6K29J00k00k7Q3o2l2K2r0K98k07q6J54p1J40L5m36J13
$$ 43 41 -7 -257 64 49 -44 -127 -111 118 218 18 -9 74 12 -20 2 -88 210 3 -83 71 0 140 175 -261 -148
3822a48K21r2K96j79j72J21R7k60L7J2J63N9j71L2J1o7J13k1j38J35N2M7l51J95
$$ -148 73 -19 277 98 -74 47 144 -116 -79 -67 96 155 -16 16 27 -40 73 52 -86 49 101 148 -203 -8
3846ho0N8J8j24J6K14j40p6PM6Oj87J52n1J91J64l34p4J94R6j37j72M1R4nm9m9
$$ -8 -68 -10 8 -116 -100 114 -26 -102 -95 -49 -43 -230 -78 -129 62 226 -108 -182 12 108 -29 -201 -160 -66 -71 -120 -169
3873a69j6K26n3J8k32K62k7M1j26J1L9J39j92K30k22l7J19o0J38j8k9O6j29J8
$$ -169 -185 41 -12 6 -226 36 9 50 -76 -65 -26 113 -79 151 -71 -108 11 -49 89 71 42 108 -21 -3
3897cj01K08K0j35L8J01Qr6k22K16J70j72o6k2J10P0j15r4J35K9Kk01R6o1J51
$$ -3 -104 104 124 -11 27 128 136 40 -182 34 204 32 -34 -56 54 124 9 -85 50 79 81 -120 -24 -85 66
3922F6J6j58O4O6j1j70J31nol7L3j56O4o2J87j66Q0j59L58k18M8N6N5n9j16O4
$$ 66 82 -76 -12 54 43 -127 4 -1 -7 -44 -11 -167 -103 -165 22 -144 -64 -223 135 -83 -35 21 76 17 -99 -35
3948c5N0j3kr7K7j5J37L4k7j05O9J36j25n9q3K94k08R1j68J76j1p4J48j53N5l5
$$ -35 15 2 0 -97 -70 -85 52 86 59 -46 23 159 34 -25 -108 186 -22 69 -99 77 66 -8 140 -13 42 7
3974Gq2R2j06K10M5k33J46N0M8j27o8o8M8R8P0n4k05L39j5k15j30J96N5j04q6
$$ 7 -75 17 -89 121 166 -67 79 129 177 50 -18 -86 -38 60 130 76 -129 210 195 -20 -150 46 101 -3 -89
3999h9J24j04K1ln4J8J76j95n2J74o1J27k28qJ31j13J67q5o6rK20j07O2l1j04
$$ -89 35 -69 -48 -51 -105 -87 89 -106 -158 16 -45 82 -146 -154 -23 -136 31 -54 -120 -129 91 -16 46 15 -89
4024h9J77o9k0R4p9J67r5j25qJ12r8O4p5P7K7O0Q6k60N6K68j77j20M4k5K81k51
$$ -89 88 19 -1 93 14 181 86 -39 -47 65 -33 31 -44 33 60 120 206 -54 2 270 93 -27 17 -8 273 22
4050B2R0j68K51j57r5j51M73j36l48K1L30l2q1k9M3pMj04p9OJ19K20k52l4O4Q7
$$ 22 112 -56 195 38 -57 -208 265 129 -219 -198 132 100 19 -10 33 26 30 -74 -153 -147 -28 192 -60 -94 -30 57
4076E7J31m34K53j2P2j43J00O1k44J70p0k1N8Q7k1j68K4K4J37p2J15j96j0N9L1
$$ 57 188 -246 7 -5 67 -76 24 85 -159 11 -59 -80 -22 65 44 -124 -100 -76 61 -11 104 -92 -102 -43 -12
4101a2j20J41J07j66J42j82R4J36p7j66k0J13M03l59r6Q0j4J58l9l09J50J2R8
$$ -12 -132 9 116 -50 92 -90 4 140 63 -103 -123 -10 393 34 -62 18 4 162 123 -186 -36 -24 74
4124G4j22O9j7j2J04k9m1r6L10j95kp4o8K40k51R9J8P0j82j0J41k4N9P5j10o5
$$ 74 -48 21 4 -8 96 67 26 -70 240 45 43 -31 -99 141 -110 -11 7 77 -105 -115 26 2 61 136 26 -39
4150c9k8J0o2q1K87q5l1N9J39j64K3j12j36n8L77M1j93PJ46k3j42RJ24o7j07J52
$$ -39 -67 -57 -119 -200 87 2 -29 30 169 5 28 -84 -220 -278 99 140 -53 -46 100 77 -65 -56 68 1 -106 46
4176D6p8m3Q9r1J45j59P5J59j45n6q5M48k36N9j11n3MN8j55J4K10nq9k11K05J79
$$ 46 -32 -75 14 -77 68 -91 -16 143 -2 -58 -143 305 69 128 17 -36 -32 26 -129 -115 95 90 1 -210 -5 174
4202A74j07o0m5J4J41j24J46j66jJ42j6j82J55j1J4o5j15L0Q7L5p4k08K13J22
$$ 174 67 7 -38 -24 117 -7 139 -27 -28 114 98 -84 71 60 74 9 -106 -76 11 46 -28 -236 -23 99
4226I9j86R6k04J93k4NpK7J6j47K15k17K57j19J00j76pP5j2n7J60l8j80J80m4
$$ 99 -87 9 -195 -2 -26 -21 -28 -1 15 -132 83 -134 123 4 104 -72 -79 -4 -16 -73 87 49 -131 49 5
4251Em6l2Q5k21J62J9J12Q6N8l56J32J16L9j70m5q0J27l6L6N3j19L64k52r7J28
$$ 5 -41 -73 12 -209 -47 -28 84 170 228 -128 4 120 159 -11 -56 -136 -9 -45 -9 44 -75 289 37 -60 68
4276F8P8O3l11J28j38J56N7p5r2q7L91j40q5j38J40K30k21O4m1rl0R6n7P7r0n7
$$ 68 146 209 -102 26 -112 44 101 26 -66 -153 238 98 13 -125 15 245 24 88 47 38 8 104 47 124 34 -23
4302b3j2m8J85p8p2O8K4o7M4j8j21K24k15J02p3j9l2N4J15j36K1N3rK09j64j03
$$ -23 -35 -83 102 24 -48 20 44 -23 21 3 -118 106 -109 -7 -80 -99 -131 -77 38 -98 -77 -24 -33 176 12 -91
4328i1K7q4J97j20O2m2R7Kj64J82J64k19k62K26N5J2L8p9P9o4R3j57J36Kr1M0
$$ -91 -64 -148 49 -71 -9 -51 46 48 -116 66 230 11 -251 -25 30 42 80 1 80 16 109 -48 88 90 -1 39
4354C9P0M1rm2k32O1K94j57o5K4L5m9N6j20m2K8J07p8p7l4J72L8J49k52J50j83
$$ 39 109 150 141 99 -133 -72 222 65 0 24 59 10 66 -54 -96 -68 39 -39 -116 -150 22 60 209 -43 107 -76
4380g6l1J46j48J03R6j10J27j96J22J05j50j10J44n0l2j80J40J55K1M2l14K3P0
$$ -76 -107 39 -109 -6 90 -20 107 -89 33 138 -12 -122 22 -28 -60 -240 -100 55 76 118 -196 -173 -103
4403a03J67m3J32k41K16j46l7P9K9K5Mj45P1p4K38k12L4j21K00J22j38j8K7J31
$$ -103 64 21 153 -88 128 -18 -55 24 53 78 82 -63 8 -66 172 -40 -6 -127 73 195 57 39 66 197
4427A97j17j73J08J53m4M1j56M1q6j7QJ9j14J23q3m2J25K6m8J78l13K66j46K8
$$ 197 80 -93 15 168 124 165 9 50 -36 -53 -45 -26 -140 -17 -100 -142 -17 9 -39 139 -174 92 -54 -26
4451b6m1P5L1j97J97p4p5J10Qk5m2j2M8K14l48M1N5J40q6j2J6j03K62j02j17q1
$$ -26 -67 8 39 -158 39 -35 -110 0 8 -17 -59 -71 -23 191 -157 -116 -61 79 -7 -19 -3 -106 156 54 -63 -144
4477a44J52J14o3j28K07j1n0j29p2J08l6q4P3J02N1p0q2j7J80J5O5k21K4K1J08
$$ -144 8 122 59 -69 138 127 77 -52 -124 -16 -52 -136 -63 39 90 20 -62 -79 101 116 181 -40 -16 5 113
4502A13j93P1q5P2L4qJ09j83M0J46m7k5J0r4Q8r8m8P2n4J61m3J13r7k06J37%K9
$$ 113 -80 -9 -94 -22 12 4 113 -70 -30 116 69 44 54 -40 48 -50 -98 -26 -80 81 38 151 54 -152 -15 -15 14
4529A4P0K3k01Q2j5N7J89k86K2J89r2j41J07k08K05k5k69P1R0Q3j1j6K4m4J9J51
$$ 14 84 107 -94 -12 -27 30 219 -67 -45 144 52 -89 18 -190 15 -10 -279 -208 -118 -35 -46 -62 -38 -82 -63 88
4555H8k10J46O2j17J15K4J6n4l2oq3O3N6j43L2P9j04J96j48o6j4J98j75n3J1J99
$$ 88 -122 24 86 -31 84 108 124 70 38 32 -51 12 68 -75 -43 36 -68 128 -20 -86 -100 98 -77 -130 -119 80
4581H0Pj9o6o7J0K9m6j17K37n6J34k58R2n2J27K2Q0k80K84r5M5j6j92K42j37q
$$ 80 87 68 2 -65 -55 -26 -72 -189 48 -8 126 -132 -40 -92 35 57 137 -143 141 46 91 75 -117 125 -12 -20
4607b0q3J42k4j06J8J92N8l68K24j87K03Q7j35k08J30K18j73J26j46K53k46K2
$$ -20 -103 39 15 -91 -73 119 177 -191 33 -154 49 136 1 -207 -77 141 -32 94 -52 201 -45 -23
4629b3Q2j54P0J34n0k84K09n6K43J7k20O5l2J02q3J29j5p6l2j6Q9j3M2L2j93N6
$$ -23 59 -95 -25 109 59 -225 -16 -72 171 188 -32 33 1 103 20 149 134 58 26 10 99 86 128 160 -33 23
4655B3N5R3j37M8k25K81o1q1q4J61ml6q9R5k6kp7o6J57J56k73Q2l9J02J7j63J13
$$ 23 78 171 34 82 -143 138 77 -4 -88 73 69 33 -56 39 13 11 -66 -132 25 181 -92 -10 -49 53 70 -93 20
4682B0k31J79M7j15M8J4N6R0j29j53N3Oj6k02J88K89k91J69j34J30m4N1j06K0
$$ 20 -211 -32 15 -100 -52 -38 18 108 -21 -174 -121 -115 -131 -333 -145 144 -147 22 -112 18 -26 25 -81 -61
4706f1J10op4r1L4K63j16J36k34J21j4k80K4J02J65M6p4k90J63J39o1k0k8M8J21
$$ -61 49 43 -31 -122 -88 175 59 195 -39 82 68 -212 -188 -86 79 125 51 -239 -76 63 2 -18 -46 2 123
4731A23N6k22J52M0j61n5J25j24o9J57Kq3J14lj21l8K15k90L00j07r9J43j39J70
$$ 123 179 -43 109 149 -12 -67 58 -66 -135 22 24 -59 55 52 -69 -107 108 -182 118 11 -88 55 -84 86
4755H6j94R0om8J2M2m6P9p3J36j63J46k5j9l9j5%nJ81j50J21j25Lj03L5K14m4
$$ 86 -108 -18 -24 -72 -60 -18 -64 15 -58 78 -85 61 36 17 -22 -37 -37 -42 139 -11 110 -15 -12 -115 -80 134 90
4782I0j88K13j77jM4J05j11M2m9l2P6n2J04q6J68j53j23P2P3L8R0j45m9L03k13
$$ 90 -98 115 -62 -63 -19 86 -25 17 -32 -64 12 -40 64 -22 146 -7 -130 -58 15 53 143 -2 -51 252 39
4807C9M9P3k23L9J7K8M3m6m3j2r7J48M6k5p1R6L4n6p2M8j1j75J70j5m2J54r0K4
$$ 39 88 161 -62 -23 -6 22 65 19 -24 -36 -133 15 61 36 -35 61 95 39 -33 15 4 -171 -1 -16 -58 96 6 30
4835C0K1j64R2P5j1r5K7o1J37j57N1l1O2n1N8j23K77o1r1j8qK15l09nJ72K1o9
$$ 30 51 -113 -21 54 43 -52 -25 -86 51 -106 -55 -86 -24 -75 -17 -140 137 76 -15 -33 -41 174 -135 -140 32 53 -16
4862a6J04j48M1J19j49NJ16j57J94Oj08R4j09R7j78J74r3N1l8L2K1k3l9o0J27
$$ -16 88 -60 -19 100 -49 -44 72 -85 109 115 7 101 -8 89 -89 85 -8 43 5 37 58 35 -4 -64 63
4887F3j13J37Nj73P4J4k3M1P0k18O2J31P3k77nP9J15Nj91N5N4J75k91J75jP5j82
$$ 63 -50 87 92 -81 -7 7 -16 25 95 -123 -61 70 143 -134 -139 -60 55 60 -131 -76 -22 153 -138 37 36 111 -71
4914g1J02k7j23J25O8M3j36m2Nj7K0rJ42j56R2j69N7k5J96j52J12q8K8j06J76
$$ -71 31 4 -119 6 74 117 -19 -61 -56 -73 -53 -62 80 -76 16 -153 -96 -121 75 -77 35 -53 -25 -131 45
4939D5k66L52J0k24M1J33o2oj46K05j32K2O2O3j60K7k9m9J90j61P5J0j40J59l8
$$ 45 -221 131 141 -83 -42 91 29 23 -123 82 -50 -28 34 97 -63 -36 -65 -114 76 -85 -10 0 -140 19 -19
4964a9J66j04j52K76L0k42l1O4j09K41k1r1K8k9P9n2l2j69J08J07O1j86N5Q6j37
$$ -19 147 43 -109 167 197 -45 -76 -12 -121 120 99 8 36 7 86 34 2 -167 -59 48 109 -77 -22 64 -73
4989g3P4j02O3P4j17J77Jj39J27j02p7K03o8Nj01O2k6N2q7O3j44Q7J15J2n8n5
$$ -73 1 -101 -38 36 -81 96 97 -42 85 -17 -94 109 41 46 -55 7 -19 33 -54 9 -135 -48 67 79 21 -34
5015c4K48k91J30j34J01m6R6j62J20J41k38J1J3p4L29o2q1q2J09l5j63J99m6j17
$$ -34 214 -77 53 -81 20 -26 70 -92 28 169 -69 -58 -45 -119 210 148 67 -15 94 59 -104 95 49 -68
5039f8L30k33J29j12j07O1JL2j58J33rk0Jo4J43j43O3J79j58j27R8J6m9J75o7
$$ -68 262 29 158 46 -61 0 1 33 -125 8 -1 -21 -20 -84 59 -84 -21 158 0 -127 -29 -13 -62 113 46
5064D6k1j00N5J4J15m8k12K28r7J3j09O8K11j31r0J22q4Q6j04J7J5J33j30r0J80
$$ 46 25 -75 -20 -6 109 61 -151 77 -20 -7 -116 -48 163 32 -58 64 -20 66 -38 -21 -6 127 -3 -93 87
5089H7n4j4KJq0R4n1Q1j40l9K38j04j7p4N9oM0kk09K91k04J42l6o3J76J00j69
$$ 87 33 19 21 22 -58 36 -15 66 -74 -113 125 21 4 -70 -11 -17 23 21 -188 103 -101 41 5 -58 118 218 49
5116D9m4L6J33k56K2J5J26k13P7K24k28L2n1n9J18N9l8l8m7J03o6R6j4m2n1O9
$$ 49 5 41 174 -82 -60 -45 81 -132 -55 169 -59 -27 -78 -137 -19 40 2 -36 -83 20 -46 50 36 -6 -57 12
5142A2k6N6j47M2j39J45P7LP1k03R8p3K01m5k10K10j22l5J49J0K4Mk81K21r9J66
$$ 12 -14 42 -105 -63 -202 -57 20 23 94 -109 -11 -84 117 72 -138 72 -50 -85 64 74 98 102 -179 42 -57 109
5168A09j77J00p2M9n3l4J73ql8p3K40k37j0k4K1O0j1r7L0k2J60p4J7j10MJ76j31
$$ 109 -68 32 -40 9 -44 -78 95 87 49 -24 216 -21 -31 -55 -34 26 15 -82 -52 -74 86 12 29 -81 -77 99 -32
5195c2Q8q3p5J97j7r4O6R8p6j02Q6N4j74R7j79j73L06k7K08Nk85k81J44K65j79
$$ -32 56 -27 -102 95 78 -16 50 148 72 -30 56 110 -64 33 -146 -319 -13 -40 168 173 -112 -393 -249 16 -163
5220a63M2q3J71n7J61q0ql3j3J52m7J5p3j04R5J54n4j40M1J00r9m4J80j24J39
$$ -163 -121 -204 -33 -90 71 -9 -17 -50 -63 89 42 57 -16 -120 -25 129 75 -65 -24 76 -23 -67 113 -11 128
5245A28j81P4l6j6j8J76n3L2q5Q6p6q3J27o4J05m6j47J87j1j96K17j12Q3L5j03
$$ 128 -53 21 -15 -31 -49 127 74 106 21 107 31 -52 75 11 116 70 -77 110 99 -97 120 8 91 126 23
5270B3n8m3p8L3L9M3R3P9j81J56k45J80m6K8j7PL8K7k77L73k60J02m8q4j7J91
$$ 23 -35 -78 -156 -123 -84 -41 52 131 -50 106 -139 41 -5 23 6 13 51 78 -199 174 -86 16 -32 -116 -133 58
5296E8qo6L8K0Jk17K68j17m0J30k60R1J28p2j47L11j98L7P2%M8J5Rj77p8J39k7
$$ 58 50 -16 22 42 43 -174 94 -23 -63 67 -193 -102 26 -46 -193 118 -80 -43 29 29 77 92 101 -76 -154 -15 -42
5323d2j7P6ko5j6k8M9k7m1M6%K87k63m8J82k2M6j43J74k2j93M3j67J71J1k8m4
$$ -42 -59 17 15 -50 -66 -94 -45 -72 -113 -67 -67 220 -43 -91 91 69 115 -28 146 124 -69 -26 -193 -22 -11 -39 -83
5350h3J62q0j20k2P9KJ87j56j11J61o5Q4j12l2LJ04k14K55n4l6kl0J32n0L5K2
$$ -83 79 -1 -121 -143 -64 -62 125 -31 -142 19 -46 38 -74 -106 -103 1 -213 42 -12 -48 -50 -80 52 2 37 59
5376E9N7j96J96j62o9J16j26K00j99J20J00k78N1L6K9Q3J19l6R3j63l5m6p9K49
$$ 59 116 -80 116 -46 -115 1 -125 75 -124 -4 96 -182 -131 -95 -66 17 136 100 193 30 -5 -51 -130 119
5400A19J4q8oQ6k04J34j22J2J58j40Q9p6j6p5K6J64j58K03J20k73K6j15J92o6
$$ 119 133 45 39 125 -79 55 -67 -55 103 -37 52 -24 -40 -115 -89 75 -83 120 240 -33 -7 -122 70 4
5424DO2p9j30J20N7j75J17n4J01J04m7J11k57L1N3r1Q9j71L77k01j08J41m1O9
$$ 4 66 -13 -143 -23 34 -141 -24 -78 23 127 80 191 -66 -35 18 -73 16 -155 222 21 -87 54 13 82
5448H2k01K28k50K3J27j72J30M7n3J1m9J3K6P9j02J6O0j77N6N8J35K5p8L5r5K8
$$ 82 -119 109 -141 -118 9 -163 -33 14 -39 -28 -77 -64 -38 41 -61 -45 15 -162 -106 -48 87 112 34 69 -26 2
5474BJ28j5k9K3J5j18n7P0m8n4J16l7k9j01J77J75k53M7r6J08q2j11J64Q7j26
$$ 2 130 115 86 109 124 6 -51 19 -29 -83 33 -4 -33 -134 43 218 -35 12 -84 24 -58 -169 -5 82 -44
5499d4k8j9J10m5j60J70qn2L9j03K83r3J6n6Qr1K5n9L4n0J21J26p5rj44J3K09
$$ -44 -72 -91 19 -26 -186 -16 -24 -76 -37 -140 143 50 66 10 18 -73 -48 -107 -73 -123 -2 124 49 40 -104 -91 118
5526A18k06P5N3p8N6r5J28Q8k04Q6Qq5R0J37o3k15L3J8Q7o6J75j55J61j58J1k6
$$ 118 -88 -13 40 -38 18 -77 51 139 -65 21 29 -56 34 171 108 -107 -74 -56 31 -35 140 -15 146 -12 -1 -27
5552b7N6j15J47o5N0N3l8j4j52J75j5j8o3J9J6J02k21j2O8L2n3N3R2k61J62p9
$$ -27 29 -86 61 -4 46 99 61 47 -105 70 55 37 -26 -7 9 111 -110 -122 -54 -22 -75 -22 70 -191 -29 -108
5578a08J17po3J62j21P0j90J38J47j78j41R6q0M3J86j04J23m1N7k40J4K00n5o6
$$ -108 9 2 -61 101 -20 50 -140 -2 145 -33 -174 -78 -158 -115 71 -33 90 49 106 -134 -120 80 25 -41
5602d1j12J59NJ3j94L70k69K2L9N1j37k8J29k8k5J43k6j60J95q9J01k00J11P1
$$ -41 -153 6 11 24 -170 200 -69 -47 -8 43 -94 -122 7 -21 -46 97 71 -89 106 17 118 -82 29 100
5626A00j05J58j30R8r3MK5K9n2kJ6o3k8j22J10L2q7L8Q2Q9j26Oq5J71k20K25K2
$$ 100 -5 153 23 121 28 32 57 86 34 32 48 -15 -43 -165 -55 -23 -110 -72 10 99 -27 -21 -106 65 -155 70 92
5653I2k4j94N4J2J89j45J36j76j9%o1J64j82J45K1p2J14J10j42J26k25J04O8K3
$$ 92 68 -126 -72 -60 129 -16 120 -56 -75 -75 -136 28 -154 -9 12 -60 54 164 22 148 -77 27 95 118
5677A18L3j23M8r1lNO4K6m1j02o1J27j6NN5l0j81J28J22j60J03mkk7l4J30j15
$$ 118 151 28 76 -15 -18 -13 51 77 36 -66 -127 0 -16 -11 44 14 -167 -39 83 -77 26 22 20 -7 -41 89 -26
5704b6j9J82k94K13J4K3p5j1k6L2j8P6j20O5J20j58n6K33m4k67K79j64N2N1p0
$$ -26 -45 137 -157 56 70 93 18 7 -19 13 -5 71 -49 16 136 -22 -78 155 111 -156 123 -41 11 62 -8
5729hp1Q8Rl1M9o3j01O7J00j48J41j33O1r3J40J88k50J20L7j98M7q8kP2PM0O1
$$ -8 -79 9 18 -13 36 -27 -128 -61 39 -109 32 -101 -40 -133 7 195 -55 65 102 -96 -49 -137 -139 -67 -60 -20 41
5756D1r7l9J81j11N9J6Q2j67n2K4P5l6J7o0J78j7j81J09m6K02j55n6J91j14R6
$$ 41 -56 -95 86 -25 34 50 132 -35 -87 -63 12 -24 -7 -67 111 94 -87 22 -24 178 23 -33 158 44 140
5781A40J8j25o5Q4P5r5Jl5K6K6j3L9r1QK5m6NP4p3K0J78j81j10P1N7n3J38q8n0
$$ 140 158 33 -32 52 127 32 33 -2 24 50 37 76 -15 -7 18 -28 -23 51 -22 -2 176 -5 -115 -44 13 -40 98 10 -40
5810d0O2N7j94J76P3m0m0j29l5J67j07J08p2m3m1K04j61R5j14N4N9k39K79j31
$$ -40 22 79 -115 61 134 94 54 -75 -110 57 -50 58 -14 -57 -98 106 -55 40 -74 -20 39 -200 79 -52
5834e2j21K94j25M5j27K15j70J01%Rk3j18Ml0J21K23k41M6q0L0j2J11N3q8J42
$$ -52 -173 121 -4 41 -86 129 -41 60 60 69 46 -72 -68 -98 23 246 5 51 -29 1 -11 100 153 65 207
5859B07l84J97j39J64j24J42m3j18J43p2m6J49p6J24j78N3N9m3l9n9M1l9J94K3
$$ 207 -177 20 -119 45 -79 63 20 -98 45 -27 -73 76 0 124 -54 -1 58 15 -24 -83 -42 -81 113 136
5883A36j26j85J03J16k8j03M1k2J00j3q9K4J13k56J13M9Jl8j63K48j12J98k4j79
$$ 136 10 -175 -72 44 16 -87 -46 -68 32 19 -70 -46 67 -189 -76 -27 -26 -64 -227 21 -91 107 83 -96
5907i6Q9R1p9Lp2p0m0L12j95L6p2J98r1l2J05Q0k16R3n5J41q8J69j45p9J15j40
$$ -96 -7 84 5 8 -64 -134 -174 138 -57 -21 -93 105 14 -18 87 167 -49 44 -11 130 42 211 66 -13 102 -38
5933c8MJ08O4J2p8j08Lo0J45M2r2K9L9q8q7J46j02KJ59p4l4Pl3M2j6r5Q1N2j02
$$ -38 -34 74 138 150 72 -36 -33 -93 52 94 2 31 70 -18 -105 41 -61 -59 100 26 -8 -1 -34 8 -8 -103 -22 30 -72
5962g2K17k04J35j13m2l3Q6Q0l0P0k74L08j58J13P7m8k6q9oj60K26p7M8n7J0l5
$$ -72 145 -59 76 -37 -79 -112 -26 54 24 94 -180 128 -30 83 160 112 86 -3 -9 -169 57 -20 28 -29 -19 -54
5988e4K09j85J22n3m1L3k4l9P0n2J75k27K5k8R0J30k46RJ90M6j12K3O9j2k24P7
$$ -54 155 -30 92 39 -2 31 7 -32 38 -14 161 -66 -41 -69 21 151 -95 -86 104 150 38 61 130 118 -106 -29
6014b9L5j23Q8L9J97j99k9J0J36k02J67q7q8J07m4R6l0q5m9J06j1n3P8Ml7P2j73
$$ -29 6 -117 -29 10 207 8 -21 -11 125 -77 90 3 -85 22 -22 74 44 -41 -90 16 5 -48 30 34 -3 69 -104
6041a04L32l62K05j60J41J4p9pN4LK3j85J91n2j29K27k56J97j9L6m0N8k3r2J54
$$ -104 228 -134 71 -89 52 66 -13 -20 34 37 60 -125 66 14 -115 112 -144 53 34 70 30 88 65 -27 127
6066A27j44rl1M0l9P0k2R7r4P2j25l2J27m6O0M2j45L1j6NOQ0j05m3J67j40R4l3
$$ 127 -17 -26 -57 -17 -56 14 -8 89 -5 67 -58 -90 37 -9 51 93 -52 -21 -37 -32 -26 54 -51 -94 73 -67 27 -6
6094fk6J2L7p4K08j00MPj71J00P8m4Q0r8N2k5M1k05N0J97k43J37k1j2k06J78m5
$$ -6 -32 -20 17 -57 151 51 55 62 -109 -9 69 25 105 7 59 34 75 -130 -80 117 -126 11 -10 -22 -228 -50 -95
6121i5Q7j3J04L8l0j34J7j22J15j22J03J1J6J1j9m9L3J92j79k0L7l7j00K14rN0
$$ -95 -8 -21 83 121 91 -43 -26 -148 -33 -155 -52 -41 -25 -14 -33 -82 -49 143 -36 -56 -19 -56 -156 58 49 99
6147I9j23R0j95K06j36M5J37j41J04j96K26k56Q2J12j66J08m6P8r0J25j18J36
$$ 99 -24 66 -129 77 -59 -14 123 -18 86 -110 116 -140 -58 54 -112 -4 -50 28 -62 63 -55 81
6169H1j28k4P1q3l0J31o0L0R9l2j04J63l0j27N7p1J6j16J28n6J03P2k10J48j26
$$ 81 -47 -71 0 -83 -113 18 -42 -12 87 55 -49 114 84 -43 14 -57 -41 -157 -29 -85 18 90 -120 28 -98
6194i8J38J6n1P5j81K9K15j94J32m4p1J08K8j05R2j29q3L5J27R7j55Nr0J10L0
$$ -98 40 56 5 80 -101 -72 143 -51 81 37 -34 74 102 -3 89 -40 -123 -88 39 136 -19 -14 -104 6 36
6219C6n7R4l7P7j47P9j29K10lk87J81o5K9R4m6P4K2j59onk2L0J90j53j3O4n0Q8
$$ 36 -21 73 36 113 -34 45 -84 126 123 -164 17 -48 -19 75 29 103 125 -34 -40 -45 -67 -37 153 0 -13 51 1 89
6247H9k12J09J35j40J9m8kJ24j16l5J08k7K2kj00L4K5M7j56K12j31J25r1p5Q3
$$ 89 -123 -14 121 -19 0 -48 -50 74 -42 -77 31 4 26 24 -76 -42 -17 30 -126 86 -45 80 -11 -86 -3
6272cn0Q6l4kK0k0Q8q9Kk4N3p0NOM2L3L7o3R5j49J71j50J23Q2n4q4R2j65rN7M7
$$ -3 -53 33 -1 -3 17 -3 85 -4 -2 -26 27 -43 -38 -32 10 43 80 17 112 -37 134 -16 107 189 135 51 143 -22 -31 26 73
6303G3j28n7Q7n1L5N7k1j79K38m9J8Ln3r1O9K4kJ23L3k58O1J47p5J9j10J49k19
$$ 73 -55 -112 -25 -76 -41 16 -5 -184 54 5 23 26 -27 -118 -49 -25 -27 96 129 -129 -68 79 4 23 -87 62 -157
6330a57J82j03J5J61k46Q1Q1j9qK6r1K24j71J45j99P3J71Kj50J03j05mr6J50K1
$$ -157 25 -78 -63 98 -148 -67 14 -5 -13 13 -78 146 -25 120 -79 -6 165 167 17 120 15 11 -85 65 86
6355H6q8k00K22R5k81K09o3R6N7k27J79j06j44J59J24j70m6O4k1J13Q2j63K5j1
$$ 86 -2 -202 20 115 -166 43 -20 76 133 -94 85 -21 -165 -6 118 -52 -98 -34 -55 58 140 -23 2 -9
6379iK04l32M05k18j4j8q9Mm6J18p1J54J0j47K4K43o6j65l3Q2r5N5pJ35j66lo1
$$ -9 195 -137 268 50 36 18 -71 -67 -113 5 -66 88 98 -49 -25 218 152 -13 -46 36 -59 -4 -11 124 -42 -45 -106
6406a06P1P3P0j84P1n3J68j48O1M5j51P3J34j3k17J40n5p2R3o3N3o1P2J35j12
$$ -106 -35 38 108 -76 -5 -58 110 -38 23 68 -83 -10 124 111 -106 34 -21 -93 0 -63 -10 -71 1 136 24
6431B4K2mP9j53N4N1n5M9j47J03p1L8j7J17k9n8O1j20n3J09r2P8p1m0N2J03mK3
$$ 24 46 42 121 -32 22 73 18 67 -80 23 -48 -10 -27 90 61 3 64 -56 -109 0 -92 -14 -85 -125 -73 30 26 49
6459D9k28K00m1P1J2m6J44j82J09N4j47pL3j07P5J19j31nJ37j43MP2m6M3j54K69
$$ 49 -179 21 -20 51 63 17 161 -21 88 142 -5 -12 21 -86 -11 108 -23 -28 109 -34 -30 42 -4 39 -115 154
6485A54j97%JJk1K8J4k4J89j55o7O5mO2l8J3Lj7p1O3J58j02o1J9j06J31j20J60
$$ 154 -43 -43 -42 -41 -62 -34 -20 -44 145 -10 -77 -12 -16 46 8 21 24 7 -64 -1 157 55 -6 13 -93 38 -82 78
6513G8j50n2m8K49j56Lp8L79j9j06J87k58K6n8J10j08l5k7J33j32J18j1P5j34
$$ 78 -72 -124 -172 77 -79 -76 -154 225 206 100 287 29 55 -3 107 -1 -36 -63 70 -62 56 45 120 -14
6537a4R4l7L4q4J25k82K8J91j02R5n0M3N7J5j64O0o0O3J1j28J27o2J69j39M1J7
$$ -14 80 43 77 -7 118 -164 -136 55 -47 48 -2 41 98 113 -51 9 -51 12 23 -105 22 -40 129 -10 31 48
6563D8k01J65k51n7L07j87J13K29j94j77J82r1R9n7Q6l5J43j14J8j5n1J26q7R8
$$ 48 -153 12 -239 -296 11 -176 -63 166 -28 -205 -23 -114 -15 -72 14 -21 122 8 26 11 -40 86 -1 97
6587I7k28O0n3Q5P2k3J6j3J9p3J16j15mJ02Lj55oJ06k7j19J23N2O5j26K32l4l39
$$ 97 -131 -71 -124 -39 33 10 26 13 32 -41 75 -40 -44 58 61 -94 -100 6 -21 -140 -17 35 100 -26 206 172 -167
6614a67L31k29O9j58K85p8l7R8j81l9p9J88j25J8L7L15l07Q1q3k0j8N8n1J4p1
$$ -167 164 -65 4 -154 131 53 16 114 -67 -106 -185 3 -122 -104 -67 248 -59 22 -61 -81 -99 -41 -92 -78 -149
6639a49L98k85J86k45K7J88k00J65k82K43K5j24N2J16j74P9j39K05j65k1N8P5
$$ -149 249 -36 150 -95 -68 120 -80 85 -197 46 71 -53 -1 115 -59 20 -119 86 -79 -100 -42 33
6661C3L8m4k83J96K0Ml8K4J20p4LRm8R7j02K3J7M8j13K02j15Nj2j12k9o1L35j73
$$ 33 71 27 -256 -60 -40 -36 -74 -50 70 -4 -1 8 -40 57 -45 -22 -5 43 -70 132 17 22 10 -102 -131 -192 143 -30
6689c0K01l35J38N1J7K3n3n8m9J49J3q8J04q4M3j24K80k20J1Q5n7n4O0r4P9j24
$$ -30 171 -164 -26 25 42 65 12 -46 -95 54 67 -21 83 -1 42 -82 198 -22 -11 74 17 -37 23 -71 8 -116
6715a16o4R7Q1k7K6J68k69O9K0J27k20Q3j10K7j08J09n9J79j43jJ38M7J63l91
$$ -116 -180 -83 -2 -29 -3 165 -104 -35 -15 112 -108 -25 -135 -108 -216 -107 -166 13 -130 -131 7 54 217 -174
6739a74O2L91n2n77N72J16n37M08k29n3N2J53J04l55j10L38n6K41l41K69k89M93
$$ -174 -112 279 227 -350 222 338 -199 209 -20 -73 -21 132 236 -119 -229 109 53 294 -47 222 -67 426
6761D26p66K68j48M45j66p3m3K82k68J63k48K28q7L3o8n4N4J7l1r8P2j11R5J8
$$ 426 -340 -72 -220 225 59 -14 -57 225 -43 120 -128 100 13 46 -22 -76 -22 -5 -36 -134 -62 -173 -78 -60
6785f0K48m02R4J21j64J75J4n3J06k9m2L0j15J67o9N2j52J3M4L3o2J48j44P2R
$$ -60 188 -214 -120 1 -163 12 26 -27 79 50 8 38 -77 90 21 73 -79 -66 -22 11 -51 97 -47 25 34
6810C4K2J55j40j44O0l1J35k23J87j81J22r4J1oJ10J61k69M00l44K0P2jq3J21
$$ 34 56 211 71 -73 -13 -44 91 -132 55 -126 -4 -98 -87 -93 17 178 -91 309 -35 -15 57 56 -27 94
6834I4j3j53J40j52o1L25k67Q3j06K4M1J71j79Q8j04J64k11L8J23o1O2o7p5J0
$$ 94 81 -72 68 -84 -145 180 -87 -4 -110 -86 -45 126 -53 35 -69 95 -116 -78 45 -16 46 -21 -96 -86
6858h6J67K2j00j3K6j50K57pL0k1k5p8k6k2n9J56n2o4l8R1j7J08r9P6K4q6Q5j84
$$ -86 81 103 3 -10 16 -134 123 116 146 125 100 22 -4 -26 -85 71 19 -45 -83 8 -9 99 0 76 100 14 99 -85
6886h5J11J0K8k8n9l3M9N3mK8j50J67m5k6Nq6J44j53O0j0L3j36K32r4p2J67j41
$$ -85 26 36 64 36 -23 -56 -7 46 42 70 -80 87 42 16 21 -65 79 -74 -14 -24 9 -127 105 11 -61 106 -35
6913c5P7j83J71jp3R7J07r4k55L49k49J73r5r8q6K83M4k52K44o9j6j9k08K28J23
$$ -35 42 -141 30 29 -44 53 160 66 -189 160 -89 84 -11 -109 -195 88 132 -120 124 55 39 20 -188 40 163
6938A63j59J03m0J09j70o4j47K08j11J91j27R0m0J42j36P6k20J48q1J13k3k7N8
$$ 163 4 107 67 176 6 -58 -205 3 -108 83 -44 46 6 148 12 88 -132 16 -65 48 25 -2 56
6961E6j11L2J03k5j28J24l2l2O0Jr8O6n5N5r4J21j48J71r8j1M3qP8J7oO4k3j5
$$ 56 -55 -23 80 55 -73 51 19 -13 47 48 -50 16 -39 16 -78 43 -105 66 -32 -43 0 -8 70 87 81 145 122 107
6989A07o0r8P5n9R8j04J05p3r6N8N2kj2l4J9J3j9N8o4j16J74k1J47j57j44J23
$$ 107 47 -51 24 -35 63 -41 64 -9 -105 -47 5 3 -9 -43 -24 -11 -30 28 -36 -152 22 1 148 -9 -153 -30
7015c0m7l6K09J24j18j67J02p6q9K0J20J17m8j86N3L4k2m4K41p6j11Ok2Q1p6J31
$$ -30 -77 -113 96 220 102 -65 37 -39 -128 -108 12 129 81 -105 -52 -18 -40 -84 157 81 -30 -24 -46 35 -41 90
7041I0j00k5J40J11k41J7k14K74r2NJ06jq6jO4j86l8J63J8o3N5O2j4k9K9J4q3
$$ 90 -10 -35 105 216 -25 -8 -222 52 -40 -35 71 70 -16 -17 47 -139 -177 -14 4 -59 -4 58 44 15 44 58 -25
7068b5J00j00L7k7p5J43k49J10M4L6P8j25Jn1R3r9j74L00M8Q2o6j38m7J73q5o
$$ -25 75 -25 12 -15 -90 53 -196 -86 -42 -6 72 -53 -52 -103 -10 -109 -283 17 65 147 81 -57 -104 69 -16 -22
7094b2lo9m8R6J13m3j08M7k9J35m6LKj28J08M1j43m2J96p6m0L8Rj48J37K6K3l6
$$ -22 -25 -94 -142 -46 67 24 -84 -37 -66 69 23 26 28 -100 8 49 -94 -136 60 -16 -56 -18 -9 -157 -20 6 29 -7
7122gJ40k83J10J28n1p2j32K02j20J54J3k5r9p2J92L3p7r5L4J55l1j71r2K11o3
$$ -7 133 -150 -40 88 37 -35 -167 35 -85 69 82 57 -42 -114 78 111 34 -61 -27 128 97 -74 -166 45 -18
7147a8P8j50R7M9m2j20J61j79J01J68k01k5k4N8J4N7J9L9j49J13J42l21K11j15
$$ -18 60 -90 7 56 14 -106 55 -124 -23 145 -56 -81 -105 -47 -33 24 43 82 -67 46 188 -133 78 -37
7171c7PNQQ4j54K36n0j53Q8j19M2Q0j49J95K2j12Mp9M3P8Q8j23q5J03j2J07o3
$$ -37 -30 -25 -17 67 -87 149 99 -54 34 -85 -43 37 -112 83 105 -7 -3 -82 -39 39 127 4 -81 22 10 117 54
7198E4k0j06J48j87P6J57q7l4r1J30j19J10p8j17J44Pj62K17k4J71j96n8J0Q9
$$ 54 34 -72 76 -111 -35 122 35 1 -90 40 -79 31 -47 -164 -20 -13 -175 42 18 189 -7 -65 -55 34
7222C4q9j5J4N0m4L1p7K15j05o5J58j15L0q5k0N7j17P1O7M0M4p5K6j63K9O5K9
$$ 34 -55 -70 -56 -6 -50 -19 -96 119 14 -51 107 -8 22 -63 -83 -26 -143 -72 -5 35 79 4 30 -133 -104 -39 -10
7249a0M9J03j59m0P4M8l3O1j90O6J7R4j96J24J27m4j55J28n7jo2J08j1j74K67
$$ -10 39 142 -17 -57 17 65 32 93 -97 -31 -14 80 -116 8 135 91 -64 64 7 6 -56 52 41 -133 134
7274A34j49l34K37K25r4J19j14J25M0k6j85m2M2M6l74L06m7N4j06K5K21j45J40
$$ 134 -15 -349 -112 113 19 138 24 149 189 163 -22 -64 -22 24 -350 -44 -91 -37 -143 -118 103 -42 98
7297I8j96Q5k65M03P3k77j98L92k33KK05P1k18L5J37k0j80L0o4K14K1j5j75k4
$$ 98 -98 -13 -278 125 198 -79 -277 115 -118 -116 89 160 -58 -23 114 94 -86 -56 -120 94 115 100 -75 -99
7321i9J69K0jk1M7j25M1k1m3J31j23P7o8l6n2J31N4j25L63k75j8n5L8L9j06j18
$$ -99 70 90 89 68 115 -10 31 10 -33 98 -25 52 -16 -52 -104 27 81 -44 319 44 26 -29 9 48 -58 -176
7347a76l7J89m1J12k18L45j59K7r8J40j06O1j02P9n1q1R2L3q4n0J42q2P4j63K71
$$ -176 -213 -24 -65 47 -171 174 15 42 -56 84 -22 39 -63 16 -35 -116 -24 9 -75 -125 17 -65 9 -154 117
7372A17n8q5K5k9l4M4j8L6n7N7n7j24K39j24k3J16p1l1L2o8R6j11K11j4j09K19
$$ 117 59 -26 -1 -30 -64 -20 -38 -2 -59 -2 -59 -183 56 -68 -91 25 -46 -77 -45 -113 -17 -128 83 69 -40 179
7398A79k43J51k20J80j91R7n9J23J06k23Q2J10j60N8J8N5r3m7L4J33q2r1K5J26
$$ 179 -64 87 -133 47 -144 -47 -106 17 123 -100 -18 92 -68 -10 8 63 -30 -77 -43 90 8 -83 -58 68
7422F8q0J0j4j36J84N7j92Q6J5j81L05k22o3J26R4p2o3Q8O9j37M6k03K78j05P2
$$ 68 -12 -2 -16 -152 32 89 -103 -17 -2 -183 122 -100 -163 -37 57 -15 -78 10 79 -58 -12 -215 63 -42 30
7447C0p6J24k6M2lp8j29R3J20o9q7J13m3k9Q5k01N8J00j9Pn7K1o5L0o7Q2J10m5
$$ 30 -46 78 52 94 91 13 -116 -23 97 28 -59 54 11 -18 67 -134 -76 24 5 12 -45 -24 -89 -59 -126 -44 66 21
7475B1j68L25j67q5K6j27K10N5k4q5JJ74l04L32j03r8J59j16K52k51k41J24m66
$$ 21 -147 178 11 -74 -48 -175 35 90 66 -19 -18 156 -148 184 81 -17 142 26 278 27 -214 -90 -556
7498e56R21J18m70j18j92L74l1J7k65J36N9k4N7o2J7J4j5J1J3q9R3J28j76L0p6
$$ -556 365 483 13 -105 -297 77 46 63 -202 -66 -7 -31 26 -36 -19 -5 -20 -9 4 -85 8 136 -40 -10 -86
7523h6l1J18J08j90J88p6p0%J75k14Q7mm5J01l12K45j5l1J35j9J5l3l2J26j65
$$ -86 -117 1 109 -81 107 31 -39 -39 136 -78 9 5 -40 61 -251 -6 -21 -52 83 64 79 46 14 140 -25
7548b5k8l9R1o9J28j91J29Q4o8J50j61k0o1M8N3j57J28L0P4o3j19J57m5r7J45
$$ -25 -53 -92 -1 -70 58 -133 -4 80 12 162 1 -19 -80 -32 21 -136 -8 22 96 33 -86 71 26 -71 74
7573G4q9M6q6J44j19j2R8j86J26L9p1oN2K7m6j02N3J63k22o8O6K54J3k63RJ65
$$ 74 -15 31 -55 89 -30 -42 56 -130 -4 35 -36 -42 10 37 -9 -111 -58 105 -117 -185 -119 135 148 -115 -106 59
7599E9p4l2J03P5j25J8j08J83o5r4J30R3j52J0l5k6N6J02q6M4j9p4K5o0K23n7
$$ 59 -15 -47 56 131 6 24 -84 99 34 -60 70 163 11 21 -14 -40 16 118 32 76 57 -17 8 -52 171 114
7625A14j56M9ln4N4j17q8J56r7L5J50J4k48J10O9K2n8o9l6L1J55j1p4Q3n9J99
$$ 114 -42 7 4 -50 4 -113 -201 -45 -142 -107 43 57 -191 -81 -12 10 -48 -117 -153 -122 33 22 -52 31 -28 171
7651A71k45J20m9kq3J46o0p7L3J0J00j07J07L8N2j39q2m3PJ14O2l8J8o3J7OO1
$$ 171 -74 46 -3 -5 -88 58 -2 -79 -46 -36 64 -43 64 102 154 15 -67 -110 -103 11 73 35 53 -10 7 13 74
7678G4K6m9j4Q3j75J45l9R5j13KN6l7k15J52P5nj87J07m8r7J78k4oO7j43j0J19
$$ 74 100 51 37 120 -55 90 51 146 33 35 91 54 -161 -9 66 61 -126 -19 -67 -164 14 -10 -16 51 -92 -102 17
7705A7k9R7n5K3Rr0k2J27Mj57r6K65L2j56n1M1Q3M7k56J76nm5J13l8N9j07l0J46
$$ 17 -12 85 30 53 62 -28 -50 77 81 -76 -172 93 125 -31 -82 -41 42 89 -167 9 4 -41 72 34 93 -14 -44 102
7733A02r8m6M0K9q6L4J38k06M1L2Rj90K26N4j58J24o2K8Q6n5p3n4J30j56J56j37
$$ 102 4 -42 -2 27 -59 -25 113 -93 -52 -20 -11 -201 25 79 -79 45 -17 11 97 42 -31 -85 45 -111 45 -92
7759i2N6Q3j04J60p2J49j65P3j43j8M5J32m5Lj39r7M58l54l8K8P2l21j07L26J65
$$ -92 -36 47 -57 103 31 180 15 88 -55 -73 -28 104 59 62 -77 -174 284 -70 -108 -80 -8 -329 -436 -110 55
7784E5L38j14k43j41om0k4P2K2L3O2M7k1q7J9J6kPM1N1j47l3J12P2j33O1k8L7
$$ 55 393 279 36 -105 -111 -151 -175 -103 -81 -48 14 61 40 -47 -28 -12 -14 -7 34 85 -62 -95 17 89 -44 17 -11 26
7812B6l1P4q9L1j3K15m24J95n1O0J11j95K6J96j01m2m6O0O2q2p8J08K7j28K05
$$ 26 -5 69 -20 11 -2 213 -211 -16 -67 -7 104 -91 -65 131 30 -12 -58 2 64 -18 -96 12 39 -89 116
7837A16j56K4K2L8n9j30O3M5J65R2k85K26q6L4j39k8L9k3J12k17J88L0j84J95
$$ 116 -40 -16 6 44 -15 -145 -82 -37 128 220 -65 161 75 109 -30 -58 -19 -42 70 -147 41 71 -113 82
7861H2q8J6K4n9J3j06J25K3j21l1R5r6K36n9P8r2m6Q2Nl9j18J72j14Q5k6k3%J73
$$ 82 -6 10 34 -25 -12 -118 7 30 -91 -122 -27 -123 113 54 132 40 -6 76 81 42 -76 96 -18 67 41 18 18 191
7889A91j23l0j00J53k32K22N3Kj96R8q9J11l9L2j10r1Q1Q3j7r5R8J28j95J17k8
$$ 191 68 38 -62 91 -141 81 134 136 -60 38 -51 60 21 53 -57 -148 -67 16 -1 -96 2 130 -65 52 24
7914B4j62J69L8m3j32J03m7K0j1N2N2q0K5M4j9N2rm8P5nn7j83J19J22j33L6J10
$$ 24 -138 31 69 26 -106 -3 -50 -30 -41 11 63 -17 8 52 33 85 76 28 103 98 41 -142 -23 99 -34 2 112
7941A12Pl14J28K8n9K4l3R0p4J40j73K35n5on6O1L0J2r7j3J7K3p7rL9j31Q4m2
$$ 112 119 -195 -67 -39 -98 -74 -107 -17 -91 49 -124 111 56 50 -6 55 85 97 0 -13 4 27 -50 -59 -20 -151 -67 -109
7969a09K07L8j98R0j5j23J96j7q5o6k3j09J39Pqr8J29m9J37j04K39r7k03L5r2
$$ -109 98 136 -62 28 13 -110 86 69 -16 -82 -105 -214 -75 -68 -76 -174 -45 -94 43 -61 178 81 -122 -87 -179
7994a79K94q6Q8l32J59o0J42P3j80K0J53Ml03J88M1nj8K3oj56J80r0Pj7J1J8l2
$$ -179 115 29 117 -215 -56 -116 26 99 -81 -61 92 96 -207 -19 22 17 -1 22 16 -140 40 -50 -43 -60 -49 -31 -63
8021f3J08M0r8L9r2M6j84K06j00J78nj61J25n7M9M0j80J75n8j62J19n2Q1j0R5
$$ -63 45 85 -13 26 -66 -20 -204 2 -98 80 75 -86 39 -18 31 71 -109 66 8 -154 -35 -87 -6 -16 79
8046G9j39L7n4J17j86K18k46J60Q6M1n3p7K8p8J34j97K04o0J38j40m4j03L05k12
$$ 79 -60 -23 -77 40 -146 72 -174 -14 72 113 60 -17 11 -67 67 -130 74 14 152 12 -32 -135 170 -42
8070d2j94K18l1J97j75qQ5r8MoJ76j47N5p6J4J26JLq8KJ01j6j90J17L2N5n3n6
$$ -42 -236 -18 -49 148 -27 -35 50 -48 -44 -50 126 -21 34 -42 -28 98 99 102 14 16 117 101 -89 28 60 115 62 6
8098Fk0J09k0q7n9l4J36N4p6j83K59j49J47K8q1m3n1Q9KJ01k67J77r5M0J04o8
$$ 6 -14 95 75 -12 -71 -105 31 85 9 -174 85 -64 83 111 30 -13 -64 25 27 128 -139 38 -57 -17 87 19
8124A9n9j9L2J15j33J74l57J53J14m0L3r2o9k3N1N3N4k6n7M6J0%N6j5l8l8J77
$$ 19 -40 -59 -27 88 -45 129 -228 -75 39 -1 32 -60 -129 -152 -101 -48 6 -20 -77 -31 -21 -21 35 20 -18 -56 121
8151A21j64m4K8N9Q1j51o0N1L1L0m5J63k33J34j7O3P8p7r5J85j21k3q3J78j66
$$ 121 -43 -87 -59 0 81 -70 -130 -79 -48 -18 -63 100 -133 1 -16 47 125 48 -47 138 17 -6 -89 89 -77
8176g7l3K59n1j29K6j83J71R4m4Jj29Q6P3q7k6
$$ -77 -110 149 98 -31 -5 -188 -17 77 33 34 -95 -9 64 -23 -49
8191d9
$$ Imaginary data points
##PAGE= N=2
##DATA TABLE= (X++(I..I)), XYDATA
0@%%%%%%%%%%%%qJ6j6J6k4L2l2M0n4O2p2Q8j04J20j42J66j92K24k56K92l32L77
$$ 0 0 0 0 0 0 0 0 0 0 0 0 0 -8 8 -8 8 -16 16 -16 24 -30 32 -40 48 -56 64 -78 88 -104 120 -136 156 -176 201
34B01m29M85n47O14o88P69q56R55j063J176j302J442j592J756j938K136k351K590
$$ 201 -228 257 -290 324 -364 405 -451 504 -559 617 -685 757 -835 921 -1017 1119 -1232 1358
52A358k853L143l467L831m239M702n234N851o576P440q498R826j1545J3872j7225
$$ 1358 -1495 1648 -1819 2012 -2227 2475 -2759 3092 -3484 3956 -4542 5284 -6261 7611 -9614
67i614K2545l2716Q7521k14243J22861J86961k35546J13163l9473n0839R6795
$$ -9614 12931 -19785 67736 -146507 -23646 163315 -72231 40932 1459 -49380 47415
78D7415r1506J1735P2283j23677N3383M5889n1538M3o618M2427K7997r3559J9583
$$ 47415 -44091 -32356 39927 -83750 -30367 15522 -36016 -35973 -42591 -164 27833 -65726 -46143
91d6143R9606k7448q4594N1539N2262n2363J2569J9634m2930K2442J330J6446
$$ -46143 53463 26015 -58579 -7040 45222 -7141 5428 25062 -17868 4574 5904 22350
103B2350P946r4750N4661P7848r9504J1167K0862k8062P0681o1037m3940J15257
$$ 22350 30296 -64454 -9793 68055 -31449 -20282 580 -27482 43199 -17838 -61778 53479
115E3479n1020m6724P3204l8981k177M7096m5314j306J9797j3688L6336j7511
$$ 53479 2459 -44265 28939 -10042 -12219 34877 -10437 -11743 8054 -5634 30702 13191
127A3191o6090N9244M5239o7130K942J6431j6546M8483k7507l8831O0053k6333
$$ 13191 -52899 6345 51584 -15546 -12604 3827 -12719 35764 8257 -30574 29479 3146
139C146l966M2210n6918K5414K1387m1690N2371m6676k3718J03500q0075m3566
$$ 3146 -820 41390 -15528 9886 31273 -10417 41954 -4722 -28440 75060 -5015 -48581
151d8581Q5988m0041rP400n5027N2068J0503m6332K1913r397r542L0081L655k9002
$$ -48581 37407 -2634 -2643 4757 -50270 1798 12301 -34031 -12118 -21515 -31057 -976 2679 -26323
165b6323j2243M4630Q306k8701L128p05L5531l178n2489N3848N855m4883M6433
$$ -26323 -38566 6064 14370 -14331 -11203 -11908 23623 20445 -32044 21804 27659 -17224 29209
178B9209k3921j7100M4110l3091P294n47l4436N9113j4283m8101L1670j0454K1920
$$ 29209 5288 -11812 32298 -793 6501 5954 -28482 30631 16348 -31753 -83 -10537 11383
191A1383N351o1649M3334K2746m3701K9821n575k5730L3283K746j6479j858K372
$$ 11383 16734 -44915 -1581 21165 -22536 7285 1710 -24020 9263 12009 -4470 -6328 -3956
204c956J4683L426k0962j0807L6116P046m5628J3605K4129j3411O719j4838k068
$$ -3956 10727 14153 -6809 -17616 18500 25546 -20082 -6477 17652 4241 10960 -3878 -5946
217e946K1358j4868J3941n350l4950L9701J0803l0520M293j0123J9778J4231m2912
$$ -5946 15412 544 14485 9135 -25815 13886 24689 -5831 -1538 -11661 8117 22348 -20564
230b0564Q283K1753j4222O38n541k199P650M4k00j1243L631J1713R29k207k0768
$$ -20564 -12281 9472 -4750 -4112 -9653 -11852 -4202 -4158 -4358 -15601 -11970 -257 672 -1535 -22303
245b2303J6684K9853k8129m944N520M787L1036l8330j0649M5434l3758J0120K4166
$$ -22303 -5619 24234 -3895 -8839 -3319 1468 32504 -5826 -16475 28959 -4799 5321 29487
258B9487n3208K6187K2221l3714J6666j6631k087L5411l3257j0245J9208j636
$$ 29487 -23721 2466 24687 -9027 7639 -8992 -11079 24332 -8925 -19170 38 -1598
270a598R554k3260m336K9490j2911j949K380j1765J6249N448n529p925n329K3811
$$ -1598 7956 -15304 -19640 9850 -3061 -5010 -2630 -14395 1854 7302 1773 -6152 -11481 12330
284A2330J141j4349l145j513K7345p695l0351K4429K529p381Q545k0526J2570
$$ 12330 13471 -878 -4023 -5536 21809 14114 -16237 8192 10721 3340 11885 -8641 3929
297C929J0094j9900J7110j3244j4390L6795j1940k4603J0674O038J2199j3635
$$ 3929 14023 -5877 11233 -2011 -16401 20394 8454 -16149 -5475 563 12762 -873
309h73k0840K2575Q247j3540Q93k042k863J1830L697j6612n79J1688o00O407j4389
$$ -873 -21713 862 9109 -4431 -3538 -5580 -8443 3387 7084 -9528 -10107 1581 981 7388 -7001
324g001j1511L5249q054k4305J7857m559Q304O247l0264J9414R449j8205J9704
$$ -7001 -18512 16737 8683 -15622 2235 -2324 5980 12227 -18037 1377 10826 -7379 12325
337A2325j7094j1001L0794j1603o834j040q936K6325o358k4127J2407N772L339
$$ 12325 -4769 -15770 15024 3421 -3413 -4453 -13389 12936 6578 -17549 -5142 630 3969
350C969n833j0682J1247J061K399j570j1042J2546J073J990J644k2785K4196J5141
$$ 3969 -1864 -12546 -1299 -238 2161 591 -10451 2095 3168 5158 6802 -15983 8213 23354
364B3354l1295J1909J813m086K2127k4862m659K0313j2857J1691j0395j7157K9221
$$ 23354 -7941 3968 5781 1695 23822 -1040 -5699 14614 1757 13448 3053 -14104 15117
377A5117j1063r431J3486k3163J3621J7190k8446K776Q762j062O717j4148k655
$$ 15117 4054 -5377 8109 -15054 -1433 15757 -12689 -9913 -1151 -2213 4504 -9644 -12299
390a2299J4524L16n419n995M315O322k88j162q855L382J0200j778l675j1872Q688
$$ -12299 2225 2541 -2878 -8873 -4558 1764 1476 314 -8541 -5159 5041 3263 -412 -12284 -3596
405c596J8923k0410n348J1920m603J0293p440j3368J7909j995l429N081j3678
$$ -3596 15327 -5083 -10431 1489 -3114 7179 -261 -13629 4280 2285 -1144 3937 -9741
418i741Q281J2035j0037m568r88Q605N972j1069m584M711J0627m318j2067Q734
$$ -9741 -1460 10575 538 -4030 -5018 3587 9559 -1510 -6094 -1383 9244 4926 -7141 1593
432A593m22J237P093j5594N083P034n037J2787k0117l374L2648k0231p562J2851
$$ 1593 1171 2408 9501 -6093 -1010 6024 987 13774 -6343 -9717 22931 2700 -4862 7989
446G989j2545J8205m856k0196J9819p712P56J1200k6931J0511J4149j5195N661
$$ 7989 -4556 13649 8793 -11403 8416 704 1460 12660 -14271 -3760 10389 -4806 855
459H55j0840L57K0880j6654o787P895J14P202r155l440P016j009Q157r134o578
$$ 855 -9985 -9628 11252 -5402 -12189 -4294 -4180 3022 -6133 -9573 -2557 -3566 4591 -4543 -11121
474a1121J5075m027J517j785j0437J6961k079p261O681j5058J5871J0353k8469
$$ -11121 3954 -73 1444 -341 -10778 6183 4104 -3157 3524 -11534 4337 14690 -13779
487a3779J2259O523r558J5382j5682m457J9464r912K598j863j1763K1032q57j5467
$$ -13779 -1520 5003 -4555 10827 -4855 -9312 10152 240 2838 975 -10788 10244 9387 -6080
501f080O233r48P147L513j6850K541J3045k708o964k59J014L144N549r836n139
$$ -6080 153 -795 6352 9865 -6985 -4444 8601 5893 -1071 -1330 -316 2828 8377 -1459 -6598
516f598J2182k914o81J765j2608J1192Q740j4920J896O83K262P246j2775j62O710
$$ -6598 5584 2670 1989 3754 -8854 2338 11078 -3842 -1946 -1263 999 8245 -4530 -4692 2018
531B018l717O670p016r116J2570K331n907l981j889Q842K695p385o812O881J1168
$$ 2018 -1699 4971 -2045 -11161 1409 3740 -2167 -6148 -8037 805 3500 -3885 -10697 -3816 7352
546G352j0832k769N369n163J2683k455j6981J4193L028l132K803j4193J2446Q299
$$ 7352 -3480 -6249 -880 -6043 6640 4185 -12796 1397 4425 1293 4096 -10097 2349 10648
560A0648j6567R956n035n546K1042j5883o864J4947j0057P819J606j6850J3311
$$ 10648 -5919 4037 -998 -6544 14498 -1385 -8249 6698 -3359 4460 6066 -10784 2527
573B527L893o865K738p508N646O997p007j323k981N899P371j1086l057N008M315
$$ 2527 6420 -445 2293 -5215 431 7428 421 -902 -3883 2016 9387 -1699 -4756 252 4567
588D567O14r413J552M147J799L052j4403L114J5028j1277J07J134p107J4374l426
$$ 4567 5181 -4232 -2680 1467 3266 6318 -8085 -4971 10057 -1220 -1113 21 -7086 7288 3862
603C862j1372P518j686M817Q76j3091P726N388m967J795n738J555P079l039k804
$$ 3862 -7510 8 -1678 3139 4015 -9076 -1350 4038 -929 866 -4872 -3317 3762 723 -2081
618b081k123K544M514j273l870n155R442N845j3427K054M203j121O830j0198j997
$$ -2081 -4204 -1660 2854 1581 -2289 -7444 1998 7843 -5584 -3530 673 -448 6382 -3816 -5813
633e813J1104n919L822l006r763J6094r66j0048N078n430Q723M150j6302O730
$$ -5813 5291 -628 3194 188 -9575 6519 5553 -4495 583 -4847 3876 8026 -8276 -1546
647a546N108l978M859q140l41Q628l322l17l633J01P087l063j166l084k67J0899
$$ -1546 3562 -416 4443 -3697 -4038 4590 1268 951 -2682 -2581 4506 1443 277 -2807 -3074 7825
663G825o256o660N441P27L935m026n414P042k167K909J631j3867R836Q329j1816
$$ 7825 1569 -5091 350 1077 5012 986 -4428 2614 447 3356 4987 -8880 956 9285 -2531
678b531K028j171M37Q754q674l773O220j092L034l685n539O888J600j546k872
$$ -2531 -503 -1674 -1237 7517 -1157 -4930 1290 198 3232 -453 -5992 896 2496 950 -1922
693a922l949P091L935p428l292N196K321k325K53l143j242Q852k448p632L478
$$ -1922 -5871 1220 5155 -2273 -5565 -369 1952 -373 -120 -3263 -4505 4347 1899 -5733 -2255
708b255J150L601q70q464N248M483k710j18m852K798O551n402m71r85J170P164
$$ -2255 -1105 2496 1626 -6838 -1590 2893 183 65 -4787 -1989 4562 -840 -1311 -2296 -1126 6038
724F038n705m730M299K607J372m375k016L373J436L372p526k707J0413l396j622
$$ 6038 333 -4397 -98 2509 3881 -494 -2510 863 2299 5671 -1855 -4562 5851 2455 833
739H33R42o753R791J538r649L982j592M063L413j2556O382M169o880Q470p640
$$ 833 1775 -4978 4813 6351 -3298 684 -908 3155 6568 -5988 394 4563 -2317 6153 -1487
754a487n625J4170m867m249J220l846R659j487j0413N720J161J193l08o354L822
$$ -1487 -7112 7058 2191 -2058 -838 -4684 4975 3488 -6925 -1205 -44 1149 841 -5513 -1691
769a691K192j376J770n579J16O786o61m245m260O927M934q262m88K169J149M259
$$ -1691 501 -875 895 -4684 -4568 2218 1557 -2688 -6948 -21 4913 -3349 -3837 -1668 -519 3740
785C740o707j476O008k227K984j857o271P285K377l699o38l235N730M306p601
$$ 3740 -2967 -4443 1565 -662 2322 465 -5806 1479 3856 157 -481 -3716 2014 6320 -1281
800a281j748L880K629K40n036q43N208J270m002k88Q31p40M773j043q352N112
$$ -1281 -3029 851 3480 3720 -1316 -2159 3049 4319 317 29 860 120 4893 3850 -4502 610
816F10M584k967q89n071M521O255q061l88J228k19O010p146l766Q190l863J626
$$ 610 5194 2227 1338 -3733 788 7043 -1018 -1406 -178 -397 5613 -1533 -5299 2891 -972 654
832F54R15q121O069L150l747o21l498N232L882p375l50R73L830J883q608K391
$$ 654 1569 -6552 -483 2667 -1080 -1701 -5199 33 3915 -3460 -3810 -2837 993 2876 -5732 -3341
848c341M846k846J572k754j060M170r42K264n123k949J1490l268o374L993j516
$$ -3341 1505 -1341 231 -2523 -3583 587 -355 1909 -3214 -6163 5327 2059 -4315 -322 -1838
863a838N924j061q733P420J090k733L767o034J417N521l674J438l927n50Q862
$$ -1838 4086 3025 -5708 1712 2802 69 3836 -2198 -781 4740 1066 2504 -1423 -1973 6889
878F889m773n047L188P89L278k863n330M386L103j816k288q85K566N46M94k063
$$ 6889 2116 -2931 257 1046 4324 1461 -3869 517 3620 1804 -484 -1369 1197 1743 2237 174
894A74k930L938K567l068l025L75N086o93n215J044J467J423o6m693J258K456
$$ 174 -2756 1182 3749 681 -2344 -1969 3117 2424 -2791 -1747 -280 1143 1077 -3616 -2358 98
910I8p29O81k710j675M536J650l396l380L166M521l226k329K47J746L763l485
$$ 98 -631 50 -2660 -4335 201 1851 -1545 -4925 -1759 2762 -464 -2793 -2546 -800 2963 -522
926e22k769K641J074J950k836k754M058j6J117j019o149O996L450o837P55L67
$$ -522 -3291 -650 424 2374 -462 -3216 842 826 1943 924 -5225 1771 5221 -1616 -861 -494
942d94J953L125o647J037L519k186L048l123k370M602j271J072j918m452P171
$$ -494 1459 4584 -2063 -1026 2493 307 3355 232 -2138 2464 1193 2265 347 -4105 3066
957C066P50n727M91L78L256l05m377J312P32K068M54n363K206K688r30J329n000
$$ 3066 3816 -1911 -1420 -1042 2214 1909 -2468 -1156 -424 1644 2098 -3265 -1059 1629 699 2028 -2972
974b972P89O304k588k532j681K270N308n600k862L860k14J777k631l235M744m37
$$ -2972 -2183 4121 1533 -999 -2680 -410 4898 -702 -3564 296 82 1859 -772 -4007 737 300
990C00j154J317l581J337L728j167l444r27N075J015n059N29J673J433N65l251
$$ 300 -854 463 -3118 -1781 1947 780 -2664 -3591 1484 2499 -2560 -2031 -358 1075 1640 -1611
1006a611P34N63J175K215m767m73L720L53P61n643k76Q852l555n036K459L88L348
$$ -1611 -877 -314 861 3076 -1691 -2164 1556 1909 2670 -2973 -3249 5603 2048 -2988 -529 -141 3207
1023C207k072m634M079K36NP95m860K556K882j852K53l573J707N626m309k612
$$ 3207 1135 -3499 580 816 821 1616 -3244 -688 2194 342 595 -2978 -1271 4355 46 -2566
1039b566J989J825J475m016K29K106j449L004j954l262L864L5M94q26m746N375
$$ -2566 -577 1248 2723 -1293 -1064 1042 -407 2597 643 -2619 1245 1280 1774 948 -3798 1577
1055A577K231m594k65r00L809J992o987J098L267j134J663l877j318N662j592
$$ 1577 3808 -786 -1051 -1951 1858 3850 -3137 -2039 1228 94 1757 -2120 -3438 2224 632
1070F32k115J43j575L427J190l653j327K337K980j737l866J804L166o71k001M9
$$ 632 -1483 -1340 -2915 512 1702 -1951 -3278 -941 2039 302 -3564 -1760 1406 735 -1266 -1217
1086a217P31N45J555j511j637J692J022J197k279l097M329K101l430j649P62K806
$$ -1217 -486 59 1614 103 -1534 158 1180 2377 98 -2999 1330 3431 1 -1648 -886 1920
1102A920j33l030R9N43J738Q98m120K03K850L10J90l343K08M280o63j980j523
$$ 1920 1787 -1243 -1144 -601 1137 2035 -2085 -1882 968 1278 1468 -1875 -1667 2613 1950 -30 -1553
1119a553J629M389l756k016L000j617K518m18m837L852M69j369J921m889J411
$$ -1553 76 4465 709 -1307 1693 76 2594 2176 -2661 1191 1660 291 2212 -2677 -1266
1134a266M081l323R7j918O19N420n392j705L880k353K770n17m766M242N91q84
$$ -1266 2815 -508 -411 -2329 -1710 3710 -1682 -3387 493 -1860 910 393 -4373 -131 460 -424
1150d24J59l743L523K161l108L07j758K632L191n542%K836kJ339l338J12L350
$$ -424 -265 -4008 -485 1676 -1432 -1125 -2883 -251 2940 -2602 -2602 234 232 1571 -1767 -1655 1695
1167A695j284J064j184k045M245q9j742n18j083M094K67n349J653J886m95M7k486
$$ 1695 411 1475 291 -1754 2491 2402 660 142 -941 3153 3420 -1929 -276 1610 1115 1162 -1324
1184a324L19K078p30J50j615o28L368L95l090m79J916K032q13k620K91L415k65
$$ -1324 -1005 1073 343 493 -1122 -1750 1618 2013 -1077 -1556 360 2392 1579 -1041 -750 2665 2400
1201B400k301j1l9J361R17k978o55J365P28K95l474n21L386l30j240j517n66M049
$$ 2400 99 88 49 1410 2327 -651 -1306 59 787 1082 -2392 -2913 473 143 -1097 -2614 -3180 869
1219H69o89l214R87J025J176j14k251J029N07J520L35m043J581L327j651o09j660
$$ 869 180 -3034 -2047 -1022 154 40 -2211 -1182 -675 845 1180 -2863 -1282 2045 394 -215 -1875
1236a875Q43M151l271j345J452K6K797k184k659L540n34R42R4m247L728J935k737
$$ -1875 -1032 3119 -152 -1497 -45 -19 2778 594 -2065 1475 941 1883 1977 -2270 1458 3393 656
1253F56N39k041J428L471m089j246J664K21J470k942j358L290q50r4m98k310K992
$$ 656 1195 -846 582 4053 -36 -1282 382 603 2073 -869 -2227 1063 213 119 -379 -2689 303
1270C03J400k056p81r8K390P96k595n64J146K086m12k872N96J836j83m05k014
$$ 303 1703 -353 -1134 -1232 1158 1954 -641 -1205 -59 2027 1615 -1257 -661 1175 992 587 -1427
1287a427k28K238J91j900j419J279J720p91j661o75J743J864j651j984J166K375
$$ -1427 -1655 583 774 -1126 -2545 -1266 454 -337 -1998 -2673 -930 934 -717 -2701 -1535 840
1303H40Q8k213K65N92J294J088k704n07K549K92l73j654q86L740n44k419N49l24
$$ 840 928 -1285 -1020 -428 866 1954 -750 -1257 1292 1584 1211 -443 -1329 2411 1867 -552 -3 -327
1321c27K281m2l218J516O41J79R92l405K65L216j256l67j426K3L289j761j896
$$ -327 1954 1912 -1306 210 851 1030 2022 -1383 -1118 2098 842 475 -951 -928 2361 600 -1296
1338a296O81Q5K243j439k668K156K51J49K30k658J365K177q76l73j917K018K482
$$ -1296 -615 -530 1713 274 -2394 -238 13 162 392 -2266 -901 1276 400 27 -1890 128 2610
1355B610k805p59N36Q23J919k550j442K337j09K89j152j527J882P94o72j340j309
$$ 2610 -195 -954 -418 405 2324 -226 -1668 669 560 849 -303 -1830 52 846 174 -1166 -2475
1372b475K711Q35k706k39J184P05O19j658o42J516J228q30j437L95J529N22o27
$$ -2475 236 1071 -1635 -1874 -690 15 634 -1024 -1666 -150 1078 248 -1189 -794 735 1257 630
1389F30j450N04J887J10j536j316J634J453j106j134o34J579J738k702q96J694
$$ 630 -820 -316 1571 1681 145 -1171 463 1916 810 -324 -958 621 2359 -343 -1239 455
1405D55k0O12j033j755K060P16n13j204j219K963L94k211J91m34J699J226l477
$$ 455 435 1047 14 -1741 319 1035 522 -682 -1901 1062 1456 -755 -564 -998 701 1927 -1550
1422a550O07J813o72R73j639n71J979l66N14j767p99L415q23k019Q35r20K294
$$ -1550 -943 870 198 1171 -468 -1039 940 574 1088 -679 -1478 1937 1114 -905 -70 -990 1304
1439A304L14l805J556J320l71K10k369P40J931q56R8k121M51L733k207k015J341
$$ 1304 1618 -2187 -631 689 318 528 -1841 -1101 830 -26 72 -2049 -1598 2135 -72 -2087 -746
1456g46K86J485j038k298J834J074m18l77j374J264J539j030m76o05J130J692
$$ -746 -460 1025 -13 -2311 -477 597 179 -198 -1572 -308 1231 201 -275 -880 250 1942
1472A942j464j156R57M80P42m56j974Q55J763n20j303p40J015J689j590j387M05
$$ 1942 478 -678 279 759 1501 1045 -929 -74 1689 1169 -134 -874 141 1830 240 -1147 -742
1489g42J072J241j705k002K105J278q04r62r94J956J742k229o67N70R94J263k441
$$ -742 330 1571 -134 -2136 -31 1247 443 -519 -1513 443 2185 -44 -711 -141 853 2116 -325
1506c25q07K203n23N21j082j837K863p0j837R47j593J322J405k789N64rN15J918
$$ -325 -1132 1071 548 1069 -13 -1850 1013 943 -894 53 -1540 -218 1187 -1602 -1038 -1047 -532 1386
1524A386l284n4K405r41J115j481j686L992n87j709J58p21K740l6l163J403K08
$$ 1386 -1898 -1952 453 -488 627 -854 -2540 1452 865 -844 -686 -1407 1333 1297 -1866 -463 -255
1541b55Q25R82l645J319K530j508N99j673J75L281j857j200R93j93J801j181j932
$$ -255 570 1552 -2093 -774 1756 248 847 -826 -651 2630 773 -427 566 373 2174 993 -939
1558i39K116o35M82N51l067J491J637j536J35j421K75K586j591j216L30L81J692
$$ -939 1177 542 1024 1575 -1492 -1 1636 100 235 -1186 -911 1675 84 -1132 -802 -421 1271
1575A271j402j609J666P11K11o60j645J849J309j737o77KP72J435j579j589J050
$$ 1271 -131 -1740 -74 637 848 188 -1457 392 1701 -36 -713 -711 61 1496 -83 -1672 -622
1592f22J248k1k058l96J765J98r15q8o96R50J242j470m65P81N36Q70r88j261J611
$$ -622 626 605 -1453 -1849 -84 114 -801 -889 -1585 -635 607 -863 -1328 -547 -11 859 -129 -1390 221
1611B21R28n16q16o17J599P30j529N8o15J074J594k673k72J504Q2O90j608j024
$$ 221 1149 633 -183 -800 799 1529 0 58 -557 517 2111 -562 -834 670 752 1442 -166 -1190
1629a190K489r6o13o81n71K351l94j920P31qO58O19k599N68J442o90K08j155l55
$$ -1190 1299 1203 590 -91 -662 1689 1295 -625 106 98 756 1375 -1224 -656 786 96 304 -851 -1206
1648a206K146p56q56l78j86K262o29j719P64K20J029k7j928R95R88k09j94j298
$$ -1206 940 184 -672 -1050 -1236 1026 397 -1322 -558 -338 691 664 -1264 -269 719 510 316 -982
1666i82O63J233p08o59o30N05J791j330j584J004P86L42j021r08J073R31l44p09
$$ -982 -319 914 206 -453 -1083 -578 1213 -117 -1701 -697 89 431 -590 -1498 -425 506 162 -547
1684e47m78J065Q57n85q31K16J111O61j301q67R51J222p26r55j00M70J150q25
$$ -547 -1025 40 897 312 -519 -303 808 1469 168 -699 252 1474 748 -207 -307 163 1313 488
1702D88j325K96R37O71q16j510J483O97m02m86j049J081J387j491m39K0O61J083
$$ 488 -837 -541 396 1067 251 -1259 224 921 519 33 -1016 65 1452 -39 -478 -458 203 1286
1720A286j456r63J130L52L73j394r41J984L55j001m01q23J935O42k029J13L46
$$ 1286 -170 -1133 -3 349 722 -672 -1613 371 726 -275 -676 -1499 436 1078 -951 -838 -492
1737d92Q96P48j817k79J215M40P4j579k57K063l92r64k49k80J654K2j853M43M82
$$ -492 404 1152 -665 -944 271 711 785 -794 -1051 1012 620 -344 -593 -873 781 803 -1050 -607 -125
1756a25N71k9j447J63J217K02l11j320M26J951o83j069r9N65J238n95j481N26
$$ -125 446 417 -1030 -867 350 552 241 -1079 -653 1298 615 -454 -553 12 1250 655 -826 -300
1774c00Q87J29n86q22N15J140k41p31q81P13J286n25j541N36J026K23o12j217
$$ -300 587 716 130 -692 -177 963 722 -9 -890 -177 1109 584 -957 -421 605 828 216 -1001
1792a001P05J278o91m68k82J87J256o07r95M1N65J057o91j673J130J033m45m16
$$ -1001 -296 982 291 -177 -459 -272 984 377 -618 -577 -12 1045 354 -1319 -189 844 399 -17
1810a7j265J309J311j536l40m8K95J296j158q83Q20J36Q70q81j542J560Q75p86
$$ -17 -1282 27 1338 -198 -538 -586 -291 1005 -153 -1036 -216 -80 790 -91 -1633 -73 802 16
1828A6m91q30J456P87j608O6J71N53Q91j495n90J445k44M53q19r45J708L67j018
$$ 16 -475 -1305 151 938 -670 -604 -433 120 1011 -484 -1074 371 127 580 -239 -1184 524 891 -127
1847a27l67j47J458J26j639M47N12M12L55j540J4J354j04j13o51o58J650J68j180
$$ -127 -494 -641 817 943 -696 -249 263 675 1030 -510 -496 858 754 641 -10 -668 982 1150 -30
1866c0l50J43J246j78j636K53R75M9o8j287L50J230k30p98l23R1J412j06j625
$$ -30 -380 -237 1009 831 -805 -552 423 472 404 -883 -533 697 467 -331 -654 -563 849 743 -882
1885h82K63R27L11m10j432O61J078o08K8q29M7J543o85j021M42n6J034m6j792
$$ -882 -619 308 619 209 -1223 -562 516 -92 -64 -893 -846 697 12 -1009 -567 -623 411 365 -1427
1904a427P27P64J96jj574J107J094q37k46l90J96J775j056j078R06j90J035p18
$$ -1427 -700 64 260 259 -1315 -208 886 49 -197 -587 -391 1384 328 -750 156 -34 1001 283
1922B83j545J563N65k39m35j233J561P62j478K95k58M55J143j718m76J271l29
$$ 283 -1262 301 866 627 192 -1041 520 1282 -196 99 -159 296 1439 -279 -755 516 187
1939A87P76q75r12J651j78k81k54j161J632L78j602K89j76O79O99j660J8P71J50
$$ 187 963 88 -824 827 649 368 114 -1047 585 963 -639 -350 -526 153 852 -808 -790 -19 131
1958A31L80j200o73J891j22n25n52l64J912k46j550J43P32M52j22j509N75R73
$$ 131 511 -689 -1362 529 407 -118 -670 -1034 878 632 -918 -775 -43 409 287 -1222 -647 326
1976C26o4m47q50M14J470o54q01l5M04R56k91j255P63N00K20j92r16J56J148l48
$$ 326 262 -185 -1035 -621 849 195 -606 -641 -237 719 428 -827 -64 436 656 464 -452 -296 852 504
1996E04k52m06nJ174l38r64K2N20R07m19j817R83J030l55m77r62Q91J232j208
$$ 504 252 -154 -159 1015 677 -287 -265 255 1162 743 -1074 -91 939 584 107 -855 36 1268 60
2015F0o99K73M55J077j071j044J129M00p1p36r43J468L90q72l45j98P42M71j081
$$ 60 -639 -366 89 1166 95 -949 180 580 509 -227 -1170 298 688 -184 -529 -727 15 486 -595
2034e95kK72J35P55j001m21Q52N5J05m51q50J473L44r20m00oJ013K32r68j00J74
$$ -595 -597 -325 -190 565 -436 -857 -5 50 155 -296 -1146 327 671 -249 -649 -655 358 590 -378 -478 -304
2055c04P05K92j323m27J426K69l86r39mJ530k42q34l84Q64M40l51o58K19L38M74
$$ -304 401 693 -630 -1057 369 638 252 -687 -691 839 597 -237 -621 243 683 332 -326 -107 231 705
2075G05l42o70J92P80o2o12m47O26N13j53p90l43Q30L65m91n42K93M46K67o98
$$ 705 363 -307 -115 665 603 -9 -456 170 683 530 -260 -603 227 592 101 -441 -148 298 565 -133
2095a33m06K88Q17n2j058j09R07K36k67p93k26J318j00j048r8K80J002k49r57
$$ -133 -539 -251 566 514 -544 -653 254 490 223 -570 -796 522 422 -626 -724 -444 558 309 -648
2114f48K05J91P41j78j206K89J021j26k43p36K45J076m90o39J00L82P58m77p72
$$ -648 -443 -252 489 311 -895 -606 415 289 46 -690 -445 631 141 -498 -398 -16 742 265 -507
2133e07L16K43N41m78q97Q46O56l93m93o37P33Q37p37l04j16O68N54r64l46M43
$$ -507 -191 52 593 115 -782 64 720 327 -166 -803 -70 767 30 -274 -390 278 832 -132 -478 -35
2153c5N12m8m26n20Q31L51p41j97j46P22N10r31m78P31L48K63j081k81R00J92
$$ -35 477 429 3 -517 314 665 -76 -273 -419 303 813 -118 -596 135 483 746 -335 -616 284 476
2173D76l24n29j90Q29L74q49m76M45O61N8r07l66J095J95l34o62j66R80Qm64k77
$$ 476 152 -377 -567 262 636 -213 -689 -244 417 475 -432 -798 297 492 158 -504 -670 310 318 -146 -423
2194d23k34Q95L82j110p7M61M25J28j107p9J051m8l93n36K2J298k79p79Q0M4N90
$$ -423 -657 238 620 -490 -567 -106 319 447 -660 -739 312 264 -129 -665 -643 655 376 -403 -323 -279 311
2215C11K37j175K97M93K80k17j101O16Q92k92l97k89J29J250o89q26M61J75N94
$$ 311 548 -627 -330 163 443 226 -875 -259 633 341 -56 -345 -216 1034 345 -481 -20 155 749
2234G49k51j064N92O14p8m76o33N67P23o20m37L8L53O89p41n82M57K62K38n24
$$ 749 498 -566 26 640 562 86 -547 20 743 123 -314 -276 77 766 25 -557 -100 162 400 -124
2254a24n49P42K79k25m82l26Q59K94o84n65M19N06K67q13m39Q39J68p2m00l50
$$ -124 -673 69 348 123 -359 -685 174 468 -216 -781 -362 144 411 -402 -841 -2 166 94 -306 -656
2274f56R30K55o27l17M7M61M71j033M8M21M05r9p60j15R02J55m51l07p4O98J37
$$ -656 274 529 -98 -415 -368 93 564 -469 -421 0 405 306 -454 -569 333 488 37 -270 -344 354 491
2295D91p16j64L46N12L45j174k27J119j21m3n07p3R57j34n85k37J32O19J6q16
$$ 491 -225 -389 -43 469 814 -360 -587 532 411 368 -139 -212 745 611 26 -211 -79 540 556 -260
2315b60J54L59J64N8r42M1R79k15m57k70N3P88l33m74K4N5Q29l46q63M48Q6L47
$$ -260 -106 253 417 475 -467 -426 553 338 -119 -389 -336 452 119 -355 -331 -276 553 207 -656 -208 -122 225
2337B25p4r31M12Q71n93k49l29L85Q52p20m76L21K69L69m05q84Q38N05k08l47
$$ 225 151 -780 -368 503 -90 -339 -668 -283 569 -151 -627 -306 -37 332 -73 -957 -119 386 178 -169
2357a69m00O15M09m52m13J49O03K68o87l62N99J19J66o38j42O49J60m04j37j95
$$ -169 -569 46 455 3 -410 -261 342 610 -77 -439 160 279 445 -193 -335 314 474 70 -67 -262
2377b62L30N28n75k75K12M81K48r00j80P74K41k41m43l58P31K38n48l45n8O77
$$ -262 68 596 21 -254 -42 439 687 -213 -393 381 622 381 -62 -420 311 549 1 -344 -402 275
2397B75R5p92k52P33L50k57p40m7J085k16n20k14J25P56j14p30N9M45L69k7p83
$$ 275 370 -422 -674 59 409 152 -588 -635 450 234 -286 -500 -375 381 267 -463 -404 41 410 383 -400
2418d00PN58L4k02n59L47M87k62k25j04J09N63k61n53QM26M99l18o10K47O89J10
$$ -400 -393 165 199 -3 -562 -215 272 10 -215 -319 -210 353 92 -461 -453 -27 472 154 -456 -209 480 590
2440E90m68o84O47O74m68o41K0N61M49o50m83M26N64k39n95j38P01Q6j23l42j50
$$ 590 122 -562 85 759 291 -350 -330 231 680 30 -453 -27 537 298 -297 -435 266 352 229 -113 -263
2461b63N04L06m47m55K98L85k9m18qJ16N19j83n82j37M80J43r1o20N6O65R2n01
$$ -263 241 547 100 -355 -57 328 299 -119 -127 -11 508 325 -257 -394 86 229 138 -482 -426 239 331 -170
2483a70o43N55P26m29m26o8M00P00q00m93N27L90pm77j76M40L18l90l06p7M34
$$ -170 -813 -258 468 39 -387 -455 -55 645 -155 -648 -121 269 262 -215 -391 49 367 -23 -329 -406 28
2504B8J94m05j31K27K05L01p17j49M92J66P7m88k56O79K10k70k63j13N61K78q28
$$ 28 222 -183 -314 -87 118 419 -298 -447 45 211 288 -200 -456 223 433 163 -100 -213 348 626 -202
2525b02j38K38N30M1o61j25M82J88k16l29o8O90N5n78j17J89M11K62j101R1P18
$$ -202 -340 -102 428 469 -192 -317 165 353 137 -192 -260 430 485 -93 -210 -21 390 652 -449 -358 360
2546C60j18J37p05J58P15m67k20l01K05N04k59k82j0O0N19q6p03K02L62p9P2p12
$$ 360 242 379 -326 -168 547 80 -140 -441 -236 268 9 -273 -283 -223 296 210 -493 -291 71 -8 64 -648
2568f48K82P68l59j77k38J17O70l79m50K44L57J67l27o04M79N44m30m5l68M23
$$ -648 -366 402 43 -134 -372 -255 415 36 -414 -170 187 354 27 -577 -98 446 16 -29 -397 26
2588B6M24n51M1k24J07P81n98m35N17J89m8j32n05O43K79m98m3j93L34N38o96
$$ 26 450 -101 -60 -284 -177 604 6 -429 88 277 229 97 -408 235 514 16 -27 -220 114 652 -44
2609d4J22p9P1M83m82n70P39Kq1n43r8O93M05q00j49J95M72R8p28MK32J20L07
$$ -44 78 -1 70 553 71 -499 240 242 161 -382 -480 213 618 -182 -331 -136 336 434 -294 -290 -58 62 369
2632C69q46pO38j13j06l31K20M80j03n45K03J6L44O5q14K28N39k45J4n13K44N60
$$ 369 -477 -484 154 41 -65 -396 -176 304 201 -344 -141 -125 219 284 -530 -302 237 -8 6 -507 -263 297
2654B97l51k82O3J7L59L4m75J82J69M19k99m39J50N83j70k17j61l8P10j25n40
$$ 297 -54 -336 -273 -256 103 137 -338 -156 13 432 133 -306 -156 427 257 40 -121 -159 551 426 -114
2675a14j39M91J46k30m49M22M4J76k62k06K30K88l20r7j77K91L76j95l31j40K84
$$ -114 -253 238 384 154 -295 127 171 347 85 -121 109 397 77 -20 -197 94 470 275 -56 -196 88
2696H8K69k38n19N28Nj44p4l17M10M00o01j41J34K51J50l23m07M10L01j08k98
$$ 88 357 119 -400 128 133 -11 -85 -402 8 408 -193 -334 -200 51 201 -122 -529 -119 182 74 -224
2717b24l61P64Q0k98r6k85O19O9m85k0R5K27O8n39N1M70Q5j24l26j38O60J2m00
$$ -224 -585 179 259 -39 -135 -420 199 268 -217 -237 -142 85 153 -386 -335 135 220 96 -230 -368 292 304 -96
2740i6n4K07N00l94l75P3L11K83k77l51J6O65k31l58j28K35M04q7n65J51J88J41
$$ -96 -150 57 557 163 -212 -139 172 455 178 -173 -157 508 277 -81 -209 26 430 343 -222 -71 117 258
2762B58j30m10J18L63l9k50O0j44P16m27k45m9K24L89l24m44J95K52rj06n20L57
$$ 258 128 -282 -164 199 160 -90 -30 -174 542 115 -130 -179 45 434 110 -334 -139 113 104 -2 -522 -165
2784a65N13l49k48n6J65M05l40j37J04J04K96l62k90K59J94j14j9l35M10K06k53
$$ -165 348 -1 -249 -305 -140 265 -75 -212 -108 -4 292 -70 -360 -101 93 -21 -40 -375 35 241 -12
2805a2j62N1K77J50n05j45K85J59J22k12l20L07L58l20j30j05L38K87n14q4J28
$$ -12 -174 -123 154 304 -201 -346 -61 98 220 8 -312 -5 353 33 -97 -202 136 423 -91 -175 -47
2826d7K67P4l79j01K75K13Ql81n9L42L8l55j53L73K4N4m79J65J06M4L7j71n3J88
$$ -47 220 294 -85 -186 89 302 310 -71 -130 212 250 -105 -258 115 139 193 -286 -121 -15 29 66 -105 -158 30
2850C0J58k16j64O5K71K21n98J08K61j28O9k91N4J60J73j60l92M7N07J60m04k24
$$ 30 188 -28 -192 -127 144 365 -233 -125 136 8 77 -214 -160 0 173 13 -379 -332 175 335 -69 -293
2872b93J18L31J12n50J51K86o8k30O1oK07J95l16j23J65k5R9k85J35Q1R5j73k31
$$ -293 -175 156 268 -282 -131 155 87 -143 -82 -88 119 314 -2 -125 40 15 114 -171 -36 45 140 -33 -264
2895b64J94L56k73q8J33j82M08l32j56K75m0L20j6n50O2M80j97m6l50K84L54k93
$$ -264 -70 286 13 -75 58 -124 284 -48 -204 71 31 351 335 -215 -153 327 130 84 -266 18 372 79
2917G9l38j5K62L90k75m91K09L08Qk77l36N55R3j63J4k14K32L44n14n0J1K50J45
$$ 79 -259 -274 -12 378 103 -388 -179 129 137 -140 -476 79 172 9 23 -191 41 385 -129 -179 -168 82 227
2940B27k58k85L78j10J04k0l83L99n3j00pj95K43L25n32j4K71MK90m97K1L20O7
$$ 227 -31 -316 62 -48 56 36 -347 52 -1 -101 -108 -303 -60 265 -267 -281 -10 -6 284 -213 -192 128 195
2963A95k4l50K2N04q4m40J09j1K56J8m70J60L96k67K48m84J04M49k84J55j78j33
$$ 195 171 -179 -157 347 263 -177 -68 -79 177 195 -275 -115 281 14 262 -222 -118 331 47 202 24 -109
2985a09N15j39m06J80j17K56O2m56K47J02j7P7m85J48M67l29n2r5j7O47l55m38
$$ -109 406 267 -139 41 -76 180 242 -214 33 135 118 195 -290 -142 325 -4 -56 -151 -168 479 124 -314
3007c14K71L7J71k22m36M74J97k02K9k20J73K24m55O3J17q2M65k44n05N44j36
$$ -314 -43 -6 165 -57 -493 -19 178 -24 5 -215 -42 182 -273 -210 -93 -175 290 46 -459 85 -51
3028e1n5O2k49M20m5j0j67j49J49M14n20MK00j6L17k90k54L04J83l4k52LL04J55
$$ -51 -106 -44 -293 127 82 72 -95 -244 -95 319 -201 -197 3 -13 304 14 -240 64 247 213 -39 -36 268 423
3052D23o52K15j09K51J72m78J33J63lM0k38m4L53j63j65P2j50M52q7l09O5n7K08
$$ 423 -229 -14 -123 128 300 -178 -45 118 115 155 -83 -127 226 63 -102 -30 -180 272 185 -124 -59 -116 92
3075I2L0l41K52J10m9j00j85J73K23qk99j05j5K57k0k80L05j82J44m6l02J93L50
$$ 92 122 -219 33 143 94 -6 -191 -18 205 197 -102 -207 -222 35 15 -265 40 -142 2 -44 -346 -153 197
3098A97j01j24j41J18K87p4l75J87J05j4j64j81J72K92j95J2j22O5M36l38l05
$$ 197 96 -28 -169 -51 236 162 -213 -26 79 65 -99 -280 -108 184 -11 1 -121 -56 380 42 -263
3119b63J09J82K35j05k30J31k5P8j58k13L56J73k04n1j6M1L28k81j09r9K66J15
$$ -263 -154 28 263 158 -72 59 34 112 -46 -259 97 270 66 15 -1 40 368 87 -22 -121 145 260
3141B60k89k28K50J29O4j12m04M30J41l19nN1Q0J45k02k64L50K5n2j42j08J28
$$ 260 -29 -257 -7 122 186 74 -330 100 241 -78 -83 -32 48 193 -9 -273 77 102 50 -92 -200 -72
3163g2K71k33j37J8J73J04l17k3J07J45K44l44k14L88j19jk03J06L93r3l87J27
$$ -72 199 -34 -171 -153 20 124 -193 -216 -109 36 280 -64 -278 110 -9 -10 -213 -107 286 193 -194 -67
3185f7k3K85j37o3p9K68Ln6k52P5K18L0j73k31J50K90j19j91Q2J17J72p0l33P7
$$ -67 -90 195 58 -5 -84 184 187 131 -121 -46 172 202 29 -202 -52 238 119 -72 10 127 299 229 -104 -27
3209b7L62l24Q0j83m0L05q0j12j62k2M52k54j71L11K0J35k85j56J92p2r2J39p5
$$ -27 335 11 91 -92 -132 173 93 -19 -181 -203 249 -5 -176 135 155 290 5 -151 41 -31 -123 16 -59
3232e9M6L48l22r0p9J35P6j13j73K63O4J17j34j74J15J33Ll18J79K9J31j48J3
$$ -59 -13 335 13 -77 -156 -21 55 -58 -231 32 96 213 79 -95 20 153 156 -162 17 46 177 29 42
3255D2k08K35J0j75j07K88K5j49K2j80R6L29k34j48J22J26k4j02n2K68j17o6L
$$ 42 -166 69 79 -96 -203 85 110 -39 -17 -197 -101 228 -6 -154 -32 94 70 -32 -84 184 67 1 4
3278DK6J12j2j48j6j68L86k7j11j22K45j1l3k01l9K17J43k65o1J60J39k12j06
$$ 4 30 142 130 -18 -34 -202 184 157 46 -76 169 158 125 -76 -115 102 245 -20 -81 79 218 6 -100
3301a00j22J34K36p9j36j28L12n0q9k56K38J88O8l59J05j2J39j09l15K40O2J67
$$ -100 -222 -88 148 69 -67 -195 117 67 -22 -278 -40 148 216 -143 -38 -50 89 -20 -335 -95 -33 134
3323A34p2j18J8J37o4r5o5K7L50l19J5r7rK30L3j32j5K43k20l0p2J60J91j92m7
$$ 134 62 -56 -38 99 35 -60 -125 -98 252 -67 -52 -149 -158 72 105 -27 -42 201 -19 -49 -121 39 230 38 -9
3348in9K59O9k83l5J38J8O2j32p1R9J27q8qj03J83K48n44L2K8j13L87k58q3K26
$$ -9 -68 191 260 -23 -58 80 98 160 28 -43 56 183 95 87 -16 167 415 -129 -97 -69 -182 205 -53 -136 90
$$ [...]
8191c4
##END NTUPLES=NMR FID
##END=
