##TITLE=1H_L2-ScPh(IPS-f3)
 CDCl3, 8 sc, 
 5.3.2019
##JCAMPDX= 6.0         $$ Bruker NMR JCAMP-DX V2.0
##DATA TYPE= NMR FID
##DATA CLASS= NTUPLES
##ORIGIN= UXNMR, Bruker Analytische Messtechnik GmbH
##OWNER= root
$$ XWIN-NMR		Version 3.5
$$ Tue Mar  5 13:58:14 2019 Russian Standard Time (UT+4h)  she@DPX200
##.OBSERVE FREQUENCY= 200.1316
##.OBSERVE NUCLEUS= ^1H
##.DELAY= (6, 6)
##.ACQUISITION MODE= SIMULTANEOUS
##.ACQUISITION SCHEME= undefined
##.AVERAGES= 8
##.DIGITISER RES= 18
##SPECTROMETER/DATA SYSTEM= spect
##.PULSE SEQUENCE= zg30
##.SOLVENT NAME= CDCl3
##.SHIFT REFERENCE= (INTERNAL, CDCl3, 0, 15.7039)
##AUDIT TRAIL= $$ (NUMBER, WHEN, WHO, WHERE, WHAT)
$$ ##TITLE= Audit trail, XWIN-NMR		Version 3.5
$$ ##JCAMPDX= 5.01
$$ ##ORIGIN= Bruker BioSpin GmbH
$$ ##OWNER= she
$$ F:/spectra/data/she/nmr/H-F/1/audita.txt
$$ ##AUDIT TRAIL=  $$ (NUMBER, WHEN, WHO, WHERE, WHAT)
(   1,<2019-03-05 13:55:14.79 +0400>,<she>,<DPX200>,
      <created by zg, POWCHK disabled, PULCHK disabled
       configuration hash MD5:
       00 E9 B6 7A A2 85 ED C7 34 08 36 98 17 FE 4E 26
       data hash MD5: 16K
       D8 48 20 AB 27 52 A4 33 36 2E C8 A2 14 70 50 7C>)
$$ ##END=
$$ 
$$ hash MD5
$$ C5 E2 FB D2 C4 C7 F4 87 69 5A C2 A6 3A 09 93 45
##$RELAX= 
##$RELAX= 
##$RELAX= 
##$RELAX= 
##$RELAX= 
##$RELAX= 
$$ Bruker specific parameters
$$ --------------------------
##$DU= <F:/spectra>
##$EXPNO= 1
##$NAME= <H-F>
##$PROCNO= 1
##$TYPE= <nmr>
##$USER= <she>
##$AMP= (0..31)
100 100 100 100 100 100 100 100 100 100 100 100 100 100 100 100 100 100 
100 100 100 100 100 100 100 100 100 100 100 100 100 100 
##$AQSEQ= 0
##$AQ_mod= 1
##$AUNM= <au_zg>
##$AUTOPOS= <>
##$BF1= 200.13
##$BF2= 200.13
##$BF3= 200.13
##$BF4= 200.13
##$BF5= 200.13
##$BF6= 200.13
##$BF7= 200.13
##$BF8= 200.13
##$BYTORDA= 1
##$CFDGTYP= 0
##$CFRGTYP= 5
##$CHEMSTR= <none>
##$CNST= (0..31)
1 1 145 1 1 1 1 1 1 1 1 1 1 1 1 1 1 1 1 1 1 1 1 1 1 1 1 1 1 1 1 1 
##$CPDPRG= <>
##$CPDPRG1= <>
##$CPDPRG2= <>
##$CPDPRG3= <>
##$CPDPRG4= <mlev>
##$CPDPRG5= <mlev>
##$CPDPRG6= <mlev>
##$CPDPRG7= <mlev>
##$CPDPRG8= <mlev>
##$CPDPRGB= <>
##$CPDPRGT= <>
##$D= (0..31)
0 1.2 0 0 0 0 0 0 0 0 0 0.03 0 0 0 0 0 0 0 0 0 0 0 0 0 0 0 0 0 0 0 0 
##$DATE= 1551779714
##$DBL= (0..7)
120 120 120 120 120 120 120 120 
##$DBP= (0..7)
150 150 150 150 150 150 150 150 
##$DBP07= 0
##$DBPNAM0= <>
##$DBPNAM1= <>
##$DBPNAM2= <>
##$DBPNAM3= <>
##$DBPNAM4= <>
##$DBPNAM5= <>
##$DBPNAM6= <>
##$DBPNAM7= <>
##$DBPOAL= (0..7)
0.5 0.5 0.5 0.5 0.5 0.5 0.5 0.5 
##$DBPOFFS= (0..7)
0 0 0 0 0 0 0 0 
##$DE= 6
##$DECBNUC= <off>
##$DECIM= 24
##$DECNUC= <off>
##$DECSTAT= 4
##$DIGMOD= 1
##$DIGTYP= 9
##$DL= (0..7)
0 120 120 120 120 120 120 120 
##$DP= (0..7)
150 150 150 150 150 150 150 150 
##$DP07= 0
##$DPNAME0= <>
##$DPNAME1= <>
##$DPNAME2= <>
##$DPNAME3= <>
##$DPNAME4= <>
##$DPNAME5= <>
##$DPNAME6= <>
##$DPNAME7= <>
##$DPOAL= (0..7)
0.5 0.5 0.5 0.5 0.5 0.5 0.5 0.5 
##$DPOFFS= (0..7)
0 0 0 0 0 0 0 0 
##$DQDMODE= 0
##$DR= 18
##$DS= 0
##$DSLIST= <SSSSSSSSSSSSSSS>
$$ [...]
##$SUBNAM2= <"">
##$SUBNAM3= <"">
##$SUBNAM4= <"">
##$SUBNAM5= <"">
##$SUBNAM6= <"">
##$SUBNAM7= <"">
##$SUBNAM8= <"">
##$SUBNAM9= <"">
##$SW= 24.9336934301222
##$SWIBOX= (0..15)
0 0 2 0 0 0 0 0 0 0 0 0 0 0 0 0 
##$SW_h= 4990.01996007984
##$TD= 16384
##$TD0= 1
##$TE= 0
##$TE2= 300
##$TE3= 300
##$TEG= 300
##$TL= (0..7)
0 120 120 120 120 120 120 120 
##$TP= (0..7)
150 150 150 150 150 150 150 150 
##$TP07= 0
##$TPNAME0= <>
##$TPNAME1= <>
##$TPNAME2= <>
##$TPNAME3= <>
##$TPNAME4= <>
##$TPNAME5= <>
##$TPNAME6= <>
##$TPNAME7= <>
##$TPOAL= (0..7)
0.5 0.5 0.5 0.5 0.5 0.5 0.5 0.5 
##$TPOFFS= (0..7)
0 0 0 0 0 0 0 0 
##$TUNHIN= 0
##$TUNHOUT= 0
##$TUNXOUT= 0
##$USERA1= <user>
##$USERA2= <user>
##$USERA3= <user>
##$USERA4= <user>
##$USERA5= <user>
##$V9= 5
##$VALIST= <valist>
##$VCLIST= <CCCCCCCCCCCCCCC>
##$VD= 0
##$VDLIST= <DDDDDDDDDDDDDDD>
##$VPLIST= <PPPPPPPPPPPPPPP>
##$VTLIST= <TTTTTTTTTTTTTTT>
##$WBST= 1024
##$WBSW= 4
##$XGAIN= (0..3)
0 0 0 0 
##$XL= 0
##$YL= 0
##$YMAX_a= 50328
##$YMIN_a= -94421
##$ZGOPTNS= <>
##$ZL1= 120
##$ZL2= 120
##$ZL3= 120
##$ZL4= 120
##$ABSF1= 10
##$ABSF2= 0
##$ABSG= 5
##$ABSL= 3
##$ALPHA= 0
##$AQORDER= 0
##$ASSFAC= 0
##$ASSFACI= 0
##$ASSFACX= 0
##$ASSWID= 0
##$AUNMP= <proc_1d>
##$AZFE= 0.1
##$AZFW= 0.1
##$BCFW= 1
##$BC_mod= 2
##$BYTORDP= 1
##$COROFFS= 0
##$CY= 11.3945322036743
##$DATMOD= 1
##$DC= 2
##$DFILT= <>
##$DTYPP= 0
##$F1P= 18.9103706918063
##$F2P= -1.10871071338519
##$FCOR= 0.5
##$FTSIZE= 0
##$FT_mod= 4
##$GAMMA= 1
##$GB= 0.15
##$INTBC= 1
##$INTSCL= 1
##$ISEN= 128
##$LB= 0.24
##$LEV0= 0
##$LPBIN= 0
##$MAXI= 10000
##$MC2= 0
##$MEAN= 0
##$ME_mod= 0
##$MI= 1.114404
##$NCOEF= 0
##$NC_proc= 0
##$NLEV= 6
##$NOISF1= 3.799351
##$NOISF2= 2.8
##$NSP= 1
##$NTH_PI= 0
##$NZP= 0
##$OFFSET= 15.70392
##$PC= 1
##$PHC0= -8859.439
##$PHC1= 9.600138
##$PH_mod= 1
##$PKNL= yes
##$PPARMOD= 0
##$PSCAL= 0
##$PSIGN= 0
##$REVERSE= no
##$SF= 200.130013532006
##$SI= 16384
##$SIGF1= 3
##$SIGF2= 2
##$SINO= 400
##$SIOLD= 16384
##$SREGLST= <1H.CDCl3>
##$SSB= 0
##$STSI= 0
##$STSR= 0
##$SW_p= 3612.71676300578
##$SYMM= 0
##$S_DEV= 0
##$TDeff= 0
##$TDoff= 0
##$TI= <>
##$TILT= no
##$TM1= 0
##$TM2= 0
##$TOPLEV= 0
##$USERP1= <user>
##$USERP2= <user>
##$USERP3= <user>
##$USERP4= <user>
##$USERP5= <user>
##$WDW= 1
##$XDIM= 8192
##$YMAX_p= 0
##$YMIN_p= 0
$$ End of Bruker specific parameters
$$ ---------------------------------
##NTUPLES= NMR FID
##VAR_NAME=  TIME,          FID/REAL,        FID/IMAG
##SYMBOL=    X,             R,               I
##VAR_TYPE=  INDEPENDENT,   DEPENDENT,       DEPENDENT
##VAR_FORM=  AFFN,          ASDF,            ASDF
##VAR_DIM=   8192,          8192,            8192
##UNITS=     SECONDS,       ARBITRARY UNITS, ARBITRARY UNITS
##FACTOR=    0.0002004,     1,               1
##FIRST=     0,             0,               0
##LAST=      1.6414764,     0,               0
##MIN=       0,             -94421,          0
##MAX=       1.6414764,     50328,           0
$$ Real data points
##PAGE= N=1
##DATA TABLE= (X++(R..R)), XYDATA
0@%%%%%%%%%pJ5j6J6j6K2l0L2l9M7n5O3p2Q7j02J18j34J51j71J95k22K49k79L15
$$ 0 0 0 0 0 0 0 0 0 0 -7 8 -8 8 -8 14 -16 16 -23 24 -31 32 -40 47 -55 63 -71 80 -91 104 -118 131 -148 167
33A67l52L92m38M88n42O03o69P40q19R06j002J111j233J367j520J697j900K135
$$ 167 -185 207 -231 257 -285 318 -351 389 -430 476 -526 585 -648 719 -801 896 -1004 1131
51A131k415K756l177L716m436N446o987R651j5552N4673l3181n8764Q5800J1667
$$ 1131 -1284 1472 -1705 2011 -2425 3021 -3966 5685 -9867 44806 11625 -47139 38661 50328
65E0328o1669j2396N6768j7158m7607J7680L3725m4336l2188M2367K8574m2398
$$ 50328 -11341 -23737 33031 15873 -31734 -14054 19671 -24665 -56853 -14486 14088 -28310
77b8310j7741L3737P035k9870O686K6903p723j8604J7637J6842j0455l535J6163
$$ -28310 -46051 -12314 -5279 -35149 -28463 -1560 -9283 -27887 -10250 6592 -3863 -7398 8765
90H765R89j0101M594Q310o484l21J0129j723p898N937p51k0048k914K0816J006
$$ 8765 9754 -347 4247 12557 6073 5752 15881 14158 6260 12197 11446 -8602 -11516 9300 10306
105A0306k0479L152J5021j6694j9537J9637J4163k5125o657L5900P531l7987m984
$$ 10306 -10173 -7021 8000 -8694 -28231 -8594 5569 -19556 -26213 9687 17218 -20769 -25753
118b5753L8702L072l1147R528L4752q630k4837J6001K0894j8578j0789K3952L792
$$ -25753 12949 16021 -15126 -5598 29154 20524 -4313 11688 32582 14004 3215 27167 30959
131C0959k7492K254K8992q793l3800O673K6757j3695l0805O324J9530r519j5285
$$ 30959 3467 5721 34713 25920 -7880 -1207 25550 11855 -18950 -12626 6904 -2615 -17900
144a7900Q588N196j8406j1049J2949J0447p216o174P308Q207l691p200J082P582
$$ -17900 -9312 -4116 -22522 -33571 -20622 -10175 -17391 -23565 -16257 -8050 -11741 -18941 -17859 -10277
158a0277N932L458N541L882o323o144Q764J2809m293j0469M871J2923k651j1832
$$ -10277 -4345 -887 4654 8536 2213 -3931 4833 17642 13349 2880 7751 20674 18023 6191
172F191j008M843k077m296K041j428p867j307O476J093p332n250J137N19j008
$$ 6191 5183 10026 7949 3653 5694 4266 -3601 -4908 1568 2661 -4671 -9921 -8784 -8265 -9273
187i273J695L903K026j342k24J625l07m393K144J2221P701p171o079P890K969
$$ -9273 -7578 -3675 -1649 -2991 -3215 -1590 -1897 -6290 -4146 8075 15776 8605 2526 10416 13385
202A3385j1217k938J4312N055j2165l502J0551m544j6668K174J3764p170j3842
$$ 13385 2168 -770 13542 18597 6432 2930 13481 8937 -7731 -5557 8207 1037 -12805
215a2805Q895R484j4965j1783J3981P619j7532m210J8261J942j6865L759J9492
$$ -12805 -3910 5574 -9391 -21174 -7193 426 -17106 -21316 -3055 -1113 -17978 -14219 5273
228E273m386j4987P145J3427p320n334J4935P031j2851j174J2890l004j3514N279
$$ 5273 887 -14100 -6955 6472 -848 -6182 8753 15784 2933 1759 14649 11645 -1869 3410
242C410J3889l594r003M681J000j1239k588Q376j795p605L730N367q102o529M035
$$ 3410 17299 13705 4702 9383 10383 -856 -3444 4932 3137 -4468 -738 4629 -3473 -10002 -5967
257e967n11n725N164P843p598o130R897N238j1545n28J3705j277j1530P704J3950
$$ -5967 -6478 -12203 -7039 804 -6794 -12924 -3027 2211 -9334 -9862 3843 2566 -8964 -1260 12690
272A2690r283j0725J4407R383j7149q420J8192O266j7221j23J6992n322j9889
$$ 12690 3407 -7318 7089 16472 -677 -9097 9095 15361 -1860 -1983 15009 9687 -10202
285a0202N795J4297j0185j2047J4654J0075j6639q827J3716J457j5801L851J7559
$$ -10202 -4407 9890 -295 -12342 2312 12387 -4252 -13079 637 2094 -13707 -9856 7703
298G703m265j5150P973J2739j0409j1096J1704J1070j0196m525J0856K479j0888
$$ 7703 3438 -11712 -3739 9000 -1409 -12505 -801 10269 73 -4452 6404 8883 -2005
311b005l34R378j467p873J412N671j590j993J118k334l636K418K76m928N3O368
$$ -2005 -2339 7039 5572 -2301 -889 4782 3192 1199 2317 -17 -3653 -1235 -959 -5887 -5834 534
327E34r70n195K580K992p246m845R042O444n990j849P587k80q847L033P402l783
$$ 534 -436 -5631 -3051 -59 -7305 -12150 -3108 3336 -2654 -4503 3084 2804 -6043 -3010 4392 609
343F09m471R725O476j0517n760J0076K180j1254M59J3487k590j3874M098J3367
$$ 609 -3862 5863 12339 1822 -3938 6138 8318 -2936 -2477 11010 8420 -5454 -1356 12011
357A2011p406j4837P352J2250r547j0468J0804R670j2143q927J1904O122j2567
$$ 12011 4605 -10232 -2880 9370 -177 -10645 159 9829 -2314 -11241 663 6785 -5782
370e782m503J1886M084p949N6P013m553p731N731Q280n374o263P537N864p323
$$ -5782 -10285 1601 5685 -2264 -2208 4805 252 -7479 -1748 6532 1158 -5105 2432 8296 973
385I73n365M453J252n012K681P089l240q675K503O950l703o631K807N550j411
$$ 973 -4392 61 1313 -3699 -1018 6071 2831 -5844 -3341 3609 -94 -6725 -3918 1632 221
400B21k627J556J234j651l48J59j03J866K266k240k052L709L684n009l954M020
$$ 221 -2406 -850 384 -1267 -1615 -1456 -1559 307 2573 333 -1719 1990 5674 665 -3289 731
416G31K862l062L42N684k390p691K581P447m940q708N313Q505m320n532L744N32
$$ 731 3593 531 873 6557 4167 -3524 -943 6504 1564 -7144 -1831 6674 2354 -3178 566 1098
432A098o718J068Q270k916p600N623Q038p308q031Q672N305r428k709J2069K820
$$ 1098 -5620 -4552 3718 802 -6798 -1175 6863 -445 -8476 196 5501 -3927 -6636 5433 8253
447H253j1362j246R817j251r083L194P897n536n572Q566M440r634n500P184L211
$$ 8253 -3109 -4355 5462 4211 -4872 -1678 6219 683 -4889 3677 8117 -1517 -7017 167 3378
462C378o227n02M627j364k592L933N73p195j183P929J647n933P11O079k114m911
$$ 3378 -2849 -3351 1276 -88 -2680 1253 1826 -5369 -6552 1377 3024 -2909 -2198 3881 1767 -3144
478c144K552L485l359j100M528R13l519J530K514m474l606M878L879m772k853
$$ -3144 -592 2893 -466 -1566 2962 3875 356 1886 4400 -74 -3680 1198 5077 305 -2548
493b548L993R90l565K02J239m428j431O668L475p737m114P112L293n837m097N036
$$ -2548 1445 2435 -1130 -928 311 -4117 -5548 1120 4595 -3142 -7256 -144 3149 -2688 -6785 -1749
509a749K832k033P04K574j897l039L213K674l020j801M894K744m431k590L804
$$ -1749 1083 -950 -246 2328 431 -2608 605 3279 259 -1542 3352 6096 1665 -925 2879
524B879K155m265j972K755J806k051j81J012k778k322L326K571n198m141N443
$$ 2879 5034 769 -1203 1552 3358 1307 1126 2138 -640 -2962 364 2935 -2263 -6404 -961
539i61N727m868n656K487L365k058q45L387p36l323L355M282m444n224M948N674
$$ -961 4766 -102 -5758 -3271 94 -1964 -2809 578 -158 -3481 -126 4156 -288 -5512 -564 5110
555E110m298l063M687K053n224l19M163k103l843M085L186n593k557O546Q83q082
$$ 5110 812 -2251 2436 4489 -735 -1054 3109 1006 -2837 1248 4434 -1159 -3716 2830 3713 -4369
571d369o79P013r50n437K716M437m765k280O253l50q065J968R837j944q286M123
$$ -4369 -5048 1965 1015 -4422 -1706 2731 -2034 -4314 1939 1589 -6476 -4508 5329 3385 -4901 -778
587g78O671o031m563P993K452q932J211J0634l431j0362N318Q647q842o884J0222
$$ -778 5893 -138 -4701 3292 5744 -3188 -1977 8657 5226 -5136 182 8829 -13 -6897 3325
602C325N105j1659k873J1973j036j2545L336J0666o296r199R469P098j1516n502
$$ 3325 8430 -3229 -6102 5871 4835 -7710 -4374 6292 -4 -9203 266 7364 -4152 -9654
616i654J2539J915j1720J194J0850l256q427P255O395r562m697J1196K148j0542
$$ -9654 2885 4800 -6920 -5726 5124 1868 -6559 696 7091 -2471 -7168 4028 6176 -4366
630d366Q75J1104l846q749N505N993q106m548J0409J400r698J022Q757m589p889
$$ -4366 -3491 7613 3767 -4982 523 6516 -1590 -6138 4271 5671 -4027 -3005 5752 1163 -6726
645f726O050N638p832k923R886k80j0659K820J0103n542q526Q164P337r989m101
$$ -6726 -676 4962 -2870 -5793 4093 3813 -6846 -4026 6077 535 -7991 173 7510 -2479 -6580
660f580J1180J691j1634J473J1216m151r819O815Q731q505o899J0066K967j0807
$$ -6580 4600 6291 -5343 -3870 7346 3195 -6624 191 8922 417 -6482 3584 6551 -4256
674d256j030J1085j508j0027M324Q210o842p018P918M442q430k333R107J33r225
$$ -4256 -5286 5799 4291 -5736 -1412 6798 -44 -7062 856 5298 -3132 -5465 3642 3775 -5450
689e450J731P730k954o106M833M432n134j878N480J54n252J327M637k548l250
$$ -5450 -3719 4011 1057 -5049 -216 4216 -918 -2796 2684 2838 -2414 -1087 3550 1002 -2248
704b248L476J613l946K09L815k235m078L552L103l933k381M316P14m820M59L734
$$ -2248 1228 2841 -1105 -896 2919 684 -3394 158 3261 -672 -3053 1263 1977 -2843 -2384 1350
720A350j924k951L270K699m221j815M464J102m289j78M462j104k947K096K683
$$ 1350 -574 -3525 -255 2444 -1777 -3592 872 1974 -2315 -2493 1969 865 -2082 14 2697
735B697l019k056L548J506k983j023L548J64k845l43K026K18j622OJ180m73q93
$$ 2697 -322 -2378 1170 2676 -307 -1330 2218 2382 -463 -806 1220 1438 -184 -178 1002 529 -364
752c64J97R80r2j517m22J384J037k139n93K107Q00k511p40L037k17l043J028L503
$$ -364 -167 813 721 -796 -1218 166 1203 -936 -1529 578 1378 -1133 -1873 1164 947 -2096 -1068 2435
770B435j605k736K189K372l744j539M604Q81n044m26N603r69n429J291M845k781
$$ 2435 830 -1906 283 2655 -1089 -2628 1976 2857 -2187 -2613 2990 2021 -3408 -2117 2728 -53
786e3l257L734J515m250o22M883l87n218J765M329k032l787L312K418l890k04
$$ -53 -3310 424 1939 -2311 -2933 1950 1563 -3655 -1890 2439 407 -3380 -68 2350 -1540 -1744
802a744L864j402l603L294L605m631k377N162J378n533L43N474j871m787L491
$$ -1744 2120 718 -2885 409 4014 -617 -2994 2168 3546 -1987 -1644 3830 1959 -2828 663
817F63L825n660k434O903R77q184N17Q546k563p895L838O631n360n225O901K829
$$ 663 4488 -1172 -3606 3297 4274 -3910 -3393 5153 2590 -5305 -1467 5164 -196 -5421 1480 4309
833D309q220k53Q741j818r034L837Q690n218p439O696N371p476k620P816j62p902
$$ 4309 -3911 -4164 4577 2759 -6275 -2438 6252 1034 -6405 291 5662 -1814 -4434 3382 3220 -4682
849d682K988O991n020o593O642N699p502m156Q253J336p415N29O734k982n303
$$ -4682 -1694 5297 277 -6316 326 6025 -1477 -5633 2620 3956 -3459 -2930 3804 822 -4481
864d481N108L570o334k275P587O32p566P45P547k375n790L755M013m795j898O197
$$ -4481 627 4197 -2137 -4412 3175 3807 -3759 -3014 4533 2158 -3632 123 4136 -659 -2557 3640
880C640n21p130K416P419l777p013M569N506n461l992N912J561n976K54O526k987
$$ 3640 3119 -4011 -1595 5824 2047 -4966 -397 5109 -352 -4344 1568 3129 -2847 -2593 3933 946
896I46o834M931N947o002n162O706L883o501k326O588M77o164J515N227l346m203
$$ 946 -5888 -957 4990 -1012 -6174 532 4415 -2086 -4412 2176 2653 -3511 -1996 3231 -115 -4318
912d318N443L466o163k624O804J986o680q93O092n34m088J205K547k443k009L729
$$ -4318 1125 4591 -1572 -4196 2608 4594 -2086 -2979 3113 2579 -1509 -304 2243 -200 -2209 1520
928A520J025m610l3M555l1m402K92L227q35k433J864J199j774jK018j188k352
$$ 1520 2545 -2065 -2098 2457 2426 -1976 -1684 1543 708 -1725 139 1338 -436 -437 1581 393 -1959
945a959J474L023j985k613K536J827j450j730J141k0p54R40J391k604j680L359
$$ -1959 -485 2538 553 -2060 476 2303 853 -877 264 244 -510 430 1821 -783 -2463 896
961H96J890l758k381L102J957k228j509J912J29k272J467J859j993k327K822L035
$$ 896 2786 -972 -3353 -251 1706 -522 -2031 -119 10 -2262 -795 1064 -929 -3256 -434 2601
977B601l259k631L608K420l550j680L380J830l024o02K921l58k910J817K667k825
$$ 2601 -658 -3289 319 2739 -811 -2491 889 2719 -305 -907 2014 1656 -1254 563 3230 405
993D05k316L504K122l901k264L465J770l869r07L329m09l202J629K839k663l201
$$ 405 -1911 1593 3715 -186 -2450 1015 2785 -1084 -1991 1338 929 -2273 -644 2195 -468 -3669
1009c669K901K678k942k409L771J660l159l51K434m24k043J220J826j055j040
$$ -3669 -768 1910 -1032 -3441 330 1990 -1169 -1520 914 490 -1553 -333 1493 438 -602
1024f02K087K03k644K37K834j137k143J496J907j891j277J895k65k799Q54K844
$$ -602 1485 1688 -956 -719 2115 978 -1165 331 2238 347 -930 965 700 -2099 -1245 1599
1040A599j315k709J837K039k420j794K429Q34k534R78K895j859k543K459K541
$$ 1599 284 -2425 -588 1451 -969 -2763 -334 500 -2034 -1056 1839 -20 -2563 -104 2437
1055B437k941k300L829J772l711k65M321n21m384R14L863j511l721K637K884k839
$$ 2437 -504 -2804 1025 2797 -914 -1179 3142 2621 -1763 -849 3014 1503 -2218 419 3303 464
1071D64k584K645J339l111j213L084L54k682N06K319j792j734J786J481k507l65
$$ 464 -2120 525 1864 -1247 -2460 624 978 -1704 -1198 1121 -671 -2405 -619 862 -1645 -2010
1087b010K862M23k947M9K961j2k920J149K821o51k044R43J709j133j290R03P54
$$ -2010 852 1275 -1672 -1623 1338 1326 -1594 -445 2376 1725 -319 624 2333 1200 -90 813 1567
1104A567q38n03Q99J94q18m24r8m67m7O60p97r02J099J031j827j460J385J233
$$ 1567 729 226 1125 1319 501 77 -21 -488 -535 125 -672 -1574 -475 556 -1271 -2731 -1346 -113
1122a13p44j007J849R98k230k02J775L07k153Q60K492l17k284J000J821j738j314
$$ -113 -857 -1864 -15 983 -1247 -1449 326 633 -1520 -660 1832 1515 -769 231 2052 314 -1000
1139a000J904J121k788j03L373o43m107J122L565k119l921K523L912l101k790
$$ -1000 904 2025 -763 -866 2507 1864 -2243 -1121 2444 325 -3596 -1073 2839 -262 -3052
1154c052L651J972m750j373M877P82m520P25M542p81m131K047K857l009j487M267
$$ -3052 599 2571 -2179 -3552 1325 2107 -2413 -1688 2854 2073 -2058 -11 2846 -163 -1650 2617
1170B617J003m231O5L960j137m216K039L242l087k115L616J096m974n28M192o42
$$ 2617 3620 -611 -546 3414 2277 -1939 100 3342 255 -1860 1756 2852 -2122 -2650 1542 900
1186I00m144J888K567l028j353L403P34m353j1M468j077l277K483L126l526j684
$$ 900 -3244 -1356 1211 -1817 -3170 233 967 -3386 -3397 1071 -6 -3283 -800 2326 -1200 -2884
1202b884M719K62n409J334O239k001m972K741M074m701k743N380J794n681k56
$$ -2884 1835 2097 -3312 -1978 4261 2260 -2712 29 4103 -598 -3341 2039 3833 -1848 -2104
1217b104O036j386o709K727N220l960m344M976L234n344k072N430M63n790J572
$$ -2104 3932 2546 -4163 -1436 3784 -176 -4520 456 3690 -1654 -3726 1704 2167 -3623 -2051
1232b051N537k840m469M423M333m748l148M304J959m264M72L475j522k949K960
$$ -2051 3486 646 -3823 600 4933 185 -2963 1341 3300 -964 -492 2983 1461 -1488 1472
1247A472K041m359j650L957J077m085L74L441j912l120K647R96l359L8L543j205
$$ 1472 3513 -846 -2496 1461 2538 -1547 -1173 2268 356 -2764 -117 879 -2480 -2442 1101 -104
1263a04l129K503L683m814l296M305L564l783j990M002K36k926K081K662l778
$$ -104 -3233 -730 2953 -1861 -5157 -852 2712 -1071 -3061 941 1177 -1749 332 2994 -784
1278g84k828M573L879m482l331L731K527l090j049J686j188j485L158J902l893
$$ -784 -3612 961 4840 358 -2973 758 3285 195 -854 832 -356 -1841 1317 3219 -674
1293f74k405L316J668l010j542K589J026j066j65P74r71n61J098O59p99L37J700
$$ -674 -3079 237 1905 -1105 -2647 -58 968 -98 -263 511 -460 -1021 77 736 -63 274 1974
1310A974n80j138m54M15J015Q46j689j413J782K855j842l359K84K774J00k108
$$ 1974 1394 256 -198 217 1232 2078 389 -1024 758 3613 1771 -1588 -1304 1470 1570 -538
1326e38m73R09m64Q89N36k178j968J656K273j249j334J205O14j021O82M29j286
$$ -538 -1011 -102 -566 323 859 -1319 -3287 -1631 642 -607 -1941 -736 -122 -1143 -461 -32 -1318
1343a318m06K207J388k166k93K068m30k148O12J767o27o12O88k10j366J282J016
$$ -1318 -1724 483 1871 -295 -588 1480 1050 -1098 -486 1281 654 42 730 520 -846 436 1452
1360A452l000j885M169J746l318j591L289k3l409J546L550k742l375M128M279
$$ 1452 -1548 -3433 736 2482 -836 -2427 862 839 -2570 -1024 2526 -216 -3591 537 4816
1375D816m888l149M162K244l687k52L743j055l301K428K918l374k838L833J087
$$ 4816 -72 -3221 941 3185 -502 -754 2989 1934 -1367 1061 3979 605 -2233 1600 2687
1390B687m016P47L931k431m777L097L827m086l705M041K780m024j066L756j248
$$ 2687 -1329 -582 3349 918 -3859 -762 3065 -1021 -4726 -685 2095 -1929 -2995 761 -487
1405d87l361K242L039k656j726M037P18m000J229L637k311l247L963K678l974
$$ -487 -3848 -1606 1433 -1223 -2949 1088 1806 -2194 -965 2672 361 -2886 1077 3755 -219
1420b19j661N114J8o179J302N738k440o014L396N317l978m261L329K124m512K8
$$ -219 -1880 3234 3252 -2927 -1625 4113 1673 -4341 -945 4372 394 -3867 -538 1586 -2926 -2898
1436b898M962j686m892L033N293m599l991M865L051m922r03N617k29n199J966
$$ -2898 2064 378 -4514 -1481 3812 -787 -4778 87 3138 -1784 -2687 2930 2701 -2498 -532
1451e32N126l077m731M131M024l733k676L570J660m176j042L299j057k058K099
$$ -532 4594 1517 -3214 917 4941 1208 -1468 2102 3762 -414 -1456 1843 786 -1272 827
1466H27O45l219n24L211r33l834J273L611j713k718K334J624l009k47L341M9l037
$$ 827 1472 -1747 -2271 940 7 -3827 -2554 1057 -656 -3374 -1040 584 -2425 -2672 669 718 -2319
1483b319J064L686j176k741K224J648k488n8L051m50k952J868K548k855k663K662
$$ -2319 -1255 2431 1255 -1486 738 2386 -102 -160 2891 2441 -511 1357 3905 1050 -1613 1049
1499A049J644l707r34L360K48l774o2K750j104k604J294K556j803j509K251O54
$$ 1049 2693 -1014 -1948 1412 1660 -2114 -2176 574 -530 -3134 -1840 716 -1087 -2596 -345 309
1515C09j902o93J835J045r09N76Q99n66p2R91O70j877J94J456l0j050L5M96k91
$$ 309 -1593 -2286 -451 594 -315 261 1160 594 522 1513 2183 306 500 1956 1926 876 911 1407 1116
1534A116n75N7k32p65J10Oon28J7n69l13N51n17q2J72J644j50j284J08J331j0
$$ 1116 541 598 366 -399 -289 -283 -289 -817 -800 -1369 -1682 -1131 -1648 -1730 -1558 86 -64 -1348 -1240 91 81
1555H1j129J198J329j53m00O08L72j216J47R79K53k94o52M03n66l47k00j71j95
$$ 81 -1048 150 1479 1326 926 1534 1906 690 837 1816 2069 1775 1123 1526 960 613 413 242 47
1574D7l14n82j75M19l53p86p80Q91j32r92J79J158k97l89R39J365j760r96K472
$$ 47 -267 -849 -1024 -605 -958 -1744 -2524 -1633 -1765 -2757 -2578 -1420 -1717 -2106 -1167 198 -1562 -2558 -86
1593h6J221j027m90K380Kk001Q67J697r87j800K928J311k611j797K008M29k267
$$ -86 1135 108 -382 1998 2000 -1 866 2563 1576 -224 2704 4015 1404 -393 1615 2044 -223
1610b23l61K257q72k083Q10J264k155j380J800J138j955k43J950m25j308P69J142
$$ -223 -584 1673 801 -1282 -472 792 -1363 -2743 -943 195 -1760 -2003 -53 -478 -1786 -1017 125
1627A25n03p97J538L38j258J086K106j361k106J226K029j090j389J302O22j580
$$ 125 -378 -1175 363 701 -557 529 2635 1274 -832 394 2423 1333 -56 1246 1868 288
1643B88J91R10j291k226R12K215j218j731O45P10j508r6J159n57j289J812J544
$$ 288 479 1389 98 -2128 -1216 999 -219 -1950 -1305 -595 -2103 -2199 -1040 -1597 -2886 -1074 470
1660D70j694j561K283J574k053k61K572N86k409N84K555l87j402L39J349j016
$$ 470 -1224 -2785 -502 1072 -981 -1242 1330 1916 -493 91 2646 2259 857 1196 2545 1529
1676A529p81J713L57j766p12J787l45k003j87N38o19K24R09o93k334m4J869J8
$$ 1529 748 2461 2818 1052 340 2127 1782 -221 -408 130 -489 -265 644 -49 -2383 -2427 -558 -540
1694e40j843P24J945q10j467Q26P52p26q8J487M42o21O44N0j264K59K155K06k349
$$ -540 -2383 -1659 286 -524 -1991 -1165 -413 -1139 -1227 260 702 81 725 775 -489 -230 1925 2131 -218
1713b18l13J849M52j626j39J036j147j260J404Q48k406j730L213J881k552k512
$$ -218 -531 1318 1770 144 5 1041 -106 -1366 38 886 -1520 -3250 -37 1844 -708 -3220
1729c220J136K291j357n14J521L8p24O82Q56r55o25J903J038j265l61J944L8k178
$$ -3220 -2084 207 -1150 -1664 -143 -105 -829 -147 709 -246 -871 1032 2070 805 444 2388 2426 248
1747B48N3K291j76j597J34J310j657r31J947k84k641l93K688K97l101q50K174
$$ 248 301 2592 2416 819 953 2263 606 -325 1622 1338 -1303 -1696 992 1289 -1812 -2662 -488
1764d88J54o71l00o38n43J206J850j353k235J771J775j006j701J625J556j462
$$ -488 -334 -1005 -1305 -1943 -2486 -1280 570 -783 -3018 -1247 528 -478 -2179 -554 1002 -460
1780d60M21J596o00k032J303K218k028q37J685J645j938j933J399O42q03J01P44
$$ -460 -39 1557 957 -1075 228 2446 418 -419 1266 2911 973 -960 439 1081 278 379 1123
1797A123j848o43K679K67l678j34L247M23l339J51K649n37j781J786J022k261
$$ 1123 -725 -1368 1311 1578 -2100 -2234 1013 1436 -1903 -1752 897 360 -1421 365 1387 -874
1813h74r50K777J180k455m70K348K93k046N18Q90j153n70J597O22k050k50J441
$$ -874 -1824 953 2133 -322 -792 1556 1849 -197 321 1211 58 -512 1085 1707 -343 -593 848
1830H48j263j358K025R94k077j217J473J121j902l24J132m06m52J101O10j365
$$ 848 -415 -1773 252 1246 -831 -2048 -575 546 -1356 -1680 -548 -954 -1406 -305 305 -1060
1846a060r89J963J064j531p4R09J29m58R93O82j815P4J842qj778r2J387k13q69
$$ -1060 -2049 -86 978 -553 -627 282 411 -47 946 1628 -187 -113 1729 1721 -57 -149 1238 1025 156
1865A56P49K04j383l50J285k00j074L05O72n36q80N41N2r51P34J276m81j196M73
$$ 156 905 1109 -274 -624 661 461 -613 -308 364 -172 -1052 -511 -459 -1410 -676 600 119 -1077 -604
1884f04J169r52l50Q09N76p84K37K79k82o46R92P45j222k05Q08J00o77J85N4n51
$$ -604 565 -387 -737 72 648 -136 101 380 98 -548 444 1189 -33 -238 570 670 -7 178 232 -319
1904c19K15O45o50j208R75J098q27r12N41K91o31J69J272n26j329R85J239j211
$$ -319 -104 541 -109 -1317 -342 756 -71 -983 -442 -151 -782 -613 659 133 -1196 -211 1028 -183
1922a83q29J273N93j095K07J282o24j623J252J250j214p62J543j55j703P28J614
$$ -183 -1012 261 854 -241 -34 1248 624 -999 253 1503 289 -473 1070 915 -788 -60 1554
1939A554j409j514J563J415k118j015K219j37j823L85K039j320k044K005J867
$$ 1554 145 -1369 194 1609 -509 -1524 695 558 -1265 -880 1159 -161 -2205 -200 1667
1954A667k255j178K314O58k499Q03J722j317j072J975J112k276o05K549k10k465
$$ 1667 -588 -1766 548 1206 -1293 -490 1232 -85 -1157 818 1930 -346 -951 1598 1388 -1077
1970a077L42K285j118j605J856Q02k443p69K862k72k334N01K128j705j403K045
$$ -1077 -735 1550 432 -1173 683 1485 -958 -1727 1135 863 -1471 -970 1158 -547 -1950 95
1986I5R16k764kL001l23l068O98L367j838k472K766J473k743q56L015K28k685
$$ 95 1011 -1753 -1755 1246 923 -2145 -1447 1920 82 -2390 376 1849 -894 -1750 1265 1493 -1192
2003a192L39K702q25k489J751J232j797j120L093j6l004N22K473j293j844K044
$$ -1192 -853 1849 1024 -1465 286 1518 -279 -1399 1694 1678 -1326 -804 1669 376 -1468 576
2019E76J485k807p73K658J18k649N90K525j060k300J689J982k284p16K246R6k233
$$ 576 2061 -746 -1519 1139 1257 -1392 -802 1723 663 -1637 52 2034 -250 -966 1280 1376 -857
2036h57O76K024j637j589J939J489k812m61K419l20k470R77K069j572k225J999
$$ -857 -181 1843 206 -1383 556 2045 -767 -1228 1191 871 -1599 -622 1447 -125 -2350 -351
2052c51J429k383j028K374L27k611O41K226j298j718J682J371j786n07J833J94
$$ -351 1078 -1305 -2333 41 368 -2243 -1602 624 -674 -2392 -710 661 -1125 -1632 201 395
2068C95j847P89K074j643j290K333J289k141p35J725O81j793P7J595r65o44J423
$$ 395 -1452 -663 1411 -232 -1522 811 2100 -41 -776 949 1630 -163 -86 1509 544 -100 1323
2085A323K06j630p5J549k63j314L83N17o87m52J113l2j784N59J947j283j377J277
$$ 1323 1529 -101 -176 1373 1110 -204 179 696 9 -443 670 638 -1146 -587 1360 77 -1300 -23
2103b3J272j187j169J138P97j282J58R65m49p65P12Q05j632l77J685L7j358n16
$$ -23 1249 62 -1107 31 828 -454 -296 669 220 -545 167 972 -660 -1037 648 685 -673 -1189
2121a189J212k11o32L96K36j047j49J654m69j350J62J465j65r39K90O00l22K52
$$ -1189 23 -188 -820 -424 -188 -1235 -1384 270 -199 -1549 -1387 78 -87 -1026 -736 -136 -458 -206
2139b06J76k42k97J224M64j451J01J179P70j443J88Q98l60o39Q99k95q93L38J454
$$ -206 -30 -272 -569 655 1119 -332 -231 948 1718 275 463 1361 1001 362 1261 966 73 411 1865
2158A865o44k066P55J616n92j440L54N47q73r4J361j126j354J598J081j503j385
$$ 1865 1221 -845 -90 1526 934 -506 -152 395 -478 -572 789 -337 -1691 -93 988 -515 -1900
2175a900J921R55j585p22J387K53r13M84N72r89m9J449k28j337J7J633j2j578
$$ -1900 21 976 -609 -1331 56 309 -604 -120 452 -537 -586 863 635 -702 -685 948 936 -642
2193f42J67Q50l06n74Q47k56j612N89J899r70j892J290J502j047j114J203J98
$$ -642 -475 375 69 -505 342 86 -1526 -937 962 -8 -1900 -610 892 -155 -1269 -66 132
2210A32r00Q06J232j391j022J946R49j966o28K204J60j911L89J748p89j060M38
$$ 132 -768 38 1270 -121 -1143 803 1752 -214 -842 1362 1522 -389 0 1748 959 -101 337
2227C37R30j290n73K070j90k235L8K347q75k024N51J124p27p50R81j61j086M02
$$ 337 1267 -23 -596 1474 1284 -951 -913 1434 559 -1465 -914 210 -517 -1267 -286 -447 -1533 -1131
2245a131J500k02j860Q19J886q97j348R92J007r24l6J059k04p23Q36O70p25p64
$$ -1131 369 167 -1693 -874 1012 115 -1233 -241 766 -158 -194 865 661 -62 774 1444 719 -45
2263d5R71J79r94j04Q52j20j008p5R05r58l41R71n7j376p6J739o49j325N59Q91
$$ -45 926 1105 111 7 859 739 -269 -344 561 -397 -738 233 176 -1200 -1276 463 -186 -1511 -952 -61
2283f1j51o53P15L73j049J91J054L98j301L91J340o87n11N35N50o95k89N63O25
$$ -61 -212 -865 -150 223 -826 -635 419 817 -484 -93 1247 560 49 584 1134 439 150 713 1338
2302A338j278j64O23k92o38L52O01p84l16O81M7o69l52P25L53r05J15M83j17n02
$$ 1338 60 -104 519 227 -411 -59 542 -242 -558 123 170 -499 -851 -126 227 -678 -563 -80 -197 -699
2322f99N18M90o8m32L61L69l05j82M24M04p17J66K81q6j94o8K61j39p0l58J37
$$ -699 -181 309 241 -191 170 539 234 52 476 880 163 329 610 524 330 262 523 384 314 -44 93
2343I3l02K58L3m15l59j08M00k33k1N4qn78L60N53m1n30K44N21K40m09K11J01
$$ 93 -209 49 82 -333 -692 -800 -400 -633 -654 -600 -608 -1186 -826 -273 -314 -844 -600 -79 161 -248 -37 64
2365F4M3NN84L5p70O02L55j32o73L88N5m31NL03M74j161l43J295l91m22r3N05
$$ 64 107 112 696 731 -39 563 918 786 113 501 556 125 130 433 907 -254 -597 698 307 -115 -208 297
2387B97n26l12M36L72o56n49Q23j3l13K9M20n7k75L50J81m18k91N39M91l91l60
$$ 297 -229 -541 -105 267 -389 -938 -115 -128 -441 -412 8 -49 -324 26 207 -211 -502 37 528 137 -223
2408b23P10q02J00K43J04n78l15M35K21n99R9N27n24j34N59j3m70k02R36k7o90
$$ -223 487 -315 -215 28 132 -446 -761 -326 -105 -704 -605 -78 -602 -736 -177 -190 -660 -862 74 47 -643
2429f43P47J40o4m65L91M22m32J09O20k86m17L70K55l36l43M34J34o27J40J18
$$ -643 104 244 180 -285 106 528 96 205 825 539 122 492 747 411 68 502 636 9 149 267
2449B67M0j49n09O29o72j8J09J42j49k45L32j12k40N32k93o15O02M36k15m45K38
$$ 267 307 158 -351 278 -394 -412 -303 -161 -310 -555 -223 -335 -575 -43 -336 -951 -349 87 -128 -573 -335
2470c35L56j92J82L84j46p58O06Q8l55l31M34K56n68K02M16k47o66N99K98l99
$$ -335 21 -171 11 395 249 -509 97 185 -170 -501 -67 189 -379 -177 239 -8 -674 -75 223 -176
2490a76k11P89K62j287Q7J417K2j125J94O85j04m66O90l83o43N66J089p83p87
$$ -176 -387 402 664 -623 -536 881 903 -222 -28 657 553 87 777 394 -249 317 1406 623 -164
2509a64N73O92p19q83P59J0o19K54M94j017n38J027N03j455m08J457l42j056M80
$$ -164 409 1101 382 -501 258 268 -351 -97 397 -620 -1158 -131 372 -1083 -1491 -34 -376 -1432 -952
2528i52Q47m95q22J340k66n74N48J186p00j305J095J763j381j120O20J372j183
$$ -952 -105 -600 -1422 -82 -348 -922 -374 812 112 -1193 -98 1665 284 -836 -216 1156 -27
2545b7j83P70j67j097R81J425j495j425J306J234j695l98P69L60q99K93R23j060
$$ -27 -210 560 393 -704 277 1702 207 -1218 88 1322 -373 -771 -2 358 -541 -248 675 -385
2563c85q06K204P9j782k83K052j63j127M30J261j045m94J320m5j309O00J107r30
$$ -385 -1191 1013 1092 -690 -973 1079 916 -211 219 1480 435 -59 1261 1216 -93 507 1614 684
2581F84j528R36J088j107j013J036K93j085l55J010q96j399J852J073j967m79
$$ 684 -844 92 1180 73 -940 96 389 -696 -1051 -41 -937 -2336 -484 589 -1378 -1857
2597a857R60J058j571J22J587k90j208O21J492q45j190K136M98k087M38J960p90
$$ -1857 -897 161 -1410 -1288 299 9 -1199 -578 914 69 -1121 1015 1513 -574 -136 1824 1034
2614A034j525P12J618r08r69J089Q6j485O58J190j359j399J301J082j540q18J050
$$ 1034 -491 221 1839 931 -38 1051 1137 -348 310 1500 141 -1258 43 1125 -415 -1233 -183
2631a83N16j163j68J451p07j051J068J113j178p01J584J1r46L16J458r11r13R13
$$ -183 333 -830 -998 453 -254 -1305 -237 876 -302 -1003 581 592 -354 -38 1420 509 -404 509
2649E09P63j013r9J183o75j217P26R61j163j494J419Q72j275q68R90K43j114K54
$$ 509 1272 259 160 1343 668 -549 177 1138 -25 -1519 -100 772 -503 -1371 -381 -138 -1252 -998
2667i98O82q35l97J048M45j013j60J555o5r77O20Q40m73j13J036K67j483N29J342
$$ -998 -316 -1151 -1548 -500 -55 -1068 -1228 327 262 -715 -95 745 272 159 1195 1462 -21 508 1850
2686A850l86j456N53J068o61r47L58J70n05lL63j023o67J097L70r44q80J150M6
$$ 1850 1464 8 561 1629 968 21 379 549 44 41 404 -619 -1286 -189 181 -763 -1643 -493 -447
2705d47p73N5J041q46k87J231M64r80q7J175M74j409m9J828l88j185R06J60n89
$$ -447 -1220 -1165 -124 -970 -1257 -26 438 -542 -629 546 1020 -389 -438 1390 1002 -183 723 883 294
2724B94o3J061m58j085L69Q81o18j671J147N15r32o68P32K5q99M64R79q86o74
$$ 294 231 1292 834 -251 118 999 381 -1290 -143 372 -560 -1228 -496 -471 -1370 -906 73 -813 -1487
2743a487R18R78j088k63J045R5o47P89M55n34l11J168L39j614M22J342o30p30
$$ -1487 -569 409 -679 -942 103 198 -449 340 795 261 -50 1118 1457 -157 265 1607 977 247
2761B47M30N35j097k70J265n78j218M4J050n00j497P98Q01q10r82J352L70j439
$$ 247 677 1212 115 -155 1110 532 -686 -642 408 -92 -1589 -791 10 -800 -1782 -430 -60 -1499
2779a499N97J000l13r93J204N79o08n44J368L52j086j98J481l79q99R07M53j053
$$ -1499 -902 98 -215 -1208 -4 575 -33 -577 791 1143 57 -141 1340 961 62 969 1422 369
2797C69P2O29O7j088j58R39p91p80R28j05p96n00Q50J38j106J00J396p18j028
$$ 369 441 1070 1137 49 -109 830 39 -741 187 82 -714 -1214 -364 -226 -1332 -1232 164 -554 -1582
2816a582J136L48p26p7J159k6o22M42J125n76o19N92N30q09j98R24j6j034L76
$$ -1582 -446 -98 -824 -901 258 232 -390 52 1177 601 -18 574 1104 295 97 1021 1005 -29 347
2835C47P87r99q45R95L32r23o04Q14Rr83K76N39l16n06O20K63m50j50Q44ro79
$$ 347 1134 135 -710 285 617 -306 -910 -96 -87 -1070 -794 -255 -571 -1077 -457 -194 -644 -794 50 41 -638
2856f38P11N07r5m00O05O37r65K25P24n34n92L94O95q11n00O57o3o44K2K59n04
$$ -638 73 580 485 85 690 1327 362 587 1311 777 185 579 1274 463 -37 620 557 -87 -65 194 -310
2877c10m47K38N13m67k51L15j70l52k0N46M9p63M90N61j73m15P28N74p48O1J044
$$ -310 -757 -519 -6 -473 -724 -409 -579 -931 -951 -405 -356 -1119 -629 -68 -241 -656 72 646 -102 -41 1003
2898A003N0p91j46N93J52n96L93n21l8K24M90q94n25O3M59j0p59M61k76r3L44
$$ 1003 1053 262 116 709 861 265 658 137 99 323 813 -81 -606 -543 -84 -94 -853 -392 -668 -761 -417
2919d17J81k49k66N07M64p59K78M80j24l16P42J81q8m87J001l17j49m5K34k56
$$ -417 -236 -485 -751 -244 220 -539 -261 219 95 -221 521 702 614 127 1128 811 662 617 851 595
2939E95k41L27M20o43o18K7J63j00k04j66m23k95O21k01k30k40P1O36r0k11j92
$$ 595 354 681 1101 458 -160 -133 30 -70 -274 -440 -863 -1158 -537 -738 -968 -1208 -1137 -501 -591 -802 -994
2960i94P17l7lL99j12M3L31K5j67K92N84l56l87M19j6j85j66o5J17l86N65q4q74
$$ -994 -277 -314 -317 82 -30 13 344 369 202 494 1078 722 335 754 738 553 387 322 439 53 618 534 -340
2983c40m12N59J53j95p97K68M55L55m10k25j14J12N78J96m54k23P98l8k3J3L16
$$ -340 -752 -193 -40 -235 -1032 -764 -309 46 -364 -589 -703 -591 -13 183 -271 -494 304 266 243 256 572
3004E72N37k61o9M5j25L70m29j89m61L88K87k85o99J2J83P9k46n84m58M90L22
$$ 572 1109 848 779 824 699 1069 640 451 -10 378 665 380 -319 -307 -124 -45 -291 -875 -1333 -843 -521
3025e21R9n68o05P39L36J11l44J43K67M40j55l89M20K17M35K77k63l35R8O84P5
$$ -521 -422 -990 -1595 -856 -520 -409 -753 -610 -343 97 -58 -447 -27 190 625 902 639 304 402 1086 1161
3046A161o78j10L54j41n6m71L82J1m15j55m54K94L84j76n03k42L81M23j95l01
$$ 1161 483 373 727 586 530 59 441 452 37 -118 -572 -278 106 -70 -573 -815 -434 -11 -206 -507
3066e07l19O70q3L89J19J02j86R8O33J50l91k77Q09p50j07R1K74m90N04m97l67
$$ -507 -826 -156 -239 150 269 371 185 283 916 1066 675 398 1207 457 350 441 715 225 729 232 -135
3087a35k82K33k26l19j03N94o50m08N49L5j70n69N48L64o29K03N58k23r6M38O37
$$ -135 -417 -184 -410 -729 -832 -238 -888 -1296 -747 -712 -882 -1451 -903 -539 -1168 -965 -407 -630 -726 -288 349
3108C49k89r4N97J52l99N33K38J76r36N54O35l77o99M52Q3j035N55L67l91j157
$$ 349 60 -34 563 715 316 849 1087 1263 327 881 1516 1139 440 892 975 -60 495 862 471 -686
3128f86J43P00l31m62n6Q9p9M30J59n26l74Q63J46n95K24K91L88l02j03N97M3
$$ -686 -543 157 -174 -636 -692 -603 -682 -252 -93 -619 -993 -130 16 -579 -355 -64 324 22 -81 516 559
3149E59j56N20K4p30j97P30k71o42M05P3k25o61K91K07q08J58M25m17j111O63
$$ 559 403 923 947 217 20 750 479 -163 242 315 90 -571 -280 -73 -881 -723 -298 -715 -1826 -1163
3169a163Q50o59o13N57N71j6j20J19K5j95P93Q35o27k52Q52L36o61r0Q07O5l76
$$ -1163 -313 -972 -1585 -1028 -457 -473 -593 -474 -449 -644 149 984 357 105 957 1293 632 542 1349 1414 1038
3190A038K25N23q21m26M29k3p67k31O13O4j471K14Q10o28r46N99N00r09M32J036
$$ 1038 1263 1786 965 539 968 945 178 -53 560 624 -847 -633 177 -451 -1397 -798 -298 -1207 -775 261
3210B61o73p75N23N00Ll93R58N4o34K07R90m77q74P36L96l40n82J074J00j006
$$ 261 -412 -1187 -664 -164 -161 -554 404 458 -176 31 1021 544 -330 406 802 462 -120 954 1054 48
3230D8PN08o4j143N42M10p20n95N88K80j231L10J056m85n55M35N59m81j48Q29
$$ 48 55 563 499 -644 -102 308 -412 -1007 -419 -139 -1370 -1060 -4 -489 -1044 -609 -50 -531 -679 150
3250A50N1n18M76R67k50n48M02P19n34j76P30k85q71O46O99j195o01Q48q4p16
$$ 150 201 -317 159 1126 876 328 730 1449 915 739 1469 1184 313 959 1658 463 -138 710 626 -90
3270i0n22J022m03j019K78N72p50n22Q56k03q54L82R08l06j43m5Q50l16n00O13
$$ -90 -612 410 7 -1012 -734 -162 -912 -1434 -578 -781 -1635 -1253 -345 -651 -794 -839 11 -305 -805 -192
3290a92Q42q29K44M15K28n49J06O33k36k94N84r3p24J76L67l20j094J254q1j010
$$ -192 650 -179 65 480 708 159 265 898 662 368 952 859 135 311 678 358 -736 518 437 -573
3310e73l9O08m4r24M42L49l85p37O19L75l96J74N58M75p25J03M28Q8l28P25M5
$$ -573 -612 -4 -48 -972 -530 -181 -566 -1303 -684 -309 -705 -531 27 502 -223 -120 308 396 68 793 838
3331H38o02K80M21J91j129K90R62l50j288N60K08n50j23M20l94q91K92P85m74
$$ 838 236 516 937 1128 -1 289 1251 901 -387 173 381 -169 -292 128 -266 -1157 -865 -80 -554
3350e54m98K94L79l85l74P35m1l96O27N73o59l60Q50O25p56j7O88K85n05J28M31
$$ -554 -1052 -758 -379 -764 -1138 -403 -444 -840 -213 360 -299 -659 191 816 60 43 731 1016 511 639 1070
3371A070n42k29P28m78n63J04O78m06j034L07Q33o04o35M00pq94O45N91p33p75
$$ 1070 528 299 1027 549 -14 90 768 362 -672 -365 468 -136 -771 -371 -378 -1272 -627 -36 -769 -1544
3391a544J121P71p19l91K60Q37m45J39N41l39j92O36K85p35k49J059K09j124o2
$$ -1544 -423 348 -371 -762 -502 335 -110 29 570 231 39 675 960 225 -24 1035 1244 120 58
3410E8N27O9o14P4K36m83k63Q34l68r13K52Q97m17r13L02M55n02J65P34k72n62
$$ 58 585 654 40 114 350 -133 -396 438 70 -843 -591 306 -111 -1024 -722 -267 -769 -604 130 -142 -704
3431g04O64O44m78o60Q86M24m70l74P94m7o6k7N36k26p46L27p5k03l55P42j78
$$ -704 -40 604 126 -534 352 776 306 -68 726 679 613 586 1122 896 150 477 402 199 -156 586 408
3452D08r68J41L64P6p07K10N0l44j49O68k38p61N10Q99m33n43M59L39j07J79O13
$$ 408 -560 -419 -55 21 -686 -476 -426 -770 -919 -251 -489 -1250 -740 159 -274 -817 -358 -19 -126 53 666
3473F66j53k35K13P77q11l96O66K51o86oO20j30o95M03l91k40j01Q48m56p99J07
$$ 666 513 278 491 1268 457 61 727 978 292 286 906 776 81 484 93 -147 -248 600 144 -655 -548
3494e48L24L2n11J79M26m88k11N32K20m82K28N79j08n92N16J56p9k50O20j81j30
$$ -548 -224 -192 -703 -524 -98 -586 -797 -265 -45 -527 -299 280 172 -420 96 252 173 -77 543 362 232
3515B32q9M69l55m01N19k17L4m02L72j27l35k01O14m58k48K89Km11J62L36m61
$$ 232 143 612 257 -144 375 158 192 -210 162 35 -300 -501 113 -345 -593 -304 -302 -713 -551 -215 -676
3536f76j65P11K0N4l54K35N65j54l2M46R6p87P02p2m9l15O77j96l70J13M6Qo44
$$ -676 -841 -130 -110 -56 -410 -175 390 236 204 650 746 -41 661 589 540 225 902 706 336 449 495 503 -141
3559a41M34o4l48k40K06j9k48m0q8j25j29j4P14m46k14J08M25j03j56M96l3j84
$$ -141 293 229 -119 -359 -153 -172 -420 -460 -548 -673 -802 -816 -102 -548 -762 -654 -229 -332 -488 8 -25 -209
3581b09M70M47n26k07L20k1k16K53L13j22l16K0Q5j73m8j86r8JJ25j90l61k4M31
$$ -209 261 708 182 -25 295 274 58 311 624 502 186 206 291 118 70 -116 -214 -213 -88 -278 -639 -663 -232
3604b32J4m73J98L61l57K42K00O1l77J72R4L85j46P5N74l27k51L33J38j24j12
$$ -232 -218 -691 -493 -132 -489 -247 -47 14 -363 -191 -97 288 142 217 791 464 213 546 684 560 448
3625D48j2K87m60j74K90R2p03Q7J48k70m0j53M4k52J38n8j63L3J28r1J40J02m0
$$ 448 436 723 263 89 379 471 -232 -145 3 -267 -307 -460 -416 -668 -530 -588 -751 -718 -590 -681 -541 -439 -479
3648d79Q8N5k8L15k6L69L26l00l7j4J65J35K79J0l43K59l29N1q0j83K59m54j59
$$ -479 -391 -336 -364 -49 -75 294 620 320 283 269 434 569 848 858 515 774 445 496 416 233 492 38 -121
3671a21J61p7k58J37j49q7K4j55Q7r6J16J05nk47L51R9M13m20M73l63M9L50P5
$$ -121 40 -37 -295 -158 -307 -394 -370 -525 -438 -534 -418 -313 -318 -565 -214 -115 298 -122 351 -12 37 387 462
3694D62o5k68K89R8k26J38r0l4j03l1j3l45J11j10l6l11L5K10j76j33KM53k98
$$ 462 397 129 418 516 290 428 338 304 201 170 157 -188 -77 -187 -223 -534 -499 -289 -465 -598 -596 -143 -441
3717d41r6J92o1L80k81M72o8J75q6Q5o5L48Q2J19o19J24L29J09m6k1Q6k73l27
$$ -441 -537 -345 -406 -26 -307 165 97 272 186 271 206 554 636 755 136 260 589 698 652 631 717 444 117
3740A17K49j78K4k71j10r1k69K90k60k60O4J45J81k01j06M30j62N5K15j29j48
$$ 117 366 188 212 -59 -169 -260 -529 -239 -499 -759 -695 -550 -369 -570 -676 -246 -408 -353 -138 -267 -415
3761d15J74L88M5k71J93N69l47k59L82Q1q6k35K54K28l22k69J25j36j08K27o2
$$ -415 -241 147 192 -79 114 683 336 77 459 540 454 219 473 701 379 110 235 99 -9 218 156
3782A56k92m46M34J74k51j15K59J8l44o5L44k08M3K80J15j97R3L68J28o29L17
$$ 156 -136 -582 -148 26 -225 -340 -81 -63 -407 -472 -128 -336 -293 -13 102 -95 -2 366 494 -135 182
3803A82O92n65j97O11l50m6K37J34o40n3L17N6p48j00K14J45r51N23K36m40J31
$$ 182 874 309 112 723 373 327 564 698 58 5 322 378 -370 -470 -256 -111 -1062 -539 -303 -743 -612
3824f12J82K11o43J48O94m04M9K48R0k65L16K0Q0k9L7M94k67P1k07N30k29l24
$$ -612 -430 -219 -862 -714 -20 -424 -375 -127 -37 -302 14 34 114 85 122 616 349 420 213 743 514 190
3846A90M75K69p75j29N05k37l80M30k46l28nJ74L01q02J44M18j4m68J78J76m35
$$ 190 665 934 159 30 535 298 -82 348 102 -226 -231 -57 244 -558 -414 4 -10 -478 -300 -124 -559
3867e59M09N24j70m88K30O05k50o32N54K52n70j9L21J79l39J85J3m64k58P02m5
$$ -559 -150 374 204 -284 -54 551 301 -331 223 475 -95 -114 207 386 47 232 245 -219 -477 225 180
3888A80m41m12Q70j84o19K21k6L07l98K00J23j71j57N34j82j91J44M10j27j28
$$ 180 -261 -673 197 13 -606 -385 -411 -104 -502 -302 -179 -350 -507 27 -155 -346 -202 208 81 -47
3908d7p9K67k11L39L72j38j21J64Nm07q8K70j0m96P2N6M25n07j27J63k70L1K95
$$ -47 -126 141 -70 269 641 503 382 546 551 144 56 326 316 -180 -108 -52 373 -134 -261 -98 -368 -337 -42
3931d2L35r25J80R23n01l85K44L37l27j70Q02q6o24L54N09k96n36N67Lo6k45L60
$$ -42 293 -632 -452 471 -30 -415 -171 166 -161 -331 471 385 -239 115 624 328 -208 359 362 296 51 411
3953D11L8o16L79j00q12J7P49Oo50jM29J33m35k70N14j53j99M30J34n85L59N78
$$ 411 449 -167 212 112 -700 -683 66 72 -578 -579 -150 -17 -452 -722 -208 -361 -560 -130 4 -581 -222 356
3975C56j21p48Q02m1k43m10O77K30l05k97Q34m84m35N06K4j4l27K29L73o01r2
$$ 356 235 -513 289 248 5 -405 272 502 197 -100 734 250 -185 321 345 331 4 233 606 5 -87
3996h7M93j53p83O75j9n42K01K67K00n87J91M69k02n35L56M06l02o5M87J3n86
$$ -87 406 253 -530 145 126 -416 -215 52 252 -335 -144 325 123 -412 -56 350 48 -17 470 483 -103
4017a03K9O97l76j94j48O44m54m57J99M40o24Q0M48k12n49ON95q16L24M58l60
$$ -103 -74 623 247 53 -95 549 95 -362 -163 277 -347 -267 181 -31 -580 -574 21 -795 -471 -13 -373
4038c73l40K51J73j31j09L43M89m03n24R94k38m28M10L53k10k62N20K23o29J32
$$ -373 -713 -462 -289 -420 -529 -186 303 -100 -624 370 132 -296 114 467 257 -5 515 738 109 241
4058B41Q5L62m51K95r0k90o52Q55O1r51M37J87j29l06O1M09m18P7J89J66o3k53
$$ 241 326 688 237 532 442 152 -500 355 416 -535 -98 89 -40 -346 -285 124 -294 -217 -28 138 75 -178
4080a78N02j50l04L4N32k21j09K43K97n44nN32n37M7pL80q75j06O48l87Q1j84
$$ -178 324 174 -130 -96 436 215 106 349 646 102 97 629 92 139 132 512 -363 -469 179 -208 -127 -311
4102c11M10l89m07L43R9l02l80P56J40q06L51N78j45j39L93L41n72J10L45K60
$$ -311 99 -290 -697 -354 -255 -557 -937 -181 -41 -847 -496 82 -63 -202 191 532 -40 70 415 675
4122F75l98p1N22k59n6M30k9k05k04J83k22l9k27L67k06k38J81p1m11j93L33L88
$$ 675 277 206 728 469 413 843 814 609 405 588 366 327 100 467 261 23 204 133 -278 -471 -138 250
4144B50p70K65o5j68j69M99r8l44J97O08n36j32M30N36n37j30M82K75k53k87J8
$$ 250 -520 -255 -320 -488 -657 -158 -256 -600 -403 205 -331 -463 -33 503 -34 -164 318 593 340 53 71
4165G1L43m83j8L54n30P9M26p0n11k19M13L3k04ML17l77k89N71J23k00k54L62
$$ 71 414 -69 -87 267 -263 -184 242 172 -339 -558 -145 -112 -316 -312 5 -372 -661 -90 33 -167 -421 -59
4187e9K90k76J22L14l64P9Q23n07k22nM06j47j70L06J29m52m1K12k09l57mP1p0
$$ -59 231 -45 77 391 27 106 929 422 200 195 601 454 284 590 719 267 226 438 229 -128 -132 -61 -131
4210a31j14P2O1l35j20j14L10l25o7J72m4J14QM29K5l26M70N6j86o4K70J98n08
$$ -131 -245 -173 -112 -447 -567 -681 -371 -696 -763 -591 -635 -521 -513 -84 -59 -385 85 141 -45 -109 161 359 -149
4233a49M14O4m6k23N13j35j7k61q9K25n83M56L27o67k53M52Rl25R4m4K56j89L04
$$ -149 265 329 283 60 573 438 421 160 71 296 -287 169 496 -171 -424 28 37 -288 -194 -238 18 -171 133
4256A33k78l1M8J74Q9m06J20K12L48m42R6M9j9L26k40j69R9L6K98l21q4N3k02
$$ 133 -145 -176 -128 46 135 -271 -151 61 409 -33 63 112 93 419 179 10 109 145 443 122 38 91 -111
4279a11p2j8k99L82N1q9j23m66N7L09J69l35m9M50j01J2J42K52r7J94J02j83j12
$$ -111 -183 -201 -500 -118 -67 -156 -279 -745 -688 -379 -210 -545 -594 -144 -245 -233 -91 161 64 258 360 177 65
4302F5Q6L31j45K59q1P8n2j09m14K37k4J01j5J7m32M60k50k24j63l3m6L77l57
$$ 65 151 482 337 596 515 593 541 432 18 255 231 332 317 334 -98 362 112 -112 -275 -308 -354 23 -334
4325c34oo5J69k43J5L21j92J81o6q7M36j71j82K0K58R7J56k22N4j57m59M76r9
$$ -334 -340 -405 -236 -479 -464 -143 -335 -154 -220 -307 129 -42 -224 -204 54 151 307 85 139 -18 -477 -1 -100
4348a00j11P4K12l56O2J73l07jN91m93k89K68N3MK84k30p2n8J64M90k34l24N96
$$ -100 -211 -137 75 -281 -219 -46 -353 -354 237 -256 -545 -277 -224 -220 64 -166 -238 -296 -132 358 124 -200 396
4371C96k01K21j33L29O4j07k27J11o8r2j38j73M88k20L7k60j36K58o6j40m5k66
$$ 396 195 416 283 612 676 569 342 453 385 293 155 -18 470 250 287 27 -109 149 83 -57 -102 -368
4393c68Lr3L19k77j60K81KO2j20O1J9J47O0L10m77L13l5J47j40K56l06K37p2l17
$$ -368 -365 -458 -139 -416 -576 -295 -293 -231 -351 -290 -271 -124 -64 246 -231 82 47 194 54 310 4 241 169 -148
4417a48L04j29K37j29m58M73m29J83J84n3o45L66K49j50j57J2K76j28kM5o0LL26
$$ -148 156 27 264 135 -323 150 -279 -96 88 35 -610 -244 5 -145 -302 -290 -14 -142 -144 -99 -159 -156 170
4440A70J48l87J64QL19o4j95K33j57R7R5J48m18q0J19J20n44K53j16J42l71K83
$$ 170 318 -69 95 103 422 358 163 396 239 336 431 579 161 81 200 320 -224 29 -87 55 -316 -33
4462c3k54j30OK1N45o87K18R8k88J64K7M74m78k2P08k39l3R9K36n13kO26N1k21
$$ -33 -287 -417 -411 -390 155 -532 -314 -216 -504 -340 -313 161 -317 -339 369 130 97 196 432 -81 -83 543 594 373
4486C73l3j09O5j83Q9j01r2j03J90k05j02l04L93L07n54N0K60k75l42K04K64o9
$$ 373 340 231 296 113 202 101 9 -94 96 -109 -211 -515 -122 185 -369 -319 -59 -334 -676 -472 -208 -277
4508b77J90L74m62QK45j10O2m86N76K07l18M59K3l25j61J71j1k68p1N53q9n02
$$ -277 -87 287 -175 -167 78 -32 30 -456 120 327 9 468 491 166 5 176 165 -103 -174 379 290 -212
4530b12K21J49m84j98N77j48k06j09L51K41o16O4N48l59k10L50N03m77j41O00
$$ -212 9 158 -326 -524 53 -95 -301 -410 -59 182 -434 -370 178 -181 -391 -41 462 -15 -156 444
4550D44L4n10K92J99k7o35N38J15l67j79K58k2n77L76M44l59n09K17J99m23o3
$$ 444 478 -32 260 459 432 -203 335 450 83 -96 162 140 -437 -61 383 24 -485 -268 -69 -492 -555
4571e55J84j03J33K09k03K9m38L44N35m37p9K26p3J07J76J23L6j18K05J02k92
$$ -555 -371 -474 -341 -132 -335 -306 -744 -400 135 -302 -381 -155 -228 -121 55 178 214 96 301 403 111
4592A11K03L86k74r6k7L00k54l64K56K4k26l6j46O1k00mM85n06l64O14J37k77
$$ 111 314 700 426 330 303 603 349 -15 241 265 39 3 -143 -82 -282 -286 199 -307 -671 -57 80 -197
4614a97J76n6j04j39N37M8m04lR9M05l70pL03P8l16R4l05K83j26L03j71p80K71
$$ -197 -21 -77 -181 -320 217 265 -139 -142 -43 362 -8 -15 288 366 50 144 -161 122 -4 299 128 -652 -381
4637c81N15Kn81q3L19q2k19K9J30k90L78K0m05J30J99L30k11k51L44J20m5j27
$$ -381 134 136 -445 -528 -209 -291 -510 -481 -351 -641 -263 -243 -648 -518 -319 11 -200 -451 -107 13 -32 -159
4659a59Q39n11j77Q30l07m86K1O99l29l19K14K58l11j61J15j40L0J6K6j93m80
$$ -159 680 169 -8 822 515 29 50 749 420 101 315 573 262 101 216 76 106 122 148 -45 -525
4680e25M36L98o63k20K00K58j70j82M63o2k13J81O30n52J45L25k13j65J28K51
$$ -525 -89 309 -354 -574 -374 -116 -286 -468 -5 -67 -280 -99 531 -21 124 449 236 71 199 450
4700D50j45j89N59n52j71P0l9J49l17J3P0k01j84J71L15o36K41K89k16q6l56N12
$$ 450 305 116 675 123 -48 22 -17 132 -185 -172 -102 -303 -487 -316 -1 -637 -396 -107 -323 -409 -765 -253
4722b53k25j80N20J33l33J30M81j67k72J70L57R0n91M96J36k86j6K75l59j39J30
$$ -253 -478 -658 -138 -5 -338 -208 273 106 -166 4 361 451 -140 356 492 206 190 465 106 -33 97
4743I7L51o1l47J24K39n45J22J18l46j84QL10l7k31K02K79M1m37K98L11o26L84
$$ 97 448 387 40 164 403 -142 -20 98 -248 -432 -424 -114 -151 -382 -180 99 140 -297 1 312 -314 70
4765G0L87l71J37k01N38q95K72L16K78o82R2M41m84L46l05K72J04o64N58j32o45
$$ 70 457 86 223 22 560 -335 -63 253 531 -151 -59 382 -102 244 -61 211 315 -349 209 77 -568
4786e68L93L98l07n13M92J4l01j91O99m01r4K48J63k0k69K61J91j00j25M29J69
$$ -568 -175 223 -84 -597 -105 -91 -392 -583 116 -285 -379 -131 32 12 -257 4 195 95 -30 399 568
4807E68o58J96L50k91j45J07J24l7n10Q23l61m38M5M15k49r6J45J32l20m3R5l9
$$ 568 -90 106 456 165 20 127 251 214 -296 527 166 -272 -227 188 -61 -157 -12 120 -200 -243 -148 -187
4829a87L5j98N89k39j56L84k45J74j22J68l5r4O1L78j94l35L41K79l81l9J31j34
$$ -187 -152 -350 239 0 -156 228 -17 157 35 203 168 74 135 513 319 -16 325 604 223 184 315 181
4851A81q1m13K91J52m29J90mJ13m15J73K92l54j3K48k88j41J83K02p3l5K97j98
$$ 181 100 -313 -22 130 -299 -109 -113 0 -415 -242 50 -304 -317 -69 -357 -498 -315 -113 -186 -221 76 -122
4873a22m96N77L31l68N8n7M40m03J51j72j38K64K23o9j5l14n4M68k30J86r8j21
$$ -122 -618 -41 290 -78 -20 -77 363 -40 111 -61 -199 65 288 219 204 -110 -164 304 74 260 162 41
4895D1j10n1j16j79M03o4R5J06o7k95J16l13N24K1r9J37O0j4K3j9j25J1K48j79
$$ 41 -69 -120 -236 -415 -12 -76 19 125 58 -237 -121 -434 90 111 12 149 209 195 218 199 74 85 333 154
4919A54L53l91K12j82K12m16L37k72j30o9N8J55l31j85N11l28l1lj36R3m9K53
$$ 154 507 116 328 146 358 -58 279 7 -123 -192 -134 21 -310 -495 16 -312 -343 -346 -482 -389 -438 -185
4941a85l84N80j48J11j31J61M4J22q3J30J9l19M77lR2k63m5k7L79k78J44j1l43
$$ -185 -569 11 -137 -26 -157 4 48 170 87 217 236 -83 394 391 483 220 175 148 527 249 393 382 39
4964C9k9K03r5l43P4K51j55l5o9P6j71n0j5K69J40k66K36k88M10J67j25J8n0j62
$$ 39 10 213 118 -225 -151 100 -55 -90 -159 -83 -254 -304 -319 -50 90 -176 60 -228 182 349 224 242 192 30
4988C0K25k42L11m8k89K47j53K74q9j98MR8m6j19j03J2j71j19K12M9p3Nk61M76
$$ 30 255 13 324 276 -13 234 81 355 266 68 72 170 124 5 -98 -86 -257 -376 -164 -115 -188 -183 -444 32
5012C2n55J58J41k5j4K65K81o04M45J01l3O4q2Q4j32J8q7L13l28L95l74J25k34
$$ 32 -523 -365 -224 -249 -263 2 283 -321 124 225 192 256 174 258 126 144 57 370 42 437 63 188 -46
5035d6J98j80K31l73L75l07j44n4JJ51m3l05J43J6L3L23Q4j67J79k16J13qj23
$$ -46 152 -28 203 -170 205 -102 -246 -300 -299 -148 -191 -496 -353 -337 -304 19 103 -64 115 -101 12 4 -119
5058a19R6M66m23p8N33n10K91j46l5L10k14l4j10j06o1L23k6l83J72j33J64l83
$$ -119 -23 443 20 -58 475 -35 256 110 75 385 171 137 27 -79 -140 183 157 -226 -54 -187 -23 -406
5080d06L53k00j56J02M92o21oL19N7J63n50N91K19k25r8j04J63J38J6Q7k46K73
$$ -406 -53 -253 -409 -307 185 -436 -442 -123 -66 97 -453 138 357 132 34 -70 93 231 247 334 88 361
5102C61k00j2M9k41L69j02j74k00L02l86j20J58Ll54K24M66l21k23j2J04K23l8
$$ 361 161 149 198 -43 326 224 50 -150 152 -234 -354 -196 -193 -547 -323 143 -178 -401 -413 -309 -86 -124
5124a24r6OJ03J63K36n03K58K21P8j14J9L57l36R5k65J71K11k56J3O3j30l59K85
$$ -124 -220 -214 -111 52 288 -215 43 264 342 228 247 604 268 363 98 269 480 224 237 300 170 -189 96
5147I6J96m21q0j27J81m21J4L61R9l68K95Q3l23K55K20j82j84J82L06J21k34R7
$$ 96 292 -129 -209 -336 -155 -576 -562 -201 -102 -470 -175 -92 -415 -160 60 -122 -306 -124 182 303 69 166
5169A66j00M53m20L0K63k05J42l8K8j84j50L07j45m6J30l23J5L8J06m80k04K06
$$ 166 66 519 99 129 392 187 329 291 319 135 -15 292 147 101 231 -92 -77 -39 67 -413 -617 -411
5191d11m6j79K71L45lj47l52M05j59K25jL18m25K14%M7j81M64Nk79K79L4n2m03
$$ -411 -457 -636 -365 -20 -23 -170 -522 -117 -276 -51 -52 266 -159 55 55 102 -79 385 390 111 390 424 372 -31
5215c1L89R6l96k76M45K0l16K63m58k3L9Q9j94J44J74k21n2K10p0L70j88N9r0
$$ -31 358 454 58 -218 227 247 -69 194 -264 -287 -248 -159 -353 -209 -35 -256 -308 -98 -168 202 14 73 -17
5238a7K67l07M68l45L63j11p7J35k19J5M2K66l47J18k82j4j29J5K40l50k26K61
$$ -17 250 -57 411 66 429 318 241 376 157 172 214 480 133 251 -31 -45 -174 -159 81 -269 -495 -234
5260b34q2k56P4J37Q1k57R4M96l20k3J16Q5o1K44N7K27l58N01k96l8k30O24k25
$$ -234 -316 -572 -498 -361 -280 -537 -443 53 -267 -290 -174 -89 -150 94 151 378 20 521 225 187 -43 581 356
5283C56k98J58j41K51j77K88l19l0k51k8L45n90N32q8k07k40RN60k63m59L36J56
$$ 356 58 216 75 326 149 437 118 88 -163 -191 154 -436 96 8 -199 -439 -430 130 -133 -592 -256 -100
5305a00j53p7K34L29m94M58J07n14K68L0L10n4j10M6O4j84N4L64p07JJ28K73n78
$$ -100 -253 -330 -96 233 -261 197 304 -210 58 88 398 344 234 280 344 160 214 578 -129 -128 0 273 -305
5328c05Q8P8j55p9nK67m57J44K43k51j99N7N62J9n80N34m1r1j10K94M62l41j1
$$ -305 -217 -139 -294 -373 -378 -111 -568 -424 -181 -432 -631 -574 -12 7 -573 -39 -80 -171 -281 13 475 134 123
5351A23L50k40l27M67p1k32J07J61J64n44K61m2j98k60L47Q9m62R2m6K89m22j47
$$ 123 473 233 -94 373 302 70 177 338 502 -42 219 177 -21 -281 66 155 -307 -215 -261 28 -394 -541
5373e41L68j49N1l9J14q6J3N32k92k3L1L12Q6l62M11l39P4M1N3J52m67P5K63J43
$$ -541 -173 -322 -271 -310 -196 -282 -269 263 -29 -52 -21 291 377 15 426 87 161 202 255 407 -60 15 278 421
5397D21m89J5R7k48r4K94p7j90j51J28p2j94K40p0OP6M28q5k76K93J54l64R1N5
$$ 421 -68 -53 44 -204 -298 -4 -81 -271 -422 -294 -366 -560 -320 -390 -384 -308 120 35 -241 52 206 -158 -67 -12
5421a2L79l21j19L63J38l13K34j11j31P8j67J37j38j07j12J16l42L46l0j48j65
$$ -12 367 46 -73 290 428 115 349 238 107 185 18 155 17 -90 -202 -86 -428 -82 -112 -260 -425
5442d25J20L10j30J6j40J19j58q0N16l12L61j52J48K4nJ62l55Q1Q6K79j99Q0n4
$$ -425 -305 5 -125 -109 -249 -130 -288 -368 148 -164 197 45 193 217 212 374 19 100 186 465 266 346 292
5465B92Q2k40j0J06j43l7l07K15k04L90l20K9O0m37M31l63Q4Q5M9n1K60J46j32
$$ 292 374 134 124 230 87 50 -257 -42 -246 144 -176 -147 -87 -524 -93 -456 -372 -287 -238 -289 -29 117 -15
5488a5k89J86K31O0k94M07p7J4n8j1K1J43r5OK1k39J72j57J54n9l14R1K56m40
$$ -15 -304 -118 113 173 -121 286 209 223 165 154 175 318 223 229 250 11 183 26 180 121 -193 -102 154 -286
5512b86N8p7K47l44J73RL50k62n0K2j05J79J9J0P9j35r6M47Lk04r9L07L0j50J28
$$ -286 -228 -305 -58 -402 -229 -220 130 -132 -182 -160 -265 -86 -67 -57 22 -113 -209 238 241 37 -62 245 275 125 253
5537B53Pp5k27K70j13l4k47L28j17k13J66ol02j15J12K56k15j00J2K37k3j73M72
$$ 253 260 185 -42 228 115 81 -166 162 45 -168 -2 -8 -310 -425 -313 -57 -272 -372 -360 -123 -146 -319 153
5560A53oo17O14j23kL21k02j95K04M8P9r8j72L10n7rl28Q2L16m90J0Q3J46k58
$$ 153 147 -470 144 21 19 340 138 -57 147 195 274 176 4 314 257 248 -80 2 318 -172 -162 -79 67 -191
5584a91J86k44rn4J62j3P7N6l08L40k44L86O8l71o7L24J76j56l15K18J17n1p6
$$ -191 -5 -249 -258 -312 -150 -163 -86 -30 -338 2 -242 144 212 -159 -226 98 274 118 -197 21 138 87 11
5607A1J69p1lj96j87K36Q7K17n27k9J80j31k09K02j45q8K78N6K24j59l1p5K16
$$ 11 180 109 106 -90 -277 -41 46 263 -264 -293 -113 -244 -453 -251 -396 -484 -206 -150 74 -85 -116 -191 25
5630B5J80j66mJ91J97q9k63N6K69k30J94r7k33j6L37o8j57J02j21j36oj31P7j52
$$ 25 205 39 35 226 423 334 71 127 396 166 360 263 30 14 351 283 126 228 107 -29 -35 -166 -89 -241
5654b41J40n8J81j79n8N6l51L87n1J57Mn7J5j72n9K5J98K67k62j30N30O7n38M89
$$ -241 -101 -159 22 -157 -215 -159 -510 -123 -174 -17 -13 -70 -55 -227 -286 -261 -63 204 -58 -188 342 409 -129 360
5678C60j68r9j51J24K45j36p2j43j71j7K25k67K37k41L01j12j31M1L39m82J72
$$ 360 192 93 -58 66 311 175 103 -40 -211 -228 -3 -270 -33 -274 27 -85 -216 -175 164 -318 -146
5699a46M51k77J37k94J25J94j55Q6j46K84r3q3L90l25J61j51j1l7N2J34j31n36
$$ -146 305 28 165 -129 -4 190 35 121 -25 259 166 83 473 148 309 158 147 110 162 296 165 -371
5721c71L12l5k12N5j75O6P5j89L19l84J11J8J73J42M4K08l35R5J20j38L04l62
$$ -371 -59 -94 -306 -251 -426 -360 -285 -474 -155 -539 -428 -410 -237 -95 -51 157 -178 -83 37 -101 203 -159
5743a59L35j11J42k62L46q9J29O0k00J46j30k7q2p0O7l25Q3K61k71N0l42L55q0
$$ -159 176 65 207 -55 291 202 331 391 191 337 207 180 98 28 95 -230 -147 114 -157 -107 -449 -94 -174
5766a74K0j1j15q3M10j98J18J17j07Lp7J5L11q9k88L86k35J78J50m59J9K47N5
$$ -174 -154 -165 -280 -363 47 -151 -33 84 -23 -20 -97 -82 229 140 -148 238 3 181 331 -128 -109 138 193
5789A93Pk33k07j03p8L90j56J96j80L1m0k03M3J64j3j35M19j24n2M7r2J62KO5
$$ 193 200 -33 -240 -343 -421 -31 -187 9 -171 -140 -180 -383 -340 -176 -189 -324 95 -29 -81 -34 -126 36 38 103
5813A03j50J35n6MP8mN1J74k18Q2o6Q5k00j18L45k30j15J31k36Ll17p5N53J63
$$ 103 -47 88 32 36 114 110 161 335 117 199 133 218 18 -100 245 15 -100 31 -205 -202 -519 -594 -41 122
5837A22m28J24q3j1K6k11L44P0P4r5Pk04J55J67LJ11j76J23J20o6M3k27K80j9
$$ 122 -306 -182 -265 -276 -250 -461 -117 -47 27 -68 -61 -265 -110 57 60 171 -5 118 238 172 215 -12 268 249
5861B49l88K8L57m28K19k61K05n6P0m6j69L69j73j91p9K18p7P0K62m66J39K27
$$ 249 -139 -111 246 -182 37 -224 -19 -75 -5 -51 -220 149 -24 -215 -294 -76 -153 -83 179 -287 -148 79
5883G9j28J30M1n6j9p6K28R6k88J19N0j07k04O4K21j23j68p6j78N6J11K33l37
$$ 79 -49 81 122 66 47 -29 199 295 7 126 176 69 -135 -71 150 27 -141 -217 -395 -339 -228 5 -332
5906c32j2J57R9o4k75L84l0K9o1L12M6l85P7K92k34l5L76l02J83k7o5J46k6J19
$$ -332 -344 -187 -88 -152 -427 -43 -73 -44 -105 207 253 -132 -55 237 3 -32 344 42 225 198 133 279 253 372
5930C72o0l04R5R7J56k46l27P0J74j45L6j15j21K87o7K15k73L32l18J87J43m80
$$ 372 312 8 103 200 356 110 -217 -147 27 -118 -82 -197 -318 -31 -98 117 -156 176 -142 45 188 -292
5952b92M23o75K39L27O4k80L31K29l26r3j93K09n5J83j0k22j02N12k62j14k56
$$ -292 131 -544 -305 22 86 -194 137 366 40 -53 -246 -37 -92 91 81 -141 -243 269 7 -107 -363
5973c63P9L80l1l52P4J5l5j6J02M5K33j6r1l4m11N64J65k77J40J27k82K72oj57
$$ -363 -284 96 65 -287 -213 -198 -233 -249 -147 -102 131 115 24 -10 -421 143 308 31 171 298 16 288 282 125
5997A25Qq7K06lO9r4j06j58j27kj0K72j40J11K6l4k19K43o2j18j37J10J7q1J73
$$ 125 133 46 252 249 318 224 118 -40 -167 -169 -179 93 -47 64 90 56 -163 80 18 -100 -237 -127 -110 -191 -18
6022a8n4K20l42M09j56J43k98N62l61J89j76J01k54J39LK06j15j62M7j77J10k06
$$ -18 -72 148 -194 215 59 202 -96 466 105 294 118 219 -35 104 107 313 198 36 83 -94 16 -190
6044a90P9p6N9k89K05J17J06j04j19m8J42K41k55J04J94k9k34K57J39J52k04M00
$$ -190 -111 -187 -128 -417 -212 -95 11 -93 -212 -260 -118 123 -132 -28 166 137 -97 160 299 451 247 647
6066F47m83o6K48k00o8J76j08m03L6L32j65J41l08J14k4k14M28M5l51l6J96%k91
$$ 647 164 98 346 146 78 254 146 -257 -221 111 -54 87 -221 -107 -131 -345 83 128 -223 -259 -63 -63 -354
6089c54K50L16k38k31J2L65m5k64M84l00L69k16K24k70k26K12L08j41n9M1N7j55
$$ -354 -104 212 -26 -257 -245 120 75 -189 295 -5 364 148 372 102 -124 88 396 255 196 237 294 139
6111A39j06J59l60RK3K03m31K26k22L93l90M62q4k9m65K56k24J60j55L12J42j41
$$ 139 33 192 -168 -159 -136 67 -364 -138 -360 33 -357 105 21 -8 -473 -217 -441 -281 -436 -124 18 -123
6133a23r6M64j97n7K86l4p4k58K35K48l93Q2q6O2j89j0K73m3k88M25k13lm97K29
$$ -123 -219 245 48 -9 277 243 169 -89 146 394 1 83 -3 59 -130 -140 133 90 -198 227 14 11 -486 -257
6157b57N18o90N36m6p6k59J46L20m35J48J71K48l1j23k78O74l76j46r8K74o6O8
$$ -257 261 -429 107 61 -15 -274 -128 192 -243 -95 76 324 293 170 -108 566 190 44 -54 220 154 222
6179B22l1j19O4o8Q7k29J27K04k65k17J78M9Q1j16K21m46K77k73J62J17l50K80
$$ 222 191 72 136 68 155 -74 53 257 -8 -225 -47 2 83 -33 188 -258 19 -254 -92 25 -325 -45
6201d5R1l37L64j16j9j24M00q1m80L26J05j6N0O1J12p2Nk14J05j01o6OK83n9j41
$$ -45 46 -291 73 -43 -62 -186 214 133 -347 -21 84 68 118 179 291 219 224 10 115 14 -52 -46 237 178 37
6226C7J98l47P7J26j43j13J38R3j97m3J53J97k02l09L39K7K20l34J75j2Q9l3r6
$$ 37 235 -112 -35 91 -52 -165 -27 66 -131 -174 -21 176 -26 -335 4 31 251 -83 92 80 169 136 40
6249D0j21L46j18m9N00m43p5J9L5j83K46r2k25k63M68R3l45J43O6k15k57K43o3
$$ 40 -81 265 147 98 598 155 80 99 134 -49 197 105 -120 -383 85 178 -167 -24 42 -173 -430 -187 -250
6272b50j1o1J86J44K1L0K9j44j72N12k26O0r3k3R0K45k70k00N11l69K5k42L50
$$ -250 -261 -322 -136 8 29 59 88 -56 -228 284 58 118 25 2 92 337 67 -133 378 9 34 -208 142
6295A42j07j26N7k91N23j35J29k17j82k25J13N2L2O6lK78k56j66M08l42M05Lj0
$$ 142 35 -91 -34 -325 198 63 192 -25 -207 -432 -319 -267 -235 -169 -172 106 -150 -316 92 -250 155 158 148
6318A48Q0k09L5Nk24K73j41K28j11q8k8M6j45P4M9J40l38j14R1K40j56n9j37M28
$$ 148 228 19 54 59 -165 108 -33 195 84 -4 -32 14 -131 -57 -8 132 -206 -320 -229 11 -145 -204 -341 87
6342H7l17K27pn46M89K78l09M1J05m8p3M90L2m59P3n7J94j21QK68j57L5j1j7k1
$$ 87 -230 -3 -10 -556 -67 211 -98 -57 48 0 -73 417 449 -10 63 6 200 79 87 355 198 233 222 205 184
6367A84k81K37j34j22OM1lk21j32K30j35J87j7K06Q8K67l62j67j42K50K17l19
$$ 184 -97 140 6 -116 -110 -69 -72 -293 -425 -195 -330 -143 -160 46 134 401 39 -128 -270 -20 197 -122
6389a22k34O08j17k22M39R2n4n67L14j79L1l05Q32k21j71j21K0j22J91k81n2J58
$$ -122 -356 252 135 -87 352 444 390 -177 137 -42 -11 -316 516 295 124 3 23 -99 92 -189 -241 -83
6411h3L9K5j18J02k08N77m94J60J38j91J09J52l37K8K02Q3m02J31L28n7k56K9
$$ -83 -44 -19 -137 -35 -243 334 -160 0 138 -53 56 208 -129 -101 101 184 -218 -87 241 184 -72 -43
6433d3PJ91j19n4k65K13q2P0k8L57k76j38J21R0j39Q8m0j12JK95j98p2Rj4L15
$$ -43 -36 155 36 -18 -283 -70 -152 -82 -110 247 -29 -167 -46 44 -95 -7 -47 -159 -158 137 -61 -133 -124 -138 177
6458A77l64j07K97J41J00k45k6J01j00K34n7J4j78p6M10k34J07O6j64j80L23j42
$$ 177 -187 -294 3 144 244 -1 -27 74 -26 208 151 165 -13 -89 321 87 194 260 96 -84 239 97
6480I7k56J22J30m5j8r1N4L20o73J14K10j36J16r2J3M50k17j42l6l5O7M69k89
$$ 97 -159 -37 93 48 30 -61 -7 313 -360 -246 -36 -172 -56 -148 -135 315 98 -44 -80 -115 -48 421 132
6503A32k16Q6K31J23JK53l62j11j31J62r0k64J40R6J49k18l29L10q5M4m2P5n7
$$ 132 -84 2 233 356 357 610 248 137 6 168 78 -186 -46 50 199 -19 -348 -38 -123 -79 -121 -46 -103
6526a03O6LK28m17K90L8k11L59j10n4j24L18k53J71j17J26k10R2j67N6O3qo0K40
$$ -103 -37 -34 194 -223 67 105 -106 253 143 89 -35 283 30 201 84 210 0 92 -75 -19 44 36 -24 216
6550B16j21j43j60K52j13R5k87j22K07J38o1J33Q5J15k28k64J79k6N36j98L3l9
$$ 216 95 -48 -208 44 -69 26 -261 -383 -176 -38 -99 34 119 234 6 -258 -79 -105 431 233 266 227
6572B27l65J43K25l15L56k03K14j26M8kl45N5L8J13j71K36K3k45L8j79N3j19K39
$$ 227 -138 5 230 -85 271 68 282 156 204 202 -143 -88 -50 63 -108 128 151 -94 -56 -235 -182 -301 -62
6595f2K23k01k12J25K44p9N1j26L70l71j55L81q7j70K10k33M01p2j61Q8k37L20
$$ -62 161 -40 -252 -127 117 38 89 -37 333 -38 -193 188 101 -69 141 -92 309 237 76 164 -73 247
6617B47j88L87m10L14l49l5k49l0J42O6p4l37K58J56L6q7Ok2L01r1J08m43K03
$$ 247 59 446 36 350 1 -34 -283 -313 -171 -105 -179 -516 -258 -102 -66 -153 -147 -169 132 41 149 -294 -91
6640i1Q4R9k87J60K58n9K18p5j29j58L19k74K2p0p7L78l64p0Q4K7R7o07M70j90
$$ -91 -7 92 -195 -35 223 164 382 307 178 20 339 65 87 17 -60 318 -46 -116 -32 -5 92 -515 -45 -235
6664b35M8n3l5J1J11K08m27j77L04m5k7L09qR2j87M97J52k25o7l8J96k30o4L62
$$ -235 -187 -240 -275 -264 -153 55 -372 -549 -245 -290 -317 -8 -16 76 -111 386 538 313 246 208 404 174 110 472
6688D72k17m03mp7L83l07R6K34l9l68J97k0r4j29K63m0k90P42m60q4rJ75R4j32
$$ 472 255 -148 -152 -229 154 -153 -57 177 138 -230 -33 -53 -147 -276 -13 -53 -343 399 -61 -145 -154 21 115 -17
6712a7K0K49N5p6q3J28K35o62K65Q1r3Lm9P5J50j46K1k87r3jK54j84J1R8p7p7
$$ -17 3 252 307 231 148 276 511 -151 114 195 102 105 56 131 281 135 156 -131 -224 -225 29 -155 -144 -46 -123 -200
6738b00j3J05k20j3K19r7n24M14O15l15N2L1R3O1o6L26l10j23J67P6l3J7j14K23
$$ -200 -213 -108 -328 -341 -122 -219 -743 -329 286 -29 23 54 147 208 142 468 158 35 202 278 245 262 148 371
6762C71k89L1l00J19K58o21K36k8K87k65J69n53M20l54M82J57k53j73j0K39K93
$$ 371 82 113 -187 -68 190 -431 -195 -223 64 -201 -32 -585 -165 -519 -37 120 -133 -306 -316 -77 216
6783B16k13P1J70n5j81K22n1k33N97m62J05m60M76j07J68o3J28n02k44L26K36
$$ 216 3 74 244 189 8 230 179 -54 543 81 186 -274 202 95 263 200 328 -174 -418 -92 144
6804A44O8l72j09K78j69o9O9j98N48o50K16R8K03l32K51j20J59M31m79J39p1J57
$$ 144 212 -160 -269 9 -160 -229 -160 -358 190 -460 -244 -146 57 -275 -24 -144 15 446 -33 106 35 192
6826A92R6J52k23r8j25J32j4K61l35q4K05K8k65K11m0m93J55j83j44L34j32J52
$$ 192 288 440 217 119 -6 126 112 373 38 -46 159 187 -78 133 93 -400 -245 -428 -572 -238 -370 -218
6848b18o8k85M78p3L21J29m11j18M64o10M90n1n2K73rk3J45j16K6j42K0O4J30
$$ -218 -286 -571 -93 -166 155 284 -127 -245 219 -391 99 48 -4 269 260 237 382 266 292 150 170 234 364
6871C64nj06j53p3k79M06l91K62l54K17k16j47J06q7J63l5J90k72M60l00J04m1
$$ 364 359 253 100 27 -252 154 -237 25 -329 -112 -328 -475 -369 -456 -293 -328 -138 -410 50 -250 -146 -187
6893a87K56Q8o2L10l79M7J40j95J45M1k51J50J54K31k87j24k08L85n55M09k95
$$ -187 69 157 95 405 26 73 213 18 163 204 -47 103 257 488 201 77 -131 254 -301 108 -187
6914a87K0J66k56j38K25j53K73M8j05q2j63M27O1l28k2r2L57p8L57k06R7N5j03
$$ -187 -167 -1 -257 -395 -170 -323 -50 -2 -107 -189 -352 75 136 -192 -214 -306 51 -27 330 124 221 276 173
6937A73J9j49J01rJ37k29j4L3m6J00k36N2j86L05j9j3j13Q7N0j23m05L01J9J5
$$ 173 192 43 144 135 272 43 29 62 16 116 -120 -68 -254 51 32 19 -94 -7 43 -80 -485 -184 -165 -150
6961a50P1j14J98j08K00q1J02m21M70Q5l25QN58n74J78j70J34R1k4j65j93J13
$$ -150 -79 -193 5 -103 97 16 118 -303 167 252 -73 -65 493 -81 97 -73 61 152 128 -37 -230 -117
6983a17L83m54J14K77n01K59j46p4N0o6k60N66k5k74K65r6K64m1L7j25K61m05
$$ -117 266 -188 -74 203 -298 -39 -185 -259 -209 -275 -535 31 6 -268 -3 -99 165 124 161 36 297 -108
7005a08J8K51Q3J52n46M5K91l21J65n9K1J06j52n7j3N6j06r8K3P7M4K9kk0j78
$$ -108 -90 161 244 396 -150 -105 186 -135 30 -29 -8 98 -54 -111 -124 -68 -174 -272 -249 -172 -128 -99 -101 -121 -299
7030b99o4J79o7K41j0j88J90j90K13j61M5K06J37k4k86M73l86J38J26k75L11J7
$$ -299 -363 -184 -251 -10 -20 -208 -18 -208 5 -156 -111 95 232 208 -78 395 9 147 273 -2 309 326
7052C26l00K5J60k74J66k92J84l5j20qJ23Pn00N49j25J10K7P1k57K0M0K43j10
$$ 326 26 51 211 -63 103 -189 -5 -40 -160 -168 -45 -38 -538 11 -114 -4 23 94 -163 -143 -103 140 30
7075C0k4o3MJ57k02m8Q5M42l86J59j74j5K09J4j07j80J06j95K95k61K48k96K27
$$ 30 6 -57 -53 104 -98 -146 -61 381 -5 154 -20 -35 174 188 81 -99 7 -188 107 -154 94 -202 25
7098B5j2r9r1O8o3pn6K63Q1J09k73Q8l22N30l01j3o0n0K83q3J44M9k30K99l38
$$ 25 13 -86 -177 -109 -172 -179 -235 28 109 218 -55 33 -289 241 -60 -73 -133 -183 100 17 161 210 -20 279 -59
7123e9J49j63K05K8j01J32l65J35k45J61O9k19P9N5QL3L6K93q8l33j48j07O63
$$ -59 90 -73 132 160 59 191 -174 -39 -284 -123 -54 -273 -194 -139 -131 -98 -62 231 143 -190 -338 -445 218
7146B18k56j16M59l99M62j9m34L56l91O1Q2m0NJ5m3K27Q6n68L64j27J50j30k14
$$ 218 -38 -154 305 -94 368 349 -85 271 -120 -59 23 -17 -12 3 -40 187 273 -295 69 -58 92 -38 -252
7169b52L91o6l43L10k24J38rk3k41L32J08k19L06l62L23n4J50k26j44L15j75L6
$$ -252 139 73 -270 40 -184 -46 -55 -78 -319 13 121 -98 208 -154 169 115 265 39 -105 210 35 71
7191G1J32m43M17m60K95M17l52J37k0p1k08j6pK76J68n18o0M52l39nJ07o2pj19
$$ 71 203 -240 177 -283 12 429 77 214 194 123 -85 -101 -108 168 336 -182 -242 210 -129 -134 -27 -89 -96 -215
7215b15M22k43k21J38J29o9R4r2q5J69k7m8O9L23n36J93k45K93nP9l36J15J72
$$ -215 207 -36 -257 -119 10 -59 35 -57 -142 27 0 -48 21 344 -192 1 -244 49 44 123 -213 -98 74
7238G4L0l92L17j51J04j6K7n1k07L95r3O4%pM7L1k08K0J45k2J56J94k84n1L20
$$ 74 104 -288 29 -122 -18 -34 -7 -58 -265 130 37 101 101 94 141 172 -36 -16 129 107 263 457 173 122 442
7263D42j34n07O14l59k84K24P1m5k22J57K16k99k00J78QJ1K9P6k61L36o9J21j17
$$ 442 308 -199 415 56 -228 -4 67 22 -200 -43 173 -126 -326 -148 -140 -129 -100 -24 -285 51 -18 103 -14
7286a4j42J32J11j42j07J38k0Mo7J83j83J21P5l14J69l51L20J61m13J29K2L49
$$ -14 -156 -24 87 -55 -162 -24 -44 -40 -107 76 -107 14 89 -225 -56 -407 -87 74 -339 -210 -188 161
7308A61n04K37k28L00j55m6M41l93J88k59J85j58K5j86M50o1K08j99j18J56O1
$$ 161 -343 -106 -334 -34 -189 -235 206 -187 1 -258 -73 -231 -206 -392 58 -3 205 6 -112 44 105
7329A05K35l23l7K08mj31R7N9rn40N01j90K23k29M3j0K93k33K8k76k04L58K1j06
$$ 105 340 17 -20 188 184 53 150 209 200 -340 161 -29 194 -35 8 -2 291 58 86 -190 -394 -36 -15 -121
7353a21j87M0K2K04m2N3m7k0oK64k49J24j69K07m9K41l09K38j66O0J64l24k46
$$ -121 -308 -268 -246 -42 -84 -31 -78 -98 -104 160 -89 35 -134 73 24 265 -44 194 28 88 252 -72 -318
7376c18K98J1l0j8r2K35n9j13Q0o2K3j08jm6N4j49K68MK3J21l96L85K22l62j47
$$ -318 -20 -9 -39 -57 -149 86 27 -86 -6 -68 -45 -153 -154 -200 -146 -295 -27 -23 0 121 -275 110 332 -30 -177
7401a77M89l67j13k5L54j05j08J00NK01k45K12m8n72M59J46o9k33m0K42j83j78
$$ -177 312 -55 -168 -193 161 56 -52 48 53 254 9 221 173 -399 60 206 137 -96 -136 106 -77 -255
7423b55j26J75K50j12j49K30q6k77L49o3J86j11q1L90j1n03K37L28l14nQ3j78
$$ -255 -381 -206 44 -68 -217 13 -73 -350 -1 -64 122 11 -70 320 309 -194 43 371 57 52 135 -43
7445d3N9l2J20j1o6o3j7L39m70M95n48L18k62k4K10o4m0K38j51P6l10L03n4o6
$$ -43 16 -16 104 93 27 -36 -53 286 -184 311 -237 81 -181 -205 5 -59 -99 139 -12 64 -246 57 3 -63
7469f3J0K09Lk52Q6L48l76M82l73j89M54k61J12p2mn3J07m7j30j19p4j43L20j8
$$ -63 -53 156 159 -93 -7 341 -35 447 74 -115 339 78 190 118 114 61 168 121 -9 -128 -202 -345 -25 -43
7493d3j85R5J56r2J55k08O4K11l8j08R3m0j14j12L12Q1m89L42P0l60M7N4j99J48
$$ -43 -228 -133 23 -69 86 -122 -58 153 115 7 100 60 -54 -166 146 227 -262 80 150 -210 -163 -109 -308 -160
7517a60K17k02K38q5j04k8j50L10k32m5K52j61j57j9K49j70J43J13Q7j62K12m3
$$ -160 57 -145 93 8 -96 -124 -274 36 -196 -241 11 -150 -307 -326 -77 -247 -104 9 96 -66 146 103
7539A03k99J61Q2q7o2K41j65j70J22J50o1J00L4n1j01K47j75K7K13Kj02r9pp1
$$ 103 -196 -35 47 -40 -102 139 -26 -196 -74 76 15 115 149 98 -3 244 69 96 309 311 209 110 103 32
7563C2Jq1J15M0o4J10k94K83j34j79J14R0J76k33O0j91j74M59k09j84L05J97l27
$$ 32 33 -48 67 107 43 153 -141 142 8 -171 -57 33 209 -24 36 -155 -329 130 -79 -263 42 239 -88
7586h8J56K52o8p0n9J40l38J30l55K49j78O1J49J11l45J92j39J3Rk63M93K54k00
$$ -88 68 320 252 182 123 263 -75 55 -300 -51 -229 -168 -19 92 -253 -61 -200 -187 -178 -441 52 306 106
7609A06k0N7M6j76j07K20J28j52r1K76k12j1J53k97L69l88L9K83j59k1J04%q1
$$ 106 86 143 189 13 -94 126 254 102 11 287 75 64 217 -80 289 -99 -60 223 64 43 147 147 66
7632F6M7l03L54k58K23J7L8k20n7N52m47J30l60J58j57N79n74M15m5p9J33m94
$$ 66 113 -190 164 -94 129 146 184 -36 -93 459 12 142 -218 -60 -217 362 -212 203 158 79 212 -282
7654b82J46P0j36L47r0J03k36j43L31n26K85J9JJ34K28l43O5J39j63j80J87o8
$$ -282 -136 -66 -202 145 55 158 -78 -221 110 -416 -131 -112 -111 23 251 -92 -27 112 -51 -231 -44 -112
7676a12k1J63j25Q2m2L86oj78%k55M7K61j67ok6J27k99J83P7k17J84k00K50J42
$$ -112 -133 30 -95 -13 -55 331 325 147 147 -108 -61 200 33 27 1 128 -171 12 89 -128 56 -144 106 248
7700B48k53l8K01j34j57P2j18K75k31K3K05j26K8Q0j0l78L52j59L43L9j52J8m5
$$ 248 -5 -43 158 24 -133 -61 -179 96 -135 -112 93 -33 -5 75 65 -313 39 -120 223 262 110 128 83
7723H3j96J46K69k46j24L50J70n32J14j54N28k20j42j45J30J32n6j31N1K7k36
$$ 83 -113 33 302 56 -68 282 452 -80 34 -120 408 188 46 -99 31 163 107 -24 27 54 -182
7744a82L17j61N7M4k70j1R0R3J53J13j08J1j35J08j98NJ57n8j7n0p6J34j36r9
$$ -182 135 -26 31 75 -195 -206 -116 -23 130 243 135 146 11 119 -79 -74 83 25 8 -42 -118 16 -120 -219
7768b19K4K73j16P2J46l20M8J87l64L48k80J81LP9o8J47m18N57k47j98N84p25
$$ -219 -195 78 -38 34 180 -140 -92 95 -269 79 -201 -20 -17 62 -6 141 -277 280 33 -165 419 -306
7790c06L06j68J77N0Rj1k47K54O8j70J86nR4n9l10J84j99l0K69k18K25o1K8j31
$$ -306 0 -168 9 59 68 57 -190 64 132 -38 148 143 237 178 -132 52 -147 -177 92 -126 99 38 66 -65
7814f5Q3L5k05m3jJ73j0N2j27k8K6L14M4j74m0J36l9j29NJ97k10k02N63m41L1
$$ -65 18 53 -152 -195 -196 -23 -33 19 -108 -136 -110 204 248 74 34 170 131 2 7 204 -6 -208 355 -86 -55
7839e5L08j08o3Nm27K06L26l78J75j82K09m64N39p5J73m13J52L10m06N66k82k04
$$ -55 253 145 82 87 -340 -134 192 -186 -11 -193 16 -448 91 16 189 -224 -72 238 -168 398 116 -88
7861h8J4J27q3J86q7L94o22J99K11l1l37K48j10J0L00m14o3L16r8l76K27O0r3
$$ -88 -74 53 -30 156 69 463 -159 40 251 220 -117 131 21 31 331 -83 -146 170 72 -304 -77 -17 -110
7884a10J57p0kn3r4L85k59j62o3J81K60n14K61k2j1j04J18J11%m3j8j00J43k4
$$ -110 47 -23 -25 -78 -172 213 -46 -208 -271 -90 170 -344 -83 -105 -116 -220 -102 9 9 -34 -52 -152 -9 -33
7908c3k6j43R8J49k09QL63P9m7k12J28k14j74K50K8k85J97J8L1r1nj55R3j37J81
$$ -33 -59 -202 -104 45 -164 -156 207 286 239 27 155 -59 -233 17 45 -240 -43 -25 6 -85 -90 -245 -152 -289 -108
7933a08J49q1K00j38R6j67L8pj06M1J53pk34K96k55M31j98q2M3K02j86j15K54
$$ -108 41 -40 160 22 118 -49 -11 -18 -124 -83 70 63 -171 125 -130 301 103 21 64 266 80 -35 219
7956B19k92L9l3Q5j06J4LQJ85j44p2J04j44J3N2K0k35J87K63m2j86J79m29L70
$$ 219 -73 -34 -67 18 -88 -74 -71 -63 122 -22 -94 10 -134 -121 -69 -49 -284 -97 166 124 -62 117 -312 58
7980E8r1K94l18K94j70NK8k19K47J96k48J02k08L1O9L0J04k44k92L24J84o48M68
$$ 58 -33 261 -57 237 67 72 100 -119 128 324 76 178 -30 1 70 100 204 -40 -332 -8 176 -472 -4
8003dkj58J54M8k7l2J16k25J52j84K13%j0R2p2j37K70l36J21J79j56J74k89j10
$$ -4 -6 -164 -10 38 11 -21 95 -130 22 -162 51 51 41 133 61 -76 194 -142 -21 158 2 176 -113 -223
8027b23K20J50j59j63Q5J02p3K37o12L86k71L79k9k04K91m40M51J92l34j44K41
$$ -223 -3 147 -12 -175 -90 12 -61 176 -436 -50 -321 58 29 -175 116 -324 127 319 -15 -159 82
8048H2j06J4J46o1K31k39J09m95N05J38k17L5j22K05q0J04k24k34J52L46k51k4
$$ 82 -24 -10 136 75 306 67 176 -319 186 324 107 142 20 225 145 249 25 -209 -57 289 38 14
8070A4j03j66L55l12K0k09K97l7K09l01K34j40N1J83k15K0J12o2M7J02J26r2J37
$$ 14 -89 -255 100 -212 -192 -401 -104 -141 68 -233 1 -139 -88 95 -120 -100 12 -50 -3 99 225 133 270
8093B70m18K91j57J9r0M16j79k27k02K26kj24Q1L8k10j30N43l09K65o6mj99L32
$$ 270 -148 143 -14 5 -85 331 152 -75 -277 -51 -53 -177 -96 -58 -268 -398 145 -164 101 35 31 -168 164
8116A64j17lq0K29l3j58l0O1J90l29K75n1k04J69j13M3O5j99K52k00r9L4q1K1
$$ 164 47 44 -36 193 160 2 -28 33 223 -106 169 118 -86 83 -30 13 78 -121 131 -69 -168 -134 -215 -194
8140a94N9K12j64r7K61N3j10j33j50N4J50q1J65j26M52n3j98l9k03L64j21r1q3
$$ -194 -135 77 -87 -184 77 130 20 -113 -263 -209 -59 -140 25 -101 351 298 100 61 -142 222 101 10 -73
8163g3N13j33l10j93L19J55o2k37J48m59N05o4l12k60L10l70N30o6L7K7j23L22
$$ -73 440 307 -3 -196 123 278 216 -21 127 -332 173 109 -203 -463 -153 -523 7 -59 -22 5 -118 204
8185B04k62P2k08K14J5r9
$$ 204 -58 14 -194 20 35 -64
8191f4
$$ Imaginary data points
##PAGE= N=2
##DATA TABLE= (X++(I..I)), XYDATA
0@%%%%%%%%%%%Pj5J6j6J6j6K4l2L2m0M8n3O1p1Q2r1J04j19J34j50J69j90K12k37
$$ 0 0 0 0 0 0 0 0 0 0 0 0 7 -8 8 -8 8 -8 16 -16 16 -24 24 -29 32 -39 43 -48 56 -63 71 -79 90 -100 112 -125
35a25K64k94L27l63M02m45M92n46O06o69P41q24R19j028J153j301J478j694J968
$$ -125 139 -155 172 -191 211 -234 258 -288 318 -351 390 -434 485 -543 610 -691 787 -907 1061
54A061k324K813l523M651o732J1801m8106n4062R4212K3925o7775j7201O1702
$$ 1061 -1263 1550 -1973 2678 -4054 7747 -40359 -94421 -209 23716 -44059 -61260 442
67D42o089m9850J5747M2781l1295k8566M6548L4918m1098k0690L9802J5820k9245
$$ 442 -5647 -55497 -39750 3031 -28264 -56830 -10282 24636 -16462 -37152 2650 18470 -10775
80a0775L413L0008m789k1286J4944J8668j3784j0718J3127J603j4860Q92Q457
$$ -10775 -7362 22646 17857 -3429 11515 30183 16399 5681 18808 20411 5551 6443 14900
93A4900p417n344P226k640j2007J531J435j3649q69K1179K551k0955M11J7610
$$ 14900 7483 2139 9365 6725 -5282 -3751 -2316 -15965 -16834 4345 6896 -14059 -13648 3962
107C962r490j6436K0079J9800j9845q937L2309Q307l7129n582M0046N845l4138
$$ 3962 -5528 -21964 -1885 17915 -1930 -10867 21442 29749 -7380 -12962 27084 32929 -1209
120a209L660L2046j0072l1160J0821K1440j9410j7835J9042M974k7605k905K6221
$$ -1209 2451 34497 24425 -6735 4086 25526 6116 -11719 7323 12297 -15308 -18213 8008
133H008p930l3905N948K9028j1443k9513J0540K5966p348j6386R724J0298j2129
$$ 8008 78 -33827 -27879 1149 -10294 -39807 -29267 -3301 -10649 -27035 -17311 -7013 -19142
146a9142n253J8685J4304p579o285R650P884l777o026L995R631N045j111o51j034
$$ -19142 -24395 -5710 8594 1015 -5270 4380 12264 8487 2461 6456 16087 21132 20021 19370 18336
161A8336p572n588P183Q752o985j3690K730J0223n711j4818q34P082j665m844
$$ 18336 10764 5176 12359 21111 14126 436 3166 13389 7678 -7140 -7974 -892 -2557 -7401
175g401J253L97m857L90P470J591p609k579N420M368J218J947M027J140k168j005
$$ -7401 -6148 -5751 -10608 -10218 -2748 -1157 -8766 -11345 -5925 -1557 -339 1608 5635 6775 4607 3602
191C602J467N93j675J947R201K750j0808q870N049L622r982l654J2366L206j5414
$$ 3602 5069 5662 3987 5934 15135 17885 7077 -1793 3256 6878 -3104 -6758 5608 8814 -6600
206f600n972R885k037j4897L686J5965n173j3432Q207J2301j1827j0120J6017
$$ -6600 -12572 -2687 -4724 -19621 -15935 30 -5143 -18575 -10368 1933 -9894 -20014 -3997
219c997J0964j4448m281J9723M860j6475J608J9245l074j6845O147J5190o823
$$ -3997 6967 -7481 -11762 7961 12821 -3654 -2046 17199 14125 -2720 3427 18617 11794
232A1794r481J1478N531j4927n778J1117j885j4060L988J3468n808j3387K424
$$ 11794 2313 13791 19322 4395 -1383 9734 7849 -6211 -2223 11245 5437 -7950 -5526
245e526K817q563k449J0208O35p969K933O179o088n821P132L894l526M368P640
$$ -5526 -2709 -11272 -13721 -3513 -2878 -10847 -7914 -1735 -7823 -13644 -6512 -2618 -6144 -1776 5864
260E864n665o055R457O378j0446j877J2897K58j2400M873J2715q617j3401J1267
$$ 5864 199 -5856 3601 9979 -467 -2344 10553 10811 -1589 3284 15999 7382 -6019 5248
274E248R250j6740r682J7991P394j8775m276J6333l547j9561N077J7456o911j3273
$$ 5248 14498 -2242 -11924 6067 13461 -5314 -9590 6743 3196 -16365 -11288 6168 -743 -14016
288a4016J2639J1113j6405r570J5548N978j3462K340J7256l341j6797O051J4254
$$ -14016 -1377 9736 -6669 -16239 -691 5287 -8175 -5835 11421 8080 -8717 -2666 11588
301A1588r113j1925J2207J1411j1120p397R472K685j1519j375R550j327r203J953
$$ 11588 2475 -9450 2757 14168 3048 -4349 5123 7808 -3711 -5086 4464 3137 -6066 -4113
315d113O367k241l941R54n93k797K067K231k731N71O066qo115J783M501m514k998
$$ -4113 2254 13 -3928 -2974 -3567 -6364 -4297 -2066 -4797 -4226 1840 1832 -4283 -2500 2001 -2513 -5511
332e511R493O341p017m312O793M95q268J582Q510k896n804O781M832j0993p074
$$ -5511 3982 10323 3306 -1006 5787 6282 -1986 -404 8106 5210 -594 6187 11019 26 -7048
347g048R881L576j0861o27J1968j753j4319L140J3160o577j4136P185J4017p742
$$ -7048 2833 6409 -4452 -5079 6889 5136 -9183 -6043 7117 540 -13596 -6411 7606 -136
361a36j1495J0271R952j1505q750J1919P674j1858m559J2566M653r716j889O657
$$ -136 -11631 -1360 8592 -2913 -11663 256 7930 -3928 -8487 4079 8732 -984 -2873 3784
375C784k664o906M983Q903n621p368N914N865q106o314N902L141l973J396N626
$$ 3784 1120 -5786 -803 8100 2479 -4889 1025 6890 -1216 -7530 -1628 1513 -2460 -1064 4562
390D562l557q080L313P141k606o547L685O414j856l903J507J781j350j056J650
$$ 4562 1005 -7075 -3762 3379 773 -5774 -2089 4325 2469 -1434 73 1854 504 -552 1098
405A098K88J021J482j658k818K996K608m633m430M634L522l613j526L873j746
$$ 1098 1386 2407 3889 2231 -587 2409 5017 384 -4046 588 4110 497 -1029 2844 1098
420A098p236K481P490l994p785N298Q851m624p575L288L154m784P08P924j680
$$ 1098 -6138 -3657 3833 -161 -7946 -2648 6203 1579 -5996 -2708 446 -4338 -3630 4294 2614
435B614p456M132Q233p004p876P703P239q689l918J0944K965j2300k843J1065
$$ 2614 -4842 -710 7523 519 -7357 346 7585 -1104 -5022 5922 8887 -3413 -6256 4809
449D809J17j0252K022Q763m418o612O437M924r290n688Q461N209o339k162N399
$$ 4809 4926 -5326 -3304 5459 1041 -5571 866 5790 -3500 -9188 -727 4482 -1857 -4019 1380
464A380n6l466K713J434o075k92Q314K007o832l88N704j454n690K206M300k795
$$ 1380 1324 -2142 571 2005 -4070 -4362 3952 5959 -873 -1261 4443 2989 -2701 -495 3805 1010
480A010k060L562J082m042k49K283l473k779M675L678m593l848M350J456m004
$$ 1010 -1050 2512 3594 -448 -697 1586 -1887 -4666 9 3687 -906 -4754 -404 1052 -2952
495b952m28K075j848n09N614K748o971m130P478M159o019l412N540L836l111o56
$$ -2952 -3380 -1305 -3153 -3662 1952 4700 -2271 -6401 1077 5236 -783 -4195 1345 5181 2070 1414
511A414J871j396k744K111K977k832k362M099J656m810k998L393K086l942k246
$$ 1414 3285 1889 -855 1256 4233 1401 -961 3138 4794 -16 -3014 379 2465 -1477 -3723
526c723L583J737k507j611J244j701j369L087K692m259l280O044N014n202o275
$$ -3723 -140 1597 -910 -2521 -1277 -2978 -4347 -1260 1432 -2827 -6107 -63 4951 -251 -6526
541f526M002M972k051j775L221K22l072K025L775m229m878N246N569m796m777
$$ -6526 -2524 2448 397 -1378 1843 2065 -1007 1018 4793 564 -4314 932 6501 1705 -3072
556c072M838K331n513j483M457o76m146L010L648n316k586N665J285p423o16Q103
$$ -3072 1766 4097 -1416 -2899 1558 882 -3264 -254 3394 -1922 -4508 1157 2442 -4981 -5597 2506
572B506M50o179J962M933l844l060N422J312p043J745R230j648r480K857P658
$$ 2506 2956 -3223 -1261 3672 -172 -3232 2190 3502 -3541 -1796 7434 5786 -3694 -837 6821
587F821n532n860P645L333q704p79R697k631j1067L823R453o818q046R224O501
$$ 6821 1289 -4571 3074 6407 -2297 -3076 6621 3990 -7077 -3254 6199 -619 -8665 559 7060
602G060j1228m413J1851O65j2545K463J2028m532r778Q388P828j0465o182J2490
$$ 7060 -4168 -8581 3270 3935 -8610 -6147 5881 1349 -8429 -41 7787 -2678 -8860 3630
616C630L952j2061l41J1596j909r932N430P334q667n478J0086M147j1356l68J0434
$$ 3630 7582 -4479 -4820 6776 4867 -5065 365 7699 -968 -6446 3640 7787 -3569 -3937 6497
631F497k465j0128M401P222p264n060R397K909j0247m66R214k969q159N348P341
$$ 6497 4032 -6096 -1695 5527 -1737 -6797 2600 5509 -4738 -5204 4010 1041 -7118 -1770 5571
646E571o764m068Q694J256j0018J265J0435l858r145P032Q320r326n801J1162
$$ 5571 -1193 -5261 3433 4689 -5329 -4064 6371 2513 -6632 400 8720 -606 -6407 4755
660D755K359j1626k46J1677l059j0538N389R577p964q073Q945N185j0625j930
$$ 4755 7114 -4512 -4758 6919 3860 -6678 -1289 8288 324 -7749 1196 6381 -4244 -6174
674f174J0998n46j0531K784R268n790p587P555O275q460l283R006J110r281J323
$$ -6174 4824 4278 -6253 -3469 5799 9 -7578 -23 6252 -2208 -5491 3515 4625 -4656 -3333
689c333Q301k606o786M374M971m683l266N192J110n967P28M689j614l677K652
$$ -3333 4968 2362 -4424 -50 4921 238 -3028 2164 3274 -2693 -1965 2724 1110 -2567 85
704H5K125l630o43L847j849l645K717L754l761k800L759J844m450k26M298o54
$$ 85 2210 -1420 -2063 1784 -65 -3710 -993 2761 -1000 -3800 -41 1803 -2647 -2873 1425 771
720G71l333K844L265m221j911M391J195m393j96M701k72m098J700K754k680k622
$$ 771 -2562 282 3547 -674 -2585 1806 3001 -1392 -1588 3113 2841 -1257 443 3197 517 -2105
736b105L381J840l134j358L140L82l407n51K158M99j704N1J050k46r55R2J196
$$ -2105 1276 3116 -18 -1376 1764 2146 -1261 -1812 346 845 -859 -808 242 -4 -959 -867 329
753C29j52j431JJ480N52j613r09K418Q14k584q26L181K61l090Q59L135j511l105
$$ 329 177 -1254 -1253 227 779 -834 -1743 675 1489 -1095 -1921 1260 1521 -1569 -710 2425 914 -2191
771b191J765K701l090k127M526J351n530l06N320m51n538J412M800k008m140L613
$$ -2191 -426 2275 -815 -2942 1584 2935 -2595 -2901 2419 1968 -3570 -2158 2642 634 -3506 107
787A07K351l891j262M921J36m929R34N317k259l847K787L118l777j271M126l31
$$ 107 2458 -1433 -2695 2226 2362 -2567 -1633 3684 1425 -2422 365 3483 -294 -1565 2561 2230
803B230m134K418L365l797k951M687J947n654p78N779j129n679L319L807m751
$$ 2230 -1904 514 3879 82 -2869 1818 3765 -1889 -2667 3112 1983 -3696 -377 3430 -1321
818a321l203O255J702p793j83Q479j345q027L051P085m519n761O221L893p191
$$ -1321 -4524 1731 3433 -4360 -4543 3936 2591 -5436 -2385 4700 181 -5580 641 4534 -2657
833b657j885Q369l68q993K993R147m856q107O179O300p020m118P462J542p838
$$ -2657 -4542 3827 3459 -5534 -2541 6606 1750 -6357 -178 6122 -898 -5016 2446 3988 -3850
848c850J707P233m009o950N975O191p502m535P590L073p706n92P140j628n870
$$ -3850 -2143 5090 1081 -5869 106 6297 -1205 -5740 1850 4923 -2783 -3375 3765 2137 -3733
863c733M126M400n950k433O746J354p752J47P526j548o541K930N125m897k678
$$ -3733 393 4793 -1157 -3590 3156 4510 -3242 -3095 4431 2883 -3658 -728 4397 -500 -3178
878c178N396N10o569J402P493l387p395L934O478n350m942O100K784o099l57O175
$$ -3178 2218 2728 -3841 -2439 5054 1667 -5728 -1794 4684 -666 -5608 492 3276 -2823 -3180 2995
894B995j920o693M246O627n628n550O528M655o557l149O693J296o377Q62N906
$$ 2995 1075 -5618 -1372 5255 -373 -5923 605 5260 -1297 -4446 2247 3543 -2834 -1972 3934
909C934k653m192M188L691o050k958O495K036o450j072N940L09n513O55L873k591
$$ 3934 1281 -2911 1277 4968 -1082 -4040 2455 4491 -1959 -3031 2909 3218 -2295 -1640 2233 -358
925c58j945L052J691m764k30M295J14m131M67L332l76k746J168J625j542j80K287
$$ -358 -2303 749 2440 -2324 -2554 1741 1855 -2276 -1809 1523 1147 -1599 -431 1194 -348 -528 1759
942A759j511k110J606K653k058k514K158K369j968k422J595P66j033L85J083j856
$$ 1759 248 -1862 -256 2397 339 -2175 -17 2352 384 -2038 -443 323 -710 -325 758 -1098
958a098j306K514J904l320k052L216K112k454j853K551N97k010Q27K075j571k438
$$ -1098 -2404 110 2014 -1306 -3358 -142 1970 -484 -2337 214 811 -1199 -372 1703 132 -2306
974b306K919K906k795l083L272K690l586k375L948J905l585r81K894j11l035P85
$$ -2306 613 3519 724 -2359 913 3603 17 -2358 1590 3495 -90 -1071 1823 1712 -1323 -538
990e38K443k127k365L172K061m188j990L479K076l836j489L612N43k862P78L106
$$ -538 1905 -222 -2587 585 2646 -1542 -3532 -53 2023 -1813 -3302 310 853 -2009 -1231 1875
1006A875k671k605L222K617k899k291L687J993l364r34K597N0k449J217J798q08
$$ 1875 -796 -3401 -179 2438 -461 -2752 935 2928 -436 -1370 1227 1277 -1172 45 1843 1035
1022A035j941J878K81k449RK319o71k079J073K339k185j920K091L73k164L04L130
$$ 1035 -906 972 1253 -1196 -1187 1132 461 -1618 -545 1794 -391 -2311 -220 153 -2011 -1707 1423
1039A423j091k938J892K724k208j963K099J781k353L6K579o23k756J891K281k508
$$ 1423 332 -2606 -714 2010 -198 -2161 -62 1719 -634 -598 1981 1358 -1398 493 2774 266
1055B66k171L487J734l982q66L825j06m546M31M596j437l965J694L554k818l090
$$ 266 -1905 1582 3316 -666 -1532 2293 2187 -2359 -1928 2668 1231 -2734 -1040 2514 -304 -3394
1071c394K529K346k999j285L415Q36l124O8K813r59j983J827K168k021j176K794
$$ -3394 -865 1481 -1518 -2803 612 1448 -1676 -1608 1205 246 -1737 90 2258 237 -939 1855
1087A855K36k535k62K521J86k568L45K701o34k559N72J572j078j942J123J100
$$ 1855 2091 -444 -706 1815 2001 -567 -222 2479 1845 -714 -142 1430 352 -1590 -467 633
1103F33o96q95P18M5j253r7M40K3J84J52O2n35M06R08p24j186R86K090q73j054
$$ 633 -63 -958 -240 -195 -1448 -1545 -1105 -1082 -898 -746 -684 -1219 -813 95 -629 -1815 -829 1261 388 -666
1123f66J577J075j971p44J854O79j627q2K238n48k765J028J940j522k246K119
$$ -666 911 1986 15 -729 1125 1804 177 95 2333 1785 -980 48 1988 466 -1780 339
1139C39J135k402j11K492n95l521Q00L691j402l828K503L808k749l017L249K123
$$ 339 1474 -928 -1039 1453 858 -2663 -1863 1828 426 -3402 -899 2909 160 -2857 392 2515
1155B515m038r79M906J194n011M53M347n50m556J414L200k665j644L635O86m576
$$ 2515 -1523 -2502 2404 3598 -1413 -960 3387 2837 -1719 -305 2895 230 -1414 2221 2907 -1669
1171a669n28L971p22m122J913L114k445k657K883J711m629r41M795L5m022J227
$$ -1669 -2197 1774 1052 -3070 -1157 1957 -488 -3145 -262 1449 -3180 -4121 674 709 -3313 -2086
1187b086L287j452k366K635J703l942L6M715o23l431J897L061l223j892M003P57
$$ -2086 1201 -251 -2617 18 1721 -2221 -2185 2530 1907 -1524 373 3434 211 -1681 2322 3079
1203C079m673K46N861j686n444K111M381l940l410M623K599n826j405O095m95
$$ 3079 -1594 -1348 4513 2827 -2617 -506 3875 -65 -3475 1148 3747 -2079 -3484 2611 2116
1218B116o016J660N598k904m889M311M385n433k756N781J012n448J004N438k191
$$ 2116 -3900 -2240 3358 454 -4435 -124 4261 -1172 -3928 1853 2865 -2583 -1579 3859 1668
1233A668m923L835M377m877l974N076K392m706q33M027r56l643K285J940l991
$$ 1668 -3255 580 4957 80 -3894 1182 3574 -1132 -1965 2062 1106 -2537 -252 1688 -2303
1248b303j947M409J605m042m07L596j335l257K475J779k577l67L723m10l405J965
$$ -2303 -4250 159 1764 -2278 -2685 911 -424 -3681 -1206 573 -2004 -2371 1352 942 -2463 -498
1264d98L496l458l094M714L382m302k310L863Q93l575J028L113l122l071M948
$$ -498 2998 -460 -3554 1160 4542 240 -2070 1793 2686 -889 139 3252 130 -2941 2007
1279B007L084n152l730M046K986l454j892K266l02j062K139J501l771k115L598
$$ 2007 5091 -61 -3791 255 3241 -213 -2105 161 -141 -1203 936 2437 -1334 -3449 149
1294A49K190l178j477L046J208j731n70R25k95m55J093N90j101Q6J197k80j906
$$ 149 2339 -839 -2316 730 1938 207 -363 562 267 -188 905 1495 394 480 1677 1397 -509
1311e09l08J008Q75k35j544j034J744J777j863l187N70L674l65k438j26J466k33
$$ -509 -817 191 1066 831 -713 -1747 -3 1774 -89 -3276 -2706 968 603 -1835 -1961 -495 -728
1328g28P2M96j297j172K054K623j409j511P95O56o52k51J335o94o22J577R90k307
$$ -728 -656 -160 -1457 -2629 -575 2048 639 -872 -77 579 -73 -324 1011 317 -305 1272 2262 -45
1346d5p65J733K96k367O99J687k73j567O26L16j207P33J173j827j614L610J855
$$ -45 -810 923 1219 -1148 -449 1238 965 -602 24 340 -867 -134 1039 -788 -2402 1208 3063
1363C063l563k446L854P38l261J013L816k334l294L769L209l880l993M130L074
$$ 3063 -500 -2946 908 1646 -1615 -602 3214 880 -2414 1355 4564 684 -3309 821 3895
1378C895m079j182L555l87m075J645L298l575k779L465K282m272j93M012j936
$$ 3895 -184 -1366 2189 1802 -2273 -628 2670 -905 -3684 -219 2063 -2209 -2402 1610 -326
1393c26m327K728M196l555l576M805L080l923k167M133k48l055J606L895k394
$$ -326 -4653 -1925 2271 -1284 -4860 -55 3025 -898 -3065 1068 820 -2235 -629 3266 872
1408H72k373L291J445l987M00L622k385l105K944L715m179k826M353O34n732O50
$$ 872 -1501 1790 3235 -752 -352 3270 885 -2220 724 4439 260 -2566 1787 2421 -3311 -2661
1424b661N901k142n769K737O111m047n094L858L392l829j168N224j034n055L100
$$ -2661 3240 1098 -4671 -1934 4177 130 -4964 -1106 2286 -1543 -2711 2513 1479 -3576 -476
1439d76N142m057m514M699M324m982j686N015J25n503J115M930k406n163L411
$$ -476 4666 609 -3905 794 5118 136 -1550 3465 3590 -1913 -798 4132 1726 -3437 -26
1454b6M433m042m004L477K023m255j386L937j62k373J125J774k629j142L463r3
$$ -26 4407 365 -3639 -162 1861 -2394 -3780 157 -5 -2378 -1253 521 -2108 -3250 213 120
1470A20l355J541M004j306l094J962K252k712r27M224j80l180R64L784j650l498
$$ 120 -3235 -1694 2310 1004 -2090 -128 2124 -588 -1515 2709 2529 -651 313 4097 2447 -1051
1486a051J941K136k401j192K478j55k947M43K669k620k768K640K088l462j217
$$ -1051 890 3026 625 -567 1911 1756 -1191 -748 1921 -699 -3467 -827 1261 -2201 -3418
1501c418L519O94l877j02L610k54k699J630K678j161k010K023J614k128p36K208
$$ -3418 101 795 -3082 -3184 426 172 -2527 -897 1781 620 -1390 633 2247 119 -617 1591
1517A591Q87j428j17J099j036n05O94q6j556J69J424J73j914k70L36m01o10K88
$$ 1591 2478 1050 933 2032 996 491 1185 1099 -457 -288 1136 1309 -605 -875 -539 -940 -1550 -1262
1535a262r5k28K05M58k68k4L5K34j18M97P99l20J33J154K63j746P93R84N4m25
$$ -1262 -1357 -1585 -1380 -922 -1190 -1214 -1179 -945 -1063 -566 233 -87 46 1200 1463 -283 510 1494 1548 1123
1555A123M39J005q84j174M32J83j100l42R44j50j160o4j91l23n60J43l31K70K9
$$ 1123 1562 2567 1683 509 941 1124 24 -318 626 476 -684 -748 -939 -1262 -1822 -1679 -2010 -1740 -1711
1574a711l67K09N18Q0p62qJ708L46q59L52J380K11m88O97P70j200l43J877R17
$$ -1711 -2078 -1869 -1351 -1271 -2033 -2041 -333 13 -846 -494 886 1097 609 1306 2076 876 533 2410 3327
1593C327j694p88J679l24j718k54K113j244j971J943J119k867k184K078J103k223
$$ 3327 1633 845 2524 2200 482 228 2341 1097 -874 1069 2188 -679 -2863 -785 318 -1905
1609a905m55K379o25j811M60J876j309j266K081J541j661n42K117P1j576M87K025
$$ -1905 -2360 19 -606 -2417 -1957 -81 -1390 -2656 -575 966 -695 -1237 880 951 -625 -138 1887
1626A887j007p60P77R12j289j07J562p69k626R27K128j435j839J229P16j490l98
$$ 1887 880 120 897 1809 520 413 1975 1206 -1420 -493 1635 200 -1639 -410 306 -1184 -1582
1643a582R16n53j748J402K408j407j734R51J568j626J85J508j56o19J684J258
$$ -1582 -666 -1219 -2967 -1565 843 -564 -2298 -1347 221 -1405 -1220 288 132 -487 1197 2455
1659B455j808j257J825K084k194n50K232K60k367k80K270m94k317M02J089j004
$$ 2455 647 -610 1215 3299 1105 555 2787 3047 680 400 2670 2176 -141 261 1350 346
1675C46q40P30K99j742m97J174oj872J03J328l03j40P31m84j722P52K425r5j516
$$ 346 -494 236 535 -1207 -1704 -530 -536 -2408 -2305 -977 -1280 -1420 -689 -1173 -2895 -2143 282 187 -1329
1694a329M58K091k11j770Q97J069m90m77J108L39q96R8N0m53o71J552j13k215
$$ -1329 -871 1220 1009 -761 136 1205 715 238 1346 1685 789 887 937 484 -187 1365 1252 -963
1712i63j70J658L24j981l82J319o76q14J206P95j996j099L226J501k316k475K472
$$ -963 -1133 525 849 -1132 -1514 -195 -871 -1685 -479 316 -1680 -2779 447 1948 -368 -2843 -371
1729c71K368j172p40J527K58j379M60J110q90j015J654R33j919r14J658L5k287
$$ -371 1997 825 85 1612 1870 491 951 2061 1171 156 1810 2743 824 -90 1568 1603 -684
1746f84j90K315n42k228N7J029r77j042J429J53k336j7K967K56k898l65K381R85
$$ -684 -874 1441 899 -1329 -1272 -243 -1220 -2262 -833 -680 -3016 -3033 -66 190 -2708 -3073 -692 293
1764B93q76p63J83K55J178J572j252j702J113K630j403j674J516J379j022q63
$$ 293 -583 -1346 -1163 -908 270 1842 590 -1112 1 2631 1228 -446 1070 2449 1427 564
1780E64J161n16j741J101J445j637j145J575J184k188j992J793J236j485n4N66
$$ 564 1725 1209 -532 569 2014 377 -768 807 1991 -197 -2189 -396 840 -645 -699 -133
1796a33j023l62K298K94l166j2L474L21k980l67K822o5j652J006R73k001j038
$$ -133 -1156 -1518 780 1074 -2092 -2104 1370 1691 -1289 -1656 1166 1101 -551 455 1428 -573 -1611
1813a611K816J260k636p07K105o7k020M08J291j180q52J973J12k285j80J510l82
$$ -1611 1205 2465 -171 -878 1227 1160 -860 -452 839 -341 -1193 780 892 -1393 -1573 -63 -445
1830d45j134J456J085j820j406J926J297j787l12J577L14q27M43J249j558o16
$$ -445 -1579 -123 962 -858 -2264 -338 959 -828 -1140 437 751 -76 367 1616 58 -558
1846e58J650R84j956j25J193j09n24K27M35j438k61J671kk208Q1J566j67j217
$$ -558 1092 2076 120 -5 1188 1079 555 782 1217 -221 -482 1189 1187 -1021 -940 626 459 -758
1864g58L73L50j240l2J099M06j275J37J146r30m18O34P93q80M82Q02m80j310R32
$$ -758 -385 -35 -1275 -1307 -208 198 -1077 -940 206 -724 -1142 -508 285 -595 -113 689 209 -1101 -169
1883a69R61k79r50J150L83o47m77N36l42l31O41K35r27m40J014k53l58k88N93
$$ -169 792 513 -437 713 1096 449 -28 508 166 -165 476 711 -216 -656 358 105 -253 -541 52
1902E2o59M4Q12p44o71O88J257o89j137P98L12l96J45J155k35j345P90J099j032
$$ 52 -607 -563 249 -495 -1166 -478 779 90 -1047 -249 63 -333 -188 967 732 -613 177 1276 244
1921B44r30J140Q02j480M16J009r71j045N65J457j186j075J586K50k068M60J676
$$ 244 -686 454 1256 -224 192 1201 230 -815 -250 1207 21 -1054 532 782 -1286 -826 850
1938H50q80j914J651J688j906j232K075O70j902n2K159j080j972J830J819j981
$$ 850 -30 -1944 -293 1395 -511 -1743 332 1002 -900 -952 1207 127 -1845 -15 1804 -177
1954a77j203K040J019k286l43K356p21j956K092J143k245j351K162Q04k339j60
$$ -177 -1380 660 1679 -607 -950 1406 685 -1271 821 1964 -281 -1632 530 1334 -1005 -1165
1970a165K424p13k201J155J361k238p65K891K18k560P0K413p44j745J469J356
$$ -1165 1259 546 -1655 -500 861 -1377 -2142 749 967 -1593 -1523 890 146 -1599 -130 1226
1986A226k129q09L151J39l122P61L105j514k337K170J503k411j176L111P60l400
$$ 1226 -903 -1712 1439 1578 -1544 -783 2322 808 -1529 641 2144 -267 -1443 1668 2428 -972
2002i72q6K983j106k198J193K139k111j549K978J08k880L48K964r02k522J809
$$ -972 -1058 1925 819 -1379 -186 1953 -158 -1707 1271 1379 -1501 -1153 1811 909 -1613 196
2018A96J484k397q40K522Q81l293K59K890o81k711J374K018k040r79K052M17k542
$$ 196 1680 -717 -1557 965 1846 -1447 -1188 1702 1021 -1690 -316 1702 -338 -1317 735 1152 -1390
2035a390M85K025j127k045J974J258k287r66K536K25k717M69K448j078k359K300
$$ -1390 -905 1120 -7 -2052 -78 1180 -1107 -2073 463 688 -2029 -1560 888 -190 -2549 -249
2051b49J436k308j025K574P95k475R3K322p82j682J733J896k345o93K035M56k041
$$ -249 1187 -1121 -2146 428 1223 -1252 -1159 1163 381 -1301 432 2328 -17 -710 1325 1781 -260
2068b60K39K279j166j664J586J092j702j264J960M14j578l97J646r40q78R24Q06
$$ -260 -21 2258 1092 -572 1014 2106 404 -860 1100 1514 -64 -461 1185 245 -633 291 1097
2085A097j998q3J615l28j469K42J304p36q76J131K66j453O72J399r18j562J193
$$ 1097 -901 -984 631 303 -1166 -924 380 -356 -1232 -101 165 -1288 -616 783 -135 -1697 -504
2102e04J619j340r26J107R17j270m88R28k38r72J185N30j451m06J496L07j810
$$ -504 1115 -225 -1151 -44 873 -397 -885 43 -195 -1167 18 548 -903 -1309 187 494 -1316
2119a316K96J258j65p19K61N62r18J90J493m57j486O97J552k09j097L28Q04j65
$$ -1316 -1020 238 73 -646 -385 177 -741 -551 942 485 -1001 -304 1248 1039 -58 270 1074 909
2137I09l62N00m03o35J533K48j234l26R75K95j240k79P77m38k90J76j7j320N17
$$ 909 547 1047 644 9 1542 1790 556 230 1205 1500 260 -19 758 320 30 206 189 -1131 -614
2156f14J275r78j592Q27J605n41j644P57Q66n86l31Q30k35j584J546J583j488
$$ -614 661 -317 -1909 -1082 523 -18 -1662 -905 -39 -625 -956 -126 -361 -1945 -399 1184 -304
2173c04j422J565J356j200r22J570J98j043R3J016r74o64J224N63j785k50J831
$$ -304 -1726 -161 1195 -5 -927 643 841 -202 -109 907 -67 -731 493 1056 -729 -979 852
2190H52l12j419K73J040m88o67O05K89j336P67J535j361j325J061J968j042j218
$$ 852 540 -879 -606 434 -54 -721 -116 173 -1163 -396 1139 -222 -1547 -486 1482 440 -778
2207g78P56J245r71j3J114q09r95J368Q34j720r10J938M70k135p8J306pj761Q97
$$ -778 -22 1223 252 239 1353 544 -451 917 1751 31 -879 1059 1529 -606 -684 622 615 -1146 -249
2226b49O74j215n31J732l6k131m6K027R1k174M38J690j84j210J024O65j580N16
$$ -249 425 -790 -1321 411 375 -1756 -1802 225 316 -1858 -1420 270 86 -1124 -100 565 -1015 -499
2244d99J734m24j430M62J898o44j695J319P78j299p0J062k43j342O33N99p94r94
$$ -499 1235 811 -619 -157 1741 1097 -598 721 1499 200 130 1192 949 -393 240 839 45 -949
2262i49J219L50j463k82J097K1r91J53R40o80l49L89P39j315n3J253L6r85L57
$$ -949 270 620 -843 -1125 -28 -7 -998 -845 95 -585 -934 -545 194 -1121 -1174 79 115 -870 -513
2281e13J341n83l94L29P51r66K97Q11L64j383R7J024m33j050Q49M19p76p82R39
$$ -513 828 245 -149 180 931 -35 262 1073 1437 54 151 1175 742 -308 541 960 184 -598 341
2300C41q6o67n36J271m36n17J9O12o79k13Q94M13p79k93M16O87m56Q7N26m5k83
$$ 341 255 -412 -948 323 -113 -630 -611 1 -678 -891 3 416 -363 -656 -240 447 -9 78 604 559 276
2321B76j38M55J34o93O72k66k00k1K72r7n83R5L38k84o47J75L55l99j08L38k15
$$ 276 138 593 727 34 706 440 240 219 491 394 -189 -94 244 -40 -687 -512 -157 -556 -664 -326 -541
2342e41k34o1L31P3j99L13K9r5J6P9M34j44J08K23L44p81M91N70Jo81K91K13m62
$$ -541 -775 -836 -505 -432 -631 -318 -289 -384 -368 -289 145 1 109 332 676 -105 386 956 957 276 567 780 318
2365C18k85J079p5q54k94P43l55o80K94L64k79o52N91N24p87m38O10N6k94j72
$$ 318 33 1112 1037 183 -111 632 277 -403 -109 255 -24 -676 -85 439 -348 -786 -176 -120 -414 -586
2385e86P59k68q07M40N54l07n92O82M65o91P4N01O7o55L93K48k80n14P28J41o69
$$ -586 173 -95 -902 -462 92 -215 -807 -125 340 -351 -277 224 291 -364 29 277 -3 -517 211 352 -317
2406c17r6J66qk11L78o8q4l60R81l40m10M53L22m56m19Q35o9k84m39R31M8l20
$$ -317 -413 -247 -255 -466 -88 -156 -240 -600 381 41 -369 84 406 -50 -469 366 297 13 -426 505 553 233
2428B33l7O66k68m55N21j11m26k12N31k49m93L12J67l81L5KK1p82K57N38k21j70
$$ 233 196 862 594 139 660 549 123 -89 442 193 -300 12 179 -202 -167 -165 -144 -926 -669 -131 -352 -522
2450e22j19L22P7m43L33J80k01k51L60J26q6K96k15P6N00r2l3l96j00P65n75L1
$$ -522 -641 -319 -242 -685 -352 -172 -373 -624 -264 -138 -224 72 -143 -67 433 341 308 -88 -188 577 2 33
2472C3N10n14r3J28J53J7l79J78K93l69j98O48q2p93N16N45o23m59J077K61j230
$$ 33 543 29 -64 64 217 234 -145 33 326 -43 -241 407 325 -468 48 593 -30 -489 588 849 -381
2493c81L43Q39j07r79M32P33k07j148N37L30o38M7P92p11r59P07O21l31j297Q22
$$ -381 -38 801 694 -285 147 880 673 -475 62 392 -246 -199 593 -118 -1077 -370 251 -80 -1377 -555
2513e55J94q99N13L97m86k77J108L67j682K18J095K37r70O83P94l94o13Q50J32
$$ -555 -361 -1260 -747 -350 -836 -1113 -5 362 -1320 -1102 -7 230 -740 -57 737 343 -270 580 712
2532G12p78N00P92m03j376J003J464j462j398J186P75o06m93M74j87j279J142
$$ 712 -66 434 1226 823 -553 450 1914 452 -946 240 1015 409 -84 390 203 -1076 66
2549F6J151j261j715J471J643j709q33J157P73j265K76P91p46p57J980K60j520
$$ 66 1217 -44 -1759 -288 1355 -354 -1187 -30 743 -522 -246 545 -201 -958 1022 1282 -238
2566b38m61K084l20j551J27J123m88q26O64L13j270J64J476p43j909J111J350
$$ -238 -699 1385 1065 -486 -359 764 276 -550 114 427 -843 -679 797 54 -1855 -744 606
2583F06j399j202J018P95p17o33J537o93j037J820J156j837r27K031R99j573J58
$$ 606 -793 -1995 -977 -182 -899 -1532 5 -688 -1725 95 1251 -586 -1513 518 1517 -56 102
2600A02J355n05m81N12P43q68o93J040R33k011j72J443k8k107M35J734j456q22
$$ 102 1457 952 471 983 1726 858 165 1205 2138 127 -45 1398 1370 -737 -302 1432 -24 -846
$$ [...]
8191c0
##END NTUPLES=NMR FID
##END=
