##TITLE=1H_L2-Dau(feb-21)-B
 CDCl3,8 sc, 
 5.03.2021
##JCAMPDX= 6.0         $$ Bruker NMR JCAMP-DX V2.0
##DATA TYPE= NMR FID
##DATA CLASS= NTUPLES
##ORIGIN= UXNMR, Bruker Analytische Messtechnik GmbH
##OWNER= root
$$ XWIN-NMR		Version 3.5
$$ Fri Mar  5 10:28:09 2021 Russian Standard Time (UT+4h)  she@DPX200
##.OBSERVE FREQUENCY= 200.131506
##.OBSERVE NUCLEUS= ^1H
##.DELAY= (6, 6)
##.ACQUISITION MODE= SIMULTANEOUS
##.ACQUISITION SCHEME= undefined
##.AVERAGES= 8
##.DIGITISER RES= 18
##SPECTROMETER/DATA SYSTEM= spect
##.PULSE SEQUENCE= zg30
##.SOLVENT NAME= CD3CN
##.SHIFT REFERENCE= (INTERNAL, CD3CN, 0, 15.7039)
##AUDIT TRAIL= $$ (NUMBER, WHEN, WHO, WHERE, WHAT)
$$ ##TITLE= Audit trail, XWIN-NMR		Version 3.5
$$ ##JCAMPDX= 5.01
$$ ##ORIGIN= Bruker BioSpin GmbH
$$ ##OWNER= she
$$ F:/spectra/data/she/nmr/H-F/1/audita.txt
$$ ##AUDIT TRAIL=  $$ (NUMBER, WHEN, WHO, WHERE, WHAT)
(   1,<2021-03-05 10:26:23.71 +0400>,<she>,<DPX200>,
      <created by zg, POWCHK disabled, PULCHK disabled
       configuration hash MD5:
       00 E9 B6 7A A2 85 ED C7 34 08 36 98 17 FE 4E 26
       data hash MD5: 16K
       52 02 43 52 66 6C E1 2C 30 3D F9 2F D0 95 9D 80>)
$$ ##END=
$$ 
$$ hash MD5
$$ D6 13 FC 1A 82 19 D5 69 C5 18 B3 0D A0 07 47 2A
##$RELAX= 
##$RELAX= 
##$RELAX= 
##$RELAX= 
##$RELAX= 
##$RELAX= 
$$ Bruker specific parameters
$$ --------------------------
##$DU= <F:/spectra>
##$EXPNO= 1
##$NAME= <H-F>
##$PROCNO= 1
##$TYPE= <nmr>
##$USER= <she>
##$AMP= (0..31)
100 100 100 100 100 100 100 100 100 100 100 100 100 100 100 100 100 100 
100 100 100 100 100 100 100 100 100 100 100 100 100 100 
##$AQSEQ= 0
##$AQ_mod= 1
##$AUNM= <au_zg>
##$AUTOPOS= <>
##$BF1= 200.13
##$BF2= 200.13
##$BF3= 200.13
##$BF4= 200.13
##$BF5= 200.13
##$BF6= 200.13
##$BF7= 200.13
##$BF8= 200.13
##$BYTORDA= 1
##$CFDGTYP= 0
##$CFRGTYP= 5
##$CHEMSTR= <none>
##$CNST= (0..31)
1 1 145 1 1 1 1 1 1 1 1 1 1 1 1 1 1 1 1 1 1 1 1 1 1 1 1 1 1 1 1 1 
##$CPDPRG= <>
##$CPDPRG1= <>
##$CPDPRG2= <>
##$CPDPRG3= <>
##$CPDPRG4= <mlev>
##$CPDPRG5= <mlev>
##$CPDPRG6= <mlev>
##$CPDPRG7= <mlev>
##$CPDPRG8= <mlev>
##$CPDPRGB= <>
##$CPDPRGT= <>
##$D= (0..31)
0 1.2 0 0 0 0 0 0 0 0.06 0 0.03 0 0 0 0 0.0002 0 0 0 0 0 0 0 0 0 0 0 0 
0 0 0 
##$DATE= 1614925583
##$DBL= (0..7)
120 120 120 120 120 120 120 120 
##$DBP= (0..7)
150 150 150 150 150 150 150 150 
##$DBP07= 0
##$DBPNAM0= <>
##$DBPNAM1= <>
##$DBPNAM2= <>
##$DBPNAM3= <>
##$DBPNAM4= <>
##$DBPNAM5= <>
##$DBPNAM6= <>
##$DBPNAM7= <>
##$DBPOAL= (0..7)
0.5 0.5 0.5 0.5 0.5 0.5 0.5 0.5 
##$DBPOFFS= (0..7)
0 0 0 0 0 0 0 0 
##$DE= 6
##$DECBNUC= <off>
##$DECIM= 32
##$DECNUC= <off>
##$DECSTAT= 4
##$DIGMOD= 1
##$DIGTYP= 9
##$DL= (0..7)
0 120 120 120 120 120 120 120 
##$DP= (0..7)
150 150 150 150 150 150 150 150 
##$DP07= 0
##$DPNAME0= <>
##$DPNAME1= <>
##$DPNAME2= <>
##$DPNAME3= <>
##$DPNAME4= <>
##$DPNAME5= <>
##$DPNAME6= <>
##$DPNAME7= <>
##$DPOAL= (0..7)
0.5 0.5 0.5 0.5 0.5 0.5 0.5 0.5 
##$DPOFFS= (0..7)
0 0 0 0 0 0 0 0 
##$DQDMODE= 0
##$DR= 18
##$DS= 0
##$DSLIST= <SSSSSSSSSSSSSSS>
$$ [...]
##$SUBNAM2= <"">
##$SUBNAM3= <"">
##$SUBNAM4= <"">
##$SUBNAM5= <"">
##$SUBNAM6= <"">
##$SUBNAM7= <"">
##$SUBNAM8= <"">
##$SUBNAM9= <"">
##$SW= 16.9725357007746
##$SWIBOX= (0..15)
0 0 2 0 0 0 0 0 0 0 0 0 0 0 0 0 
##$SW_h= 3396.73913043478
##$TD= 16384
##$TD0= 1
##$TE= 0
##$TE2= 300
##$TE3= 300
##$TEG= 300
##$TL= (0..7)
0 120 120 120 120 120 120 120 
##$TP= (0..7)
150 150 150 150 150 150 150 150 
##$TP07= 0
##$TPNAME0= <>
##$TPNAME1= <>
##$TPNAME2= <>
##$TPNAME3= <>
##$TPNAME4= <>
##$TPNAME5= <>
##$TPNAME6= <>
##$TPNAME7= <>
##$TPOAL= (0..7)
0.5 0.5 0.5 0.5 0.5 0.5 0.5 0.5 
##$TPOFFS= (0..7)
0 0 0 0 0 0 0 0 
##$TUNHIN= 0
##$TUNHOUT= 0
##$TUNXOUT= 0
##$USERA1= <user>
##$USERA2= <user>
##$USERA3= <user>
##$USERA4= <user>
##$USERA5= <user>
##$V9= 5
##$VALIST= <valist>
##$VCLIST= <CCCCCCCCCCCCCCC>
##$VD= 0
##$VDLIST= <DDDDDDDDDDDDDDD>
##$VPLIST= <PPPPPPPPPPPPPPP>
##$VTLIST= <TTTTTTTTTTTTTTT>
##$WBST= 1024
##$WBSW= 4
##$XGAIN= (0..3)
0 0 0 0 
##$XL= 0
##$YL= 0
##$YMAX_a= 75899
##$YMIN_a= -77007
##$ZGOPTNS= <>
##$ZL1= 120
##$ZL2= 120
##$ZL3= 120
##$ZL4= 120
##$ABSF1= 10
##$ABSF2= 0
##$ABSG= 5
##$ABSL= 3
##$ALPHA= 0
##$AQORDER= 0
##$ASSFAC= 0
##$ASSFACI= 0
##$ASSFACX= 0
##$ASSWID= 0
##$AUNMP= <proc_1d>
##$AZFE= 0.1
##$AZFW= 0.1
##$BCFW= 1
##$BC_mod= 2
##$BYTORDP= 1
##$COROFFS= 0
##$CY= 11.3945322036743
##$DATMOD= 1
##$DC= 2
##$DFILT= <>
##$DTYPP= 0
##$F1P= 15.9154993809931
##$F2P= -4.1035820241983
##$FCOR= 0.5
##$FTSIZE= 0
##$FT_mod= 4
##$GAMMA= 1
##$GB= 0.15
##$INTBC= 1
##$INTSCL= 1
##$ISEN= 128
##$LB= 0.24
##$LEV0= 0
##$LPBIN= 0
##$MAXI= 10000
##$MC2= 0
##$MEAN= 0
##$ME_mod= 0
##$MI= 1.114404
##$NCOEF= 0
##$NC_proc= 0
##$NLEV= 6
##$NOISF1= 3.799351
##$NOISF2= 2.8
##$NSP= 1
##$NTH_PI= 0
##$NZP= 0
##$OFFSET= 15.70392
##$PC= 1
##$PHC0= -11120.91
##$PHC1= 11.40094
##$PH_mod= 1
##$PKNL= yes
##$PPARMOD= 0
##$PSCAL= 0
##$PSIGN= 0
##$REVERSE= no
##$SF= 200.130013532006
##$SI= 16384
##$SIGF1= 3
##$SIGF2= 2
##$SINO= 400
##$SIOLD= 16384
##$SREGLST= <1H.CDCl3>
##$SSB= 0
##$STSI= 0
##$STSR= 0
##$SW_p= 3612.71676300578
##$SYMM= 0
##$S_DEV= 0
##$TDeff= 0
##$TDoff= 0
##$TI= <>
##$TILT= no
##$TM1= 0
##$TM2= 0
##$TOPLEV= 0
##$USERP1= <user>
##$USERP2= <user>
##$USERP3= <user>
##$USERP4= <user>
##$USERP5= <user>
##$WDW= 1
##$XDIM= 8192
##$YMAX_p= 0
##$YMIN_p= 0
$$ End of Bruker specific parameters
$$ ---------------------------------
##NTUPLES= NMR FID
##VAR_NAME=  TIME,          FID/REAL,        FID/IMAG
##SYMBOL=    X,             R,               I
##VAR_TYPE=  INDEPENDENT,   DEPENDENT,       DEPENDENT
##VAR_FORM=  AFFN,          ASDF,            ASDF
##VAR_DIM=   8192,          8192,            8192
##UNITS=     SECONDS,       ARBITRARY UNITS, ARBITRARY UNITS
##FACTOR=    0.0002944,     1,               1
##FIRST=     0,             0,               0
##LAST=      2.4114304,     0,               0
##MIN=       0,             -77007,          0
##MAX=       2.4114304,     75899,           0
$$ Real data points
##PAGE= N=1
##DATA TABLE= (X++(R..R)), XYDATA
0@%%%%%%%%%%%%%%qJ6j6J6j6K4l2L2m0M8n6O4p2Q7r6J05j21J43j66J84k08K36
$$ 0 0 0 0 0 0 0 0 0 0 0 0 0 0 0 -8 8 -8 8 -8 16 -16 16 -24 24 -32 32 -40 47 -49 56 -65 78 -88 96 -112 124
36A24k62K93l30L67m07M54n02N55o15O79p49Q26r09J000j102J215j339J478j634
$$ 124 -138 155 -175 192 -215 239 -263 292 -323 356 -393 433 -476 524 -578 637 -702 776 -858
55h58J809k009K236k501K817l195L659m243M999o026P506r821J3943k3352P9859
$$ -858 951 -1058 1178 -1323 1494 -1701 1958 -2285 2714 -3312 4194 -5627 8316 -15036 64823
70F4823J1076j52906J19627m2079k6772O9830n8517J8785K0178n0838O1067l0759
$$ 64823 75899 -77007 42620 541 -26231 43599 -14918 3867 24045 -26793 34274 3515
82C515l3249N2490k4035O724J2758m2763L5973P884k4287J0612j3776J0457J1073
$$ 3515 -29734 22756 -1279 5445 18203 -24560 11413 19297 -4990 5622 -8154 2303 13376
95A3376j4652J9684k4749j4364M3970j1954j9767Q122p638J5215k532r135R886
$$ 13376 -1276 18408 -6341 -20705 23265 11311 -8456 -334 -7972 7243 4711 -4424 5462
108E462k1885J2564K4235l7560L525K3779r365N22j0140J091R553n606J6467j7426
$$ 5462 -16423 -3859 20376 -17184 -13659 10120 755 1277 -8863 -7772 1781 -3825 12642 -4784
122d784j8682L7258r367r856K2028l0008m50K7067j5105L216J221n353J0005j4874
$$ -4784 -23466 13792 4425 -5431 16597 -13411 -13861 13206 -1899 1317 2538 -2815 7190 -7684
136g684L166Q992j7197J9077Q211k6298N616N767n24N955r831K891M388j607J1976
$$ -7684 -4518 4474 -12723 6354 14565 -11733 -6117 -350 -874 5081 -4750 -1859 2529 922 12898
151A2898j5926j1904K2920l261j651O801j6206Q677O651j1181R596r664Q99J8147
$$ 12898 -3028 -14932 7988 4727 3076 9877 -6329 2348 8999 -2182 7414 -2250 -1351 16796
165A6796k3526N882J3865k5259J8637N127k6727J6971n94k194J1428k1674P781
$$ 16796 -6730 -848 13017 -12242 6395 11522 -15205 1766 1172 -1022 10406 -11268 -3487
178c487N380j5523K6851j0990k1805K5763p737l246Q558j5845J3902k73j1309
$$ -3487 1893 -13630 13221 2231 -19574 6189 -1548 -4794 3764 -12081 1821 1548 -9761
191i761J4730j5149M620J8292k3732O037N035j4629J9658l483j1586R156m481
$$ -9761 4969 -10180 -5560 12732 -11000 -4963 72 -14557 5101 1618 -9968 -812 -5293
204e293P018l113j0877J5384p258j565J7550j6380l178Q342l686P279m670j00
$$ -5293 1725 -1388 -12265 3119 -4139 -5704 11846 -4534 -7712 630 -3056 4223 -447 -547
218e47P161j0314Q374o82j4644J7916K074r364M723p903O289N860j0387P015o326
$$ -547 6614 -3700 4674 3992 -10652 7264 9338 -26 4697 -3206 3083 8943 -1444 5571 -755
233g55k888J6194j1433l160Q940j0292N242M152q066K632Q98M220l134j0288J1853
$$ -755 -3643 12551 1118 -2042 6898 -3394 1848 6000 -2066 566 1464 5684 2550 -7738 4115
248D115j94r795J1548l042q933P235J220l34m247k996P436k651J50K125j0649
$$ 4115 3921 -5874 5674 2632 -6301 934 2154 1820 -2427 -5423 2013 -638 -488 1637 -9012
263i012P871P484j2509K942K536n695O619l14k852J475l659O865k498j0611J1714
$$ -9012 -1141 6343 -6166 -3224 -688 -6383 236 -78 -2930 -1455 -5114 1751 -747 -11358 356
278C56K923p034O388n212m052P291j145J693j341l152O920m603j658P134q328
$$ 356 3279 -3755 2633 -2579 -6631 660 -485 1208 -133 -3285 3635 -968 -2626 4508 -3820
293c820K816Q071p241l56K190q74K604j741m83j389p0Q755n503p171Q190j055
$$ -3820 -1004 7067 -174 -530 1660 786 3390 1649 1166 -223 -293 8462 2959 -4212 3978 2923
309B923k485L252k507r29J316L166p19p866M632L922n065L120j018l424M150j414
$$ 2923 438 3690 1183 254 1570 4736 4017 -3849 783 4705 -360 2760 1742 -1682 2468 1054
325A054l50p93j818N573k699l190M412n148M77P449n796l121J859O91K366k251
$$ 1054 704 -89 -1907 3666 967 -2223 2189 -2959 -2482 4967 -829 -3950 -2091 -1400 966 -1285
341a285l15M58k699M399p04n805M861K827l087j20j210j79J790K091k23m710J982
$$ -1285 -1600 -1142 -3841 558 -146 -5951 -1090 1737 -1350 -1470 -2680 -2859 -1069 1022 799 -3911 -1929
358a929N435m120j620L083j418M54K758j151k124l28K648O86k723P21K87j07K855
$$ -1929 3506 -614 -2234 849 -569 -115 2643 1492 -632 -960 1688 2374 -349 372 659 552 3407
375C407k028k754K078J366n98j242J1J439j056K323R51p079K494O800m372j260
$$ 3407 1379 -1375 703 2069 1471 229 240 1679 623 2946 3897 -3182 -688 6112 1740 480
391D80J413j569J928o98k59L03l125N065n55o600M620K64k954M431l150k851K369
$$ 480 1893 324 2252 1554 1295 1598 -1527 3538 2983 -3617 1003 1267 -1687 2744 -406 -3257 -888
408h88Q9K087k796j806L758l430J557K640o569L024M175l692j38j054J227J186
$$ -888 -799 1288 -1508 -3314 444 -2986 -1429 1211 -5358 -2334 1841 -1851 -1989 -3043 -1816 -630
424f30k074L593k894l418P503k053m863L240k88J420L17l207J548m87J461J863
$$ -630 -2704 889 -2005 -5423 2080 27 -4836 -1596 -1884 -464 -147 -3354 -1806 -2293 -832 1031
440A031n151L121J436l587M855j086l412K647M71K203l196j494P112m253j001
$$ 1031 -4120 -999 437 -3150 1705 619 -2793 -146 325 2528 -668 -2162 4950 697 -304
455c04M908n872J774L926k659J056l933K032M677o618L386J20n778Q462k937m838
$$ -304 4604 -1268 506 4432 1773 2829 -1104 928 5605 -1013 2373 2493 -3285 5177 2240 -2598
471b598N544l818J987K052n849L604j304m17N332q579K274O016q222M459J254
$$ -2598 2946 -872 1115 3167 -2682 922 -382 -799 4533 -4046 -1772 4244 -3978 481 1735
486A735n973N174q02l19L25n637O102R93o211N630k503l432O236k673j671J684
$$ 1735 -4238 936 134 -185 140 -5497 605 1598 -4613 1017 -1486 -4918 1318 -1355 -3026 -1342
502a342j603L471j806k200L327k188J749K696n717K043L017k064J608q82p27J461
$$ -1342 -2945 526 -1280 -3480 -153 -2341 -592 2104 -3613 -1570 1447 -617 991 109 -618 843
518H43l95K516k160k121M786r34k687L218k318o85L030q82j093r34J177K199l592
$$ 843 448 2964 804 -1317 3469 2535 -152 3066 748 63 3093 2211 1118 184 1361 3560 -32
535c2P02J810l149K695O79l529J156R93M45P2k486J766m7j658L518k600k323N084
$$ -32 670 2480 -669 2026 2705 -824 332 1325 1770 1842 -644 1122 1075 -583 2935 335 -1988 3096
553C096l071j073K943l389J383J066k287K345l973J377M622o927K326K688n512
$$ 3096 25 -1048 1895 -1494 -111 955 -1332 1013 -2960 -1583 3039 -3888 -1562 1126 -4386
568d386M828m57l485L973l437K343K020o045N224j228l172P565o252p17O538n884
$$ -4386 442 -15 -3500 473 -2964 -621 1399 -4646 578 -650 -3822 3743 -2509 -3226 3312 -2572
584b572K760R30m742O044l533j20M827q130M857L519p923N731j051l716O422l773
$$ -2572 188 1118 -3624 2420 -1113 -1233 3594 -4536 321 3840 -4083 1648 597 -3119 3303 -470
600d70L38J816n099P166k325m798P035m117k99N440n992J914J778k846M155l870
$$ -470 -132 1684 -3415 3751 1426 -3372 3663 -454 -753 4687 -1305 609 2387 -459 3696 -174
616a74o18M004m068L305k0o208O440j20m242L415k793J324J047k663L240l430
$$ -174 -792 3212 -856 2449 2429 -3779 2661 2541 -1701 1714 -1079 245 1292 -1371 1869 -1561
632a561r91O044m555r82L246l538K925J13l171K640k289K291J263n395L630Q78
$$ -1561 -2552 3492 -1063 -2045 1201 -2337 588 701 -2470 170 -2119 172 1435 -3960 -330 548
648E48l382M823l370k360M955k397P66m04k938N224k057j583L957n330K340M277
$$ 548 -2834 1989 -1381 -3741 1214 -1183 -417 -821 -3759 1465 -592 -2175 1782 -3548 -1208 3069
664C069n750J733J320k346M053k638n03K481l196L664L00n790N637k91k869M518
$$ 3069 -2681 -948 372 -1974 2079 -559 -1062 1419 -1777 1887 2187 -3603 2034 1743 -1126 3392
680C392l799n96M047k915K005j556k232N835l534j729M498n239K480L162n410
$$ 3392 -407 -1003 3044 129 2134 578 -1654 4181 647 -1082 3416 -1823 657 3819 -1591
695a591K448k68j382M141m172N82J906l814M391j233m471N417j602j624L074l724
$$ -1591 857 589 -793 3348 -824 -242 1664 -2150 2241 1008 -3463 1954 352 -1272 1802 -1922
711a922J589J051j948K473l518L40M264m378P51J957l569L055J92k524K049k099
$$ -1922 -333 718 -1230 1243 -2275 -1935 2329 -2049 -1298 659 -2910 145 337 -2187 -138 -2237
727b237K091J077m187K833j39j880M153l149q95K912j521R34l34j597L205j760
$$ -2237 -146 931 -3256 -423 -562 -2442 1711 -1438 -2333 579 -942 -8 -342 -1939 1266 -494
743d94m17K716m157J955K543k907J698p86r06L129k453P66O20k424L823j186k749
$$ -494 -911 1805 -2352 -397 2146 -761 937 151 -755 2374 -79 687 1307 -1117 2706 1520 -1229
760a229L928k784j52L761l688L25J426j088J643k573L27K774l597J741J655m530
$$ -1229 2699 -85 -237 3524 -164 161 1587 499 2142 -431 -104 2670 -927 814 2469 -2061
776b061K926R01k045J249j713Q66J407k682K208j094j874L707j981j387K176k085
$$ -2061 865 1766 -279 970 -743 123 1530 -1152 1056 -38 -1912 1795 -186 -1573 603 -1482
792a482J224J121k756J915p81l08K064l521J403K085l049K289R4k946K548r8k69
$$ -1482 -258 863 -1893 22 -759 -1067 997 -2524 -1121 964 -2085 204 298 -2648 -100 -198 -467
809d67J88j612K576n20j868L362k440m57L258k519j77J332r48J322r34l15J202
$$ -467 -279 -1891 685 165 -1703 1659 -781 -1238 2020 -499 -676 656 -292 1030 96 -219 983
826I83j890J932P32k939J800K77j082J565j329m33J208m19J094j564o24K443j520
$$ 983 -907 1025 1757 -1182 618 895 -187 1378 49 -384 824 405 1499 -65 -689 1754 234
843B34o3J407k123J010J027j163nm55N46M87j394Q39r3j227K262o83j691J099
$$ 234 171 1578 -545 465 1492 329 324 -131 415 902 -492 347 254 -973 1289 606 -1085 14
861A4J09q8k56k69J99n72N68O55j750j79K151r81p44O84n45l99J463j2j011q1
$$ 14 123 35 -221 -490 -291 -863 -295 360 -1390 -1569 582 -399 -1143 -459 -1004 -1403 60 48 -963 -1044
881a044R58L72j609N49L69n79R01N32j683K78J027k57l08k58Q7K35L68P46j411
$$ -1044 -86 286 -1323 -774 -405 -984 -83 449 -1234 -956 71 -186 -494 -752 -665 -430 -62 684 -727
900g27j68J626o69n15O41n76O51P93l94n93j67J416J11j396R23j6o56J000k37
$$ -727 -895 731 62 -453 188 -388 263 1056 662 69 -98 1318 1429 33 956 940 284 1284 1047
919A047o67k14R42O71j495o41J538q75Q3N66j233J1R12k71l34k3J26M3j33L10
$$ 1047 380 166 1108 1779 284 -357 1181 306 389 955 -278 -267 645 374 40 17 143 186 53 363
939C63o94p69J853j87j503P32j09l32N04L58j019n54J189N45j578R5R05o28K19
$$ 363 -331 -1100 753 566 -937 -205 -314 -646 -142 216 -803 -1357 -168 377 -1201 -1106 -201 -829 -610
958f10K74n27n38J226K58j103J75K93K72L40j74l44J48M89O22p98n40J281m71
$$ -610 -336 -863 -1401 -175 83 -1020 -845 -552 -280 60 -114 -458 -310 179 801 3 -537 744 273
977B73J34Q62j730L52J029l4J59j346P23J284k029J258K43j665J965k92j450J087
$$ 273 407 1269 -461 -109 920 886 1045 -301 422 1706 -323 935 1178 -487 1478 1186 -264 823
995H23r04P66N69j443Q10n99m5J966k225M9J169j350J010J24j441O69J70M53l30
$$ 823 -81 685 1254 -189 621 22 -23 1943 -282 -233 936 -414 596 720 -721 -52 118 571 241
1014B41j846J693K95j469J480j111m63J345o53j55k73k16J511j296J31P59j581
$$ 241 -1605 88 383 -1086 394 -717 -1180 165 -488 -643 -916 -1132 379 -917 -786 -27 -1608
1031a608J283Q16j670N85j20K62Q22j350R52j86m42J598j276j177K389q99k68
$$ -1608 -325 491 -1179 -594 -714 -452 370 -980 -28 -214 -656 942 -334 -1511 878 -21 -289
1048b89J020j541O56N84j54N58j694J029J219j934Q08N36j154J516j89j184O10
$$ -289 731 -810 -154 430 276 834 -860 169 1388 -546 262 798 -356 1160 971 -213 397
1065C97l87J325j49j891J687j65r87J733j310p94J847j145N34O3j363J144O2o87
$$ 397 10 1335 1186 -705 982 817 -170 1563 253 -541 1306 161 695 758 -605 539 601 -86
1083h6O46j986J579J115k266Q79K61j356J489m14j074J092o27Q24J35k036J878
$$ -86 560 -1426 153 1268 -998 -119 142 -1214 275 -139 -1213 -121 -748 76 211 -1825 53
1100E3n59j000K510j858m92J742j339Q33k90p45J626j199r2J372k150J251J171
$$ 53 -506 -1506 1004 -854 -1346 396 -943 -110 -400 -1145 481 -718 -810 562 -1588 -337 834
1117H34k268J148K71p02J321r22J75K86p97J904j175j127K084j087K77Q47j564
$$ 834 -1434 -286 -15 -717 604 -318 -143 143 -654 1250 75 -1052 1032 -55 222 1069 -495
1134d95Q99K47m54J057j420O63Q11j668J002N48j932K066n41r41J106j114Q66
$$ -495 404 651 197 1254 -166 497 1308 -360 642 1190 -742 1324 783 -158 948 -166 700
1151G00j54r23J565j446n06K299k000L5J445j733R91qq55J252j622P38J160k540
$$ 700 546 -377 1188 -258 -764 1535 -465 -430 1015 -718 273 265 -590 662 -960 -222 938 -1602
1169a602J710O6j609J897o42j122J806j290N23M51j334J498q84p69K097k070K59
$$ -1602 108 174 -1435 462 -180 -1302 504 -786 -263 188 -1146 352 -532 -1301 796 -1274 -1015
1186a015K110k556J016P23j517J547p10n5P97j738J430Q59k360K141l83j294K055
$$ -1015 1095 -1461 -445 278 -1239 308 -402 -457 340 -1398 32 891 -1469 672 289 -1005 1050
1203A050j045o8Q37j246J536p29r63K068j333J89J226k156P77J050j703J656p90
$$ 1050 5 -63 774 -472 1064 335 -628 1440 107 296 1522 -634 143 1193 -510 1146 356
1220C56k60J232j317M45L40j548K321p45j709J906r10l3R94j290N62j74l43J303
$$ 356 96 1328 11 456 796 -752 1569 824 -885 1021 111 78 1072 -218 344 170 -173 1130
1238A130j857q1J743j659P06J73j096J043k62MK99j297J077L81j280J087o51o97
$$ 1130 -727 -808 935 -724 -18 155 -941 102 -160 -156 143 -1154 -77 304 -976 111 -540 -1237
1256a237J715j182l07O48n36Q38l67n74J098p00P0R56j683R52J002j424R23j75
$$ -1237 478 -704 -1011 -363 -899 -61 -428 -1002 96 -604 -534 422 -1261 -309 693 -731 192 17
1274A7n10J140q12L16L14j279J711m44q94J324o29p22J743j392M9M37l03P62q76
$$ 17 -493 647 -165 151 465 -814 897 453 -441 883 254 -468 1275 -117 -68 369 66 828 -48
1293d8J1Q94j214P40Q42j774R75O17r38M59q51M55N43j028Q06m61p20J292k47
$$ -48 -37 857 -357 383 1225 -549 426 1043 105 564 -287 168 711 -317 489 28 -692 600 353
1312C53q60J112r76M59K85j140R18l13l67J075j606O71Q72j524J025J44j556J503
$$ 353 -507 605 -371 88 373 -767 151 -162 -529 546 -1060 -389 483 -1041 -16 128 -1428 75
1330G5j51m38K72p17J166k43r42J355q97l70J490q41RK27n10Q46o15j61R35j137
$$ 75 -76 -514 -242 -959 207 -36 -978 377 -520 -890 600 -241 -232 -5 -515 331 -284 -445 490 -647
1350f47N54O18j383R63J28o65J178q08O6K13k47O76q14k98J512q88j04P61r89
$$ -647 -93 525 -858 105 233 -432 746 -62 4 217 -30 646 -168 -466 1046 158 54 815 -174
1369a74L47L60l83J24k35M19J56n74M84k3n05O23q9j036N51L62r2k14R5J24p56
$$ -174 173 533 150 274 39 458 614 40 524 501 -4 619 530 -506 45 407 315 101 196 320 -436
1390d36M56O65j054j4O61k66l99J82j78j13L79P0k83l13N50N8p06N07J04n70N81
$$ -436 20 685 -369 -383 278 12 -387 -205 -383 -496 -117 -47 -330 -643 -93 -35 -741 -234 -130 -700 -119
1411a19R1m24PK14o2j0k33K26l8j2L90l76l03R52q7l24L40k24j69K03J87J77n63
$$ -119 -28 -452 -445 -231 -293 -303 -536 -310 -348 -360 30 -346 -649 303 216 -108 232 8 -161 42 229 406 -157
1434a57O51J32p79J09N59n16K64K59m26J09J53Lk18j08M92o6l08P33m75l37P28
$$ -157 494 626 -153 -44 515 -1 263 522 96 205 358 361 143 35 527 461 153 886 411 74 802
1455H02m66k67O7r5J92L3j04nn03N01J69p65K68J29k72Q4L73m98r0L58O4l51j06
$$ 802 336 69 136 41 233 266 162 157 -346 155 324 -441 -173 -44 -316 -232 141 -357 -447 -89 -25 -376 -482
1478d82K89j55r1M83m58l85P49o8l11o3K01j14L59m24J56O1jM21l20k44M01j14
$$ -482 -193 -348 -439 44 -414 -799 -50 -118 -429 -492 -291 -405 -46 -470 -314 -253 -254 167 -153 -397 4 -110
1500a10J88m3m13K33M50J2l22l36K83M58n05K26Qm02Q18Op14L07p2J61J58k57
$$ -110 78 35 -378 -145 305 317 -5 -341 -58 400 -105 121 129 -273 545 551 -163 144 72 233 391 134
1522A34J71j37M4M88o72j99Q60m78k1J26k39J55J8K17m6j062Q96J54r58R81m82
$$ 134 305 168 212 700 28 -171 689 211 190 316 77 232 250 467 421 -641 255 409 -549 432 -50
1543e0l17N86m84J59q1j72N53n54m3P39q86L29J89n00L04j59j8M84k80k32K89
$$ -50 -367 219 -265 -106 -187 -359 194 -360 -403 336 -550 -221 -32 -532 -228 -387 -405 79 -201 -433 -144
1564a44m56J145q05n54J020m54n4M20o44N46l05J83M43p63K50Q60j154O22N13
$$ -144 -600 545 -260 -814 206 -248 -302 118 -526 20 -285 -102 341 -422 -172 688 -466 156 669
1583F69j287J101n4n24N12n21N31M51j169Q29j61p71J272o29m33Q47p92N54Oo42
$$ 669 -618 483 429 -95 417 -104 427 878 -291 538 377 -394 878 249 -184 663 -129 425 431 -211
1603b11Q78n62k57P64j114N63P79j108L44J25o11P75j83j61K67q47Q59j94p95
$$ -211 667 105 -152 612 -502 61 840 -268 76 201 -410 365 182 21 288 -559 300 106 -689
1622f89P27m62j90J089r74m7O45n14N73m91k54Q28o54R8J29o13O55M47j000P89
$$ -689 38 -424 -614 475 -499 -546 99 -415 158 -333 -587 241 -413 -315 -186 -799 -144 303 -697 92
1642I2n67K4Q62q05N50m45k95R45n15j88O88q95O28L81j081N50J43j62M53p01
$$ 92 -475 -451 411 -394 156 -289 -584 361 -154 -342 346 -549 79 460 -621 -71 72 -90 363 -338
1662c38L32M07o75P94o9q94R68k35o3L55j102R71K41p54Q89p93j59R58r73J73
$$ -338 -6 401 -274 520 451 -443 525 290 227 582 -520 451 692 -62 827 34 -125 833 -140 33
1682C3N15q62P47K19q52O36n92L61L91j232Q48Nq77J238p69l61Q00k78qN0o60
$$ 33 548 -314 433 652 -200 436 -156 205 596 -636 212 217 -660 578 -191 -552 248 -30 -38 12 -648
1703f48Q30n01k69R29j163L45Q90r86K52K72l84L90m79J87M75n75O14j05j072
$$ -648 182 -319 -588 341 -822 -477 413 -573 -321 -49 -433 -43 -522 -335 140 -435 179 74 -998
1722i98J362j13o49O03o55L64M78m93L40m58l00J195p28j65P51j005Q09J65o22
$$ -998 364 251 -398 205 -450 -86 392 -101 239 -219 -519 676 -52 -217 534 -471 338 503 -119
1741a19N84m82R1N12q30P81m5o54J026m29r15J245q81J26J57l62P85m72j96R69
$$ -119 465 -17 74 586 -244 537 492 -162 864 435 -480 765 -116 10 167 -195 590 118 -78 891
1761H91j248J32J090j380N04L73o36M03k15n9L79r14Q55k7q69J067o71k92R93
$$ 891 -357 -225 865 -515 -11 362 -274 129 -86 -145 234 -680 175 148 -721 346 -325 -617 376
1780C76j189L67N36o43O65m13l89Q56r38M70N49r81P17L16j077Q44j09p4M40q01
$$ 376 -813 -446 90 -553 112 -301 -690 166 -772 -302 247 -734 -17 299 -778 66 -43 -117 323 -478
1800d78P39k31o02J075l04n31Q02p39K18O76r22L57J64k35N68o73J88N24j043
$$ -478 261 30 -572 503 199 -332 470 -269 -51 625 -297 60 224 -11 557 -116 72 596 -447
1819d47R91j93m40N83j75l49L47j40n4K78m95L54j07m37R74n32l42N01l43j4L01
$$ -447 544 351 -89 494 319 -30 317 177 123 401 -94 260 153 -284 690 158 -184 317 -26 -40 261
1840B61n63O90m36q4O65q07K16N36r81O68j13n94Q39q35K96K39m33O38l66m45
$$ 261 -302 388 -48 -132 533 -274 -58 478 -503 165 52 -542 297 -538 -242 -3 -436 202 -164 -609
1860f09P97p21J20N71k60j54N1k21N37m94J06O39r22O19K02p62M52O8l06L26O
$$ -609 188 -533 -413 158 -102 -256 -205 -426 111 -383 -277 362 -560 59 261 -501 -49 19 -287 39 45
1881D5n0J27l30M54k18m21P59k02k41O39o66K36M16m53ok68K87L35o02M84J62
$$ 45 -5 122 -208 246 28 -393 366 164 -77 562 -104 132 548 95 89 -179 108 443 -159 325 487
1902D87o41M06jm45L17p9M7J13k31K13k52J22M42m52l79M43k07L7j03N1J36j69
$$ 487 -154 252 251 -194 123 44 91 204 -27 186 -66 56 498 46 -333 110 -97 -60 -163 -112 24 -145
1924a45K16k54k17M14K64o69L35k10J8K26J51m52J10j9K47j03j65J90r9J78Q2
$$ -145 71 -183 -400 14 278 -391 -56 -266 -248 -22 129 -323 -213 -232 15 -88 -253 -63 -162 16 98
1945I8l50o5L07L3m9k47L36k5J5R3j96j40L88r4j19J99j97J8J72j32R2k11K97
$$ 98 -252 -317 -10 23 -26 -273 63 38 53 146 -50 -190 198 104 -15 184 -13 5 177 45 137 -74 223
1968B23M03o05L2J09M5nR0l95o9O02j39r8r5M0j57J10J88l7m14N20j96j85J60
$$ 223 626 21 53 162 207 202 292 -103 -172 430 291 193 98 138 -19 91 279 242 -172 348 152 -33 127
1991A27j28J8O6j06O5j46M8N9k06j35M88m26M25l36L1p8P8J26j31Q1K4j12k03
$$ 127 -1 17 83 -23 42 -104 -56 3 -203 -338 150 -276 149 -187 -156 -234 -156 -30 -161 -80 -56 -168 -371
2014c71L28j58r4K18Q1m1k39J41j08J1k1J04j71J29J48k31J32m1J92j79J99J26
$$ -371 -43 -201 -295 -77 4 -37 -276 -135 -243 -232 -253 -149 -320 -191 -43 -274 -142 -183 9 -170 29 155
2036A55l4r9J74j75K78j95R3J11j64K67m36J67J45q5jJ68k13mk6k35K90j78M10
$$ 155 121 22 196 21 299 104 197 308 144 411 -25 142 287 202 201 369 156 152 126 -109 181 3 413
2059D13k71n05L82j73N8K94k81J11K74k25q7M9k08L20j62Q5J0m05M11p2n70J87
$$ 413 142 -363 19 -154 -96 198 -83 28 302 77 -10 39 -169 151 -11 74 84 -321 90 18 -552 -365
2081c65K46k08L52j79M4M4k42K58K11o79L19K21k60K69k80J51J70l07K67k99K07
$$ -365 -119 -327 25 -154 -110 -66 -308 -50 161 -518 -199 22 -238 31 -249 -98 72 -235 32 -267 -60
2102f0J22l06L50k3m52K72M1J03O5n2J33O8n68L79R3j98K90j02k93L63k50K44
$$ -60 62 -244 106 83 -369 -97 -56 47 112 60 193 261 -307 72 165 -33 257 155 -138 225 -25 219
2124B19j86q2K01j35K99j1m95J67K91n34K63J19l2J68j68l2R8m76O20k68k03N45
$$ 219 33 -49 152 17 316 305 -190 -23 268 -266 -3 116 84 252 84 52 150 -326 294 26 -177 368
2146C68l96k66P27n71nO6k98L61r7m0M77m30L29m8m88M18j05q8L22n12QJ73k15
$$ 368 -28 -294 433 -138 -143 -77 -375 -14 -111 -151 326 -104 225 177 -311 107 2 -86 236 -276 -268 -95 -310
2169c10M22l52o3N26m95p9O04l04P2J57k35L23l67L90l6l42J37K01n84Q82m49
$$ -310 112 -240 -303 223 -272 -351 253 -51 21 178 -57 266 -101 289 253 -89 48 249 -335 547 98
2190I8l07L55p1j60K90o48P30j37k15N96n46k70N60l78K35L8k20L64j87OK09n48
$$ 98 -209 146 75 -85 205 -443 287 150 -65 531 -15 -285 275 -103 132 170 -50 314 127 133 342 -206
2212b06K53M53p21L93n3k40M98k54m61K35l4M24k01m48M24l58JM95n15L02L84
$$ -206 47 500 -221 172 119 -121 377 123 -338 -103 -137 287 86 -362 62 -296 -295 200 -315 -13 371
2233C71o61j57K04o2N72m83q6L88m29O51j42p67P13m22J01N34o00K85J6j39K68
$$ 371 -290 -447 -243 -305 267 -216 -302 86 -343 308 166 -601 112 -310 -209 325 -275 10 26 -113 155
2254A55k91j31O77p42K73L23o79O69K3m39N53o17J08O67p40M04O6l20L26k45r1
$$ 155 -136 -267 410 -332 -59 264 -415 254 277 -162 391 -226 -118 549 -191 213 279 -41 285 40 -51
2275e1N39m34L93j72m88L04L5p6M38p22J98M09q82N58k23O3J80J1k35K22l03K91
$$ -51 488 54 447 275 -213 91 126 50 488 -234 -36 373 -509 49 -174 -111 69 80 -155 67 -236 55
2297E5%l03L77k04J40L8l45N7J85j61M93o57O7L16o72L94J10k59J86N8m25L82
$$ 55 55 -248 129 -75 65 103 -242 -185 0 -161 332 -325 -258 58 -614 -220 -110 -369 -183 -125 -550 -168
2319a68P6j3L17m53J64J79m67L96Ok38K60k73K08Jk14L69m52K07M42l34M3K29
$$ -168 -92 -105 212 -241 -77 102 -365 31 37 -201 59 -214 -6 -5 -219 150 -302 -95 347 13 56 285
2341B85m94N09l6l21K82j94o7K95m19L59o7p5M32l32k74O35l28k65K94l06L72
$$ 285 -209 300 264 -57 225 31 -36 259 -160 199 132 57 489 157 -117 518 190 -75 219 -87 285
2362B85l42K27j16j91P9L20n19J63J11j55L22m35J42K26n3j44J04r5N1Ll98N59
$$ 285 -57 170 54 -137 -58 262 -257 -94 17 -138 184 -251 -109 117 64 -80 24 -71 -20 -17 -415 144
2384A44m27J19K96l53J98j85LR1j38JM04k92K4K62l00K81k96N1R2j6O4O6j96K91
$$ 144 -283 -164 132 -221 -23 -208 -205 -114 -252 -251 153 -139 -115 147 -153 128 -168 -117 -25 -41 23 89 -107 184
2408A84k78Q9K26k96q1M38k84J75m7l01K87j09J04J11k15J61p2O0K12j97M0R9
$$ 184 -94 -5 221 -75 -156 282 -2 173 126 -175 112 3 107 218 3 164 92 152 364 167 207 306
2430C06l81J07K77n68O12m38K18K02k56q1J81j97J84o3l21L49j13L12l21j85k1
$$ 306 -75 32 309 -259 353 -85 133 335 79 -2 179 -18 166 103 -218 131 18 330 9 -176 -197
2451a97J56L9Q0m39K21N9j69P2J66l36J79N1%M4%k02L42J4k94K24l19M45k44L9
$$ -197 -41 -2 78 -361 -140 -81 -250 -178 -12 -348 -169 -118 -118 -74 -74 -276 66 80 -214 10 -309 136 -108 -69
2475f9J96k21K67l08o9K27O5j12j8J04%K1j82J88q0j16J61k1j30J39p0J35L9M
$$ -69 127 -94 173 -135 -204 23 88 -24 -42 62 62 83 -99 89 9 -107 54 33 -97 42 -28 107 146 150
2499A50k4Pj98J43MR9J02k05j77j12J18l2K17j20LK7N3k30K81j54N2m2L74m40
$$ 150 126 133 -65 78 82 181 283 78 -99 -211 -93 -125 92 -28 -25 2 55 -175 106 -48 4 -38 336 -104
2523a04K87j86m1l7o6R9j17%J83k32J50L15k97p3K00j42j56L55l12NR8l00J56
$$ -104 183 -3 -44 -81 -147 -48 -165 -165 18 -214 -64 251 -46 -119 81 -61 -217 138 -174 -169 -71 -371 -215
2546b15J78o0m4l4q3K34m8r3K43l9K61r6l13n1J79N1K09k56J44j75J18j7J06k91
$$ -215 -37 -97 -141 -175 -258 -24 -72 -165 78 39 300 204 -109 -160 19 70 279 23 167 -8 110 93 199 -92
2570i2K60O5Q9k89J02j42N7K83l26K28k24O0J37Qp4o6l19N72k64k6KP8q3j07r5
$$ -92 168 233 322 33 135 -7 50 333 7 235 11 71 208 216 142 76 -243 329 65 39 41 119 36 -71 -166
2595a66P9mj41L69k98K07J10l39J19oR2L3m26L89j51P2N3J57k49L66m47J01NK2
$$ -166 -87 -91 -232 137 -161 46 156 -183 -64 -70 22 55 -371 18 -133 -61 -8 149 -100 266 -181 -80 -75 -53
2619e3k38K15J26j67K65q9j5l56K72Q0j78L08P6l53KK92J4k22K3J89m12P4M17
$$ -53 -291 -76 50 -117 148 59 44 -312 -40 40 -138 170 246 -107 -105 187 201 -21 2 191 -221 -147 270
2642B70l47K8K19j70Q9Q9k92P2p7L10K03m97K09J63j77L7m5K5Kj25O5K29n35M89
$$ 270 -77 -49 170 0 89 178 -114 -42 -119 191 394 -103 106 269 92 129 84 109 111 -14 51 280 -255 234
2666B34k84O2J40j78R0k02O0j61L60l91L65l12J62Q5l74M43j45j09J34m8l9N2
$$ 234 -50 12 152 -26 64 -138 -78 -239 121 -270 95 -217 -55 30 -344 99 -46 -155 -21 -69 -108 -56
2688e6p7J55oq5j00J2p6J48j65J8L49j55j30R5J80m2k08K55q4j66K66j92O9K74
$$ -56 -133 22 16 -69 -169 -157 -233 -85 -250 -232 117 -38 -168 -73 107 65 -143 112 28 -138 128 -64 5 279
2712B79l20q9M42m52K79j2l44N27m34J2M72m02O1Rm16M99L8j85K16j90l7K82q7
$$ 279 -41 -130 312 -140 139 127 -217 310 -124 -112 360 -42 19 28 -388 111 149 -36 180 -10 -47 235 148
2735A48L4J94n74L53J6n96N54m2r4J35j94N2p3p9L33k59Q9J34k60o0L13k94K23
$$ 148 182 376 -198 155 171 -425 129 87 -7 128 -66 -14 -87 -166 167 -92 -3 131 -129 -189 124 -170 53
2758E3n3j01L92m60K59j0j97L34l48k66L45o7j05M31m69M18J2j24M3k36pL57n71
$$ 53 0 -101 291 -169 90 80 -117 217 -131 -397 -52 -119 -224 207 -262 156 168 44 87 -149 -156 201 -370
2781c70L55K96m07K42N9j14P4j98N0K24k73K02k9k48M28k96J08M57n48p1J51r9
$$ -370 -15 281 -126 116 175 61 135 -63 -13 211 -62 140 111 -137 291 -5 103 560 12 -59 92 -7
2803gK7k48L89K95l97K10k39l22N51l27n4L53l33L29Nk00j57L56n10O77n43QJ66
$$ -7 20 -228 161 456 59 269 30 -292 259 -68 -122 231 -102 227 232 32 -125 231 -279 398 -145 -137 29
2826B9k52L31k73r2N10k73k06M44m07K15K31o60N08k14k7L38n00M15L6m00J88
$$ 29 -223 108 -165 -257 253 -20 -226 218 -189 26 257 -403 105 -109 -136 202 -298 117 153 -247 -59
2847e9J5j30M37n41L61M8l26L34m3k76M46l53P7L09l45J48J52l06K90m07J36L52
$$ -59 -44 -174 263 -278 83 131 -195 139 96 -180 266 -87 -10 299 -46 102 254 -52 238 -169 -33 319
2869C19n70N75N3n73L15J14k45L78m02j87O62m33J13%k29K92j86J19N7m54L58
$$ 319 -251 324 377 -196 119 233 -12 366 -36 -223 439 6 119 119 -110 182 -4 115 172 -282 76
2890G6L27o51L70J26l00K32k98K24j1j46j5M14m83L17m21K57pl26K47Q7j24J99
$$ 76 403 -248 122 248 -52 180 -118 106 95 -51 -66 348 -135 182 -239 18 11 -315 -68 19 -105 94
2912I4j30j86N04n27j3jm2J81K00k29M6m9j29J86MP3J7M3o7L01l32L02n96L71
$$ 94 -36 -222 282 -245 -258 -259 -301 -120 80 -149 -103 -152 -281 -95 -91 -18 -1 42 -25 276 -56 246 -350 21
2936B1N1p1j11L10j19j61jK2Q6l31P07l90p2K97R9k51p0M2L43l78k54M38j35J31
$$ 21 72 1 -110 200 81 -80 -81 -59 27 -304 403 13 -59 238 337 86 16 58 401 23 -231 207 72 203
2960B03j06j09Q2Lj03K18n7l49M04j29N4Q6l29M33n06q2L80o5k18K24k18j22K33
$$ 203 97 -12 70 73 -30 188 131 -218 186 57 111 197 -132 301 -205 -287 93 28 -190 34 -184 -306 -73
2983g3r4J59O9k67K29m3J13J21k33M3J92l44J78M9k72J89j02l8J39J62pj41j11
$$ -73 -167 -8 61 -206 23 -20 93 214 -19 24 216 -128 50 99 -173 16 -86 -124 15 177 170 29 -82
3006h2J78r9j51j4J65n4K88k24R8k04k2J86k05K67J11k14J03j04M3k43L13J1r
$$ -82 96 -3 -154 -168 -3 -57 231 7 105 -99 -121 65 -140 127 238 24 127 23 66 -177 136 147 138
3029A38j00L12k57k48L92l0k19RO5J22j6j51L3M2r4K43k96K31j33mJ72l62m5K78
$$ 138 38 350 93 -155 237 207 -12 -3 62 184 168 17 50 92 -2 241 -55 176 43 39 211 -151 -196 82
3053H2r0R2k8k25J79Oj9L5j52j24J82J85k0k33M7p4j1M5J53j54P2K87m34K78K41
$$ 82 -8 84 56 -169 10 16 -3 32 -120 -244 -62 123 103 -130 -83 -157 -168 -123 30 -124 -52 235 -199 79 320
3078C20l71L44m41R8O9J42p1j10J96p5j14J2J6p1K9L3J61j64R5j29K19m3J48n52
$$ 320 -51 293 -148 -50 19 161 90 -20 176 101 -13 -1 15 -56 -27 6 167 3 98 -31 188 145 293 -259
3102b59M80j0N5m11K36j68r9K85M3P6k31l7J34j88J91N5k83m9J68K49k47m6j25
$$ -259 221 211 266 -145 91 -77 -176 109 152 228 -3 -40 94 -94 97 152 -131 -180 -12 237 -10 -56 -181
3125a81J06J23R6k18j55K93j0j75J18R8r6N6r3J35r8Qk98L39j4l18J21J05J59
$$ -181 -75 48 144 -74 -229 64 54 -121 -3 95 -1 55 -38 97 -1 7 -291 48 34 -284 -163 -58 101
3148A01j71N3j77K47N8O6l49M7K03l69L25r2P3J8j30P3J30l8j62M52n06j3M2J11
$$ 101 -70 -17 -194 53 111 177 -172 -125 78 -291 34 -58 15 33 -97 -24 106 68 -94 358 -148 -161 -119 -8
3172hJ43J19k98Q3j08K7J74l1r8j55L09n7k19K6J2J36l6lJ55j29K9j71L66m34
$$ -8 135 254 -44 39 -69 -42 132 101 3 -152 157 100 -119 -93 -81 55 19 16 171 42 71 -100 266 -168
3196a68J20J62J20j29k10J90J24k97R6l9k23K23j8n1J89k91J63M3J3k58R1Q5J67
$$ -168 -48 114 234 105 -105 85 209 -88 8 -31 -254 -31 -49 -100 89 -202 -39 4 17 -241 -150 -65 102
3219A02j96j33K24k45J72N1P3p2o0K08Rj45J06l4j03R6L0j31K19n4j20m0%J41
$$ 102 -94 -227 -3 -248 -76 -25 48 -24 -84 124 133 -12 94 60 -43 53 83 -48 171 117 -3 -43 -43 98
3243I8k63P8J07l02K18K73m30N11m0l06N21m54R1J42l65L61k04J51l5l00j0M80
$$ 98 -165 -87 20 -282 -64 209 -221 290 250 -56 465 11 102 244 -121 240 36 187 152 -148 -158 322
3265C22m17l1L33k50J7M6k38K57k99J67J05r1j6J21k12j5J12l2L53j27K35k22
$$ 322 -95 -126 207 -43 -26 20 -218 39 -260 -93 12 -79 -95 26 -186 -201 -89 -121 232 105 340 118
3287A18k63K38P4l15k7j14M25o7k51L35j68p6J74k28j39J37j91K84n1j08K03o1
$$ 118 -145 93 167 -148 -175 -289 136 69 -182 153 -15 -91 83 -145 -284 -147 -338 -54 -105 -213 -10 -71
3309g1J09Q4l48K49K21l29K02m6l12M56l68J38K56l27L56l09lJ29Km6K47k75K31
$$ -71 38 122 -226 23 244 -85 117 71 -241 215 -153 -15 241 -86 270 -39 -42 87 89 43 290 15 246
3332B46mm97M88k74j24L13j11qj27j95L34L0q6J01j68M8J55k59Oj09o2O45l25
$$ 246 242 -255 233 -41 -165 148 37 29 -98 -293 41 71 -15 86 -82 -34 121 -138 -132 -241 -303 342 17
3355A7k49R2Q0j00L0p7K88p5j81L58m82L48Qk59J45j18J4K96r9j66j99K44J64
$$ 17 -232 -140 -60 -160 -130 -207 81 6 -175 183 -299 49 57 -202 -57 -175 -161 135 36 -130 -329 -85 79
3378G9o0K8j9K85l72K3j22L02P1o84N98k98K36K95n33M00K3j61J86l92J16K78
$$ 79 19 47 28 313 -59 -36 -158 144 215 -469 129 -169 67 362 -171 229 252 91 277 -115 1 279
3400B79k60J08j03R4J01j39j37J52j79L4N01o33L41n7j41R1K1l08J16J23j55J53
$$ 279 19 127 24 118 219 80 -57 95 -84 -50 451 -182 159 102 -39 52 73 -235 -119 4 -151 2
3422Bl7J67r3n4L5l19Q7Q5j31P4K90k82R3k31L78j43J0J98j24k68J52L6k52L89
$$ 2 -35 132 39 -15 20 -299 -212 -127 -258 -184 106 -176 -83 -314 64 -79 -69 129 5 -263 -111 -75 -327 62
3446F2k20N6R4k22K16N0n5L25k77L8q2j69K32j38R4m6Jj71K91k1j55N7o0J78L7
$$ 62 -158 -102 -8 -230 -14 36 -19 306 29 67 -15 -184 48 -90 4 -42 -41 -212 79 58 -97 -40 -100 78 115
3471A15j20P2j3K7p1j18O6m8q3M44l98K9K88o9R6j40k37N7J93M4Ol58K94O9m24
$$ 115 -5 67 54 81 10 -108 -42 -90 -173 271 -127 -98 190 121 217 77 -160 -103 90 134 140 -218 76 145 -279
3496b79L33J33m04K44n1Qn1O3k3R3k77J83J8j51L04r8J63k76N5L0j47R3J66l25
$$ -279 54 187 -217 27 -24 -16 -67 -4 -27 66 -211 -28 -10 -161 143 45 208 -68 -13 17 -130 -37 129 -196
3520a96M94j90m40P7N21l52k9K24n0K8l45M88nl61J13K61j96O9k87K26J08k93
$$ -196 298 108 -332 -255 266 -86 -115 109 59 87 -258 230 225 -136 -23 238 42 111 -176 50 158 -135
3542a35K00j01j79L74O5k17L04k62J09q6N2K27l68j93L68j70M0n6J46j02m4k81
$$ -135 65 -36 -215 159 224 7 311 49 158 72 124 351 -17 -210 158 -12 28 -28 118 16 -28 -309
3564c09O35l39n6L81m75L98k00k4J71j85n9J11l49M98J9n6l1k57K2L24l69J0K13
$$ -309 326 -13 -69 312 -163 235 35 11 182 -3 -62 49 -300 198 217 161 130 -127 -105 219 -150 -140 73
3587G3j96p8J28q5K10J53j16l5j91L03l38K14j31j30K6L6L44k32R0J8p9k60R9
$$ 73 -123 -201 -73 -158 52 205 89 54 -137 166 -172 42 -89 -219 -193 -157 187 -45 45 63 -16 -276 -177
3610a77J05R9o9K75k32q0O7P9k85N31j59O8k33n0N7O6m2p7J61l5j7m9j16K15r3
$$ -177 -72 27 -42 233 1 -79 -12 67 -218 313 154 222 -11 -61 -4 62 20 -57 104 69 52 3 -113 102 9
3635Ij05M9K68l18K38r7j3o1O5J69k72L4J65l36m0L42j56J81j45q6K3K37k62J23
$$ 9 -96 -47 221 -97 141 44 31 -30 35 204 -68 -34 131 -205 -245 97 -59 122 -23 -109 -86 151 -111 12
3659A2jk9MJ01Qj18J8j33K76k10J42oK3j47J46O6j65r1R1j55J66K5q6K3J04L2
$$ 12 11 -18 -14 87 95 -23 -5 -138 138 -72 70 64 87 -60 86 152 -13 -104 -13 -168 -2 23 -63 -40 64 96
3685I6M7k07J36r6j00J56k02P5N5J37N6l4l17K44J00j61K11k15l8O6j30L59l38
$$ 96 143 -64 72 -24 -124 32 -170 -95 -40 97 153 119 -198 46 146 -15 196 -19 -57 9 -121 238 -100
3708a00Q9J58j13j81K06N9o2j4p6K8P5k37q5K71K32m25J56L13l66q2p0K4L51k63
$$ -100 -11 147 34 -147 59 118 56 42 -34 -6 69 -168 -253 18 250 -175 -19 294 -72 -154 -224 -200 151 -112
3732a12J17j4j9j61L56J4k36O3j0J20j10j12J97k64L6J62j76P8J9J31O4l02J09
$$ -112 5 -9 -28 -189 167 181 -55 8 -2 118 8 -104 93 -171 -135 27 -149 -71 -52 79 143 -159 -50
3755e0M7o6J54k85J12K19k55K42L5l62N1K23k19K34j37J36J02l25J24J6K3j28
$$ -50 -3 -69 85 -200 -88 131 -124 118 153 -209 -158 65 -154 80 -57 79 181 -144 -20 -4 19 -109
3777a09K27J67k84Lr1N22m82j1P2j59J38j8j3K46j90J78O1l41M00j28k96K5o6
$$ -109 118 285 1 4 -87 435 -47 -58 14 -145 -7 -25 -38 208 18 196 257 -84 316 188 -108 -83 -149
3800a49J5P8k09J46j10J06L25l98o8M34m42M48k09j89N17m02Q4K33m00P2m2J22
$$ -149 -134 -56 -265 -119 -229 -123 202 -196 -264 170 -272 176 -33 -222 295 -107 -23 210 -190 -118 -160 -38
3822c8O6j66Q9J5m7J80q0l50K17k0K4N8k46K24J49l48J48K12k5k20J06J89j68
$$ -38 28 -138 -49 -34 -81 99 19 -331 -114 -134 -110 -52 -298 -74 75 -273 -125 87 62 -158 -52 137 -31
3845c1KL4K1m6J29k6o6j0k24M64j38l2J1j90J52J4j47J4L56l14J44j57k33J99
$$ -31 -29 5 26 -20 109 83 17 7 -217 247 109 77 88 -102 50 64 -83 -69 287 -27 117 -40 -273 -74
3869g4N5K97n05L04j14Q7N8N7J3k19rJ1L7R0j63R9j0j00K40j84L9m6j55L09j99
$$ -74 -19 278 -227 77 -37 50 108 165 178 -41 -50 -39 -2 88 -75 24 14 -86 154 -30 9 -37 -192 117 -82
3894h2q8M30m00K56M5j52k2J26l05K46k09J78L06m23q5J46j24J00M6j7M1J66j8
$$ -82 -170 260 -140 116 161 9 -13 113 -192 54 -155 23 329 -94 -179 -33 -157 -57 -11 -28 13 179 161
3917A61j01k54K47p6M4p1Q7K27K0m15K36Mk83K54m36L31MM3N7k67J99m9O9j2n1
$$ 161 60 -194 53 -23 21 -50 37 264 284 -131 105 109 -174 80 -356 -25 -21 22 79 -188 11 -38 31 19 -32
3942c2P1J81j48J4q4k3J08O5l23j40L21jk1l8j2J38p0n9l6J18j39L0j83oJ84p3
$$ -32 39 220 72 86 2 -21 87 152 -171 -311 10 9 -12 -50 -62 76 6 -53 -89 29 -110 -80 -263 -269 -85 -158
3968a58J70k7o1J05j53lK41l04L08j01k18K33j71K55j35n4J35j95K41N1k52J65
$$ -158 12 -15 -76 29 -124 -127 114 -190 118 17 -201 32 -139 116 -19 -73 62 -133 108 159 -93 72
3990G2r0j85K01k21J33L28n37K13K87j57m9k54J53K11k36J54Q1l7PJ35k54M8L9
$$ 72 -18 -203 -2 -223 -90 238 -299 -86 201 44 -5 -259 -106 105 -131 23 104 67 74 209 -45 3 42
4013D2P8J81k98J3o0J5n2K53r4k44K69l12K16j55M30l61J20q9J08J0l9o2k33M06
$$ 42 120 301 3 16 -44 -29 -81 172 78 -166 103 -209 7 -148 282 -79 41 -48 60 70 31 -31 -264 142
4037A42l85M13r3k10N7J60l6L0qj25K53m44J91p8L3P9l57M77J1l7q4j60Q1L3j31
$$ 142 -243 170 77 -133 -76 84 48 78 70 -55 198 -246 -55 -133 -100 -21 -378 99 110 73 -11 -171 -90 -57 -188
4062a88P7K99k66L18k84p3M6K34m2j00m6n0M19m96K72m2J19p1j75R0M2k6lj81
$$ -188 -111 188 -78 240 -44 -117 -71 163 121 21 -25 -75 344 -152 120 78 197 126 -49 41 83 57 54 -127
4086a27J5M71l97m9k08K81J28K39m58R3K84m02J28Q4j53MJ31O8j88J97l4o1k18
$$ -127 -112 359 -38 -87 -295 -14 114 353 -105 -12 272 -130 -2 82 -71 -67 64 132 -56 141 107 46 -172
4109a72K34j4j27r5J1L4m3J1M3j0l5L55l52L05k04Q1j24L57j68j33J0J80l28k0
$$ -172 62 48 -79 -174 -163 -129 -172 -161 -118 -128 -163 192 -160 145 -59 22 -102 255 87 -46 -36 144 -184 -204
4133b04K19K0M4j83J87l13K66k08P6J89k21K56k60j21L17j97J03J68J5j80l2Q2
$$ -204 15 35 79 -104 83 -230 36 -172 -96 93 -128 128 -132 -253 64 -133 -30 138 153 -27 -59 23
4155B3j43M3J05k20K71K09l30j6L9j45L34m9m4L0n0J52k05Q6Q7p0l5m9k03K5K78
$$ 23 -120 -77 28 -192 79 288 -42 -58 -19 -164 170 121 77 107 57 209 4 90 177 107 72 23 -180 -155 123
4180A23j81J47k98K7J74l5K2j29K09j82N3L02k58r1K29J23l40J98m3k43O1j08
$$ 123 -58 89 -209 -182 -8 -43 -21 -150 59 -123 -70 232 -26 -117 112 235 -105 93 50 -193 -132 -240
4202b40K34k71L7J98M1qq9K04k37O3j52K05R0j05J15o7k46K13P1k74k5J59J22
$$ -240 -6 -277 -240 -42 -1 -9 -98 106 -131 -68 -220 -15 75 -30 85 18 -228 -15 56 -218 -243 -84 38
4225C8l0LoR2l62P1J53k7J4J27k51K13j70p1K60o3k15M0K33k25J70K07p9p0k59
$$ 38 8 11 5 97 -265 -194 -41 -68 -54 73 -178 35 -135 -206 54 -9 -224 -184 49 -176 -6 201 122 52 -207
4250b07J85J52j54J93k43P2r4m9K61j88J05l07K21O6j14J02k8K32k97j46lJ37
$$ -207 -22 130 -24 169 -74 -2 -96 -145 116 -72 33 -274 -53 13 -101 1 -27 205 -92 -238 -241 -104
4272a04P3q6j00J31J28M8j74K2K35j70K2r4Q6L6Q1j48nq6K0J48o4R5J6j99j3L61
$$ -104 -31 -117 -217 -86 42 90 -84 -62 173 3 25 -69 17 53 134 -14 -19 -105 -85 63 -1 94 110 -89 -102 259
4298B59j32j42j03K43k1l38M82k72j24J17J24J82k24nK21k05j76L58m73L31J96
$$ 259 127 -15 -118 125 104 -234 248 -24 -148 -31 93 275 51 46 267 62 -114 244 -229 102 298
4319B98k64J33K2l01K72k44q1l5L46j64J06k17J52Q3J14k78K11j12k84N02l30
$$ 298 34 167 189 -112 160 -84 -165 -200 146 -18 88 -129 23 106 220 -58 153 41 -243 259 -71
4340g1N1n5n3J01P9R9j24l8j11J3oRM7j05%J31J5j21L0K21k31O1L4l50M33P2k5
$$ -71 -20 -75 -128 -27 52 151 27 -11 -122 -109 -115 -106 -59 -164 -164 -33 -18 -139 -109 112 -119 -58 -24 -374 59 131 106
4367A06j91K04l50K14J01N1o9o7K33l14J96l7p1K70k59j1k0LL90l67j97K36j80
$$ 106 -85 119 -231 -17 84 135 66 -1 232 -82 114 77 6 276 17 6 -14 -11 379 12 -185 51 -129
4390a29O3Q7q3J03p7j2L8kj7k0P6j73K78k15K23M6k70l7l2l1J63j0R2k92L57k27
$$ -129 -66 21 -62 41 -36 -48 -10 -12 -29 -49 27 -146 132 -83 140 186 -84 -121 -153 -184 -21 -31 61 -231 126 -101
4416a01q6l0K13j37J92j00J5o5lJ9J68o2o6j07j67L83m43L00j93L51j99J04N0
$$ -101 -187 -217 -4 -141 51 -49 -34 -99 -102 -83 85 23 -43 -150 -317 66 -377 -77 -270 81 -118 -14 36
4439C6j37Kl7J06pK99k00j4r7J88j26J28N5m90K74K7J8L1P4M2l9j37r4J65L4J35
$$ 36 -101 -99 -136 -30 -37 262 62 48 -49 139 13 141 196 -294 -20 7 25 56 130 172 133 -4 -98 67 101 236
4465B36l87K63l2k39J99O2L8j41k0j20J0K31L0j64Q7j50J33j41J68j91K93k91
$$ 236 -151 112 80 -159 40 102 140 -1 -21 -141 -131 100 130 -34 53 -97 36 -105 63 -128 165 -126
4487a26J62q3M2k65K74j17K49j11j71K11q8o2K33k97J50J29l44J07o0Q9L2o1K22
$$ -126 36 -47 -5 -270 4 -113 136 25 -146 65 -23 -85 148 -149 1 130 -214 -107 -167 -78 -46 -107 115
4510A15j14k11J09K21k10L27k01k10J48j60n8K56O6j14J35j87J63J7k77L56j86
$$ 115 1 -210 -101 120 -90 237 36 -174 -26 -186 -244 12 78 -36 99 -88 75 92 -185 171 -15
4531a5M6J03q8Q0l00K98J11l67K16N7j64J30j74J6o3K88o9m8k2J98q3k07K47k01
$$ -15 31 134 46 126 -174 124 235 -132 84 141 -23 107 -67 -51 -114 174 105 57 35 233 150 -57 190 -11
4555a1j1j5p2J15P7j74J54k00J3J42j06K13p7l25L60j92J40J57k44P5j22m0J27
$$ -11 -22 -37 -109 6 83 -91 63 -137 -124 18 -88 125 48 -277 83 -109 31 188 -56 19 -103 -143 -16
4578a6K24k72mO3q2n2l4MJ61j31L5JJ82J34k39k7L43l28j02J79j57J93k34J76
$$ -16 208 -64 -68 -5 -87 -139 -173 -169 -8 -139 -104 -103 79 213 -26 -53 290 -38 -140 39 -118 75 -159 17
4602A7rn3J26j67K80j26LR2J06k53k1K41l71L61j02m2MJ81k89JL3n3M21m57p2
$$ 17 8 -45 81 -86 194 68 71 163 269 16 -5 236 -135 226 124 82 86 267 -22 -21 12 -41 380 -77 -149
4627a49K20l77L84j54k44J27L44R7l97J03J45k88L26j73Q6L1m4r9P9m0n0J66J5
$$ -149 71 -306 78 -76 -320 -193 151 248 -149 -46 99 -189 137 -36 50 81 37 -62 17 -23 -73 93 108
4650A08k28J15l3L2n8k4M8Q7j15J93m12K01J20J45r3r6q1q7LK18P3k51J24M9N2
$$ 108 -120 -5 -38 -6 -64 -88 -40 47 -68 125 -287 -86 34 179 86 -10 -91 -178 -175 43 116 -135 -11 38 90
4675I0Jj55K25j19k05L4O2J03j65J22J61j66L6j70J30p8P1J33n4l5r4O7J1R1k33
$$ 90 91 -64 161 42 -163 -129 -67 36 -129 -7 154 -12 24 -146 -16 -94 -23 110 56 21 -73 -6 5 96 -137
4700a37Q0J59j26k8K57r5j23j22L12j79o5Jk1l0J09L9j4j08J82Kj09j83L51J26
$$ -137 -57 102 -24 -52 205 110 -13 -135 177 -2 -67 -66 -87 -117 -8 31 17 -91 91 93 -16 -199 152 278
4724B78m14mJ06J32P0j63k04J09J18Q2k60K10j22j16J91k66K73o0J64q0k1j0J06
$$ 278 -136 -140 -34 98 168 5 -199 -90 28 110 -150 60 -62 -178 13 -253 20 -40 124 44 23 13 119
4747A19p4P0Q5l97L14j65k96K01J00rO0N7jr8J85j85J00j88J34o4N0j34J45J21
$$ 119 45 115 200 -197 117 -48 -344 -143 -43 -52 8 65 64 -34 151 -34 66 -122 12 -52 -2 -136 9 130
4771A30j67P8r1R0j04m1J94M2j49J29Qj46o6J83n9Q1k15J01j17L63l72N2N1Nj27
$$ 130 -37 41 -50 40 -64 -105 89 131 -18 111 119 -27 -93 90 31 112 -103 -2 -119 244 -128 -76 -25 -20 -147
4796a47J38P5l5j6r9o1J95j18j35K63J5J13L0r3k51j05K34K94k81m8J10o9k9J15
$$ -147 -9 66 31 15 -84 -145 50 -68 -203 60 75 188 218 125 -126 -231 3 297 16 -32 78 9 -20 95
4820I5J5k39J11J57O1J5j34j63M11m75L7J82r8J64j35P0k63M7J32o2k8K05j48
$$ 95 110 -129 -18 139 200 215 81 -82 329 -146 -109 73 -25 139 4 74 -189 -142 -10 -72 -100 105 -43
4843d3j9qj75L16J29m71K11J39O8q7m09L91P4K5k13R4j97J09P6k8j20J13K17m0
$$ -43 -62 -70 -245 71 200 -271 -60 79 147 60 -349 42 116 141 -72 22 -175 -66 10 -18 -138 -25 192 152
4867A52p9J37p4k27j18J39j19P7N1J26KJk1q5P4R8l03K26Jk23R9K42l36J20K29
$$ 152 73 210 136 -91 -209 -70 -189 -112 -61 65 67 68 47 -38 36 134 -169 57 58 -165 -66 176 -160 -40 189
4892A89k16J06j47J51k17K27N9N4l42L63m27J90K15j47J5j40j0K11k50J11K2N7
$$ 189 -27 79 -68 83 -134 93 152 206 -136 227 -200 -10 205 58 73 -67 -77 134 -116 -5 17 74
4914G4j03m9J76j65J32N3m18M32j60K60J1k72l22K78R0o9J96k67o2M13j46l09
$$ 74 -29 -78 98 -67 65 118 -300 132 -28 232 243 -29 -351 -73 17 -52 144 -123 -185 228 82 -227
4936b27J89L2m8R2q0p1L51n28N49k29P4j83r8L8r8L57j18n1P6R2j66o7M2J73j52
$$ -227 -38 -6 -54 38 -42 -113 238 -290 259 30 104 -79 -177 -139 -237 120 2 -49 27 119 -47 -114 -72 101 -51
4961e1P6k04K20l1LMK22j75M8j23J61j26P5j45p8J55j05J33j3l27Q9L05P3j28
$$ -51 25 -179 41 10 13 17 239 64 112 -11 150 24 99 -46 -124 31 -74 59 46 -281 -192 113 186 58
4985E8Rr5O3j00K1K41n4k73J54k04n3m3L55J28k53J50J11l21j34L46J06j58k91
$$ 58 67 -28 35 -65 -44 197 143 -130 24 -180 -233 -276 79 207 -46 104 215 -106 -240 106 212 54 -237
5008b37L50n2k95J54J25l4J35j79p2L4j2k5Q2O0o1p3r5K64j61K55l18pJ79oj3
$$ -237 113 61 -234 -80 45 11 146 -33 -105 -71 -83 -108 -26 34 -27 -100 -195 69 -92 163 -155 -162 17 11 -2
5033bm6P1j2k03K97p7k2j71J29P2m8K79k09K47l68J83J82k62j19K18j73L2j81
$$ -2 -48 23 11 -192 105 28 6 -165 -36 36 -12 267 58 305 -63 120 302 40 -79 139 -34 -2 -183
5056a83J4J18M5J26j93oOP6J05N1l1Q2j34k1k1j31m7j17M59j33L8r8J36q3n1j
$$ -183 -169 -51 -6 120 -73 -79 -73 3 108 159 128 210 76 55 34 -97 -144 -261 198 65 103 5 141 58 7 6
5082FQ4j2j37J69J32n09K54m9P4k06J80q9r9M00k04N7o1k8r6L48l46J40O9j72
$$ 6 90 78 -59 110 242 -267 -13 -62 12 -194 -14 -103 -202 198 -6 51 -10 -38 -134 214 -132 8 77 -95
5106i5K96k09J53r4j82K06r4m5K73rl06L13j73Pj90J09n8rJ67k44q0K63K0k07
$$ -95 201 -8 145 51 -131 75 -19 -64 209 200 -106 207 34 41 -149 -40 -98 -107 60 -184 -264 -1 19 -188
5130a88K09N5r0K59l17Q1qLN0J1j33J65r0p5J26K03q5l05J6J62O7j91K00l82J90
$$ -188 21 76 -14 245 -72 9 1 4 54 65 -68 97 7 -68 58 261 176 -129 -113 49 116 -75 125 -257 -67
5155f7M1J27K35q2k45P2o8J03j56r1K16j91J05k26J83j40J66J76j91J22n3K2j23
$$ -67 -26 101 336 254 9 81 13 116 -40 -131 85 -106 -1 -227 -44 -184 -18 158 -33 89 36 58 -65
5178f5K2p7O8O9J19k57K51m4k55L67m35K26P9m5r2o4K04M3k43j53J87J65j03j17
$$ -65 -43 -120 -52 17 136 -121 130 86 -169 198 -237 -11 68 23 -69 -133 71 114 -129 -282 -95 70 -33 -150
5202a50K3L88j71j05pj29K43j47j56J10K23j21L10m98K14N4j77J25j21L19m40
$$ -150 -127 261 90 -15 -22 -151 92 -55 -211 -101 122 1 311 -187 27 81 -96 29 -92 227 -213
5223b13J56J03pJ36o1j32K9P3j49J20k03J78O1J01k21K09p6j13q3n9J77p8J1J73
$$ -213 -57 46 39 175 114 -18 11 84 -65 55 -148 30 91 192 -29 180 104 -9 -92 -151 26 -52 -41 132
5247A32p1j41M0q5M00l04J1j43l6K23o8MK20l58oJ33J42j15K3P0o4J76l77K00
$$ 132 61 -80 -40 -125 275 -29 -18 -161 -197 26 -42 -38 182 -176 -182 -49 93 -22 1 71 7 183 -194 6
5271Fp7M5k36L69P9q9j77P7n7k4p7J53k57L92r2j51M5j24L42l51K45k42R0K78
$$ 6 -71 -26 -262 107 186 97 -80 -3 -60 -84 -161 -8 -265 127 35 -116 -71 -195 147 -204 41 -201 -111 167
5295A67l8j40qo0N9k7j17K64k04J0K16l14O5lR9j8K53m32J77J93L9j28L2J66k55
$$ 167 129 -11 -19 -79 -20 -47 -164 100 -104 -94 122 -192 -127 -130 -31 -49 204 -228 -51 142 181 53 85 251 -4
5320dn3j32K71M9j72k96L02l2R8P6j31L0NL9j93J98jJ1j35J15r2P9j48o7J68k06
$$ -4 -57 -189 82 131 -41 -337 -35 -67 31 107 -24 6 11 50 -143 55 54 65 -70 45 -47 32 -116 -183 -15 -221
5346b21L4L62l19k35L84J53j33O5j52J56R0j55j55K21P6j76KO5n7L6q3J85j93
$$ -221 -187 175 -144 -379 5 158 25 90 -62 94 184 29 -126 95 171 -5 -3 62 5 41 -42 143 -50
5369e0J45j59M9n6L67r7j25Jk77m2M69k56K4j14J14Q5l9Q7l87J25J42r4o0J01
$$ -50 95 -64 -15 -71 296 199 74 75 -202 -244 225 -31 -7 -121 -7 78 39 126 -261 -136 6 -88 -148 -47
5393d7l7n9K50j89j25K00o5K5m3m0K6j14K7K6J16o6Q0M4p9o9m5P8O2k87L89Qj0
$$ -47 -84 -143 107 -82 -207 -7 -72 -47 -90 -130 -104 -218 -191 -165 -49 -115 -35 9 -70 -139 -184 -106 -44 -331 58 66 56
5420E6j32N8N0R1j38o4J6N4n6N4q4j3Oj2J98j70O2j20J62L9l8p4K3Q3j6p5Mp7
$$ 56 -76 -18 32 123 -15 -79 -63 -9 -65 -11 -95 -108 -102 -114 84 -86 -24 -144 18 57 19 -55 -32 51 35 -40 -36 -113
5448a13R0J30K2l96L38j82L26k62K29j68p7J98j09Jm3N6K4j4o1Mn3Q0m9k3M35
$$ -113 -23 107 129 -267 71 -111 215 -47 182 14 -63 135 26 27 -16 40 64 50 -11 -7 -60 20 -29 -52 383
5473C83l27r5N7j11J38q1J73k43o0L2J78k33J95j18L1p3J77l02Q2K38Kp7M6j9
$$ 383 56 -39 18 -93 45 -36 137 -106 -166 -134 44 -189 6 -112 -81 -154 23 -279 -197 41 43 -34 12 -7
5497gj42n7K82M4K2k11o9l2Q3L34q9j44j57J99j90L26j83K3Q5k28QK56l9k44K03
$$ -7 -149 -206 76 120 142 -69 -138 -170 -87 247 158 14 -143 56 -134 192 9 32 117 -111 -103 153 114 -130 73
5522G3J14k26K69j70j89J75o7p5R8R6J6m6j71K18j25n4J89l55L49l72K33k7K62
$$ 73 187 -39 230 60 -129 46 -21 -96 2 98 114 68 -103 115 -10 -64 125 -230 119 -253 -20 -47 215
5545B15m07J00K88k90j35L47J02k60O4N7j65J84n2k25J27r3nJ43R0k11J41r1p
$$ 215 -192 -92 196 -94 -229 118 220 -40 24 81 -84 100 48 -177 -50 -143 -148 -5 85 -126 15 -76 -83
5568h3K3J90j68j28Q7L4K42j75m4J13J52j29l63K18K32r2o6Q1k12K94k07K00l54
$$ -83 -60 130 -38 -166 -79 -45 197 22 -22 91 243 114 -249 -31 201 109 43 124 -88 206 -1 199 -155
5591a55O0K14j28q3K28r4o0j83L6L17o1J16p9j21J74j40k8J02l2j9j37J80k84
$$ -155 -95 119 -9 -92 136 42 -18 -201 -165 152 91 207 128 7 181 41 13 115 83 64 -73 107 -177
5614a77m7J84K3j52L4K14k11K74q8o2J31K7l77J98O0l1m3J79j17n1m5Q6J44P4
$$ -177 -224 -40 -17 -169 -135 79 -132 142 54 -8 123 150 -227 -29 31 0 -43 136 19 -32 -77 9 153 227
5638B27m11L60l20M8N3r9L24j75J8k54J18k5M88k47o5j55J91l8Q4j87J54q4Q2
$$ 227 -184 176 -144 -96 -43 -142 182 7 25 -229 -111 -136 352 105 40 -115 76 38 122 -65 89 5 87
5661H7j31q5q2J46r0j2Q3J59m5j17P9Q7j69J4L06j54NJ24j21LR1j03M8j1j44j36
$$ 87 -44 -129 -211 -65 -155 -167 -84 75 30 -87 -8 79 -90 -76 230 76 81 205 84 87 178 75 123 112 -32 -168
5687a68L26M3m37l6L19l67L17K8k44Q8K05Oj04J39j07Q0j51j57K17N6r4P6r2J92
$$ -168 158 201 -236 -272 47 -320 -3 25 -219 -131 74 80 -24 115 8 88 -63 -220 -3 53 -41 35 -57 135
5711A35k44o0J80O1J9J22j36L0j67L29k95qP5k82L88j11j09J04r6J02J38r8q5
$$ 135 -109 -169 11 72 91 213 77 107 -60 269 -26 -34 41 -241 147 36 -73 31 -65 37 175 77 -8
5734hMq4J69l02M72l47K32k33Q4j47K91J2l50K66q9J21j60O2J60q2p9k31L50r1
$$ -8 -4 -88 81 -221 251 -96 136 -97 -13 -160 131 143 -207 59 -30 91 -69 -7 153 71 -8 -239 111 20
5758B0j05l6J06k0R0q2QRr9J86j20j27L10k44J46P5j12j0k5J28j3M8p5q3RJ98
$$ 20 -85 -121 -15 -35 55 -27 -19 -10 -109 77 -43 -170 140 -104 42 117 5 -5 -30 98 85 133 58 -25 -16 182
5784A82k32J34j45J58k01J42k49K18Q9O0j31q9K87k24o9J58l11K90j28J66j53
$$ 182 -50 84 -61 97 -104 38 -211 7 96 156 25 -64 223 -1 -70 88 -223 67 -61 105 -48
5805d8r5J56n6q1J98j13j46K33O9J44k05K29l06m9L3J07j44n3M8L19k38L0K7N5
$$ -48 -143 13 -43 -124 74 -39 -185 48 117 261 56 285 -21 -70 -37 70 -74 -127 -79 240 2 32 59 114
5829A14P8l6j30P6m2k59K85j00J68r9q5O6r0K05k10j6J08q6L5K33l03J21j51K80
$$ 114 192 156 26 102 60 -199 86 -14 154 55 -30 36 -54 151 -59 -75 33 -53 -18 215 -88 33 -118 162
5853A62k89K95j50p5J92j24K4k8p8L37j13j81J0O0M2l38L10K00k87k51K55O4l88
$$ 162 -127 168 18 -57 135 11 35 7 -71 266 153 -28 -18 42 84 -254 56 256 -31 -282 -27 37 -351
5876c51M55j89jJ33k18K63K7j77j31k9K74N7k86l0Q3pJ53J63r0j73K74j17l02
$$ -351 104 -85 -86 47 -171 92 119 -58 -189 -218 56 113 -173 -203 -120 -127 26 189 99 -74 200 83 -219
5899b19J88m8K25K14m53M44l99K7r9R6%J21j20j63L5J85J40k18M5R1jj27Pk9K79
$$ -219 -31 -79 146 360 -93 351 -48 -21 -120 -24 -24 97 -23 -186 -151 34 174 -44 1 92 91 -36 -29 -58 221
5924B21k18j0q7J70O2k22n9L91k09r8K41k39J45l6j02PK1j79Q1J56k7k37K89l5
$$ 221 3 -7 -94 76 138 -84 -143 248 39 -59 182 -57 88 52 -50 -43 -22 -201 -120 36 9 -228 61 26
5948B6o2n7O3j09O1J22l8p9l13L19n3J38J03k81N3Q8K85k88j01k22K07L36K0k79
$$ 26 -36 -93 -30 -139 -78 44 6 -73 -386 -67 -120 18 121 -160 -107 -19 266 -22 -123 -345 -138 198 218 -61
5972f1k04K03P5k8N0k52M1L94p3j22p8J44M6nl79K60qN2o9k8J99j42k69K42L1
$$ -61 -265 -62 13 -15 35 -217 -176 218 145 23 -55 89 135 130 -249 11 3 55 -14 -42 157 15 -254 -12 19
5997A9M2J19k13j97M35k03j35K7L67r1j24k14J54K8J26j92p5P7J82o5j01m1K6
$$ 19 61 180 -33 -230 205 2 -133 -106 261 170 46 -168 -14 14 140 -52 -127 -50 132 67 -34 -75 -49
6020d9K03l26K01j10Q9J61j0j58P0K11k33l45L32k94K92j80J20j13q2Q0R8N5J72
$$ -49 154 -172 29 -81 8 169 159 1 71 282 49 -296 36 -258 34 -146 -26 -139 -221 -141 -43 12 184
6043A84j16O7j5m13M36j86kR0PK62j45k94J11j51P3m8K16l44J95Q1J43j71R6L2
$$ 184 68 135 120 -293 143 -43 -45 45 52 314 169 -125 -14 -165 -92 -140 76 -268 -73 8 151 -20 76 108
6067A08j79j88K64N4l45o5N39k78o2M9K7O9J06r3L3k23J40K44j39j78J79m9k04
$$ 108 -71 -259 5 59 -286 -351 188 -90 -152 -103 -76 -7 99 6 39 -184 -44 200 61 -117 62 13 -191
6090a91K4J30m7l6J72Q2l9n0j0l16K55J14L3j71K00N3k60J39R1j96J22J58q9P2
$$ -191 -167 -37 -84 -120 52 134 95 45 35 -281 -26 88 121 -50 150 203 -57 82 173 -23 99 257 168 240
6114B40n90M63l03K91j86R3P4k5n3j3Q1L5k6o6j84J99L1k99J48J16r3J21j04J34
$$ 240 -350 113 -190 101 -85 8 82 57 4 -9 72 107 81 15 -169 30 61 -238 -90 26 -67 54 -50 84
6138H4J65k73J56k84L61l34O0R3J11j39j5L39n08K32q9r1P2K04k87J61m06L68
$$ 84 249 -24 132 -152 209 -125 -65 28 139 0 -15 324 -184 48 -41 -132 -60 144 -143 18 -388 -20
6160b0j25J13m3k7J3J42M0k66M06j34j1K14m55rK71k50M36j57m7n4J03k32J2r5
$$ -20 -145 -32 -75 -102 -89 53 93 -173 233 99 88 302 -153 -162 109 -141 295 138 91 37 140 -92 -80 -175
6184a75K08J42j16k0J2O5j74j91K63J18k24K13j6j75L60j91K2k42J56J6J32k53
$$ -175 33 175 59 39 51 116 -58 -249 14 132 -92 121 105 -70 290 99 121 -121 35 51 183 -70
6206g0n1J05K4j81J40J3K4pk5J20nj59m1J21j09K59p7k38K64P8j43Kj4N2l88M28
$$ -70 -121 -16 8 -173 -33 -20 4 -3 -28 92 87 -72 -113 8 -101 158 81 -157 107 185 42 44 30 82 -306 122
6232A22j06j56J61J13k02J88j58J33r1J72j61o3J4J07j31Q0k3j6J37k35M3J13
$$ 122 16 -140 21 134 -68 120 -38 95 4 176 15 -48 -34 73 -58 22 -1 -17 120 -115 -72 41
6254D1J33k63J31r7q4J43j33O1R4kk46J96KM1J87k37J5J03k36J71L3J59j14J40
$$ 41 174 -89 42 -55 -139 4 -129 -68 26 24 -222 -26 -24 17 204 -33 -18 85 -151 20 53 212 98 238
6278B38j32M3M0j59p0Nj29J13K39l07O2K3J09k50M77l43J30O1o0l1O8l3p0m3J78
$$ 238 106 149 189 30 -40 -35 -164 -51 188 -119 -57 -34 75 -175 302 -41 89 150 90 59 127 94 24 -19 159
6303A59j45k43L01j27p1J24J7k8j49Q7oJ45mk16J02J79j85K17l76M25j45j55j04
$$ 159 14 -229 72 -55 -126 -2 15 -13 -162 -75 -81 64 60 -156 -54 125 -60 157 -219 206 61 -94 -198
6326a98L95j85j28j57K57q2J43J27k05m4J32Kk3J31r4O7l39K19j3m4j16K82q1
$$ -198 197 12 -116 -273 -16 -98 45 172 -33 -77 55 57 34 165 71 138 -201 18 5 -39 -155 127 46
6349D6J10p4j69J30j07M5K37k6j20P9N1l42J21k90O23l0k35n8j02O6kJ42j37K69
$$ 46 156 82 -87 43 -64 -19 218 192 72 151 202 -140 -19 -309 314 284 49 -9 -111 -45 -47 95 -42 227
6373B27k26k85K85j18O4L0J45m9O8n2Nk10J33N9q7O1r1J50j65K24k47K55k80J02
$$ 227 1 -284 1 -117 -53 -23 122 73 141 89 94 -116 17 76 -11 50 -41 109 -56 168 -79 176 -104 -2
6397bj29q0R1J5R1j29L1J33J62l64J16j59R9M5n6J83k01K62j19R4Kk57J87r2J29
$$ -2 -131 -211 -120 -105 -14 -143 -112 21 183 -181 -65 -224 -125 -80 -136 47 -154 108 -11 83 85 -172 15 -77 52
6422E2l5L7n7k0r7K80k14J02j76L16k61RK54k52J62j6j88J70%j00OJ81Q6l61J58
$$ 52 17 54 -3 -23 -120 160 -54 48 -128 188 -73 -64 190 -62 100 84 -104 66 66 -34 -28 153 239 -122 36
6447C6Rk06Q7mK30n5K9o9j05k5Q3jR3J0j47J82j57r0Q8m8K37k04j84M9J88j28
$$ 36 45 -161 -74 -78 152 97 126 57 -48 -73 10 9 102 112 -35 147 -10 -100 -12 -60 177 -27 -211 -162 26 -102
6473a02J02j90K65J57j57P6k52J61p5R2j2q5K0mJ77k0l18L34M7j68k04k8M56j66
$$ -102 0 -190 75 232 75 151 -101 60 -15 77 65 -20 0 -4 173 153 -165 169 216 48 -156 -184 272 106
6497A06L7L5k68J56M2k18N5K2J65MQ8j75j12J75J24J19l68J37k24K22k55P4o3
$$ 106 143 178 -90 66 108 -110 -55 -33 132 136 224 49 -63 112 236 355 -13 124 -100 122 -133 -59 -122
6520a22J58P4q2K3j01J1Lm2l5J26k5J22J7M6l97J46Q4J80j87q7K08j32j48J44
$$ -122 36 110 28 51 -50 -39 -36 -78 -113 13 -12 110 127 173 -224 -78 6 186 -1 -88 120 -12 -160 -16
6544a6J39k42L3o3k7J80j33K26j79J65j02p0p0k8M08l11Q9o8J43j42K18k84Q9
$$ -16 123 -119 -86 -149 -176 4 -129 97 -82 83 -19 -89 -159 -187 221 -90 -1 -69 74 -68 150 -134 -45
6567d5J07j74L51k15O8R4l54J11K31n2j93L1j8Om4J49J70k36N2j62k25J70L27
$$ -45 62 -112 239 24 92 186 -168 -57 174 122 -71 -40 -58 -52 -96 53 223 -13 39 -123 -348 -178 149
6590A49O8k77R4J16m94J69L19Rl98K78m9Kj6m3j9R9m1K54K3k70P4j62K44l69L43
$$ 149 217 -60 34 150 -344 -175 144 153 -245 33 -16 -14 -30 -73 -92 7 -34 220 243 -27 47 -115 129 -240 103
6615A03j18O1r0J48j62K32k12rq0O8J38j18k92K21j3J34N4J1j71r0J77J90m31
$$ 103 -15 46 -44 104 -58 174 -38 -47 -127 -59 79 -39 -331 -110 -123 11 65 76 -95 -185 -8 182 -249
6638b49L92o4q6q3Q0L1Q6kj26L0n6K47j34m1k0K5p4J20R1m8m1R2j88j48K43k8
$$ -249 143 79 -7 -90 -10 21 107 105 -21 9 -47 200 66 25 5 30 -44 76 167 119 78 170 -18 -166 77 49
6664D9J35o1j71J72k34K70j3j17j31N6l8L8o2K80j19j8o7J14l31M02j93j42J11
$$ 49 184 123 -48 124 -110 160 147 30 -101 -45 -83 -45 -107 173 54 36 -31 83 -248 154 -39 -181 -70
6687g0J43j50K9mJ50k67J25kJ43K8r7J3n7j44K55k43O9Q7K59k62j23J12n9l0K01
$$ -70 73 -77 -48 -52 98 -169 -44 -46 97 125 28 41 -16 -160 95 -148 -79 8 267 5 -118 -6 -65 -95 106
6712A06m0j53R0oO6K7J21k56K20k50J30m7M6N5K0k30K12j86J2J51J30l58J75P4
$$ 106 66 -87 3 -3 63 90 211 -45 175 -75 55 8 54 109 129 -101 111 -75 -63 88 218 -140 35 109
6736A09K1L1l14R2J82O4l22lJ11j39J36OR3O5p2l20J97L11l82K5R1P1k45K06J8
$$ 109 130 161 -153 -61 121 185 -137 -140 -29 -168 -32 -26 67 132 60 -260 -63 248 -134 -109 -18 53 -192 14 32
6761C2j53j7m5K33J03k7k9j39KJ30q7M1j82L65k23l9R0j63K08j87n7M1J02j11
$$ 32 -121 -138 -183 50 153 126 97 -42 -40 90 3 44 -138 227 4 -35 55 -108 100 -87 -144 -103 -1 -112
6785a12K67r5j88J44Oj07J31J74l18K35k18L9n2j10L17k0m6N5J22j9j25K20m11
$$ -112 155 60 -128 16 22 -85 46 220 -98 137 -81 -42 -94 -204 113 93 47 102 224 205 80 300 -111
6808a11K38r8o9rj37K59l09O8J71l88O31k52L3K61j54r2M6K05k64j33J77n6J03
$$ -111 127 29 -40 -49 -186 73 -236 -168 3 -385 246 -6 27 288 134 42 88 293 29 -104 73 17 120
6831A20r9Jn0n8J27k20L00J3l25KJ48Lj03J61J41l86J74P9j56J14j84JM45l3k97
$$ 120 21 22 -28 -86 41 -179 121 134 -191 -189 -41 -38 -141 20 161 -225 -51 28 -128 -14 -198 -197 248 215 -82
6856h2K62k81J98n2NQ4j58J57k83O6R6L60k26j18Q6l43J64K36j45K80k23J89k41
$$ -82 180 -101 97 45 50 134 -24 133 -150 -84 12 372 146 28 114 -229 -65 171 26 306 83 272 31
6879C1J63j55m9j21J66N3J01l32J11q2L26p1k58k01L76kj70P0p6K39l28J29n8
$$ 31 194 39 -10 -131 35 88 189 -143 -32 -114 212 141 -117 -318 58 56 -114 -44 -120 119 -209 -80 -138
6902a38l5J37O6j02l0K16l21K74j05p0M3K22R5l04k14R3L17p8K6Q3k42j9oK08
$$ -138 -173 -36 30 -72 -102 114 -207 67 -38 -108 -65 157 252 -52 -266 -173 144 66 92 175 -67 -86 -92 116
6926A16m2J3J07l30J25j01m1J41K11k32j7J15L3o5J32j00k77J14K26j6k49M23
$$ 116 74 87 194 -136 -11 -112 -153 -12 199 -33 -50 65 98 33 165 65 -212 -98 128 112 -137 286
6948B86j38j29M5j33J95j20M4j51J17J72n04Q2K83M1l7J13m9r1j4j99j12K49K41
$$ 286 148 19 64 -69 126 6 50 -101 16 188 -316 -234 49 90 53 166 117 26 12 -187 -299 -50 191
6971A91k02j37O7j10J58K43l94K02l6k38L31o4q7l2K18K11l24KJ3J1r5m9L29r7
$$ 191 -11 -148 -81 -191 -33 210 -184 18 -18 -256 75 11 -76 -108 110 321 -3 -1 12 23 -72 -121 208 111
6995A11j05o2k31J87J80J63j53j58J26r9J57k64L28j62n7R2j81J98Qj18J97j46
$$ 111 6 -56 -287 -100 80 243 90 -68 58 -41 116 -148 180 18 -39 53 -128 70 78 -40 157 11
7017A1Q5r2P1o7j30J65k75J30J9J06O7k10J75j56r0J41J4L7l9o3K05o3k6J48k62
$$ 11 96 4 75 8 -122 43 -232 -102 -83 23 90 -120 55 -101 -191 -50 -36 1 -38 -101 104 41 15 163 -99
7042i9K10K30j22l22K11j92J99k64J73M2o5J0K7K1k13J81J62k95L66k94L3K02
$$ -99 111 341 219 -103 108 -84 115 -149 24 66 1 11 38 59 -154 27 189 -106 260 -34 -1 201
7064B01p5j42o2J44j23J78J76j72J01l56j57K73K97k29L4j3N5l0l03L57j56k5
$$ 201 126 -16 -78 66 -57 121 297 125 226 -130 -287 -14 283 54 88 75 130 100 -203 154 -2 -27
7086b7j12K53k40J06J06k01K39k7k59J34M7Mj7l9j3j57J18p8p2K93M3j04K29R9
$$ -27 -139 114 -126 -20 86 -115 124 97 -162 -28 19 23 6 -33 -46 -203 -85 -163 -235 58 101 -3 226 325
7110C25k83k04L22j78P3j33j02J92p8J82p6r2rj28J84O3R0m9l35K94o8m9k2L18
$$ 325 42 -162 160 -18 55 -78 -180 12 -66 116 40 -52 -61 -189 -5 58 148 99 -236 58 -10 -59 -81 237
7134B37p7k40J54k20K53j77l4L31j34J39k09J14l1pj26l5o4mL26n5J20k94J75
$$ 237 160 -80 74 -146 107 -70 -104 227 93 232 23 137 106 99 -27 -62 -126 -130 196 141 261 -33 142
7157A42r5n2K04l07J53n5J50k89l6L51j84J28k41K03k18R8J23j07j24J26Or1K69
$$ 142 47 -5 199 -108 45 -10 140 -149 -185 166 -18 110 -131 72 -146 -48 75 -32 -156 -30 -24 -115 154
7180A54j43k56K46K07r4j51J15k43K05o6L69j76l28J76j75J54r8J72l22J55J08
$$ 154 11 -245 1 208 114 -37 78 -165 40 -26 343 167 -161 15 -160 -6 -104 68 -254 -99 9
7201IP8j41K10k72J18M3j21M7j87R1J56O0o6k6j91L23j52K0J1M9j66k4K49j44
$$ 9 87 -54 156 -116 2 45 -76 -29 -216 -125 31 91 25 -1 -192 131 -21 -1 10 59 -107 -131 118 -26
7225b6j24P4q5P2P0L5K50l67O2k90L50kK8l6oL2m49M22r4R0J1Nj22q2L29M1k22
$$ -26 -150 -76 -161 -89 -19 16 266 -101 -39 -329 21 19 47 11 5 37 -412 10 -84 6 17 22 -100 -182 147 188 -34
7252c4OK01j72rJ5q2O0K38l59K00%j03j44M93l00Q4j57K8j15K27Q0O0k14j84L04
$$ -34 -28 173 1 -8 7 -75 -15 223 -136 64 64 -39 -183 310 10 94 -63 -35 -150 77 157 217 3 -181 123
7277A23j28o1J09J71k02Mr9P8Q2K8l21L27k91K63o8j60L97m60L29n0j22JP4J78
$$ 123 -5 -66 43 214 12 16 -83 -5 77 105 -216 111 -180 83 15 -145 252 -208 121 71 -51 -50 24 202
7301B02m00J20o2K86j09j01J64j86J18n5p9J68m4O6k71J53P6j6k85R5J76j00l8
$$ 202 -198 -78 -140 146 37 -64 100 -86 32 -23 -102 66 22 88 -183 -30 46 30 -255 -160 16 -84 -122
7324a22J20p9j67J97N0o0r5K40j25j9r4J68qmM4q5k57L33l6L1J54k29J45J4J8
$$ -122 -2 -81 -248 -51 -1 -61 -156 84 -41 -60 -154 14 6 2 46 -39 -296 37 1 32 186 -43 102 116 134
7349A34k44L02j08j07NK64j22k82J52m9q0K02l66M13P7l51J86J72k42J00M9jO5
$$ 134 -110 192 84 -23 -18 246 124 -158 -6 -55 -135 67 -299 114 191 -160 26 198 -44 56 105 104 169
7372A69j88o4K7KJ04K5k86L0J00q6J08J12l4O9q3l9J20k9k03K02J38k50J3RK5
$$ 169 -19 -83 -56 -54 50 75 -211 -181 -81 -167 -59 53 19 88 5 -34 86 57 -146 56 194 -56 -43 -34 -9
7397il0J46P6j96j85P9J00J41k63K82J7j28J78k28k93N00k68o5j07K43o7K75k47
$$ -9 -39 107 183 -13 -198 -119 -19 122 -141 141 158 30 208 -20 -313 187 -81 -146 -253 -10 -77 198 -49
7420d9J05j06J06J43l56OJ98j92o5M24l15j23M09l3j61j00K31oj38RP2j48m6K47
$$ -49 56 -50 56 199 -157 -151 47 -145 -210 214 -101 -224 185 152 -9 -109 122 116 -22 -13 59 -89 -135 112
7444A12j6k41J40j06K23l2m2j78Jj19L95k79o0K24j43K91k64k2K38j55n2K26j08
$$ 112 96 -145 -5 -111 112 80 38 -140 -139 -258 137 -142 -202 22 -121 170 -94 -116 122 -33 -85 141 33
7467C3P0k2l09K21J23k41J0q9J53j54K04J5N3n9r2K72j53NJ48m2j34J2j21J4L52
$$ 33 103 81 -228 -7 116 -125 -115 -204 -51 -205 -1 14 67 8 -84 188 35 40 188 146 12 24 -97 -83 269
7492B69j92j39J95k13j2l4r4J7M28K8j41j09J59K46n02k0J72q9O0J04j51J16k19
$$ 269 77 -62 133 -80 -92 -126 -220 -203 225 253 112 3 162 408 -94 -114 58 -31 29 133 -18 98 -121
7515a21K5L10k88j23K57n4q0N1j63q5K65J22j38K9r7K93j97M7J7K40l78J25N2
$$ -121 -96 214 -74 -197 60 6 -74 -23 -186 -271 -6 116 -22 7 -90 203 6 53 70 310 -68 57 109
7538A09j56J60o8j14M4J5J94k06J96K4j11Q3k58Q5j50K08P3M5l4o1r1J88l10J91
$$ 109 -47 113 45 -69 -25 -10 184 -22 174 198 87 170 -88 -3 -153 55 128 173 139 78 -13 175 -135 56
7562E6j67K58j95M1k5n5K6K89l9k31l1R9J44J8r9q7K01l26K86n1k09R6L48l23
$$ 56 -111 147 -48 -7 -32 -87 -61 228 189 -42 -73 26 170 188 89 2 203 -123 163 112 -97 -1 347 24
7586B4NL2l1k6j35J19J09%m6j4P7j61K35k69L4j44K06R8j77K26J1j85j62J86j60
$$ 24 29 61 30 4 -131 -12 97 97 51 37 114 -47 188 -81 -47 -191 15 113 -64 162 173 -12 -174 12 -148
7611a48j87K25K49k07KM4m8J58N4k69L14l81J44M7o0J32k87J79j57M1K06N0p4
$$ -148 -335 -110 139 -68 -66 -22 -70 88 142 -127 187 -194 -50 -3 -63 69 -218 -39 -196 -155 51 101 27
7634B7k3j36R8K13l22J75N7m0K1P1k34K92j10R3l86L41k18J36j54R0J43j61m7
$$ 27 4 -132 -34 179 -143 32 89 49 70 141 -93 199 89 182 -204 137 -81 55 -99 -9 134 -27 -74
7657g4K28o1k17j31K20J73k4J6k14J86l10J83J11j09l5K12r2j91K13j54JP6m5
$$ -74 154 93 -124 -255 -35 138 114 130 -84 102 -208 -25 86 -23 -58 154 62 -129 84 -70 -69 7 -38
7680c8j35J53M3oJ26n1l6j37oj45L15q9l1p7O8L67m04P8o9J64k07l1K79m05M64
$$ -38 -173 -20 23 17 143 92 56 -81 -87 -232 83 -6 -37 -114 -46 321 -83 -5 -74 90 -117 -148 131 -274 190
7705A90o5K1k21N4q3j11L13k04N5J08j40P1R2R9l11J50j09R1q7J02J35mj07j21
$$ 190 125 146 -75 -21 -104 -215 98 -106 -51 57 -83 -12 80 179 -132 18 -91 0 -87 15 150 146 39 -82
7729h2q9M5L9J73j73J12m0L4J03k04J87K4k73K53O3l17K5L18j56J08k12j2q7M4
$$ -82 -171 -126 -87 86 -87 25 -15 19 122 -82 105 129 -144 109 172 -145 -120 198 42 150 -62 -74 -161 -117
7753a17J46l9J71j80J3p3N2J59k02L8j33O7L09j67J37j01Mj21p4J17k16j43L62
$$ -117 29 -10 161 -19 -6 -79 -27 132 -70 -32 -165 -98 211 44 181 80 84 -37 -111 6 -210 -353 9
7776Ir5pK78k29L9j20K52j99j16K16N8k41L86l47J08J2P1L9j39j76L76k05J99
$$ 9 -86 -93 185 -44 -5 -125 127 -72 -188 28 86 -155 231 -116 -8 4 75 114 -25 -201 175 -30 169
7799A69j13J71q3m60K60p0O6K38k55R7j71P8J45m9J4j7jpm7O9l1J16j75J62k23
$$ 169 56 227 144 -316 -56 -126 -60 178 -77 20 -151 -73 72 23 37 20 19 12 -35 34 3 119 -56 106 -117
7824a17J92o6K66o8k31N5LJ0j05Q9K03l06QK34k67J30Mj8L1j32M6q5J91j53L47
$$ -117 75 9 275 207 -24 31 34 44 -61 28 231 -75 -67 167 -100 30 34 16 47 -85 -39 -124 67 -86 261
7849B61j18l61M0L38j43K2q0RP2N6J3L0l34O4L97k51j33J49n1o3J07j28j1P3k4
$$ 261 143 -218 -178 160 17 39 -41 -32 40 96 109 139 -195 -131 266 15 -118 31 -20 -83 24 -104 -115 -42 -66
7874f6p3R8J25R7j08k47K81j90Q2K22j44k51j20J81J67k60L5O3R2L6l49L59q3
$$ -66 -139 -41 84 181 73 -174 107 -83 -1 221 77 -174 -294 -113 54 -206 -171 -108 -16 20 -329 30 -53
7897e3O5j18J96k28J1J45r5L38l28K00j62M6j55L07l03J40k1j19K39j56j86J03
$$ -53 12 -106 90 -138 -127 18 -77 261 -67 133 -29 17 -138 169 -134 6 -15 -134 105 -51 -237 -134
7919a34rK39j51J07j6j04MK45j53j3qj43J61k77K82j45J27j45j7j0pK63OJ4r1
$$ -134 -143 96 -55 52 36 -68 -64 181 28 15 7 -136 25 -252 30 -115 12 -133 -150 -160 -167 96 102 116 25
7944B5o7M7k%q8J40k3r3J08P0k61l9J40J25kr8M0J7j83N3l7pn1J98p7J67j13j19
$$ 25 -42 5 3 3 -85 55 32 -61 47 117 -144 -183 -43 82 80 -18 22 39 -144 -91 -128 -135 -186 12 -65 102 -11 -130
7972a30K15k85j22L12N1J1p0KL1R8k17K7J11j68J69j91J38J32k89p3L22l45K44
$$ -130 85 -200 -322 -10 41 52 -18 -16 15 113 -104 -77 34 -134 35 -156 -18 114 -175 -248 74 -271 -27
7995b7j28Q7N0J04j50Q1R0L0m53L59L8j29j31K86l79L26q3J14r6Q0k50j28J64
$$ -27 -155 -68 -18 86 -64 17 107 137 -316 43 81 -48 -179 107 -272 54 -29 85 -11 69 -181 -309 -145
8018a45Q9o5K09j25R4m8o0o4J18r0J2O5J93j3j06j63K19q2k9m6n3K13k17J08l1
$$ -145 -56 -121 88 -37 57 9 -51 -115 3 -87 -75 -10 183 170 64 -99 120 38 9 -37 -90 123 -94 14 -17
8043a7kk76K02q8L45J0m05kJ07L11k13q4J28J26o2j54K26l24K44j6NL7m25J98
$$ -17 -19 -295 -93 -181 164 174 -231 -233 -126 185 -28 -112 16 142 80 -74 152 -172 72 56 61 98 -327 -129
8067a29j43K59j43MM30k25J31k09j33M8O2j0J68j48J4m3K49j81j2j33J52l5K06
$$ -129 -272 -13 -156 -152 278 53 184 -25 -158 -110 -48 -58 110 -38 -24 -67 182 1 -11 -144 8 -27 179
8090A79l67L28j03k11J31J38k4l7J50k26P2l9l5N5Jj90O8K93j11k28K09j35J46
$$ 179 -188 140 37 -174 -43 95 71 34 184 -42 30 -9 -44 11 12 -178 -110 183 72 -156 53 -82 64
8113F4k8k4k8L5Q9l53K45k98K56r1O4jJ18Q8k04R3l85K81Q3Nk95K95p2Mj47K67
$$ 64 36 12 -16 19 108 -245 0 -298 -42 -133 -69 -70 48 136 -68 25 -360 -79 4 9 -286 9 -63 -59 -206 61
8139F1J0q7O6j46J67n0r1K2Q3P7l9l57M69Q0j43n4p7O9Nm1P1p2q0J78k73L18k70
$$ 61 71 -16 50 -96 71 21 -70 -48 35 112 73 -284 185 265 122 68 -9 60 65 24 95 23 -57 121 -152 166 -104
8166a04%J86k21L08j26j15R1K01j08k7R6k23q9O1m4K83j10l9K35k30J53p4j90
$$ -104 -104 82 -139 169 43 -72 19 220 112 85 181 -42 -131 -70 -114 169 59 20 255 25 178 104 -86
8189h6k22K93
$$ -86 -308 -15
8191a5
$$ Imaginary data points
##PAGE= N=2
##DATA TABLE= (X++(I..I)), XYDATA
0@%%%%%%%%%%%%%%qJ6j6J6j6K4l2L2m0M8n6P2q1Q9j04J21j40J63j85K09k40K71
$$ 0 0 0 0 0 0 0 0 0 0 0 0 0 0 0 -8 8 -8 8 -8 16 -16 16 -24 24 -32 40 -41 48 -56 65 -75 88 -97 112 -128 143
36A43l04L40l80M26m75N29n90O54p23P99q83R76j075J184j304J437j583J744j926
$$ 143 -161 179 -201 225 -250 279 -311 343 -380 419 -464 512 -563 621 -683 754 -829 915 -1011
55a011K128k354K611k908L252l655M138m730N473o437P750r656J2708j8686N4607
$$ -1011 1117 -1237 1374 -1534 1718 -1937 2201 -2529 2944 -3493 4257 -5399 7309 -11377 43230
70D3230j09250N0252Q0499j11401R0033k9339l3454N4006m8659K0255J9499o6677
$$ 43230 -66020 -15768 64731 -46670 43363 14024 -19430 34576 -14083 6172 25671 -41006
82d1006N9149n230k5977K8768l9359J7395L0051m5624J6585l699j700K4787k6428
$$ -41006 18143 12913 -13064 15704 -23655 -6260 23791 -21833 -5248 -8947 -10647 14140 -12288
95a2288R918r19k9683M7990l822l6173J9809k275P454O417j9997J3133j0797J26
$$ -12288 -2370 -3289 -32972 15018 11196 -24977 -5168 -7443 11 6428 -13569 -436 -11233 -11107
109a1107K8658l1275o384L1690j0346o699m811J616J3493q388Q314o717k1104
$$ -11107 17551 -13724 -20108 11582 1236 -5463 -10274 -8658 4835 -3553 4761 -1956 -23060
122b3060L4567J534k4172J9886j4464q909L2384r139j0012Q074n415M748m254
$$ -23060 11507 13041 -11131 8755 -5709 -14618 17766 8627 -1385 6689 1274 6022 1768
135A768m095J3325q878L275J3112k4204l885J8589n080p74k270m841R080l009
$$ 1768 -2327 10998 2120 5395 18507 -5697 -9582 9007 3927 3153 883 -3958 5122 2113
149B113M31m253j5300K0660P192j7760Q920q798k796J7665j4676K904M467j1094
$$ 2113 2544 -1709 -17009 3651 10843 -6917 2003 -6795 -9591 8074 -6602 -3698 769 -10325
163a0325J9942j3523j1070K6699k1442K443K0910l0882J1263J4499j5762J3226
$$ -10325 9617 -3906 -14976 11723 -9719 -7276 13634 -17248 -5985 8514 -7248 5978
175E978j5075l342J9844j8865J5495L527l0646K5092M204j6050J3684j1429N293
$$ 5978 -9097 -12439 7405 -11460 4035 7562 -23084 2008 6212 -9838 3846 -7583 -2290
188b290R433j6970J3074l814o062K1591j8285m723J6826j3528J0991N040j7660
$$ -2290 7143 -9827 3247 -567 -6629 14962 -3323 -8046 8780 -4748 6243 11283 -6377
201f377R029J092n36J826j1001J1616J774r732J3705r150j0933J3524j022J33
$$ -6377 2652 3744 3208 5034 -5967 5649 7423 -2309 11396 2246 -8687 4837 3815 3948
215C948K8m763O946o449J96O170j2787J0000R590j5865K278J073p73Q996r939
$$ 3948 3976 -787 6159 -290 -94 6076 -6711 3289 12879 -2986 -708 365 -408 8588 -1351
230a351J50L927p474J2629l803j2903J2054m323l413R694q810k86N483j884l09
$$ -1351 -1201 2726 -4748 7881 4078 -8825 3229 -1094 -4507 5187 -3623 -3909 1574 -310 -619
245f19q657O595Q068j3331O429N029j3302P723M630n154l18l374O663J556o382
$$ -619 -9276 -2681 5387 -7944 -1515 3514 -9788 -2065 2565 -2589 -2907 -6281 382 1938 -4444
260d444N218n767J540J1971j2791j552R331p137N081K164o221L712k597K987K313
$$ -4444 774 -4993 -3453 8518 -4273 -5825 3506 -3631 1450 3614 -2607 1105 -1492 1495 3808
275C808j0659R080P382j1612L784k38n936Q033J057k314J88l414N291j496m883
$$ 3808 -6851 2229 9611 -2001 1783 1545 -4391 3642 4699 2385 2573 -841 4450 2954 -1929
290a929P137m220k288R336n918m146M902o45N77o68j899N07l33N222k692q984
$$ -1929 5208 988 -1300 8036 2118 -2028 2874 2229 2806 2138 239 746 413 5635 2943 -6041
306f041P287L010n842K514l15k586K025J790j275n640K105O442n169n33K346m032
$$ -6041 1246 4256 -1586 928 613 -1973 52 1842 567 -5073 -2968 3474 -1695 -2228 118 -3914
322c914K526J555l332J009j072K787Q53n687M516j53l450P625l627o242N457J042
$$ -3914 -1388 167 -3165 -2156 -3228 -441 412 -5275 -759 -912 -4362 3263 -364 -6606 -1149 -107
338a07P10p54k367K335j744J753K363o034L101N719n358j082Q99n05K929M20l96
$$ -107 603 -151 -2518 -183 -1927 -174 2189 -3845 -744 4975 -383 -1465 -566 -1071 1858 2278 1882
355A882l136l0O038l042l881M577n47o95K294j495j480j37K535J092l433L80J654
$$ 1882 -1254 -1284 4754 1712 -2169 2408 1861 1166 3460 1965 485 348 2883 3975 542 922 2576
372B576j141J743j444l372K626J270j361j214m04J434r91J07R00n209P78P167
$$ 2576 1435 3178 1734 -1638 988 2258 897 -317 -721 713 -278 -171 729 -4480 -3702 3465
388C465l526m270K816m98M77K00j334R23j610K679J444o123K590L905m543K558
$$ 3465 -61 -4331 -1515 -2013 -1536 -1336 -2670 -1747 -3357 -678 766 -5357 -2767 1138 -3405 -847
404h47l5m122L556R65K27j283k439L639n97j289L601m687J9O608m204k057K116
$$ -847 -882 -5004 -1448 -483 -256 -1539 -3978 -339 -936 -2225 1376 -3311 -3292 3316 -888 -2945 -829
421h29j73K698k017N39J503m674N742J361p203M182K080j435J678l644P31J905
$$ -829 -1002 1696 -321 218 1721 -2953 2789 4150 -3053 1129 3209 1774 3452 -192 539 2444
437B444r38K384l898k25M450m780K463J639n641K727J414n09p74l487N881j063
$$ 2444 1506 3890 -8 -233 4217 -563 1900 3539 -2102 625 2039 1530 756 -2731 3150 2087
453B087n389O157l578j468O538m256m49n45r16O599n799j015M962o405N215J645
$$ 2087 -3302 2855 -723 -2191 4347 91 -358 -903 -1819 4780 -1019 -2034 2928 -3477 1738 3383
469C383q706O161N0k904M475n767J925K566l859N225n153k133R162p129j17N667
$$ 3383 -5323 838 888 -2016 2459 -3308 -1383 1183 -2676 2549 -2604 -4737 4425 -2704 -2821 2846
485B846p079L494K676l778K256l441K916M532p355K914K089n274N352j79m025
$$ 2846 -4233 -739 1937 -1841 415 -3026 -110 4422 -2933 -19 2070 -3204 2148 1969 -2056
500b056K741m49J033L47l376K982l72j284L327m387lM834k641n23Q52j437J742
$$ -2056 685 236 1269 1616 -1760 1222 850 -434 2893 -1494 -1497 3337 696 173 1025 -412 1330
517A330l04K41r3k608L934O80m634L054M89k647L170p88j727K95M86J710k083
$$ 1330 1026 1267 1174 -1434 2500 3180 -1454 1600 2089 -558 2612 1824 97 392 878 2588 505
534E05j437L118k453J47K052l986M33K228j026K88k011M28K032k708K307n98l718
$$ 505 -932 2186 -267 -120 1932 -2054 -1621 607 -419 -131 -2142 -1714 318 -2390 -83 -681 -4399
551d399M885o91l344L666j935n23K841k851J793r23j220N465n224j223N920n625
$$ -4399 486 -205 -3549 117 -1818 -2341 500 -2351 -558 -1481 -2701 2764 -2460 -3683 2237 -3388
567c388K070L154n507L350l33j254M099n372J978L406n808N995j686n209Q768
$$ -3388 -1318 1836 -3671 -321 -654 -1908 2191 -3181 -1203 2203 -3605 2390 704 -4505 4263
582D263l796k007N372n703L664J065m469N940m514o13P479q437J868M356o582
$$ 4263 467 -1540 3832 -1871 1793 2858 -1611 4329 -185 -798 6681 -1756 112 4468 -2114
597b114N255l79m470M689m361K994K376p939N851K80m890O110l966j812M918m188
$$ -2114 3141 2762 -1708 2981 -1380 1614 3990 -3949 1902 2182 -2708 3402 -564 -2376 2542 -1646
613a646K361m59l256N137k580r46L281o027L980L608o980L052m7j385L107l444
$$ -1646 715 256 -3000 2137 -443 -1389 1892 -4135 -155 3453 -3527 -475 -522 -1907 1200 -2244
629b244J663J41l371N603j904m334N284k084j40K408m013K208M37j044L078m860
$$ -2244 -581 -440 -3811 1792 -112 -4446 838 -1246 -1386 1022 -2991 -783 -346 -1390 1688 -3172
645c172J786M038m788L159L6m585N418l55k433K114k719L129Q19m106M033k088
$$ -3172 -1386 2652 -2136 1023 1059 -3526 1892 1537 -896 1218 -1501 1628 2447 -1659 2374 286
661B86j236N742m777j526M274l199K381r5l285L737k117M31K681n907K754L509
$$ 286 -950 4792 15 -1511 2763 -436 1945 1850 -1435 2302 185 616 3297 -2610 144 3653
677C653n000L259r23l224N036j744j334J535l049L795k64m970N357k672j439N555
$$ 3653 -1347 1912 989 -2235 2801 1057 -277 1258 -1791 2004 1740 -3230 2127 -545 -1984 3571
693C571n249n43L475k941K955j936k283M369l488J542K104o114M173K007m662
$$ 3571 -1678 -2221 1254 -1687 1268 -668 -2951 1418 -2070 -528 1576 -4538 -365 1642 -3020
708c020L384j628j055L444k943J646o08k219N536k945k423M387l004R08K671m097
$$ -3020 364 -1264 -2319 1125 -1818 -172 -780 -2999 2537 -408 -2831 1556 -1448 -540 2131 -1966
724a966K033k17j57K522l626R51K346l018L161o32l314L816o75j365J760k214
$$ -1966 67 -150 -307 2215 -1411 -460 1886 -1132 2029 1397 -1917 1899 1224 -141 1619 -595
740e95K278p1k267L150k664l81M263l632j02J725k427K779q72j681K111k022J604
$$ -595 1683 1612 -655 2495 -169 -550 3713 81 -21 1704 -723 2056 1184 -497 1614 -408 1196
757A196Q69m095L296m5k944L862k277j632K970j219M22p13j507L346k518k80K899
$$ 1196 2065 -2030 1266 1221 -1723 2139 -138 -1770 1200 -19 403 -310 -1817 1529 -989 -1269 1630
774A630l948Q51L194l770J206L6q83K554k458J19J276k477L015K60l320K952r67
$$ 1630 -2318 -1467 1727 -2043 -837 -801 -1684 870 -1588 -1469 -193 -2670 345 605 -2715 237 -730
791g30p08K409k707P69J262j605J950j699p21L711k755k9K257l478K044J571j863
$$ -730 -1438 971 -1736 -967 295 -1310 640 -1059 -1780 1931 -824 -853 1404 -2074 -30 1541 -322
808c22P09j255J285J283l222K611j15k093L591j250k267K483q30K06K77j310J558
$$ -322 387 -868 417 1700 -1522 1089 974 -1119 2472 1222 -1045 1438 608 814 1091 -219 1339
825A339j156M41J616l055J197J658k194R17K3j213J486q76K27m21j463K532q74
$$ 1339 183 624 2240 -815 382 2040 -154 763 786 -427 1059 183 410 -11 -1474 1058 184
842A84j464J691j219l73J653j302l84N05q4Q71j202j78J292j486J230L05k023
$$ 184 -1280 411 -808 -1181 472 -830 -1214 -709 -793 78 -1124 -1302 -10 -1496 -266 39 -1984
859a984J052Q75p69J54l08K21PJ53R18j503l91K211n63j165Q39j5l79R86j00n90
$$ -1984 -932 -57 -826 -672 -980 -759 -752 -599 319 -1184 -1575 636 73 -1092 -253 -268 -647 339 239 -351
879c51j51J033N77j282K70Q63m80M61M85j335o3J457l12n28j09L54L8k75P75j002
$$ -351 -502 531 1108 -174 96 959 479 940 1425 90 27 1484 1172 644 535 889 927 652 1427 425
899D25l12J506o65j053P82j91m22R93o77r24J56P64N35j559L64J045j157K78O05
$$ 425 113 1619 954 -99 683 492 70 1063 386 -538 -382 382 917 -642 -278 767 -390 -112 493
918D93j164J44Q52K57r19j104J634J39r71Q39p37n75J311m45m78k37J86N64l43
$$ 493 -671 -527 325 582 -337 -1441 193 332 -639 200 -537 -1112 199 -246 -724 -961 -775 -211 -554
937e54o3N2o60J417J10j679Q24N84q36Q59N70r64n84J270Q44j405k01R01k02l49
$$ -554 -617 -565 -1225 192 302 -1377 -553 31 -805 54 624 -340 -924 346 1190 -215 -416 485 283 -66
957f6L59m89q6J025L60j055k33N17o6K48j2o52L34O50J38p59p38J503k6j281J491
$$ -66 293 -196 -282 743 1103 48 -185 332 266 514 502 -150 184 834 972 213 -525 978 952 -329 1162
978A162r80n90J453k19m81n59K43J427j374m00J442k102J264Q97k234P56N53m21
$$ 1162 182 -408 1045 826 345 -214 29 1456 82 -318 1124 -978 286 1183 -1051 -295 258 -163
996a63Q88j426p6O65p43J612j335j120J953r07m98J381j738Q10P70n81J76j112
$$ -163 725 -701 -777 -112 -855 757 -578 -1698 255 -652 -1150 231 -1507 -697 73 -508 -332 -1444
1014a444R65J130j842J127j2j276J514j50q26K69k20J334q51o80J187p94N04J175
$$ -1444 -479 651 -1191 -64 -76 -1352 162 12 -814 -545 -765 569 -282 -962 225 -569 -65 1110
1032A110j813R8J168p18R41r10m5J005q44J042q2j762K199l42j137J140o45k59
$$ 1110 -703 -605 563 -155 786 -124 -169 836 -8 1034 952 -810 1389 1047 -90 1050 405 146
1050A46J218o10j95m81N3J542j686k21J373j705R26Q25j732M26N8N39M79k160
$$ 146 1364 754 559 78 131 1673 -13 -234 1139 -566 360 1185 -547 -121 -63 476 955 -1205
1068a205R95P33j308J369p19j175J583k49q72Q24o53L87Q31j478J200j051l18
$$ -1205 -210 523 -785 584 -135 -1310 273 24 -848 -24 -677 -290 541 -937 263 -788 -1106
1085a106J984j709l37J603j537P14R34k148J081j0J08O51j750J192P97j825K067
$$ -1106 878 -831 -1168 435 -1102 -388 546 -1602 -521 -531 -423 228 -1522 -330 467 -1358 709
1102G09o15j645K397o09m57Q39j285J364o1r30J521j418J22J991k473P11J189
$$ 709 94 -1551 846 237 -220 619 -666 698 637 -293 1228 -190 -68 1923 -550 161 1350
1119A350j455J166m22o64Q99j098J113K01k178K069j89j306J737j101k38J134
$$ 1350 -105 1061 639 -25 874 -224 889 1090 -1088 981 792 -514 1223 122 -116 1018
1135A018j125M98L8r19J766j517j1J283k274J310Q49k023J315n16k30Q20j329
$$ 1018 -107 391 429 -490 1276 -241 -252 1031 -1243 67 916 -1107 208 -308 -538 282 -1047
1152a047R95L31k019K494r85j301J838r59k17J082j405J258n37o98J767j872N12
$$ -1047 -52 279 -1740 754 -231 -1532 306 -653 -870 212 -1193 65 -472 -1170 597 -1275 -763
1169g63J652k174J148M19j993K354n11r97J768j674O40Q06j546J945j184q89K528
$$ -763 889 -1285 -137 282 -1711 643 132 -865 903 -771 -131 675 -871 1074 -110 -999 1529
1186A529j450n76J759j493P80M92j352J378j192O1J810k450Q04J561k150J313
$$ 1529 79 -497 1262 -231 549 1041 -311 1067 -125 -64 1746 -704 100 1661 -489 824
1202H24M4j246J372q88L63L08j576J855l34j697K126j137o81J924j527K06M12
$$ 824 868 -378 994 106 469 777 -799 1056 722 -975 1151 14 -667 1257 -270 -64 348
1219C48r82J397j012l99J213j630R84J135k692J528N13j456J405j069J24M22p69
$$ 348 -634 763 -249 -648 565 -1065 -81 1054 -1638 -110 403 -1053 352 -717 -593 -171 -940
1236i40J263p77j087K238j219m07J309j597Q98L96j064R19m54K29Q86j496O14
$$ -940 323 -454 -1541 697 -522 -929 380 -1217 -319 77 -987 -68 -522 -293 593 -903 -289
1253b89P45j381J456k33j332J718l32k78O49j406J172k82o50J635j789R7J868
$$ -289 456 -925 531 298 -1034 684 352 74 723 -683 489 207 -443 1192 -597 -500 1368
1270A368j468J35R03j184J076l24n42P47q74Q09M48j662J123K68j316J228j46
$$ 1368 -100 35 938 -246 830 506 -36 711 -163 646 1094 -568 555 823 -493 735 589
1287E89j003J045o45O81m15r33J667j073m28J480j673J15J576j526R7L09l22N41
$$ 589 -414 631 -14 667 252 -681 986 -87 -515 965 -708 -593 983 -543 -446 -137 -459 82
1305H2o73l6P85j416J483O2j552J118r2n04R36j008K8R08o39J010j065n79J568
$$ 82 -591 -627 158 -1258 225 287 -1265 -147 -239 -743 193 -815 -787 121 -518 492 -573 -1152 416
1324D16r40R1P43j271Q69N16j118R10p09L70Q74j307P83K76j085J726m29j114
$$ 416 -524 -433 310 -961 -92 424 -694 216 -493 -123 751 -556 227 503 -582 1144 715 -399
1342c99R30m27N72j6p45R04n09k64J278j468M17R87j123M48Jp41P90n27J15K50
$$ -399 531 104 676 660 -85 819 310 46 1324 -144 273 1260 137 585 586 -155 635 108 223 473
1362D73p38J009l37q59R99n03m94J076p48p0l8K26M18q83K15N55p51M25J42p64
$$ 473 -265 744 407 -452 547 44 -450 626 -122 -192 -230 -4 414 -469 -254 301 -450 -25 117 -647
1382f47L93L22m04J95k77L00l64kM61m41n95J160k32m09M77k30o5R1K50m84J50
$$ -647 -254 68 -336 -141 -418 -118 -482 -484 -23 -464 -1059 101 -131 -540 -63 -293 -358 -267 -17 -501 -351
1403c51L83K17o06J44L83l19J76J85l78j04P58k72k49J82J59r4J03L37m20r8M33
$$ -351 32 249 -357 -213 170 -149 27 212 -166 -270 488 216 -33 149 308 214 317 654 234 136 569
1424E69K27o99K35k0k92J93K37l76j24L22L02l50k88M28k98o2O29o21l11M31J58
$$ 569 796 97 332 312 20 213 450 74 -50 272 574 224 -64 364 66 4 633 12 -299 132 290
1445B90m89j47K42J51l35M51l62o46Q87J93p05K5J30k47L85o5n4k23J73L90n94
$$ 290 -199 -346 -104 47 -288 163 -199 -845 42 235 -470 -445 -315 -562 -177 -242 -296 -519 -346 44 -550
1466e50J25N88l46j97K40k13O1J51J90j37n97N27J90l87L05j4n60P44L14o24k1
$$ -550 -425 163 -183 -380 -140 -353 -292 -141 49 -88 -685 -158 32 -355 -50 -64 -624 120 434 -190 -211
1487b11L97o4r8K87j32jj56N14m23n5M01l15j09L91k55l02P42p4k70o10Q02R2
$$ -211 186 122 24 311 179 178 22 536 113 58 459 144 35 426 171 -131 611 537 267 -343 459 551
1509E51j91k45L95l72P9L48m66n6j0L03m5l38j73L70n6L61o49l87P07m2m75O23
$$ 551 360 115 510 138 217 565 99 43 33 336 291 -47 -220 150 94 455 -194 -581 126 84 -391 232
1531B32n82mJ45q6J11o52N41M59n86K49j24l39O87p0n42M11l79L74k16l53R34
$$ 232 -350 -354 -209 -295 -184 -836 -295 164 -422 -173 -297 -636 51 -19 -561 -150 -529 -155 -371 -724 210
1552B10o89j04J197j106J36O86l96J00k22j95Q16o26N93J95j245R94J31o35M83
$$ 210 -479 -583 614 -492 -356 330 -66 34 -188 -383 433 -193 400 595 -650 344 475 -160 323
1571C23j07n8J2k60L79L3n06J147p84l68Q05p09K84P58j170K84J24j02O04r95
$$ 323 216 158 170 -90 289 322 -184 963 179 -189 616 -93 191 949 -221 63 187 85 689 -306
1591c06M08M36p67P47l22q85J172l59l46M31n47J76L21n16M92n11k93J261r34
$$ -306 102 538 -229 518 196 -689 483 124 -222 209 -338 -162 159 -357 135 -376 -669 592 -342
1610c42j88Q81q79L30M24q81M66k70L19L08q91M64J73p67O37O4l64N21m3o7O3
$$ -342 -530 351 -528 -198 226 -655 -189 -459 -140 168 -723 -259 -86 -853 -216 -152 -516 5 -38 -105 -42
1631d2l68P67o02j01P93r10M02O57p56Q8L97n25Q60o34K0L34o20P87j30r65R47
$$ -42 -410 357 -245 -346 447 -463 -61 596 -160 -72 325 -200 660 26 46 380 -240 547 417 -548 399
1652C99r7l16Q49j065L26N63m24N03n43m29J165j278M11N44r16O15K20j021O10
$$ 399 302 -14 835 -230 96 659 235 738 195 -234 931 -347 64 608 -308 307 527 -494 116
1671A16m46J83R18j084J77K18o25J036o03n26Q48l98M1L31q29M84J08m19O58j049
$$ 116 -330 -147 771 -313 -136 82 -543 493 -110 -636 212 -186 -145 186 -643 -159 -51 -470 188 -861
1691h61M62Q86j057N35J51r66J241o17j02M98p57P30J07r63Q49l65l87J429j134
$$ -861 -399 487 -570 -35 116 -850 391 -226 -328 170 -587 143 250 -713 136 -229 -616 813 -321
1710c21j13Q80o80M43n4n57R21n87K46L84j168Q22O41j422Q67l3m48R85o45j07
$$ -321 -434 446 -234 209 155 -402 519 -68 178 562 -606 216 857 -565 302 269 -179 806 161 54
1730E4L16o06R90l60p85J222n98l79R53j061N41N7n58N54n65Q9P64j183Q47P1
$$ 54 370 -236 754 394 -391 831 233 -146 807 -254 287 344 -214 340 -225 -136 628 -555 292 363
1750C63j278J429m39m68N17l43K29K28p60P61n34m43J265j123J00J016j018M24
$$ 363 -915 514 75 -393 124 -219 10 238 -522 239 -295 -738 527 -596 -496 520 -498 -74
1768g4o3n12R49q71J52O18j094P10L40q50Q26l00k95R48q82K94L98q33P09K5o16
$$ -74 -137 -649 300 -571 -419 199 -895 -185 155 -695 131 -169 -464 484 -398 -104 294 -539 170 195 -421
1789d21J052q64J66P84j181N98J75m25M48k63l4M01q19O48K52o15N67r1o39Q13
$$ -421 631 -233 -67 717 -464 134 309 -116 332 69 35 436 -383 265 517 -98 469 378 -261 552
1809E52o59J01L61m57P21n31nN30q27J46O78p53J78M51o84L63r1l30L67m38L76
$$ 552 -107 -6 355 -102 619 88 83 613 -214 -68 610 -143 35 486 -198 165 74 -256 111 -327 49
1830D9K1n96P43O8j087J240o56j56L50j94R6J29n36P96n49o80R67n05J21M66o59
$$ 49 70 -526 217 285 -802 438 -218 -374 -24 -218 -122 7 -529 267 -282 -962 5 -500 -379 87 -572
1851e72M21m0JK20p05O84K13n23O71k64p56J033k06m71O52n99N33n1m35M96l36
$$ -572 -151 -191 -190 30 -675 9 222 -301 370 106 -650 383 177 -294 358 -241 292 241 -194 302 -34
1872c4j6P48q80J64N99p77N52K0m54N75k35l31N12o16O83m39j48M81l60k84O97
$$ -34 -50 698 -182 -18 581 -196 356 376 -78 497 262 -69 443 -173 510 71 -77 404 44 -240 457
1893D57m25K15j38k10K37r0l71N62l61K67ro15L12m3j4M45n46J35J50l99M24k12
$$ 457 32 247 109 -101 136 46 -325 237 -124 143 134 -481 -169 -212 -226 219 -327 -192 -42 -441 -17 -229
1915b29l4K69j19k74K79k95K16J13k79L48k49jN11m41J97J82n29L60J02l76O0
$$ -229 -263 6 -113 -387 -108 -403 -187 -74 -353 -5 -254 -255 256 -185 12 194 -335 25 127 -249 -189
1936a89L16p2kl04O07k77j59O73o52P7L53K3n08N4q7M86j49n2K24k72j53N94l45
$$ -189 127 55 53 -251 356 79 -80 593 -59 18 371 394 -114 -60 -147 339 190 138 362 90 -63 531 186
1959A86k40J47J40K37m85K18l02J89n0P1Q1rL4m05M47l71K9R1O4k22J41j04K19
$$ 186 -54 93 233 470 -15 203 -99 90 40 111 192 183 217 -188 259 -112 -83 8 72 -150 -9 -113 106
1982A06j51k6j26k00L77Pl33K10M7j03Q1j4j40j19L41j16p4k35M72l14N2O2o4
$$ 106 -45 -71 -197 -397 -20 -13 -346 -136 -89 -192 -111 -125 -265 -384 -43 -159 -233 -468 4 -310 -258 -196 -260
2005b60J71j61K95j17p2L44O1m5l49P7M2L4L93o41L59j42J04JQ0J48k17l2L5K98
$$ -260 -89 -250 45 -72 -144 200 261 216 -133 -56 -14 20 413 -228 131 -11 93 94 174 322 105 73 108 406
2029D06k98M28j46l86J56j1k15M45p6j34k18k57M46P8j77l5j49M2M35m61L6K19
$$ 406 108 536 390 4 160 149 -66 379 303 169 -49 -306 140 218 41 6 -143 -101 334 -127 -91 128
2051A28j92R4o5j14Q2N5j6J5k15K85k03J34J42l18r0Q4M9k34L19J58j90j46RJ08
$$ 128 -64 30 -35 -149 -67 -12 -28 -13 -228 57 -146 -12 130 -188 -278 -194 -145 -379 -60 98 -92 -238 -229 -121
2075a21n5J17K44l51m0N21o43K92L6l7J44k43K29j42j22L42k99J05P2l3k42M94
$$ -121 -176 -59 185 -166 -206 315 -328 -36 0 -37 107 -136 93 -49 -171 171 -128 -23 49 16 -226 268
2097B68l8j59J86m77L78k09N2J88j49j01N61l29N0J56l04K34m77L25J66m15M08
$$ 268 230 71 257 -220 158 -51 1 189 40 -61 500 171 221 377 73 307 -170 155 321 -94 314
2118C14N9m03O4O0j04%j55K45k5l05M46l12k22L72k41K65l8l90L04R8m51K75k11
$$ 314 373 -30 34 94 -10 -10 -165 80 55 -250 196 -116 -338 34 -207 58 20 -370 -66 32 -419 -144 -355
2141c55J08j4l05N02j92r9Q37o12j30J50q2o5K86l44N78k71m65O33n58J22O00
$$ -355 -247 -261 -566 -64 -256 -355 482 -130 -260 -110 -192 -257 29 -315 263 -8 -473 160 -398 -276 324
2162C24n02J73K27n84P96l89J09J44p16P71k49j66M17k67N0K55k41J69p6k13J44
$$ 324 -178 -5 222 -362 434 45 154 298 -418 353 104 -62 355 88 138 393 152 321 245 32 176
2183A76l77J94O08o42oJ74l90N03j5k77J99k97r7K23m57Q44m4p80P36k53k99O67
$$ 176 -201 -7 601 -41 -47 127 -263 240 225 -52 147 -150 -247 -24 -481 363 319 -461 275 22 -277 390
2205C90p51M80J00l78L75k34j30K28l95J93J77m89L08J12m54O06j94q2K29k51
$$ 390 -361 119 219 -159 216 -18 -148 80 -315 -122 55 -434 -126 -14 -468 138 -56 -138 91 -160
2225a60J67R3m02N50l71j48L50k28M0L6k64K23op1L56j94N2O09r47M36R6n09O21
$$ -160 7 100 -302 248 -123 -271 79 -149 -109 -73 -337 -114 -120 -191 165 -29 23 632 -315 121 217 -292 329
2248C29k76l27L83m2M1L14o88L51J47m76O31n60N7L90l53K71j44k39M86l13N6
$$ 329 53 -274 109 67 108 422 -266 85 232 -244 387 -173 -116 274 -79 192 48 -191 295 -18 38
2269C8M95p08M47j55n28M72j20j61L97n19J74M00n94M28l93k4P46o09j13L05k51
$$ 38 533 -175 272 117 -411 61 -59 -220 177 -342 -168 232 -362 66 -327 -351 395 -214 -327 -22 -273
2290b73N26m02L8J46m65K61K32n17N38J56m17L30m6o29M78q8J72K49m38L17j89
$$ -273 253 -149 -111 35 -430 -169 63 -454 84 240 -177 153 107 -522 -44 -132 40 289 -149 168 -21
2311b1l32M60n23J66N68n79L17p3j31L75m82K08M32m59R6K62l82L39j88j70K60
$$ -21 -353 107 -416 -250 318 -261 56 -17 -148 227 -255 -47 385 -74 22 284 -98 241 53 -117 143
2332A43j71J56J48m80L01j53p8M95l84Q5m5k36L39J20l99K54nm5L19m44J15Lm05
$$ 143 -28 128 276 -204 97 -56 -134 361 -23 62 17 -219 120 240 -159 95 90 45 364 -80 35 38 -367
2355c67N69l24O8L36l13O5J60m73M65k86L1J05k17P0J06l01L02j53j06M14M5j48
$$ -367 202 -122 -54 282 -31 34 194 -279 186 -100 -69 36 -181 -111 -5 -306 -4 -157 -263 151 196 48
2377D8J40l77K68J57l16K27n36K69J83p4k29K67k24O9J96j73L24l54J89L23n54
$$ 48 188 -189 79 236 -80 147 -389 -120 63 -11 -240 27 -197 -128 68 -105 219 -135 54 377 -177
2398a77K19K30l07J70l1j32K58j48J65Mk41L36k76j42M38n07j83Q29n32N0j11
$$ -177 42 272 -35 135 104 -28 230 82 247 251 10 346 70 -72 366 -141 -324 505 -27 23 -88
2419h8r8M43k70j05M50l81O7r6j17K36r8J1K24k42Q4k6j84J14j41q3M17k6j80
$$ -88 -186 257 -13 -118 332 -49 18 -78 -195 41 -57 -46 178 -64 20 -6 -190 -76 -217 -300 117 91 -89
2442h9J72j74J80p1k59K95j51j01J97l11M35j10m16N15k21P6Q0j31M3o0j6R5R0
$$ -89 83 -91 89 18 -241 54 -97 -198 -1 -312 123 13 -403 112 -109 -33 47 -84 -41 -101 -117 -22 68
2465F8o8M9j31p7R1j25K39j80Q5J49o2O2k45N2Q6K34k45N9M8j47J13Q3N8J14n03
$$ 68 0 49 -82 -159 -68 -193 46 -134 -49 100 38 100 -145 -93 -7 227 -18 41 89 -58 55 138 196 310 -193
2490a93L91k8k65ML64j71N3l82J84Kj81k3L03j1o5l3Q4J2O4J60j89l77K50jK25
$$ -193 198 170 -95 -91 273 102 155 -227 -43 -41 -222 -245 58 47 -18 -51 33 45 109 269 80 -297 -47 -48 177
2515A77j99j76J55r8J77m3m1r2K03j29q5J18J12l8k29J35j70r1J92J26q2J1J13
$$ 177 -22 -198 -43 -141 36 -7 -48 -140 63 -66 -151 -33 79 41 -188 -53 -223 -314 -122 4 -78 -67 46
2538D6j22J48j7j73Q5j3M4M5L3J47m6O6k43J21k56Q4K84l16M18j26k34J32J59
$$ 46 -76 72 55 -118 -33 -46 -2 43 76 223 177 243 0 121 -135 -51 233 -83 335 209 -25 107 266
2561B66q8k65J88J42k50J43j08j04K12L7j04k46J71K70l50J30MJ9Lj40k02J52
$$ 266 178 -87 101 243 -7 136 28 -76 136 173 69 -177 -6 264 -86 44 48 67 70 -70 -272 -120
2583a20L47k47j93K15j66L5K4q4o0J75k48J82j00J79m4j29K66M5l16K35Q8j50
$$ -120 227 -20 -213 2 -164 -129 -105 -189 -249 -74 -322 -140 -240 -61 -105 -234 32 77 -239 -4 84 -66
2605f6j20J10Q8j76O9J99k91J33K12j68Q9j54l5R7K53k26K1j3rK93k97j19J94
$$ -66 -186 -76 12 -164 -95 104 -187 -54 158 -10 79 -75 -110 -13 240 14 35 22 13 306 9 -110 84
2628H4J31n6K51k73K2l0j22qR4J64k28K0J24J01j64R1k98l9J84k20L62o7J87j93
$$ 84 215 159 410 137 159 129 7 -1 93 257 29 49 173 274 110 201 -97 -136 48 -172 190 123 310 117
2652A17k99K7M03l77J09n9m5O4J2j72L64j46j01K7l9K35j54m45N45j33k53K89
$$ 117 -182 -155 248 -129 -20 -79 -124 -60 -48 -220 144 -2 -103 -76 -115 120 -34 -479 66 -67 -320 -31
2674c1j75M39k24j21pO5N8N3l77J40K51k47L09j41j73K65k00J38K08k83J78Rk90
$$ -31 -206 233 9 -112 -119 -54 4 57 -320 -180 71 -176 133 -8 -181 84 -116 22 230 -53 125 134 -156
2697a56L16m7j28L84l41J47m3l1q6j23L4M36m06J84J80l32L21k12l8l4P0j10j69
$$ -156 160 113 -15 369 28 175 132 101 15 -108 -74 362 -44 140 320 -12 309 97 59 25 95 -15 -184
2720a84oN50m46k6N66o03nL86l63N9o9j9L47j26j15L08o63L98K95o91N12l30O5
$$ -184 -190 360 -86 -112 454 -149 -154 232 -131 -72 -141 -160 187 61 -54 254 -409 -11 284 -407 105 -225 -160
2743a60K44q9M2r9l35N22j21l06N91m27r0M17o83N51J6k84J80k39K77q3j42L25
$$ -160 84 -5 37 -62 -397 125 4 -302 289 -138 -228 189 -494 57 73 -211 -31 -270 7 -76 -218 107
2765A07k0k76M12j85k52L75k61O4J76j30K36j49p2K80k51J0R0m3R1J46m70K26
$$ 107 87 -189 223 38 -214 161 -100 -36 140 10 246 97 25 305 54 64 154 111 202 348 -122 104
2787A04m3j20K36k36L84k83l20O19k13l70L45m8J64j64l80M48k41oL34l42qL72
$$ 104 61 -59 177 -59 325 42 -278 341 128 -242 103 55 219 55 -325 123 -118 -124 210 -132 -140 232
2809B32n07J12J69k51K97j2l64L16j42J39jl85K84J80o3J45k68J26j79j8K39J01
$$ 232 -275 -163 6 -245 52 40 -324 -8 -150 -11 -12 -397 -113 67 4 149 -119 7 -172 -190 49 150
2831A50l75K19j22J31L30m97J55K26n87N01l9o7l7j76J55J50j91K11J29n42N25
$$ 150 -225 -6 -128 3 333 -164 -9 217 -370 131 92 25 -12 -188 -33 117 -74 137 266 -276 249
2852B49j11k89K13R7M4l43J18K26j96n0L17l10K43rl61L59j07j34J16q4r6O01
$$ 249 138 -151 62 159 203 -140 -22 204 8 -42 275 -35 208 199 -162 197 90 -44 72 -12 -108 493
2874D93n92L25k70m46Q59m47l4K34k79l2K64l92L84l80J36K50j40j24J72l04K69
$$ 493 -99 226 -44 -490 369 -78 -112 122 -157 -189 75 -317 67 -313 -177 73 -67 -191 -19 -323 -54
2895e4J97j64o2j03R7k5J08Pn4l80N36j12k6J90l13l1J61n3M5j4q8L74m90K59
$$ -54 143 -21 -83 -186 -89 -114 -6 1 -53 -433 103 -9 -35 155 -158 -189 -28 -81 -36 -50 -138 236 -254 5
2919EK25l10J32n6J62j39OO4K42m35K14mm09O42l22J8K66m48K15j4pj5O3k86K21
$$ 5 230 -80 52 -4 158 19 25 89 331 -104 110 106 -303 339 17 35 301 -147 68 54 47 32 95 -191 30
2944C0j73L00j07m7L0m6j16L05m17L75J7j41j5j44o7L57l27o6K51l42M49j81j30
$$ 30 -143 157 50 3 33 -13 -129 176 -241 134 151 10 -5 -149 -216 141 -186 -252 -1 -343 106 -75 -205
2967b05L54l11j16K33k64J23L25k22l1j58K7R1K74j31j11r5J02K8j3J84j35K18
$$ -205 149 -162 -278 -45 -309 -186 139 -83 -114 -272 -245 -154 120 -11 -122 -217 -115 -87 -100 84 -51 167
2989A67j83L8j42P1O7q8j46K61L55m75R2J46k47J43OP9j45l9Q2J5n0J43M8m05
$$ 167 -16 22 -120 -49 18 -70 -216 45 400 -75 17 163 -84 59 65 144 -1 -40 42 57 7 150 198 -207
3013b07K06J36m2L10m49n4L00j75j1j35K09j66R5K05k06k32K96N4k07Nj09K13
$$ -207 -1 135 93 403 -46 -100 200 25 14 -121 88 -78 17 222 16 -216 80 134 -73 -68 -177 36
3035C6o2j74J34k15L70Q0k20l7J34j01k24J08J25j45K27j00k1L3J22k62j23J93
$$ 36 -26 -200 -66 -281 89 169 -51 -88 46 -55 -279 -171 -46 -191 36 -64 -85 -52 70 -192 -315 -122
3057a22L3Q2lJ0k19K30K1K5L1P0l83J61K10K64n13R7j0J46j08m0r8K48P6p8J59
$$ -122 -89 -7 -10 0 -219 11 32 57 88 158 -225 -64 146 410 -103 -6 -16 130 22 -18 -116 132 208 130 289
3082B89j86j94J33M9k52M9j30K83K1j75Q3J04rJ70j95J0MRm6k57K82J07j02j02
$$ 289 103 -91 42 91 -161 -112 -242 41 62 -113 -30 74 65 235 40 50 54 63 17 -240 42 149 47 -55
3106e5qj24K97l62J55J42k80L4P6Q9k1j09J99n7O8l3j79N2J55j30J61q3K0n2L5
$$ -55 -63 -187 110 -252 -97 45 -235 -201 -125 -36 -57 -166 33 -24 44 11 -168 -116 39 -91 70 -13 7 -45 -10
3131a0M1l35m9K91N6k21L23N8r9L8k50p0K35J91k53P7J70j76J14r0j5j5J81j82
$$ -10 31 -304 -353 -62 -6 -227 96 154 55 93 -157 -227 8 199 -54 23 193 17 131 41 26 11 192 10
3155A0q7K27l2k41K00J75j79j82O1K1K48k21m8P4K24r2j71l3j48K84k12J04J22
$$ 10 -77 150 118 -123 77 252 73 -109 -48 -27 221 0 -48 26 250 158 -13 -46 -194 90 -122 -18 104
3178A04Jj70O3o0Q7j32O9r1q6R8J61j01J5Q1j78K21k15LJ90k70K66q7k87L92k65
$$ 104 105 -65 -2 -62 25 -107 -38 -129 -215 -117 44 -57 -42 39 -139 82 -133 -130 60 -210 56 -31 -318 74 -191
3203a91J66Rj03J28j15J56L0K5k90L46j84J45J8k16L70k37j17l7J50p2j19K34
$$ -191 -25 -16 -119 9 -106 50 80 105 -185 161 -23 122 140 -76 294 57 -60 -97 53 -19 -138 96
3225I6p7J95j87RL8l27M48l42K52j05O0J9P4j04rk06J87J55k43J41j25J23J75
$$ 96 19 214 27 36 74 -253 195 -147 105 0 60 79 153 49 40 -166 21 176 -67 74 -51 72 247
3248B47l38K38Pk63p8M08l80K55m62K42J99k03J18P5j7K21n15L38k8m2j16R3J83
$$ 247 -91 147 154 -109 -187 221 -159 96 -366 -124 75 -128 -10 65 48 269 -246 92 64 22 -94 -1 182
3271A82l4k15l7L41n59J76L46k20J47r7j99K13l12K19K5m0p8L66l01p9P1J14K13
$$ 182 148 -67 -104 237 -322 -146 200 -20 127 30 -169 44 -268 -49 -24 -64 -142 224 -77 -156 -85 29 242
3294B42j59NR5j97K57k87o0Q1o2R4J65j99K37j55k64K95K4l09K96k76K91K5k99
$$ 242 83 88 183 -14 243 -44 -104 -23 -85 9 174 -25 212 57 -207 88 112 -197 99 -177 114 139 -160
3317a60M73k70n6M3M3r5pJ68J41k79L5j6j30R0j3j85J13M58p10M89o9j25l2J6
$$ -160 313 43 -13 30 73 -22 -29 139 280 1 36 20 -110 -20 -33 -218 -105 353 -357 132 63 -62 -94 -78
3341g8K9L2j91K61j42K86M7m53j0K16l50K72L3J83k85o0j9J40q4J97J03q5r2p3
$$ -78 -49 -17 -208 53 -89 197 244 -209 -219 -3 -353 -81 -48 135 -150 -210 -229 -89 -173 24 127 42 -50 -123
3365a23M5R5l22L52J32l98K94j37lK37l64j14M51j8m0j76M3J15k93L07J31l65
$$ -123 -78 17 -305 47 179 -219 75 -62 -65 172 -192 -306 145 127 87 -89 -46 69 -224 83 214 -151
3387a51K58J48k38M31m43k11L14k68K6K01k18L77l44n0L78l55j6K88j58O1J68
$$ -151 107 255 17 448 5 -206 108 -160 -134 67 -151 226 -118 -168 210 -145 -161 127 -31 30 198
3408A98k89kN1j33L12l39P5J63j83M40m04Q0K42j69r0Lk59K44j4M2J24k82P3J48
$$ 198 -91 -93 -42 -175 137 -202 -127 36 -147 293 -111 -31 211 42 -48 -45 -304 -60 -74 -32 92 -190 -117 31
3432C1j34j8J35o9m2J54j04K09k81K71J4m68L44Q5k72K49p8n3n0J1P6K8k7K32
$$ 31 -103 -121 14 -55 -97 57 -47 162 -119 152 166 -302 42 127 -145 104 26 -27 -77 -66 10 38 11 243
3456B43k39L27M6m63Q1P9j76K24k60P7K93j48k00K91J5k2q5l76K18J16p7o1j13
$$ 243 4 331 377 -86 -5 74 -102 122 -138 -61 232 84 -116 175 190 168 83 -293 -75 41 -36 -97 -210
3479b10L87j14j71K22l19J51N2J4J99l2j41J37j98q6J69l84J82L52k91K5j4M8
$$ -210 177 63 -108 114 -205 -54 -2 12 211 179 38 175 -23 -109 60 -324 -142 210 -81 -56 -70 -22
3501b2j27K3L7K44k84J65mk90L27M7k76jk00M70o7o9K82l13K04O5j26J97k23l80
$$ -22 -149 -126 -89 155 -129 36 32 -258 69 116 -160 -161 -361 109 42 -27 255 -58 146 211 85 282 59 -321
3525c21M78m4m6J99j95k69L3p8N00q1j75K87j75k9J6j53q1R0o5K4N9R1q2m8J67
$$ -321 157 113 67 266 71 -198 -165 -243 257 176 1 288 113 84 100 -53 -134 -44 -109 -85 -26 65 -17 -65 102
3550A02j36M6j0J63j4o0R6m29P5J08O8M0j46K58l91K28K4j69n9L39m12K80j3N9
$$ 102 -34 12 2 165 151 91 187 -242 -167 -59 9 49 -97 161 -230 -2 22 -147 -206 133 -279 1 -12 47
3574D7k4j61j4J14k56K46j32J3K72k30P8M52o50J91q8L55j42j66m7K18j51J93
$$ 47 23 -138 -152 -38 -294 -48 -180 -167 105 -125 -47 405 -245 -54 -142 213 71 -95 -142 76 -75 118
3596A18mj52OJ38j47K3K8o4J43j74J95N3l78M15j32M2o8j22l2K28j12P2J1j06
$$ 118 114 -38 -32 106 -41 -18 10 -54 89 -85 110 163 -215 200 68 110 42 -80 -112 116 4 76 87 -19
3620a9P4k39L43j3k17J70n5j5p9q8J87j4m2j67J73k58N09k53L8j0q8k22J19J80
$$ -19 55 -184 159 146 -71 99 44 29 -50 -138 49 35 -7 -174 -1 -259 250 -3 35 25 -63 -285 -166 14
3644A4N1p0J32o3j80K85k38k2K73r8k59P3%j19J7Q3K9J48j53Rj55J61J75J49l03
$$ 14 65 -5 127 64 -116 169 -69 -91 182 84 -175 -102 -102 -221 -204 -121 -92 56 -97 -88 -243 -82 93 242 -61
3669f1K30O8o0N5j44j38J12N4P3k57l0K13j11RK2Q6j20k6J06j57k8J25j60L94
$$ -61 169 237 177 232 88 -50 62 116 189 -68 -98 115 4 13 35 121 1 -25 81 -76 -104 21 -139 255
3693B55k63Q7J1rJ24m11Q2J46k10K47L9J5J44m43j8K44k37J06L2p6J12N0N8kj91
$$ 255 -8 79 90 81 205 -206 -124 22 -188 59 98 113 257 -186 -204 40 -197 -91 -59 -135 -23 27 85 83 -108
3718a08j9K20R9k33J18j17j4QM4k1j47P8J09k17L05j67J58J18l09%j51O9K63N3
$$ -108 -127 93 192 -41 77 -40 -54 -46 -2 -23 -170 -92 17 -200 105 -62 96 214 -95 -95 -246 -177 86 139
3742A39j67k4j03rK17P9k01m1J44k57J50J32J41k27j25J53o4k5J72J71m09J60
$$ 139 -28 -52 -155 -164 53 132 -69 -110 34 -223 -73 59 200 -27 -152 1 -63 -88 84 255 -154 6
$$ [...]
8191A6
##END NTUPLES=NMR FID
##END=
