##TITLE=1H_L2-Dau(feb-21)-A
 CDCl3,8 sc, 
 5.03.2021
##JCAMPDX= 6.0         $$ Bruker NMR JCAMP-DX V2.0
##DATA TYPE= NMR FID
##DATA CLASS= NTUPLES
##ORIGIN= UXNMR, Bruker Analytische Messtechnik GmbH
##OWNER= root
$$ XWIN-NMR		Version 3.5
$$ Fri Mar  5 10:32:58 2021 Russian Standard Time (UT+4h)  she@DPX200
##.OBSERVE FREQUENCY= 200.131506
##.OBSERVE NUCLEUS= ^1H
##.DELAY= (6, 6)
##.ACQUISITION MODE= SIMULTANEOUS
##.ACQUISITION SCHEME= undefined
##.AVERAGES= 8
##.DIGITISER RES= 18
##SPECTROMETER/DATA SYSTEM= spect
##.PULSE SEQUENCE= zg30
##.SOLVENT NAME= CD3CN
##.SHIFT REFERENCE= (INTERNAL, CD3CN, 0, 15.7039)
##AUDIT TRAIL= $$ (NUMBER, WHEN, WHO, WHERE, WHAT)
$$ ##TITLE= Audit trail, XWIN-NMR		Version 3.5
$$ ##JCAMPDX= 5.01
$$ ##ORIGIN= Bruker BioSpin GmbH
$$ ##OWNER= she
$$ F:/spectra/data/she/nmr/H-F/1/audita.txt
$$ ##AUDIT TRAIL=  $$ (NUMBER, WHEN, WHO, WHERE, WHAT)
(   1,<2021-03-05 10:31:44.35 +0400>,<she>,<DPX200>,
      <created by zg, POWCHK disabled, PULCHK disabled
       configuration hash MD5:
       00 E9 B6 7A A2 85 ED C7 34 08 36 98 17 FE 4E 26
       data hash MD5: 16K
       D5 A5 43 EA E5 50 64 97 B3 22 92 B1 DE B1 EB 3E>)
$$ ##END=
$$ 
$$ hash MD5
$$ C0 A8 A6 90 BF 73 CA C0 85 D9 C4 D5 29 16 EA 76
##$RELAX= 
##$RELAX= 
##$RELAX= 
##$RELAX= 
##$RELAX= 
##$RELAX= 
$$ Bruker specific parameters
$$ --------------------------
##$DU= <F:/spectra>
##$EXPNO= 1
##$NAME= <H-F>
##$PROCNO= 1
##$TYPE= <nmr>
##$USER= <she>
##$AMP= (0..31)
100 100 100 100 100 100 100 100 100 100 100 100 100 100 100 100 100 100 
100 100 100 100 100 100 100 100 100 100 100 100 100 100 
##$AQSEQ= 0
##$AQ_mod= 1
##$AUNM= <au_zg>
##$AUTOPOS= <>
##$BF1= 200.13
##$BF2= 200.13
##$BF3= 200.13
##$BF4= 200.13
##$BF5= 200.13
##$BF6= 200.13
##$BF7= 200.13
##$BF8= 200.13
##$BYTORDA= 1
##$CFDGTYP= 0
##$CFRGTYP= 5
##$CHEMSTR= <none>
##$CNST= (0..31)
1 1 145 1 1 1 1 1 1 1 1 1 1 1 1 1 1 1 1 1 1 1 1 1 1 1 1 1 1 1 1 1 
##$CPDPRG= <>
##$CPDPRG1= <>
##$CPDPRG2= <>
##$CPDPRG3= <>
##$CPDPRG4= <mlev>
##$CPDPRG5= <mlev>
##$CPDPRG6= <mlev>
##$CPDPRG7= <mlev>
##$CPDPRG8= <mlev>
##$CPDPRGB= <>
##$CPDPRGT= <>
##$D= (0..31)
0 1.2 0 0 0 0 0 0 0 0.06 0 0.03 0 0 0 0 0.0002 0 0 0 0 0 0 0 0 0 0 0 0 
0 0 0 
##$DATE= 1614925903
##$DBL= (0..7)
120 120 120 120 120 120 120 120 
##$DBP= (0..7)
150 150 150 150 150 150 150 150 
##$DBP07= 0
##$DBPNAM0= <>
##$DBPNAM1= <>
##$DBPNAM2= <>
##$DBPNAM3= <>
##$DBPNAM4= <>
##$DBPNAM5= <>
##$DBPNAM6= <>
##$DBPNAM7= <>
##$DBPOAL= (0..7)
0.5 0.5 0.5 0.5 0.5 0.5 0.5 0.5 
##$DBPOFFS= (0..7)
0 0 0 0 0 0 0 0 
##$DE= 6
##$DECBNUC= <off>
##$DECIM= 32
##$DECNUC= <off>
##$DECSTAT= 4
##$DIGMOD= 1
##$DIGTYP= 9
##$DL= (0..7)
0 120 120 120 120 120 120 120 
##$DP= (0..7)
150 150 150 150 150 150 150 150 
##$DP07= 0
##$DPNAME0= <>
##$DPNAME1= <>
##$DPNAME2= <>
##$DPNAME3= <>
##$DPNAME4= <>
##$DPNAME5= <>
##$DPNAME6= <>
##$DPNAME7= <>
##$DPOAL= (0..7)
0.5 0.5 0.5 0.5 0.5 0.5 0.5 0.5 
##$DPOFFS= (0..7)
0 0 0 0 0 0 0 0 
##$DQDMODE= 0
##$DR= 18
##$DS= 0
##$DSLIST= <SSSSSSSSSSSSSSS>
$$ [...]
##$SUBNAM2= <"">
##$SUBNAM3= <"">
##$SUBNAM4= <"">
##$SUBNAM5= <"">
##$SUBNAM6= <"">
##$SUBNAM7= <"">
##$SUBNAM8= <"">
##$SUBNAM9= <"">
##$SW= 16.9725357007746
##$SWIBOX= (0..15)
0 0 2 0 0 0 0 0 0 0 0 0 0 0 0 0 
##$SW_h= 3396.73913043478
##$TD= 16384
##$TD0= 1
##$TE= 0
##$TE2= 300
##$TE3= 300
##$TEG= 300
##$TL= (0..7)
0 120 120 120 120 120 120 120 
##$TP= (0..7)
150 150 150 150 150 150 150 150 
##$TP07= 0
##$TPNAME0= <>
##$TPNAME1= <>
##$TPNAME2= <>
##$TPNAME3= <>
##$TPNAME4= <>
##$TPNAME5= <>
##$TPNAME6= <>
##$TPNAME7= <>
##$TPOAL= (0..7)
0.5 0.5 0.5 0.5 0.5 0.5 0.5 0.5 
##$TPOFFS= (0..7)
0 0 0 0 0 0 0 0 
##$TUNHIN= 0
##$TUNHOUT= 0
##$TUNXOUT= 0
##$USERA1= <user>
##$USERA2= <user>
##$USERA3= <user>
##$USERA4= <user>
##$USERA5= <user>
##$V9= 5
##$VALIST= <valist>
##$VCLIST= <CCCCCCCCCCCCCCC>
##$VD= 0
##$VDLIST= <DDDDDDDDDDDDDDD>
##$VPLIST= <PPPPPPPPPPPPPPP>
##$VTLIST= <TTTTTTTTTTTTTTT>
##$WBST= 1024
##$WBSW= 4
##$XGAIN= (0..3)
0 0 0 0 
##$XL= 0
##$YL= 0
##$YMAX_a= 73988
##$YMIN_a= -64378
##$ZGOPTNS= <>
##$ZL1= 120
##$ZL2= 120
##$ZL3= 120
##$ZL4= 120
##$ABSF1= 10
##$ABSF2= 0
##$ABSG= 5
##$ABSL= 3
##$ALPHA= 0
##$AQORDER= 0
##$ASSFAC= 0
##$ASSFACI= 0
##$ASSFACX= 0
##$ASSWID= 0
##$AUNMP= <proc_1d>
##$AZFE= 0.1
##$AZFW= 0.1
##$BCFW= 1
##$BC_mod= 2
##$BYTORDP= 1
##$COROFFS= 0
##$CY= 11.3945322036743
##$DATMOD= 1
##$DC= 2
##$DFILT= <>
##$DTYPP= 0
##$F1P= 15.9154993809931
##$F2P= -4.1035820241983
##$FCOR= 0.5
##$FTSIZE= 0
##$FT_mod= 4
##$GAMMA= 1
##$GB= 0.15
##$INTBC= 1
##$INTSCL= 1
##$ISEN= 128
##$LB= 0.24
##$LEV0= 0
##$LPBIN= 0
##$MAXI= 10000
##$MC2= 0
##$MEAN= 0
##$ME_mod= 0
##$MI= 1.114404
##$NCOEF= 0
##$NC_proc= 0
##$NLEV= 6
##$NOISF1= 3.799351
##$NOISF2= 2.8
##$NSP= 1
##$NTH_PI= 0
##$NZP= 0
##$OFFSET= 15.70392
##$PC= 1
##$PHC0= -11123.29
##$PHC1= 13.40094
##$PH_mod= 1
##$PKNL= yes
##$PPARMOD= 0
##$PSCAL= 0
##$PSIGN= 0
##$REVERSE= no
##$SF= 200.130013532006
##$SI= 16384
##$SIGF1= 3
##$SIGF2= 2
##$SINO= 400
##$SIOLD= 16384
##$SREGLST= <1H.CDCl3>
##$SSB= 0
##$STSI= 0
##$STSR= 0
##$SW_p= 3612.71676300578
##$SYMM= 0
##$S_DEV= 0
##$TDeff= 0
##$TDoff= 0
##$TI= <>
##$TILT= no
##$TM1= 0
##$TM2= 0
##$TOPLEV= 0
##$USERP1= <user>
##$USERP2= <user>
##$USERP3= <user>
##$USERP4= <user>
##$USERP5= <user>
##$WDW= 1
##$XDIM= 8192
##$YMAX_p= 0
##$YMIN_p= 0
$$ End of Bruker specific parameters
$$ ---------------------------------
##NTUPLES= NMR FID
##VAR_NAME=  TIME,          FID/REAL,        FID/IMAG
##SYMBOL=    X,             R,               I
##VAR_TYPE=  INDEPENDENT,   DEPENDENT,       DEPENDENT
##VAR_FORM=  AFFN,          ASDF,            ASDF
##VAR_DIM=   8192,          8192,            8192
##UNITS=     SECONDS,       ARBITRARY UNITS, ARBITRARY UNITS
##FACTOR=    0.0002944,     1,               1
##FIRST=     0,             0,               0
##LAST=      2.4114304,     0,               0
##MIN=       0,             -64378,          0
##MAX=       2.4114304,     73988,           0
$$ Real data points
##PAGE= N=1
##DATA TABLE= (X++(R..R)), XYDATA
0@%%%%%%%%%%%%%%qJ6j6J6j6J6k4L2l2M0m8N6o4P2q8J04j19J34j51J68j88K12
$$ 0 0 0 0 0 0 0 0 0 0 0 0 0 0 0 -8 8 -8 8 -8 8 -16 16 -16 24 -24 32 -32 40 -48 56 -63 71 -80 88 -100 112
36A12k39K68k99L33l70M10m54N03n57O18o82P49q25R09j000J103j215J340j482
$$ 112 -127 141 -158 175 -195 215 -239 264 -293 325 -357 392 -433 476 -524 579 -636 704 -778
55g78J640j819K026k268K553k892L307l832M514n435O757q828J2517k0956P1998
$$ -778 862 -957 1069 -1199 1354 -1538 1769 -2063 2451 -2984 3773 -5055 7462 -13494 58504
70E8504J5484j38366R3252j8380k8951M4337k9720J0980R490l4495M3908k0156
$$ 58504 73988 -64378 28874 10494 -18457 25880 -3840 7140 16630 -17865 26043 5887
82E887k6722L2612p509K782N471k8546K4215J0291k1615K346N043j539L83N126
$$ 5887 -20835 11777 4268 7050 12521 -16025 8190 18481 -3134 -788 4255 2716 3099 8225
96H225O301k2504l988K7063j426j8621k597R082K273r843J0052p80k1389J7021
$$ 8225 14526 -7978 -11966 15097 13671 -4950 -7547 1535 3808 -6035 4017 3237 -18152 -1131
110a131J2833k4043j478J4666M264p030q720O688p01R90J1730j5203n007J7595
$$ -1131 11702 -12341 -13819 847 5111 -1919 -10639 -3951 -4652 -3662 8068 -7135 -12142 5453
124E453o155K611O467j8900J006J6971k056q746J201P651o146m864Q319n878m137
$$ 5453 -702 1909 8376 -10524 -9518 7453 5397 -3349 -2148 5503 -643 -5507 2812 -3066 -7203
139g203J2452K278r979p410Q031Q435p755p28K789l454Q321K817j2589m83P039
$$ -7203 5249 7527 -2452 -9862 -1831 6604 -1151 -1879 910 -2544 5777 8594 -3995 -4478 2561
154B561K287K164k975m496K605L885L43m361l751P027L849r888J941L805r382
$$ 2561 4848 7012 4037 -459 2146 6031 6374 2013 -1738 5289 9138 -750 1191 4996 -4386
169d386P642N030j4161J908O231j264J138o913k37L021k983R680m735j3374J3333
$$ -4386 3256 8286 -5875 -3967 2264 1000 2138 -4775 -5012 -1991 -4974 4706 -29 -13403 -70
184g0K062p524L914l994J836L848l712J879m961K280R790r982k045M390n731P736
$$ -70 1992 -5532 -1618 -5612 -3776 72 -3640 -1761 -6722 -4442 5348 -4634 -6679 -2289 -8020 -284
200b84K010r028K378L141J171l000k766M604j818J821O723q062l822P435R27j627
$$ -284 1726 -7302 -4924 -1783 -612 -3612 -6378 -1774 -3592 -1771 4952 -3110 -6932 503 1430 -197
216a97M48K492j460j047O035m983o144J0529L197o055j573R73L240j760n21J881
$$ -197 251 2743 1283 236 6271 1288 -4856 5673 8870 2815 1242 2215 5455 3695 3174 5055
232E055n346K338N650m239k142o41L43L705j953k566n03K535K759o382p75O448
$$ 5055 -291 2047 7697 3458 1316 675 1018 4723 2770 204 -299 2236 4995 -1387 -2162 4286
248D286n400N75N826o062m153N077L527l710n427N257J507n546M870k92p405N231
$$ 4286 -1114 -539 5287 -775 -4928 149 3676 -34 -5461 -204 1303 -4243 627 335 -7070 -1839
264a839M113n145k225P01K087J119j658L50q56k66K350k529j078L152M2J501J041
$$ -1839 2274 -2871 -5096 -4395 -2308 -1189 -2847 -2497 -3353 -3619 -1269 -3798 -4876 -1724 -1682 -181 860
281H60n142j124O128J142l548k57L500m87l375L423J875n555K697N746l654l897
$$ 860 -4282 -5406 722 1864 -1684 -1941 1559 1072 -2303 1120 2995 -2560 137 5883 2229 -1668
297a668K504L571k014j931K357j613N5M015k616k320J610N69R47p09j925j45K221
$$ -1668 836 4407 2393 462 2819 1206 1261 5276 2660 340 1950 2519 3466 2757 832 687 2908
314B908K796m408l207O011j870k488M399k796k430K453Q83n82m245J789N818o543
$$ 2908 5704 1296 -1911 4100 2230 -258 4141 1345 -1085 1368 2251 1669 -2576 -787 5031 -1512
330a512q88L880m109J014L031k473j178j407K205K439l821M03M69o99K698k965
$$ -1512 -2400 1480 -2629 -1615 1416 -1057 -2235 -3642 -1437 1002 -2819 -2416 -1947 -2646 52 -2913
346b913j756M080m65r10J182j742r70J838K987j585m570L965L871m645o07K922
$$ -2913 -4669 -589 -1054 -1964 -782 -2524 -3494 -1656 1331 -254 -4824 -859 3012 -1633 -2240 682
362F82r70j67J958J51k497m30L260Q6k617P06J043M80Q57j612r49K164k50j65
$$ 682 -288 -455 1503 1654 -843 -1273 1987 2073 -544 162 1205 1685 2542 930 -19 2145 1895 1730
380A730K62r16L71N23J486j01n012K488N029m250r24J749j917J341L15r31l46
$$ 1730 1992 1076 1447 1970 3456 3355 -1657 831 5860 1610 686 2435 518 1859 2174 1243 897
397H97j062K887l03n267L559Q13l246L556k427k365K809m28Q77j764k005L380
$$ 897 -165 2722 2419 -2848 711 1524 -1722 1834 -593 -2958 -149 -577 300 -1464 -3469 -89
413h9k405K73K795n363K111L885m232P94l07m08K743j841N03l1k965N053j023
$$ -89 -2494 -2221 574 -4789 -2678 1207 -3025 -2231 -2538 -2946 -203 -2044 -1541 -1572 -4537 516 -507
430e07m402L996j191K34K816m322K76K628l21J076l160J650K956m119L023J545
$$ -507 -4909 -913 -2104 -1870 946 -3376 -3100 -472 -793 283 -2877 -1227 1729 -2390 633 2178
446B178n121L098K522j350j331p57M268p99l196L387j126j229L161r21q67q24
$$ 2178 -2943 155 2677 1327 -4 -761 3507 2708 -488 2899 1773 544 3705 2784 1917 1093
462A093m79L433j736j858Q43m66K777k034l004M053j621j568L498k535j733J124
$$ 1093 614 4047 2311 453 1296 830 3607 1573 -1431 2622 1001 -567 2931 396 -1337 -213
478b13J758P52n493J358N006m703k63L173k995M34J233m76j59l337K449K771l843
$$ -213 1545 2297 -3196 -1838 3168 -1535 -1798 1375 -1620 -1186 47 -429 -588 -3925 -1476 1295 -2548
495b548K81L65n91K151j643j024K177j399K07J908j559j555J487K642p20l473
$$ -2548 -2267 -1902 -2493 -342 -1985 -3009 -832 -2231 -2024 -116 -1675 -3230 -1743 899 179 -3294
511c294J650L440j829j473K485o27j599K614J106k235p31K203J841k361j255K218
$$ -3294 -1644 1796 -33 -1506 979 352 -1247 1367 2473 238 -493 1710 3551 1190 -65 2153
527B153N0m33P51j479N65M04o59J844j459k186K746P35r23k041j62L391j463k471
$$ 2153 2203 1770 2521 1042 1607 2011 1352 3196 1737 -449 2297 3032 2109 68 -94 3297 1834 -637
545f37L159j801j489K840K32k342j301K482J557l628m30K581j531k77O12j085
$$ -637 2522 721 -768 2072 2304 -38 -1339 1143 2700 -928 -1358 1223 -308 -585 27 -1058
561a058l57k09J296j96k023P9J175J095q34k152J586R06j242K53K09j44o10J192
$$ -1058 -1415 -1624 -328 -524 -2547 -2468 -1293 -198 -1032 -3184 -1598 -692 -1934 -1681 -1472 -1616 -2226 -1034
579a034J562k946o28M249j140j856P33N43O97p31N19P48k609J572K272k874J31
$$ -1034 528 -2418 -3046 1203 63 -1793 -1060 -517 180 -551 -32 716 -1893 -321 1951 -923 -792
596g92R00j47J587j283o88J371m50J200n34q61J021m41M76J377k419O1K104o83
$$ -792 108 -39 1548 265 -423 948 498 1698 1164 303 1324 883 1359 2736 317 378 2482 1799
614A799o07o2K19M09l72L50p45j121J476O74k119k79J014M1l98K63q02r91J483
$$ 1799 1192 1130 1349 1758 1386 1736 991 -130 1346 2020 -99 -378 636 677 279 542 -260 -1251 232
633B32M01j303p42R55L03m46l93K43j124J006J098j979m1P51o4M04n65m76L02
$$ 232 633 -670 -1412 -457 -154 -600 -993 -750 -1874 -868 230 -1749 -1790 -1039 -1103 -699 -1264 -1740 -1438
652a438L02O22o01j044J104J58k75P20r59p37K031J96j201rJ209K79o33J39M49
$$ -1438 -1136 -514 -1115 -2159 -1055 -897 -1172 -452 -1411 -2148 -117 79 -1122 -1131 78 357 -276 -137 312
671C12o00L51J666r19j263J093P75l25k17l7M5O31O4j09k93m76P22K42l83l25
$$ 312 -288 63 1729 810 -453 640 1415 1090 873 836 881 1512 1576 1467 1174 698 1420 1662 1279 954
691I54o06J131O84k123K03J715j161k44K80j66n06k53J606n36k489J816J146j934
$$ 954 348 1479 2163 40 243 1958 797 553 833 667 161 -92 1514 978 -1511 305 1451 -483
709d83m3K28p7m6l94O58p39n51J044J86q78p03K16R35j62j401Q41Q89q61k23Q16
$$ -483 -526 -298 -375 -421 -815 -157 -896 -1447 -403 -217 -1095 -1798 -1582 -647 -809 -2210 -1369 -480 -1341 -1564 -748
730g48q0j010M16J675j179j467K012J016j440m79J150L95j199O28J216j344l30
$$ -748 -828 -1838 -1422 253 -926 -2393 -381 635 -805 -1284 -134 261 -938 -310 906 -438 -768
747g68J736L8j022j88Q66J008j005n42J090p3J06l15M57O9j237R75J396j549j319
$$ -768 968 1006 -16 -204 662 1670 665 123 1213 1140 1246 931 1388 1457 220 1195 2591 1042 -277
766b77J897M53j432j98J188k59j428J069P58j887M5J618l47j248m41J132K42j369
$$ -277 1620 2073 641 443 1631 1372 -56 1013 1771 -116 -71 1547 1200 -48 -489 643 885 -484
784d84l0O68o41J93k50K01l39p52J147O63j713M9R47l27m36n06Q88J29j342J295
$$ -484 -514 154 -487 -294 -544 -343 -682 -1434 -287 376 -1337 -1288 -341 -668 -1104 -1610 -722 -593 -1935 -640
804f40O91k456Q10J384m58o59J67J342m57j014J341m36p43J312p2l85O7J41M75
$$ -640 51 -2405 -1595 -211 -669 -1328 -1161 181 -276 -1290 51 -385 -1128 184 112 -273 -206 -65 410
823D10n3m63M21J92M57k74n64J081k76l62P14n13l99P10L22k22p99N5Q85m86k74
$$ 410 357 -106 315 507 964 690 126 1207 931 569 1283 770 371 1081 1403 1181 382 437 1322 836 562
844E62O11p32K84N37p96l8j50L09K86p84M0J43m31O55j97p29L18k3j50p1N0j50
$$ 562 1173 441 725 1262 466 428 278 587 873 89 129 272 -159 496 299 -430 -112 -135 -285 -356 -306 -456
866d56k27L67n4r26K63M97j79l61J93o8QN90m72l13Q0L45K59o22J12K54j62P95
$$ -456 -683 -316 -370 -1296 -1033 -536 -715 -1076 -883 -951 -943 -353 -825 -1138 -1058 -713 -454 -1076 -964 -710 -872 -77
888g7j48j265P36P39l21k27K14L5P6p1P71p24m08J388j76n90J74o6Q21j16k98
$$ -77 -225 -1490 -754 -15 -336 -563 -349 -314 -238 -309 462 -262 -670 718 542 -48 126 60 881 765 467
909D67N7J97J82J87m03M67o65L66J018j039k93L78Q6K53j066M39P48j111M22O04
$$ 467 524 721 903 1090 687 1154 489 855 1873 834 541 919 1005 1258 192 631 1379 268 690 1294
929A294j297k13J141k57n01p12N39M51r19K75Q3n48N56j41k36J06q47O87Q00j078
$$ 1294 -3 -216 925 668 167 -545 -6 445 -474 -199 -116 -664 -108 -249 -485 -379 -1226 -539 261 -817
949h17l62K43M20m15o36J081k78j042J593n4j279L58J032J37j028k40J334m9r49
$$ -817 -1179 -936 -516 -931 -1567 -486 -764 -1806 -213 -267 -1546 -1188 -156 -19 -1047 -1287 47 -2 -951
968i51R70k3n14K77M69J14n45J06J014k91n34N8M89L62m90L16J74n98j3N10K74
$$ -951 19 -4 -518 -241 228 342 -203 -97 917 626 92 150 639 1001 511 827 1001 403 390 900 1174
989A174r36R7J235j79j382N95N90l35k93K98j05p04L83J027j269l78O22Q5N3p56
$$ 1174 238 335 1570 1391 9 604 1194 859 566 864 759 55 438 1465 196 -182 440 525 578 -178
1009a78K09J64j07j20L8k36l09O4N53k25j132O25K30L6o41j25P23k34k95M76m44
$$ -178 31 195 88 -32 6 -230 -539 -475 78 -147 -1279 -654 -424 -388 -1029 -1154 -431 -665 -960 -484 -928
1030i28k59N45L13n45o39P69O39m19l84O80n26J87P67o70J81M5j38P43n01j88
$$ -928 -1187 -642 -329 -874 -1513 -744 -105 -524 -908 -228 -754 -567 200 -470 -289 -244 -382 361 -140 -328
1050c28O91kJ54m68j5R89n13o04P51l48R9N11k8k0q81K49J108p62NJ19l03O79
$$ -328 363 361 515 47 32 1021 508 -96 655 307 406 917 889 869 -12 237 1345 583 588 707 404 1083
1072A083l53j79j3l30N13J40q28L46q4j23N07p81m14O60k32Q2k18J41Q0k43J67
$$ 1083 730 551 538 208 721 861 33 379 295 172 679 -102 -516 144 -88 -6 -224 -83 -3 -246 -79
1093g9j72o62N35L22m70k8j84J27l26M3L05o16N38M44o58J23l4p7K47K34j10m37
$$ -79 -251 -913 -378 -56 -526 -554 -738 -611 -937 -894 -589 -1205 -667 -223 -881 -758 -792 -869 -622 -388 -498 -935
1115i35N7R94l15p98Q46Nk88O09k92n4j69P53O9m46Q9M58J14l78n9j42P37l06
$$ -935 -878 116 -199 -997 -151 -146 -434 175 -117 -171 -340 413 482 36 125 583 697 319 260 118 855 549
1137E49K05K37m04k9J52K31k93m03N13L00n67l82O32Oo36L05J82k99k20P24j47
$$ 549 754 991 587 558 710 941 648 245 758 1058 491 109 741 747 111 416 598 299 79 803 656
1158F56q72j04Q58o0o03j8J43k65j53J20K19o41K21K40K5m33L3K16J60m40k0K17
$$ 656 -216 -320 538 478 -125 -143 0 -265 -418 -298 -79 -720 -499 -259 -234 -667 -634 -418 -258 -698 -718 -501
1180e01k91j99N51K99j019J1J032o1j103Q75K46j42l99L59O3Ll76R60m22k71N79
$$ -501 -792 -991 -440 -141 -1160 -1149 -117 -178 -1281 -406 -160 -302 -701 -342 -279 -276 -652 308 -114 -385 194
1201A94J57j82j45j49P23K3o13L19J78k75L0L19K36l95l92J008m28m16J94O07
$$ 194 351 169 24 -125 598 621 8 327 505 230 260 579 815 420 28 1036 608 192 386 993
1221I93n87n3L62J50n88J23O65n43n23N65J94m47l41L36M21n48m72M10J89l85
$$ 993 406 353 715 865 277 400 1065 522 -1 564 758 311 -30 306 727 179 -293 117 306 -79
1241g9K0J13J13n43L9L60m78n36Q22k4m64J22K72J18p88L6O78m13n16P20J90o28
$$ -79 -59 54 167 -376 -337 23 -455 -991 -169 -193 -657 -535 -263 -145 -933 -897 -219 -632 -1148 -428 -238 -866
1263h66K87P2K38l67O5L10n6m5K70l12K60j53J62K77j75J04L62j4j3l45J32N17
$$ -866 -579 -507 -269 -636 -571 -261 -317 -362 -92 -404 -144 -297 -135 142 -33 71 433 419 406 61 193 710
1285G10p20M87N57r79L19N54n47J12j53L57k20j49K78Jn72N80j5m42L16j87J72
$$ 710 -10 477 1034 55 374 928 381 493 340 697 477 328 606 607 35 615 600 158 474 287 459
1306D59k4k14j6r9r9N47m45Oj96M6Q8j35q8j35L9j03K59k42jj68J88O4k52QK30
$$ 459 435 221 205 106 7 554 109 115 -81 -35 53 -82 -170 -305 -266 -369 -110 -352 -353 -521 -333 -269 -521 -513 -283
1331b83m46K23j6L47l20j10J96l6l52P49j23l82M16K21k14L9j3M6j08j7M76k52
$$ -283 -729 -506 -522 -175 -495 -605 -409 -445 -797 -48 -171 -553 -137 84 -130 -91 -104 -58 -166 -183 293 41
1353D1k71K20J14L24m15J35J89j00J26j27L37k9l53M96j66j98oM39q6m12R2K05
$$ 41 -230 -10 104 428 13 148 337 237 363 236 573 544 191 687 521 323 317 756 670 258 350 555
1375E55l8l72K61K9J20m07L38k44k79M03K32m22p2J48l02K03l87J22Q7q6J6j1
$$ 555 517 145 406 435 555 148 486 242 -37 366 598 176 104 252 -50 153 -234 -112 -25 -111 -95 -106
1397a06k02K16m88L45J32m96J3O69m12o3R1oj62j31L51k55k37M99J37m21J43n4
$$ -106 -308 -92 -580 -235 -103 -599 -586 83 -329 -392 -301 -307 -469 -600 -249 -504 -741 -242 -105 -526 -383 -437
1419d37K61J5j80N07l85M0J23K59l61r5O5L27K10n22M71L28m45j42L72J0k53L12
$$ -437 -176 -161 -341 166 -219 -179 -56 203 -158 -253 -188 139 349 -173 298 626 181 39 411 421 168 480
1441D80K94l12k31J82K63j60l25L50K05j71j41L56p76K62J51j73J1m65M89j39
$$ 480 774 462 231 413 676 516 191 541 746 575 434 790 14 276 427 254 265 -200 289 150
1461A50j98Q4qJ95k04j18L44k72m81N29K96p78j20M72N6l46k66M44k70j86L44
$$ 150 -48 36 28 223 19 -99 245 -27 -508 21 317 -461 -581 -109 -53 -399 -665 -221 -491 -677 -333
1482c33Nj67R7K79k34l04J79M11k93k3j4L02O8p5j96J36p7K2L63o9j38j86M59
$$ -333 -328 -495 -398 -119 -353 -657 -478 -67 -360 -383 -397 -95 -27 -102 -298 -162 -239 -217 146 77 -61 -247 212
1505B12N4l48L9J62R1K5l2r8L7J19L10l10l47M19K35J3l71K89j93J00J6Q9l44
$$ 212 266 -82 -43 119 210 235 203 105 142 261 571 261 -86 333 568 581 210 499 306 406 422 511 167
1528A67M59m3m62J48j18l7J61L13m52j32J90p7j26m5m2Ok18K26l3k59J88J36j73
$$ 167 626 583 121 269 151 114 275 588 136 4 194 117 -9 -54 -96 -90 -308 -82 -115 -374 -186 -50 -223
1551b23R1j87k05K23J98l07N8J0M9P8j46J04k61P6K71l27J99L9j9j3j06L85N6
$$ -223 -132 -319 -524 -301 -103 -410 -352 -342 -293 -215 -361 -257 -518 -442 -171 -498 -299 -260 -279 -292 -398 -13 43
1574D3k21J72J49k88J10j04J06J73k18QJ97q7L54l25K40J13m18M08n4j63K08K90
$$ 43 -178 -6 143 -145 -35 -139 -33 140 -78 -70 127 40 394 69 309 422 4 412 358 195 403 693
1596F93m43j30K79K90m48Q0J22M0l38K93q9k08p7K25Q5k28l26K69P2K49m87J1
$$ 693 250 120 399 689 241 321 443 483 145 438 349 141 64 289 374 146 -180 89 161 410 -77 -66
1618f6n1O4J08J1Kl48J27j5J64m10K3L40l38m3K57J00k60J22q9k13j45L08L31
$$ -66 -117 -53 55 66 68 -280 -153 -168 -4 -414 -391 -51 -389 -432 -175 -75 -335 -213 -302 -515 -660 -352 -21
1641b1l23n2L78j56p6p6J86K08k15q1M02l29j25M05j22m4k94M36L21m37Q5L20
$$ -21 -344 -396 -18 -174 -250 -326 -140 68 -147 -228 174 -155 -280 125 3 -41 -335 101 422 -15 70 390
1663C90j05l84L42j5J2k57K00J6k88M18K38l52M2L43j51j16Q6j3j70j91L10J11
$$ 390 285 -99 243 228 240 -17 183 199 -89 329 567 215 257 600 449 333 419 406 236 45 355 466
1685D66m04J25r8j96J95j59r8L00J65l47j77M36m86j53L32oq3O1K80m64n6kL7
$$ 466 62 187 89 -107 88 -71 -169 131 296 -51 -228 208 -278 -431 -99 -105 -188 -127 153 -311 -367 -369 -332
1708c32j5j51K49q2r7K98nk90J58j86L27r0n4J50J63j01l49N96k61k92K22L14
$$ -332 -347 -498 -249 -331 -428 -130 -135 -425 -267 -453 -126 -216 -270 -120 43 -58 -407 189 -72 -364 -142 172
1730A72l52O3O1J57J51k70K12p9N6J2J06mJ5L7j06J5j4P9j98J1r9L1r6O03l73
$$ 172 -180 -117 -56 101 252 -18 194 115 171 183 289 285 300 337 231 246 232 311 113 124 25 56 -40 563 190
1755A90J91k30J12l07M07j20l76K41K8k08J8K61j54k28P6J37j14j68L44k91j20
$$ 190 381 151 263 -44 363 243 -133 108 136 -72 -54 207 53 -175 -99 38 -76 -244 100 -191 -311
1776c11J36O2o9m7L39m50J58J09k43O3K28k57o4K30K74o66K26K30k19j83M59k05
$$ -311 -175 -113 -182 -229 110 -340 -182 -73 -316 -253 -25 -282 -346 -116 158 -508 -282 -52 -271 -454 5 -200
1798b00m8o9M95l15J21m5J54J42k78o6j5K39j13J16lR4j07J26J73j14K06k31J48
$$ -200 -248 -317 178 -137 -16 -61 93 235 -43 -109 -124 115 2 118 115 209 102 228 401 287 493 262 410
1821D10k31l0L41j21k70K60k20m4K55k91J58O5j18J37l60J75p8j8J11j29m2k6
$$ 410 179 149 490 369 99 359 139 95 350 59 217 282 164 301 -59 116 38 20 131 2 -40 -66
1843f6K36m52J69J05q7k16N4J1J93m00M40J02l02p0qK1LM6N2j42J94Kj72J7K06
$$ -66 170 -282 -113 -8 -95 -311 -257 -246 -53 -453 -13 89 -213 -283 -291 -270 -267 -221 -169 -311 -117 -115 -287 -270 -64
1868f4j50Mj60K49K01l22J34Q8q5O6l1J93J90k41J59o9J21l28K19Q1L6k85J14
$$ -64 -214 -210 -370 -121 80 -242 -108 -20 -105 -39 -70 123 313 72 231 162 283 -45 174 255 291 6 120
1891A20K63m20R9K31k15M3J70M2j58p3K4Q3n6K09j73j16K13l22J88ln6n7L09k42
$$ 120 383 -37 62 293 78 121 291 333 175 102 126 209 153 362 189 73 286 -36 152 149 93 36 345 103
1915A03k27J30M0K5k69K09P5l39JL62j69k73M58j47k85K79j01l45M4M46m95K97
$$ 103 -124 6 46 71 -198 11 86 -253 -252 110 -59 -332 126 -21 -306 -27 -128 -473 -429 17 -478 -181
1937a81rrl4P8k45J41J68K8j59K00J75l70PNl2m7J13J80k91K36K00l65O4K73K34
$$ -181 -190 -199 -233 -155 -400 -259 -91 -63 -222 -22 153 -217 -210 -205 -237 -284 -171 9 -282 -46 154 -211 -147 126 360
1962C60m47L32n9p7P0j0J0J3n6o6L72k12jQ8l69J65J65j04K50j05k52J29N5k02
$$ 360 -87 245 186 109 179 169 179 192 136 70 442 230 229 317 -52 113 278 174 424 319 67 196 251 49
1986D9M0J53N3j09J2k07o3o5O4J59l0j45k4j18l8J99j34J65j22l6j20J03J78k32
$$ 49 89 242 295 186 198 -9 -72 -137 -73 86 56 -89 -113 -231 -269 -70 -204 -39 -161 -197 -317 -214 -36 -268
2010b68q4J97k0JR4j3j60N6J87Pm20K18J70j52l6J96m3q0O9L5q5K84k26K40l9
$$ -268 -352 -155 -175 -174 -80 -93 -253 -197 -10 -3 -423 -205 -35 -187 -223 -27 -70 -150 -81 -46 -131 153 -73 167 128
2035A28L3j79J95j02KQK23j54p3m1L06k43%K12j62Q3r5M42m39J90m4n8J05k38
$$ 128 161 -18 177 75 77 85 308 154 81 40 346 103 103 315 153 236 141 583 144 334 290 232 337 99
2059I9r7O1r5k7J73j71K42k87l5L15l37pJ06j36k75O30k67k38K23p7j3J79j23
$$ 99 2 63 -32 -59 114 -57 185 -102 -137 178 -159 -166 -60 -196 -471 159 -108 -346 -123 -200 -213 -34 -157
2082a57N2J48l50P4K06n05L80j27j2J77j8Q0r7n0k3j2J66N7l1k06J88K1P1p1m68
$$ -157 -105 43 -307 -233 -27 -532 -152 -279 -291 -114 -132 -52 -149 -199 -222 -234 -68 -11 -42 -248 -60 -39 32 -39 -507
2107e07L49L05k49L6J00K07p2j87J01k2J38j3r1j00KO6M7j08M63m02J10Pj55K72
$$ -507 -158 147 -102 -66 34 241 169 -18 83 61 199 186 95 -5 -3 63 110 2 465 63 173 180 25 297
2131B97j57J39q7j87J08pK80n5m78K57O5j18K0p5O5j75r5K49L00m04Por0J18k13
$$ 297 140 279 192 5 113 106 386 331 -147 110 175 57 77 2 67 -108 -203 46 346 -58 -51 -57 -147 -29 -242
2156b42j5J91k63K65j67O9j44j9J59j75K26j45J98R0j00j82N42m11J55j0k33j29
$$ -242 -257 -66 -329 -64 -231 -162 -306 -325 -166 -341 -115 -260 -62 28 -72 -254 288 -123 32 22 -211 -340
2178c40J88P2j90K85M14m07m7J84k39J44J20k73K84o3R6j10J02k21P9K7K15n0
$$ -340 -152 -80 -270 15 429 22 -25 159 -80 64 184 -89 195 132 228 118 220 -1 78 105 320 270
2200B70k17R6J48l59K28j78M84l62p6L90l93K85k37r7j7O1R9o9m3j01M1j72M01
$$ 270 53 149 297 -62 166 -12 472 110 34 424 31 316 79 -18 -35 26 125 56 13 -88 -47 -219 182
2223A82k68j30K65j3l38J31K13l32J67l6k65L2K31J51l47J31J80L5l54K05K13
$$ 182 -86 -216 49 36 -302 -171 42 -290 -123 -159 -424 -392 -161 -10 -357 -226 -46 -11 -365 -160 53
2244E3m74K33K80k25K4l5J78p3J78l27P6K61r4j79J43P6P0j24n4m3J56k21N48
$$ 53 -421 -188 92 -133 -109 -144 34 -39 139 -188 -112 149 55 -124 19 95 165 41 -13 -56 100 -121 427
2267D27m55p2K87J36o2JJ95m03J13K4M3R9j44J9J24J15k30J89j15j68j50l0Q7
$$ 427 -28 -100 187 323 261 262 457 54 167 191 234 333 189 208 332 447 217 406 291 123 -27 -57 30
2290C0o0KO1q5j32L2J31n6j1J92l04J45O6j4k30J08L5K79n07J54J58k49N6N9n1
$$ 30 -30 -28 33 -52 -184 -152 -21 -77 -88 104 -200 -55 11 -3 -233 -125 -90 189 -318 -164 -6 -255 -199 -140 -191
2315a91m7K8p2K19m3O7o4J28o4k49K30j2Nr0K80j55j24J86J05k49K80q5j47J96
$$ -191 -238 -210 -282 -63 -106 -39 -103 25 -39 -288 -58 -70 -65 -155 125 -30 -154 32 137 -112 168 83 -64 132
2339A32K91q6l42Q3P3K7q6L7J07N6k06J90j6j48N4N2qK2k65r6L33J01l73P8R7
$$ 132 423 337 -5 78 151 178 92 129 236 292 86 276 260 112 166 218 210 232 -33 -129 204 305 -68 10 107
2364A07j05J27L13l22j80O5O8j83N0J05O7k0j54J90l06pO5J09j30O9Q3Jr9p3j48
$$ 107 2 129 442 120 -60 5 73 -110 -60 45 112 92 -62 128 -178 -185 -120 -11 -141 -72 11 12 -87 -160 -308
2389c08J54K93m34K00N1j13m4j4J83l7k4M0J2m7J47j42L1j76M75k40R2o4j00J34
$$ -308 -154 139 -295 -95 -44 -157 -201 -215 -32 -69 -93 -53 -41 -88 59 -83 -52 -228 247 7 99 35 -65 69
2413F9K24k20j4R2L6m3j68L12r1P0j26M8j90K32j14j34J94j0j74Q1J89l65K84
$$ 69 293 73 59 151 187 144 -24 288 197 267 141 189 -1 231 117 -17 177 167 -7 74 263 -102 182
2436A82q8j53k1ML84k32j05p4k3K17J05k7L0k38n7o0K1J19r2L8O5Kk02N0n7j07
$$ 182 94 -59 -80 -76 308 76 -29 -103 -126 91 196 169 199 -39 -96 -156 -135 -16 -108 -70 -5 -3 -205 -155 -212 -319
2462c19J06P8o4M7kj07J94j86J12Q3j77K16l0k57K04j23L07m9J05k10J75j84K69
$$ -319 -213 -135 -199 -152 -154 -261 -67 -253 -141 -58 -235 -19 -49 -306 -102 -225 82 33 138 -72 103 -81 188
2485A88j45J81j80k8j47J71J93m37N72l93J87j91j9J06J72j1k3k48J28K56k45
$$ 188 43 224 44 16 -131 40 233 -204 368 -25 162 -29 -48 58 230 219 196 -52 76 332 87
2506H7K79l32M5K28o4q3R0j96J60l02j48K33R2k76K38j30J73K4K09n21O06n55
$$ 87 366 34 79 307 243 160 250 54 214 -88 -236 -3 89 -187 51 -79 94 118 327 -194 412 -143
2528a43j57J80J29j03l08L03p1L2n7n1jK43k5k31J34J09l82J87K90k17K8j86K44
$$ -143 -300 -120 9 -94 -402 -99 -170 -138 -195 -246 -247 -4 -29 -260 -126 -17 -399 -212 78 -139 -111 -297 -53
2551e3J46m50M58r2JL0Q2j30r9k1J61Q8j13J18J3j98J53k35K59o8K67l22OK08
$$ -53 93 -357 101 9 10 40 122 -8 -107 -128 33 121 8 126 139 -59 94 -141 118 50 317 -5 1 209
2575B09j01J15j22j3J0R3j65J59j67j14M48k06j14J74j01o6J68Q1m33L10j32j99
$$ 209 108 223 101 88 98 191 26 185 18 -96 352 146 32 206 105 39 207 288 -145 165 33 -166
2597a66j73M42M4j72q4l6p0L24l61K44J4J02P5l48rq2L87j69j32o6j75L41q8L03
$$ -166 -339 103 147 -25 -109 -145 -215 109 -252 -8 6 108 183 -165 -174 -256 131 -38 -170 -236 -411 -70 -158 145
2621A45k73k2m0J84J67m87P0J38rJ38r1k08J5L58j1j27J76k06K93j64O2R0n2n
$$ 145 -128 -150 -190 -6 161 -326 -256 -118 -127 11 -80 -288 -273 85 74 -53 123 -83 210 46 108 198 146 141
2645A41K1J24k22O3j69P9O0m3J46j97J77k03k7R1M7kP7j18j94J71J04j99J30N6
$$ 141 162 286 64 127 -42 37 97 54 200 3 180 -23 -50 41 88 86 163 45 -149 22 126 -73 57 113
2669A13K1j92j48J52J52j26J50j61o7L4m3J74m9J48l81J83J15k66MJ32n0j53M
$$ 113 134 -58 -206 -54 98 -28 122 -39 -106 -72 -115 59 10 158 -223 -40 75 -191 -187 -55 -105 -258 -254
2692b54K69k50Q8r9J60j06k0J32O2K4k28J99J15K09k93J01R8j78m8L00n44K84
$$ -254 15 -235 -147 -246 -86 -192 -212 -80 -18 6 -222 -23 92 301 8 109 207 29 -19 281 -263 21
2714B1J54j20J88J0m67K05J01l2rr5J51m9J12k6O8p1n7N5L5L9Q9k66r6J06J2K35
$$ 21 175 55 243 253 -214 -9 92 60 51 -44 107 58 170 144 212 141 84 139 174 213 302 36 -60 46 58 293
2740B93J0l82J65j87K10r5p0m1j9rj53L45r4N9l88L84r5Q7j06o1j67M71k16j93
$$ 293 303 -79 86 -101 109 14 -56 -97 -116 -125 -278 67 -27 32 -356 28 -67 20 -86 -147 -314 157 -59 -252
2764b52J90N6p0j64K00RJ07n4k32J39MJ61l83J42J28rk08K31p8K05j10j26Q2%
$$ -252 -62 -6 -76 -240 -40 -31 76 22 -210 -71 -67 94 -289 -147 -19 -28 -236 -5 -83 122 12 -114 -32 -32
2788c2J06n4k09l2L57rj41K9j49J14M95l80k92N8K82J66k05J07j78J11j79jK30
$$ -32 74 20 -189 -221 136 127 -14 15 -134 -20 475 95 -197 -139 143 309 104 211 33 144 -35 -36 194
2811A94K8j57q6K42j14j12M4k48L10j1n7N6O6j85l1N2J31k41L5O6l54L28o7K1
$$ 194 222 65 -21 221 107 -5 39 -209 101 90 33 89 155 -30 -61 -9 122 -119 -84 -18 -372 -44 -111 -90
2835i0M3o2n9J5J44k42K46m8j15Q9k39L35l82L09J34k13J33N3j93J53j08N3J5
$$ -90 -47 -109 -168 -153 -9 -251 -5 -53 -168 -79 -318 17 -365 -56 78 -135 -2 51 -142 11 -97 -44 -29
2858b9J24j09L0K8p7m0K9p8J41J76j51k0J5R0q1P7j85P8m9rK89j27j07L1J08p0
$$ -29 95 -14 16 44 -33 -73 -44 -122 19 195 44 24 39 129 48 125 -60 18 -31 -40 249 122 15 46 154 84
2884H4K27k2l77MK70J22j03k29L47m10K51j61J13j41m5k3ML5j83L18l96J01M2
$$ 84 311 289 -88 -84 186 308 205 -24 323 -87 164 3 116 -25 -70 -93 -89 -54 -237 81 -315 -214 -172
2907a72M12k01o5l6j86K27o2l08K25k5R2j17K44n7kk26K18j12O8J11Q7l44P9J41
$$ -172 240 39 -26 -62 -248 -21 -83 -391 -166 -191 -99 -216 28 -29 -31 -257 -39 -151 -83 28 115 -229 -150 -9
2931io3p8nK12l39J59J63J9P2j7m17M46J15j72o7J20o6J08o5j4M1p9J39K6q5O2
$$ -9 -72 -150 -155 57 -282 -123 40 59 131 114 -303 143 258 86 19 139 73 181 116 102 143 64 203 229 144 206
2957B06j11L12m77J37J81k92p6L21l0M2r8j50P0l1N5J77j52Q1m08K02Jj00J53
$$ 206 95 407 -70 67 248 -44 -120 201 171 213 115 -35 35 4 59 236 84 165 -243 -41 -40 -140 13
2980A3k5jk23K02J5r7K09j25k10j8J1K58p8J8J5l04K61j67L51l05J44J29j58R7
$$ 13 -12 -13 -236 -34 -19 -116 93 -32 -242 -260 -249 9 -69 -51 -36 -340 -79 -246 105 -200 -56 73 -85 12
3004A2j71J94j47L05l86K52P3m3j12K0j0r7L25l41k5J72l5J91j16Q1j46j32J87
$$ 12 -159 35 -112 193 -193 59 132 89 -23 -3 -13 -110 215 -126 -151 21 -14 177 61 142 -4 -136 51
3027E1j92K84n3q2J16j90K16k29J01m3J65l2j58J31p0K7J04j22j02K74k20Q1r1
$$ 51 -141 143 90 8 124 -66 150 -79 22 -21 144 112 -46 85 15 42 146 24 -78 196 -24 57 -34
3050c4j27L6K1L39n19L09J75k09o9m7k0K02j33ok8m6j79K69J28k11j4j06J23j3
$$ -34 -161 -125 -104 235 -284 25 200 -9 -78 -125 -145 57 -76 -82 -110 -156 -335 -66 62 -149 -163 -269 -146 -159
3074a59m9K43r6J50l03O4J29P7N1j30k35j1K83J41k00Q4l1j6J93k60L79l03j27
$$ -159 -208 35 -61 89 -214 -150 -21 56 107 -23 -258 -269 14 155 -45 39 8 -8 185 -75 304 1 -126
3097a26L44j10Nm4J74l03L14j54p1J1l1J96k96K06L2j16J6M3p9K45j68j02k0k14
$$ -126 218 108 113 69 243 -60 254 100 29 40 9 205 -91 115 147 31 47 90 11 256 88 -14 -34 -248
3121b48J60K58j52K68l57JK42j93Q3j44K77k79K66j11j35j20n1K00k89J90J5q4
$$ -248 -88 170 18 286 -71 -70 172 -21 62 -82 195 -84 182 71 -64 -184 -235 -35 -324 -134 -119 -203
3143b03J39Pn4L4k1Q0j24P0j90J68K9J07j76J39o5p1j6J06J74k42L00j11j65J43
$$ -203 -64 -57 -111 -77 -98 -18 -142 -72 -262 -94 -65 42 -134 5 -60 -131 -147 -41 133 -109 191 80 -85 58
3167E8M1R5j53j16J8K05j3R0q9k7p1lj23J42j38M4N2J32k2j89K1K63o4n5j41J36
$$ 58 99 194 41 -75 -57 148 135 225 136 109 38 35 -88 54 -84 -40 12 144 122 -67 -46 217 153 98 -43 93
3193I3K37n24M01k07L38n65L62k05K45m50J65Q5j64J08M7R8k7j72J16jK9J08n6
$$ 93 330 -194 207 0 338 -227 135 -70 175 -275 -110 -25 -189 -81 -34 64 37 -135 -19 -20 9 117 61
3216F1k26mJ5o9K52j47j0j6K21m07K55J76k41Lj07J9J76m8q4L39o6J57k62R8J5
$$ 61 -165 -169 -154 -223 29 -118 -128 -144 77 -330 -75 101 -140 -137 -244 -225 -49 -97 -181 158 92 249 -13 85 100
3241A00k2o0J05r7M7l2J30m52N70r9j01J57m66J63J02m1m6j9K30Kk07J81j62P4
$$ 100 78 18 123 26 73 41 171 -281 289 190 89 246 -220 -57 45 4 -42 -61 169 171 -36 145 -17 57
3265E7q9L24k87J68k7j16k10R8K4L13j42P2n5J12j19k88O5P3p7j7J94j2m0k48
$$ 57 -32 292 5 173 146 30 -180 -82 -58 255 113 185 130 242 123 -165 -100 -27 -104 -121 73 61 21 -227
3289b27L56j03Rn1K1J47j2j99o3K65k81j39M06j90Q7p0J34j72j0N7q2m5L10j72
$$ -227 129 26 35 -16 5 152 140 -59 -122 143 -138 -277 129 -61 26 -44 90 -82 -92 -35 -117 -162 148 -24
3313b4N3k45N8K55j24K24k06o1o2J48k6j80K62O7l66M15l74M08k66K65j50rJ86
$$ -24 29 -216 -158 97 -27 197 -9 -70 -132 16 -10 -190 72 139 -227 188 -186 222 -44 221 71 62 248
3336B48k37k3R6KM2j41j13J40Q6j50L01r1r0r7N1j7n1J04m0l03L22k33K26p9l3
$$ 248 11 -12 84 86 128 -13 -126 14 100 -50 251 160 70 -27 24 7 -44 60 20 -283 39 -194 32 -47 -80
3361h0m4L3j36jK36J04L4k91J3L1q3P1J81k44J54j07J14j06j01J07J93j59o7K15
$$ -80 -124 -91 -227 -228 8 112 146 -145 -132 -101 -184 -113 68 -176 -22 -129 -15 -121 -222 -115 78 -81 -148 67
3385F7J84l58J31j56K50n1R8l05p8K13p6K64j0l1j47N4M1M4Q4l50J62p2J78r3
$$ 67 251 -107 24 -132 118 67 165 -140 -218 -5 -81 183 173 142 -5 49 90 134 218 -132 30 -42 136 43
3409D3l75O95l48J61k27K93j53k59J92P5j04J88j44j7K7l7O8l21L14L2j56J79
$$ 43 -332 363 15 176 -51 242 89 -170 22 97 -7 181 37 20 47 10 78 -243 71 103 -53 126
3431A26j22l78N14p2k2m7J8n0J1o7Q6j52L14l87J71r7L08l64K22l72L64J20l19
$$ 126 4 -374 140 68 46 -1 17 -33 -22 -89 -3 -155 159 -228 -57 -154 154 -210 12 -360 4 124 -195
3454a95J27n5kJ40j14J33j3J4l16K01K33p0j34Oo5R0J16r5r4J30K08k32P9J16
$$ -195 -68 -123 -125 15 -99 34 21 35 -281 -80 153 83 -51 -45 -110 -20 96 1 -93 37 245 13 92 208
3478B08j59O8j28J14Q0o7%l38M3K02J44Q6j51k38J58O3roO8k10NJ89p7j9r9l1
$$ 208 49 117 -11 103 183 116 116 -222 -179 23 167 253 102 -136 22 85 76 70 138 -72 -67 122 45 26 -73 -104
3504a04J45J05j44K82l89P2J70k84P5K4L5l3k6J78k10K59k06J26k21N7K7j53K94
$$ -104 41 146 2 284 -105 -33 137 -147 -72 -48 -13 -46 -72 106 -104 155 -51 75 -146 -89 -62 -215 79
3527G9j80j9L06j36J61m4j23j37o0p8K65J9k05J39K1L3N4K9k24M25l14P1M9j1
$$ 79 -101 -120 186 50 211 167 44 -93 -153 -231 34 53 -152 -13 8 41 95 124 -100 325 11 82 131 120
3551A20j22Q8m8P1L8mk71J48l8J38j46J08O5k19J97nk74J42J51l02M01j94n8K62
$$ 120 -2 86 38 109 147 143 -128 20 -18 120 -26 82 147 -72 125 120 -154 -12 139 -163 238 44 -14 248
3575B48m63J71J73j01j28K12j91p0J31o1J10M7p8o1o4K19j52p8K03l64Q2K17q8
$$ 248 -215 -44 129 28 -100 112 -79 -149 -18 -79 31 78 0 -61 -125 94 -58 -136 67 -297 -215 2 -86
3598h6Q7j17M6J57k10j03J64J45k3j30J31j62J18J33J8j90k7Q1l3M2j12MJ74n7
$$ -86 1 -116 -70 87 -123 -226 -62 83 60 -70 61 -101 17 150 168 -22 -49 32 -1 41 -71 -67 107 50
3622E0K21m57L86j52n6L70m11km2N5K85k50R3oq8J50r4k1nJ02j62J46Nj17R1n4
$$ 50 271 -186 200 48 -8 362 -49 -51 -93 -38 247 -3 90 84 -4 146 52 31 26 128 -34 112 117 0 91 37
3648C7j4Pj48L53j39Kj70R8k26K33J2oj13K06J00j87k41n0N7O3j5j7QJ28j54J92
$$ 37 23 30 -118 235 96 98 -72 26 -200 33 45 39 -74 132 232 45 -196 -246 -189 -126 -141 -158 -150 -22 -176 16
3674A6k47J51k7J81nj24K2k47J44j57Q0L02j41J26j46p6n6M37l36m0K15j85k9
$$ 16 -231 -80 -107 74 69 -55 -33 -280 -136 -293 -213 89 -52 74 -72 -148 -204 233 -103 -143 72 -113 -142
3697a42J50J23k30kJ69j27j87L86l43K56M0j90J23K0O0k1m5K44L5m82L99Pm1j63
$$ -142 8 131 -99 -101 68 -59 -246 140 -203 53 93 -97 26 46 106 85 40 284 319 -163 236 243 202 39
3721C9J20k1k14P4q8p7L83k27pJ01Q3J6l46K64l46M88k59K34n12K24L4K6p4J14
$$ 39 159 138 -76 -2 -90 -167 216 -11 -18 83 166 182 -164 100 -246 242 -17 217 -295 -71 -37 -11 -85 29
3745B9p2O6j83K14j28j05J38m7k39Q7J04m0R1m4L5O8j97j31M02j53l4K24j48q7
$$ 29 -43 23 -160 54 -74 -179 -41 -88 -327 -240 -136 -176 -85 -129 -94 -26 -223 -354 48 -105 -139 85 -63 -150
3769a50L2p4K93J10j2l75J38M5mK13k47K22l6r3J20k94L10Mm08K12P1j47J94j24
$$ -150 -118 -192 101 211 199 -176 -38 7 3 216 -31 191 155 62 182 -112 198 202 -206 6 77 -70 124 0
3793@J08j14R0Mk5K67j50j59j07J12k58J29J86q3K29j25Rj29l7k9M8J71k15j54
$$ 0 108 -6 84 88 63 330 180 21 -86 26 -232 -103 83 0 229 104 113 -16 -53 -82 -34 137 -78 -232
3817b32J78q4L95j32j22J00o0J13k45R4j26P5q2j3K15j80M34n36J97J53j53j1
$$ -232 -54 -138 257 125 3 103 43 156 -89 5 -121 -46 -128 -141 74 -106 328 -208 -11 142 -11 -22
3839b2j94K98Q1O5m07K24M9j77O2M1R5k84M56l89K70L9k18j10%J04N6P6k45L91
$$ -22 -216 82 163 228 -179 45 94 -83 -21 20 115 -169 287 -102 168 207 -11 -121 -121 -17 39 115 -130 261
3863B61j02q8q4n4j9K58j67J58p9J06k20p5J45K5m8N6l32L56k18K61pk17K09m3
$$ 261 159 71 -13 -67 -86 172 5 163 84 190 -30 -105 40 65 17 73 -259 97 -121 140 133 -84 125 82
3887H2n0j10Q9M9p9K33m13O3K16q8Q4j93L01j21j16j55K39j11l9J93j18l1J86
$$ 82 32 -78 11 60 -19 214 -199 -136 80 -8 76 -117 184 63 -53 -208 31 -80 -119 74 -44 -75 111
3910A11l15Q6J30k10L35j13r3K3K09k02OK07k20L8j93J14R6M4o6no3NJ79M8L2
$$ 111 -204 -118 12 -198 137 24 -69 -46 163 -39 -33 174 -46 -8 -201 -87 9 53 -13 -18 -81 -76 103 151 183
3935A83k16K66j58p8j11L9lm5J74o5p4M3Q1j52J24N5k96K65J06n5J00k54r9K91
$$ 183 -33 233 75 -3 -114 -75 -78 -123 51 -14 -88 -45 36 -116 8 63 -233 32 138 83 183 -71 -170 121
3959A21l71J93K40j40N8j14j89R0p0J17O5J9k03L29k50P9j58J94l88K74k3j49
$$ 121 -250 -57 183 43 101 -13 -202 -112 -182 -65 0 19 -184 145 -105 -26 -184 10 -378 -104 -127 -276
3981b76L51k49L41j99L3o3M6N9k55j04J26J07J38k23K32k82L54N9k49j31J67M7
$$ -276 75 -174 167 -32 1 -62 -16 43 -212 -316 -190 -83 55 -168 64 -218 136 195 -54 -185 -18 29
4003B9o8J79k50J40m7Q6K7j32L4K6K57k52l6N5o8J26j87J52o4m6L34j71j19J40
$$ 29 -39 140 -110 30 -17 69 96 -36 -2 24 281 29 -7 48 -20 106 -81 71 7 -39 295 124 5 145
4027A45q1j89J85j36n6L5L4J76L4l13J09J76j40k35K39o7j29L39j92J37j35J26
$$ 145 64 -125 60 -76 -132 -97 -63 113 147 -166 -57 119 -21 -256 -17 -84 -213 126 -66 71 -64 62
4049F2l5p1Q4l8k08j2q7K45JK6K7O4k23J50J39K4l25j09L70N4o9pl8m4M6K0j40
$$ 62 27 -44 40 2 -206 -218 -305 -60 -59 -33 -6 58 -165 -15 124 148 -177 -286 84 138 69 62 24 -20 26 46 -94
4076i4K04j54K8J93m4k96J53m9j8J78q0K0l3K8j34J78J87n1j89K65l09QR8o4j0
$$ -94 110 -44 -16 177 133 -163 -10 -59 -77 101 21 41 8 36 -98 80 267 216 27 292 -17 -9 89 25 15
4101A5K74k47p7K87l50j69K72j95L22J98n24M00Oj16mj32JK65j95L4j39M1J7L
$$ 15 289 42 -35 252 -98 -267 5 -190 132 330 -194 206 212 96 92 -40 -39 226 31 65 -74 -33 -16 -13
4125a3P3K88n37N1j72K97j20K40k05J98j10J52k27k4J40k45L33k76J63j91K06
$$ -13 60 348 -189 -138 -310 -13 -133 107 -98 100 -10 142 -85 -109 31 -214 119 -157 6 -185 21
4146B1j87J63J20P4l54L31q7p9q4m8k5j08N4P0J90j71L07j36jj01J70j31q4L28
$$ 21 -166 -3 117 191 -163 168 81 2 -82 -130 -155 -263 -209 -139 51 -120 187 51 50 -51 119 -12 -96 232
4170B32j09j7j00J34j24K0Q4j25R9j51J67l60O1K86k64J66j63K94l08J22J98k17
$$ 232 123 106 6 140 16 36 120 -5 94 -57 110 -250 -189 97 -167 -1 -164 130 -178 -56 142 -75
4192g5J16j23j32J08J20Jk60L16j28o8m5J2J08M4R2j68j4k48K96J27l1k10K33
$$ -75 41 -82 -214 -106 14 15 -245 71 -57 -125 -170 -158 -50 -6 86 -82 -96 -344 -48 79 48 -162 71
4215G1J39k39pj24L32k45K74J7m20J25J06R2k10J34jj39K89o0j53J67m03L45k46
$$ 71 210 -29 -36 -160 172 -73 201 218 -202 -77 29 121 -89 45 44 -95 194 134 -19 148 -255 90 -156
4238a56K97p6pK00q2j77K13Mk55r0K85k77K28j0M5k4Oq6j84J74Q0j3Pj99R1J57
$$ -156 141 65 58 258 176 -1 212 216 -39 -129 156 -121 107 97 142 118 124 38 -146 28 108 95 102 -97 -6 151
4264A51J63k68j46J76q8nL2L1q6l1j67R2oQ2p9k05M22R5k25J24m9O3nO0R5k05
$$ 151 314 46 -100 76 -12 -17 15 46 -40 -71 -238 -146 -152 -70 -149 -354 68 163 -62 62 13 76 71 131 226 21
4290B1J18Q2k27m1j21P2J1J16j42Q7r1N1K58l36J57J18j73N8j85J40O3M2q3J36
$$ 21 139 221 -6 -47 -168 -96 -85 31 -111 -24 -115 -64 194 -142 15 133 -40 18 -167 -27 36 78 -5 131
4314A31J20k63J99j79q3J59J28j02k34J17j23Q7p9oK49l9O1l06q6k4K25L58k10
$$ 131 251 -12 187 8 -75 84 212 110 -124 -7 -130 -43 -122 -128 121 82 143 -163 -249 -273 -48 310 100
4337A00J02k64K45r2k83K13J34m5k07j22J17K08m9k68J35N1qm2n4J24j56J04J8
$$ 100 202 -62 183 91 -192 21 155 110 -97 -219 -102 106 57 -211 -76 -25 -33 -75 -129 -5 -161 -57 -39
4360c9L5j06J77j56J13o9K96k52j92M59j97J23k30j11J77k2n1p9J86r6Q6O2j60
$$ -39 -4 -110 67 -89 24 -45 251 -1 -193 266 69 192 -38 -149 28 6 -45 -124 62 -34 52 114 -46
4383d6k05K52R4j13k00L86j11q1Q9Q4O9nj4k07p7j00K42j47L05k61j01J02P8J04
$$ -46 -251 1 95 -18 -218 168 57 -24 65 149 218 213 199 -8 -85 -185 57 -90 215 -46 -147 -45 33 137
4407A37K6l29P1P7J99j66j71K00o8j94L55p1j91K24k75O3N6j0m6p2k7q2M7J57
$$ 137 163 -166 -95 -18 181 15 -156 44 -24 -218 137 66 -125 99 -176 -113 -57 -67 -113 -185 -212 -294 -247 -90
4431i0j11JL38j98LL3l2R8k20J15j5J6M6J15QP0Rj31p0J24j7k77N11m73K26O3
$$ -90 -201 -200 138 -60 -57 -24 -56 42 -178 -63 -78 -62 -16 99 107 177 186 55 -15 109 92 -185 326 -147 79 142
4457A42p5n9J06k14P5J35k07pL06j91J41j6k56K00P9R8k50Q1O2k70L11k19j3m8
$$ 142 67 8 114 -100 -25 110 -97 -104 202 11 152 136 -120 80 159 257 7 88 150 -120 191 -28 -41 -89
4481h9J91n9J69j19pj3o7K28l59qQ8J64j35N0J78j34m5j12J08o6j56J88p1J88
$$ -89 102 43 212 93 86 73 6 234 -125 -133 -45 119 -16 34 212 78 33 -79 29 -37 -193 -5 -76 112
4505A12k99K59j77J57k92K61Q2l92J00J77P6k40J96P0k04K83k41J91K3K0p2P0
$$ 112 -187 72 -105 52 -240 21 103 -289 -189 -12 64 -176 20 90 -114 169 -72 119 142 162 90 160
4527A60k86J80M3q4k10K07J0NM8q7M7J11l61K06J90qk77J95Pk26J51o0K46j99
$$ 160 -126 54 97 13 -197 10 20 25 73 -14 33 144 -217 -11 179 171 -106 89 96 -130 21 -39 207 8
4551HJ09l25K38j6j23K03O5o3K5k72Q8J94k84O5J01k37J86J15R9p4k86K23Q0k03
$$ 8 117 -208 30 14 -109 94 159 96 121 -151 -63 131 -153 -88 13 -224 -38 77 176 102 -184 39 119 -84
4575h4J86J56m35K19qR2k82j4K27n3J58j88j41J06l9J96q7q2K64l49J25M3k61
$$ -84 102 258 -177 42 34 126 -156 -170 57 4 162 -26 -167 -61 -100 96 9 -73 191 -158 -33 10 -251
4598b51K14k96J28J06K02j23n8L3J08j62l2K7p7J54K18k79J22j3J83m5j32j58
$$ -251 -37 -333 -205 -99 103 -20 -78 -45 63 -99 -131 -104 -181 -27 191 -88 34 21 204 159 27 -131
4620a31K88p5m2K1j12J54m5k18J69J37m77M17j81J84j77L22l25J44L1j58J25j03
$$ -131 157 82 40 61 -51 103 58 -160 9 146 -331 86 -95 89 -88 234 -91 53 84 -74 51 -52
4642e2j53K34k33K29J12l13R9o0n8K19k37o7K09j46K35j83M7K8M4L6K1P1j50j22
$$ -52 -205 29 -204 25 137 -176 -77 -137 -195 24 -213 -280 -71 -217 18 -165 -118 -90 -46 -10 11 82 -68 -190
4666a90K56oj49r8J56j55L92l12N7J21P1j08N0L2k74K00k3R5k6j47J34j74J21
$$ -190 66 60 -89 -187 -31 -186 206 -106 -49 72 143 35 85 117 -157 43 20 115 89 -58 76 -98 23
4689B3j60K85k57J97q4J3r4O9J7j34N8n8R2N4J50q3m4k0q0PP3r5N6J52K4k07r6
$$ 23 -137 148 -109 88 4 17 -77 -8 9 -125 -67 -125 -33 21 171 88 44 24 -56 -49 24 -71 -15 137 161 -46 -142
4716a42K51j70j8Q9J21k42K84j05j52j57rJ87J42j42J05O2k8k23n4L91j07n9k86
$$ -142 109 -61 -79 10 131 -111 173 68 -84 -241 -250 -63 79 -63 42 104 76 -147 -201 190 83 24 -262
4739b62K41m1k46L22j28J50o1j04m8K24k42J34J16l75J54J66J9l06L15j6j33j27
$$ -262 -21 -62 -308 14 -114 36 -25 -129 -177 47 -195 -61 55 -320 -166 0 19 -287 28 12 -121 -248
4761b48N1K77J78k94m1K12p9j39R8pp7M7pJ69j23J38j44j20L64l13q7J83p7R1
$$ -248 -197 80 258 -36 -77 135 56 -83 15 8 -69 -22 -29 140 17 155 11 -109 255 -58 -145 38 -39 52
4785E2J12k6j25l80K17J68j6O7l7j34k4K28l50K61N6m3N9k30J89r9r7J02Q5k85
$$ 52 164 138 13 -367 -150 18 2 69 32 -102 -126 102 -248 13 69 26 85 -145 44 -55 -152 -50 35 -250
4809b50K41O9j65J67k07M2L0L7j31J60J95m33K24j51K14kl24M06j58%o3j13K08
$$ -250 -9 60 -105 62 -145 -103 -73 -36 -167 -7 188 -245 -21 -172 42 40 -284 122 -36 -36 -99 -212 -4
4832dj6J16k13Q6pj00Q4P7j5Q4R0k48n8L01k04J11O5J3j86J31R3j61M7K8J5k53
$$ -4 -20 96 -117 -31 -38 -138 -54 23 8 92 182 -66 -124 177 -27 84 149 162 -24 107 200 39 86 114 129 -124
4858a24j8nJ7L40k64P1o9k2M4O4j44J33r3j3J0K9l3QJm7j5J04K19n03L43l45K68
$$ -124 -142 -147 -130 210 -54 17 -52 -74 -30 34 -110 23 -70 -83 -73 -44 -77 -69 -68 -115 -130 -26 193 -310 33 -312 -44
4885d4k78L64l6J9k18O1j59K39L2K3ok02K80l43J75r8L6N7J06J50j40N0R8J9O
$$ -44 -322 42 6 25 -193 -132 -291 -52 -20 3 -3 -205 75 -268 -93 -191 -155 -98 8 158 18 68 166 185 191
4910A91l4j50r1J88j20L4O0p5O7p8l4J11jj53J06J13j39K1R1M1o2l08K60m6j82
$$ 191 157 7 -84 104 -16 18 78 3 70 -8 -42 69 68 -85 21 134 -5 16 107 148 86 -222 38 -8 -190
4935a90j9L63q0L4p6j18J01l5j44j28L85r2j31K4Qm7J41p3q9K22j65R9k25L03
$$ -190 -209 154 74 108 32 -86 15 -20 -164 -292 93 1 -130 -106 -98 -145 -4 -77 -166 56 -109 -10 -235 68
4959F8k25J56j2Kr9Q8K5q9M16j89k86J66k5p3j33L11j5j41K44k07J78j85o0q1
$$ 68 -157 -1 -13 -11 -110 -22 3 -86 330 141 -145 21 -4 -77 -210 101 86 -55 189 -18 160 -25 -85 -166
4983a66K43M5j06N4M2L9j07o3r7K63P1N1j46j05P3j14J81l7j22O5j56J58l20J52
$$ -166 77 122 16 70 112 151 44 -19 -116 147 218 269 123 18 91 -23 158 121 -1 64 -92 66 -254 -102
5007a02J96k9j83K34M5k17j30J14j4J16k8r0M6n9M07j97J5j97J48r4M9j37R0J72
$$ -102 94 65 -118 116 161 -56 -186 -72 -86 30 2 -88 -42 -101 306 109 124 -73 75 -19 30 -107 -17 155
5031A55k98J12O7j04j96J56J28m6k3J83k36j50J78j68m6J87N4P1J8j06j01r6K12
$$ 155 -143 -31 36 -68 -264 -108 20 -26 -49 134 -102 -252 -74 -242 -288 -101 -47 24 42 -64 -165 -261 -49
5054d9J02j83R7j62K88n8%K03k45P9m2j58L98l17N9l0N8l9n8J79l3j10n0q2M0
$$ -49 53 -130 -33 -195 93 35 35 238 -7 72 30 -128 270 -47 12 -18 40 1 -57 122 89 -21 -71 -153 -113
5079a13l7J32k29M54l24K95k10k33L73k00k28J90J19j84J65J32Q8l08J42r6J84
$$ -113 -150 -18 -247 207 -117 178 -32 -265 108 -92 -320 -130 -11 -195 -30 102 190 -118 24 -72 112
5100A12k33K98q5q4q1k38L94n2l2J73l21J51k3r7RQ0L1j95J75o2N0m4J28o3n5
$$ 112 -121 177 92 8 -73 -311 83 31 -1 172 -149 2 -21 -118 -109 -29 2 -193 -18 -80 -30 -74 54 -9 -64
5125f4J8J09J21j15k60K77j03K8k00J56j82K27J03k61J36p9P5j32J57J42Q3k65
$$ -64 -46 63 184 69 -191 86 -17 11 -189 -33 -215 12 115 -146 -10 -89 -14 -146 11 153 236 -29
5147b9j30J23n5J89q4K30j34L3j16L0k4n2Q6p3n1K28j42qj24L4l2L0J97r8K4N2
$$ -29 -159 -36 -91 98 14 244 110 143 27 57 33 -19 67 -6 -57 171 29 21 -103 -69 -101 -71 126 28 52 104
5173A04j65K18j57O8j01n1Q6p6m2J3N3K4j86K66k58J93l6k63M53l00l2K92j47
$$ 104 -61 157 0 68 -33 -84 2 -74 -116 -103 -50 -26 -212 54 -204 -11 -47 -310 143 -157 -189 103 -44
5196d4n9O5L5m5R6k06K75j27k30L13j04J81P2k48l3J96K5j53J09n1j74Q9J1ML7
$$ -44 -103 -38 -3 -48 48 -158 117 -10 -240 73 -31 150 222 -26 -59 137 162 9 118 67 -107 -18 -7 -3 34
5221C4m8j21J97K7k1N2k41K3J97r3R2r7JO8j37j95L35j13K40k57K7jJ5M2j21J95
$$ 34 -14 -135 62 89 68 120 -121 -98 99 6 98 1 2 70 -67 -262 73 -40 200 -57 -30 -31 -16 26 -95 100
5247A00Pm17L26Q2j08R9j32p8K35P1j7j64o9R4N8j60n9O6q7r9R6K46J8p2l76O13
$$ 100 107 -310 16 98 -10 89 -43 -121 114 185 168 4 -65 29 87 -73 -132 -66 -153 -252 -156 90 108 36 -340 273
5273B73k10r1Q6j58J43J23k37Q6rk92K52k9N0p1K40k73M35k57k27K79j68n1J04
$$ 273 63 -28 58 -100 43 166 -71 15 6 -286 -34 -63 -13 -84 156 -117 318 61 -166 113 -55 -106 -2
5296bK76k09p5r0M26k54J8k59K81j37o5l6R9J27O6k02OK58R3j78k36l1J82%l19
$$ -2 274 65 -10 -100 326 72 90 -169 112 -25 -90 -126 -27 100 166 -36 -30 228 321 143 -93 -124 58 58 -261
5321b61L48K09j36j19n5M9j30J57j62J31j31R3r2M7j83K46j93N8M9J24j0k2j74
$$ -261 87 296 160 41 -14 35 -95 62 -100 31 -100 -7 -99 -52 -235 11 -182 -124 -75 49 39 17 -157
5344a57K8j59J21L39j69R5p8l4k6L16l40n3j23L27k76J56K43k10K2J13j62J05
$$ -157 -129 -288 -167 172 3 98 20 -14 -40 276 -64 -117 -240 87 -189 -33 210 0 22 135 -27 78
5366G8k71J14J49j44J37J10k56J46l8J45o7J34k34k3j08J34p8k6J38j84J74q3
$$ 78 -193 -79 70 -74 63 173 -83 63 25 170 103 237 3 -20 -128 6 -72 -98 40 -144 30 -53
5388e3%J47n0L9k33r5K27J46k48L75l27K4p3K03j44J98j62J01O8j66J16j46q2
$$ -53 -53 94 44 83 -150 -245 -18 128 -120 255 -72 -48 -121 82 -62 136 -26 75 143 -23 93 -53 -135
5411a35L55m61L8R3k9K55l04L47jm91L60J17k09J45K04m09J19q0j45K70j47L0
$$ -135 220 -241 -203 -110 -139 116 -188 159 158 -333 27 144 -65 80 284 -125 -6 -86 -231 39 -108 -78
5433g8J73j97J57J43j66J76l14J00p9K01j13k1O3o2Q0j87L1K73k63K03m63K50
$$ -78 95 -102 55 198 32 208 -106 -6 -85 116 3 -18 45 -17 63 -124 -93 180 -83 120 -343 -93
5455i3K37j27J59p2K9r0l3L1Kj11K17q3k47J86j76K34o7Q9k50K84k6Q8k33K1j34
$$ -93 144 17 176 104 133 43 10 41 43 -68 149 66 -181 5 -171 63 -4 85 -165 119 93 181 -52 -31 -165
5480a65K33m1m5j1p5j15K88n3j42M3k3J70j95Q8P8J19j22Qq6O7k73J58K9n1K51
$$ -165 68 27 -18 -29 -104 -219 69 16 -126 -83 -106 64 -131 -43 35 154 32 40 -46 21 -252 -94 -65 -116 135
5505A35o9j30K0l0J82K3q1q6p1K7J05M9M1J12k88L1J23j13k99K21L23j30N0k67
$$ 135 66 -64 -44 -74 108 131 50 -36 -107 -80 25 74 115 227 -61 -30 93 -20 -319 -98 225 95 145 -122
5529a22j6q0K43K16l90O9J64j36K22J9Kj00j59o1j18Q6J40O4O1j96j43K39J37
$$ -122 -138 -218 25 241 -149 -80 84 -52 170 189 191 91 -68 -129 -247 -161 -21 43 104 -92 -235 4 141
5552A41r2N8k39K4J85r2P0J23j97k76K60J7jn6j02J72P2K4j53o3K13n1j4O1l53
$$ 141 49 107 -132 -108 77 -15 55 178 -19 -295 -35 -18 -19 -75 -177 -5 67 91 -62 -125 88 37 23 84 -269
5577b69K20J90r0j29m5J39l26K56j10J82J32q1p7J20k25J63K8n9k13L16K2j22
$$ -269 -49 141 51 -78 -123 16 -310 -54 -164 18 150 69 -8 112 -113 50 78 19 -194 122 144 22
5599B2K91m11Q6j40J44Q2j02j6k96J39J47O4J16k23M8j31K94k20P1J42p4Rn3r9
$$ 22 313 -98 -12 -152 -8 74 -28 -44 -340 -201 -54 10 126 -97 -49 -180 114 -106 -35 107 33 42 -11 -110
5623a10K1L8J52k96J44p9J44m7k04J01K28l08L3J08k8J00J60N8k60P9O0k2k61
$$ -110 -89 -51 101 -195 -51 -130 14 -33 -237 -136 92 -216 -183 -75 -103 -3 157 215 -45 34 94 72 -189
5646a89K85r4q0J22k07K23o0Q5pQ9k40R0j48Q9O6R9j64NK46l33j6J95M5r8r2l
$$ -189 96 2 -78 44 -163 60 0 85 78 167 -73 17 -131 -42 24 123 -41 -36 210 -123 -139 56 101 3 -89 -92
5672i2J53j78J02K3J05LJ8j24J32m33L58q2o0O9O4M70n25l5n7J65j67N9q3nJ91
$$ -92 61 -117 -15 8 113 116 134 10 142 -291 67 -15 -75 -6 58 528 3 -32 -89 76 -91 -32 -115 -120 71
5697G1k05K71q3k3p2Q8l3q4J29j84n9K93k27L10k01P7r8J53M1m0j87J31J1K9m31
$$ 71 -134 137 54 31 -41 47 14 -70 59 -125 -184 109 -118 192 -9 68 -30 123 164 124 -63 68 79 108 -323
5722c23L19J6j78K37m0j71L51k72j44R4K22l0l9J52J4k95K8J16K2j12O3k58Q3
$$ -323 -4 12 -166 71 31 -140 211 -61 -205 -111 111 81 42 194 208 -87 -59 57 79 -33 30 -228 -145
5745a45K39k63K11j36j03Q5O2J55l8j57L22j85l4r2J18n8j60J40l3Q4k56K10j2
$$ -145 94 -169 42 -94 -197 -112 -50 105 67 -90 232 47 13 -79 39 -19 -179 -39 -72 12 -244 -34 -46
5768d6J59l22K12P1j28M5P9R4j63J28o2j06lL4k50M23j85k5j30J45o8p3J99j27
$$ -46 113 -209 3 74 -54 -9 70 164 1 129 67 -39 -42 -8 -258 165 -20 -45 -175 -30 -98 -171 28 -99
5792i9j1K51l96L29j40J80j26R4l44K15j30N2N2q8J97j90K64q2P6O3k45J00p9
$$ -99 -110 141 -255 74 -66 114 -12 82 -262 -47 -177 -125 -73 -161 36 -154 110 28 104 167 -78 22 -57
5815e7o2K27j77n4J79j63J29N1O0o4m3j21n9l6L99m10K00O2lM1k12N7o8J24K09
$$ -57 -119 108 -69 -123 56 -107 22 73 133 69 26 -95 -154 -190 209 -201 -1 61 58 99 -113 -56 -124 0 209
5840B09k75KQ9J3j43K75m02K12J07k59K16J46r4l6l29K18L5J5o3K29j39K06l80
$$ 209 -66 -64 25 38 -105 170 -232 -20 87 -172 44 190 96 60 -269 -51 -16 -1 -64 165 26 232 -148
5863a48L3J65n39M85R4m6k05K17m7M9k69m0%L44l21L5J06J2j20K40N4q8j8j75
$$ -148 -115 50 -489 -4 90 44 -161 56 9 58 -211 -251 -251 93 -228 -193 -87 -75 -195 45 99 11 -7 -182
5887a82J65P2J11q0M8j71R8k27j43K67l5J05J01j48J67LLL5l15N4N9J9l2r5J79
$$ -182 -17 55 166 86 134 -37 61 -166 -309 -42 -77 28 129 -19 148 151 154 189 -126 -72 -13 6 -26 -121 58
5912E8J53k32r1K55J3l3r7N8O2l1j54J23p8k65K07M6K19j20j05M8j47K04j14o9
$$ 58 211 -21 -112 143 156 123 26 84 146 115 -39 84 6 -259 -52 -6 213 93 -12 36 -111 93 -21 -90
5936i0j3q0J11N0r6K30l1k12L6m1K15r6P1j86J28P6J2j93j10L30j67L19l17j08
$$ -90 -103 -183 -72 -22 -118 112 81 -131 -95 -136 79 -17 54 -132 -4 72 84 -109 -219 111 -56 263 -54 -162
5960a62L0j49K37Q7J22j70J28m38K32l4K51j30P8N3o0j39J21j64j40K72j04j42
$$ -162 -132 -281 -44 43 165 -5 123 -315 -83 -117 134 4 82 135 75 -64 57 -107 -247 25 -79 -221
5982b21K62j01MJ75n3J47k30l1J36r0J16q5Qr4p6O5L6k3j5J54k9r0K8Q4j73J94
$$ -221 41 -60 -56 119 66 213 -17 -48 88 -2 114 29 37 -57 -133 -68 -32 -55 -70 84 55 -35 -7 77 -96 98
6008I8J92j94N2l84L4L7L87m80K58l7Q4j08P3j09k0K49o1m4N9j55j21J50R9m4
$$ 98 290 96 148 -236 -202 -165 222 -258 0 -37 47 -61 12 -97 -117 132 71 27 86 -69 -190 -40 59 15
6032A5P0o6j69P3j13K15m1j34J91l34J49K64j05p6L57l87K99l59L36j02j21k40
$$ 15 85 19 -150 -77 -190 25 -16 -150 41 -293 -144 120 15 -61 296 -91 208 -151 185 83 -38 -278
6054b78K00m1nJ04K09k99K1Q4Q9k13P6L6J04j37K40R2m31J46l6J3k44L85O6l51
$$ -278 -78 -119 -124 -20 189 -110 -89 -5 84 -129 -53 -17 87 -50 190 282 -149 -3 -39 -26 -270 115 181 -170
6078a70L4K52q4N0q7j97QJ74p1ko9J18K36l19O8j70K61j23K67o5Q2rk73K7j75
$$ -170 -136 116 32 82 -5 -202 -194 -20 -91 -93 -162 -44 192 -127 -59 -229 32 -91 176 111 193 184 -89 -62 -237
6103b37M6L23m32J81J9J46k17l5K53k09K94j10j97L56p3k6j83N2l7J40j10o0J94
$$ -237 -191 132 -300 -119 -100 46 -171 -206 47 -162 132 22 -175 181 108 82 -101 -49 -86 54 -56 -116 78
6126G8J96n8n14M55j36M9j50M2J61J74l14J10R9j58P4n3M7j54K87M2l66K96r8
$$ 78 274 216 -298 157 21 70 -80 -38 123 297 -17 93 192 34 108 55 102 -52 235 277 -89 207 109
6149A09Jo0p9K11pj00k01L78m44J71J89j67N3M7l4j46J34q7L4N2o8k87K66r2L04
$$ 109 110 50 -29 182 175 75 -126 252 -192 -21 168 1 54 101 67 -79 55 -32 2 54 -14 -301 -35 -127 177
6174A77j49r8q8Q0j3j0J17Q7k00k5P8J45p4J35l35J99K0j31J44j52K27l05J25
$$ 177 28 -70 -158 -78 -91 -101 16 103 -97 -122 -44 101 27 162 -173 26 46 -85 59 -93 134 -171 -46
6197d6K17J2j31j18m3n6J03J35o6j19J77%%q7J59l6l6J18k12L7%j86L12j17J17
$$ -46 171 183 52 -66 -109 -165 -62 73 7 -112 65 65 65 -22 137 101 65 183 -29 8 8 -178 134 17 134
6222A34J1j43l76L19J07j90J25M1k5J33r8j47l8N7J93j2o0P5j94OO0P7o7O6k47
$$ 134 145 2 -374 -55 52 -138 -13 28 3 136 38 -109 -147 -90 103 91 31 106 -88 -82 -22 55 -12 54 -193
6247a93K76j88O8J45k31K84p5j60L60j39p8J19j09J95k22k28J61r7J09O0J40j98
$$ -193 83 -105 -37 108 -123 161 86 -74 286 147 69 188 79 274 52 -176 -15 -112 -3 57 197 -1
6269aK1j78J85J69n3k44l4QN7L08k45k6l2J41R5p1N1k91K78j24j94J94J50N9j96
$$ -1 20 -158 27 196 143 -101 -135 -127 -70 238 -7 -33 -65 76 171 100 151 -140 138 14 -180 14 164 223 27
6294B7J67q6l2j24R0M8J4j30Q8r7j13J31j13J02J48k83j03L53p1kJ04k82K07l2
$$ 27 194 108 76 -48 42 90 104 -26 62 -35 -148 -17 -130 -28 120 -163 -266 87 16 14 118 -164 43 11
6318A1l10M19k68J04k49K62Q8p8J17k46J07j73R6mK30j09J1O1Q2j32k62K59nJ67
$$ 11 -299 120 -148 -44 -293 -31 57 -21 96 -150 -43 -216 -120 -124 106 -3 8 69 151 19 -243 16 11 178
6342A78j86Q3j18m9R5j60nK62j18j31J27J16J06k34Mj9J30k74L74k07j66K37r2
$$ 178 -8 75 -43 -92 3 -157 -162 100 -18 -149 -22 94 200 -34 -30 -49 81 -193 181 -26 -192 45 -47
6365d7rL14P4j70K5k91l2K13K7k34J92K9l07R0J54n4K0J1J3o0J0m8K41r0k91K57
$$ -47 -56 258 332 162 187 -104 -136 77 104 -130 62 91 -216 -126 28 -26 -6 5 18 -42 -32 -80 161 71 -220 37
6391C7r8L1o1J35j17l2J49R9L6k22J67j96q5O6r9J7M31m22J65%j44R6j53K43r2
$$ 37 -61 -30 -91 44 -73 -105 44 143 179 -43 124 -72 -157 -91 -190 -173 258 -164 1 1 -143 -47 -200 43 -49
6416d9j75R3O0J05r8K19L5j76N3j1k08J26K01J5q6n3o4k40J54J23J10k42Q5J29
$$ -49 -224 -131 -71 34 -64 155 190 14 67 56 -152 -26 175 190 104 51 -13 -253 -99 24 134 -108 -23 106
6440A06j22K47k37j32L97l10q5M61k21Q2J46l35L3k83M81j48j20J39J05k51N1
$$ 106 -16 231 -6 -138 259 -51 -136 325 104 186 332 -3 30 -253 228 80 -40 99 204 -47 4
6461DJ27q0k36J41k01M37k43J22n0O8j23Q3n7J11K46m42J10P4k02J84L9m3p8k32
$$ 4 131 51 -185 -44 -245 192 -51 71 21 89 -34 49 -8 103 349 -93 17 91 -111 73 112 69 -9 -241
6485b41M53l16K04j69J62J5k22J71q2k9l5j08k2L24J6j57jl3M1j0j01L06j3k01
$$ -241 212 -104 100 -69 93 108 -114 57 -25 -54 -89 -197 -219 105 121 -36 -37 -70 -29 -39 -140 166 153 -48
6509d8J40j50OK16k63J69Nj33J91j74rJ91k29mO1J16o5n3K36j79o7J56j9k72Q3
$$ -48 92 -58 -52 164 -99 70 75 -58 133 -41 -50 141 -88 -92 -31 85 20 -33 203 24 -43 113 94 -178 -95
6534i5J70j19q5P5N8%n0j16K57j25n4Q8m9J29k62J27l4R0R0k01Q3k3N5r8j49K96
$$ -95 75 -44 -129 -54 4 4 -46 -162 95 -30 -84 4 -45 84 -178 -51 -85 5 95 -106 -23 -46 9 -89 -238 58
6560E8n4n1J2l03N9K71K8j14j13R8K74j26j18K65j72RQl4l5jlK07j69J5R5n3K07
$$ 58 4 -47 -35 -338 -279 -8 20 -94 -207 -109 165 39 -79 186 14 23 31 -3 -38 -39 -42 165 -4 11 106 53 260
6587B60j65j60R0r8M84k51j30kn6R6m4P8k5r8J62N6l04J7K29r1o7K10Nk23L17
$$ 260 95 -65 25 -73 411 160 30 28 -28 68 24 102 77 -21 141 197 -107 -90 139 48 -19 191 196 -27 290
6612B90l45O6J81J4K6p4r2m0N9N6k63L14k78k00L57j44nR4n6j50K16j0J49j36
$$ 290 -55 11 192 206 232 158 66 26 85 141 -122 192 -86 -286 71 -73 -78 16 -40 -190 26 16 165 29
6636B9M9m94M96J19r9Q0j92l27K79J34l13K77k9Q4LK75m06L1J7O2j01J24j51L99
$$ 29 78 -416 80 199 100 180 -12 -339 -60 74 -239 38 9 93 96 371 -35 -4 13 75 -26 98 -53 346
6660C46l49j13J24J52j86K2J99l92L29j55P3P8k11K36k8j57m8J68j63K08j09p8
$$ 346 -3 -116 8 160 -26 -4 195 -197 132 -23 50 128 -83 153 125 -32 -80 88 -75 133 24 -54
6682e4O2J38j75M4p3j80L30j21P5j22K09j24r6J11L8k32L28k14K38q6J47l36O7
$$ -54 8 146 -29 15 -58 -238 92 -29 46 -76 133 9 -87 24 62 -170 158 -56 182 96 243 -93 -26
6705b6m9N6o8J48P8k67R3n9J48N3l3J48k36j5J89j29k08J38j05J73K0L5j28J52
$$ -26 -75 -19 -87 61 139 -128 -35 -94 54 107 74 222 -14 -29 160 31 -177 -39 -144 29 49 84 -44 108
6729A08P1q5Q2k63OJ94j08j43m9K38q7J1R4L5j17N5j3k76J50J73O8k3j45K7K4
$$ 108 179 94 176 -87 -81 113 5 -138 -187 51 -36 -25 69 104 -13 42 29 -247 -97 76 144 121 -24 3 27
6754B7J21j88Q3M0k3J17q9l19K29J46j41j46K3n6K35k08K64J43l27j32J37j57
$$ 27 148 -40 43 83 60 177 88 -231 -2 144 3 -143 -120 -176 59 -149 115 258 -69 -201 -64 -221
6776b21K38Kr4L0M4j38K04r4q4Q3L2k05L55j65r2J90R2m97M99j02J36j44k02K11
$$ -221 17 19 -75 -45 -1 -139 65 -29 -113 -30 2 -203 152 -13 -105 85 177 -320 179 77 213 69 -133 78
6800G8j27J34j10j66L39j91R0J63j23L1j33n3K5K53j48N8k48K58k75l0K66j25
$$ 78 -49 85 -25 -191 148 -43 47 210 87 118 -15 -68 -43 210 62 120 -128 130 -145 -175 91 -34
6822c4j49J51L03k6j20Nj76K01rk16K82o3l27J79o1L9K16l3k01K52l40J81k00
$$ -34 -183 -32 271 245 125 130 -46 155 146 -70 212 149 -178 1 -60 -21 195 162 -39 213 -127 54 -146
6845a46q5K44m0L2J0k0m6k79K98O9j54n4J78l3j62O9K49j89m3m2O6L10j44k8J18
$$ -146 -231 13 -27 5 15 -5 -51 -330 -32 37 -117 -171 7 -26 -188 -119 130 -59 -102 -144 -78 232 88 60 178
6870A78j93k18L53j23j42NJk1K11P9j45J58lj96M4J78R0k28M0k20K60j87J50K9
$$ 178 -15 -233 120 -3 -145 -140 -139 -160 51 130 -15 143 140 -56 -12 166 256 28 68 -152 108 -79 71 100
6894A00j34J78K55k31j92P0q1n3K05J9p0l1j51P0q7M9K61k71J34k2j55J95j41
$$ 100 -34 144 399 168 -24 46 -35 -88 117 136 66 35 -116 -46 -133 -84 177 -94 40 18 -137 58 -83
6917h3Q9Q7nj5k9o1J42k14N1J22j75j31J12M26m04K05k60R4j07M0Q9o7l4N1J69
$$ -83 6 93 88 73 44 -17 125 -89 -38 84 -91 -222 -110 316 -88 117 -143 -49 -156 -116 -27 -94 -128 -77 92
6942I2j77r0L3P7Q8O0p6j87K07n5M2P5o6P8k14K12oO6l11MK17L03m70L02j86K9
$$ 92 -85 -175 -142 -65 23 83 7 -180 27 -28 14 89 23 101 -113 99 93 159 -152 -148 69 372 -98 204 18 47
6968D7r1J27J54j10l92R4K16J3P8j34J13K7j15j17L6m0L17q6j03J05n0j20p1r9
$$ 47 -44 83 237 127 -265 -171 45 58 136 2 115 142 27 -90 -54 -94 223 137 34 139 89 -31 -102 -201
6992b01L2K01J7n2n1J62l30M8L06l7k00P8O7k0M1j04N1P9k29J21k0l9K27m02K84
$$ -201 -169 32 49 -3 -54 108 -222 -174 132 95 -105 -27 40 20 61 -43 8 87 -142 -21 -41 -80 147 -255 29
7017B9l63M66k06P9m7k28K40P1K5j89J38k40M19j8l2k46J63K5p6M8j61K33r7J29
$$ 29 -334 132 -74 5 -42 -270 -30 41 66 -123 15 -225 194 176 144 -102 61 86 10 58 -103 130 33 162
7041A62R5k17R6j96O9O5j60j23J36K90l78J69k2JJ55j40m3N0j06k30L88J00p4
$$ 162 257 40 136 -60 9 74 -86 -209 -73 217 -161 8 -14 -13 142 2 -41 9 -97 -327 61 161 87
7064H7j39R7Oj09m6o4O9L0J88j54j29K86m19K80j36J48o3pO4Q6l82L02M9L5q2
$$ 87 -52 45 51 -58 -104 -168 -99 -69 119 -35 -164 122 -297 -17 -153 -5 -68 -75 -11 75 -307 -5 44 79 -3
7089co7J97j86q1Q1J86q8j38j89L01o7J17M5l11K58R9k73L05k49J32J43o2j43
$$ -3 -70 127 -59 -140 -59 127 39 -99 -288 13 -54 63 108 -203 55 154 -119 186 -63 69 212 150 7
7112GM7p1j90J98l55M18m1J98k33O8M6j60J30k22J58J5J42j86q2qJ85J3j84K60
$$ 7 54 -17 -207 -9 -364 54 13 211 -22 46 92 -68 62 -160 -2 13 155 -31 -113 -121 64 77 -107 153
7136A53k2q7R6R8j16k29M3k0p5J96j03j44N9J8K21j12K45l39J1k0J29L1k9q7J08
$$ 153 131 44 140 238 122 -107 -64 -84 -159 37 -66 -210 -151 -133 88 -24 221 -118 -107 -127 2 33 4 -83 25
7161B5j36o0N7O3k4K59l01L65j49l17L35m11L79k20k8L07l36R3K25r8P1l96L88
$$ 25 -111 -171 -114 -51 -75 184 -117 248 99 -218 117 -294 85 -135 -163 144 -192 -99 126 28 99 -297 91
7184I1j15j44N3J10j08J37N1k01L13k60Q2k41K36j67J91j1J65M7l20R2J0j88J26
$$ 91 -24 -168 -115 -5 -113 24 75 -126 187 -73 9 -232 4 -163 28 17 182 229 -91 1 11 -177 -51
7207e1N1m8Qj35J76k0J67j58J00kl60M33n4M6j87L8O4k65K00p0O2p4J00j88n9
$$ -51 0 -48 -40 -175 1 -19 148 -10 90 88 -272 161 107 153 -34 4 68 -197 3 -67 -5 -79 21 -167 -226
7232b26L99m6k92M58l55R1n3K64k94J4p3j03J72L4J95k52N1j05R4K85k49O8q6
$$ -226 173 127 -165 293 -62 29 -24 240 -54 -40 -113 -216 -44 -10 185 -67 -16 -121 -27 258 9 77 -9
7255iR2r0l7k5R0j06M7J42j72K91r2j87LR8k58N9P0J28Q4j91O5M5O8k09k39L77
$$ -9 83 -7 -44 -69 21 -85 -38 104 -68 223 131 -56 -53 45 -213 -154 -84 44 128 -63 2 47 115 -94 -333 44
7281D4Q3j48j70K07j00K5L1j00J58N1j07K08r0r2K8qk70N3K84k4m0J18J6Rk12
$$ 44 127 -21 -191 16 -84 -59 -28 -128 30 81 -26 182 92 0 28 20 -250 -197 87 63 23 141 157 166 -46
7306d6O1j54j05J99k89L06KK22l39K07K75l76q2J78m5p2J11j71QK63j81n8pK2
$$ -46 15 -139 -244 -45 -334 -28 -26 196 -143 64 339 -37 -119 59 14 -58 53 -118 -110 153 -28 -86 -93 -71
7330g1K55l76J74J68k47l8j09L42J68k67p8o1P5P0M7r5J36o5j06R9%k9K00k54
$$ -71 184 -192 -18 150 -97 -135 -244 98 266 -1 -79 -140 -65 5 52 -43 93 28 -78 21 21 -8 192 -62
7354f2k4J29Mn8j99K96l3k70L30k75mJ49j56K31m2K1j27K40jm71L99Mj38J3L1
$$ -62 -86 43 47 -11 -210 86 53 -217 113 -162 -166 -17 -173 58 16 37 -90 150 149 -322 77 81 -57 -44 -13
7379a3j04Q2R6J6om9J82j33j56Q8j36mK95j27L8j40j87J81k26J71j8m9K34O6m7
$$ -13 -117 -35 61 77 71 22 204 71 -85 3 -133 -137 158 31 69 -71 -258 -77 -303 -132 -150 -199 35 101 54
7404E4j13K6K52j5l15J65j25K4J48l90J94K12k67N04m11K19L8m45J18N0n1O7O6
$$ 54 -59 -33 219 204 -111 54 -71 -47 101 -289 -95 117 -150 354 -57 162 200 -245 -127 -77 -128 -61 5
7427EJ9J12mk14J53p6j61M67k86N8m3r0O5p7J42k32P2K03J24j48m8k84K27q2N8
$$ 5 24 136 132 -82 71 -5 -166 301 15 73 30 -60 5 -72 70 -162 -90 113 237 89 41 -243 -16 -98 -40
7452d0J60k50J37n0J42Oj99lR9r9J59k91JK69j01J66j60j33L86r7L2l05J88m9
$$ -40 120 -130 7 -43 99 105 -94 -97 2 -97 62 -229 -228 41 -60 106 -54 -187 199 102 134 -171 17 -32
7476c2J42k43Q5L9k9J77l8j57q8M57m26K25m6j04K4r4J17m9r9L92l34L7L28l59
$$ -32 110 -133 -48 -9 -38 139 101 -56 -144 313 -113 112 66 -38 -14 -108 9 -40 -139 253 -81 -44 284 -75
7500g5R6J48j88j7L7o6K1p7p6J70P0k44J3N6R7J8l9j18JL22k38K22j28O3j58R7
$$ -75 21 169 -19 -36 1 -65 -44 -121 -197 -27 43 -201 -188 -132 -35 -17 -56 -174 -173 149 -89 133 5 68 -90 7
7526GrR6l4k57K39m3n8j0l2J13J21j94r1k03M35k56K35K4l09J8K87j34pP6N5k77
$$ 7 -2 94 60 -197 42 -1 -59 -69 -101 12 133 -61 -152 -355 80 -176 59 83 -226 -208 79 -55 -62 14 69 -208
7552b08J71m1K63l02j6OM02k70qJ29j28j51n7L34k42r0K58j17NO0O9l16L60P9
$$ -208 -37 -78 185 -117 -133 -127 275 5 -3 126 -2 -153 -210 124 -118 -208 50 -67 -62 -2 67 -249 111 190
7576A90j78k0r8q5K64J53l26k38M27J70m10J01Q3J13j22k29M16m79J57L02m17
$$ 190 12 -8 -106 -191 73 226 -100 -338 89 259 -151 -50 33 146 24 -205 211 -268 -111 191 -226
7597b26K40j42p9K6o7K54q2K31l05j61K18J29Q2j42j29M5O9j63J51r5J08J55l04
$$ -226 14 -128 -207 -181 -248 6 -76 155 -150 -311 -93 36 118 -24 -153 -108 -39 -202 -51 -146 -38 117 -187
7620a87J20J85K6j26j40J85k7L7j72M2k1P1r2r5K69j77J89r3j13K03k02J00J26
$$ -187 -67 118 144 18 -122 63 36 73 -99 -57 -78 -7 -99 -194 75 -102 87 -6 -119 84 -118 -18 108
7643A08R2m5j35L3L0j31K04r2m8r3L6J99n6l18L32l9R5J06l54J91j01o8J44Q9
$$ 108 200 155 20 53 83 -48 156 64 16 -77 -41 158 102 -216 116 77 172 278 -76 115 14 -54 90 179
7667A79k38J44k9j26Q2j23K69j06l3j00k4K91j59r9J36j54J21j03k68L46J9m4
$$ 179 -59 85 56 -70 12 -111 158 52 19 -81 -105 186 27 -72 64 -90 31 -72 -340 6 25 -19
7689a9k9p2J54kj82Q5M1j0mM8n3P1m05N06Jj51j7O2J2j07M0R9rP8l4j93j3j84
$$ -19 -48 -120 34 32 -150 -65 -24 -34 -38 10 -43 28 -377 129 130 -21 -38 24 36 -71 -31 68 59 137 103 -90 -103 -287
7717b87L66j33J34k62K23j36K84j32J81l45K57q2R3k58J68j24j12P8NQK72j76
$$ -287 79 -54 80 -182 41 -95 189 57 238 -107 150 68 161 -97 71 -53 -165 -87 -82 -74 198 22
7739B2N8J13j53j86J36l5j90L77k47j96M15O8j15pR7q2q5J27k97L58m07K78j20
$$ 22 80 193 40 -146 -10 -45 -235 142 -105 -301 114 182 67 60 157 75 -10 117 -180 178 -229 49 -71
7762g1Q2j36J63j28L58k08K3J2m4j50n2Q7j80J01K8k8J35o8j38K35M8m8Lj31p6
$$ -71 11 -125 38 -90 268 60 83 95 51 -99 -151 -64 -244 -143 -115 -143 -8 -76 -214 21 69 21 24 -107 -183
7787a83J01O2K22q1q7K8J01k20LJ15J93j85k05k3Q9K45l12J24J00J8R1j18k64
$$ -183 -82 -20 202 121 34 62 163 -57 -54 61 254 69 -136 -159 -70 175 -137 -13 87 105 196 78 -186
7810a86J19K39k10J11j42k81J90J12Np2P8J45m3j23K36m78K78k25K40k2j6K37
$$ -186 -67 172 -38 73 -69 -350 -160 -48 -43 -115 -37 108 65 -58 178 -300 -22 -247 -7 -29 -45 192
7832A92k40r9J57L0j32P5O5jK16m5l36o0l5L53l15J39j15J17m9j61K55J99k60
$$ 192 -48 -147 10 40 -92 -17 48 47 263 218 -118 -178 -213 140 -175 -36 -151 -34 -83 -244 11 210 -50
7855e0N4Q2m8j43J24o4Q2o7K00j90P9N0j51N7j0l9l9Q5l24QK55l0K77k38J69j46
$$ -50 4 86 38 -105 19 -45 37 -30 170 -20 59 109 -42 15 5 -34 -73 12 -312 -304 -49 -79 198 -40 129 -17
7881a7L7l7L0j50q0J58R2J47o0p8r4L4n3J89l6j21J00q2O0l3j06j53L07m4k7j06
$$ -17 20 -17 13 -137 -217 -59 33 180 120 42 -52 -18 -71 118 82 -39 61 -21 39 6 -100 -253 54 10 -17 -123
7907a23j8P4J11k54K22k99J71k13J39J86j05n0N2k6J69n0j18R0J78j56k44L49
$$ -123 -141 -67 44 -210 12 -287 -116 -329 -190 -4 -109 -159 -107 -133 36 -14 -132 -42 136 -20 -264 85
7929H5k1j32J1j57JK67j0o1K2o1J61O8j72J37j38k6j9o9k18L92j52K6K68k23L9
$$ 85 64 -68 -57 -214 -213 54 44 -17 5 -56 105 173 1 138 0 -26 -45 -114 -332 60 -92 -66 202 -21 18
7954A8j36K68j1l1k65Q0pR0J46k49L0J26R5%k30J82k41K27j55op7K4K05k10n3
$$ 18 -118 150 139 108 -157 -77 -84 6 152 -97 -67 59 154 154 -76 106 -135 92 -63 -69 -146 -122 83 -127 -180
7979a80L07j19j4n9J05Lj31J72o2J48k16q7J10Oj18M9J20j57K01j59J96l63K28
$$ -180 127 8 -6 -65 40 43 -88 84 22 170 -46 -133 -23 -17 -135 -86 34 -123 78 -81 115 -248 -20
8002b0j16K3n2P1J03R2kj73k19K24J02j71J3L14m1j75J16j96l16N82l4Kr2L9n8
$$ -20 -136 -113 -165 -94 9 101 99 -74 -293 -69 33 -138 -125 189 148 -27 89 -107 -423 159 125 127 35 74 16
8027A6r0J22p3j20M3m5N1J32O9j56j65k2rl9J93K01k1n2k32L60j55j44K17k01
$$ 16 -74 48 -25 -145 -102 -147 -96 36 105 -51 -216 -238 -247 -286 -93 108 87 35 -197 163 8 -136 81 -120
8051a20J92j75J51j44J6Q4j20L03k14k20M19j54j92J93j11p6M55k22j54r5j9L41
$$ -120 72 -103 48 -96 -80 4 -116 187 -27 -247 172 18 -174 19 -92 -168 287 65 -89 -184 -203 138
8073A38o8k1k01P3K70j58JJ4r8Q8M2p0p3r2J54k24K91j03r5J92j72R6r2k06N75
$$ 138 70 49 -152 -79 191 33 34 48 -50 38 80 10 -63 -155 -1 -225 66 -37 -132 60 -112 -16 -108 -314 261
8098B61m92L31r6k09L09j49o9J0Q0R1k36L40j12J00j26q0R1k00J52n1q1L13l97
$$ 261 -231 100 4 -205 104 -45 -114 -104 -24 67 -169 171 59 159 33 -47 44 -156 -4 -55 -136 177 -220
8121b20M9J62r4K53m4n1j8j54K16J0m8j30N1j00q5k8K59k15K73j37R0j39K41k69
$$ -220 -171 -9 -103 150 106 55 37 -117 99 109 61 -69 -18 -118 -203 -231 28 -187 86 -51 39 -100 141 -128
8145a28J10P6l9n3L2q8Lj0j86K90J7j09L6Q9k8j54J51J01q6K17l26K08k55K34
$$ -128 -18 58 19 -34 -2 -90 -87 -97 -283 7 24 -85 -49 40 12 -142 9 110 24 241 -85 123 -132 102
8169A02p1j53K44Oj43K69l58P1J51o0j69M2O6k21Q9l8L10j96rN0O2j
$$ 102 31 -122 122 128 -15 254 -104 -33 118 58 -111 -69 -3 -224 -135 -173 137 -59 -68 -18 44 43
8191D3
$$ Imaginary data points
##PAGE= N=2
##DATA TABLE= (X++(I..I)), XYDATA
0@%%%%%%%%%%%%%%jRj6J6j6J6k4L2l4M2n0N8p2Q2r0J04j21J40j63J86k10K38k67
$$ 0 0 0 0 0 0 0 0 0 0 0 0 0 0 0 -1 8 -8 8 -8 8 -16 16 -18 24 -26 32 -40 42 -48 56 -65 75 -88 98 -112 126 -141
37a41L00l37L76m18M65n18N75o37P04p77Q58r45J041j148J265j393J534j693J871
$$ -141 159 -178 198 -220 245 -273 302 -335 369 -408 450 -495 546 -602 663 -730 804 -889 982
56I82k070K297k558K862l219L645m168M826n682O848q548J1298j6741M9045r3415
$$ 982 -1088 1209 -1349 1513 -1706 1939 -2229 2597 -3085 3763 -4785 6513 -10228 38817 -54598
71e4598L4144Q2698r2527N6895q991k4305K8687l0763J3808J4739m8974L8137
$$ -54598 -20454 62244 -30283 26612 17621 -6684 22003 -8760 5048 19787 -29187 8950
83H950J482j5803J1666k6255J4033K1387l3650Q081N206k271O334p089P528j1341
$$ 8950 10432 -5371 6295 -19960 -5927 15460 -18190 -10109 -4903 -7174 -840 -7929 -401 -11742
97a1742j3483L4891k426k4831M811R480N985q961Q75Q829k0837J1081J7987k3826
$$ -11742 -25225 9666 7240 -17591 -12780 -3300 2685 -6276 -5401 3428 -17409 -6328 11659 -12167
111a2167k114J6243K908p094j2966J2097M516p711J3360j2111r613K3078n229
$$ -12167 -14281 1962 4870 -2224 -15190 -3093 1423 -6288 7072 -5039 -14652 8426 3197
124C197n185Q462j4011J237J8261p06j1283j65J0328m886o014R151k783l328Q063
$$ 3197 -1988 6474 -7537 -6300 11961 11255 -28 -193 10135 5249 -765 8386 5603 2275 10338
139A0338J146r230r084R909R506j2012j816M012l578N184r3j0434j314Q427L172
$$ 10338 11484 2254 -6830 3079 12585 573 -1243 2769 -809 4375 4282 -6152 -7466 961 4133
154D133l893k963l512Q25O960k927l932M22K589O328q672l984J1037q671K038
$$ 4133 240 -2723 -6235 -5410 1550 -1377 -5309 -4887 -2298 4030 -4642 -8626 2411 -6260 -4222
169d222J0176j5019P74J1232m691L37m853j990P806l828M660m66j3894J1942O763
$$ -4222 5954 -9065 -8291 2941 -1750 -1413 -6266 -8256 -450 -4278 382 -84 -13978 -2036 4727
184D727j0733K595J39O02L934l521R61j346J464Q761p461m354P757k033K471M127
$$ 4727 -6006 -3411 -3272 -2670 1264 -2257 -1296 -2642 -1178 7583 122 -4232 3525 1492 3963 8090
200H090q425L52N689p5l830j464M281J75j100L379n049n808P316L704n238m04
$$ 8090 -335 17 5706 5631 1801 337 4618 4793 3693 7072 2023 -3785 3531 7235 1997 1593
216A593K884k204j421L500k666n223P600M742q027l536M193J977j249j737J269
$$ 1593 4477 2273 852 4352 1686 -3537 4063 8805 778 -2758 1435 3412 2163 426 1695
231A695k094K54M893l218n184J698J403J621j031l433J21K909O12m832j739N899
$$ 1695 -399 -145 4748 1530 -3654 -1956 -553 1068 37 -3396 -3275 -366 246 -4586 -6325 -426
247d26j718l339N898k948o086O431L765m604l869L812M263m721J018L694o813
$$ -426 -2144 -5483 415 -2533 -8619 -2188 1577 -3027 -6896 -3084 1179 -3542 -2524 1170 -5643
262e643L316P103o745k038L524J312J636k558m83J514j609K745p73k755M016L31
$$ -5643 -2327 4776 -1969 -4007 -483 829 2465 -93 -576 938 -671 2074 1301 -1454 2562 2893
278B893j303J667m294o19O451O24l931j536L648N69m425K744K571m943J220N212
$$ 2893 1590 3257 -1037 -1656 4795 5419 1488 -48 3600 4169 -256 2488 5059 116 1336 6548
294F548l181m710K484M569k717l168K697j334n17K891k303k711J757R64j65p90
$$ 6548 3367 -1343 1141 5710 2993 -175 2522 1188 671 3562 1259 -1452 305 1269 1104 314
310C14j513l43J348J947l989l353N483O14m091K788k10l653K612J746k013j948
$$ 314 -1199 -1542 -194 1753 -2236 -5589 -106 508 -3583 -795 -1005 -4658 -2046 -300 -2313 -4261
326d261R04N265l951l857N805j478j818M324k330k628J815J116J918k198j809
$$ -4261 -3357 1908 -2043 -5900 -95 -1573 -3391 933 -1397 -4025 -2210 -1094 824 -1374 -3183
341c183K729l40P03J33l008M366O65l174J746q77r62K909J233j035l400K333M695
$$ -3183 -454 -794 -91 42 -2966 1400 2065 -1109 637 -240 -1202 1707 2940 1905 -1495 838 5533
358E533m678k133M674r87p92J709o18j515p30L054Q90m072Q12J623r50O06j516
$$ 5533 855 -1278 3396 2409 1617 3326 2708 1193 463 3517 4407 335 1147 2770 1820 2426 910
375I10j266K231l12p61l33p92K94m4O13n87l459J405M892l889k836K858r80k35
$$ 910 -356 1875 1563 802 469 -323 -29 -73 540 -47 -3506 -2101 2791 -1098 -3934 -1076 -2056 -2291
393b291J602j819l19K21J482R06m432J597L483l434J140M63l266K982J242j476
$$ -2291 -689 -2508 -2827 -2606 -1124 -218 -4650 -3053 430 -3004 -1864 -1401 -4667 -1685 -443 -1919
409a919N4j936K712Q95k907L334k667r06N811l861j054K559j502K763m77j693
$$ -1919 -1865 -3801 -1089 -194 -3101 233 -2434 -3340 2471 -1390 -2444 115 -1387 1376 899 -794
425g94K520k486K608K299o086L763K134l117L467l294j665M900j647j70j124r31
$$ -794 1726 -760 1848 4147 -1939 1824 3958 841 4308 1014 -651 4249 2602 2432 1308 377
441C77M095l508k02L861n678R88M232k980r14o37K558P64m609K708N06k903L387
$$ 377 4472 964 762 4623 -1055 -67 4165 1185 271 -366 2192 2956 -1653 1055 1561 -1342 2045
458B045o72j955M60o86K774j008l282J717j51J307l97l817L654J69k880K778p25
$$ 2045 1373 -582 -122 -808 1966 958 -2324 -607 -758 549 152 -3665 -11 158 -2722 56 -669
475f69k561J944J127O21m156m4N692l241k675M318j869o86K465o91m06j726J766
$$ -669 -3230 -1286 -159 462 -3694 -3738 1954 -1287 -3962 356 -1513 -2199 266 -425 -831 -2557 -791
492g91L351l282j134K163m6R93o40j550J686L90j113J439n59j723J360K191j073
$$ -791 2560 -722 -1856 307 261 1254 614 -936 750 1140 27 1466 907 -816 544 2735 1662
509A662k894R22L935j556l046K568L08k114J789J419k416o72K131J451k627j576
$$ 1662 -1232 -310 3625 2069 -977 1591 1899 -215 1574 2993 577 -95 2036 3487 860 -716
525g16K902L6j132N86j375K36J093j283J196r53k184J925J137j816j397j0K704
$$ -716 2186 2222 1090 1676 301 537 1630 347 1543 590 -1594 331 1468 -348 -1745 -1755 949
542I49p56l313K341J90k043J764O68k364p68K257J514k958j054L176m03j372R45
$$ 949 193 -3120 -779 -589 -2632 -868 -200 -2564 -3332 -1075 439 -2519 -3573 -397 -800 -2172 -1227
559a227m39l51M39J094j55j700O53J166L28o50j267R40J834j282n42J071k04l14
$$ -1227 -1666 -2017 -1578 -484 -639 -2339 -1686 -520 -192 -842 -2109 -1169 665 -617 -1159 -88 -292 -606
577f06Q53J444k168j169M233j74l293J492J208L1k24l21Q38j123j82L054k305
$$ -606 247 1691 -477 -1646 2587 2413 -880 612 1820 1851 1627 1306 2144 1021 839 3893 1588
594A588j393K192n05P6l01j567J647k17k17K32j652M98N96o74P83j313j195K786
$$ 1588 195 2387 1882 1958 1657 90 1737 1520 1303 1535 -117 381 977 303 1086 -227 -1422 1364
612A364q36j726L99L06N99m44l69k56q18J174J266k412m02J326Q2o83L5j77p14
$$ 1364 528 -1198 -799 -493 106 -338 -707 -963 -1781 -607 659 -1753 -2155 -829 -747 -1430 -1395 -1572 -2286
631b286Q87R25j029q52Q82P37l32m02L08l68L41J270j134q58J787K08l23L23r92
$$ -2286 -1399 -474 -1503 -2355 -1473 -736 -1068 -1470 -1162 -1530 -1189 81 -1053 -1911 -124 84 -239 84 -908
650i08P38R57k71lo24Q35M93n22O20l57r58J837M38j934K05J291K6q53l4O28o74
$$ -908 -170 787 516 513 -111 724 1217 695 1315 958 0 1837 2275 341 546 1837 1863 1010 976 1604 930
671I30K9J498j144j563J291Q80p03p98N64k5P3m0p02J86l75L90M0p37j83k88M87
$$ 930 959 2457 1313 -250 1041 1921 1218 420 984 959 1032 992 290 476 101 491 531 -206 -389 -677 -190
692a90R42j885p31K312r76q70Q75p38o5k58Q97rk485J664K069k368k71J117j25
$$ -190 752 -1133 -1864 448 -528 -1398 -523 -1261 -1326 -1584 -687 -696 -3181 -1517 552 -1816 -2087 -970 -1095
711a095PN1K93j08q23J035O14j056lK27J210L7j539Q91Q25o49j49L69M31q05K85
$$ -1095 -1088 -1037 -744 -852 -1675 -640 -26 -1082 -1085 -858 352 389 -1150 -259 566 -83 -232 137 568 -237 48
732D8J661j102j591J861J377j390n61J164N08j624L96J352j075p81J715M9j206
$$ 48 1709 607 -984 877 2254 864 303 1467 1975 351 747 2099 1024 243 1958 2007 801
749H01m30Q64P16j134n97O89P7n90j5K34Q2r16L87J374j512j491K164N31k319
$$ 801 371 1235 1951 817 220 909 986 396 381 615 697 -219 168 1542 30 -1461 703 1234 -1085
768a085j77J549k44j194M53R44j583k55J762p43j173l3J235J17r80k4N36l72N6
$$ -1085 -1262 287 43 -1151 -698 246 -1337 -1592 170 -573 -1746 -1779 -544 -427 -1407 -1431 -895 -1267 -1211
787a211K72l13J18k82O18R41j689J67J454p8q38n7N35O29j020O15J198j830M79
$$ -1211 -939 -1252 -1134 -1416 -798 143 -1546 -1379 75 -3 -841 -898 -363 266 -754 -139 1059 -771 -292
806b92J868j237o79M07J082j23j238O58R46r89Q29m2o96M28j19N06p9o24K88R0
$$ -292 1576 339 -340 67 1149 1026 -212 446 1392 403 1232 1190 494 922 803 1309 1230 606 894 984
826I84K89l75m89O96L18j129L76J00p81O73J97m32r03J71J001q10m22P63q41l22
$$ 984 1273 898 409 1105 1423 294 670 770 -11 662 859 427 -476 -305 696 -114 -536 227 -614 -936
846i36Q34o94k93K96L1K22m59k27K61n0M28k52r23O86M72m48qK35j89j50N06J18
$$ -936 -102 -796 -1089 -793 -762 -540 -999 -1226 -965 -1015 -587 -839 -1762 -1076 -604 -1052 -1060 -825 -1014 -1164 -658 -540
868e40n59J39Q15j13n29O52L6k42N39J4n90L51O00J9m88L00J70J76J58M68j094
$$ -540 -1099 -960 -145 -258 -787 -135 -99 -341 198 212 -378 -27 573 592 104 404 574 750 908 1376 282
889B82M44P66m92l68K62K41j55K02J73n14j08N78J34j180L00K4L92J47q57R7m1
$$ 282 726 1492 1000 632 894 1135 980 1182 1355 841 733 1311 1445 265 565 589 981 1128 271 368 327
910C27J49j3k99j3j74j33P16l85j266O93O66o70m69J6R86q21k54J026j038k50
$$ 327 476 463 164 151 -23 -156 560 175 -1091 -398 268 -402 -871 -855 131 -690 -944 82 -956 -1206
930a206R49j21p08k64N45O41r63k65J006p89N24J8j95Q9j39N01Q99r38k47N62
$$ -1206 -257 -378 -1086 -1350 -805 -164 -1127 -1392 -386 -1175 -651 -633 -828 -739 -878 -377 522 -416 -663 -101
950a01L70j68o32O78M41r29O40O99j152R2J073L58j211m52J215J18j048M77N83
$$ -101 269 101 -531 147 588 -341 299 998 -154 -62 1011 1369 158 -294 921 1039 -9 468 1051
969A051p60L42M31r7m33r3Q50m10p23J14O41K00q20lK60j48k5K12j21m62l61J202
$$ 1051 291 633 1064 967 534 441 1291 881 158 272 913 1113 293 290 550 402 377 589 468 6 -355 847
991H47j96j531L99J149p55n33K91j06l67P1P63r01n65J204q6m05j89l21Q00k87
$$ 847 651 -880 -481 668 -87 -620 -329 -435 -802 -731 32 -869 -1434 -230 -316 -721 -910 -1231 -431 -718
1011g18j11M2k39K19N1J51Q1o26O05M26l60j41q3O27J21o67O04O8o35Q77M99j082
$$ -718 -829 -787 -1026 -807 -756 -605 -524 -1150 -545 -119 -479 -620 -703 -76 45 -622 -18 50 -585 292 791 -291
1033b91J4L37P86l11r31J025q6j92Q71p16r9L58r6M79l07l80K54K47O6n12l95
$$ -291 -277 60 846 535 -396 629 543 351 1222 506 407 765 669 1148 841 461 715 962 1028 516 121
1054A21Q25p0p48P04k24m34N11k4m39l64j4J107j131j94L58j19N6J63n08J32j30
$$ 121 946 876 128 832 608 174 685 661 222 -142 -156 951 -180 -374 -16 -135 -79 84 -424 -292 -422
1075d22N9K77o14l2K79p0K27n67l38N55R3nk16k7J77M2k02J05l69M81L23l74J2
$$ -422 -363 -86 -700 -732 -453 -523 -296 -863 -1201 -646 -553 -558 -774 -801 -624 -582 -784 -679 -1048 -567 -244 -618 -606
1098f06j50O39J35j75l20J62K07L98l14P0N11n11J98M41k33j12K92PL42q75N83
$$ -606 -756 -117 18 -157 -477 -315 -108 290 -24 46 557 46 244 685 452 340 632 639 981 106 689
1119F89L01n64L43k06j72K74K91k11k47m50Q92n5o20L71k56K71j25l96L68l81
$$ 689 990 426 769 563 391 665 956 745 498 48 940 885 265 636 380 651 526 130 498 117
1139A17r3M91k14m15j78M16N78q78n12N07J85o88K93J20Lm55L59L05q48p7Q63
$$ 117 24 515 301 -114 -292 124 702 -176 -688 -181 4 -684 -391 -271 -268 -723 -364 -59 -907 -984 -121
1160a21k9r05K31K33j3j51K67J09k12n7N38J0o53nP06J20n93J13O10j57m52O27
$$ -121 -150 -1055 -824 -591 -604 -755 -488 -379 -591 -648 -110 -100 -753 -758 -52 68 -525 -412 198 41 -411 216
1182B16K24n32q9P63J0o63K74O92l69k50K38P2m8O1L54j50n95N94J39m43J8J92
$$ 216 440 -92 -181 582 592 -71 203 895 526 276 514 586 538 599 953 803 208 802 941 498 516 708
1204G08J9R5o97J46K46l9k37J69K92p24k13P77j16j023M46P78q34k35L51k0j81
$$ 708 727 822 125 271 517 478 241 410 702 -22 -235 542 426 -597 -151 627 -207 -442 -91 -111 -292
1225b92k63L85p8m68L78Q9k57o4J38J40j10m75M85j89P4l8P9J74l95j48P93l12
$$ -292 -555 -170 -248 -716 -338 -249 -506 -570 -432 -292 -402 -877 -392 -581 -507 -545 -466 -292 -687 -835 -42 -354
1247c54o45Q37J12k71j08L82l5j22k14P12m15j26O14L9m81O5K48R4n5j93M54O
$$ -354 -999 -162 -50 -321 -429 -47 -82 -204 -418 294 -121 -247 367 406 -75 -10 238 332 277 84 538 544
1269E44m36L89n0J86o3k62L83k48k49M62O3k92J11j50L72m49R4J81m57qK95r9
$$ 544 108 497 447 633 570 308 691 443 194 656 719 427 538 388 760 311 405 586 129 121 416 317
1291C17k72J90Q6j26m22M39k6m57K16J75o60J35K63l72M73m13J0p6L0K23k97k12
$$ 317 45 235 321 195 -227 212 186 -271 -55 120 -540 -405 -142 -514 -41 -454 -444 -520 -490 -267 -564 -776
1313g76N19n06L56k8k10N3R8K93k49n5j30J84k32M77l09J2N11j40p7K64J3R4q9
$$ -776 -257 -763 -407 -435 -645 -592 -494 -201 -450 -505 -635 -451 -683 -206 -515 -503 8 -132 -209 55 68 162 73
1336G3m2M40n41J84N07l77J10J99l44Q7K30n5K08k2r3n7k55M54L2l05k87M78J02
$$ 73 31 471 -70 114 621 244 354 553 209 296 526 471 679 657 564 507 252 706 738 433 146 624 726
1359G26k55j19N4j71J20M4l39jK7L7K5P0l07k61O42j99n14J78k1k11J66k5l32
$$ 726 471 352 406 235 355 399 60 59 86 123 148 218 -89 -350 292 93 -421 -243 -264 -475 -309 -334 -666
1382f66O0M3M57m36p0M47l97Q9J60l80R9K43k46K52j43J54j75J74N26p48K51O12
$$ -666 -606 -563 -106 -542 -612 -165 -562 -473 -313 -693 -594 -351 -597 -345 -488 -334 -509 -335 191 -557 -306 306
1404C06m42k68L71J30L1m19M58J82p42N29M74m60o5K64K05k72j75K98K4j56J96
$$ 306 -136 -404 -33 97 128 -291 167 349 -393 136 610 150 85 349 554 282 107 405 429 273 469
1425D69Mj16M6N2K53j65n86K77M73k27l28K53n4l60r4O91k78m84M73J96l47m08
$$ 469 473 357 403 455 708 543 -43 234 707 480 152 405 351 -9 -103 588 310 -174 299 495 148 -260
1447b60M21J5o46J30L01k27j17N23m57m2k95N18K86o20p6J64J28k22j8J19J16
$$ -260 161 176 -470 -340 -39 -266 -383 140 -317 -359 -654 -136 150 -470 -546 -382 -254 -476 -494 -375 -259
1468b59l61L29K74m95l3L37K5l30J18N14j99m07K99R0rj87M74k09q8j05N52o8
$$ -259 -620 -291 -17 -512 -545 -208 -183 -513 -395 119 -80 -487 -188 -98 -107 -294 180 -29 -117 -222 330 262
1490B62j50J96l49K86Q3k76L85j27l6L33k2n8j44L16j85l06K29J67n7k24J41k1
$$ 262 112 308 -41 245 328 52 437 310 274 607 585 527 383 699 514 208 437 604 547 323 464 443
1512D43m9M1p9k6m36J48L73n65K26M7k40J53o7j42l2L87k90k09k2j4J09j83K24
$$ 443 394 435 356 330 -106 42 415 -150 76 123 -117 36 -31 -173 -205 182 -108 -317 -339 -353 -244 -427 -203
1535b03k17r0K25J14k11k24J91M1K3J88j28j94K56j18m8J18R5p3K11j27p9J3P2
$$ -203 -420 -510 -285 -171 -382 -606 -415 -374 -351 -163 -291 -485 -229 -347 -395 -277 -182 -255 -44 -171 -250 -237 -165
1558a65K27p2L7J75K5j74K60k00q0J06J70m3J6lK25j29k57M93m42K0K37j11K74
$$ -165 62 -10 27 202 227 53 313 113 33 139 309 266 282 279 504 375 118 611 169 189 426 315 589
1581E89l58O7O8q6j85K28L6J60m48J38R4k20p5L52j17m70K26P8j53l41N61j34
$$ 589 231 298 366 280 95 323 359 519 71 209 303 83 8 360 243 -227 -1 77 -76 -417 144 10
1603A0k8j25R2j06j15k37J82j87K95Q4k1k30n2j48M06Q1l32NJ29O0j25L67k36
$$ 10 -18 -143 -51 -157 -272 -509 -327 -514 -219 -135 -156 -386 -438 -586 -180 -99 -431 -426 -297 -237 -362 5 -231
1626b31o5j43M90j58m76O33P0k11K5jr1L8L88j60k48P7M87j56j41k33L24J48l77
$$ -231 -296 -439 51 -107 -583 50 120 -91 -66 -67 -158 -120 268 108 -140 -63 424 268 127 -106 218 366 -11
1649a1J36M15j27l01L77j4j79k03rO05n43l0L65p8l90J11J95q8k85M28O2n82k1
$$ -11 125 540 413 112 489 475 296 93 84 689 146 116 481 403 13 124 319 231 -54 374 436 -146 -167
1672a67N76j91l92J78J01l48J71n6l5J44j66qM2P4k24K31j75k74l7L22m2k59K71
$$ -167 409 218 -174 4 105 -243 -72 -128 -163 -19 -185 -193 -151 -77 -301 -70 -245 -519 -556 -234 -276 -535 -264
1695b64J39k54k27M90p9l55K32J27KQ3N6K05k67J46O7k05J41J82M9j51m2k7K72
$$ -264 -125 -379 -606 -116 -195 -550 -318 -191 -189 -106 -50 155 -112 34 101 -104 37 219 268 117 75 48 320
1718C20j29ok7OK01r6J51j00l60K75K68j45k44J51J10j56j02p2J43p6K65k4m09
$$ 320 191 185 158 164 365 269 420 320 -40 235 503 358 114 265 375 219 117 45 188 112 377 353 -56
1741e6J97J15J84n04R2K79k57J85k70j17L11n3j48k95K75k34J69M1k45k4LN01
$$ -56 141 256 440 -64 28 307 50 235 -35 -152 159 106 -42 -337 -62 -296 -127 -86 -331 -355 -352 149
1763A49n39K8J90j0o2J09j62K03k60L34j52k01J89q8Q4J49m4k52J09LJ99k70J68
$$ 149 -390 -362 -172 -182 -244 -135 -297 -94 -354 -20 -172 -373 -184 -272 -188 -39 -83 -335 -226 -223 -24 -294 -126
1786a26K52k9k7J89k01QN4O7j00J49j96O6q1J98l3K24m7j04j45L4J95k81m3K70
$$ -126 126 97 70 259 58 66 120 187 87 236 40 106 25 223 190 414 367 263 118 152 347 66 23 293
1810B93N3j41j43J87j69K20j88o6L01j79j69rJ04K77n77M09m17J38M4o1K27l46
$$ 293 346 205 62 249 80 300 112 46 347 168 -1 -10 94 371 -206 203 -214 -76 -32 -93 134 -212
1832b12J5r3J51j69J35o0r4J34j90q3M84l12O6n6L2j8n7J62j21j39J58M77n89
$$ -212 -197 -290 -139 -308 -173 -233 -327 -193 -383 -466 18 -294 -228 -284 -252 -270 -327 -165 -286 -425 -267 210 -379
1855c79m5P39j24m81J92J20j09j24L22o1j3J4nJ57j63Q3j36J96j44K00%K9k20
$$ -379 -424 315 191 -290 -98 22 -87 -211 111 50 37 51 46 203 40 123 -13 183 39 239 239 268 48
1878D8L14k9M7k13J36K4l39J55K72j61k25L00qj78j72L24j68j5J32J9k71J25j50
$$ 48 362 333 380 167 303 327 -12 143 415 254 29 329 321 143 -29 295 127 112 244 263 -8 117 -33
1901c3Q1k23Q2J02R0j32j93p9J01Qj09L73j06k83k4L87r9k87L17Qj81J0J87j85
$$ -33 48 -175 -93 9 99 -33 -226 -305 -204 -196 -305 68 -38 -321 -345 42 -57 -344 -27 -19 -200 -190 -3 -188
1925a88m5J51J8j31l1K0O7J00O3j46J00lqmk1J89k31M21L6l38k61N98m47N28k98
$$ -188 -233 -82 -64 -195 -226 -206 -139 -39 24 -122 -22 -25 -33 -37 -58 131 -100 321 357 19 -242 356 -91 437 139
1950A39J35m85N43J79k66j40J43J91k99n8K52J63m81K53j06L1Q3j08K8Q0k87J74
$$ 139 274 -211 332 511 245 105 248 439 140 82 334 497 16 269 163 194 277 169 197 277 -10 164
1972A64n7j49L7K9R2p6l87L64J17k27J6j32J33j52O5K72l31j59K77j39Q5r2K2
$$ 164 107 -42 -5 24 116 40 -347 17 134 -93 -77 -209 -76 -228 -163 109 -222 -381 -104 -243 -158 -250 -228
1995b28J55O2p0k4M7J04j27r8J00k98l2M18j49nn3M7K92p6n3J10r1j91K96J34
$$ -228 -73 -11 -81 -105 -58 46 -81 -179 -79 -377 -409 9 -140 -145 -198 -151 141 65 12 122 31 -160 136 270
2019B70l47L53j20m2j07K46o3J09k42K64k38J64J59j86o9J97r5l31K99k03J51
$$ 270 -77 276 156 114 7 253 190 299 57 321 83 247 406 220 151 348 253 -78 221 18 169
2040A69j13K73j65o9K85l48q2N6J44j64J45o3l51L12j19j43P4p4l2J61K66j88
$$ 169 56 329 164 95 380 32 -50 6 150 -14 131 68 -283 29 -90 -233 -159 -233 -265 -104 162 -26
2062b6j53K9J10k9k35M02l87l1K65l03J65p6J69r3k1K90j34j06J47K8k04J42O3
$$ -26 -179 -150 -40 -69 -304 98 -289 -320 -55 -358 -193 -269 -100 -193 -214 76 -58 -164 -17 11 -193 -51 12
2085A2m2m2J01j63J49oK0p3J92K5j86r5L70j18j02R1K04l29L44q2q6q2L36l65
$$ 12 -30 -72 29 -134 15 9 29 -44 148 173 -13 -108 262 144 42 133 337 8 352 270 184 102 438 73
2109G3M9Q7o2k95K21P4J47j44jK0j00J38k78N0J5K3j10J27o1k04R3L43k36om9
$$ 73 122 209 147 -148 73 147 294 150 149 169 69 207 -71 -21 -6 17 -93 34 -27 -231 -138 205 -31 -37 -86
2134h6m3j28o4J28Rp5J89j01r3k9J74j69k23N28k26q1K85n4j23K0J08o3J15q9
$$ -86 -129 -257 -321 -193 -184 -259 -70 -171 -264 -293 -119 -288 -511 17 -209 -290 -5 -59 -182 -162 -54 -117 -2 -91
2158i1k87K63J30lj96L31J77m40K34J10l17k2P3K02k4o1J37j00j65K43j48K6R1
$$ -91 -378 -115 15 12 -184 147 324 -116 118 228 -89 -111 -38 164 140 79 216 116 -49 194 46 72 163
2181A63Q4k55M9J89m9j46K20k1k29L23j64R4L4j68k4p1J72k6j24o1J80k52rN3
$$ 163 247 -8 41 230 181 35 255 234 5 328 164 258 292 124 100 29 201 175 51 -10 170 -82 -91 -38
2205c8nP0j24j28p9Q4J13k09K08Rj75J46n6K18k03r8j7J49J37N2j49q5J84k63
$$ -38 -43 27 -97 -225 -304 -220 -107 -316 -108 -99 -274 -128 -184 34 -169 -267 -284 -135 2 54 -95 -180 4 -259
2229b59J97L4j05J98k24N4K06j60L8J37r7r1q3L00O3j77L7nJ8j4p9l1K59K37m21
$$ -259 -62 -28 -133 65 -159 -105 101 -59 -21 116 19 -72 -155 145 208 31 68 63 81 67 -12 -43 216 453 32
2254C2J17k8K9O4j2l4j34L6rK3J05j56OJ25n6o3P2j84r3r6K12K98m38J62J15l4
$$ 32 149 121 150 214 202 168 34 70 61 84 189 33 39 164 108 45 117 -67 -160 -256 -44 254 -184 -22 93 59
2280E9N9j49k21J89J21j66k40L20j78J84q6j69J36j22K16p6K5j23K13j31k6k0
$$ 59 118 -31 -252 -63 58 -108 -348 -28 -206 -22 -108 -277 -141 -263 -47 -123 -98 -221 -8 -139 -165 -185
2302a85Q1q0M9mJ23j21J16p9O1K55k00J35k84K54L4m5J04m9q8r7J36k22J84K87
$$ -185 -104 -184 -135 -139 -16 -137 -21 -100 -39 216 16 151 -133 121 155 110 214 165 77 -20 116 -106 78 365
2326C65l28L6k29K73%O4O0j61o0M16j47j75J9L3J40l29K01j64M4Q9J5J36l46L6
$$ 365 37 73 -156 117 117 181 241 80 20 436 289 114 133 166 306 -23 178 14 58 147 162 298 -48 -12
2350a2mM1k61J31K28k9k75M1K0k5Q7M3K9j31p4K07k86pJ42J3J70k09K54j64j80
$$ -12 -16 25 -236 -105 123 94 -181 -140 -120 -145 -58 -15 14 -117 -191 16 -270 -277 -135 -122 48 -161 93 -71 -251
2375b51O7K6L7L3k06K15j28p2K07j63K18j28J5O8o8K06n1O5k00P6J0J32k15J37
$$ -251 -184 -158 -121 -88 -294 -79 -207 -279 -72 -235 -17 -145 -130 -62 -130 76 25 90 -110 -34 -24 108 -107 30
2399C0J64n0q2K5l4O1L5j05K47k07m8J15P4p0o1n5k1m8R3J19k31L43j60j13J63
$$ 30 194 144 62 87 53 114 149 44 291 84 36 151 225 155 94 39 18 -30 63 182 -49 294 134 21 184
2424A84K15l72R1j49Ok37J74N4M63l12r9j41q3OJ68q8J05j17J41q9J03j05R7k9
$$ 184 399 27 118 -31 -25 -262 -88 -34 429 117 18 -123 -206 -200 -32 -120 -15 -132 9 -80 23 -82 15 -14
2448a4p3o5l7l0k0J00j52L49p8r9p9K13M9n9k75L14j23K84j23N1k02R7J35q1Q9
$$ -14 -87 -152 -189 -219 -239 -139 -291 58 -20 -119 -198 15 64 5 -270 44 -79 205 82 133 -69 28 163 82 171
2473A71k49J76rj66J50J03J49r3j54J36N5l07R1R6j16j05J24P7m09L89K8j93J85
$$ 171 -78 98 89 -77 73 176 325 232 78 214 269 -38 53 149 33 -72 52 129 -280 109 137 -56 129
2496A29m1m4j06Q4J10k92K76l03J19j3L0j30M0J62J11m49K48j2J61k07K5q3M1
$$ 129 88 44 -62 22 132 -160 116 -187 -68 -81 -51 -181 -141 21 132 -317 -69 -81 80 -127 -102 -185 -144
2519a44J20j92k3R5J61k99J32J41p4J17k64J09KK0L05O8m22K00p3J40k13K62j62
$$ -144 -24 -216 -239 -144 17 -282 -150 -9 -83 34 -230 -121 -119 -99 206 274 -148 52 -21 119 -94 168 6
2542FjM3N4Q2l8r6o1J22j2q3L1m5K96m65L05J55k42J96K8k48K56O7ll91J32l3
$$ 6 5 48 102 184 146 50 -11 111 99 16 47 2 298 -167 138 293 51 247 275 27 283 350 347 -44 88 55
2568E5O2p4q2n4j5J85j14K77j32l68j16K96n8m5R6K12m15J14K79j72j21J8K48
$$ 55 117 43 -39 -93 -108 77 -37 240 108 -260 -376 -80 -138 -183 -87 125 -290 -176 103 -69 -190 -172 76
2591G6k71M8J81j17j1j76J27N3k98J51J36n9J7J2j9j04K73j24J39l2j20J42J14
$$ 76 -195 -147 34 -83 -94 -270 -143 -90 -388 -237 -101 -160 -143 -131 -150 -254 19 -105 34 2 -118 24 138
2614A38j92o7K1n1P4L11j12j93J77Rk9m9O7J10k2l67L07L61j62j44m8k4L32l51
$$ 138 -54 -121 -100 -151 -77 234 122 -71 106 115 86 37 104 214 192 -175 132 493 331 187 139 115 447 96
2638I6j67K59l13K94N5j61O5L0n9Q7j37j71j59K34j23K92j18J3q0q2J46j85Q3
$$ 96 -71 188 -125 169 224 63 128 158 99 186 49 -122 -281 -47 -170 122 4 17 -63 -145 1 -184 -101
2661a01J44j93J65N9J56l37j04J79k35L18j75J47j57l89N47j1k94K28r7J97j14
$$ -101 43 -150 15 74 230 -107 -211 -32 -267 51 -124 23 -134 -523 24 13 -281 -53 -150 47 -67
2682f7K1j00K1j08K75j49q1L09k54k1K38r2R1rm5q5K58k9k64m1K41M7j0J82l05
$$ -67 -46 -146 -125 -233 42 -107 -188 121 -133 -154 84 -8 83 74 29 -56 202 173 -91 -132 109 156 146 328 23
2707B3o3K07O9p8j16n9K29P7j11O0j25J82k56r5J52j04J28K48j46j57J00k29J
$$ 23 -40 167 236 158 42 -17 212 289 178 238 113 295 39 -56 96 -8 120 368 222 65 165 -64 -63
2730f3J76j13j35M5J54j15J29Oj95J36k34N5Q9m9P6nJ95p9j63j4j0J82n4j75J55
$$ -63 113 0 -135 -90 64 -51 78 84 -111 25 -209 -154 -65 -114 -38 -43 152 73 -90 -104 -114 68 14 -161 -6
2755fj76J6q4K46m7L77l77K6J76m0r8m6P0Oj0j00K70k24m9N9m4M1L03k12j55L16
$$ -6 -182 -166 -250 -4 -51 326 -51 -25 151 111 13 -33 37 43 33 -67 203 -21 -70 -11 -55 -14 289 77 -78 238
2781B38m04L06R3Rj40J40j29L34q7l04n7J61J28L4m36M8J18J00j47J19K07k98
$$ 238 -166 140 233 242 102 242 113 447 360 56 -1 160 288 322 -114 -66 52 152 5 124 331 33
2803C3n1J27j24J26j37J33j44qJ67r0j18Q8q8q9J66k13K29j33M9L9k09J21J3M2
$$ 33 -18 109 -15 111 -26 107 -37 -45 122 32 -86 2 -86 -175 -9 -222 7 -126 -77 -38 -247 -126 -113 -71
2827g1k68L95k45Q5l0K35k87J52J02j52j8Q0K13l11K24j23M1j26N7j05L05q3o2
$$ -71 -339 56 -189 -104 -134 101 -186 -34 68 -84 -102 -22 191 -120 104 -19 22 -104 -47 -152 153 70 8
2850HK02j29o3N0P2J31j44L9lr5N3j24k2L0j27L06l52K10J26q7j30J70N7j48k0
$$ 8 210 81 18 68 140 271 127 166 163 68 121 -3 -25 5 -122 184 -168 42 168 81 -49 121 178 30 10
2875A0R5J06o6q0MR4j70J00l00n4nJ87j07l8J33J4J42k71qn7L3L9L68j78j02J32
$$ 10 105 211 145 65 69 163 -7 93 -207 -261 -266 -79 -186 -224 -91 -77 65 -206 -214 -271 -238 -199 169 -9 -111 21
2901B1p0l9j92J47M2N1J04l86J94rO3J45j01Q9o9R3n9K04k10N4k19L61j22l9J16
$$ 21 -49 -88 -280 -133 -91 -40 64 -322 -128 -137 -74 71 -30 59 -10 83 24 228 18 72 -147 214 92 53 169
2926A69j86n0LQ0J01J75k36J43OJ06j17q1n5k0m4j36M03j13o3J55k42o0O8J17
$$ 169 -17 -67 -64 16 117 292 56 199 205 311 194 113 58 38 -6 -142 261 148 85 240 -2 -62 6 123
2950A23k87J8J31J37%j27n7j36K98j51P2oj33k5j53L66k23J10J3J4k60K46J35
$$ 123 -164 -146 -15 122 122 -5 -62 -198 100 -51 21 15 -118 -143 -296 70 -153 -43 -30 -16 -276 -30 105
2973A05k39j00J12J02j62Q2N2K20l15R1k9J28o4K07j9k46J08J27r6j87J01p6L46
$$ 105 -134 -234 -122 -20 -182 -100 -48 172 -143 -52 -81 47 -17 190 171 -75 33 160 64 -123 -22 -98 248
2996B48l05R7N4j04m0p9K20j15n8Q8m3J07K25j56j76L16k68L8J42k34oJ31N2l4
$$ 248 -57 40 94 -10 -50 -129 91 -24 -82 6 -37 70 295 139 -37 279 11 49 191 -43 -49 82 134 100
3020A00k0R3j39L3j1J43k83j07J60kq2N3j04K37m4j92L29o5k07J53j08N9k32J63
$$ 100 80 173 34 67 56 199 -84 -191 -31 -33 -115 -62 -166 71 27 -165 164 99 -108 45 -63 -4 -236 -73
3044g3j67M05l13j58L37k65J90j14p1J73J83k02j86Q5K72r5J20j59k27J56N8n1
$$ -73 -240 165 -148 -306 31 -234 -44 -158 -229 -56 127 -75 -261 -176 96 1 121 -38 -265 -109 -51 -102
3066a02rJ25n0Q8o4L11j66J7j26m6K0j7R3NK0rj14oK9J23K07p8k34P0R5j25Q8
$$ -102 -111 14 -36 52 -12 299 133 150 24 -22 -2 -19 74 79 99 90 -24 -30 -1 122 329 251 17 87 182 57 145
3093A45j15j56o2J85M9O0L9%p0jk4Jj02K43k1j44J43j8m7N0l44N17m22j2p4N8
$$ 145 30 -126 -188 -3 46 106 145 145 75 74 50 51 -51 192 171 27 170 152 105 155 -189 328 -94 -106 -180 -122
3119a22J51k63K16j08L1K38l21J10k74M18j82M2%O7m5K7m40N35O2J2Q6r7J50k3
$$ -122 29 -234 -18 -126 -95 143 -178 -68 -342 76 -106 -64 -64 3 -42 -15 -455 80 142 154 240 143 293 270
3143B70l71J11l9J46jj01O0J82Jl29J60N6l34K79O8j24J8j50J4k4J85M8L6L0J17
$$ 270 -101 10 -29 117 116 15 75 257 258 -71 89 145 -189 90 158 34 52 -98 -84 -108 77 125 161 191 308
3168C08k84N7r3l5l3k2M46l79J21k92J52q6L25j38K3Q8p8j31J58n2P7k56N6j87
$$ 308 24 81 -12 -47 -80 -102 344 -35 86 -206 -54 -140 185 47 70 158 80 -51 107 55 132 -124 -68 -255
3192b55Q3j0R1L14l37L13k81r0Q6O1j10K8j2k6j9l3j68L23p7k06K23r5K19P1j73
$$ -255 -172 -182 -91 223 -114 199 -82 -172 -86 -25 -135 -107 -119 -145 -164 -197 -365 -42 -119 -325 -102 -197 22 93 -80
3217h0j1K69l02j24J10J24K0J06j16N9lk45J04P7L5K96k98J69P6k40K00k58lL37
$$ -80 -91 178 -124 -248 -138 -14 6 112 -4 55 52 -193 -89 -12 23 319 21 190 266 26 226 -32 -35 302
3241C02m27L6K12j69p8K09j25K74j65M4J62k53J64J01m58J7J29j7J38j74jp1O6
$$ 302 -125 -89 123 -46 -124 85 -40 234 69 113 275 22 186 287 -171 -154 -25 -42 96 -78 -79 -150 -84
3264h4m2j90K40R4r8k52L38j34j9K30m1R0L0k95K31k22l7Q8P1o5p1KJ66l9n7R5
$$ -84 -126 -316 -76 18 -80 -332 6 -128 -147 83 42 132 162 -133 98 -124 -161 -73 -2 -67 -138 -136 30 -9 -66 29
3290B9j3J74j4k08O1j1j09L29l08j67K74m0J45N3k23K4j37L47k58K30P4j61j6
$$ 29 16 190 176 -32 29 18 -91 238 -70 -237 37 -3 142 195 -28 -4 -141 206 -52 178 252 91 75
3313G5J56j67N2n2R2J53j25o2K1j51q3j8K29j8n5K50k44O1j55J03k05J58m4J12
$$ 75 231 64 116 64 156 309 184 122 143 -8 -91 -109 120 102 47 297 53 114 -41 62 -143 15 -29 83
3337H3l85M75n27K69J65m7R6Kj07j16J42j26o5J60K1l5j03K10j39m9p0J27k65
$$ 83 -302 173 -354 -85 80 33 129 131 24 -92 50 -76 -141 19 40 5 -98 112 -27 -76 -146 -19 -284
3360b84L29j88J12m4K18j31O3l4O3j79M00k63j70K23j57j83M4K63j13j26J96J9
$$ -284 45 -143 -31 -75 143 12 75 41 104 -75 325 62 -108 115 -42 -225 -181 82 -31 -157 39 58
3382E8k14J41m1K82o0Rk67k1Q2M1J48Pk4J99m55K34o9j14J40o3m7m2J01oK65j87
$$ 58 -156 -15 -56 226 166 175 -92 -113 -31 10 158 165 141 340 -115 119 50 -64 76 13 -34 -76 25 19 284 97
3408I7k45J54kJ05j85J67j47l2J31k50J50j36J54r1J03M2l0N4j3%j37R7j75J98
$$ 97 -148 6 4 109 -76 91 -56 -88 43 -207 -57 -193 -39 -130 -27 15 -15 39 26 26 -111 -14 -189 9
3432Ik15O7J48j32J0J33k27J78k33J6K07R9j88P6L4J61j18o7J41j37k4K66j11
$$ 9 -206 -139 9 -123 -113 20 -207 -29 -262 -246 -39 60 -128 -52 -18 143 25 -42 99 -38 -62 204 93
3455I3Q5j03J56k32K43k52L0P1m1L18j61j2j67J23j2j37J81J12j71j96J80J3r3
$$ 93 178 75 231 -1 242 -10 20 91 50 368 207 195 28 151 139 2 183 295 124 -72 108 121 28
3478B8J24n7k2J9k58J41P9k09QJ31Q6r9J63l48K78j83Q6nM4o5k20M25j65k01L99
$$ 28 152 95 73 92 -166 -25 54 -155 -147 -16 70 -29 134 -214 64 -119 -33 -38 6 -59 -279 146 -19 -220 179
3503A79j06j67K28k64m5K19J48l75J06M5N3k14j5J96k1P0k0p6L4K18j04k80K49
$$ 179 73 -94 134 -130 -175 44 192 -183 -77 -32 21 -193 -208 -12 -33 37 17 -59 -25 193 89 -191 58
3526E8k6l2K24j83k7J20P6j52j34J61o9K5J6p2k2Q5p2o6JL1J7Q7j4j5r1O9J62
$$ 58 32 0 224 41 14 134 210 58 -76 85 16 41 57 -15 -37 48 -24 -90 -89 -58 -41 46 32 17 -74 -5 157
3553A57k70J77pj34k7K96o4k26O4J01p1N4j56J37j08r9K22k37k6M01k61l8J68
$$ 157 -113 64 57 -77 -104 192 128 -98 -34 67 -4 50 -106 31 -77 -176 46 -191 -217 184 -77 -115 53
3576E3j80j8Q5J15j9K19k5m76J20J09P2m0l9OK5Lk63L47k12L15j7j48O3p4j59
$$ 53 -127 -145 -60 55 36 255 230 -246 -126 -17 55 15 -24 -18 7 10 -253 94 -118 197 180 32 95 21 -138
3601a38L99l77J37M3J8J12k04K59l51J36J62j91J31O0l48M60j98n5J49k2r8j09
$$ -138 261 -116 21 64 82 194 -10 249 -102 34 196 5 136 196 -152 308 110 55 204 182 84 -25
3623b5P6O4j75lR3l8OQ0K52m89L04j70k8J40k06K34j42J16j31R9O2j11n3k49J45
$$ -25 51 115 -60 -63 30 -8 -2 78 330 -159 145 -25 -53 87 -119 115 -27 89 -42 57 119 8 -45 -294 -149
3648a49L3j41K10k6J4J01j27k7K4J21l96J84k5J42J66J04k78j99L31MK6j13l6
$$ -149 -116 -257 -47 -73 -59 42 -85 -112 -88 33 -363 -179 -204 -62 104 208 -70 -269 62 66 92 -21 -57
3671e7p5L46l00j8j9J37N3q5l0K11Q9k64o2m2O8K15M7j59R2l22L24R8l48J13j01
$$ -57 -132 214 -86 -104 -123 14 67 -18 -48 163 252 -12 -74 -116 -48 167 214 55 147 -175 149 247 -101 12 -89
3696h9J28J8n6P0j28J76o6j16QK06J13k19j43J70k06K53k46L82m88K11j2lL01
$$ -89 39 57 1 71 -57 119 53 -63 -55 151 264 45 -98 72 -134 119 -127 255 -233 -22 -34 -37 264
3719B64l03p3L2M3P0j57N2j26K45j46K0j01K55k63J33K18l09J59Jl13M9N4Q7J08
$$ 264 -39 -112 -80 -37 33 -124 -72 -198 47 -99 -79 -180 75 -188 -55 163 -146 13 14 -299 -250 -196 -109 -1
3743aR5J34L4J9l92K60k48N6K38k11J08p2l9K04m1k18k1J05N5j8K34k29p4K5r
$$ -1 94 228 262 281 -111 149 -99 -43 195 -16 92 20 -19 185 144 -74 -95 10 65 47 281 52 -22 3 -6
3768fJ30k36p5Q1J92%o5K31m42L10p8J15N6ml84L09j15J55j21q0K46k50J37k5
$$ -6 124 -112 -187 -106 86 86 21 252 -190 120 42 157 213 209 -175 134 19 174 53 -27 219 -31 106 81
3792H1j3j11j69J89O1j61K1J21j5j32J52Q6j43P4n1O5m21L46j08O4n0J29K00m11
$$ 81 68 -43 -212 -23 38 -123 -102 19 4 -128 24 110 -33 41 -10 55 -366 -20 -128 -64 -114 15 215 -196
3816a96M83k98J0j59J90k14k6L83l28K22r4J19k05K57J3R0j28o6r4K49j92L1J40
$$ -196 287 -11 -1 -160 30 -184 -210 173 -155 67 -27 92 -113 144 157 247 119 53 -41 208 16 47 187
3839A87n9j81L2o6j12K30N9K1j27P9j28J92K7L9j79J68p4j40j5J73M7Ol27Q0P
$$ 187 128 -53 -21 -87 -199 31 90 111 -16 63 -65 127 154 193 14 182 108 -32 -47 126 173 179 -148 -68 -61
3864f1k1J27k45L45j99J71l19J22L10j06k31P1N5j1K10k19n1p9L15k02j62K58
$$ -61 -82 45 -200 145 -54 117 -202 -80 230 124 -107 -36 19 8 218 -1 -52 -131 184 -18 -180 78
3886G8n8m0JJ94j16J15O2m22J83Q4j90J78M5Mm6L7j28K00k15q5K00j59qJ78l05
$$ 78 20 -20 -19 175 59 174 236 -186 -3 81 -109 69 114 118 72 109 -19 181 -34 -119 81 -78 -86 92 -213
3911b13J93R1n5p4J20L7n2j8k4J46k46K89N7o1l50L36k31J19k29K99Kj31R1Q3
$$ -213 -20 71 16 -58 62 99 47 29 5 151 -95 194 251 190 -160 176 -55 64 -165 134 136 5 96 179
3935A79k46j7J61J63l42J08O5j25qM9K9n3R2j66J49M0p2j42k00J47J04j11J22
$$ 179 -67 -84 77 240 -102 6 71 -54 -62 -13 16 -37 55 -111 38 78 6 -136 -336 -189 -85 -196 -74
3958g4R9m8%KP7O6k62J35M5q1M5n0l67M15m4j64J91k0P8j19O6Mm0J46k43O6J45
$$ -74 25 -23 -23 -21 56 122 -140 -5 40 -41 4 -46 -413 2 -42 -206 -15 -35 43 -76 -10 -6 -46 100 -143 -77 68
3985F8o8J62j94O7l44K47O5J34m48L09J08l09l4K84K4m9j61Q5J35j34K91j17k37
$$ 68 0 162 -32 35 -309 -62 3 137 -311 -2 106 -203 -237 47 71 22 -139 -54 81 -53 238 121 -116
4008a16J97N3j14n2M9j41j8K49k73K87j47n3K85l63K95j53j27J43J38k17K13j72
$$ -116 81 134 20 -32 17 -124 -142 107 -166 121 -26 -79 206 -157 138 -15 -142 1 139 -78 135 -37
4030c7L4j38P2m6J64o2j94J15l0K21j33p0J48j74J55p1K3j34J86N6N8l87J60Q3
$$ -37 -3 -141 -69 -115 49 -13 -207 -92 -122 99 -34 -104 44 -130 25 -46 -23 -157 29 85 143 -244 -84 -1
4054ar6J33K35n07K06J14k15J32JK80k62M6j66L26qk92J45n9K8o9N2R2J2j04O6
$$ -1 -97 36 271 -236 -30 84 -131 1 2 282 20 66 -100 226 218 -74 71 12 40 -29 23 115 127 23 89
4079H9l6QN1o0J38j30j00j51J97r2K1K7M3o7J61J14l14Ll6K43j87j43K08k34P0
$$ 89 53 61 112 52 190 60 -40 -191 6 -86 -65 -38 5 -62 99 213 -101 -98 -134 109 -78 -221 -13 -247 -177
4104a77K46r3N1j9j4p5J63l0j21K68m75J92j8K5r5m1L34j23J35Jk33q7O7K57M
$$ -177 69 -24 27 8 -6 -81 82 52 -69 199 -276 -84 -102 -77 -172 -213 121 -2 133 134 -99 -186 -119 138 142
4129A42k2r8k80L70O9l01K8J27p1n9R6JQ9Q8j88J4J23J43k71K86j82l7k48J30
$$ 142 120 22 -258 112 181 -120 -92 35 -36 -95 1 2 91 179 -9 5 128 271 0 286 104 67 -181 -51
4153e1J23p9P3p4J17O5j39Q5j22j63K42k96O7L26k11j59L18l46M14j20j63J07
$$ -51 72 -7 66 -8 109 174 35 120 -2 -165 77 -219 -152 174 -37 -196 122 -224 190 70 -93 14
4175A4k14O8Q4K20k00r4N8j3J3k47N72k31j15l7O6oK63j57j38M1Q7j90QJ43K39
$$ 14 -200 -132 -48 172 -28 -122 -64 -77 -64 -311 261 30 -85 -122 -56 -62 201 44 -94 -53 34 -156 -148 -5 234
$$ [...]
8191A35
##END NTUPLES=NMR FID
##END=
