##TITLE=1H_L1-SePh(A)(2)(+1)
 Pyr-d5, 8 sc, 
 12.2.2019
##JCAMPDX= 6.0         $$ Bruker NMR JCAMP-DX V2.0
##DATA TYPE= NMR FID
##DATA CLASS= NTUPLES
##ORIGIN= UXNMR, Bruker Analytische Messtechnik GmbH
##OWNER= root
$$ XWIN-NMR		Version 3.5
$$ Tue Feb 12 15:51:57 2019 Russian Standard Time (UT+4h)  she@DPX200
##.OBSERVE FREQUENCY= 200.1313
##.OBSERVE NUCLEUS= ^1H
##.DELAY= (6, 6)
##.ACQUISITION MODE= SIMULTANEOUS
##.ACQUISITION SCHEME= undefined
##.AVERAGES= 8
##.DIGITISER RES= 18
##SPECTROMETER/DATA SYSTEM= spect
##.PULSE SEQUENCE= zg30
##.SOLVENT NAME= CDCl3
##.SHIFT REFERENCE= (INTERNAL, CDCl3, 0, 15.7039)
##AUDIT TRAIL= $$ (NUMBER, WHEN, WHO, WHERE, WHAT)
$$ ##TITLE= Audit trail, XWIN-NMR		Version 3.5
$$ ##JCAMPDX= 5.01
$$ ##ORIGIN= Bruker BioSpin GmbH
$$ ##OWNER= she
$$ F:/spectra/data/she/nmr/H-F/1/audita.txt
$$ ##AUDIT TRAIL=  $$ (NUMBER, WHEN, WHO, WHERE, WHAT)
(   1,<2019-02-12 15:50:36.43 +0400>,<she>,<DPX200>,
      <created by zg, POWCHK disabled, PULCHK disabled
       configuration hash MD5:
       00 E9 B6 7A A2 85 ED C7 34 08 36 98 17 FE 4E 26
       data hash MD5: 16K
       25 C5 81 60 A2 15 EF 3A B8 A4 E9 6F A0 84 F2 F4>)
$$ ##END=
$$ 
$$ hash MD5
$$ C7 3D E5 80 1C F8 1E 12 34 5D 0E 6B F8 1B D0 A7
##$RELAX= 
##$RELAX= 
##$RELAX= 
##$RELAX= 
##$RELAX= 
##$RELAX= 
$$ Bruker specific parameters
$$ --------------------------
##$DU= <F:/spectra>
##$EXPNO= 1
##$NAME= <H-F>
##$PROCNO= 1
##$TYPE= <nmr>
##$USER= <she>
##$AMP= (0..31)
100 100 100 100 100 100 100 100 100 100 100 100 100 100 100 100 100 100 
100 100 100 100 100 100 100 100 100 100 100 100 100 100 
##$AQSEQ= 0
##$AQ_mod= 1
##$AUNM= <au_zg>
##$AUTOPOS= <>
##$BF1= 200.13
##$BF2= 200.13
##$BF3= 200.13
##$BF4= 200.13
##$BF5= 200.13
##$BF6= 200.13
##$BF7= 200.13
##$BF8= 200.13
##$BYTORDA= 1
##$CFDGTYP= 0
##$CFRGTYP= 5
##$CHEMSTR= <none>
##$CNST= (0..31)
1 1 145 1 1 1 1 1 1 1 1 1 1 1 1 1 1 1 1 1 1 1 1 1 1 1 1 1 1 1 1 1 
##$CPDPRG= <>
##$CPDPRG1= <>
##$CPDPRG2= <>
##$CPDPRG3= <>
##$CPDPRG4= <mlev>
##$CPDPRG5= <mlev>
##$CPDPRG6= <mlev>
##$CPDPRG7= <mlev>
##$CPDPRG8= <mlev>
##$CPDPRGB= <>
##$CPDPRGT= <>
##$D= (0..31)
0 1.2 0 0 0 0 0 0 0 0 0 0.03 0 0 0 0 0 0 0 0 0 0 0 0 0 0 0 0 0 0 0 0 
##$DATE= 1549972235
##$DBL= (0..7)
120 120 120 120 120 120 120 120 
##$DBP= (0..7)
150 150 150 150 150 150 150 150 
##$DBP07= 0
##$DBPNAM0= <>
##$DBPNAM1= <>
##$DBPNAM2= <>
##$DBPNAM3= <>
##$DBPNAM4= <>
##$DBPNAM5= <>
##$DBPNAM6= <>
##$DBPNAM7= <>
##$DBPOAL= (0..7)
0.5 0.5 0.5 0.5 0.5 0.5 0.5 0.5 
##$DBPOFFS= (0..7)
0 0 0 0 0 0 0 0 
##$DE= 6
##$DECBNUC= <off>
##$DECIM= 32
##$DECNUC= <off>
##$DECSTAT= 4
##$DIGMOD= 1
##$DIGTYP= 9
##$DL= (0..7)
0 120 120 120 120 120 120 120 
##$DP= (0..7)
150 150 150 150 150 150 150 150 
##$DP07= 0
##$DPNAME0= <>
##$DPNAME1= <>
##$DPNAME2= <>
##$DPNAME3= <>
##$DPNAME4= <>
##$DPNAME5= <>
##$DPNAME6= <>
##$DPNAME7= <>
##$DPOAL= (0..7)
0.5 0.5 0.5 0.5 0.5 0.5 0.5 0.5 
##$DPOFFS= (0..7)
0 0 0 0 0 0 0 0 
##$DQDMODE= 0
##$DR= 18
##$DS= 0
##$DSLIST= <SSSSSSSSSSSSSSS>
$$ [...]
##$SUBNAM2= <"">
##$SUBNAM3= <"">
##$SUBNAM4= <"">
##$SUBNAM5= <"">
##$SUBNAM6= <"">
##$SUBNAM7= <"">
##$SUBNAM8= <"">
##$SUBNAM9= <"">
##$SW= 20.0189088683792
##$SWIBOX= (0..15)
0 0 2 0 0 0 0 0 0 0 0 0 0 0 0 0 
##$SW_h= 4006.41025641026
##$TD= 16384
##$TD0= 1
##$TE= 0
##$TE2= 300
##$TE3= 300
##$TEG= 300
##$TL= (0..7)
0 120 120 120 120 120 120 120 
##$TP= (0..7)
150 150 150 150 150 150 150 150 
##$TP07= 0
##$TPNAME0= <>
##$TPNAME1= <>
##$TPNAME2= <>
##$TPNAME3= <>
##$TPNAME4= <>
##$TPNAME5= <>
##$TPNAME6= <>
##$TPNAME7= <>
##$TPOAL= (0..7)
0.5 0.5 0.5 0.5 0.5 0.5 0.5 0.5 
##$TPOFFS= (0..7)
0 0 0 0 0 0 0 0 
##$TUNHIN= 0
##$TUNHOUT= 0
##$TUNXOUT= 0
##$USERA1= <user>
##$USERA2= <user>
##$USERA3= <user>
##$USERA4= <user>
##$USERA5= <user>
##$V9= 5
##$VALIST= <valist>
##$VCLIST= <CCCCCCCCCCCCCCC>
##$VD= 0
##$VDLIST= <DDDDDDDDDDDDDDD>
##$VPLIST= <PPPPPPPPPPPPPPP>
##$VTLIST= <TTTTTTTTTTTTTTT>
##$WBST= 1024
##$WBSW= 4
##$XGAIN= (0..3)
0 0 0 0 
##$XL= 0
##$YL= 0
##$YMAX_a= 105047
##$YMIN_a= -155319
##$ZGOPTNS= <>
##$ZL1= 120
##$ZL2= 120
##$ZL3= 120
##$ZL4= 120
##$ABSF1= 10
##$ABSF2= 0
##$ABSG= 5
##$ABSL= 3
##$ALPHA= 0
##$AQORDER= 0
##$ASSFAC= 0
##$ASSFACI= 0
##$ASSFACX= 0
##$ASSWID= 0
##$AUNMP= <proc_1d>
##$AZFE= 0.1
##$AZFW= 0.1
##$BCFW= 1
##$BC_mod= 2
##$BYTORDP= 1
##$COROFFS= 0
##$CY= 11.3945322036743
##$DATMOD= 1
##$DC= 2
##$DFILT= <>
##$DTYPP= 0
##$F1P= 18.9103706918063
##$F2P= -1.10871071338519
##$FCOR= 0.5
##$FTSIZE= 0
##$FT_mod= 4
##$GAMMA= 1
##$GB= 0.15
##$INTBC= 1
##$INTSCL= 1
##$ISEN= 128
##$LB= 0.24
##$LEV0= 0
##$LPBIN= 0
##$MAXI= 10000
##$MC2= 0
##$MEAN= 0
##$ME_mod= 0
##$MI= 1.114404
##$NCOEF= 0
##$NC_proc= 0
##$NLEV= 6
##$NOISF1= 3.799351
##$NOISF2= 2.8
##$NSP= 1
##$NTH_PI= 0
##$NZP= 0
##$OFFSET= 15.70392
##$PC= 1
##$PHC0= -9049.741
##$PHC1= 9.800139
##$PH_mod= 1
##$PKNL= yes
##$PPARMOD= 0
##$PSCAL= 0
##$PSIGN= 0
##$REVERSE= no
##$SF= 200.130013532006
##$SI= 16384
##$SIGF1= 3
##$SIGF2= 2
##$SINO= 400
##$SIOLD= 16384
##$SREGLST= <1H.CDCl3>
##$SSB= 0
##$STSI= 0
##$STSR= 0
##$SW_p= 3612.71676300578
##$SYMM= 0
##$S_DEV= 0
##$TDeff= 0
##$TDoff= 0
##$TI= <>
##$TILT= no
##$TM1= 0
##$TM2= 0
##$TOPLEV= 0
##$USERP1= <user>
##$USERP2= <user>
##$USERP3= <user>
##$USERP4= <user>
##$USERP5= <user>
##$WDW= 1
##$XDIM= 8192
##$YMAX_p= 0
##$YMIN_p= 0
$$ End of Bruker specific parameters
$$ ---------------------------------
##NTUPLES= NMR FID
##VAR_NAME=  TIME,          FID/REAL,        FID/IMAG
##SYMBOL=    X,             R,               I
##VAR_TYPE=  INDEPENDENT,   DEPENDENT,       DEPENDENT
##VAR_FORM=  AFFN,          ASDF,            ASDF
##VAR_DIM=   8192,          8192,            8192
##UNITS=     SECONDS,       ARBITRARY UNITS, ARBITRARY UNITS
##FACTOR=    0.0002496,     1,               1
##FIRST=     0,             0,               0
##LAST=      2.0444736,     0,               0
##MIN=       0,             -155319,         0
##MAX=       2.0444736,     105047,          0
$$ Real data points
##PAGE= N=1
##DATA TABLE= (X++(R..R)), XYDATA
$$ [...]
1955c41o9o29j53N04j12o79m1O99K69j46P27Q6l80L66R59J97k98k00l12m31O76
1976F92J055o73j339m65J26K27J57M24j136n63P27R86o15m88O96j08m12P26P79
1995G96m82l21R60O19r56l67M7k56L5O47k00j542l29J235K84l68n62k82o81Q56
2015h67J463m04o09Q9M73K81M46K96q59n93P43N53q04l00L14jk61j34L19n67o38
2036a060Q05P32r52k51K9O4J5J313L27r73k33N49L33J33K24r31j242N02J222O0
2056F66n49m88j34k72Q22M89m56q59K56Q70L2M37k95n45O6J75J51j341q47R28
2076h94J097K4k34j47r7P09J225J0j200l39Q26p17q4j2k19j164q23J199M68j5
2096c87p45K13J39R25P93j68n00M56N95o0k91m66m63p12P07k72j091mO43L46K77
$$ y = [-341, -410, -1039, -1192, -688, -800, -1479, -1520, -821, -552, -698, 29, 115, -265, 101, 1060, 1257, 959, 759, 447, 16, 692, 1747, 1074, -265, -730, -604, -377, -220, 204, -932, -1495, -768, 218, -397, -885, -189, -297, -709, 17, 796, 314, -7, 953, 1572, 616, 249, 296, 40, 75, 722, 522, -1020, -1349, -114, 170, -198, -760, -1042, -1723, -867, 596, 192, -417, -328, 145, 426, 872, 1168, 309, -284, 459, 1012, 208, -92, 222, 221, -40, -174, 145, -422, -1060, -255, 477, -475, -726, -697, -633, -618, 695, 1022, 49, -184, 365, 698, 831, 1055, 124, -1118, -616, 606, 666, 117, -371, -505, -777, 45, 534, 78, -781, -525, 345, 377, 814, 519, -26, 40, 215, 366, -975, -1822, -894, 203, 227, -7, -154, -251, 458, 1683, 1693, 493, 154, 980, 263, 179, 167, -52, -1216, -2039, -840, -372, -387, -1132, -919, -780, 145, 938, 770, 270, 726, 1321, 1261, 970, 504, 41, -671, 36, -236, -1327, -1331, -688, -342, -65]
2117f5O41l35m42l10N89R07m32j047q04L61P57R43p27j128P09R40K99k33K48K22
2137A093m83K95P07n52j249p3o00n55k93J20o15N0P26J240N65NR4R03Q69M28o60
2158B015j195j60O10l30j377n14j78n19j70Q43j07j99j0L19N76R74O00k80n20
2177C78M17O08J31j090n91o3J04L97L1n92j35R65K86l44l66l79j96n56L60Q4n52
2198a103o83N87O71M38K79j94l67O60J669N09q14n36L81j04j53o17o56j724j27
2217a884L32K3l98J92oR2J143J135R1q4N39P16J27k33m24q13l60O32J46r24j073
2238a031J45M45k1k50n87k26K50Q32L92k6j1j37K58P1O67m82p52J76J214M27n5
2259A299k68k88J52N8j66q11j031l41J85PK15l09l17K51Q17Q92k14q4M52M97P26
$$ y = [-65, 576, 241, -201, -511, 78, 985, 553, -494, -1298, -937, -180, 763, 36, -1092, -383, 557, 856, 623, 871, 1093, 610, 905, 1612, 1060, -189, -262, -862, -1417, -1710, -1590, -2205, -2155, -1429, -189, 376, 381, 475, 1378, 2247, 2675, 2015, 820, 660, 1270, 940, -437, -951, -1129, -1648, -1818, -975, -1082, -1281, -1291, -972, -396, 578, 1178, 898, 378, 795, 1403, 1534, 444, -147, -210, -106, 291, 322, -270, -405, 560, 846, 502, 136, -243, -439, -995, -635, -551, -1103, -1786, -1199, -528, -90, 189, -5, -372, 288, 1957, 2466, 1652, 1116, 1497, 1393, 1240, 623, -33, -1757, -1884, -1552, -1529, -1927, -1735, -1741, -1649, -506, 629, 720, 636, 1175, 1891, 2018, 1785, 1361, 548, 188, 820, 966, 42, -1031, -886, -441, -462, -712, -1299, -1525, -1275, -443, -51, -77, -88, -225, 33, 104, 771, 289, -463, -287, 927, 1354, 1299, 1031, 743, 895, 953, 787, -24, -1055, -1396, -1211, -1204, -989, -1298, -1615, -1364, -547, 345, 131, 47, 499, 996, 1722]
2280A722O20m84q16m26L36M22n95j109o30m10K89L6k60l17r8Q84P19M63L03n87
2300F2J42N44L43k96o86K07O08Q0L48o24p69l07J67K99m76r50K08J67L78M85k95
2321c65n10l31M18M86L65J93J93j95P39P37k61o87k81L95J90n31n69q39J87j79
2341h45L86q50k26J67L13P28N17J02n17j94M42J096R7l59J13k36J03L78j23p52
2361C40r81J75Q4J06m40k60L95K72J88m20n1j10J5P79K23J69j78j0Q16K63J52
2382A527q96n91p9K33P32m62j027l45O04Ll24k39K11p0k12P55L95l85%K77J71
2403B78L40N25m61l45K91M91j73q58o87O3Q12K34k57q60k27L54O24l03p24j09
2423i92J08K13Q65L66J42j76j74J13M13j44k72o01K42J52O94q88m52K08j43k16
$$ y = [1722, 2342, 1858, 1042, 616, 952, 1374, 779, -330, -960, -1370, -1081, -1045, -1305, -1622, -1720, -836, -117, 346, 649, 62, 204, 748, 1091, 795, 109, 316, 924, 1004, 1352, 728, -41, -348, -181, 118, -358, -1308, -1100, -933, -555, -70, -365, -875, -1206, -788, -302, 63, 256, 449, 254, 993, 1730, 1469, 782, 501, 896, 1086, 555, -14, -853, -666, -845, -459, -1309, -1535, -1368, -1055, -327, 190, 292, -225, -419, 23, 1119, 1216, 857, 970, 734, 837, 1215, 1092, 340, -641, -466, -382, -276, -716, -976, -581, -309, -121, -541, -592, -702, -687, 92, 315, 484, 306, 296, 1112, 1375, 1527, 631, 40, -39, 194, 926, 464, -563, -908, -304, -301, -625, -864, -653, -723, -935, -180, 215, -170, -170, 107, 278, 618, 1143, 682, 337, 628, 1119, 946, 88, -599, -536, 276, 510, 253, -607, -834, -480, 144, -159, -883, -992, -884, -671, 194, 560, 702, 526, 352, 465, 878, 734, 462, -139, 103, 255, 949, 61, -391, -183, -326, -542]
2443e42j10r03K78Q10O40J61o85M4O46K52M23j32j37o94Q7L56o3k2n13n83J52
2464e35O71L44m02k96k12R1K1K10l40n1K7N86Q8m24Q3k8K48J18j87K47r5N76O02
2487A342O2m33n27n09k89J66k99o61n04L12J95M93K86K45j03Q5L29N25K56R1L1
2508A093p8J23k43o39m21k06k1k60k67K1K17J66M07Jr0Q2N10K05L33n69j04n28
2530b68q8OL66K06j65K27Q7K52K76j24l49j90R5k30l50Qk61L5l55j78k57P2J08
2553a077N90K99N49M25O67J76J23j08l04q89k88j64j90m24l49l39l93J19O99J0
2573h68N33J87K32O87k51M97l2k17j33j62m0j43j2j90l91q6j01m9N9M34l3L17
2595B38n7K07j85j56m91k41j01l21N84q0O12M53K62J65m0o6j07K97Rl93n21N4
$$ y = [-542, -652, -1555, -1277, -467, 173, 334, -351, -307, 339, 591, 1014, 882, 745, 51, 138, 494, 431, 409, -104, -687, -535, 136, 480, 78, -218, -430, -339, -318, -108, -448, -499, -472, 114, 202, -222, -139, -167, 81, 199, 12, 259, 164, 740, 1342, 1404, 971, 444, -65, -354, -188, -487, -1148, -1652, -1340, -1145, -652, -366, -121, -224, -139, 190, 715, 971, 1062, 1093, 1015, 1138, 895, 256, -165, -371, -392, -652, -919, -898, -681, -515, -108, -107, -197, -115, 395, 600, 933, 364, 260, -268, -356, -350, 16, 222, 57, 284, 371, 623, 899, 775, 426, 236, 331, 101, -249, -241, -502, -467, -822, -1000, -1257, -1185, -1077, -487, -188, 361, 786, 1453, 1629, 1752, 1644, 1340, 451, 163, -1, -191, -615, -964, -1303, -1696, -1577, -878, -868, -335, -148, 84, 771, 520, 1017, 985, 768, 635, 473, 433, 290, 278, 88, -303, -389, -490, -539, -480, -46, -79, 238, 181, 388, 203, 47, -444, -685, -786, -1107, -523, -603, 9, 462, 724, 889, 849, 783, 676, 973, 982, 589, 68, 122]
2617A22o9l49o73J04l48o09M59L43L03L54J25Q46L11K94L5j81J10Q8k40p25k26
2638G4l29rl15j53l46K91K65Q4K17k94R2J77N%M99J24J63j06N5K12J39l41l98
2661A06q4K04J53J2k69L6q9k85m94K0n6k81O0M00K92QJO34L67J8j04J28L6l7J75
2686I51k23q9o53j27K03k84m99k59M32k3j50J19r9j37L09P6R02L07k74N8K68J51
2708I59m8j50m99m6k4K31j87m58p1l48k2J03m84j95J08K32N84K59J75J30L98K93
2730I40j32r1k5k11L7J53J22o88n08k12mj7j51J52m98M25M67M76l64L6j21O51
2752D37J39k37K40l39K0j2L01j42l58Q9O7Q7R3j3l80l65k38K64l20k10R7O6J54
2775e60K94L12Q3j18J87M28J69l0J25m0Q5J47n55o44m62k12q1O4m21n2J07L94
$$ y = [122, 53, -296, -969, -865, -1213, -1822, -1363, -1020, -717, -363, -238, 608, 919, 1213, 1248, 1067, 1177, 1265, 1025, 300, 74, -255, -264, -579, -732, -1078, -787, -522, -438, -221, -515, -423, -246, -241, -241, 258, 382, 545, 439, 494, 706, 845, 504, 106, 22, 226, 379, 391, 122, 158, 69, -216, -710, -690, -746, -1027, -967, -567, -275, -267, -266, 368, 735, 753, 649, 777, 813, 776, 951, 728, 639, -14, -141, 62, -222, -721, -980, -548, -571, -721, -602, -701, -838, -529, -453, 449, 756, 482, 540, 808, 959, 911, 761, 262, 216, 192, 423, 236, -222, -293, -641, -663, -560, -1044, -1239, -1131, -899, -315, -56, 119, 249, 647, 940, 808, 717, 692, 481, 518, 671, 793, 105, -403, -615, -619, -636, -787, -635, -1133, -708, -241, 235, -129, -93, -214, 437, 576, 339, 579, 240, 260, 248, 549, 407, 49, 138, 205, 292, 385, 372, -8, -373, -611, -347, -667, -877, -780, -714, -560, -266, 46, 129, 11, 198, 626, 795, 765, 890, 850, 935, 1082, 527, -117, -579, -791, -872, -808, -1229, -1281, -1174, -780]
2797g80Q36q8rkJ86L79O21l70j88j72J29J06j32m31l60l95L09R9l08J3j33R5K61
2820c34J44K46k48Q0L14K10J72l33l32N1K20M22j67p4l22K95L01j9m21o65j40
2841f00J1L52J77n07r0j91M42K89j20j67O5K64J86O03K44l43jL18l73j12l39n77
2863d69K60p2J98o90j27j0K27N51KQn67O51K06O22k16k99k17L90L95k08J0m74
2885A71j22j91j56K78l35k47p3K90K7M52n02K13L87R0K71n25J06J5M46J09q2m98
2907A24r5O6j14L98n61j26j53O46K05l41n4l80q5M38M1J24m34j77L40J77m6P7
2929G0LP8L30J73j0k14k14l0K04j00n83p1k18K56J47j82R6n90K39N66K29J56l47
2952a2M18K57J72K03m57l51l30r6Q3P6l60l11J35J26J93l5j19J20K27K75j28k2
$$ y = [-780, 56, -32, -41, -43, 143, 522, 1143, 773, 585, 413, 542, 648, 516, 85, -275, -670, -361, -262, -570, -557, -690, -595, -334, -190, 56, -192, -112, 202, 412, 584, 251, -81, -30, 190, 612, 445, 371, 49, 344, 645, 626, 205, -460, -600, -589, -237, -60, -567, -657, -848, -406, -117, -237, -404, -339, -75, 111, 714, 958, 615, 614, 932, 559, 447, 108, -469, -209, -281, -83, -773, -900, -910, -683, -132, -130, -122, -689, -38, 168, 790, 574, 275, 58, 448, 843, 635, 645, 171, 49, -142, -298, -20, -355, -602, -675, -385, -358, 94, -408, -195, 192, 282, 553, 28, 134, 149, 595, 704, 622, 124, 29, 95, -19, 379, -182, -308, -461, 185, 390, 49, -5, -385, -470, -32, 9, 133, -301, -478, -138, 39, -7, 70, 73, 151, 481, 654, 644, 430, 216, 186, 390, 290, -293, -364, -582, -326, -179, -361, -265, -855, -616, -50, 179, 335, -12, 406, 663, 835, 1038, 581, 230, -100, -196, -113, -37, -397, -708, -573, -447, -254, -289, -408, -288, -61, 214, 86, 64]
2974F4q4K63L99l11j97m96l7Q2K55J67k76k2JL07m9J34k42P0n7p6J32o3l53k85
2998f74Q7J65q6L67J4M15q8L94j2k16j44N7K52j66l80k69l0J64k84r1l15j12J58
3021g94K26O40m2J86j75J38O58q4k97m86K89j16k08j38J0k05j32K32K29m28J29
3042c68J24M75n7n6k6J39o6N3k9L78l63l56J54J96N4k61k78k1K77QM78l49k55
3065a49k74l6L19J95m52j73M30M8J72k65P9J60J95j69M07n4J32l12L46k03k53
3086A43l55j91K59j66k34p6K0K00K03L57K0ql17L56N19r4l57K05j28R9J03m15
3108A43k68J89k63J44j09k47j76k4M16o2k55K12Q6K63L47J9kO9j16J43J7Q1k65
3131C42l48QL7r7l05j33Q3m36M12n4M13L2L2K26J8j1ml4L16j5r0P1k30J27j68
$$ y = [64, -20, 243, 642, 331, 134, -362, -399, -317, -62, 105, -171, -193, -192, 115, 66, 200, -42, 28, -29, -105, 27, -36, -389, -674, -587, -422, -508, -141, -127, 288, 200, 594, 582, 366, 222, 279, 531, 365, -15, -284, -314, -150, -434, -525, -840, -952, -794, -568, 72, 30, 216, 41, 179, 837, 753, 456, -30, 259, 143, -65, -203, -193, -398, -530, -298, -69, -497, -368, -244, 231, 174, 118, 92, 231, 165, 218, 189, 567, 204, -152, 2, 198, 252, -9, -287, -308, -31, -23, 455, 106, -149, -423, -459, -140, 55, -397, -570, -140, -92, 80, -185, -106, 54, 249, 80, 487, 433, 565, 253, 599, 396, 143, -212, -403, -144, -310, -544, -620, -600, -400, -197, 160, 180, 172, -145, 211, 730, 636, 279, 484, 356, 455, 558, 143, -125, 64, -199, -55, -164, -411, -587, -611, -195, -257, -512, -300, -214, 49, 396, 415, 413, 482, 366, 509, 526, 607, 342, -6, 2, 39, -58, -363, -496, -413, -849, -437, -491, -78, -46, -14, 212, 230, 219, 215, 181, 497, 482, 392, 463, 233, 360, 192]
3156A92j94J25k64k8l68L82L70k99j65m59M12k7L59l81K2O3J33N11n2L4J19J6
3178E01j1K9j60M1l40J64m10k28k05K9k56j15L32N7N9L01L5L14M38J01p8QN6L61
3202A023j05m71k02k58L0j62k43l90j60J8K43K17J94J36j53K06J93j6M93l92J53
3223C54J49k49r2J76n7K42l11J04k71rj06J90k72j70k32j86j4K61L14k39R3L64
3245C9j94M10J11L47l3n3L6j03P8l22k66K7l16j15m23J49k41L35M2n7L14j92L30
3268i7L32K88j03K71j64K92q6k02O8j62n42K47n9P9k93j93q7o6K23l18MLK03n1
3292d13J48K39O4K59j8L84j36NJ93Q4r6k7n22l64n5j48Mm84R4L3KL72J11O4J26
3317h1K64m4L90o5M74j62l53j89J78j77M4m88K91q3m76K50J38j17N2J17j45J03
$$ y = [192, -2, 123, -141, -169, -537, -155, 215, -84, -249, -708, -296, -323, 36, -345, -323, -260, -127, 384, 332, 366, 485, 501, 490, 519, 359, 400, 60, 224, -186, -414, -619, -590, -846, -961, -629, -572, -513, -212, -177, 137, 575, 676, 598, 606, 662, 1023, 918, 447, 245, -13, 17, -145, -388, -778, -938, -920, -677, -460, -266, -130, -283, -77, 116, 100, 593, 201, 354, 503, 254, 162, 338, 281, 523, 212, 316, 45, 36, -70, 120, -152, -322, -554, -740, -754, -493, -179, -418, -325, 39, -155, 255, 366, 713, 680, 627, 663, 560, 638, 316, 50, 77, -239, -354, -777, -628, -869, -534, -492, -549, -235, -427, -97, 235, 523, 420, 691, 527, 819, 733, 531, 599, 437, -105, 142, 83, 162, -131, -324, -411, -477, -254, -572, -568, -565, -362, -413, -265, -26, 38, 297, 279, 663, 527, 532, 725, 809, 713, 686, 164, -200, -255, -403, -399, -883, -789, -756, -754, -382, -271, -207, -81, 183, 139, 529, 464, 938, 776, 423, 234, 412, 235, 279, -209, 82, -1, -477, -227, -89, -206, -154, -37, -182, -79]
3339g9k67K66k41j44L65k46K07J18K88Q0r5L08L28l41j44J74j44l85M9l67j79
3360d49k91j96j49K50nj3N52L86L75k2L45K97k13k8K15l26k86j41m65k54rk77
3382g04k8k24k4L38P5L1P31j01K30p9R6l73M69m56K41l92P6j42L28n1N4k7J54
3405B22p6K03l1k80k7p3l26k12k4j42j03K89O2O8L09L07J92L36OJ33K51j83j49
3428G52J05m71nn98Jn87qrk29K00N8J19K91J33M66l1K97K44j83K97k60L7l58n1
3452B10J80m29m35J15J29m2K4j08j13%L26o5p7RJ34J28J98J0q5K05k88L21j03
3475B44m1n3K32O0n4j83q6j13j14j91q5O2l47O5j63K15K6L75m0K16J74R8L33k49
3499C81k2L60J53j10k89k03j24M7n48j35j49j01j53R4J57O4Q8RN18J94Q4L56k5
$$ y = [-79, -346, -80, -321, -465, -100, -346, -139, -21, 267, 347, 252, 560, 888, 547, 403, 577, 433, 48, 97, -270, -449, -740, -936, -1085, -835, -840, -853, -301, 85, 460, 438, 783, 1080, 867, 839, 1054, 728, 442, 301, -164, -418, -427, -704, -732, -956, -980, -642, -567, -536, 195, 94, 324, 245, 341, -32, 437, -19, 222, -170, -94, -236, 92, 41, 95, 68, 222, 146, 349, 318, 38, 11, -62, -388, -600, -624, -766, -869, -580, -518, -450, -141, 166, 358, 694, 700, 833, 1084, 901, 752, 857, 386, 381, -217, -216, -803, -811, -820, -1049, -849, -791, -672, -381, -248, 218, 187, 484, 728, 545, 842, 582, 619, 261, 210, 390, -39, -474, -359, -230, -272, -248, -356, -469, -469, -143, -208, -285, -276, -142, -14, 184, 194, 109, 314, 26, 347, 244, 203, 150, 382, 442, 388, 205, 119, 6, -108, -299, -384, -322, -669, -604, -767, -552, -526, -151, -191, 25, 199, 297, 630, 381, 359, 719, 872, 762, 473, 270, 146, 193, -355, -490, -639, -740, -893, -799, -642, -578, -490, -481, 37, 231, 315, 671, 646]
3522F46r7L60k01r5j71k90n1k31Q5j35o5M2k89l8R3K1R9j92N22l0j79L77p7K1
3546A25j36J48J96j69J27K3K83n5k43J84l23j60L9j04l13j87J29l51O9K13j48
3567f53J47L99O9J87K7M54J67o6J23j61P5k59l07J9j46l81k90k86L34k0Ol99K68
3590f93M26N2M90m2J23J8M7J56j54J1o5on1J0r5l23j55k9K04J5j60k40nJ85j60
3615d41K63j91mJ91L09J31j30J91Q0j9L51K3m46R6q7M2n73J35k18m24m1K13m1
3638e90Q9N8j19K74M10K03J51l49L32L88j26j01j86L4j13k92J15j21r1m7k42k3
3660c46k2j49p4k6Q4L25l59K36K14J12K94M19l73J84J52J93j12q2k52j85l96J92
3682B9j87l14l78J91q2j21K00M6N0K44Q67p7J29j63J95Qj09k2r5j81k14K24M7
$$ y = [646, 549, 909, 708, 613, 442, 152, 101, -130, -45, -180, -245, -203, -492, -530, -437, -416, -317, -509, 13, -17, -196, 181, 104, 125, -11, 137, 333, 164, 291, 314, 597, 542, 299, 483, 160, 0, 39, -65, -378, -565, -436, -787, -718, -505, -653, -506, -107, -38, 149, 176, 630, 797, 731, 854, 693, 768, 509, 202, 221, 75, -306, -596, -882, -548, -568, -562, -961, -693, -267, -215, 275, 233, 356, 374, 421, 577, 423, 434, 369, 363, 312, 322, 227, -96, -251, -280, -76, -61, -221, -461, -466, -281, -441, -178, -369, -373, -182, 127, 258, 128, 319, 399, 380, 731, 754, 308, 404, 317, 359, -214, -79, -297, -721, -762, -549, -590, -501, -443, -562, -288, 122, 325, 476, 127, 459, 847, 721, 620, 434, 468, 355, 63, 178, 57, -34, -81, -323, -346, -368, -517, -591, -617, -533, -208, -567, -331, -117, -5, 289, 708, 335, 519, 671, 864, 752, 670, 418, 233, -163, 29, -158, -472, -850, -659, -741, -862, -662, -616, -566, -322, 545, 468, 597, 434, 629, 637, 528, 506, 411, 230, 16, 240, 287]
3705B87l32m29O8J60J73l16J52Mo1K17j82j0J90n8k26M21J66J43j7j8J82K5Q2
3728F21r2j12m40L3M3m66m56L27j25l7J20n7J99J19J86L77K74j8J91O2J02j56
3750F95J38n67j25j80k76J81k38m16J51J31J63k6O1J25J12K09RJ2N0P4l0K6m8
3773B31l6Pr9K09j9n4j37p5K18n2k03l81K34k37J5R5j1j38j22P95j32J67L40q1
3797E34Mj4J86p2k86R0m31j51o9m8k97K5k0J77Oo4J91J3L86p6L66m31N8P8k3n0
3823H2L07j94k02p7L96j90j08k21o3L59k3o7k03j19J76k49P2J94o5K51j59N28
3845D25J90k57Q9k0l3J64k60l76N4k33o2o6O8l5k79Q7K99J97J17R7K0K14j22J79
3869D57jk60l2l14O9j02j26J85J32j62J53J12k5j15J6K82k56j18q2J28k54j83
$$ y = [287, -45, -474, -406, -246, -73, -389, -237, -233, -294, -77, -259, -269, -79, -137, -363, 58, 224, 367, 350, 332, 514, 539, 621, 529, 417, -23, 10, 53, -413, -869, -542, -667, -704, -584, -641, -442, -323, -137, 240, 514, 496, 687, 749, 851, 695, 833, 266, 141, -39, -315, -134, -372, -788, -637, -506, -343, -369, -308, -183, -71, 138, 147, 159, 209, 283, 253, 279, 231, 195, 202, 103, 312, 293, 239, 102, 27, 245, 193, -10, -391, -157, -394, -379, -284, -295, -433, -555, 240, 108, 275, 615, 534, 538, 524, 710, 638, 352, 442, 11, -140, -209, -257, -554, -529, -549, -372, -366, -430, -239, -226, 160, 84, 450, 19, 77, 155, 132, 82, 389, 195, -7, -84, 312, 122, 14, -207, -270, 89, 66, -1, -204, -323, -147, -396, -324, -130, -195, 56, -103, 425, 615, 358, 447, 427, 394, 558, 298, -78, -24, -257, -319, -385, -317, -352, -631, -544, -245, -48, 69, 166, 186, 400, 278, 457, 456, 196, 164, -150, -81, -183, -309, -124, 8, -154, -1, 111, 86, -29, -13, 269, 13, -105, -187, -59, -313, -496]
3891d96N34m25J71K33L9J79j89K96J50j08k01K74l67m5J58m81N0j56oj31L15L3
3913a73n4O8O4L71J41kp0J75k30m8n5l94k44K00j33O9J24k36J45j2L08L51k35
3936A30p3M1l07K73K9j24J8k38J82q4j72K70k17L83k06L40l7Q7j50r7o0k1Q1j11
3960f3j06p8n9R4q5N9L66r7L51j9j16K1r2J20k65j8L1j28j25o5k3j48m6K62J2
3985b17L20J89K0r6j00L38j55p9R1j98j93J64O3k07l70J45n1J42M2l6J60J30n3
4008D9J16k33l2K20k25j7J28n3N9k99K76K0k8J93k98Q2J27K03k70qj62Q0k01j52
4032d25K47jL30k00J35n3j26K09K16k3j84K69j17m13L17m24J12r6J35k7M3p0p7
4055b23K5N5O3J24Kk3k0J92j59M1K93m94J68j9L30m91M5k5o8o7J02n1k03M19j76
$$ y = [-496, 38, -387, -216, 17, 56, 235, 46, 342, 492, 384, 183, 457, 90, 45, 203, -278, -228, -384, -390, -521, -206, -173, -227, -159, -95, 276, 417, 415, 345, 520, 290, 242, 187, -207, -451, -251, -384, -315, -191, -427, -282, -294, 14, 365, 130, 57, 98, -209, 64, 93, -31, -13, -251, -69, -153, -325, -55, -272, 111, -95, 245, 208, 295, 145, 48, -12, -33, 48, -63, -169, -247, -306, -212, -297, -238, 128, 31, 382, 363, 247, 268, 176, 296, 31, 13, 44, -84, -209, -274, -297, -445, -491, -229, -217, 103, 292, 312, 216, 116, 454, 299, 220, 311, 113, -80, 84, 147, -60, -430, -285, -336, -194, -152, -188, -28, 102, 49, 165, -68, -100, 120, -105, -122, 6, -47, 12, -287, -11, 9, -19, 174, -124, -42, 85, 288, 18, 10, -152, -72, -273, -425, -178, -179, 151, -49, 86, 33, -93, 116, 332, 309, 125, 394, 277, -136, 181, -243, -131, -227, -92, -119, -76, -146, -223, -198, -143, -80, 44, 46, 23, 3, 195, 36, 77, 370, -124, 44, 25, 355, -136, -91, -116, -184, -251, -149, -200, -403, 16, -160]
4080a60k13K21J07N2Q0J39J50J0j49K52q5k65k18Q8J6j39K81j61j66M7O9j01k97
4103d42L55m18K15K38O8k62K08K06m9j48l0M60n3k06r5L52l36k9n5n4j04Q4k6
4126a21k96nJ19Q2K00o0J95l07K14K08M15l03J53k90R2j32K06l08ml0j50j11j84
4149d17L20k62J57q6q5J06M15L8p5j15JK45l83L23K2K07j94O8j24o6j37J76R2
4172B26l75L0j83j17L1l9M09l94r2L17K00K75m9j3J05N2J9K41n00J43J43m10l2
4195a3j14K9k73j5L4k46k14L51j6J12J72N47k43j5n7M52j13p7P0j78J28j34RK4
4219B20k44n5pm2p2j88L3j66L52k6m0P5K61j79J03J75j24K15o6L17j62j04R0j40
4243B26k32J67j89l77J01K17j68l19M92l45J83p9J74J47J42m3J33r0J81pn7J26
$$ y = [-160, -373, -152, -45, 7, 87, 226, 376, 386, 237, 489, 404, 139, -79, 9, 25, -114, 167, 6, -160, -113, -44, -145, -442, -87, -505, -290, -52, 16, -246, -38, 168, 119, -29, -59, 401, 348, 142, 47, 399, 63, 34, -21, -75, -179, -95, -121, -417, -422, -303, -221, -21, -81, 114, -193, 21, 229, 644, 341, 494, 204, 296, 164, 370, 62, 58, 28, -122, -233, -417, -97, -359, -202, -288, -373, -267, 148, 186, 111, -4, -3, 242, -141, 182, 204, 411, 217, 285, 161, 95, -42, 134, 226, -149, -119, -302, -419, -388, -427, -18, -412, -504, -187, 13, 288, 239, 226, 331, 383, 402, 643, 143, 286, 429, 19, -13, -127, -98, -371, -386, -352, -598, -812, -461, -477, -365, -193, 354, 111, 96, 39, 491, 378, 301, 371, 193, 321, 187, 196, 220, -24, -79, -86, -128, -200, -388, -355, -521, -169, -195, -235, -160, 101, -78, 25, 200, 76, 291, 225, 542, 380, 276, 366, 226, -6, 161, -28, -405, -304, -87, -255, -574, -82, -427, -244, -323, -149, -2, 140, 97, 230, 140, 321, 314, 257, 383]
4265C83j54L55j05k00j54j39k80N0kj66j57RK98J8j91P6J22J29L55N6j05R0K44
4288E32K75m44J78j33ll41k08j14J5o0j30r7Q2J06J87k91J76K26K42p7Q4J20p8
4311B47j93K02J28r3o5j46j52J06q3q8n3J63j56J03Nn1j96j60J75K67j75m6L64
4334A03k6N1R2K36o7L9R8p4j76j99J88Q5o62n2J54j37j18k25K31J95j38N98m39
4357b43K19K28M8K14P1O5q0j54l5j56l8rm0n69Q2J80M1p9OJ77j95R2K31L5q1Q3
4383I3k76K72R7j80o4K79j25RJ30k28O8K55j57j46M7j88l22J91L1j24j86K90K8
4406b06j19J54L06j95J32P1L17j64J8K55k46j97J89j68k83L2r8J95m21N7j21L30
4428a62j12J62J90%J13J45l19O3L27R1p4l34L93j31j62p0q8r4k2r9k48K03O5q8
$$ y = [383, 229, 584, 479, 279, 125, -14, -294, -244, -246, -412, -569, -560, -262, -244, -435, -359, -237, -108, 247, 303, 198, 288, 532, 807, 363, 541, 408, 405, 64, -144, -258, -243, -303, -433, -530, -448, -342, -155, -446, -270, -44, 198, 121, 205, 325, 247, 54, 256, 384, 291, 226, 80, -72, 34, -49, -137, -190, -27, -183, -80, -75, -126, -322, -482, -307, -40, -215, -261, 103, 77, 128, 220, 456, 389, 428, 526, 452, 276, 77, 265, 350, -312, -364, -210, -347, -465, -690, -459, -264, -402, 196, -243, -24, 204, 252, 466, 537, 602, 522, 368, 333, 177, 139, 130, 90, -479, -397, -217, -176, -255, -249, -72, -267, -175, 56, 91, 10, 93, -183, 89, 186, 6, -58, 221, 96, 105, 235, 7, 75, 330, 173, 27, 74, -114, -436, -245, -214, -338, -524, -234, -206, -325, -171, 135, -60, 72, 143, 460, 296, 314, 569, 323, 126, 315, 147, -136, -104, -202, -7, -428, -371, -492, -162, -274, -112, 78, 78, 191, 336, 17, 80, 407, 498, 424, 90, 483, 352, 190, 120, 32, -62, -84, -183, -431, -228, -163, -251]
4452b51p8rk6P3n6M26%k0P9J18p6J0J9K66n76L73r0l6k75J54j7l13Q7J92m58M8
4478d36K05N5J82k81L06j54n4K02L09p6K95L5j09o6J0j03l84J03m1J4k47k36k58
4501g29L29N1j16N3J58j07L91j38Q9J19J78K25Rj1l48O2k0l9l63K83j27k56J63
4524a44k14K66k50J55j91K90q4L21j04l71J91M26J12l28J68J15L1k87N5kj87J52
4546A20k8j47n9M7k44Q3p1M2j44L1R4K50J8K7K48N7N4M2J22K9l52J86j86m3k10
4571c4J43k90J42m38K65l49J55k14M61N7j23M62k83K34o5J26Q1K17q1r7l70K71
4593B70k43j46l9l6j37R5M0l3l71M16O8p6m6J70L08k10K40n5L0n2J09M8J05n08
4617e3J64J15j48M8k1j06j51J16j14J1j81P1j03j48L64N0K3M0RJJ73Q7J69k8J18
$$ y = [-251, -329, -338, -364, -291, -347, 79, 79, 59, 138, 256, 180, 190, 209, 475, -101, 272, 182, 146, -129, 25, 8, -305, -218, -26, -484, -436, -231, -176, 6, -275, 31, -123, -177, 25, 334, 258, 553, 588, 479, 413, 423, 320, -64, 39, -2, 12, -235, -471, -729, -400, -349, -465, -412, -254, -361, 30, -108, -19, 100, 278, 503, 512, 501, 153, 215, 195, 156, -207, 76, -51, -307, -144, -358, -92, -342, -187, -378, -88, -172, 149, 45, -326, -135, 291, 403, 75, 243, 358, 389, 102, 157, 155, -32, 120, 92, -55, -114, -67, -311, -228, -299, -257, -401, -370, -276, -26, -8, 19, 267, 324, 378, 420, 542, 571, 219, 405, 219, 176, -34, 109, -181, -39, -477, -212, -561, -406, -620, -159, -102, -225, 237, -46, 188, 123, 249, 330, 547, 466, 369, -1, 270, 27, -119, -158, -194, -331, -236, -196, -229, -600, -184, -116, -192, -238, -68, 240, 30, 270, 215, 245, 193, 302, 350, 455, -53, 111, 226, 78, 126, 105, -1, -152, -36, -150, -139, -320, -249, -352, -500, -136, -86, -63, -23, -14, -13, 160, 247, 416, 388, 506]
4642E06q0m52o7J80j29j22o4p4o3K9k93J09N7J87K09j1J88J8Q5rJ80K73j59j03
4666C95n5j68Oj78jj95q2J84lk00Q4R7j23M9L99l45j27J80J89M8n6K21p7q2k68
4691a08L33J5k24j4L28k39j95K49l61o2K4K3k14K16r9n9K58M5L19j63j3K02K03
4714D64l14J31L05l18J33k22l86J47K53k82m45K53j28N9k07J67K32J28K4K42j90
4735D6L28p8j75J32j16J17j56j43M5K36k97j72L10r9l14J96m2q6rK12R3m7j23
4758a42J50M2R5K9j7Q8k21K30j20j95L65m98K42L3j13p7j59J43j0m4N6K12l34
4781b45l9J15J97R2J4Q7J07k19J75q7L3m1q9J38j59o1M7j69j06K00j81J2Qk05
4805c76K13q3L10J76k57L59O3k16J91l7o2j36j09Q6J6k25n0j14Q3M7n5q2J99N4
$$ y = [506, 426, -26, -93, 87, -42, -164, -228, -302, -365, -336, -629, -520, -463, -276, -67, -78, 110, 128, 213, 204, 384, 657, 498, 395, 340, 172, 178, 0, -1, -196, -278, -94, -97, -297, -213, -116, -239, -190, 209, -136, -263, -83, 106, 154, 98, 319, 242, 160, -108, 225, 240, 16, 2, 330, 91, -104, 145, -216, -278, -254, -231, -445, -229, -328, -387, -129, -84, 235, 72, 59, 261, 464, 150, 281, 586, 268, 401, 179, -207, -60, 193, -89, -534, -281, -409, -350, -557, -390, -158, -30, -6, 236, 46, 374, 296, 121, 253, 137, 254, 98, -45, 0, 236, -61, -233, 77, -22, -336, -140, -182, -268, -277, -65, 28, -19, -142, 8, 50, 145, 174, 157, 245, 24, 254, 134, -61, 304, -194, 48, 81, -32, -109, -268, -125, -135, -179, -123, 89, -245, -284, -169, 28, 120, 134, 221, 328, 109, 284, 197, 230, 189, 100, 238, 79, 18, 65, -104, -210, -10, -191, -179, -171, -376, -163, -246, 64, 240, -17, 342, 405, 189, 380, 343, 281, 145, 36, 122, 138, -87, -137, -251, -168, -121, -176, -258, -59, -5]
4829ep8K3N1R2L12l91K91j85J1l25K55K7m6k1L2J93Ql33lo1J15m2j8j62J97j85
4855b48K6j7J07J14j0J1P9j2J7M11j07k12J1L84n8n16L3O7l64K15o9j79o6L65
4879a8j86M6j05J38K76p3n1J7L3k23L17J57K9m17K26o3j35M02l98j23R0k36K88
4902ik71L63j71j58n0L81p8P7j80P4r9K29jJ87l23K02J5p2j85J47j37J5J85k27
4926h6K42m87J88K10k08R3j1R9Q1j84J43l04L05n2n6K32j9n4j4K34k54J38j41
4949I5M9jn4j48k6Pj70P6L13l65K81RkJ2o1N39r2k24j28q3j46J4j26J86k45K52
4975c8n7l60L50n9n0ML42J44m77K30J57k20J25N2j98J77L5k26J2J24kO8j4K24
4999C43l62M48m03j01K21m54M57l13l6K05j16j79J13R7J98m9j16K42K8J65r0M6
$$ y = [-5, -83, -60, -9, 83, 395, 4, 295, 110, 121, -204, 51, 78, 32, 11, 43, 236, 244, -89, -92, -153, -38, -80, -98, -260, -63, -248, -222, -239, -132, -18, -28, -17, 62, 50, 67, 478, 371, 159, 170, 554, 496, -20, 13, 80, -284, -69, -138, -317, -383, -18, -204, -158, -263, -125, 151, 78, 27, 44, 77, -146, 171, 328, 357, -60, 166, 103, -32, 370, -28, -151, -61, -297, -9, -280, 83, -88, -246, -296, 85, 7, 84, -96, -22, -121, 108, 107, 294, -29, 173, 188, 116, -69, 78, -59, -44, 141, -86, 156, -331, -143, 67, -141, -48, -59, 40, 121, -63, 80, -224, 81, 29, -27, 205, 186, 132, 118, 352, 98, 236, 95, 144, 143, 89, -59, -85, -78, -248, -172, 141, -224, 57, 66, 64, 76, 15, 554, 462, 238, 110, 27, -119, -105, -231, -45, -290, -38, -95, -455, -105, -164, -214, -210, 132, 276, -201, 29, 186, -34, 91, 143, -55, 122, 157, -69, -57, 67, 65, 133, 119, 343, -19, 429, 26, -75, 146, -308, 149, -164, -200, 5, -111, -290, -177, -80, 118, 69, -47, 195, 223, 388, 298, 344]
5021C44q8l74K07p6k14Kn8J24j85K85m5P4l3K17N1j15J24PJ3j40p1O8J1j45P8
5046F1n8j27L4Q0j05K4J01k7K5K9j2O8n4QPk37J66K76m52N23k76N4J67j50k9j0
5072H6l67K08Q4j69J40r6K2j16Q7K3O6J10L9J2r4J27Q6j33j53K21L9k28j53L12
5096A53j79j66P6r1j03K14R9j93O2J12K15k97Q1K48j70j17L6r2J91O7m6p6J60
5119A84J26j39j21k44K76k67K07L3q8M2j44j20K23L31j57M8k52K91j45J05J01
5140B90l13J47j32P4m56J54j4L6M5J60k80K94Q3n2K5J21J2P2j01j77K05n27R4
5163b40M09m43J74q5M3l1k9k3K30O6j5J09p4r9M0j7p1J42K8o4J8j88L0J72j96
5188a14J58J98j59O6k13J91n9k16J72j44l14J55L55j3j18j15O2L78k05j6L03k32
$$ y = [344, 256, -118, 89, 13, -201, -199, -257, -133, -318, -33, -78, -4, -37, 180, 231, 116, 240, 247, 260, 120, 49, 117, 128, -17, 61, 3, -124, -90, -10, -115, -91, 10, -17, 8, 37, 25, 93, 39, 47, 54, -183, -17, 259, -193, 330, 54, 108, 275, 125, 96, 86, -281, -73, 11, -158, -18, -114, -92, -208, -121, -98, -32, 78, 117, 129, 35, 162, 248, 115, -38, 183, 222, -6, -159, 153, -26, -192, -116, -207, -310, -96, 3, -190, -128, -16, 199, -98, -17, 231, 61, -56, -20, -112, 79, 146, 100, 24, 184, 310, 171, 50, -194, 82, -185, 22, 55, -33, 9, -135, -255, -32, 299, 142, 190, -62, 229, 84, 189, 290, -23, 124, -8, 66, -390, -236, -250, -214, -169, -9, -289, 5, 88, 36, 61, 182, 194, 266, 165, -12, 193, -334, -240, 169, -274, -100, -185, -142, -173, -202, -225, 5, 71, 56, 165, 91, -8, 32, 15, -56, 86, 114, 50, 68, -120, -90, 82, -114, 44, 242, 83, 149, -64, 127, 68, -148, 24, -120, -434, -279, 76, 63, -55, -170, -108, 270, 65, 49, 352, 120]
5210A20j66K78k79q4L8k36J21Q1q1J20j07P6K05l6k73L30J13m1p8N7J66q3PJ01
5234C49k69j02K33m59P6O2J33j47j71J89R2L8k37K32J40j68j46N0K54J05L3qr8
5257A81K29k41p0P5k15J00l37L12j91%R1j02K18p7J11j3j94J28k5O1J82J30l5
5280C18M5M0k22J23k95J91O0l36j31J66j09m8q3K55l4r3l4K2P3M0j3L07k66K26
5304B02k4J47j05N8k57J5L7j54m3k01Q6j92R2N3m7r8L02l2L6M02k69J19q8L19
5328C58k03J47j1QP1j12p0L9l14J46k09R3q6q1R1j93J59K0Q2P5J64j87M88k65
5352B10K14r2l0m6L3j37P6j14l38m0m8K09l5j02N4j13K41j94K10J04j98R9K05
5375A68k07K00J03m23N49j75N4j90P7%J1p4l59J36j41K03j67L5L7M4j62M3j0K06
$$ y = [120, -46, 232, -47, -131, -93, -329, -208, -127, -208, -88, -195, -119, 86, 50, -223, 107, 220, 179, 101, 158, 324, 241, 248, 349, 80, -22, 211, -248, -172, -110, 23, -124, -295, -106, -14, 24, -213, 19, 159, -9, -155, -105, 149, 254, 287, 279, 181, 410, 169, 99, 174, -41, 59, -278, 34, -157, -157, -66, -168, 50, -27, 84, 71, -123, 5, -20, 41, 223, 353, 318, 363, 403, 181, 304, 9, 200, 260, -76, -207, -41, -150, -198, -281, -26, -60, -153, -187, -165, -92, -52, -65, 242, -24, 202, 178, 325, 220, 278, 21, 36, 73, -81, -124, -325, -239, -431, -339, -286, -333, -431, -129, -161, -125, 277, 8, 127, 39, 358, 155, 302, 291, 299, 370, 258, 188, 227, -87, 59, -150, -57, -143, -224, -133, -326, -167, -147, -65, 10, 174, -13, 475, 210, 424, 332, 302, 256, 289, 152, 228, 114, -224, -264, -312, -103, -138, -240, -186, -299, -58, -252, -42, 62, -136, -37, 168, -39, 161, 264, -159, 390, 215, 269, 79, 156, 156, 167, 93, -266, -130, -271, -68, -235, -200, -163, -119, -281, -238, -248, -42]
5399d2J25k5K25j27K23K0j70j12M61l94j31n1m9p7k34M6j1j95L71l1q2m1J16L75
5423A90n6K72k6j93K8k1J0J05j36j64j42Q1j38P7P4q7K11j1j32k4N3P4q8m1l7
5448a21Nq2J22m6M08Q6l15J4L91k69M5P9r9l06J51j70k64j27K01j23J73P4q8K69
5472HL2J28L3K61l1J27k00k72J71k33j30kr5Q8o6p8l64J34K99K26j69q7M23n2
5496A51K5k6l4o3Jr1nk1j95K94r0M6J07pj24L4K29l01O2n4k5k27Q5L28l03Q0J1
5523a13J02P2N7J01m0Q4j13K15k12j52J53j64M0P3j77l75J18K35n4J61j66J38
5545a7K32l25L51M2j80QJ34k24j17L96l41k32J70j52K87j63L06J51k91Q0j23K7
5567A9J17k11K65l55M4K18q3J83o5j92K16r5J62k2l9p5K25m04L95j84j26o1Q4
$$ y = [-42, 83, 58, 283, 156, 379, 399, 229, 117, 578, 184, 53, 2, -47, -124, -358, -312, -323, -518, -147, -178, -260, -301, -185, 190, 134, 406, 380, 187, 215, 194, 204, 309, 173, 9, -133, -52, -190, -113, -39, -126, 85, 74, -58, -82, -29, 45, -43, -84, -121, -116, -198, -76, -122, 286, 372, 57, 71, 462, 193, 238, 317, 218, -88, 63, -107, -371, -498, -297, -420, -247, -173, -261, 8, 40, 168, 201, 462, 431, 558, 358, 86, 257, 24, -106, -108, -203, -115, -181, -259, -623, -489, -190, 36, -133, -220, 203, 151, 176, 150, 116, 53, 54, -37, -42, -63, -258, 36, -54, -8, 99, 92, -32, 2, 231, -70, -8, -62, -87, -314, -229, 99, -204, -124, -113, -11, 61, 118, 219, 179, 263, 150, 365, 153, 1, 154, -10, 30, 103, -74, -449, -331, -96, -150, 11, -155, -17, 215, -110, 241, 283, 103, 111, 245, 21, -96, 300, -41, -273, -103, -255, 32, -131, 175, 326, 35, 115, -8, 19, 136, -75, 190, -165, -121, 97, 14, 197, 132, -60, 156, 61, 223, 201, 162, 87, 312, -92, 303, 119, -7, -68, 16]
5590A6k72Q4L5J72r9PJ90k06K26K0j11J98k48p1J69L0k86o0k57N09N0M6j57J01
5614H6j2J34j60j27P8J49k24J19k43j7P2J9J39m0j68L66O6j28mQ9j84K9P3j40
5638b8J46j19j64q8K45p0j3k19J5K32M5J24j05o0J13o5M8j47j7J14l6N4Q3j34
5662d6K10l12J58J49k46O6k9k15K93K64l78Jl35K53N4O0j00M11j36m1N4R5K1k17
5686C4K36k19J15j45J46l52J70N6m4m4k42Q8J28R0j63J35J65j04K3Q7K01n4m39
5709a32J15J49o4k01%R8M7Q2j99r5J01R7K7k11J54Q9l8k79K69J33j42L80l67J2
5733B5j45K33j03K43l78J70P3j15J83q0j23k56R7M06k43k37M7n7J17J03P4L3L
5756G0o7o7L53K64n38nK54k26j31J69j81m5J31k70K3J31J07k17Q1K85q3L8n1o2
$$ y = [16, -256, -172, -137, 35, -64, -57, 133, -73, 153, 173, 62, 260, 12, -59, 110, 140, -146, -206, -463, 46, 96, 142, -15, 86, 74, 208, 48, -79, -1, 148, -76, 43, -200, -217, -145, -126, 13, -27, -195, 171, 237, 109, 105, 194, 10, 39, 112, -28, 118, -1, -165, -253, -8, -78, -91, -310, -295, -63, -18, 106, 1, -59, 54, -11, 37, -110, -127, -13, -49, 5, 88, -46, 164, -148, 10, 159, -87, -21, -50, -265, 28, 292, -86, -85, -420, -167, -113, -53, -153, 258, 122, 81, 135, 230, 251, 34, 270, 51, 166, 21, 167, -185, -15, 41, -3, -47, -289, -201, -73, 17, -146, -11, 154, 50, 73, 160, 361, 307, -132, -17, 132, 68, -133, -133, -35, 12, 94, -105, -200, -99, -2, 25, -186, -32, 57, 19, -260, 9, 142, 0, 380, 13, 25, -120, 113, 10, 253, -125, 45, 118, 3, 186, 106, -17, -273, -176, 230, -13, -250, -203, -260, -143, -40, 34, 67, 70, 3, -64, 289, 553, 15, 10, 264, 38, -93, 76, -105, -150, -19, -289, -266, -135, -28, -245, -164, 121, 38, 76, 25, -37]
5780c7K20j43J71k52K21k3J13k35N2j38j12K49p5k95j6J22n0q4K93J35k33p5M4
5803a48P6N3J24K13j69j31J81k78K12K8Q4O9k43k34j7NJ63J13k10R4k18L49j46
5826c0O9m7k22L88j22R7J16o3j08J5J18l7l26J57k03J96j32K24K8lj08j29Lp0
5850a89qjR9n5J23j04L15M4l14M07R4k74J08J9j83k15K37j66J23N6l06k66L32
5873a24J57k45n9J80q2L30J06k72rL27J77l59o1Q0l2j41j1j67J44l6J40N5k6m16
5897c44L99N8m3q4o6O6j47m9K58m2q9J37L9j2J02M3j57J95j21J89k68j00N6k58
5921b38j06K99l72J81K78l36J72R3J48k81M28N7M5l6k26K22k32K4j07j85n4p4
5943c00J95l18J62K07J74k70%L96k11L0j30M26k56l06J79J80l11R6j58L3J45J26
$$ y = [-37, 183, 40, 211, -41, 180, 157, 270, 35, 87, -51, -163, 86, 11, -284, -300, -178, -228, -312, -19, 116, -117, -192, -148, -72, -19, 105, 318, 149, 18, 199, -79, 133, 161, 245, 314, 71, -163, -180, -175, -12, 101, -109, -15, -233, 116, -30, 39, -8, -230, 158, 36, 133, 249, 186, 78, 93, 211, 174, -152, 5, -198, -2, -134, 90, 118, 115, 7, -122, -119, -189, -197, -198, -99, -154, -31, -135, 180, 224, -90, 317, 411, 137, 245, 264, 81, -134, 103, -63, 60, 116, -190, -456, -124, 33, -212, -271, -91, -173, 157, 263, -9, -18, 309, 486, 127, 66, 146, 114, -27, -38, -205, -61, -97, 43, 98, 72, -344, 55, 113, 70, -14, -80, -14, -161, -210, 48, 6, -83, 54, 93, 81, 183, 226, 69, 264, 143, 332, 64, -36, 20, -238, -344, -45, -417, -236, 42, -294, -122, -29, 119, -162, 266, 323, 368, 332, 106, 328, 96, 120, 13, -172, -226, -300, -105, -423, -261, -54, 120, -150, -150, 246, 35, 65, -65, 361, 105, -201, -22, 158, -153, -57, -215, -182, -37, 89]
5965H9J82q4j40J24q2J28k36L3o8j50R2j93J9O0J02L5K8K92J25o3J05k33K23j29
5989B59k07J79k30j56Q7L3j16j71J16J49oK86j48j27K70k76K58J14J8j73l60K16
6011A5k0j18n3Q3J27j21J97J79k86NK20k22nQ3Q9j72l16J70n8J55p2J8K65M7q0
6036A30O1K29k23ln1qk16K9J90l11k4j4J2j46L03l51J55K52l7j26K65j59L06k18
6060D5n1O6j09J79j36J27j88J83M4j38l4J07r6j38K59m34K32q4K13j77k68Q2N39
6083B23k91j47K78m7M73k85m2j80K64l2om44QL53m26J74j17Q3M8j58J98J23n3
6106cL04j25J03N6l8n5k10K26O3q4j93J31j45k02K7J58j49J7%K69n01K81k18N6
6130b32L98j30O0p7j8p0J73j52Q2J09M4p7N0Q7m26PJ11j96J3Q3J6j16L54k80K35
$$ y = [89, 271, 187, 47, 171, 89, 217, -19, 14, -54, -204, -112, -305, -286, -226, -124, -89, -61, 231, 356, 293, 398, 165, 388, 259, 52, 231, 1, -155, -68, -35, -151, -322, -206, -57, -63, 223, 75, -52, 218, -58, 200, 314, 332, 159, -201, 15, -5, -123, -176, -93, 34, -87, 110, 289, 3, 8, 228, 6, 1, 84, 173, 1, -315, -145, -203, -48, -120, -102, 163, 210, 130, 191, 420, 197, 194, 143, 135, -81, -52, 138, -173, -197, -211, -199, -345, -42, -393, -238, 14, -23, -149, 116, -43, 263, 45, -6, 60, -49, 130, -6, 121, -67, 116, 160, 22, -12, 95, -1, -139, 120, -314, -82, -166, 47, -130, -398, -316, 223, -68, -215, 63, 16, 489, 204, 162, -18, 246, 214, 208, -236, -228, 125, -301, -127, -244, -161, -113, -271, -73, 50, -3, 301, 176, 279, 335, 297, 242, 32, 258, 321, 237, 44, 175, 30, -172, -145, 13, -136, -119, -119, 150, -351, -70, -288, -232, 166, 36, 96, 19, 1, -69, 104, -48, 34, 143, 187, 110, 160, 247, -179, -172, -61, -257, -244, -161, -145, -261, 93, -187, 48]
6155D8j02L06k53K64j08OJ25l0k16M0N3m13J23k6j4k3MJ04k29J51J55j37J35r1
6179a28K94o0J2p3j36K91j36j84K06J33k61J55j7j71q1r5P8QJ63r6j31R2n7L2
6203a62j24J33J7J30J57k2P5Pj20R1m57M29J32k40j7j82M25k46j6Q5j51j45J42
6226e9J7J6m4K9j18J78j8J87p6M6J57k42Q9k04L11n0o5o12L44R4j76Om1J4O8j71
6252c20J68L92l99K79J5j1K53k52L8O1l64P6J33j4j8p2o9J29o4r6J98o9O2j03
6276d7K2l12L56K18j82k82J26J93K6j50J41l8P9j46Q2N1M0l58J32PK4k24J23N2
6300f7j69L17j98J78j45J95j48p5Q1K23M9k68L39j43k57ko3k9m7K00J5K4j65N
6324a50J86j30J00P0jk2K00k65K22k7j83J77o0j67j22L35j31J5J3k22L96l40o2
$$ y = [48, -54, 252, -1, 263, 155, 161, 286, 256, 40, 80, 133, -280, -157, -183, -197, -220, -216, -112, -341, -190, -35, -172, -37, -128, 166, 106, 118, 45, -91, 200, 64, -120, 86, 219, -42, 113, 96, -75, -156, -251, -173, -165, -2, -98, -229, -137, -194, -162, -286, -153, -136, -6, 151, 129, 204, 211, 91, 182, -275, 154, 286, 46, 29, -153, 272, 26, 10, 95, -56, -201, -59, -42, -26, -70, -41, -159, 19, 1, 188, 112, 158, 315, 73, 162, -42, 269, 219, 154, -458, -114, -20, -196, -190, -231, -217, -149, -320, -152, 240, -159, 120, 135, 124, 377, 125, 163, 224, -140, -64, 69, 55, 37, -35, -104, 25, -39, -135, 63, -6, 56, -47, -25, -337, 19, 237, 55, -227, -101, 92, 118, -32, 109, 71, 150, 4, 86, 137, 177, -181, -49, -42, -18, -242, -119, -67, -236, 81, -117, 61, -84, 111, -37, -112, -31, 192, 241, -27, 312, 169, -88, -90, -153, -182, -229, -29, -14, 10, -155, -150, 36, -94, 6, 76, 75, 53, 253, -12, 210, 183, 0, 177, 117, -50, -172, 163, 32, 47, 60, -162, 234, -106, -168]
6347a68K17q1J77j67O6K55l60K72l20l0L86k97r2k9R4J19j16L70l38j29m7K6J10
6370h2j40K90J4j00j42M00m34J69J46j52r6J57J34j74K2j68M6L27m31J22p5K82
6392A15J3j60l7j16J04P3k22K14J67m31M98m11M28k37L83l06j65J67k10R1j14
6413a56L2m6j04L42k31QR3L1L06j16N1L2j17q6J71k26K4R4j81K84n53K34p3J65
6437b2j41J61j25K05K5l6L4k37J74J29j75j8J32m0k52K44M7K7j58k18J47j9K66
6460A50j20k9q6K08j85j46K78r7O6k26m2J34L40k00L14k15j84J15J5j28N5o4j82
6483b29J56l4J32j73L3j32L09N5k71L43k24R5R4j42j0J04p2k19K74o2N5k10O3
6506f5k04J96O4k78P9P6K58n1R1o5n9l05K81j32J6R7%J24Q3l00K09M4M3j44j01
$$ y = [-168, 49, -32, 145, -22, 44, 299, -61, 211, -109, -139, 247, -50, -142, -171, -77, 42, -74, 296, -42, -171, -218, -192, -82, -222, 68, 82, -18, -160, 240, -194, -25, 121, -31, -127, 30, 164, -10, 12, -156, -110, 217, -214, -92, -167, 115, 128, -32, -69, -185, -81, -8, -230, -16, 151, -280, 218, -193, 235, -2, 381, 75, -90, 77, -133, -42, -156, -124, -170, -274, 68, -163, -155, -62, -31, 275, 159, 210, 242, 125, 39, 210, -16, 8, 102, -79, 205, -348, -114, -187, -22, -163, -2, -127, 78, 103, 67, 101, -136, 38, 167, -8, -26, 106, 66, -186, 58, 105, 132, -26, -244, -97, -116, 150, 30, 1, -85, 123, -62, -208, 70, -27, 39, -187, -229, -95, 245, 45, 359, 144, -40, 75, 90, -38, 17, -47, -229, -73, -107, 25, -148, -115, -247, 62, 117, -154, 189, -35, 60, 154, 12, 2, 106, 34, -185, 89, 27, 82, -128, -65, -269, -73, -9, -287, -208, -132, 126, 75, 166, 101, 42, -263, 18, -114, -98, -1, -1, 123, 206, -94, 115, 159, 202, 58, -43]
6531d3o1K18n6o4k15lo7Q3J30j39J67n3o6K71N1j40J54J3lp9K2l83J92O5M7k04
6557a63j29J59R1J26k58L03j20j89K26L1m6j38J05j09L3K23k00J11j24M7J32j48
6579c7O0n7P1j7j5p0N6k60Q4j14J72K7n7J44j48O3J86Q6m68K72K29L0r6j98J49
6604I2q3O8j26j95K97j37k10K47k48M3J86M1j07K28r5j19M26k81R5K6j45P7J3
6627I3L7J01j60j45M0o3M3j90J78j95K42J47k27K30k89K53k94O1K23j81P1j47
6649a72K68l6J04j74K81l43l2L1k0J23l30L81j13k02K80j60q1K03n7J68j44K16
6671A91j58k0K33j70NJ73k53K26j57l3j92j01J60K4k44R9J11n9J76j59q7J47O1
6694b7j09k3L74k70J08J25k73L62r7j88q9J60n8R6k22r3P0P6L3l1k9k65M89j50
$$ y = [-43, -104, 114, 58, -6, -221, -224, -291, -208, -78, -217, -50, -103, -169, 102, 153, 13, 167, 180, 177, 98, 120, -263, -71, -6, 41, -163, -292, -133, -42, 84, -174, 129, 9, -180, 46, 77, 31, -107, -2, -111, -78, 145, -55, 56, -68, -21, 111, -37, 23, -34, 37, 20, 5, -65, -9, -269, -185, -299, -127, -100, -157, -13, -161, -98, 88, 174, -294, -22, 207, 237, 141, -57, 92, 9, 77, -49, -244, 53, -84, -294, -47, -295, -252, -66, -25, -132, 96, 1, -118, 308, 27, 122, 148, 3, 80, 93, 130, 231, 71, -74, -34, -97, -54, -244, -66, -261, -19, 128, -99, 131, -158, 95, -199, -138, 85, -96, -25, -172, 96, 60, 164, -10, 271, -72, -104, -73, -93, 30, -300, 81, -32, -234, 46, -114, -195, 8, -49, 119, -25, 191, 33, 13, 246, 76, 81, 254, 1, 227, 70, 37, -155, -256, -96, -72, -316, -217, -106, -165, 11, -148, -235, -88, -27, -136, -159, 215, -55, 53, 178, -95, 267, 170, -18, -107, 53, -5, 91, -131, -224, -154, -78, -45, -76, -105, -370, 119, -31]
6718c1J21l7J98k30J25o6K05k94K17j10K9M0p3o0k8o1j38J20N1k7r0j09l9K00
6742h7R7J51j08K40q1j35L09k34j07K94j09q4k78K49n5j00j18J07Nq2j32L91m10
6765b77o8J50J94J80m3j51K2rJ27J1p5K3q8R2J69oj97L4j17k9m4n9Mk44Q3J51
6791a67K0M3J11j14RN03k23M6M4k2k52J35L3j98K8j34L4Pk9k3j09M6q3K94j73
6816a74K56k27Q4J23o8P3L7J48j12n2m4p6J17j02j55J79j28N6j17K76p6r2k27
6839c01K69n5Q7M9R9n4j24q3K76k21J76j07L12l00L1m1Jl2J9J7k24J83r8j92k7
6864c40n2k7J97J10QK9M6J72L22l56Q2J14j81j60J88j16M1%m6k90J54o1L3j10
6888b43QK11k7j40R9Q9kk8K08K2K1m2j26R3J93j69j94L42m24O1l3o3m9J32j30
$$ y = [-31, 90, 53, 251, 21, 146, 80, 285, -9, 208, 98, 127, 167, 94, 34, 6, -55, -193, -73, -22, -49, -139, -248, -287, -87, 10, 161, 53, 293, 212, 77, 386, 152, 45, 339, 230, 146, -132, 117, 62, -38, -156, -49, -44, -126, -258, 133, -277, -345, -195, -1, 179, 136, -15, 7, -2, 125, 136, 61, 84, -4, 88, 257, 251, 54, 88, -29, -58, -102, -161, -157, -401, -318, -167, -147, -104, 7, -107, -98, 405, 182, 228, 272, 250, -2, 133, 166, -32, -4, -138, -104, -97, -126, -149, -258, -212, -295, -1, -174, 82, -145, -61, 62, -6, 67, 104, 252, 140, 88, 44, -32, 85, -17, -172, 7, -121, -65, -182, 94, 18, -74, -301, -32, -87, 0, 49, 148, 94, -30, -113, 163, -58, 118, 11, 323, 23, 54, 13, 14, -18, 1, 18, -206, -23, -121, -313, -340, -392, -419, -222, -112, -104, -75, -29, 143, 465, 109, 191, 305, 124, -36, 152, 36, 77, 77, 31, -259, -105, -166, -133, -243, -235, -24, -51, -191, -92, -3, -5, -33, 175, 197, 218, 176, 50, 143, 336, 167, -27, 315, -109, -48, -81, -144, -193, -61, -191]
6913a91l4L96o6k41Q7p6L71j92mJ28J65k58M4R4j33j21P2j5j90J21j36nQ9R5j24
6938a24j16N4R8K4j09L00R9lJ16k73K45r9j24m6J60j69j21J51J6j25L1k1j10J95
6962D9l26o0K21J25RP0p6k7J43J0Q7j69K02j15J02j75j02RQ3j85J02j28J51L3
6986C3m6l7j63m5J90K22l63J57ML49m3j05R2j18j26J84k64M3P0K72m08j69k4K19
7010g6l63N36q1n4J47l64J27O1K09l5o2K74k95K30p0j37k01J80J30j13J9j27j34
7033a99P7J41N9j73J9r7J33j1r0K9j55N0J12L05j37J54j10j91K87j08J46O3k15
7056H9k45P0j28J05k16J43j15J66n8J08J36k5j01J05P8k36L70l02J51L47l95k81
7078b34L26j13N6k9j41R1R7j38L7J26q5J06Mj38l6J43n3Qo2N6J44k29jJ30J83
$$ y = [-191, -225, 171, 105, -136, -49, -125, 246, 54, 50, 178, 343, 85, 129, 223, 90, -31, 41, 26, -164, -43, -179, -184, -95, 0, -124, -240, -186, -88, -64, -173, 127, 226, 223, 339, 66, 311, 212, 88, 42, 202, 33, -88, 63, 79, -46, -15, -36, -146, 49, -277, -337, -116, 9, 18, 88, 12, -15, 128, 138, 225, 56, 258, 143, 245, 70, -32, -23, 60, -125, -23, -151, 0, 33, -13, -50, -213, -258, -68, 154, -209, -52, -48, 301, 258, 153, 245, 127, 1, 185, -79, -36, 34, 306, -102, -271, -295, -76, -439, 97, 16, -38, 109, -255, -128, -67, 142, 107, 45, 319, 24, 254, 184, 47, -154, 26, 156, 43, 62, -65, -199, -122, 19, 78, -95, -76, -173, -40, -51, -141, -112, -267, -217, -105, 200, 63, 217, 107, -84, 203, 95, 241, 304, 89, -156, -86, -214, -109, -325, -182, -297, -131, -189, -81, 55, 30, -71, 34, 112, -124, 246, -56, 95, 442, 47, -234, 92, -21, 35, 6, -135, -44, 53, -85, -48, 78, -7, 99, 103, -35, -71, 72, 19, 27, -35, 21, 165, -64, -65, 65, 248]
7103B48j50p5r1k7N4l3O5no5K17p2j24j94O5K22j58J93L9m9l19L30k3k42N09k00
7128A15Q7j14p9k3m5k0K01Nk02j14J17O5k77L70r6qK7J32j04J75k09n7K82j65
7152F3m5P5J76m77J23j75J97J85jk95J41p0K48p8j31RPK18j57k6Q3rM6j82K78
7177B03k24nl2L29k44l7N6j87L6Q1k73K57j23ML8N8r2j66J81K19J76j20P9j17
7201I7mJ04M3j4oj93r8R1j21j40Q3J40k56l5K76k63J37J3J20p1n0M90m03L8M10
7226C88l74P3L8j51J19j40J51m6j79P5Q6j27j64K19j85J19n3J90l7j42l4M42k52
7249A6N1j31m5J56n0M3Ql6K23m34J28j25o4J11K22l99L14q5j15J98j18j75K72
7272c5P4j45K67OJ94m47J32J97j93L09m17K27j71M3k7k18K76k33J94k03J97j6
$$ y = [248, 98, 23, -68, -95, -41, -74, -9, -14, -79, 138, 66, -58, -252, -187, 35, -123, 70, 109, 60, -259, 71, 48, -194, 315, 115, 202, 88, 9, -14, -59, -79, 122, 127, -75, -189, -72, -7, -284, 86, -10, -18, 9, 141, 37, 212, 3, -54, 228, 63, 18, 93, 269, -208, -85, -260, -63, 122, 121, -174, -33, -103, 145, 67, -64, -55, -48, 170, 13, -13, 70, 61, 107, -75, 203, -21, -26, -58, 271, 27, -10, 46, -141, -105, -24, -297, -40, -163, -159, -121, -63, -155, -321, -140, 79, 255, 135, 214, 97, 93, 197, 240, 226, 220, 27, -71, 20, -101, -241, -158, -18, -274, -309, -33, -296, -159, -146, -26, -97, -147, 343, -60, -22, 388, 14, 87, 125, -26, 93, -47, 104, 58, -121, -46, 40, -87, -251, -32, -217, -98, -151, 39, 2, -140, -174, 268, 16, 67, -64, -109, 47, -3, 40, 48, 12, 235, -199, -71, -196, -260, -149, 73, -326, -12, -97, -212, -14, -132, -307, -35, 39, -106, 161, 167, 361, -86, 46, 243, 50, 359, -58, 169, -2, 41, 14, -204, 72, -161, 33, -170, 27, 11]
7294A1J09j49lKK1p3K98k12Q4k00J75r4q2R1M0k57K33Q6j52J58k73K58K8j66n3
7319a20M9N2J55j48q5J88l6q4j69J78pMK8o2K11m08K24R7m25L71K5p1r6K17j59
7344g1K00k32j41M96m8k37NJ6P3q3j32K33R0k19j71J02MQ5l82K28L65k74R4l1
7368c0J01M9m1l02M15k57j03L2J24J05o0j29O8M6j43J73M5p0J35j58O0o2O1j7
7392D2j17J95j05l6q1K37o5Rk11J62Q3j16L8n1k60M34p4j19k87N20l97M3M5j15
7416b26N18k91J1J40n5L1J47k08o7L13k73j18J17j00J08k5K8l08K44j63K37Q1
7438A41l7j6J31k03J44j04J8l00K02j45K03j03R3J95q0k19Q6J10j3j04k25J4K63
7461E1k93K21k14J34PK54o9mJ2q0J43j67J14k42l9J63m8J21j97Q4j50K27r8K38
$$ y = [11, 120, -29, -32, -30, -9, -82, 216, 4, 88, -112, 63, -31, -113, -22, 18, -239, -6, 80, -72, 86, -187, 71, 99, -67, -120, -71, -19, 136, -12, -97, 91, 55, -29, -198, -20, -27, -23, 5, -57, 154, -254, -30, 67, -358, 13, 38, -33, -129, 88, -71, 129, -103, -244, 252, 204, -33, -28, -12, 61, -22, -154, 79, 169, -50, -221, -119, -115, -30, -412, -184, 181, -93, 1, -30, 71, 120, 79, -223, 192, -65, -168, -136, -12, 93, 33, -96, -28, 18, -125, 48, 93, 23, 158, 0, 60, -2, 59, 42, -75, 120, 15, -21, -102, 135, 70, 79, -132, 30, 113, -3, 35, -16, -276, 158, 84, -35, -322, 198, -199, -156, -111, -226, 292, 1, 12, 152, 97, 128, 275, 67, 0, 313, 40, -78, 39, -61, 47, 22, 50, -258, -14, -177, 60, 141, 104, 88, 219, 16, 160, 56, 74, -226, -24, -169, 34, -69, 24, 219, 139, -80, 6, 116, 103, -1, -226, -212, 51, -242, -21, -235, -101, -94, 160, 91, 87, 99, 19, 162, -5, 109, -133, -172, -9, -57, 64, -133, -49, -199, 28, -70, 168]
7485A68j35JL0k8J78n8j62K29j96j69l4k1M33l42k59J60K64l40L28q5r5O0pk1
7509a01K26j19n8q5N1P5J37o3J75l62J86l17R7R7K27j28j50j97M19n6J5j00k77
7532c08J92J29k12M6L11N4j47J9jOL4j61P5L2Q2j46m9K5j23K8J2m4J92o9lj01
7558a27K11k18J28R8J25j24j17R5J01j45P7k15j42L99k16j45p7L08L1j53K41k50
7580a15K34j21o2K7j78K63k62l3J90J24j28K66j05R1j0j25K8k63K98n8r2m6Q4
7603Gl30K50j04J69j09K6o8R8L24k65n8K96r3j50J72l1q7j3q7p5K67l20J67l17
7627c31N33j54l54J07L40j47Q9j01k09J1J24L15j78P9j39lK53r2K7k10K03j13
7649E0N9q2k01l6L49l45M4J99K73l00J9J11j36J57J38j59j52J93L5j49j8M2k46
$$ y = [168, 33, 34, 64, 36, 214, 156, -6, 223, 27, -142, -176, -197, 236, -106, -365, -205, 59, -281, 47, -38, -133, -73, -80, -101, 125, 6, -52, -137, -86, -11, 126, 63, 238, -124, 62, -255, -158, -61, 166, 38, -112, -309, 110, 54, 69, -31, -308, -116, 13, -199, -153, 158, 212, 65, 84, 83, 89, 123, -38, 37, 69, 151, 5, -44, -19, -142, -114, -102, -146, 46, -23, -26, -127, 84, -134, -6, 92, 217, 93, -24, 71, 172, 27, 104, -111, -253, 146, -70, -215, -292, 16, 47, -106, 135, -115, 119, -2, -64, -37, -215, 48, -214, -247, -57, 67, -61, 205, 100, 191, 181, 56, 84, -179, 119, 61, -31, -77, 7, -323, -73, -177, -8, -117, -91, -159, -61, 263, -2, -60, 236, 143, -7, 165, 134, 47, 34, -53, -128, 139, -181, -14, -331, 202, 48, -306, -199, 141, -6, 83, -18, -227, -216, -92, 223, 45, 124, -15, -18, 235, 143, 170, -40, 163, 50, 109, 27, -174, -210, 139, -206, -162, 37, 310, 10, 29, 140, 4, 161, 299, 140, -12, 181, 216, 67, 49, 91, -155]
7672a55L56k71N1j06M3j22P2J67J1k27J77J30k05j4J78Q9o9k61O3K90j38p6j20
7695a37L98l44j33K97nj82j15N1K7l4k9n5K36m2j6L01p3N8j99K12N3L5j7k15N1
7720A23j40j68P6R5o2J76L4j52p3l4NJ39R2j73NL41l7l32J84j18KL6K13j77r3
7745c8j15L21k65j76K55o4O4p4L7R7k94L26j23p3L67m70L76j13r1J63j25j7K08
7768A76p6m8p0j70J47l44L80k59Q2k0P9j9m0n4K63j29J79q2L2j19J92K1m3Q2k16
7793e6J06o6j6NO6j0J50n15J26J89J54m55K28K09m9q7J49m7j60L51j91O0j7K0
7817A44j6m8J29k24P2%j34p4P4j43L3K5Q6j39J34J38J7o3O1mj13J10j24K83r1
7842A33jM8l32J34j00J80P9j15j93J38j31j20L26k08Q0J0Q9J86N3k52J34j8j64
$$ y = [-155, 201, -70, -19, -125, -82, -204, -132, 35, 46, -181, -4, 126, -79, -93, 85, 174, 105, -156, -93, 197, 59, -17, -137, 261, -83, -216, 81, 76, -106, -221, -170, -143, -177, -206, -261, -25, -67, -83, 218, 145, 203, 4, 216, 269, 304, 287, 72, 123, -17, -185, -109, -14, -76, 100, 134, -18, -91, -125, -120, 19, 111, -62, -57, 284, 247, -85, 99, -19, -17, 19, 232, 55, -38, -153, 168, -97, -273, -18, -82, -18, -92, -55, 42, -252, 74, -49, -122, 245, -225, 151, 38, -53, 110, -15, -32, 176, 100, 52, -18, -188, -41, -385, -5, -264, -182, -202, -123, -142, -182, -236, 27, -102, 77, -5, 27, -92, 100, 121, 78, 160, -56, 50, -16, -32, -27, 39, 29, 179, -336, -210, -21, 133, -322, -94, 115, 66, -21, 128, 81, -79, 272, 81, 141, 124, 144, 128, 80, 209, -15, 57, 57, -77, -151, -77, -220, -187, -162, -76, -215, -81, 57, 74, 11, 72, 68, -45, 65, -59, 224, 133, 132, 180, -152, -18, -118, 62, 141, 26, -167, -29, -160, -280, 46, -162, -82, -72, 17, 203, 256, 4, 138, 120, -44]
7865d4K00n6m9k5K2k8j98K34j38O0p0j03L95m59K62r1N6R6O2j01L11k26k05L17
7889B22j74j11Q3K4m7J01N8m5j72kj50L12j40J51n03N36m43K86j01N7k9J1K15
7912A39q4J70N7j72O8J3n8o9j7k66P7J28k25K61N7k89K95j36j05K44o1j78M32
7935B81m44P8J81k09K40J9l7mLJ06j82j51K14q7j83K19m06K46R6j93J23j8J00
7958hM7k20J96j45J79k50L14m7K2J02m6k97K25Pl16J81j98K24j44k16K08P1N4
7981e7k08L53k23K66p4J4R4L4J05j89j77J14K05r6j03j00O6Rj57o9J03r9N7Q3
8005d9l7P2M6l03j11L08J33r5R5L24l62o3L83m23m0J76k22J50j2j01N0p7j36K15
8029g9Ok50J94j23L66m9j14L9K89l45k0l9O5R2r1Q9P8k90LJ73r0J47R7j64P2k88
$$ y = [-44, 156, 100, 51, 26, 48, 20, -178, 56, -82, -22, -92, -195, 200, -259, 3, -88, -32, 64, 126, 25, 336, 110, -95, 222, 48, -63, 20, 44, -3, 98, 156, 111, -61, -63, -213, 99, -41, 110, -393, 143, -300, -14, -115, -58, -87, -76, 139, 55, 225, 282, 110, 178, 191, 133, 64, 47, -219, -142, -14, -239, 22, 79, -210, 85, -51, -156, 88, 27, -151, 281, -163, -85, 96, -113, 127, 146, 109, 105, 108, 214, 32, -119, 95, 8, -175, 44, -362, -116, -20, -213, -90, -108, -8, 39, -181, 15, -130, 49, -201, 113, 66, 88, 190, 144, -153, 72, 79, -237, -56, -254, -30, -174, -390, -182, -111, -57, -265, 88, -135, 131, 57, 71, 165, 199, 304, 115, -62, 52, 257, 161, 58, -42, 24, 33, -124, -193, -90, -189, -132, -49, -86, -14, 32, -271, -382, -74, 59, -36, 59, 383, 21, -42, 341, -82, -122, 54, -168, -18, -30, -131, -81, -158, -294, -79, -73, -323, -129, -252, 114, 65, -49, -10, 279, -66, -86, -125, -60, 32, -59, 30, 108, -182, -179, -6, -96, 51, 148, -16, 56, -232]
8055b32K94J01k14N3J97l98K79J17k26J15j74K47PL0m84L67r1O8j10L9n3k69L16
8078b1k5j20J14j2q9K32j24K43q1j27J55K83k83j8p5o7J39k66K1J84j31J71j48
8101d5K05j22j62O8l8J5J8m3J17J9r3K17J8L2l31J45k65J72R8Q2l63L74K8m75
8125c29J73j5J39R1r6j43Rj11J02M2J59L8N9K16l18J35j70j17r4K88Qk02J14j49
8149a71R1m4j4J45m27K18N0r9J54rj36L83o9j19J84q3o8m6M6R5L9R8j2m04J4M20
8175B36l18j2N0L0k73P4K45k22K13n3m6k9M57k77O9N6
$$ y = [-232, 62, 163, -51, 2, 199, -199, 80, 197, -29, 86, -88, 159, 166, 196, -288, 79, -12, 56, -54, -15, -68, -337, -21, -46, -166, -52, -64, -153, 79, -45, 198, 117, -10, 145, 428, 145, 127, 52, -15, 124, -142, -121, 63, -68, 103, -45, 160, 38, -124, -56, -94, -79, -61, -104, 13, 32, -61, 156, 174, 206, -125, 20, -245, -73, 25, 107, -256, 118, 146, -329, -156, -171, -32, 59, -37, -180, -171, -282, -180, -138, 21, 59, 118, 334, 16, 151, -19, -136, -230, 58, 66, -136, -22, -171, -80, -124, -138, 7, -420, -202, -152, -251, -97, -106, -242, 141, 72, -47, 137, 54, -14, -60, -14, 81, 120, 218, 206, -198, -184, 236, -82, -94, -44, -14, -287, -213, 32, -190, 23, -30, -76, -105, 352, 75, 144, 200]
8191B00
$$ Imaginary data points
##PAGE= N=2
##DATA TABLE= (X++(I..I)), XYDATA
0@%%%%%%%%%%%%%%Qj6J6j6J6k0K8l2M0m8N3o1P2q3R3j08J24j41J62j85K10k35
36a23K62k95L30l69M12m58N08n61O20o86P57q35R22j017J119j232J360j501J656
55H69j833K035k264K531k847L223l681M258n006O020p483R786j3964K3923r3112
70g7545p7774J79009N2609o9073j3589R2128J3598m6520j0339K0591l0265l9262
82f432j1334Q318K70q201k1867j534K1972l294l5655Q962M6365N489k0463L0063
96A2659L1445l5626l3545L8447L3392k6600k4997J5272J2635J696N328p844k0250
109B012l831l702j6408J2882L1621k4701n2715J3930L7827l3471m0009L9643M0996
122D074k1536O540O3838J5460m1423L843L6840j7889m5141k612J2466n978m30
$$ y = [0, 0, 0, 0, 0, 0, 0, 0, 0, 0, 0, 0, 0, 0, 0, 8, -8, 8, -8, 8, -12, 16, -16, 24, -24, 29, -32, 40, -43, 50, -58, 66, -75, 87, -98, 112, -123, 139, -156, 174, -195, 217, -241, 267, -294, 326, -360, 397, -438, 484, -533, 586, -646, 714, -787, 869, -964, 1071, -1193, 1338, -1509, 1714, -1967, 2291, -2715, 3305, -4178, 5608, -8356, 15567, -77545, -155319, 23690, 76299, 7226, -6363, 85765, 99363, 52843, 42504, 63095, 32830, -6432, -17766, -9448, -9178, -17379, -39246, -40780, -18808, -22102, -57757, -48795, -2430, 3059, -17404, 12659, 44104, 8478, -25067, 13380, 46772, 20172, -4825, 10447, 23082, 24778, 30106, 22262, 2012, -1819, -5521, -21929, -9047, 22574, -2127, -54842, -40912, -3085, -36556, -76565, -36922, 4074, -17462, -10922, 52916, 68376, 26953, 30796, 67636, 49747, 4606, 1994, 14460, 8482, 8052]
135H052k119l0171k5539M352K915l660J2444M174j4270K4635O1559P687m3575
148F484k6L6735n707k5479J0521J0745j9553o664J1112j6138k4770N151N641j2734
162b4682N108J4974j6173j3460K6487J1012l0178l121L4067K794j6010K9559L5931
175E6308k1575l1388R987J1381j3212l737K061j3499m26J9315p653l0047k454
188b4939N860k1598o538L0304J0877j4787J8514L4888q934k1942J2575P746j8513
201C513M290K3211j0704k2784J3226J3763k0068j4803L513j2783j3136J9983J4810
214B031k0594q141J8908k05j2134J5699J5360j4233J064L1206M729k3716J259
227A1233J4001j3691j2709J3025J77j7779M165J1370j7647j8366O388n397j7392
$$ y = [8052, 5933, -24238, -49777, -45425, -42510, -46170, -33726, -29552, -43822, -19187, 42372, 50059, 6484, 6458, 43193, 37486, 12007, 22528, 33273, 13720, 7056, 18168, 2030, -22740, -17589, -11948, -24682, -19574, -4600, -20773, -34233, -7746, 3266, -26912, -30033, 4034, 6828, -9182, 20377, 56308, 34733, 3345, 13332, 24713, 11501, 7764, 9825, -3674, -4100, 15215, 7562, -22485, -24939, -19079, -40677, -47215, -16911, -6034, -20821, -2307, 32581, 23647, 1705, 14280, 22026, 3513, 7803, 31014, 20310, -2474, 10752, 24515, 4447, -10356, -6843, -19626, -32762, -12779, 2031, -18563, -26704, -7796, -8001, -20135, -4436, 10924, -3309, -2245, 28961, 33690, 9974, 11233, 25234, 11543, -1166, 11859, 12036, -5743, -1578, 9792, -7855, -26221, -19833, -25230, -42622]
240d2622J7219L0991o615j1413K4613J7933j5605n844J0427j2592j5131J9258
252A0619J5630j8822r274J4582n102k0771J19M156j2600J754J7815k214p850J6861
266D903P431k3307j903K6619l804k8085J0253K9857p166j7495R907M191j4967
279c566M413J8057q441j6128Q120O085j4291p041K041q724k543J5145K286q483
293a3070J6378J7173j9877j5647K5999J2901k8290p699L2816J0016k1648n304
305C748O997j1339j0486L563o514j1496J0543J4012l080K812J1636q678j3020
318a1302J4547R922j9082l346K4462l07k1436R759J8713k0499j9924J9831J2469
331A3807k1744m853K0477j955j7304P190J0230j3051n698J5040K282q209M882
$$ y = [-42622, -25403, 5588, -1027, -12440, 12173, 30106, 14501, 8657, 19084, 6492, -8639, 10619, 26249, 7427, -1847, 12735, 7633, -13138, -13019, -8863, -21463, -19709, -1894, -4108, -11958, 4903, 12334, -10973, -12876, 13743, 9939, -18146, -7893, 21964, 14798, -2697, 7210, 11401, -3566, 847, 18904, 10463, -5665, 2455, 8540, -5751, -12792, -10751, -19475, -22018, -6873, -4587, -13070, 3308, 20481, 604, -15043, 10956, 23857, -4433, -12132, 20684, 30700, 9052, 3748, 10745, -594, -11080, -7517, -14031, -25527, -14984, -972, -4052, -1240, 10396, 1718, -11302, 3245, 13167, -5915, -9261, 15201, 14894, -6542, 3217, 21930, 1431, -18493, 1338, 13807, -7937, -12790, 7687, 5732, -11572, -4382, 5848, -7203, -12901, 2139, 4421, -3788, 1094]
344A094M371j0479j821J0329l244o237J1619O941r762L595J3756j4142k2743J0308
358f415J5474j5561j3154J7131J2212r148k808M014n840k122M902p177m291K0457
372G674J0742k0510m450K5916j44k9496L34K0368j0283j6092J7964J2299k0968
385f646o056K1092j216k0932M437J5865o022p041Q840L42p830O422N904j1276
399d117r29J5452j606j4765N573J2392j0398j1494O271K988n080Q043Q307j0508
413A29n912J0858r48j3217J748Q155q266k196J5995L432j1485M904R303j4110
427a610j0738J5345M622j7020L550K0928o214j7270Q891J0090j4719p259J3119
440A715j367j3549P507J4709n733o737O482k845p860J0393Q973j3085o009J3303
$$ y = [1094, 5465, -5014, -6835, 3494, 250, -5987, 5632, 12573, 2811, 6406, 20162, 6020, -16723, -6415, 9059, -6502, -19656, -2525, 9687, 539, -2269, 1745, -4095, -6217, -1315, -8492, -12783, 7674, 18416, -2094, -6544, 19372, 19228, -10268, -9934, 10434, 151, -15941, 2023, 14322, -6646, -12702, 8390, 7174, -13758, -9321, 6544, 522, -6519, 2321, 2663, -5167, 1255, 7159, -4117, -5046, 10406, 8800, -5965, -392, 12000, 1602, -9892, -3621, -633, -5713, 2330, 10637, 129, -5783, 5075, 4127, -9090, -7342, 813, -7453, -9649, 6346, 9778, -1707, 3197, 12500, -1610, -12348, 2997, 7619, -9401, -5851, 15077, 8863, -8407, 484, 10574, -4145, -11404, 1715, 348, -13201, -5694, 9015, 3282, -3455, 3027, 182, -7678, 2715, 11688, -1397, -7406, 5897]
454E897n76j3096O992J1642j2185r733J5173O878j4316k087J0820n199j0127O496
468c421L758p271M917J1539n880p945P822J40j2566M380J4997p693j4427J2637
482I87J4578r543p097O159n175j2794O281R969p403l132J0629n40q302Q239P593
497A0449j3588o436J3859K021j2389L506J1153o774o365R819r07j4387N044J4572
511I577n989j0982P805M247j0678J707J2593n071j1327O173N952p189J684Q117
525F619r447j1007J2246J1369r836l017J2749o16j1048M019N153j2081m905J1489
539A687J98j0979M850J0797o553n564R150l5j2037K865J0648k600k220R001k968
554F240j2786N957J2263j0288j4039Q295P445p766L33R901l662p693P950M296
$$ y = [5897, 5321, -7775, -783, 10859, -1326, -11059, 4114, 10992, -3324, -5411, 5409, 210, -9917, -3421, 337, -6934, -2017, 9522, 3642, -4303, 3519, 3659, -8907, -4527, 10470, 2777, -11650, 987, 15565, 6022, -1075, 5084, -91, -12885, -6604, 3365, -4038, -7170, 3459, 2919, -5383, 2856, 10449, -3139, -9575, 4284, 6305, -6084, -2578, 8575, 1801, -4564, 5255, 4348, -10039, -4995, 9577, 3588, -7394, 411, 4658, -6020, -4313, 8280, 3209, -8118, -1945, 4007, -3182, -1498, 6619, -2828, -13835, -1589, 9780, -56, -3073, 9676, 9060, -1988, 2031, 7184, -4897, -9802, 1687, 1885, -9094, -4244, 6553, 0, -5564, 3586, 3551, -8486, -5621, 5027, 2427, 207, 9208, 6240, -6546, -589, 11674, 1386, -12653, -4358, 3087, -4679, -4346, 5555, 1893, -5800, 2150, 6446]
568F446r511N82J0458n676j0145Q405O384j2081m257J2245R20q573M906O111q821
583b607r77J2921k911j5888L827J2988l983o715O844Q54j0290J207P265o069m788
598h322Q846J969q395O790J2458p424j1600P292N899j0386l493Q460k245n051
612e202P441L422j0444j301J0054j486p605N160M116p480J183J0866l662j0899
626e837N066N752r446j433J2318k565j3866M691J2311n886p080Q403K238q287
640c621M105R285q704q850R599L988j2163j469J1347j165p452O571N506q796l464
655e283P030j201m837N964L820q863k55J1215j058j0221J028M103n759j37Q363
670C909j080p274M768N691o323k581O556k612p638N779O145p732l178R697n59
$$ y = [6446, -3065, -2483, 7975, 2299, -7846, 559, 6943, -5138, -9395, 2850, 3770, -4803, 103, 6214, -2607, -3584, 9337, 6426, -9462, -5635, 7353, 3370, -3345, 3499, 4353, -5937, -4730, 2535, -3534, -8322, 524, 2493, -5902, 888, 13346, 5922, -5678, 1614, 7513, -2873, -6366, 2094, -151, -5202, 2239, 5661, -4783, -6084, 3970, 2484, -5121, 39, 4155, -3325, -2142, 8724, 5062, -5837, -771, 4981, -4465, -5898, 6420, 3855, -10011, -5320, 6991, 1105, -5975, 2428, 4666, -3621, 484, 9769, 1065, -7785, 1814, 5802, -6361, -7830, 3517, 2352, -5100, 1471, 6977, -1819, -5283, 1747, 546, -4291, 1673, 5493, -3370, -3625, 7590, 6532, -3689, -2661, 1442, -4317, -4454, 3909, 2829, -4445, 323, 6014, -309, -2890, 3666, 1054, -6584, -805, 5340, -2392, -5570, 4127, 3568]
685C568r192N490P130j0017m807J4773L379j5776j379J2529k753r583P422O191
699F975j0541k877J0985n32r692K728N443o425j434R632N94p296K829O560o591
714C58m900O192M65o409K637O029m058k764N794n68o792K484L593n595k228P586
730A824J309n847L311M088p386k574J0737m31j1114L160J0488n272p187Q669L786
745G561j2090k182J2194j233j0273L022O370o011l018P078j138o659N504P403
759F528n783l206P417r8p544K879N514p221l771Q830J520q726R73O915n049o559
775g381N270L797n064O52N812k410k193O181o8q184P06O826l623m236O667J806
791D558q314Q31Q769k882q201M484M527o226j103Q580k517r383L509P788n132
$$ y = [3568, -5624, -134, 6996, -3021, -7828, 6945, 10324, -5452, -6831, 5698, 2945, -6638, 784, 6975, -3566, -6443, 4542, 4010, -5682, -2954, 2489, -3936, -5370, 4262, 4856, -2440, 389, 6949, 358, -4542, 1650, 2115, -4294, -1657, 4372, 314, -2450, 3344, 2776, -4016, -1532, 2061, -3534, -5762, 1824, 3133, -2714, 597, 4685, -2701, -5275, 5462, 5031, -6083, -2923, 7565, 2293, -4894, 3775, 7561, -4529, -6711, 5483, 4250, -6023, -3001, 3369, -2642, -5660, 1418, 280, -6379, -875, 6528, 745, -2461, 4956, 4858, -2686, 193, 5707, -1514, -5285, 3545, 5065, -3661, -2688, 4227, -822, -7381, -2111, 1686, -3378, -2726, 3086, 676, -1517, 4664, 4596, -3588, -2882, 3944, 321, -3915, 2752, 4558, -3756, -2925, 5844, 2962, -5239, -755, 3772, -2454, -3557, 5023, 2506, -6877, -3368, 4420, -712]
806g12n193N560K274l968L455L686n989k684Q256J192o951J018N042m432l534
821b980O172r38r444J13P340l089l259P801K419q376J247J0060j621q056L184
836E73M397n318q17O568k267p409K878L863n735k604N826k17m232M511M887n794
852h90k439O201N21m998K626K767p389j726J0297J271j0460q79P420j544l113
867b335O086J482q196OO888j924o364L016K368n160P86N796k231m419M563L477
883C839n120j16N313k833l120O955M152j0264m773P595J048o775J267L824n668
898d676k083Q441L369o530j93L712k349j056N797M84o962N48N289l195l376L437
914F57k05n351L082N994n269n069P134M582o308j469M560k371m015O531M072p553
$$ y = [-712, -5905, -345, 1929, -2039, 1416, 5102, -887, -3571, 4685, 5877, -1074, -56, 4986, 554, -2980, 3192, 2254, -7190, -7077, 263, -2826, -6085, 1716, 4135, -4241, -2994, 7066, 5445, -2611, 573, 4970, -348, -1165, 5403, 3136, -4273, -1395, 2468, -3267, -5871, -45, -262, -4494, 17, 4904, -890, -3329, 2872, 3393, -1605, 1021, 3788, -3601, -5327, 4970, 6241, -4219, -5098, 2322, 778, -2335, 3751, 5233, -2963, -2957, 3931, 2007, -4357, -1341, 1027, -4133, -3347, 2449, 218, -4201, 362, 3839, -1281, -1397, 3916, 1083, -2037, 4918, 9070, -1194, -5967, 1628, 2676, -4099, -2832, 992, -4676, -6759, 1682, 5051, -1479, -1672, 2040, -309, -1365, 4432, 4916, -2046, -1498, 3791, 596, -2780, 657, 452, -4899, -1817, 4177, -1092, -6161, 973, 5555, -753, -2222, 2338, -33, -4048, 2483, 6555, -998]
930i98m018N495J005l826L354K569n695j899O586R90m837J345J580n666n75P584
946B994q32o445L036N887m176l666N685R93o147K254O326m241o877M546M773l998
962A12k689K930k990l163N355M393m160k156L004q49j004N248J110p222o03O135
978C451n24n355K864K490n535j346N748k00n426J927M772k505k609K373j116k586
994c577M756L655o037k956O256R76m319K893M172p097m841Q247M277p309k152
1009c056M789k719n137M487M427n733l020N402J398k202K300K710l309%N308k031
1025C614n694K470M826l975k890K678k071m883L110N778l349m855K097K490m34
1040a088K621J630l979j881M345J074k559K396J112n162r38O840m73p345J681
$$ y = [-998, -5016, 479, 1484, -2342, 1012, 3581, -2114, -4013, 2573, 3563, -1274, 71, 1651, -4015, -4590, 2994, 2162, -4283, -1247, 4640, 464, -3202, 2483, 3476, -2671, -417, 5909, 1668, -5209, -663, 4110, 112, -2577, 353, -2637, -5800, -445, 3948, -212, -2368, 636, -213, -1217, 4031, 5141, -2081, -2684, 3451, 2927, -2428, 436, 2926, -2609, -3955, 1793, 1593, -3833, -1906, 2866, 361, -2248, 125, -991, -3577, 1179, 4834, -1203, -4159, 2097, 3073, -1246, 1647, 5819, -1278, -6119, 2128, 6405, -904, -3056, 1733, -986, -6123, -1636, 2791, -2942, -5962, -560, 838, -1364, 936, 3646, 337, 337, 5645, 3614, -2080, 390, 5216, 1241, -1649, 1029, -1042, -5925, -2815, 2963, -386, -5241, -3144, -654, -1088, 1533, 3163, -816, -2697, 1648, 2722, 163, 2559, 3671, -1491, -2429, 4411, 3938, -3407, -1726]
1055a726O086l798n359M894K198o796j76P241k168p405K433O840j279j446L280
1070B819p43l811L417N410k731l839J532r24k973K563K308n601l681L843J254
1085a157l716J660L958k570j464N025J732m353Q43N203j669k959J925k41l811
1100a594J691M486l110n291J862K547k573P16L775l806n018M121L920l431q41
1115b546L496j417l011L863M713l867k085M960J035m995J078L510l720k875K929
1130A068J41n693p44L167n09j490J824k49k391L592N498k241k076L744O48l704
1146E85K014M358m196o086L546K672m970j745M164j021m818K524L904k400j996
1161c465L808J122k619Q10J711k114O55M019j330m361K104L557k946j327L921
$$ y = [-1726, 4360, 562, -4797, 97, 2295, -4501, -4677, 2564, 396, -7009, -4576, 2264, 985, -461, 2819, 2076, -1735, 1682, 7092, 4361, 522, 2054, 1130, -1843, 720, 3028, -2573, -6254, -2411, -1157, -4873, -3213, 745, -1825, -3289, 1736, 3468, -885, -42, 5161, 3492, 533, 2458, 2217, -1594, 97, 4583, 1473, -3818, -1956, 591, -1982, -1266, 2509, -1297, -6315, -2194, 1726, -1705, -2546, 950, -467, -3478, 385, 5098, 1231, -854, 4106, 5141, 146, 1224, 4734, 1014, -1861, 1068, 1209, -4484, -5228, -2061, -2570, -4060, -2236, -2485, -4876, -1284, 4214, 1973, -103, 3641, 4289, 585, 2599, 6957, 2761, -3325, 221, 2893, -2077, -3822, 342, -679, -5497, -2973, 931, -1469, -3465, 343, 1465, -1154, -344, 1367, -747, -92, 3927, 2597, -1764, 340, 3897, 951, -376, 3545]
1176C545r28n360J152M572k643m090K419R66m153J88M152j099k240K658K203j846
1192e04J136L640j236k188L308L50m334o26M123k080m853J845J561l954j202M303
1208g11K54l554J635L578j719r17L594N10l050J540K448k253j817L241k05m054
1224a480P90K789k640k036L256P31m452L54L701j963k478K920J683l448K96M076
1240B099m85k942K831J992k929m82K838q84k931J819J399l681j371L411r88l178
1256c482J919K264k906r82M673K34l987J520L788k251k312L203J448l971O8L345
1272B571j308k452J292J007k207N82K313k286j971K357R30k943k7L114j483k401
1288b912K984K035k353q33L414k5k520J521J729k552j157J933n25k099K91M46
$$ y = [3545, 2617, -2743, -1591, 2981, 338, -3752, -1333, -367, -4520, -4332, -180, -1279, -3519, -861, 1342, -504, 632, 4272, 3036, 848, 4156, 4506, 172, -454, 3669, 1589, -3264, -1419, 142, -3812, -5014, -711, -457, -4011, -2376, 1202, -517, -1434, 2160, 2670, -380, 1160, 3608, 1355, -462, 2779, 2574, -1480, -690, 2099, -541, -2577, 679, 1410, -3042, -2688, 1013, -950, -3428, -508, 1175, -2273, -1977, 2099, 1614, -1328, 1503, 3495, 566, 84, 2922, 2038, -893, 926, 2325, -1356, -2727, 684, -304, -3482, -1563, 701, -2205, -3187, 1486, 1720, -2267, -747, 3041, 790, -1522, 1681, 3129, -842, -774, 2571, 1263, -1189, 103, 1110, -1097, -515, 1798, -488, -2459, -102, 828, -2115, -2142, 972, -511, -2912, 72, 2107, -246, -1079, 2335, 2310, -210, 1311, 3040, 488, -669, 1264, 739, -1360, -1069, -623]
1304f23k399Q57L446j987l436L782L945l063j919M139L81m467O85M970k494m997
1320c180K146K374l096q22K671n28k382K159K734k048o85K722k65j918J291M90
1336A663l055m28L141n33l406O50K486j581p94L010K45k001M79J991p40j75J226
1353B178k427k342K390K015k808j692K699R8k171J952K661k571j550L855R34l934
1369g13j33L129j632l228K100J474l526j098L567J065j948R10P37j318R64M206
1385D556p28m723L43K632j084j601O59j229k374J028K130j109j450K793O22j223
1401g58J431K455j617j181K454N21l133PJ282k312q28K780n94m220q3L885N57
1418F46k082Q86R11j834L10L864m27l173P44R39j062K88K028j408k585J484K362
$$ y = [-623, -3022, -2165, 1281, -706, -4142, -360, 3585, 522, -1397, 2742, 3123, -1344, -659, 4311, 1817, -3180, -1034, 1340, -1756, -2578, 93, -435, -2817, -658, 2076, 28, -657, 2065, 1800, -118, 1173, 1663, -1392, -1820, 1321, 788, -2618, -1968, 518, -1063, -1857, 1153, 1398, -603, -124, 1867, 1127, 952, 2178, -249, -2591, -201, 1814, -994, -2686, 13, 111, -2060, -108, 2553, -18, -1568, 2287, 3221, -713, -846, 2283, 651, -2577, -477, 997, -2529, -3627, -60, 1005, -943, -33, 704, -614, 350, 4556, 3828, -895, -552, 2080, 996, -605, 54, -1175, -3549, -2521, -391, -1500, -2950, -157, 465, -758, 673, 3128, 1511, 330, 2784, 3305, 172, 179, 1461, -851, -1679, 1101, 507, -3713, -3796, 89, 646, -1436, -550, 361, -1473, -1163, 2701, 2274, -899, -155, 784, -278, 10, 2038, 630, -1955, -471, 1891]
1435A891j323j230J562k91j649J292J086k912j501L274O35k823n03J861o15R1
1451a155L179J40k668K14K587o1n38J557r57m133N88L690j367l720N93R89j710
1468b772j10K538n38k019K034K427r94l99J324Q41q27P35M99k253q74K408m29
1485A591k308J38K40k308m16L586N03l398o05K477K63l52J520K41j953L03K067
1502A589j95o64J121j37j899J149J760k106k372J761K053l094j556J535K59j655
1518b451J245J332j979q74K271J455k25R04k1j544L51K698j46k314M36J84k205
1535h83n37K588q16l266j07K963q58j747J328J684q21l78J299k65n84J603O61
1552A864j087J95R44j423r71K811O75l240j448J874j43j205P40N56k613j074K609
$$ y = [1891, 568, -662, 900, 609, -1040, 252, 1338, -1574, -3075, 199, 834, -1989, -2492, -631, -1246, -1155, 2024, 2164, -504, -290, 2297, 2236, 1698, 3255, 2298, -1835, -1247, 2443, 1076, -2644, -2051, -1062, -2772, -2882, -344, -882, -2901, -867, 1560, 566, 167, 1491, 2332, 1505, 2240, 2739, 486, -388, 2020, 1591, -717, -579, -339, -2647, -3063, 523, 1026, -2372, -2977, -500, -237, -589, 931, 1172, -781, -478, 1589, 1394, 730, 1851, 1714, -185, 964, 2724, 618, -1754, 7, 2060, -1034, -2590, -1055, -796, -2451, -1206, 126, -1853, -2727, -456, 999, 774, 1678, 1657, 113, 464, 3162, 3016, 702, 1138, 1322, -883, -1420, 1168, 352, -2914, -3021, -58, -916, -2663, -1335, 349, -472, -850, 449, 184, -400, 1203, 1864, 777, 972, 1916, 493, -478, 2333, 3008, -232, -1680, 194, 51, -1154, -414, 142, -2471, -3545, -936]
1569i36M91j286P07J532p63j72J857R77j180J115R11j959q09J920j068k540L38
1586h65J552k059k710J458K060o96l87R96l73J20K137Q80j267K4J066q28j018
1603I0Q21P79j726q21R20m35n97K031J55k269k39K058j14k003M81J537j485j050
1621a867R05r8j059J903K008k079p36K658J496k282O51J739j132k472Q17Q20j642
1638c70j041K17j309j481J685J520j228R3J861Q61n79J513P84m36k63N27j068
1655A286j228M69N21j872j246J281O2j095N36J344l81n5P41l35l78J631K12k204
1673g11q16J878K22k051R18K004j564j143K358J018j526K70J326q88j992J250
1689E53P50k278j570J096L7j027N10R92m88O35J597j9r07J776J125j085p18J410
$$ y = [-936, -445, -1731, -1024, 508, -255, -427, 1430, 2407, 1227, 2342, 3253, 1294, 485, 2405, 1337, -1203, -865, 687, -1372, -4082, -2624, -564, -1260, -1647, -651, -1024, -904, 1233, 2113, 846, 870, 1936, 1108, 90, 911, 1690, -36, -857, 63, -372, -969, 1062, 1217, -1052, -1291, 767, 653, -1350, -869, 668, -817, -1867, -962, -1060, -2119, -216, 1792, -287, -1023, 1635, 3131, 849, 1500, 3239, 2107, -365, 452, 1272, -370, -1411, -1194, -2503, -3984, -2299, -779, -2007, -1914, -53, 808, 229, 1742, 2526, 2090, 1827, 2354, 1286, 58, 527, 1048, -824, -2070, -789, -727, -1822, -1286, 58, -323, -378, 363, 28, -350, 1281, 1493, -711, -1527, 351, 573, -1478, -560, 1444, -120, -1263, 1095, 2113, 587, 857, 2183, 1295, -697, 553, 1303, -975, -2545, -1449, -1412, -2439, -1929, -937, -1425, -790, 807, 788, -119, 1657, 2782, 1697, 979, 2389]
1707B389m43k013J22O60j191j402R06j73q16P79J508j124r53J328J015j008K53
1724a63R37o53p26J336P54j300L6R02m91m56J026O65j660p73J239k86j688J73
1742a128N84j159j48R33J3j074J337J237m30k6R82k43k03J314J021j649j321Q63
1760I03m08j169M35N14j639j070J942J133j704m07J004l43m45J105P49j079j80
1777f59J452mp09R56K08r41K95K027q13k046K29J406j158j054k28j250m26R70
1795a745R88j004p35R56J143L79J124Q49n51k30J483O00q16m58j164j421k82J043
1813A59m77k351k19K059q7j050O63Q35p00R39J644m94j114Q33J192m70o00L45
1831A107j036q05Q68J347j61j061j23n72J23J553j94k622j127J643O91j180k22
$$ y = [2389, 1946, -67, 55, 715, -476, -1878, -972, -1145, -1961, -1182, 326, -798, -1751, -423, 592, -416, -163, 774, 121, -605, 731, 1485, 185, 221, 1123, 632, 176, 1202, 1867, 207, -566, 673, 387, -1301, -1128, -544, -1703, -1851, -918, -905, -1979, -642, 595, 165, 139, 1121, 878, 675, 1989, 3010, 1361, 40, 903, 495, -674, -239, 275, -1364, -2434, -492, 641, -1063, -1470, -466, -809, -1254, -149, 600, -479, -659, 793, 789, 80, 1036, 1244, 303, 598, 2625, 1812, -234, -5, 1401, 243, -811, -1039, -2289, -2715, -1745, -757, -1761, -2496, -1540, -397, -18, 1106, 1955, 1404, 1174, 2657, 3257, 2441, 1983, 819, -602, -884, 159, -318, -2669, -2888, -829, -916, -1966, -1303, -468, -1168, -229, 1415, 921, -193, 640, 1832, 1362, 762, 1107, 71, -734, 134, 1481, 1320, 259, 136, -436, -313, 1240, 1046, -1576, -2703, -1060, -369, -1549, -1771]
1848a771O45k52J1J488P99l24O32J357k43m19M09l59j369l19J073j361j752m13
1866b168K2m43J014J78j391o19K349K489k38n55P89N03q2K95J95j227p22O07o04
1885C92p23M19j35j951JJ337J82j420K62J076N69j34N55p04o35J200J475n00j036
1904B30j08O79K13N27j5q25j152K36L97j12k6k04j234p72R25N49r45n53J448P66
1924B4K67J10M96n57P11J238n00j099K06O15l24j15J19j171j900O0R88m48n17
1943a797M13j73j71J113K239r49j503R16J242K10m49K20j45l54K89n0j081o67
1961f97O71n33o81L25l70k93K21R59L77m06M4P9N6R45J088o67j665K77J076K95
1981A101l73J37o01o84Q56M42r03j061K97K14n76M09O99m83k56O56Q35j281j80
$$ y = [-1771, -1126, -1378, -1367, 121, 920, 596, 1228, 2585, 2342, 1923, 2332, 1973, 604, 285, 1358, -3, -1755, -2168, -2146, -2589, -1575, -1397, -2788, -3407, -1058, 1431, 1193, 638, 1427, 1930, 1848, 2143, 2338, 1111, 389, 996, 392, -331, 88, -47, -1998, -1997, -660, -478, -1898, -1636, -560, 9, -125, 430, -274, -909, 291, 1766, 1266, 230, 122, 801, 1014, 1541, 1526, 701, -451, -215, 182, 70, 44, -160, -1394, -2166, -1241, -692, -1637, -2190, -742, 24, 291, 401, 897, 340, 1051, 2289, 1789, 690, 896, 1511, 1187, 1072, 1191, 20, -1880, -1820, -832, -1280, -1797, -1384, -1557, -1728, -615, 1624, 675, -828, 88, 1330, 1540, 1091, 1311, 1166, 812, 1101, 1051, -30, -697, -26, -559, -1240, -915, -1285, -1578, -1357, -398, -21, -427, -383, -304, -248, 697, 1785, 1118, -547, -270, 806, 1101, 728, 865, 264, -420, 436, 878, -25, -1086, -789, -575, -1151, -742, -43, -526, -782, -126, 709, -572, -752]
2000g52O57M59P6O27j20r54j04J424K21j065r04k86l38N99J275n66j120n73R36
2019e08L82J92J31m98q06J173Q31o20m17P35J18k78k56N61m12m77O97J58j065
2038c59l52M9J26K65M85M8j189j81P70Q46l00j61l13k96P37J198k3j043o43K89
2058d7k22L40K11p39o56O34P40K29k47J97q0k9O00l36j082k89R99N63p98p13j87
2079i12p0J49J270l75j230K74J439O23k78O38j63j198J19R93j05j111j267p4L04
2098i74q1L34k38n79R46J060J00k72M08N2l1J66J2o71j93J86K72n96r8j21q10
2119a128n6J051P11l35n77K0M41J034J19j653j308M11J128m52n31K75P60m0M18
2138B88J294k78j64J51J67l6n62Oq56q91j25K05p37j109M20N16Q61N61L0k32P84
$$ y = [-752, -95, 364, 440, 1067, 947, -7, -111, 1313, 1534, 469, -435, -721, -1059, -460, 815, 249, -871, -1444, -508, -126, 66, 197, -301, -1107, 66, 897, 277, -140, 595, 713, 435, 179, 740, 328, -149, 548, 706, -359, -711, -662, -536, -271, 214, 262, -927, -1108, -338, 508, 208, 47, -266, -562, 175, 1373, 1350, 307, -336, -47, -269, 71, 282, -457, -1113, -479, 261, 490, 243, 440, 360, 331, 931, 595, -487, -776, 223, 786, -12, -725, -912, -982, -833, 437, 62, -1168, -894, 545, 1168, 890, 1528, 1365, 167, 286, 1279, 1174, 63, -1204, -1278, -974, -1055, -721, -959, -1538, -592, 468, 568, 296, 704, 756, 725, 891, 903, 232, 39, 225, 497, -99, -197, -318, -1128, -1184, -133, 578, 243, -334, -314, 127, 1161, 1280, -373, -1681, -1270, -142, -594, -1125, -850, -90, -130, 288, 1582, 1304, 1140, 1291, 1458, 1422, 860, 866, 10, -881, -1006, -801, -1538, -2647, -2227, -1711, -850, -289, -259, -491, 293]
2159B93J703K41r14K70K66l52n43k5k82j516r86O11o2R7M39l91P7P20J026j23
2179E49o57k84N39K13L33l9n10k51Q07K41n65m07K26J24J95L85J13p03o28K45
2199g4P1m21p71p13m86M37J513J51n66J2J296J067L76J86m85j53P8N00p81r01
2219C36r14n53j54j7N9m84m84L71Q91M08K74O4K05Q57J054J41q26o14M53K92n43
2240H16o67k99p13K94P72J0n42j09l12J08k36N55n28q94O46R99M89m17N8M6K50
2261C26O12O49n43m43M29N28k64n10p70p29m73N37k7j005p48N20Q42L65K34j21
2281e91P4N53J246P21k42m55l17J89J7k83p05m82k79J95k64Jk36o81r4Q70L37
2302d26n18k42Q94J204R8l30j94m91L44M21K05l36l29L17P5J18r5m38j351k53
$$ y = [293, 1996, 2237, 1323, 1593, 1859, 1507, 964, 939, 657, -859, -1845, -1234, -1296, -1199, -760, -1151, -1074, -354, 672, 549, -108, -392, 147, 360, 693, 654, 144, -107, 700, 941, 376, -31, 195, 319, 514, 899, 1012, 309, -319, -74, -3, -424, -1195, -1908, -2394, -1957, -444, -293, -859, -847, 449, 1516, 1892, 2078, 1593, 1440, 1518, 2018, 1237, 336, -578, -1131, -1285, -1302, -1243, -1727, -2211, -1840, -949, -541, -267, -203, 2, 859, 1913, 2054, 1228, 614, 1067, 1359, 816, 149, -150, -863, -569, 203, 213, -329, -438, -750, -642, -878, -323, -851, -1745, -1099, -100, 389, -28, 30, 76, 326, 938, 1587, 1044, 601, 1030, 1558, 1294, 784, 14, -715, -1188, -651, -678, -1683, -2431, -1911, -1069, -704, -470, -591, -517, 36, 1282, 2003, 1761, 1306, 989, 1178, 1195, 912, 207, -275, -554, -359, -623, -622, -858, -1539, -1633, -763, -426, -944, -1186, -292, 912, 1010, 680, 486, -5, 339, 760, 965, 629, 300, 617, 692, 810, 715, 277, -1074, -1327]
2322a327N77J66j65k36l61J35N70P10l37l94N50J047L07j68l33K28J30J00p0o28
2342E01o34j58K43l77n9m89p82j56P96P05J66l06L72K12N74O36m99n36j91P51
2362G69L83k56k99J20Kj5n78o91l37j57J63L39J22j14m28K36P35M22l68p85L9
2383f98O72O99N79j86l49n22N27J59m45m49j33j98k28K25Kj68l30J62Q9N7K23
2404c12J08nL81R2J9n53K1O32O99J18m16o49L5L44o0o90n89K9J73L32J58N8r3
2427a68o56k57N99P0K84l45m7J019P16P2l66m5k92J35n5l13p78JO92J09o31p73
2449a029k59N96J38R3J79J45l91L18P09M69m89l97J6L02K71K1m71p11J31K03m4
2470b00K3J69j9K24L46q8p64m12Q6L2M4k40J45k0Q70M51J26l63m33N45L1O33j2
$$ y = [-1327, -750, -584, -749, -985, -1346, -1211, -641, 69, -268, -662, -112, 935, 1242, 1074, 741, 969, 1099, 1199, 1129, 501, -133, -291, -48, -425, -484, -973, -1755, -1911, -1115, -410, -244, -550, -178, 34, 608, 1244, 745, 209, 18, 769, 1152, 896, 597, 717, 719, 704, 126, -565, -902, -1059, -896, -557, -435, -549, -977, -741, -6, 416, 48, -737, -698, -26, 673, 1252, 1066, 717, 195, 722, 881, 436, -13, -146, -344, -572, -347, -345, -513, -843, -681, -592, -535, -312, -204, -209, 172, 264, 283, -270, -249, 383, 1082, 1200, 784, 135, 170, 514, 454, -236, -825, -796, -623, -291, -133, -75, -168, -824, -1081, -482, -412, -128, -473, -520, 499, 1215, 1287, 921, 876, 584, 719, 664, 351, -427, -426, 266, 375, -256, -1029, -1288, -692, -554, -461, -282, -137, -528, -210, 499, 968, 479, 82, 98, 400, 671, 692, 221, -490, -359, -156, -200, -177, -8, -27, 197, 543, 455, -309, -721, -635, -603, -559, -799, -654, -674, 196, 647, 773, 410, -23, 522, 553, 1186, 1174]
2493A174m70n96L32k9k93m59l99r67J23J83K06O01p4L25O72M15J17J8R4n1m4J05
2515I83n76l71j90k62K59l37k10k40N24K61J58p6k92L9L5L18M66j78l66n22L56
2536b21J0R8j31l19L98O63L63L60r4q4P3m60n36l96n61k38kj34M2K10Q2K71K99
2559c07N07P2J51L92O14O6q4m9l04m58o01p0k98q14k13qK38J6L24K49J40M67N23
2582E53L35J30l93R6k22l11P5p18K64M04q5l4j94L29p6p7j99j1j3k07K39j55R
2605b61j42j96r0j27k7M95L35L22j5N39L16M95k88l43k17l67n80m54R7j74k82
2626i64l27p5K17J66P2M36N43L94J86J44m8K80P8j34j03k10o15L92k89j59n21
2647e37j90k68K94K20J39J48j90K55M8L0L6n72J81L13O11Q8M3j18L6K96m42N0
$$ y = [1174, 704, 108, 440, 411, 118, -341, -740, -1707, -1584, -1401, -1195, -594, -668, -343, 329, 744, 861, 879, 973, 922, 878, 983, 407, 36, -154, -416, -157, -494, -704, -944, -420, -159, -1, -77, -369, -330, -295, 23, 489, 311, -55, -577, -221, -211, -113, -244, -563, -165, 498, 861, 1221, 1127, 1043, 1116, 656, 120, -276, -837, -1075, -1077, -1211, -1169, -959, -877, -606, -307, 200, 272, 423, 815, 1429, 1495, 1411, 1362, 1058, 600, -1, -71, -369, -1183, -1396, -1404, -1166, -1150, -826, -577, -437, 30, 553, 888, 1018, 625, 721, 499, 188, 263, -455, -191, 213, 128, 94, -100, 229, 153, 76, -123, -134, -147, -354, -115, -270, -261, -403, -599, -689, -816, -843, -348, -13, 309, 294, 833, 1149, 1644, 1356, 1013, 796, 429, -151, -605, -508, -682, -964, -1291, -1366, -1149, -983, -911, -475, 68, 462, 648, 792, 744, 1024, 1102, 968, 865, 655, 40, 432, 143, -16, -537, -727, -995, -701, -481, -342, -194, -384, -129, -81, -51, -15, -587, -406, -93, 518, 606, 649, 531, 567, 863, 421, 471]
2669D71l22j05r8k28L04j72o65k74L57P3p9K7j36N92J81L88K71p4j18J90K94L37
2691A214l88n85P2j29k17j29j82k23k36J25J02Q2l70K61J19K58p8K18j8K80M66
2712F42N01j64k18j40PQ9l36k95l54k85L90j45j46m06o9L4q0J80K44K20K35M60
2734C64M51K46Qm36l7J92l9l84m30n8j70K81O8m68l88Q0J34M12j17O6m4Q2J22
2757f5L33k39K8KJ87L30P5r2l28m5J81N3k7k43k78J08p7j7l19o39l56L03L65J95
2781e65K01J44M41L41K65J87j43N5M5J62o6o16m22o38K30Q8l74n68J90n3K07M21
2803d68J36j6K82K58P43j18k99N7k48K13R7m12j52l10p2L85k34qj78j60K57L76
2825A29k87k09k04K21J80J94Jj29Q8L43K1O3k26j75J33L24K31J23m51n31J85j59
$$ y = [471, 149, 44, -54, -282, 22, -150, -815, -1089, -732, -659, -738, -711, -847, -255, -74, 314, 585, 511, 393, 583, 877, 1214, 826, 241, 313, 184, -33, -162, -344, -567, -803, -678, -576, -494, -864, -603, -484, -226, -304, -86, -104, 176, 642, 1143, 979, 761, 621, 628, 717, 381, 86, -268, -553, -163, -308, -454, -860, -929, -895, -975, -795, -551, -331, -96, 364, 815, 1061, 1069, 633, 596, 788, 749, 365, -65, -123, -293, -12, 56, -412, -800, -720, -586, -174, -291, -225, -269, -187, -65, 268, 29, 57, 59, 246, 576, 651, 559, 231, 186, 367, 420, 393, 150, -128, -20, -97, -114, -433, -1072, -1428, -1125, -760, -565, -364, -220, 221, 562, 827, 1014, 871, 926, 971, 1133, 1067, 451, 29, -609, -379, -291, -665, -1233, -1043, -1096, -889, -468, -332, -348, -66, 192, 935, 817, 518, 575, 327, 540, 637, 225, 73, -237, -309, 76, -158, -166, -344, -504, -247, 129, -158, -367, -571, -350, -170, 24, 25, -104, -16, 327, 348, 411, 185, 10, 143, 467, 698, 821, 370, -161, 24, -135]
2847a35k33o4n16q8K54M30K89l67J51K50L1L33K72k28K3M07l4J2m86n6j72m1J92
2870B24l24l91m79K64L25K81l89k74L88K05O71k2o4j63L5K38qj21j36j24o0K67
2892C43j73o2m12q4r9J58l4j53r5M21N19j32M8k49M4K73J85l16l81J0J90K25J02
2915C28O2m58k36K17J51K12l93n4J13k32K96j72j54j1j41K84K72k87K38l7L56
2936C54L8J50K7n7J80j40j42j81n09l21j23J68J5k61MO5N41K83j38K92j46R0J99
2959C88N83n6k12k89j61J36m86j23l94L28k57J95N6o6K81J4K88K22j84l61oK72
2981A68K65k77k87m18L84L70J8j09l12L05J46J53K11j83l91k2q9Q9j15k78p2j43
3003e87J9nK65k20K66N78M55j77J4mK19k36j05k18l63l37j67M55j91n3j82k27
$$ y = [-135, -368, -432, -948, -1036, -782, -352, -63, -430, -279, -29, 2, 335, 607, 379, 402, 809, 775, 787, 301, 245, 73, 32, 224, -100, -491, -970, -706, -381, -100, -489, -763, -375, -170, 501, 479, 415, 252, 287, 525, 517, 396, 260, 136, 76, 343, 170, 108, -304, -388, -487, -329, -363, -516, -611, -190, 329, 197, 245, -4, 40, 313, 498, 182, -199, -189, 1, 226, 328, 390, -68, -304, -87, 64, 276, -117, -171, -58, -290, 6, -166, -320, -331, -472, -188, 84, -203, 35, -2, 354, 392, 542, 569, 512, 692, 552, 410, 229, -280, -601, -724, -556, -541, -802, -798, -733, -192, 91, -47, 245, 99, 189, 388, 971, 915, 703, 414, 253, 389, -97, -220, -614, -286, -543, -348, -292, -358, -77, -63, 225, 447, 263, -98, -104, 168, 433, 156, -131, -549, -165, 205, 223, 114, -198, 107, 253, 406, 617, 434, 43, 21, -68, 21, -94, -372, -444, -587, -568, -573, -308, -528, -262, 316, 771, 594, 608, 604, 823, 587, 482, 264, -99, -436, -603, -148, -339, -392, -574, -801]
3025h01L54L79M6k1N7L19K56l1p7Q9l44QQ4m8j96l85L4j83L00j57j80J18K78P4
3049b7r2K16l69J39K03K37j56l25K2J04L01L10j71k91m3o9L57q3j83k00J12k43
3071b51M58j26m08l43L25P2J68j51J04J41M08J56R4k15k99J61M44l05m41o3j0
3092h1J11r8k50J93l86k53L93K47Q0J2M0LM8L60j80J60Nl01L20J23m70m6N8P8
3116A66L9n08k10n1K33J3l9P4k39J00K11M83r3J97k51K25K88K51k46m77J1l11
3138a34J26P0j51k42On3R5m02L04j8L75K21o8m0K7R0J64l4M3J7k84J85nO3k00
3163A55j27j56J12m7j39j63k7k67J24L80p4lK2k02L87L68J98j67P9K29m8J44k55
3186E23j38q4k87p1l86k25n1j75M61l35M0j6K71J28N13J61J56K81l03J71L4k42
$$ y = [-801, -447, -68, -22, -43, 14, 333, 589, 558, 481, 570, 226, 234, 318, 270, 74, -311, -277, -460, -160, -317, -497, -379, -101, -27, -119, 97, -272, -133, 70, 307, 151, -174, -152, -48, 253, 563, 392, 101, 58, -11, 346, 263, 80, -120, -8, -251, 207, 81, -327, -670, -345, -273, -105, -256, -152, -11, 397, 553, 647, 432, 133, 294, 738, 433, -8, -71, -81, 30, -68, -318, -125, -511, -764, -371, -124, -44, -32, 8, 11, 59, 419, 239, 399, 404, 103, 423, 546, 76, 30, 88, 166, 205, -303, -513, -564, -331, -318, -357, -283, -522, -422, -211, 272, 179, 376, 125, 350, 638, 889, 643, 166, 177, -134, -8, 62, -89, -331, -325, -378, -283, -685, -381, -399, -24, 197, 129, 89, 116, 206, 370, 336, 379, 396, 112, 297, 292, 355, 155, 28, -128, -16, -63, -202, -365, -392, -659, -535, -155, -229, -232, -210, -412, -25, 343, 541, 374, 453, 682, 634, 778, 523, 385, 301, 14, -57, -443, -668, -719, -894, -433, -768, -728, -744, -473, -345, 168, 329, 485, 766, 463, 634, 668, 426]
3208D26r6j88R7j03k58j64k98q8K11j33j5J66O9J96J73J76k25P1K09l9L48M8m24
3231A59L97P3k92K18j24j03l96L7J62j41l49k87l3k67L64J4J90q9R1M65M37j74
3253C52L21N7k8J50k04j82m23J67k44Pm7l95j52N2J03M0k72R4L24J84p0J91K33
3276B58O8o8L11K76j95k88mk63K82j30k28Ol86J00l10O0j21R3%J06n2j38K28K74
3300a21K42L43O8J14K81m5J25l28j32j15o98l1O3j51j60n28K10N3L37j11L68K40
3322B4RM49P2L7j46o0Q0ok23j05k19J72j98R1j1j5J08o2k45K07k8l50n2R7K08
3347a66l21R7J07J34m2N16K10k28L81k20L83J13p8k09l44l94l04p4j49l56k58
3368a202L3J94L67j0O78J49K18K7N29j32L17k95P6l28n11m4l74Kk75P6k93J48
$$ y = [426, 330, 142, 239, 136, -122, -286, -584, -672, -461, -594, -609, -443, -374, -178, -5, 171, -54, 17, 226, 187, 535, 583, 159, 556, 629, 337, 555, 431, 328, -68, -31, 131, -10, -359, -646, -679, -946, -582, -568, -378, -467, -376, 89, 526, 352, 673, 730, 702, 852, 648, 466, 43, 210, -34, -27, -74, -469, -621, -569, -466, -426, -698, -604, -280, -96, -166, 25, 258, 326, 258, 569, 845, 650, 362, 358, 95, 377, 247, 19, 25, -361, -261, -571, -511, -632, -539, -539, -433, -485, -623, -395, -121, 121, 464, 532, 646, 927, 882, 1007, 679, 547, 432, -266, -297, -234, -385, -545, -1073, -863, -810, -473, -584, -216, 24, 33, 482, 554, 591, 445, 385, 465, 459, 236, 131, -88, 84, -114, -23, -34, -49, 59, -3, -248, -41, -69, -419, -471, -374, -166, -487, -390, -283, -149, -191, 325, 535, 307, 688, 468, 851, 964, 886, 677, 333, -61, -365, -439, -588, -944, -1202, -1169, -975, -608, -618, 60, 209, 427, 454, 983, 851, 1168, 873, 949, 621, 110, 66, -308, -306, -581, -505, -798, -650]
3390f50J04K19J84j89L71J56m08J70j54M59n57J39J58j11n0L64J4Q9L07j15m7
3411D53j69K2j42k67K04j97m80m6j73J66k54J98K76J59j40P84k6K68L6J89K47
3432A108n7m58o1l52j84J5n53M8k57%k5j33L17M81q4R6L36J21j1K73l35K26k80
3455B31J84k3k36K7J45l22j30m6j06L7J36l8j54j64J83o4MK1P1J46j9J38J01O
3479A28O0J98q6K26o5J54j03j75l2k30j96N6k64l67K49L7k93J85O7M3J2N05K12
3502C21L9o1L88j2nLN7j63q6k13j83l11l80j25k1lK12j4l8L03J48J62J61M9K14
3527D42K06n7K75k94j68M9j01k82l3k95j48J09Lj6j06J70k42K34r2M95k97j47
3549b95J73K49M0j88O2J37K17j49K64K7j28L9n2K8m21J00m14j99n0j02j60lm7
$$ y = [-650, -546, -327, -143, -332, 39, 195, -213, -43, -197, 262, -295, -156, 2, -109, -159, 205, 219, 308, 615, 500, 453, 284, 306, 164, -103, 101, -96, -576, -622, -795, -629, -883, -685, -409, -250, -390, 394, 368, 636, 672, 861, 1108, 1051, 593, 532, 180, -4, 11, -542, -494, -751, -751, -776, -909, -592, -111, -195, -99, 237, 358, 347, 620, 285, 511, 231, 415, 392, 156, 183, 328, 6, -124, -170, -276, -239, -103, -141, -295, -459, -276, -340, -336, -315, -244, -98, -117, 21, 122, 128, 188, 386, 300, 526, 461, 615, 512, 337, 305, 75, -121, -65, -329, -696, -447, -410, -703, -518, -451, -408, -396, 109, 321, 360, 299, 687, 675, 670, 673, 730, 567, 481, 268, 85, -226, -606, -731, -752, -755, -543, -557, -595, -292, -144, 18, 179, 228, 442, 648, 591, 866, 572, 404, 453, 352, 70, 37, -258, -406, -297, -294, -310, -416, -246, -488, -254, -346, 149, -148, -295, -122, 127, 167, -21, 41, 178, 395, 246, 510, 537, 409, 448, 396, 424, 3, 103, -311, -510, -560, -662, -822, -825, -872]
3572h72K74j09O03J43J79qO64l7K47m37K2Ol24Km03j91m23J35k73K24q3l9K88
3595d12M9K15p2K44K05K40oj15P0o0J24j41N4Kr5j71m5l5k21n5Q5k91k57K23j5
3620d80j52n9K48J88L44j05K14J76J30J76J28J09m4k64l80J00k85l61j27j16N
3641e55M6l19j1J1M21M60k43q1L25j59L66L09j16k9o8L5q7QL0k93k83K44j00j91
3665b80l2j35m0l10J29J48p7n5J80N44J3R4J27N27j16J3K15j47l76j66J68l61
3687F3n35rk31K00k30K43j71P3K24M3L55L75J3k47J03M24k37q7k62J5oq3k0k8
3711a5j15j33R4o8K08k11j35O2n2m3k24K98J00Oo2K53L28J49j13J46M41l44l9
3734E31j25J65l32k10m13j5k77m2J68j58J65k78M34L28J23L26l22K59M68J71l21
$$ y = [-872, -598, -707, -104, 39, 218, 210, 874, 837, 1084, 647, 669, 675, 351, 353, -50, -241, -664, -529, -802, -578, -661, -700, -412, -363, -148, -220, 24, 229, 469, 463, 348, 418, 358, 482, 341, 395, 397, 302, 131, 86, 51, -170, -225, -140, -431, -688, -465, -480, -632, -691, -443, -255, 89, -16, 198, 374, 504, 680, 808, 917, 873, 609, 229, 329, 44, -317, -444, -560, -555, -509, -828, -839, -828, -407, 53, -190, -271, 54, -105, 261, 570, 454, 425, 357, 392, 305, 313, 343, 50, -233, 11, -89, -280, -312, -447, -487, -797, -668, -520, -597, -652, -472, 72, 85, 179, 306, 833, 717, 730, 945, 798, 422, 256, 424, 63, -472, -481, -712, -512, -742, -499, -670, -597, -373, -330, 25, 400, 413, 166, 269, 693, 456, 369, 107, 122, 116, 33, 13, -15, -130, -263, -169, -237, -29, -240, -375, -313, -365, -408, -632, -334, -234, -228, -290, -37, 291, 440, 327, 473, 914, 570, 531, 406, 571, 239, 29, -384, -399, -676, -718, -550, -708, -543, -821, -387, -59, 64, 390, 68, 327, 795, 966, 645]
3755F45j33k14j58p8r0j64j05j42k7Q2j82M11k49J24K31Q9JL4j5M8J15k51K30
3778B02r3M5J40P6j15q7J85l9m29P0r8mk78N5q8j52m8J81J33J2L35L53O7j06K59
3803E76p4J43k31K8m48K36n0l13j55M6M3k59ML03l71J75J97N4K18J92k99l8Q3
3826F0J14J31q3J39o7l13QK96j06j10p4R9k50j04p2k8j67L2K91j36l36O97O4j0
3850G5J23K48j71J65K15j66j56m57L2J14j96K72o47L8rM46KNK68Pk58L91k35K3
3874A29J33j64M8n3m09K94L5r3K8O0L9O7N7j08J73k8k46n6j47J57J7l79J10j08
3898d44L63M3K64M4r0L8M73j92j05l39J67k85l48K80k29l29R9K33J64j14K4K46
3920c7L1M73l4p9J59q2R6k60k07m5l57M6k8rj2K17j71M07j44J63K84l78J03K02
$$ y = [645, 512, 298, 140, 62, -28, -192, -297, -439, -466, -384, -566, -155, -404, -280, -49, 40, 41, 75, 60, 108, 223, -28, 202, 109, 154, 294, 370, 255, 168, 353, 314, -115, -45, -143, -147, -425, -370, -458, -610, -658, -477, -344, -332, 3, 356, 423, 317, 576, 502, 645, 414, 442, -6, 230, 180, -133, -288, -242, -199, -458, -454, -151, -522, -347, -150, -96, 122, 314, 15, -23, 60, 174, 305, 222, 361, 294, -19, -11, 285, 179, 69, -5, 94, -156, -260, -332, -360, -527, -495, -204, -340, -676, 21, 85, 75, 198, 446, 275, 440, 655, 489, 333, -124, -92, 22, -174, 98, -549, -511, -520, -74, -72, -67, 201, 208, -50, 341, 106, 129, 262, 98, 146, 93, -316, -22, 13, -80, -52, 8, 47, 114, 171, 63, 236, 208, -38, -94, -241, -84, -67, -446, -336, -444, -81, -38, 226, 270, 180, 218, 691, 499, 394, 55, 222, -63, -411, -131, -360, -689, -590, -357, -193, -307, -283, -37, -6, 467, 433, 354, 513, 431, 527, 267, 60, 15, -342, -296, -324, -333, -345, -128, -299, 108, -36, 127, 411, 33, 136, 338]
3944C38j82k49J43j31p8o1RJ7J26k2M23k24L2K78l26p4M01J1m79j50j58L4m6m6
3968d14K28J03j23K20L95l45J91K75K1m28J93j21l97J92j26Oj46Qo3m3q4N23J53
3991B18l86L58R3QMl0m4n17L15J65o9j06P2j78p9k0J87j7k58J54L45k91R2J15
4015A31j94L3J55j96r0m8J12L25j68J9k08K30J3K20p0j78k09r7J05j78J86M5m3
4038a05j91L40P4k2N7j18N3L14r9qk66J7J59k08J41l87l5l3L10O9m82L9J18J82
4062h1l07L77J16j40k4K97J0l8L8j40J29j30J31k59n9M0j2j53J59L7l07J67o8
4085b17M5k4O5J75j74J92L0q7J06j52L96k06lJ47k78O5K05r0l64Q4Qo2m3q4J07
4110a59j88k3J01L83O9l93L34J33j1J52p1j30L6m6o7n3k25K88j52k15l45L69k78
$$ y = [338, 156, -93, 50, -81, -159, -220, -211, -194, -68, -90, 333, 109, 141, 419, 93, 19, 420, 431, -48, -198, -356, -322, -368, -414, -186, -83, -206, 14, 409, 64, 255, 530, 551, 123, 316, 195, -202, -10, -136, -130, -276, -268, -331, -374, -458, 65, 218, -168, 190, 283, 291, 295, 265, 221, -296, 19, 184, 115, 9, 81, -97, -176, -196, -9, -26, -284, -130, 215, -76, 16, 131, -63, -30, 125, -71, -161, -209, -97, 228, 60, 79, -129, 101, 114, 334, 264, 86, -123, -220, -115, -293, -107, -62, -105, -296, 44, 118, 96, 153, 35, 88, 402, 303, 295, 29, 46, 205, -3, 138, -249, -284, -317, -7, 62, -420, -381, -263, -81, -388, -11, 105, -35, -59, 238, 248, 210, 248, 108, 237, 107, 238, -21, -80, -40, -52, -205, -46, -9, -316, -149, -217, -172, -196, -131, 44, -130, 62, 92, 5, 111, -41, 355, 149, 146, 293, 15, 80, 285, 195, -169, -85, -77, -139, -182, -266, -159, -347, -370, -269, 114, 183, -210, 124, 257, 246, 398, 327, 197, 233, 187, 120, 67, -158, 130, -22, -237, -582, -213, -491]
4133d91k13L37J99J5P3J27j1J81K00k13K7k17K97q6p8j31l3j31R6J76k08r5k40
4156d19L20j57J16j46k2K13j02K86k36N9M25k02P9L02k26m0r9K41O1k64k1K5k86
4179i3j46J66L4m78n8J82rJ19K23j21k9L20J53K17k66L13r5k28o5q6j4p4J4j68
4203a89k68O8J30k28L10k01K23k7o3K16J17Q7j38K66j15J86J39k48o5j28M9j7
4225A04k9j42j41k22pP1j33K35K7J2k05J07L37N3j42J66J62K57j62K6j78o3Q4
4248B17K1K34l96p4l31K12K16l03k52j2J75o0J12M6OM87l38M62J04l34K13j09
4270B96J17M0l33J23k22L3j42j61q9j04lK9J93j42m9k8K72J03J92n1J98K72j83
4293C61J38P6n7k87m9K5r2j71k14m0J12N0l42L37l44K19K50k66L50J5M7j8J02
$$ y = [-491, -704, -367, -168, -153, -80, 47, 36, 217, 417, 204, 231, 14, 311, 225, 147, 16, -17, -148, -52, 124, -84, -179, -419, -99, -256, -140, -286, -308, -95, -197, 89, -147, -88, 337, 135, 214, 516, 290, 250, 151, 392, 453, 189, 168, 193, -93, -239, -73, -39, -517, -575, -393, -402, -283, -60, -181, -210, 110, 263, 480, 214, 527, 432, 204, 139, 53, 39, -35, -21, -189, -457, -389, -259, -487, -177, -378, -155, -182, -245, -29, 88, 175, 37, 303, 188, 374, 513, 265, 200, 72, 121, 104, 75, -67, -208, -430, -437, -366, -499, -264, -237, -225, -430, -323, 14, 67, -75, 91, 253, 510, 348, 374, 196, 133, 217, 238, 472, 76, 2, -329, -117, 99, -204, -456, -468, -293, -353, -241, -195, -189, 298, -40, 422, 526, 192, 405, 296, 413, 453, 120, 243, 21, 54, -88, -249, -338, -442, -445, -416, -223, -365, -414, -442, -170, -67, 125, 74, 272, 544, 361, 499, 575, 518, 231, 182, 207, 115, -56, -270, -310, -198, -148, -490, -153, -497, -278, -28, -294, 56, 71, 118, 100, 202]
4316B02R8j67J36o5J09K7Q8k86j09K21l45O8r0M5j93j71K98j86o9lJ81k2j12Q9
4340b56J20K73O3K00J70k07K16j81J22m57P3k00k21nk3k3k87K40q4K23J81J83
4362A20j09q3M85k12J25O5O2j62j61m7r2k22J67K4j81K34j06K0p6j17K17J2k36
4385b73M5k20J83J50K53j11R8K10j14J52l08L84k7j47L7q4j02k42P2j46K34k70
4407b26k12J30j78K81j63RL00j13L23J68J16K18q2l97K55q6k01l0p1j03j45J12
4429i5l23J7j27J85P2k9M9J50j73L31pK27j16J93m0L0J30j89j12J08j64k2m0k04
4453a49J26k53l2J84j04P3J8J31j86l4M07j06l6J21nL02j75m2J77J9k49J43j46
4476A84k09J08%rr6l45n8l0m2J39J89j54K11N2K30j96oK88KK06J26p0j70k03J01
$$ y = [202, 300, 133, 269, 204, 313, 340, 428, 142, 33, 254, -91, -23, -113, -68, -261, -432, -134, -320, -389, -392, -211, -233, -345, -256, -136, 137, 200, 400, 570, 363, 579, 398, 520, 63, 136, -64, -285, -290, -313, -336, -623, -383, -467, -244, -63, 120, 11, -72, 413, 201, 326, 391, 453, 291, 130, 83, -9, -231, -64, -40, -221, 13, -93, -73, -149, -266, -49, -37, -273, -228, -448, -265, -115, 138, 27, 125, 335, 221, 373, 65, 449, 422, 275, 312, 228, 126, -116, -44, -190, 44, -226, -438, -308, -486, -205, -368, -359, -59, -172, 151, 319, 435, 653, 571, 174, 429, 343, 142, 112, 41, -62, -207, -95, -418, -401, -528, -343, -271, -300, -251, -101, -274, 57, 50, 277, 161, 354, 314, 344, 474, 285, 173, 281, 117, 95, 55, -149, -23, -276, -308, -124, -228, -155, -137, -6, -192, -226, 181, 75, 39, 160, 155, 457, 282, 240, 417, 436, 187, 330, 184, -25, 83, 83, 74, -22, -367, -425, -455, -497, -358, -169, -323, -112, -60, 170, -26, -32, 256, 258, 464, 590, 520, 350, 147, 248]
4501B48j26j45K3l34j16O9K0k14R4K15J23K83k8j96K26L60k52J10j27Mj86K77
4523C28K9j5l41j83P5Mj23K5m1j48O4K83J2k41R0M8J49P0pj19J15K6M55l47J84
4548C92l47J24j50K8L20k96k28j08J69n1k35Q9k80J48K29K96l54J92J49K03o2
4569B28Q3j89P3J96J15L4l69j32k09J72k86K96j26j84k88L83l11K64J70K42j96
4590c4J55K67j72l7J73J25q7k25P7l10Q6j35q4n8j57J95k3l1J91l06J88o4K71
4613EJ67j67n6K41j55J08O1J48M6k96L37l06M7k41J52k65J16j0K3l03K27l12J66
4636b67j92K11j50K08J40K06P5k4L07j80J96j8R9k43k53J56l35L3r7j81l35K95
4658c49J5J0m8PK06j96L21K41J13j93J10K9J99m29J83m4j53j57K22j90q5L7jK44
$$ y = [248, 122, -23, 0, -334, -450, -381, -361, -575, -481, -266, -143, 140, 112, -84, 142, 502, 250, 360, 233, 237, 51, 328, 357, 342, 1, -182, -107, -103, -226, -201, -242, -390, -326, -43, -31, -272, -182, -134, 15, 85, 78, -41, 74, 100, 555, 208, 392, 45, 169, 19, 47, 367, 71, -157, -265, -96, -147, -382, -293, -573, -425, -196, 100, -254, -62, 87, 290, 228, 311, 122, 195, 391, 506, 540, 171, 39, -170, 2, -284, 12, -114, -298, -586, -203, -514, -250, -80, 162, -34, 121, 388, 216, 179, 352, 477, 390, 165, 242, -68, 18, -117, -201, -259, -416, -221, -244, -275, -84, -390, -202, -266, 5, 172, 5, -51, 190, 35, 143, 204, 352, 398, 102, 439, 133, 180, -61, 91, -174, -58, -68, -45, -348, -121, -433, -267, -459, -248, -398, -190, -50, 156, 231, 207, 514, 334, 530, 512, 611, 368, 115, 271, -64, -31, -128, -309, -644, -349, -334, -324, -372, -365, -159, -355, -34, 207, 320, 127, 237, 266, 465, 36, 219, 175, 22, -135, 87, -103, -188, -151, -152, 92]
4682I2m34K42k31J37J26j8j47J33M2j15J63R3Q7l37L97J47q6j56K81j75j86%k06
4705a51N9k82J55k08j54M7L08j57K37K76MR9M0j65J17J1J62l6r0j39j08J39l28
4728a64J64K8k74k49L55k50Q9J36L21n0k20K22j60J98M7J29r2P3k63N6L8J40k6
4751B48j54r9j11j75J43R2k4j68J2K8J95m16K85j09K90Q5k11K18o8K85M7j44O8
4774C17j79J40j50r9K78j3k25m45M3N4J59k0K7K13l38M36j42J4K19L7j3L5nnk81
4799E7J51j2j4j20m0j01k45P9N6M9j14J53k25K12J46o2J50k63L75N5J24j48m1
4822B22j1j96J66P4m81J93K09k42q2J2J24o8o9K45q4k30Q0K57j26J13q1J12j47
4845a0K29L2l3j26P1R9j83o8K4j52R2oj60J74l93K42k1J09j2QJ45N3J96p7nJ15
$$ y = [92, -342, -100, -331, -194, -68, -86, -233, -100, -58, -173, -10, 83, 170, -167, 230, 377, 291, 135, 416, 241, 55, 55, -151, -92, -374, -219, -427, -581, -534, -226, -383, -146, 130, 134, 233, 273, 108, 225, 236, 398, 362, 272, 133, 25, 164, -164, 0, 28, -246, -495, -140, -390, -301, -165, 156, 106, -114, 108, -52, 146, 193, 322, 230, 303, 40, 96, 134, 274, 248, 94, -5, -116, -291, -148, -56, -80, -248, -236, -208, -13, -429, -144, -253, 37, 122, -89, 129, 61, 346, 393, 249, 317, 138, 278, 128, 29, 307, 294, 69, -376, -333, -279, -120, -140, -113, 100, -238, 198, 56, 70, 289, 326, 313, 348, 343, 338, 57, 208, 196, 182, 62, 22, -79, -324, -245, -189, -140, -254, -101, -326, -114, 32, -30, 120, -143, 232, 287, 411, 263, 222, 211, 15, 181, 255, -226, -33, 176, -66, -148, -136, -12, -80, -149, 96, 12, -218, -138, 119, -7, 106, 25, 137, -10, 219, 251, 218, 92, 163, 262, 79, 11, 35, -117, -25, -31, -191, -17, -410, -168, -189, -80, -92, -84, 61, 114, 310, 233, 228, 343]
4871C43J20l22K57r7j85k70K50j64m5RL1j84J77j81L16k7m4J31j41L7k6J85j4
4894A56N2q9k4q3K04R1j72Qq1M7l17K87J23k38J32k11j0o0K75j45N6K3r0L19j35
4919A18j45q4K47j9k5n7k13J18R1K8n6r1J57j65J73o1j5j09j9p7J42j87L34j47
4943f2K3P2K63j64Q1j46r6L7K8K76l32j6j09K46j81k19M4rn8l2M72m30J34K63
4967H5K07J1Q4l8j39N1j54j6k59J02n4j37J96k38J02N2j20J22J86J22p1O0r7K07
4991B64j23q3k0j0K45k31J29k88L34j58k8K54k40j28M7L92l88J58k55J08j77r
5013b07o2J57%q7N0Q8K71p0k74M53Oj31p8n1J67k63K21k49k66J57l6Q0j12J57
5037g9J34J1k08K45J98m2j09P5j84K57k62J76m37L06M1r8l0J08l2J89k62k06M89
$$ y = [343, 463, 141, 398, 301, 116, -154, 96, -68, -113, -104, -73, -257, -80, -261, 55, 28, -16, 115, -26, 11, -15, 170, 156, 208, 119, 95, 12, 216, 307, 135, 143, 62, 109, -208, 79, 202, -36, 96, -115, -125, -185, 90, -55, 1, 24, -66, 253, 118, -27, -111, 136, 117, 92, 35, -178, -60, 31, 59, 3, -88, 69, -96, 77, 16, 1, -108, -127, -204, -62, -249, 85, -62, -39, 33, 296, 132, 213, 67, -29, 8, 36, 312, -20, -36, -145, 101, -80, -299, -255, -264, -322, -354, 118, -312, -178, 85, 292, 303, 387, 349, 210, 261, 107, 91, -168, -66, -120, -257, -61, -299, -197, -145, -265, -143, 43, 165, 94, 154, 57, 264, 141, 58, 38, 28, 273, 42, 171, -117, 217, 59, 31, 285, 45, -83, -36, 356, -32, 126, -129, -21, -198, -207, -269, -112, -112, -199, -149, -61, 210, 140, -134, 319, 325, 194, 116, 65, 232, -31, 190, -59, -325, -168, -204, -124, -236, -79, 55, 66, -142, 103, 301, 259, 150, 225, 41, 298, 36, 212, -225, 81, 122, 24, -6, 102, 70, 259, -3, -209, 280]
5060B80n21K80J1k62K90J51l68O2K3J68N8k82L04J70m16J65J16j08k10J98j30
5081b1j4K8q6r9K30p2J22j54L46j77O9p3j6J09k70J88J68l87J31L5j29N1j63P5
5105a09j9M0J41JK9j31J31j58j02L05l49J04M1J04K9O3Qr5o4J57o5K5k34Q8L7
5130b3j75k13K56k52J69J44J68j68J61J68l38K22J25k6o7l17K60K80j92j45J2
5151D9k18o7P1N5J47l24N48j2l9k29K40j6k53J32l9k40J13J72j21o8Q2O2MJ02
5175A51j33J3l1pk03J93JJ03p1j95J5K59L4l37K02J43o0k7J26K98n09J50k35K42
5199A22k98J72q4l55K08J60m6L9j28M49m43K60J94l1P3j33j82K10j60K58k30M5
5221A00k48r2l1O3j51K20k16L62n8PJ71J78o0M2l04J44p7K28k06Q2l9q7L21n24
$$ y = [280, -241, 39, 50, -212, 78, 229, -139, -77, -54, 114, 172, -110, 194, 364, -52, 113, 229, 121, -89, 109, -21, -35, -7, -93, -192, 38, -34, 88, -66, 280, 103, 172, 99, 83, 192, -78, 110, 278, -109, 22, 57, -72, -21, -184, -109, -128, -88, 53, 54, 83, -48, 83, -75, -177, 128, -221, -117, -76, 28, 57, 120, 128, 33, -31, 126, 61, 86, -148, -60, -23, -198, -411, -155, -407, -238, -94, 74, -94, 67, 235, -103, 119, 244, 218, 151, -166, 94, 374, 182, 37, 49, -169, -236, -165, -110, 37, -287, 261, 249, 210, -19, 221, 205, -48, 84, 45, -195, -82, 90, -31, -99, -17, 45, 49, 151, 18, 31, 0, -7, -210, -17, -16, 87, 16, -179, -164, 95, 129, -208, -6, 137, 77, 50, 176, 474, -35, 115, -120, 122, -176, -4, -88, -443, -235, -75, -121, -82, -210, 239, -204, 56, 250, 219, 292, 159, -23, 187, 27, 285, 55, 100, -148, -240, -271, -208, -359, -139, -355, 7, -51, -44, 127, 305, 245, 287, -17, 127, 50, 278, 72, 154, 115, 28, 349, -175]
5245a75K72k76R3j31J56K2j62j17J45J44j44N1l7N2K79r5K67k13j35J05n4K47
5267B94k24Q2l03K67m6j96j67J75j61RJ40J68j7r1o7J21QO0K32l8M3n2M9j16o9
5292A01q4R6o8k77j18K6P1m4P9k17M79K3n6m8Q0J52k59M04j12R3j9Q7r9j84k7
5317G9J50m32j23K06q8n1K1R6J66m99L83J41L2o5J65L1j44J13J3j66L23j33l1
5340A87k50J31j61l08K12P9j99P7q1l0K02k48L99l17M69J77j98k3K72n6j58J49
5362C25j81J75k48j22N0r6M6j35M85o77L82j59M8j42L29m41K54J34j77L1K59j3
5384A27J68P4r2J02j44P0l27J69p7j17p0j66J42j53O1j84J26K31p9p1M24j81K71
5407C04j25l8L48j09p8O5k31j9o3j95j99r3j2J28j41P5L13N9RJ92M8n2p2J47l9
$$ y = [-175, 97, -179, -86, -217, -61, -39, -201, -318, -173, -29, -173, -122, -159, -107, 172, 77, 344, 131, -4, 101, 47, 294, 70, 152, -151, 116, 70, -126, -293, -118, -279, -270, -130, 38, 21, -70, -137, -16, -8, 52, 284, 246, 289, 237, 286, 170, 101, 17, 113, 45, -232, -350, -324, -253, -297, -218, -435, 44, 67, 11, -37, 43, 195, -64, 340, 228, 321, 302, 389, 290, 106, 79, 229, -203, -326, -120, -208, -259, -238, -142, 24, -475, -92, 49, 81, 16, 181, 212, 68, 181, 194, 28, 351, 218, 187, -63, 68, -93, -401, -189, -110, -309, -232, -313, -343, -141, -389, 10, -307, 162, 339, 141, 118, 390, 334, 176, 325, 144, 319, 71, -51, -1, -97, -51, -186, 299, -378, 4, -155, -107, -249, 80, -361, -107, 27, -150, -119, 140, 127, 295, 369, 277, 379, 235, 305, -22, 147, 70, -47, -117, -283, -141, -294, -233, -417, -291, -60, -139, -210, 214, 33, 304, 179, 141, 489, 380, 302, 367, 136, 117, 54, -141, -340, -433, -445, -317, -458, -383, -70, -11, -2, 190, 238, 186, 114, 261, 222]
5432B22l0Q7l25J82j97p1K61n7M8K65m53J76j83J50m42J54Q6k8J21k41K93r9k7
$$ y = [222, 192, 279, -46, 136, -61, -132, 129, 72, 120, 385, -68, 108, -75, 75, -367, -213, -127, -155, -34, -275, 18, -81, -108]
$$ [...]
8191E6
##END NTUPLES=NMR FID
##END=
