##TITLE=1H_L1-Sph(MeOH-A)
 CDCl3, 8 sc, 
 15.2.2019
##JCAMPDX= 6.0         $$ Bruker NMR JCAMP-DX V2.0
##DATA TYPE= NMR FID
##DATA CLASS= NTUPLES
##ORIGIN= UXNMR, Bruker Analytische Messtechnik GmbH
##OWNER= root
$$ XWIN-NMR		Version 3.5
$$ Fri Feb 15 16:14:03 2019 Russian Standard Time (UT+4h)  she@DPX200
##.OBSERVE FREQUENCY= 200.1313
##.OBSERVE NUCLEUS= ^1H
##.DELAY= (6, 6)
##.ACQUISITION MODE= SIMULTANEOUS
##.ACQUISITION SCHEME= undefined
##.AVERAGES= 8
##.DIGITISER RES= 18
##SPECTROMETER/DATA SYSTEM= spect
##.PULSE SEQUENCE= zg30
##.SOLVENT NAME= CDCl3
##.SHIFT REFERENCE= (INTERNAL, CDCl3, 0, 15.7039)
##AUDIT TRAIL= $$ (NUMBER, WHEN, WHO, WHERE, WHAT)
$$ ##TITLE= Audit trail, XWIN-NMR		Version 3.5
$$ ##JCAMPDX= 5.01
$$ ##ORIGIN= Bruker BioSpin GmbH
$$ ##OWNER= she
$$ F:/spectra/data/she/nmr/H-F/1/audita.txt
$$ ##AUDIT TRAIL=  $$ (NUMBER, WHEN, WHO, WHERE, WHAT)
(   1,<2019-02-15 16:13:09.48 +0400>,<she>,<DPX200>,
      <created by zg, POWCHK disabled, PULCHK disabled
       configuration hash MD5:
       00 E9 B6 7A A2 85 ED C7 34 08 36 98 17 FE 4E 26
       data hash MD5: 16K
       90 51 82 A4 60 61 22 E5 FA D6 2D E6 6B 4B E8 68>)
$$ ##END=
$$ 
$$ hash MD5
$$ D7 1D D6 54 7C 0A 6C EE C9 7B 0E C3 54 3E 86 56
##$RELAX= 
##$RELAX= 
##$RELAX= 
##$RELAX= 
##$RELAX= 
##$RELAX= 
$$ Bruker specific parameters
$$ --------------------------
##$DU= <F:/spectra>
##$EXPNO= 1
##$NAME= <H-F>
##$PROCNO= 1
##$TYPE= <nmr>
##$USER= <she>
##$AMP= (0..31)
100 100 100 100 100 100 100 100 100 100 100 100 100 100 100 100 100 100 
100 100 100 100 100 100 100 100 100 100 100 100 100 100 
##$AQSEQ= 0
##$AQ_mod= 1
##$AUNM= <au_zg>
##$AUTOPOS= <>
##$BF1= 200.13
##$BF2= 200.13
##$BF3= 200.13
##$BF4= 200.13
##$BF5= 200.13
##$BF6= 200.13
##$BF7= 200.13
##$BF8= 200.13
##$BYTORDA= 1
##$CFDGTYP= 0
##$CFRGTYP= 5
##$CHEMSTR= <none>
##$CNST= (0..31)
1 1 145 1 1 1 1 1 1 1 1 1 1 1 1 1 1 1 1 1 1 1 1 1 1 1 1 1 1 1 1 1 
##$CPDPRG= <>
##$CPDPRG1= <>
##$CPDPRG2= <>
##$CPDPRG3= <>
##$CPDPRG4= <mlev>
##$CPDPRG5= <mlev>
##$CPDPRG6= <mlev>
##$CPDPRG7= <mlev>
##$CPDPRG8= <mlev>
##$CPDPRGB= <>
##$CPDPRGT= <>
##$D= (0..31)
0 1.2 0 0 0 0 0 0 0 0 0 0.03 0 0 0 0 0 0 0 0 0 0 0 0 0 0 0 0 0 0 0 0 
##$DATE= 1550232788
##$DBL= (0..7)
120 120 120 120 120 120 120 120 
##$DBP= (0..7)
150 150 150 150 150 150 150 150 
##$DBP07= 0
##$DBPNAM0= <>
##$DBPNAM1= <>
##$DBPNAM2= <>
##$DBPNAM3= <>
##$DBPNAM4= <>
##$DBPNAM5= <>
##$DBPNAM6= <>
##$DBPNAM7= <>
##$DBPOAL= (0..7)
0.5 0.5 0.5 0.5 0.5 0.5 0.5 0.5 
##$DBPOFFS= (0..7)
0 0 0 0 0 0 0 0 
##$DE= 6
##$DECBNUC= <off>
##$DECIM= 32
##$DECNUC= <off>
##$DECSTAT= 4
##$DIGMOD= 1
##$DIGTYP= 9
##$DL= (0..7)
0 120 120 120 120 120 120 120 
##$DP= (0..7)
150 150 150 150 150 150 150 150 
##$DP07= 0
##$DPNAME0= <>
##$DPNAME1= <>
##$DPNAME2= <>
##$DPNAME3= <>
##$DPNAME4= <>
##$DPNAME5= <>
##$DPNAME6= <>
##$DPNAME7= <>
##$DPOAL= (0..7)
0.5 0.5 0.5 0.5 0.5 0.5 0.5 0.5 
##$DPOFFS= (0..7)
0 0 0 0 0 0 0 0 
##$DQDMODE= 0
##$DR= 18
##$DS= 0
##$DSLIST= <SSSSSSSSSSSSSSS>
$$ [...]
##$SUBNAM2= <"">
##$SUBNAM3= <"">
##$SUBNAM4= <"">
##$SUBNAM5= <"">
##$SUBNAM6= <"">
##$SUBNAM7= <"">
##$SUBNAM8= <"">
##$SUBNAM9= <"">
##$SW= 20.0189088683792
##$SWIBOX= (0..15)
0 0 2 0 0 0 0 0 0 0 0 0 0 0 0 0 
##$SW_h= 4006.41025641026
##$TD= 16384
##$TD0= 1
##$TE= 0
##$TE2= 300
##$TE3= 300
##$TEG= 300
##$TL= (0..7)
0 120 120 120 120 120 120 120 
##$TP= (0..7)
150 150 150 150 150 150 150 150 
##$TP07= 0
##$TPNAME0= <>
##$TPNAME1= <>
##$TPNAME2= <>
##$TPNAME3= <>
##$TPNAME4= <>
##$TPNAME5= <>
##$TPNAME6= <>
##$TPNAME7= <>
##$TPOAL= (0..7)
0.5 0.5 0.5 0.5 0.5 0.5 0.5 0.5 
##$TPOFFS= (0..7)
0 0 0 0 0 0 0 0 
##$TUNHIN= 0
##$TUNHOUT= 0
##$TUNXOUT= 0
##$USERA1= <user>
##$USERA2= <user>
##$USERA3= <user>
##$USERA4= <user>
##$USERA5= <user>
##$V9= 5
##$VALIST= <valist>
##$VCLIST= <CCCCCCCCCCCCCCC>
##$VD= 0
##$VDLIST= <DDDDDDDDDDDDDDD>
##$VPLIST= <PPPPPPPPPPPPPPP>
##$VTLIST= <TTTTTTTTTTTTTTT>
##$WBST= 1024
##$WBSW= 4
##$XGAIN= (0..3)
0 0 0 0 
##$XL= 0
##$YL= 0
##$YMAX_a= 352806
##$YMIN_a= -471161
##$ZGOPTNS= <>
##$ZL1= 120
##$ZL2= 120
##$ZL3= 120
##$ZL4= 120
##$ABSF1= 10
##$ABSF2= 0
##$ABSG= 5
##$ABSL= 3
##$ALPHA= 0
##$AQORDER= 0
##$ASSFAC= 0
##$ASSFACI= 0
##$ASSFACX= 0
##$ASSWID= 0
##$AUNMP= <proc_1d>
##$AZFE= 0.1
##$AZFW= 0.1
##$BCFW= 1
##$BC_mod= 2
##$BYTORDP= 1
##$COROFFS= 0
##$CY= 11.3945322036743
##$DATMOD= 1
##$DC= 2
##$DFILT= <>
##$DTYPP= 0
##$F1P= 18.9103706918063
##$F2P= -1.10871071338519
##$FCOR= 0.5
##$FTSIZE= 0
##$FT_mod= 4
##$GAMMA= 1
##$GB= 0.15
##$INTBC= 1
##$INTSCL= 1
##$ISEN= 128
##$LB= 0.24
##$LEV0= 0
##$LPBIN= 0
##$MAXI= 10000
##$MC2= 0
##$MEAN= 0
##$ME_mod= 0
##$MI= 1.114404
##$NCOEF= 0
##$NC_proc= 0
##$NLEV= 6
##$NOISF1= 3.799351
##$NOISF2= 2.8
##$NSP= 1
##$NTH_PI= 0
##$NZP= 0
##$OFFSET= 15.70392
##$PC= 1
##$PHC0= -9054.14
##$PHC1= 16.40014
##$PH_mod= 1
##$PKNL= yes
##$PPARMOD= 0
##$PSCAL= 0
##$PSIGN= 0
##$REVERSE= no
##$SF= 200.130013532006
##$SI= 16384
##$SIGF1= 3
##$SIGF2= 2
##$SINO= 400
##$SIOLD= 16384
##$SREGLST= <1H.CDCl3>
##$SSB= 0
##$STSI= 0
##$STSR= 0
##$SW_p= 3612.71676300578
##$SYMM= 0
##$S_DEV= 0
##$TDeff= 0
##$TDoff= 0
##$TI= <>
##$TILT= no
##$TM1= 0
##$TM2= 0
##$TOPLEV= 0
##$USERP1= <user>
##$USERP2= <user>
##$USERP3= <user>
##$USERP4= <user>
##$USERP5= <user>
##$WDW= 1
##$XDIM= 8192
##$YMAX_p= 0
##$YMIN_p= 0
$$ End of Bruker specific parameters
$$ ---------------------------------
##NTUPLES= NMR FID
##VAR_NAME=  TIME,          FID/REAL,        FID/IMAG
##SYMBOL=    X,             R,               I
##VAR_TYPE=  INDEPENDENT,   DEPENDENT,       DEPENDENT
##VAR_FORM=  AFFN,          ASDF,            ASDF
##VAR_DIM=   8192,          8192,            8192
##UNITS=     SECONDS,       ARBITRARY UNITS, ARBITRARY UNITS
##FACTOR=    0.0002496,     1,               1
##FIRST=     0,             0,               0
##LAST=      2.0444736,     0,               0
##MIN=       0,             -471161,         0
##MAX=       2.0444736,     352806,          0
$$ Real data points
##PAGE= N=1
##DATA TABLE= (X++(R..R)), XYDATA
$$ [...]
1779a1k19o51O91P89n92n15K15Q56n64j69L40q5p23K12Q43Q6p32Q5Q20m52n33
$$ -11 -230 -881 -190 599 7 -508 -293 563 -1 -170 170 85 -638 -426 417 503 -229 -144 676 224 -309
1800c09K62O36o99p0Q5M00k91n95P46j07m80p5M09J51n28M50O55m69n75M22P75
$$ -309 -47 589 -110 -180 -95 305 14 -581 165 58 -422 -497 -88 63 -465 -15 640 171 -404 18 793
1821G93k22o20N34L03j256Q2O45j29m71j1M93J31o31j02P61l19j99J30J45r4k13
$$ 793 571 -49 485 788 -468 -386 259 130 -341 -352 141 272 -359 -461 300 -19 -218 -88 57 -37 -250
1842b50L10M40m41l56K08L12l79J7L55p3l56J61L95o3k79KL47j14l58K04Q2l06
$$ -250 60 500 59 -297 -89 223 -156 -139 216 143 -213 -52 343 280 1 3 350 236 -122 82 164 -142
1864a42r6J53J9j37l50L22K38q2J62J35j05j67K49J75j34j82Q6K0J5l54k73J79
$$ -142 -238 -85 -66 -203 -553 -231 7 -75 87 222 117 -50 199 374 240 58 144 164 179 -175 -448 -269
1886b69j09N9j22K38j46J03O0r2K96J29N0J25j06j79L54r9M0m65K76L16m21k08
$$ -269 -378 -319 -441 -203 -349 -246 -186 -278 18 147 197 322 216 37 391 292 332 -133 143 459 38 -170
1908a70L05km94J29K02m23O2J41K27k31l11M35J24J3O8J89q8o0L18j36Q2j02n7
$$ -170 135 133 -361 -232 -30 -453 -391 -250 -23 -254 -565 -130 -6 7 75 264 176 116 434 298 380 278 221
1931B21R4l39K2mj75j63l3j85j33Q1p1K62P7K77n6O44J08k90L30K83k82l13K21
$$ 221 315 -24 -2 -6 -181 -344 -377 -562 -695 -614 -685 -423 -346 -69 -125 519 627 337 667 950 668 355 576
1954E76k8k62l44k59k0k94j64R6L27k43j71M33K66J04K32J71J84k17J95L12k58
$$ 576 548 286 -58 -317 -337 -631 -795 -699 -372 -615 -786 -353 -87 17 249 420 604 387 582 894 636
1975F36k62j51N9k21l21N3l47Q3J71j32k02L9L00J92J91r7K2J13o9J77l0Q1Lk15
$$ 636 374 223 282 61 -260 -207 -554 -471 -300 -432 -634 -595 -295 -103 88 -9 13 126 57 234 204 285 288 73
1999G3J79k36J32o7J84k16k95K31J83l83K48n9j62P6j14J0k79K62J00O6q7K88
$$ 73 252 16 148 81 265 49 -246 -15 168 -215 33 -26 -188 -112 -226 -216 -495 -233 -133 -67 -154 134
2021A34N0J23J5J10L83l83q4K94j9m92m35M05n23l17jK47J84p05M18O29j59j74
$$ 134 184 307 322 432 815 432 348 642 623 131 -304 101 -422 -739 -740 -493 -309 -1014 -596 33 -126 -300
2043c00N66N32l27L4K42j14j74M2J91m55l82k69K91l19n89M96J93l81j98J008
$$ -300 266 798 471 505 747 633 459 501 692 237 -145 -414 -123 -442 -1031 -535 -342 -723 -921 87
2063H7O5m16M74O91k18m57o7P22m10l74J36L6n03m41L23K62l54l99M17K74l22
$$ 87 152 -264 210 901 683 226 159 881 471 97 233 269 -234 -675 -352 -90 -444 -843 -426 -152 -474
2084d74J21O31j49n1L38N00q43n01O18M09o21k44L63J37n23OQ42l70o51J60O01
$$ -474 -353 278 129 78 416 916 73 -428 190 599 -22 -266 97 234 -289 -283 559 189 -462 -302 299
2105B99k29m39L95J55m14k53N94M6m78j07R14k80o39R1Q72m98m84N05Q07p03o33
$$ 299 70 -369 26 181 -233 -486 108 154 -324 -431 483 203 -436 -345 527 29 -455 50 857 154 -479
2126d79Q12J7o08j63K58K32n71K69M03P8p09J82O50k32nr6L74l44m20L93K57m14
$$ -479 333 350 -258 -421 -163 69 -502 -233 170 248 -461 -279 371 139 134 38 412 68 -352 41 298 -116
2148a16k89P28j98p31N46J27j5m12P21K77r59L06K87K01l83j88L96l14l73l4M17
$$ -116 -405 323 125 -606 -60 67 52 -360 361 638 -321 -15 272 473 90 -98 298 -16 -389 -423 -6
2169fj44k06J67J38n20L95M24Jj77jM99l85k02M7L87l55m33L00J17n52J39M74
$$ -6 -150 -356 -189 -51 -571 -176 248 249 72 71 570 185 -17 30 417 62 -371 -71 46 -506 -367 107
2191A07j66m33K32M22J6m00M85K52m49k80O64J76m78l52K55J52o68P5M21k67j67
$$ 107 -59 -492 -260 162 178 -222 263 515 66 -214 450 626 148 -204 51 203 -465 -390 31 -236 -403
2212d03L07L29k97l31M64N21r58J15M70K05n15Q6L08j76l60o0N17j82m91K28O42
$$ -403 -96 233 -64 -395 69 590 -368 -253 217 422 -93 -7 301 125 -235 -295 222 40 -451 -223 419
2233D19q42j31O08J04o10K68N96k26p13M20N94N0p78K61K74l44j52N04j65k69
$$ 419 -423 -554 54 158 -452 -184 412 186 -527 -107 487 537 -241 20 294 -50 -202 302 137 -132
2253a32j38M00r3m10J05P23n00m51K81N20k15l51M46J69n41J85K38r3k00l08O12
$$ -132 -270 130 37 -373 -268 455 -45 -496 -215 305 90 -261 185 354 -187 -2 236 143 -57 -365 247
2274B47k26l72K75M14k87n58N95L29l88m00P47Q2m39j99K87K27p52L00M14l45
$$ 247 21 -351 -76 338 51 -507 88 417 29 -371 376 458 19 -180 107 334 -418 -118 296 -49
2294d9m58J92L62j61j96L32M89o31J4M22Mrr3J76j51k73k78N86l15k71J68Q3n13
$$ -49 -507 -315 47 -114 -310 22 511 -120 -106 316 320 311 218 394 243 -30 -308 278 -37 -308 -140 -57 -570
2317e70L06K47J1k93K43K70l15q3L40L03k83O6k65Q67q09l8J09l4j85r3j1n4j36
$$ -570 -264 -17 -6 -299 -56 214 -101 -184 156 459 176 242 -23 844 35 -3 106 72 -113 -206 -217 -271 -407
2340d07M6M34l29j58P4J47L74j11O1o6K5j28N39j69l53J57L63k81j54J6k7k93
$$ -407 -361 73 -256 -414 -340 -193 181 70 131 65 90 -38 501 332 -21 136 499 218 64 80 53 -240
2362b40nJ19O2l60R7P8J8l7J7K51L03k43K75N1l6j24K49J19k35k09p2nL6r8m66
$$ -240 -245 -126 -64 -424 -327 -249 -231 -268 -251 0 303 60 335 386 350 226 475 594 359 150 78 73 109 11 -455
2387d55K18n26P4J6J25J66J50J45L7L40L49k03J79o1N0k5j61k41Rl12j08m1m13
$$ -455 -237 -763 -689 -673 -548 -382 -232 -87 -50 290 639 436 615 554 604 579 418 177 186 -126 -234 -275 -688
2410f88k3J10J42J32j07q2O78j69L52L97K5j98k99m3K18k0l46l63J61k85J50K8
$$ -688 -711 -601 -459 -327 -434 -516 162 -7 345 742 767 569 270 227 445 425 79 -284 -123 -408 -258 -230
2432b30R4m11L65J90j56J25J56R0N0j7p1j45J60l50M0o0Q4L8m6j04J57J66K0k8
$$ -230 -136 -547 -182 8 -148 -23 133 223 273 256 185 40 200 -150 -110 -170 -86 -48 -94 -198 -41 125 145 117
2456A17R1o7K82k97l6k00L5K10n47q6K47k5rj13R8K14j77M51j42L68Q2J09k48
$$ 117 208 141 423 126 90 -110 -75 135 -412 -498 -251 -276 -285 -398 -300 -86 -263 188 46 414 496 605 357
2479C57j6J10j34J9o48j96J97r6j83J45QJ56k52K38L57J92p5K96r0j72J39O0j16
$$ 357 341 451 317 336 -312 -508 -311 -407 -590 -445 -437 -281 -533 -295 62 254 179 475 385 213 352 412 296
2502B96k88N2K5j12k28j25K13q3k08J19M84k4l07L48J35n2l77N79m31n5J78O4
$$ 296 8 60 85 -27 -255 -380 -167 -250 -458 -339 145 121 -186 162 297 245 -132 447 16 -39 139 203
2524B03m7m89J37P1j2K00k6K76j74k73L57K69n44j19K99J2m71J08k0j05K8J02
$$ 203 156 -333 -196 -125 -137 63 37 313 139 -134 223 492 -52 -171 128 140 -331 -223 -243 -348 -320 -218
2546b18K44n4k25K28K40o2J51K37J34l01j22k7j00k21j16J22k18j07Q0l49J10
$$ -218 26 -28 -253 -25 215 153 304 541 675 374 252 225 125 -96 -212 -90 -308 -415 -335 -684 -574
2567e74J89O29J59o27L51K50J52l12R9J52j20l13J80L6o35J34O1P6k54M0J91j60
$$ -574 -385 244 403 -224 127 377 529 217 316 468 348 35 215 251 -384 -250 -189 -113 -367 -327 -136 -296
2589b96j82N88J60j14k01J25l5k8k7K69L6m71k36N65j1l90J17N81o76J78L48k4
$$ -296 -478 110 270 156 -45 80 45 17 -10 259 295 -176 -412 153 142 -248 -131 450 -226 -48 300 276
2611B76r3m72M80p6l30J97M2J17n16j63M01k5l4Q1K31j19K9M7K45j39L73J69j94
$$ 276 183 -289 191 115 -215 -18 24 141 -375 -538 -137 -162 -196 -115 116 -3 26 73 318 179 552 721 527
2634E27o70K85Q9l64m46R5L36k35j87K1O05n10L44M32K9k50Q9K33K28m41M9J61
$$ 527 -143 142 231 -133 -579 -484 -148 -383 -570 -549 56 -454 -110 322 351 101 190 423 651 210 259 420
2656D20m70o4K54j03n58K3L58j99j0R6K62q3P6PL28k69L8M3K04j75j21L53m76
$$ 420 -50 -114 140 37 -521 -498 -140 -339 -349 -253 9 -74 2 9 337 68 106 149 353 178 57 410 -66
2679f6l23K19L71j29j39r2K14j69l00O62p8k63j06L22O0m46J0L71j98l75M78L8
$$ -66 -389 -170 201 72 -67 -159 55 -114 -414 248 170 -93 -199 123 183 -263 -253 118 -80 -455 23 61
2701F1P2l82L27N43m37k85N03Q2k66k58M00k65l52J15o3P1p25N98K05o19J58M60
$$ 61 133 -249 78 621 184 -101 402 484 218 -40 360 95 -257 -142 -205 -134 -859 -261 -56 -675 -517 -57
2723e7K29m72K86P8M64l80K0K27K00l32j45J62l00l80PL94n49J18K01m8j85L22
$$ -57 172 -300 -14 64 528 148 168 395 595 263 118 280 -20 -400 -393 1 -548 -430 -229 -277 -462 -140
2745a40J85J34m06L66J05R8j85L23l7l21j09KJ04k07r4M84l21k48P1L6k55J56
$$ -140 45 179 -227 139 244 342 157 480 443 122 13 15 119 -88 -182 302 -19 -267 -196 -160 -415 -259
2767b59K8K11l3K4N59j54m17lK71j03%j69L13m7l21J6K02k34n1K48N1m27q2K15
$$ -259 -231 -20 -53 -29 530 376 -41 -44 227 124 124 -45 268 221 -100 -84 118 -116 -167 81 132 -295 -377 -162
2791a62J57l16K1J02L2o2L65m7J2l32M48J81j14k31L33K8m19O1p5l8j84J32K12
$$ -162 -5 -321 -300 -198 -166 -228 137 90 102 -230 218 399 285 54 387 415 -4 57 -18 -56 -240 -108 104
2814A04m60PJ20m5J12J4K00j28K21kK91j88l2J56L01n48m5J51j59j92p8m0j20
$$ 104 -356 -349 -229 -274 -162 -148 52 -76 145 143 434 246 214 370 671 123 78 229 70 -122 -200 -240 -360
2837c60l05M6K66k2N3J19J8O4K40K97J79l91j75M53k38k54jL43l92n43L41J12
$$ -360 -665 -619 -353 -375 -322 -203 -185 -121 119 416 595 204 29 482 244 -10 -11 332 -60 -603 -262 -150
2859a50m17J56J02q5K74j26L20j42ML71O7l20n4l5L70k74j65J92q3j32k6K30n
$$ -150 -567 -411 -309 -394 -120 -246 74 -68 -64 307 374 54 0 -35 335 61 -104 88 5 -127 -153 77 72
2882G2l73K67j22L42Q5l9j01qk00J05J30n28L5q2J76Q3QLL9K4j65Q21j25j86r
$$ 72 -301 -34 -156 186 271 232 131 123 -77 28 158 -370 -335 -417 -241 -158 -150 -147 -108 -84 -249 572 447 261 252
2907B52L45k38k89P9k04k39J23O6l48j41j66N09M2J11O7j9K59r0L85j65N0o5j22
$$ 252 597 359 70 149 -55 -294 -171 -105 -453 -594 -760 -251 -209 -98 -31 -50 209 119 504 339 389 324 202
2930B02K22k95j53j27j23N0k24J71K9j25j2K62j92M00n7K26lrk5j70J82r6j46
$$ 202 424 129 -24 -151 -274 -224 -448 -277 -248 -373 -385 -123 -315 85 28 254 251 242 217 47 229 133 -13
2953a3K6Pj41L0J36k14L5O3p2PJ06N8n9J95mm8k27J91j42l9N2p9Q6N6j72L35m74
$$ -13 13 20 -121 -91 45 -169 -134 -71 -143 -136 -30 28 -31 164 160 112 -115 76 -66 -105 -53 -132 -46 10 -162 173 -301
2980c01K01J03M9P8l1j76K42j43K1k48j45K55k18K66k3o0K08j72J15J85J73k69
$$ -301 -100 3 52 130 99 -77 165 22 43 -205 -350 -95 -313 -47 -70 -130 78 -94 21 206 379 110
3002A10P2K14k93J19k66L1q9O5j66J49j58J7n7L3J74L05j99q7K43KJ26k93K58
$$ 110 182 396 103 222 -44 -13 -102 -37 -203 -54 -212 -195 -252 -219 -45 260 61 -26 217 219 345 52 310
3025C10j64j76k83M15j79l20J52L4M26j98k03J28q3J59J3M11n3l31Q4J0p0K4m9
$$ 310 146 -30 -313 102 -77 -397 -245 -211 215 17 -186 -58 -141 18 31 442 389 58 142 152 82 106 57
3048E7Oj41k30K63n5l22J93K90k38K89j7J43l4j00j69KJ83m0jp8P1k35J1O4q2
$$ 57 63 -78 -308 -45 -100 -422 -229 61 -177 112 95 238 204 104 -65 -63 120 80 79 1 72 -163 -152 -88 -170
3073a70K7J27o6R9M6oq4J27J48J4k64R0j31M4J21j86j46K84r7j16K43o6j69K73
$$ -170 -143 -16 -82 17 63 57 -27 100 248 262 -2 88 -43 1 122 -64 -210 74 -23 -139 104 38 -131 142
3097A42M6j16j45L60m16K4J12J86j65j85rK4Pj19J10K40m25L34j2J21j77J44R7
$$ 142 188 72 -73 287 -129 -105 7 193 28 -157 -166 -142 -135 -254 -144 96 -329 5 -7 114 -63 81 178
3120A78Q6j02l48Q0K34k65J3pK9j54K9J25j36J02J78%k05M06P7l24l14M55L7k9
$$ 178 264 162 -186 -106 128 -137 -124 -131 -102 -256 -227 -102 -238 -136 42 42 -163 243 320 -4 -318 137 174 145
3144A45j39j42K15k34lj34K23j53Q4K95j98k99L52J50M7j62M0k2k22J07L26l97
$$ 145 6 -136 79 -155 -158 -292 -69 -222 -138 157 -41 -340 12 162 209 47 87 65 -157 -50 276 -121
3166a21N0j44O0K29k58N5R2j99Q1J16L7j41K85K68l73j5m7K89j39J5J2p5n4k36
$$ -121 -71 -215 -155 74 -184 -129 -37 -236 -155 -39 -2 -143 142 410 37 22 -25 264 125 140 152 77 23 -213
3190b13P3J26l15Q7n8M36m51L89j93K15m8k00M98l40M3j62N8Nk7j2L43k87nK56
$$ -213 -140 -14 -329 -242 -300 136 -315 74 -119 96 48 -152 346 6 49 -113 -55 -50 -77 -89 254 -33 -38 218
3214B18j32k13k7K08k0j67n5J89q7Nr6L26j63p4M65m26k28K51k7J28k63L40k1
$$ 218 86 -127 -154 54 34 -133 -188 1 -86 -81 -177 149 -14 -88 377 -49 -277 -26 -53 75 -188 152 131
3237A31n0k89L46J0l56o5M5K32k24n3J17J30j82L15k25J84m8LM74m38kJ12O2q5
$$ 131 81 -208 138 148 -208 -273 -228 4 -220 -273 -156 -26 -208 107 -118 66 18 21 495 57 55 167 229 144
3261A44j88j9j35p7J68k9k47K31J32l2k27L36J65ok73J0K50P0j42J61K24n83l5
$$ 144 -44 -63 -198 -275 -107 -136 -383 -152 -20 -52 -279 57 222 216 -57 -47 203 273 131 292 516 -67 -102
3284a02mL9k48J00J36o1q0M2J26J61j24J32J01j94R7rK94j58j30q3J16k46K15
$$ -102 -106 -67 -315 -215 -79 -140 -220 -178 -52 109 -15 117 218 24 121 112 406 248 118 35 151 -95 120
3307A20j56O4k99j3N1K21q5M5N6l9K14r3K52k41r9J59%j00j43j54K80j62j6K9
$$ 120 -36 28 -271 -284 -233 -12 -97 -52 4 -35 179 86 338 97 -2 157 157 57 -86 -240 40 -122 -138 -109
3331a09j32k19J66K41n1M4RJ69j63K0K41j52MO2j03j62n3K17k7j61n5M19q7o0
$$ -109 -241 -460 -294 -53 -104 -60 -51 118 -45 -25 216 64 68 130 27 -135 -188 29 2 -159 -214 205 118 58
3355E8k00K36Lk30J13K06j23L5j1K23m29P6qM64l34k79K19L2j65j8M35k18j46
$$ 58 -142 94 97 -133 -20 186 63 98 87 310 -119 -43 -51 413 79 -200 19 51 -114 -132 303 85 -61
3378f1K1J72J7l48lJ48k11K19J78j86k28J98K53m2j21L9K39k06R8m8pj00j18R9
$$ -61 -40 132 149 -199 -202 -54 -265 -46 132 -54 -282 -84 169 127 6 45 284 78 176 128 121 21 -97 2
3402Bk14j18o7M21j89j1K7J34J19Mj5j9l2N5K04k7j70J12l28O9j14o9K59j82m3
$$ 2 -212 -330 -397 24 -165 -176 -149 -15 104 108 93 74 42 97 301 274 104 216 -112 -43 -157 -226 33 -149 -192
3427a92P2l8j40K78K60j01k40L14n9k43K01M2k5j93J19J08k29r5L9J1J45j45r8
$$ -192 -120 -158 -298 -20 240 139 -101 213 154 -89 112 154 129 -64 55 163 -66 -161 -122 -111 34 -111 -209
3450b09J43L7j22K78j47K15m1j00M7K3k11J25k14K87j08lp4J3J8Qj07M2R1K5k01
$$ -209 -66 -29 -151 127 -20 195 154 54 101 124 -87 38 -176 111 3 0 -74 -61 -43 -35 -142 -100 -9 16 -185
3475a85QJ08J31k41N5K72k93J75j93K17k19K72m8R5j33K3L59m09J48K36l21j61
$$ -185 -177 -69 62 -179 -124 148 -145 30 -163 54 -165 107 59 154 21 44 403 -6 142 378 57 -104
3497a04k10J06K14l74L5J51M5o7J74N5k25L92r9n6J07N4k09J07o7NK46l53J68
$$ -104 -314 -208 6 -368 -333 -182 -137 -204 -30 25 -200 192 93 37 144 198 -11 96 29 34 280 -73 95
3520I5j16k41L26j82j88K31p3J7J29J29k95K23Q3k4J22J07k66j11P4o8m0k7M1
$$ 95 -21 -262 64 -118 -306 -75 -148 -131 -2 127 -168 55 138 114 236 343 77 -34 40 -28 -68 -95 -54
3543e4K28l73P4j1J12J79j03j23J58KJ02J2p0r9j8k76J31J30o9J53l56L71j85
$$ -54 174 -199 -125 -136 -24 155 52 -71 87 89 191 203 133 34 16 -260 -129 1 -68 85 -271 100 -85
3566h5J68J22k65J83K0k55J89j96k9J17p2QL3R7p5j2L5q4K06j42k5L08j65o4P9
$$ -85 83 205 -60 123 143 -112 77 -119 -148 -31 -103 -95 -62 35 -40 -52 -17 -101 105 -37 -62 246 81 17 96
3591I6j50j01J5J93r3RR4l08M1p2N5L19k33N2K95j33k07L8K47R4j09J07r2k45
$$ 96 -54 -155 -140 53 -40 -31 63 -245 -204 -276 -221 98 -135 -83 212 79 -128 -90 157 251 142 249 157 -88
3615h8k0L6L32l95R3K2J52k24j12J31k9K44r1j74J25o4J49l7j27K8K4K1j56K95
$$ -88 -108 -72 260 -135 -42 -20 132 -92 -204 -73 -102 142 51 -123 2 -62 87 50 -77 -49 -25 -4 -160 135
3639A35k54K26O7k18j3J9K7J10Q5l10m8O7K71M5k78K46j93n4J71l29K81k47K25
$$ 135 -119 107 174 -44 -57 -38 -11 99 184 -126 -174 -107 164 209 -69 177 -16 -70 101 -228 53 -194 31
3662C1l80K27J87j93K74j87j01l7L62k35J48j68K92m10J87M6o6J37l06L54j24
$$ 31 -349 -122 65 -128 146 -41 -142 -179 183 -52 96 -72 220 -190 -3 43 -23 114 -192 162 38
3683C8j67J27o3J72p3K42j67O1l99J02L05k47m3K45m11k28L45L16o9j5K0J8J8
$$ 38 -129 -2 -65 107 34 276 109 170 -229 -127 178 -69 -112 133 -278 -506 -161 155 86 71 91 109 127
3706A27p5L7K8j55J33k4j88l7J91J47l45J1j10M22l28k0J87o3J52n3r1K87l51
$$ 127 52 89 117 -38 95 71 -117 -154 37 184 -161 -150 -260 162 -166 -186 1 -62 90 37 -54 233 -118
3729a18K54M3P2r0l18K14l2j37J87j39j03j25J61N3kJ91p5j5k13J83K39Q4k18
$$ -118 136 179 251 161 -157 57 25 -112 75 -64 -167 -292 -131 -78 -80 111 36 21 -192 -9 230 314 96
3752I6j2j17j93M23m9J5j98RO1l41J48K26r4J04Nj6L37l98N9Mm0P8l95M43%j77
$$ 96 84 -33 -226 197 148 163 -35 -26 35 -306 -158 68 -26 78 83 67 404 6 65 69 29 107 -288 155 155 -22
3778b2j0k8J43l7k9O9k51j11J24K22J1J50k01r9K1Q3N9Q9j82R7N0j74R3OQ3qk71
$$ -22 -32 -60 83 46 17 86 -165 -276 -152 70 81 231 30 -69 -48 35 94 183 1 98 148 -26 67 73 156 148 -123
3805a23K26J57n15J83j2L7K57p0k15j10O6j77K97l7j68MJ82K7k4K24K9l53K63
$$ -123 103 260 -255 -72 -84 -47 210 140 -75 -185 -119 -296 1 -36 -204 -200 -18 9 -15 209 238 -115 148
3828A48q4Oj08J33j13k36j07Q9L05l60J09J80P1k62L57m0m6j85J17M00k29k32
$$ 148 64 70 -38 95 -18 -254 -361 -272 33 -327 -218 -38 33 -229 128 88 42 -143 -26 374 145 -87
3850h7N8N3m7j44k0k8K98p4N7J0k81R8M36k50L3J14p2L3Nk69R2l40J73P3K3N6
$$ -87 -29 24 -23 -167 -187 -215 83 9 66 76 -205 -107 329 79 112 226 154 187 192 -77 15 -325 -152 -79 -56 0
3876@l25N61k33j13l2j8J49O5o2O5J60l85K22p3j8P4J60j45p7q5M8L8J8J00pj24
$$ 0 -325 236 3 -110 -142 -160 -11 54 -8 57 217 -168 54 -19 -37 37 197 52 -25 -110 -62 -24 -6 94 87 -37
3902c7J20n7L1k06Q8J85p3J92j43o4k59K19k8P3j43L56j32m5k8j9K1M3J74l66
$$ -37 83 26 57 -149 -61 124 51 243 100 36 -223 -4 -32 41 -102 254 122 77 49 30 51 94 268 -98
3926i8n0J21ok5K26k73j29J54O4RJ6q5J91o5O5j27N3p4l6L9J67k3q0j93m4J83
$$ -98 -148 -27 -33 -58 168 -105 -234 -80 -16 -7 9 -76 115 50 115 -12 41 -33 -69 -30 137 114 34 -159 -203 -20
3952b0n4K7n7o7J26M9k30K64P1j07J31m7K5Qr6j2N9K6l38L5K50k86o7L14J04m9
$$ -20 -74 -47 -104 -171 -45 4 -226 38 109 2 133 86 111 119 23 11 70 96 -242 -207 43 -243 -310 4 108 59
3978E9j46k8J55j79K81j92j2J24j6r4J5O8j20j02M21l69J83j08J25j74K28j0P
$$ 59 -87 -115 40 -139 142 -50 -62 62 46 -48 -33 35 -85 -187 234 -135 48 -60 65 -109 119 109 116
4001A16o8L5o4K34k12Q3q3K7l0j8j0m9M4j38R1m9M0oN4Q5k28L1j48J73M8J55j89
$$ 116 48 83 19 253 41 124 41 68 38 20 10 -39 5 -133 -42 -91 -51 -57 -3 82 -146 -115 -263 -90 -42 113 -76
4028g6Lj6J8J03j26P8J25J26n05K52K17j27J01o0J7J5M7l80K72N7l05P9l5o6K90
$$ -76 -73 -89 -71 32 -94 -16 109 235 -270 -18 199 72 173 113 130 145 192 -188 84 141 -164 -85 -120 -186 104
4053A04j62P1O5m1j41K24m2M7j75N1K30k29R0j85K21o7j11mM0p9j79L27j44K71
$$ 104 -58 13 78 37 -104 120 78 125 -50 1 231 2 92 -93 128 61 -50 -54 -14 -93 -272 55 -89 182
4077A82l05J84m9j14M08k00j8j23j10L69l16J20k53L64k59L51M6m32J50j35J29
$$ 182 -123 61 12 -102 306 106 88 -35 -145 224 -92 28 -225 139 -120 231 277 -155 -5 -140 -11
4098a1J09k3k33Q1K19p8j53J62l08J28J66J23l55O0J91J52j01j47N9r7J51L3k06
$$ -11 98 75 -158 -77 142 64 -89 73 -235 -107 59 182 -173 -113 78 230 129 -18 41 -56 95 128 -78
4121g8J71j42K91l89K55p0j53P2J22N2j30j72O3K29k02K05l40K73K01l42L42l39
$$ -78 93 -49 242 -147 108 38 -115 -43 79 131 1 -171 -108 121 -81 124 -216 57 258 -84 258 -81
4143h1K35j26J11J15j32k25N0O6R1j89j22L28j18N2n5qJ93j32R1J03k23O5r4j83
$$ -81 154 28 139 254 122 -103 -53 13 104 -85 -207 121 3 55 0 -8 185 53 144 247 24 89 -5 -188
4167a88P5j78L28n6K0J63j53J43k63l8N9J02rRj17K5J22k64K83k29N3RP4q6j99
$$ -188 -113 -291 37 -19 1 164 11 154 -109 -147 -88 14 5 14 -103 -78 44 -220 63 -166 -113 -104 -30 -116 -315
4192c15N03m45L80JP2l66L14J15j15j78Q2j13n4M3o0P0L54m06J86j72L4K4j72
$$ -315 188 -257 123 124 196 -170 144 259 144 -34 48 -65 -119 -76 -136 -66 288 -118 68 -104 -70 -46 -218
4215b18J10K16p3j27J66R9k16J19Oo0L6l7j24Jk1k3L86k00j2J38k23k6p1J04j53
$$ -218 -108 108 35 -92 74 173 -43 76 82 22 58 21 -103 -102 -123 -146 240 40 28 166 -57 -83 -154 -50 -203
4240b03J88J70j96q7K61k89P6K3j28J03p4R9L8J71k47L3O0j24K35k07J30j30J7
$$ -203 -15 155 -41 -128 133 -156 -80 -57 -185 -82 -156 -57 -19 152 -95 -62 -2 -126 109 -98 32 -98 -81
4263h1J85k02O9p2p3J43o4P3R3ok0J2O6p8R2k38p0M6m1k6L21k3J0l2j52m2J73
$$ -81 104 -98 -29 -101 -174 -31 -95 -22 71 65 45 57 123 45 137 -101 -171 -125 -166 -192 129 106 116 84 -68 -110 63
4290F3J21q1M9k57K36k50j64K66Nm1j10r5M38j97l27J74K73l22J89R5n2r3J42
$$ 63 184 103 152 -105 131 -119 -283 -17 -12 -53 -163 -258 180 -17 -344 -170 103 -219 -30 65 13 -80 62
4313F2R1j61K26n8k35R8P3j68K23j96K6M8q1L7o2l9M0J82Q4j42j73J58k43L52
$$ 62 153 -8 218 160 -75 23 96 -72 151 -45 -19 29 -52 -15 -77 -116 -76 106 190 48 -125 33 -210 142
4337A42J43m01J68k54J38L87k26j18Rj89J59K07m38K92r4J28o1j09J83r1j62Q2
$$ 142 285 -116 52 -202 -64 323 97 -21 -12 -201 -42 165 -273 19 -75 53 -8 -117 66 -25 -187 -105
4359a05Qj19J69K42j52J47k85Q1M9k52J50J77O8k60j72L22J16k67k1L96l29K21
$$ -105 -97 -216 -47 195 43 190 -95 -14 35 -217 -67 110 178 -82 -254 68 184 -83 -104 292 -37 184
4381A84j91n5L52l82L16k76K23k17j56M05m03K85j72k6N1L32l93KJ87K9j42J95
$$ 184 -7 -62 290 -92 224 -52 171 -46 -202 203 -200 85 -87 -113 -62 270 -123 -121 66 95 -47 148
4403A48k61Q8L3N9nj19J43K51j55j22l7lq6J80j78J95k05j97N55n37K00K8J10
$$ 148 -113 -25 8 67 62 -57 86 337 182 60 23 20 -66 114 -64 131 -74 -271 284 -253 -53 -25 85
4426H5n2n2K87j24j03k47J28J28m2l58L64j72j12J32R6q4O9K25l78J79J25l4O
$$ 85 33 -19 268 144 41 -206 -78 50 8 -350 14 -158 -270 -138 -42 -126 -57 168 -210 -31 94 60 66
4449F6l1Q9k91Q4J38k41J43L29l56J23j37K25j70k6J89j3j81J37j89P2j4l6K4
$$ 66 35 124 -167 -83 55 -186 -43 286 -70 53 -84 141 -29 -55 134 121 -60 77 -112 -40 -54 -90 -66
4472f6J20K5K22m69N1J26n4L43q9j7l02K88l75Q4K8J95O2m61L37m5J3M9j34k1
$$ -66 54 79 301 -168 -117 9 -45 298 209 192 -110 178 -197 -113 -85 110 172 -289 48 3 16 65 -69 -90
4496i0R0K13j4j07j32K1nK7o5J48j48o7O9K01l29pJ64RJ76q8j37J4J2J33K2M8
$$ -90 0 213 199 92 -40 -19 -24 3 -62 86 -62 -129 -60 141 -188 -195 -31 -22 154 66 -71 -57 -45 88 110 158
4522A58Nk15kq7K01j93j6J12p1K86k09K39k64K53j20j3P6pj5l21k4J40J74K5k09
$$ 158 163 -52 -54 -141 60 -133 -149 -37 -108 178 -31 208 -56 197 77 64 140 133 118 -203 -227 -87 87 112 -97
4547i7J38J07j81N3L6K1J49l03K26j21l0K15q8j16j46L8M2J05J30q7J4j10k1L28
$$ -97 41 148 -33 20 56 77 226 -77 149 28 -2 213 125 9 -137 -99 -57 48 178 91 105 -5 -26 302
4571C02l08J00N4p1q5L3RJ93k10j6J63j68K0j30PJ59p4LL7k73K96O2n8J47j98
$$ 302 -6 94 148 77 -8 25 34 227 17 1 164 -4 16 -114 -107 52 -22 -19 18 -255 41 103 45 192 -6
4596fmn8J07Q6L2k52O6M8j36n6J61N1n2M2j19J64k97L99k44J72q8j09K15J49k52
$$ -6 -10 -68 39 125 157 -95 -29 19 -117 -173 -12 39 -13 29 -90 74 -223 176 -68 104 16 -93 122 271 19
4621A9J6o9K5K0K94k06l0j75k17J91K41k02J15n7L7J72L0l44K68l1N8m0p7J51
$$ 19 35 -34 -9 11 305 99 69 -106 -323 -132 109 -93 22 -35 2 174 204 -140 128 97 155 115 38 189
4645A89j77K3P7J62k24j25J66m0k06j0l1K07j14L16m79K64J27j05j78J64Q4R5
$$ 189 12 35 112 274 50 -75 91 51 -155 -165 -196 11 -103 213 -266 -2 125 20 -158 6 90 185
4667A85j69J9J03k06J85r5J1j83MJ2p4L41j64M8p9K47k63K2L6Kn9Q5qK0N2N2p0
$$ 185 16 35 138 -68 117 22 33 -150 -146 -134 -208 133 -31 17 -62 185 -78 -56 -20 -18 -77 8 0 20 72 124 54
4694E4k81L74j00rk90L58j13j13l2L32j25j13Q4j00M8j48J28J89k8j48j93N9J75
$$ 54 -227 147 47 38 -252 106 -7 -120 -152 180 55 -58 26 -74 -26 -174 -46 143 115 -33 -226 -167 8
4717Hp4j2J68k31J45J62j71k5j33K53j00N9n2j43J78R2k9j3N5o4l49K60LJ69j12
$$ 8 -66 -78 90 -141 4 166 -5 -30 -163 90 -10 49 -3 -146 32 124 95 82 137 73 -276 -16 -13 156 44
4742D4j19K27k36J38J1j25J99j11r9Mj8J2k98L77J31l90K18J65k45p0K15m1J44
$$ 44 -75 152 -84 54 65 -60 139 28 -71 -67 -85 -73 -371 6 137 -253 -35 130 -115 -185 30 -11 133
4765A33j09q9r0K48k02MK18j20R1Jj90K36j46O6k2m1m10K37K48k9j83n2J72J18
$$ 133 24 -65 -155 93 -109 -105 113 -7 84 85 -105 131 -15 51 29 -12 -422 -185 63 34 -149 -201 -29 89
4789H9m9L9j85J71R1j79n2l9J41n6q3J86j07M7p2R4k08J51K26l16j34k0K58j09
$$ 89 40 79 -106 65 156 -23 -75 -114 27 -29 -112 74 -33 14 -58 36 -172 -21 205 -111 -245 -265 -7 -116
4813a16J30R9j26N8k1j73Q7J35m08K09N5Lp1K18j49j92M17Q1k85m1J36j91J86
$$ -116 14 113 -13 45 24 -149 -62 73 -335 -126 -71 -68 -139 79 -70 -262 155 236 -49 -90 46 -145 41
4836D1J1j56M1Pn1qL31k06j32K0N6N2q2O5K01l85K43p5j81J74n7L90l38j0K27
$$ 41 52 -104 -63 -56 -107 -115 216 10 -122 -102 -46 6 -76 -11 190 -195 48 -27 -208 -34 -91 299 -39 -49 178
4861A78l05K64K13l67j53K80k48K24L3J21l35P9P7q2L1k14M53k89J32r4k25L12
$$ 178 -127 137 350 -17 -170 110 -138 86 119 240 -95 -16 61 -21 10 -204 249 -40 92 -2 -227 85
4883H5j08P3O0l30P6K1J81o9o4O2n8J27k66J96R5k09J07j10M9J54k8K28k02K00
$$ 85 -23 50 110 -220 -144 -123 58 -11 -75 -13 -71 56 -210 -14 81 -128 -21 -131 -82 72 44 272 70 270
4907B70k31j55K88l00J83Q5l07JL59l01J49j51L49k00R7l6J1k96K87j69j9k5j2
$$ 270 39 -116 172 -128 55 140 -167 -166 193 -108 41 -110 239 39 136 100 111 -185 102 -67 -86 -111 -123
4930a23L62k62k2J79j01k0r8J35q2K37j12j80j70J66L22k25j72J14K17k21J28
$$ -123 239 -23 -45 134 33 13 -85 50 -32 205 93 -87 -257 -91 231 6 -166 -52 165 -56 72
4951G2m06M39k77J83j2J03j51j39L07m9j86J02j49K22j07M6J16l8n2O3k77K08
$$ 72 -334 105 -172 11 -1 102 -49 -188 119 70 -116 -14 -163 59 -48 -2 114 76 24 87 -190 18
4973A8j52K70j65j51p1K01Q6J7k98L37l2J8L0o0P9P5l47J23j82L73j76K0O2k09
$$ 18 -134 136 -29 -180 -251 -50 36 53 -245 92 60 78 108 48 127 202 -145 -22 -204 169 -7 13 75 -134
4997a34L36q0J7k93O5J41R5j79J59j01K58l04j9j61J61J02k19J57r1J98j99J72
$$ -134 202 122 139 -154 -89 52 147 -32 127 26 284 -20 -39 -200 -39 63 -156 1 -90 108 -91 81
5019H1J2k36L6j9J24r4o0K10j10R6lN0r0O6l87M20k53L43j24j13J43l5J02j67
$$ 81 93 -143 -107 -126 -2 -96 -156 54 -56 40 37 87 -3 63 -324 96 -157 186 62 -51 92 57 159 -8
5043hj29K42r8k3N1k10Q2J52l54K53P5M8p1j11j92K88p0J57J64o21K39j29L70
$$ -8 -137 105 7 -16 35 -175 -93 59 -295 -42 33 81 10 -101 -293 -5 -75 82 246 -375 -136 -265 105
5066A05j24J2j40L02o5J81l77m7L36j26K36k35L3j9k30K92r1k24O7O2r1J59l75
$$ 105 -19 -7 -147 155 90 271 -106 -153 183 57 293 58 91 72 -158 134 43 -181 -114 -52 -143 16 -359
5089c59K49mP1O5j2J08mN0j23j19J27J99l84K40r3n7J06Q2k52j26K54j03q0J55
$$ -359 -110 -114 -43 22 10 118 114 164 41 -78 49 248 -136 104 11 -46 60 142 -110 -236 18 -85 -165 -10
5113a0K40k79K69k14k6J2j27K9J97O6k38J66J75n93L65l4R5k48MJ73O1j80PR4
$$ -10 230 -49 220 6 -20 -8 -135 -106 91 157 -81 85 260 -333 32 -2 93 -155 -151 22 83 -97 -90 4
5137DnKp7K75j6JJ02k89l1o4L97l08qJ20L5j99p1J07j46K74l2J19k16J37j84j34
$$ 4 -1 1 -76 199 183 184 286 -3 -34 -98 299 -9 -17 103 138 -61 -132 -25 -171 103 71 190 -26 111 -73 -207
5163b07L89pk5o3k10K25j94K9J83M6j42n3J32r9o0L8N8j80J21q5l1j08J33J52
$$ -207 182 175 150 87 -123 102 -92 -63 120 166 24 -29 103 4 -56 -18 40 -140 -19 -104 -135 -243 -110 42
5187D2j39j28K94l3k82L60j51O8l01L80k69J57K5j06J37K5j42Q1o1l4J22j69J37
$$ 42 -97 -225 69 36 -246 114 -37 31 -270 110 -159 -2 23 -83 54 79 -63 18 -43 -77 45 -124 13
5210A3l3j07j87L21M7r3M4J35j47mp8N5q3J64j88J44K0Ol02J76J2q5K28n2l5K20
$$ 13 -20 -127 -314 7 54 -39 5 140 -7 -11 -89 -34 -117 47 -141 3 23 29 -273 -97 -85 -170 58 6 -29 191
5236A91k83l16M18K20l7j45l6J60m2q7q4K17j25o2J23j57k05J77J83m26K25O5
$$ 191 -92 -408 10 230 193 48 12 172 130 43 -41 176 51 -11 112 -45 -250 -73 110 -316 -91 -26
5258b6J32Q1j91M9k8L46k11j46J87r4j70k11J48K6K44j58J69l25Q0K06p4j19p7
$$ -26 106 187 -4 45 17 363 152 6 193 99 -71 -282 -134 -108 136 -22 147 -178 -98 108 34 -85 -162
5281a62J86o0j00P4o0P3O3O9rj06j88m9P1K32J77j91j91J71N3j12j22K05m42N48
$$ -162 24 -36 -136 -62 -122 -49 14 83 74 -32 -220 -269 -198 34 211 20 -171 0 53 -59 -181 24 -418 130
5305A30N1j51L6j37L54k22o5Q2M0l96L42J07p8j95j95K84J39j07K27k01j60L23
$$ 130 181 30 66 -71 283 61 -4 78 118 -278 64 171 93 -102 -297 -13 126 19 246 45 -115 208
5327B08k94P7k5mJ21%k61p1L10j92J43m1J26k18kJ91j06J6J43k86J22Q8j34K30
$$ 208 -86 -9 -34 -38 83 83 -178 -249 61 -131 12 -29 97 -121 -123 68 -38 -22 121 -165 -43 45 -89 141
5351A41j28K0O9k60L03rk59J83j00J28k90L21m7J2k6n9J97Kk51j8J71m6j57K55
$$ 141 13 33 102 -158 145 136 -123 60 -40 88 -202 119 72 84 58 -1 196 198 -53 -71 100 54 -103 152
5375A52r9n8J25j38J32l62K45K10k04Mr0J11n7J98j58J22j75K87k0j09o2j29J94
$$ 152 53 -5 120 -18 114 -248 -3 207 3 7 -83 28 -29 169 11 133 -42 245 225 116 54 -75 119
5398A19k93J7J56r0K52j09j2M0L5j48K21k88N7L5k10J68j04K26O7m78L56L46n14
$$ 119 -174 -157 -1 -91 161 52 40 80 115 -33 188 -100 -43 -8 -218 -50 -154 72 139 -339 17 363 -151
5421a51J8K25j23k3K75j78J1L9Jl8q5Mo2J42p4m2L61l66J63j71j46K21j26J42
$$ -151 -133 92 -31 -54 221 43 54 93 94 56 -29 -25 -87 55 -19 -61 300 -66 97 -74 -220 1 -125 17
5445A7M38m22j35n0K98R7j86j78Q7p7J00N7o2k4M0l8J59k16L35l12J82K4p9Lj09
$$ 17 455 33 -102 -152 146 243 57 -121 -34 -111 -11 46 -16 -40 0 -38 121 -95 240 -72 110 134 55 58 -51
5470e1j40M4P0n0J16N1R0k3K7k16J91k40Q2n2J66l00L72k50J75Ol7J56k13j35
$$ -51 -191 -147 -77 -127 -11 40 130 107 134 -82 109 -131 -49 -101 65 -235 137 -113 62 68 31 187 -26 -161
5494a61L02l70M39k65J35j27nK4m5o5Q4J43k13N6K39j05p0j52K54j03N7L7P9k23
$$ -161 141 -229 210 -55 80 -47 -52 -28 -73 -138 -54 89 -124 -68 171 66 -4 -156 98 -5 52 89 168 -55
5518e5K2J86k70J26L3J77k18Q3j5%j22K76l06K62l68j1O8R4O8k14L08j13J09R9
$$ -55 -33 153 -117 9 42 219 1 84 69 69 -53 223 -83 179 -189 -200 -132 -38 30 -184 124 11 120 219
5542B19k28J40j03j1j44J1K00J8N8k85l4K21J5m00K43j88L46j50k4P1m0O8L4m1
$$ 219 -9 131 28 17 -127 -116 84 102 160 -125 -159 62 77 -323 -80 -268 78 -72 -96 -25 -65 3 37 -4
5566dj22Nr7K97k74J38O4K05m65J82J86k88K36L9k00q4R9J27J00j93K62j98q8
$$ -4 -126 -121 -218 79 -195 -57 7 212 -253 -71 115 -173 63 102 -98 -182 -83 44 144 -49 213 15 -73
5589g3k2k6M6K55l91L05l76L08P7P1k39K16r7j25J16j37j2P2L5K7P4m07K87J7
$$ -73 -95 -121 -75 180 -211 94 -282 26 103 174 -65 151 54 -71 45 -92 -104 -32 3 30 104 -303 -16 1
5613AJ29p5j48N5j40J12j93J81J45n9o9n4l8R5K13k5J79l92K54j84M5j28Kk7j25
$$ 1 130 55 -93 -38 -178 -66 -259 -78 67 8 -61 -115 -153 -58 155 130 309 -83 171 -13 32 -96 -94 -121 -246
5638b46M15k73P5K25l11k02L45j9J69q0K43j82k72J48J66k66j86J35N4j09J20
$$ -246 169 -104 -29 196 -115 -317 28 9 178 98 341 159 -113 35 201 -65 -251 -116 -62 -171 -51
5659e1K10j03o3m5j11k30O70j0j84k22K21J2k67K25J8l8N1j1m3r7k64K96j69J86
$$ -51 159 56 -7 -52 -163 -393 277 267 83 -139 82 94 -173 52 70 32 83 72 29 -68 -332 -36 -205 -19
5683a9J33j87J2K0K77m48K69k14L3J42j90L0K28k1j40m7LK37l70N44m72J58J71
$$ -19 114 -73 -61 -41 236 -212 57 -157 -124 18 -172 -142 86 65 -75 -122 -119 118 -252 292 -180 -22 149
5706A49j64j82M61l94k02L49j00j07K11K59l09q4J38Q4j53r7J99R5o2p3k9l3k82
$$ 149 -15 -197 264 -130 -332 17 -83 -190 21 280 -29 -113 25 109 -44 -141 58 153 91 18 -11 -44 -326
5729c26M22q1o2L95k30j93J64j10J92m1l3L7k17l1q7L11m24M46o0m6N2qj03l5
$$ -326 96 15 -47 348 118 -75 89 -21 171 130 97 134 -83 -114 -201 110 -314 132 72 26 78 70 -33 -68
5753f8K99k33J46l9Q0j45r2J70J2j38J96j22J5k18J05j1K43n9l37P6J86p2j06
$$ -68 231 -2 144 105 185 40 -52 118 130 -8 188 66 81 -137 -32 -43 200 141 -196 -120 66 -6 -112
5776a12MK30o%m6q7j8J03j02J85j96l6J92o8k27J22p2K29j44J3J35j97J56j12
$$ -112 -108 122 116 116 70 -17 -35 68 -34 151 -45 -81 111 43 -184 -62 -134 95 -49 -36 99 -98 58 -54
5800e4J17k3N8j53J1K52L8j17k9j31n9J96l36K47l9j30K64m2j64J57k24J59J0
$$ -54 63 40 98 -55 -44 208 246 129 100 -31 -90 106 -230 17 -22 -152 112 70 -94 63 -161 -2 8
5823Hj88K59n4n4J35j53L04j0K0m20K88j90QP5p8L0K96m33K44p6j51L03j69J0
$$ 8 -180 79 25 -29 106 -47 257 247 267 -153 135 -55 -47 28 -50 -20 276 -157 87 11 -140 163 -6 4
5847DR3k17J55o8N1j17K49j35Jm4j33K09l48J77R3j00J02k18K26K03j52o6j55
$$ 4 97 -120 35 -33 18 -99 150 15 16 -28 -161 48 -300 -123 -30 -130 -28 -246 -20 183 31 -35 -190
5870a90J55NK7J54J85k03k19K03K7j64p5qM4j31J52J91j76j59O3K02J95j71k1
$$ -190 -35 -30 -3 151 336 133 -86 117 144 -20 -95 -103 -59 -190 -38 153 -23 -182 -119 83 278 107 86
5893H6k21J36J4j10J89j36M5j11J81k19K68Q1l39L51j97n1J84k9l7J7l61O9K56
$$ 86 -135 1 15 -95 94 -42 3 -108 73 -146 122 203 -136 215 18 -33 151 122 85 102 -259 -190 66
5916F6j03K09l09Q3K65k37J34M2q2K09k88J77m31K1L80k65K44N9k59K38Nk37J55
$$ 66 -37 172 -137 -54 211 -26 108 150 68 277 -11 166 -265 -244 136 -129 115 174 -85 153 158 -79 76
5939G6j06J35l68K18J51J0j3k36J41J29k3k69J92j87K80l04L11j14j6lj09K20
$$ 76 -30 105 -263 -45 106 116 103 -133 8 137 114 -155 37 -150 130 -174 137 23 7 4 -105 115
5961A15j64J04J08q9j20oL26k70J49k33Q8j11J34o3N5N6k77J82n2J71m0j43J04
$$ 115 -49 55 163 74 -46 -52 274 4 153 -80 8 -103 31 -32 23 79 -198 -16 -68 103 63 -80 24
5984B4m2j78K38r0M4j66k8M57l21J08p5J63j4o8Q4M9r6J76q2k18K05k50O8OJ08
$$ 24 -18 -196 42 -48 -4 -170 -198 259 -62 46 -29 134 120 52 136 185 89 265 183 -35 170 -80 -12 -6 102
6009A02n16M13J44l62J95j13J06K88r7l35o0K09J61J6j73N8o9JM0J44j08j64l3
$$ 102 -414 -1 143 -219 -24 -137 -31 257 160 -175 -235 -26 135 151 -22 36 -33 -32 8 152 44 -120 -153
6032a53J5M96j39r1j99O6J82r9J92l88K79j25o6J55q6p6J43o6n3o2mO8j72K69
$$ -153 -138 358 219 128 -71 -5 177 78 270 -118 161 36 -30 125 39 -37 106 40 -13 -75 -79 -11 -183 86
6056H6j35J49j45L14K2j86r4J64k29O7j88QL04l49J93R5n5L1j9j26J15j63k8P2
$$ 86 -49 100 -45 269 291 105 11 175 -54 13 -175 -167 137 -212 -19 76 21 52 33 -93 22 -141 -169 -97
6080i7M1K43k7k02m2J15O4OJ0q3J26j97j40J87J38k24J84j43N4j63J42kJ10j76
$$ -97 -56 187 160 -42 -84 31 95 101 111 28 154 -43 -183 4 142 -82 102 -41 13 -150 -8 -10 100 -76
6104g6J79N0Jj93M2J6j28O4Q7o6L6q4J33r0p1L5J33k81J72R3j43J11Q3k3J33n45
$$ -76 103 153 154 -39 3 19 -109 -45 42 -24 12 -72 61 -29 -100 -65 68 -213 -41 52 -91 20 103 80 213 -332
6130c32M20Nq4j7j44L60k28J7N2Pj48N4J39K75m31K19r0Q1Ml66J12K64k68R4k68
$$ -332 88 93 9 -8 -152 208 -20 -3 49 56 -92 -38 101 376 -55 164 74 155 159 -207 -95 169 -99 -5 -273
6155b73J31P2J08j9n1Q2q7N5P2p9p2M7m7J64l31J74J66k74M29J03l73j74M19o4
$$ -273 -142 -70 38 19 -32 50 -37 18 90 11 -61 -14 -61 103 -228 -54 112 -162 267 370 -3 -177 242 178
6179A78l34K02mJ40k86M9K30n3k99J12K68l24J92j96L6J58K09m06l2K32J92k65
$$ 178 -156 46 42 182 -104 -55 175 122 -177 -65 203 -121 71 -125 -89 69 278 -128 -160 72 264 -1
6201aj64L52j47j92R9m7J09J4r3L8J14M8q1k63K11K52l62J88k5l2P3j36J25K4
$$ -1 -165 187 40 -152 -53 -100 9 23 -70 -32 82 130 49 -214 -3 249 -113 75 50 18 91 -45 80 104
6225A04k78J39K50l66J37n9o8K64l85L83l4J83O8m41J53k61Q8K84j25q1l8O6Q5
$$ 104 -174 -35 215 -151 -14 -73 -141 123 -262 121 87 270 338 -103 50 -211 -123 161 36 -45 -83 -17 68
6248F8k4m1k47J56P7l2j9K14J2k89K48p7n1J13j71L18j19k38P7K18k80l4J44k6
$$ 68 44 3 -244 -88 -11 -43 -62 152 164 -125 123 46 -5 108 -63 255 136 -102 -25 193 -87 -121 23 -3
6272cRJ85j46J84l13J12Q5K69k31k45N9R2k4J97m00J05J80j59J41k10J23J36j16
$$ -3 6 191 45 229 -84 28 113 382 151 -94 -35 57 33 230 -170 -65 115 -44 97 -113 10 146 30
6295C0J11j16j55K29Q8j6k46k6J17O0k25Q8p0P1O5Q7n2J39k76K00j82J89j21j75
$$ 30 141 25 -130 99 187 171 -75 -101 16 76 -149 -61 -131 -60 5 92 40 179 -97 103 -79 110 -11 -186
6319a86O1K50o1k21N6M37l99K4j99K42J8l51N33j35o6n6K4j61J72K2O3O5k84j7
$$ -186 -125 125 64 -157 -101 336 -63 -39 -238 4 22 -329 204 69 3 -53 -29 -190 -18 4 67 132 -152 -169
6343a69J05j26K23j21J97k0j60J0K14j24k32K62k41r0J65j63P5L73j31J5m4j69
$$ -169 -64 -190 33 -88 109 89 -71 -61 153 29 -203 59 -182 -272 -107 -270 -195 178 47 62 18 -151
6365a51J28K30k12j98L74k25oJ61n7j16j6L95l79R9K4k95pJ99J08qR8k64n9K02
$$ -151 -23 207 -5 -203 171 -54 -60 101 44 -72 -88 307 -72 27 51 -244 -251 -52 56 48 146 -118 -177 25
6389B5K7J05j96j59J29N2P1KKJ52m18K34j44J66Q5p0j24J4l0J04O0Mrq0l7O2j7
$$ 25 52 157 -39 -198 -69 -17 54 56 58 210 -208 26 -118 48 133 63 -61 -47 -77 27 87 91 82 2 -35 27 10
6416A0J18Ml11K97k35K33j51J2k7J4R9J93m00K8k5K36j50O5o3J42J02k27K3j66
$$ 10 128 132 -179 118 -117 116 -35 -23 -50 -36 63 256 -144 -116 -141 95 -55 10 -53 89 191 -36 -13 -179
6440a79Q7J97l44K80k02K38j61L16j16k80Q4J86k11K85j50o8J73j88J2j53N2J92
$$ -179 -92 105 -239 41 -161 77 -84 232 116 -164 -80 106 -105 180 30 -38 135 -53 -41 -194 -142 50
6462E0lJ30j29o8j06Q2M3n6j11r4K41m8k50L18Mp0K81k21J98O5k30K5J11m03K30
$$ 50 47 177 48 -20 -126 -44 -1 -57 -168 -262 -21 -69 -319 -1 3 -67 214 -7 191 256 26 51 162 -241 -11
6487a1J5J41J00l10m7Q2J00l02J46m8m1Q5K92O9k48j10R0k04J64L6m2J03M1j76
$$ -11 4 145 245 -65 -112 -30 70 -232 -86 -134 -175 -90 202 271 23 -87 3 -201 -37 -1 -43 60 101 -75
6511g5K22j8k86L62o7J12p6k61k9l0K65J21l85L7K31Q3l21q9K69j24J09q4N6j20
$$ -75 147 129 -157 205 138 250 174 -87 -116 -146 119 240 -145 -108 123 206 -115 -204 65 -59 50 -34 22 -98
6535i8r5K30j81L39j82J55k89J55J15j18n9R7p5n3RN0jk25K46O7j00J98J2n8Q2
$$ -98 -193 37 -144 195 13 168 -121 34 149 31 -28 69 -6 -59 -50 0 -1 -226 20 87 -13 185 197 139 221
6560B21k8k86K18l4J56p2ok24Q3o2O5k2J08k09n5K05j34L5j70L45k39O1P5k12
$$ 221 193 -93 125 91 247 175 169 -55 28 -34 31 9 117 -92 -147 58 -76 -41 -211 134 -105 -44 31 -181
6584a81M64m57K51j71j67M20k59R5K57l32J63k74K15qj96M53j60j20J11l8M5j81
$$ -181 283 -174 77 -94 -261 159 -100 -5 252 -80 83 -191 24 16 -180 273 113 -7 104 66 111 -70
6606g0Q5p5J12k06K48r7L5k4o9O7J23J12l90P1Op1L58l60O6j91M50k2k43K18k63
$$ -70 15 -60 52 -154 94 -3 32 8 -61 6 129 241 -149 -78 -72 -143 215 -145 -79 -270 180 158 -85 133 -130
6631a30J03Q8m1J01j58J7k92n3M28M7l07J31K22j23j80p0M3J65m2L5J94l00J24
$$ -130 -27 61 20 121 -37 -20 -312 -365 63 110 -197 -66 156 33 -147 -217 -174 -9 -51 -16 178 -122 2
6654BK70l95m8J12j2K2K8j77K38N2l4k87J90O4K24p6r2J20l07q2P3K64k55K43
$$ 2 272 -123 -171 -59 -71 -49 -21 -198 40 92 58 -229 -39 25 249 173 81 201 -106 -188 -115 149 -106 137
6678A37k48K7J35P3l10J66K19l02K18r4L6m5j04M3J1J09q1J31k9J1p1J2m7R3o4
$$ 137 -111 -84 51 124 -186 -20 199 -103 115 21 57 12 -92 -49 -38 71 -10 121 92 103 32 44 -3 90 26
6703B6P6N3l56Q2J40M8P9k46J81l10K09Q4r8j71K10J41j73J04l8K07j04j87Q7
$$ 26 102 155 -201 -119 21 69 148 -98 83 -227 -18 66 -32 -203 7 148 -25 79 41 248 144 -43 44
6726D4j62K45P2j11k29O9L14k0j88m6R3k98L09k28J84L3J3J40m76L46n8K27n12
$$ 44 -118 127 199 88 -141 -72 242 222 34 -12 81 -217 92 -136 48 81 94 234 -242 104 46 273 -239
6749b39N0J71kJ69r1p4N7j1l9p6L5J86rj49J52o8J27j59q9j45L07m6j2j41R5M3
$$ -239 -189 -18 -20 149 58 -16 41 30 -9 -85 -50 136 127 -22 130 62 189 30 -59 -204 103 57 45 -96 -1 42
6775D2M7j60J6K96k45Q8k85K60j64O8l2J52K3j45l02K77M4k2Q9J22j78P3M5l33
$$ 42 89 -71 -55 241 -4 84 -201 59 -105 -37 -69 83 106 -39 -341 -64 -20 -42 47 169 -9 64 109 -224
6799b24L06j14n5J02K18m35K40n3o0J02p1j53K4J66J38j17m5J83j71K11Lj87p9
$$ -224 82 -32 -87 15 233 -202 38 -15 -75 27 -44 -197 -173 -7 131 14 -31 152 -19 192 195 8 -71
6822g1J08L6j41q5P7KJ59j83J13pk25K25k40N32k59p4N1j81J93R5O2o0J02j65
$$ -71 37 73 -68 -153 -76 -74 85 -98 15 8 -217 8 -232 300 41 -33 18 -163 30 125 187 127 229 64
6846F4J13k81pK22j72k9J18k43J72p1K98k67q3J25j01K38j45J10m2j35L05j11
$$ 64 177 -104 -111 111 -61 -90 28 -215 -43 -114 184 -83 -166 -41 -142 96 -49 61 19 -116 189 78
6868G8M6k06j05K46m9k07K09p7p7J03K20l7k52N6j31K50o2j7J5L0L6J21O1l10
$$ 78 124 -82 -187 59 10 -197 12 -65 -142 -39 181 144 -108 -52 -183 67 5 -12 3 33 69 190 251 -59
6892e9J38j83J97m9J98l60NK76k32K2o3j34J45J1Q8J09l6k18nR6Q4J6k4m0J21
$$ -59 79 -104 93 44 242 -118 -113 163 -69 -47 -110 -244 -99 -88 0 109 73 -145 -150 -54 30 46 22 -18 103
6917A03k20J50j63J61P3p8J37k98PL16j50J69l19K97n5k04NK46k1%k04j10J79
$$ 103 -117 33 -130 31 104 26 163 -135 -128 188 38 207 -112 185 130 -74 -69 177 156 156 -48 -158 21
6940B1N7m7l6j68N0R4j68K80j94L3ML12k14J29j57j64M2J49k2k00Q8m9jJ03o4
$$ 21 78 31 -5 -173 -123 -29 -197 83 -111 -78 -74 238 24 153 -4 -168 -126 23 1 -199 -111 -160 -161 -58 -122
6965a22M22j41j04L2k53N1m1l3J18J10j18J42k66RR9j00K56j75M3j29J3K65k03
$$ -122 300 159 55 87 -166 -115 -156 -189 -71 39 -79 63 -203 -194 -95 -195 61 -114 -71 -200 -187 78 -125
6988a25L08l30m2r2K09K16j9j42lJ26j47J26P2l5k11R8m1q4j6K17o7Pln6J59o4
$$ -125 183 -147 -189 -281 -72 144 125 -17 -20 106 -41 85 157 122 -89 9 -32 -116 -132 85 18 25 22 -34 125 61
7014F1m8O1P1m1q4P8k46J12J9j37J04L3j24J77j08L96k74M9l28J86p0K42m7K8
$$ 61 13 74 145 104 20 98 -148 -36 -17 -154 -50 -17 -141 36 -72 324 50 99 -229 -43 -113 129 82 110
7038A10k3k30L22m42k2J35N0J65K76l76O6j49K2K31j88M4Q0k19M8K10j66K29l65
$$ 110 87 -143 179 -263 -285 -150 -100 65 341 -35 31 -118 -96 135 -53 -9 71 -148 -100 110 -56 173 -192
7061a92K17l4k8J51P5j72P4k06J36J1M2j86P3RL5J03rj13j4J54k47J84N4j79J66
$$ -192 25 -9 -37 114 189 17 91 -115 21 32 74 -112 -39 -30 5 108 99 -14 -28 126 -121 63 117 -62 104
7086A04M7l53K34q8K67l28K1n7LQ7J5K2j91P8K85r5m2J00M1k01R6r9K04j46j38
$$ 104 151 -202 32 -56 211 -117 -96 -153 -150 -63 -48 -26 -217 -139 146 51 9 109 150 -51 45 -54 150 4 -134
7111a34J20k7K6o6o0L71k14J61j49k25R6K00k44L07j30J92k96Q3p9J61l9l13L45
$$ -134 -14 -41 -15 -81 -141 230 16 177 28 -197 -101 99 -145 162 32 224 -72 11 -68 93 54 -259 86
7134H6n2j96K11K9n3k7m4q9K94N5j8l2q2q9n5J40R6k80O8J88j68R1J3l8q9J20
$$ 86 34 -162 49 78 25 -2 -46 -135 159 214 196 164 82 -7 -62 78 174 -106 -38 150 -18 73 86 48 -41 79
7160G9r5k3L3J28k00J73K2k7j88p2L34rk94L98n18L45r9j26J28j69n8J11J08J91
$$ 79 -16 -39 -6 122 -78 95 117 90 -98 -170 164 155 -139 259 -259 86 -13 -139 -11 -180 -238 -127 -19 172
7184A72P9l51K02k71J15L46k62Q1q5j75K39K2M6r9j67j16Q6r6J96P8M6l40L49
$$ 172 251 -100 102 -169 -54 292 30 111 26 -149 90 112 158 59 -108 -224 -138 -234 -38 40 86 -254 95
7207I5k24M9j7q1O0K23k27K49o2Qj41k2Q8K30j04j23J12k5q4j94K8L83k55j4J40
$$ 95 -129 -80 -97 -178 -118 105 -122 127 65 73 -68 -90 -2 228 124 1 113 88 4 -190 -162 221 -34 -48 92
7232I2J72l27M9K40j43j40k0L1J5K5k0m6K34k35J46j27K1k29K54L24k45Q5k33
$$ 92 264 -63 -14 226 83 -57 -77 -46 -31 -6 -26 -72 162 -73 73 -54 -33 -262 -8 316 71 156 -77
7255g7K95m73K44K14k89J70o9O9n5j22j66K18k4k00L75j65j53K31M6j60p2K08
$$ -77 218 -255 -11 203 -86 84 15 84 29 -93 -259 -41 -65 -265 110 -55 -208 23 69 -91 -163 45
7277D5j25k7N3R5Q5k25J44l6%mj18J5J77j70MJ15Q6l54K32r9j04L10J6j29k5Q8
$$ 45 -80 -107 -54 41 126 -99 45 9 9 5 -113 -98 79 -91 -87 28 114 -240 -8 -107 -211 99 115 -14 -39 49
7303D9j86N07m74K81k29j21J99p8r8NK02j59K31j49J5N9J30j17r1N8q3Q1M8N7
$$ 49 -137 370 -104 177 -52 -173 26 -52 -150 -145 57 -102 129 -20 -5 54 184 67 -24 34 -49 32 80 137
7327A37j24j92J32N1O0J41k09N2j87K57M0j42O2K0k74K21k39J26J96j39oP6J17
$$ 137 13 -179 -47 4 64 205 -4 48 -139 118 158 16 78 98 -176 45 -194 -68 128 -11 -17 59 176
7350A76l63K13k9j16o1M22k57j5J97J9j50j89j63K44N6k70K99k3L7kn8J71k36
$$ 176 -187 26 -3 -119 -180 242 -15 -30 167 186 36 -153 -316 -72 -16 -286 13 -10 27 25 -33 138 -98
7373i8j0mQ4j58Q4K07J09j1l58J14J49k56L0r5K84M2k90J5J53j49L49k56K8Q1
$$ -98 -108 -112 -28 -186 -102 105 214 203 -155 -41 108 -148 -118 -213 71 113 -177 -162 -9 -158 191 -65 -37 44
7397D4j10J70p4p6K12k20L5O5K4r7J35l9l01L84p7m7j06k29J65O9j37K75J3J96
$$ 44 -66 104 30 -46 166 -54 -19 46 70 -27 108 69 -232 152 75 28 -78 -307 -142 -73 -210 65 78 274
7421B74l73K0J78j32l80K85LQ9J47On8k0R1k07K48J0rn8K4k10j94J61K08km5j3
$$ 274 -99 -79 99 -33 -413 -128 -125 -36 111 117 59 39 130 -77 171 181 172 114 138 -72 -266 -105 103 101 56 43
7447D3p0o3L26j89J12J17m40R6j6J51J1J11o5k59K0P4j53M13k09J7lN7j7j76J52
$$ 43 -27 -90 236 47 159 276 -164 -68 -84 67 78 189 124 -135 -115 -41 -194 219 10 27 24 81 64 -112 40
7472D0k46J00M9j47K89j50K57j34p2K23m34J97J21j31r8J16j90J89N5L0k34O6
$$ 40 -206 -106 -57 -204 85 -65 192 58 -14 209 -225 -28 93 -38 -136 -20 -210 -21 34 64 -170 -104
7494a04j5L73j99J71k96Q3pJ29k16N9L3L1q1N1j5q1K33j96j9q3P0J6J21m1J16
$$ -104 -119 254 55 226 -70 13 6 135 -81 -22 11 42 -39 12 -3 -84 149 -47 -66 -149 -79 -63 58 17 133
7519A33rk65J35J86o9l2j68L9J21L6K8m4j94J08J8J6r1J12J04j84k6r4R4J83p3
$$ 133 124 -141 -6 180 111 79 -89 -50 71 107 135 91 -103 5 23 39 -52 60 164 -20 -46 -140 -46 137 64
7544F4p3%K50k01J22j49p3J98l78J77k42J77K92j48O6r9L6J59k23l8k5K34K9j50
$$ 64 -9 -9 241 40 162 13 -60 138 -240 -63 -305 -128 164 16 82 -17 19 178 -45 -83 -108 126 155 5
7568Ek10nK01k10K64J09p6k97J62j31K49j61N8J83k32O9L5l0K1J49j38j16o0M5
$$ 5 -205 -210 -9 -219 45 154 78 -219 -57 -188 61 -100 -42 141 -91 -22 13 -17 4 153 15 -101 -161 -116
7592a16lLL90j59j11o9k9Q1n0R0q2J39p0kN9j4p4JnJ8N5j68k4N1K27q7l1p2k4
$$ -116 -119 -116 274 115 4 -65 -94 -13 -63 27 -55 84 14 12 71 57 -17 -16 -21 -3 52 -116 -140 -89 138 51 20 -52 -76
7621g6K66j87o2K47k28K7L49m99J71k51J50P1J56j38J33j0k08r0L40k47pm5j81
$$ -76 190 3 -59 188 -40 -13 336 -163 8 -243 -93 -22 134 -4 129 119 -89 -179 161 -86 -93 -138 -319
7644c19M35r4k3p0J71o1o9J11k6r4J52n4m5K94m13J31qJ10k28P8J34P5r9n1n2
$$ -319 116 22 -1 -71 100 39 -30 81 55 -39 113 59 14 308 -105 26 18 128 -100 -22 112 187 88 37 -15
7669a5j67L16q1j57K31Lk01K00j91K58j82O2L9r0J94l08o5K11n5l1R9j57j31L70
$$ -15 -182 134 53 -104 127 130 -71 129 -62 196 14 76 115 25 219 -89 -154 57 2 -29 70 -87 -218 152
7693A52o5j61J65k34J11j0n4K74j99J54j26j0p5K6o8j45L25M4r3n5o8K18k1M9
$$ 152 87 -74 91 -143 -32 -42 -96 178 -21 133 7 -3 -78 -52 -120 -265 60 104 11 -44 -112 106 85 134
7717A34j99Q3j8J40k48K01k52J34NJ57p9O5k92K72J9l00j3K48NJ29j43M0j35j40
$$ 134 -65 18 0 140 -108 93 -159 -25 -20 137 58 123 -169 103 122 -178 -191 57 62 191 48 88 -47 -187
7741a87K36J07l88N3J82j37K24n3k3K47j31J14m68M88j75j3n2k15R2J06J0r4R
$$ -187 49 156 -232 -179 3 -134 90 37 14 261 130 244 -224 264 89 76 24 -191 -99 7 17 -77 -68
7764f8q7J95Q0k13J30K29j44j9L6k18O4j5j42P9J7K02J74j94j53N6K11k47J56
$$ -68 -155 40 120 -93 37 266 122 103 139 -79 -15 -30 -172 -93 -76 126 300 106 -47 9 220 -27 129
7787A29k07q1P9n2J03O0k92K99k5P2j44N7J21j39l10K69K01J31m12kP1K32j08
$$ 129 -78 -159 -80 -132 -29 31 -261 38 13 85 -59 -2 119 -20 -330 -61 140 271 -141 -143 -72 160 52
7810E2L5l4Nm0N6j07M9J25o0l13J96j82K56K5p8l9L2K8J43m0j98K3R7M9o8OJ47
$$ 52 87 53 58 18 74 -33 16 141 81 -232 -36 -218 38 63 -15 -54 -22 6 149 109 -89 -66 31 80 12 18 165
7837A65p2%k81k5K32O8k01J44r9M5m3O9P6j53P1k2k61K24K19p8K3r4j23Q2J0j03
$$ 165 93 93 -188 -213 19 87 -114 30 -69 -24 -67 2 78 -75 -4 -26 -287 -63 156 78 101 7 -116 -34 -24 -127
7863a27L72j65R9k33k31J82k01M05j52J52m11J07M01j76J3J3n3q1J76K3r5J27
$$ -127 245 80 179 -54 -285 -103 -304 101 -51 101 -310 -203 198 22 35 48 -5 -86 90 113 18 145
7885A45j0l49L70j91L1LN8J33o1j58j43K68R7k14N8Q0j8r2k62J31O3J22Q5k34
$$ 145 135 -214 156 -35 -4 -1 57 190 129 -29 -172 96 193 -21 37 117 99 7 -255 -124 -61 61 146 -88
7909h8N2M3k26K3L29l05K81l87M58l04N0J03n8N3j50K38j40J31k6n0Q0n5%N6j3
$$ -88 -36 7 -219 -196 133 -172 109 -278 180 -124 -74 29 -29 24 -126 112 -28 103 77 27 107 52 52 108 95
7934I5j06k4K72k26j28L15j78m5q8J81mk89K55J21k64K23j06p5K02j19J62j09
$$ 95 -11 -35 237 11 -117 198 20 -25 -113 68 64 -225 30 151 -113 110 4 -71 131 12 174 65
7956F5O7K40l35k4N4k87L42k2j72P6mJ1j8J27n9K26l68R5J13Q5l09J92j02R5j51
$$ 65 132 372 37 13 67 -220 122 100 -72 4 0 11 -7 120 61 287 -81 14 127 212 -97 95 -7 88 -63
7981f3qP8j5R5j41J56K7L09m20l8j80k1K57J24r9j09R7j41O3N7j3k4J75J05m31
$$ -63 -71 7 -8 87 -54 102 129 438 18 -20 -200 -221 36 160 61 -48 49 -92 -29 28 15 -9 166 271 -160
8006a60J15K58m39K62J06q6ol3r2PJ89k9q6L7n6N1K26l11j68j14K93K1k2k2j48
$$ -160 -45 213 -226 36 142 56 50 17 -75 -68 121 92 6 43 -13 38 264 -47 -215 -329 -36 -15 -37 -59 -207
8031b07J07r3K44R6m11K13m8r1J58M5j32p8K92KJ5r4j12J94k29J13l1J58j55j19
$$ -207 -100 -193 51 147 -264 -51 -99 -190 -32 13 -119 -197 95 97 112 18 -94 100 -129 -16 -47 111 -44 -163
8055a63J51j75M28p0m39mL15o5K29l92K66j11P1J68j36R1j34j23L1K2j11K59l48
$$ -163 -12 -187 241 171 -268 -272 43 -22 207 -185 81 -30 41 209 73 164 30 -93 -62 -40 -151 108 -240
8078b40K30K55j32m1R1k32k7L39k42k30Q4K20k05J82N3j81j30J43J9j80J52J73
$$ -240 -10 245 113 72 163 -69 -96 243 1 -229 -145 75 -130 52 105 -76 -206 -63 -44 -224 -72 101
8100A01j2p2j72Q8J51k45R3j3k9J21p2K36k10j3j70k9J23L18j91K3k6P0k03j20
$$ 101 89 17 -155 -67 84 -161 -68 -81 -110 11 -61 175 -35 -48 -218 -247 -124 194 3 26 0 70 -133 -253
8124b53L74o1r5k09M62k32rR4k53M40k29J47k59K10P1k12n4M12j89j99J29k41
$$ -253 121 60 -35 -244 218 -14 -23 71 -182 258 29 176 -83 127 198 -14 -68 344 155 -44 85 -156
8146a56o3J00K78o0k3M8k71J90J66j14k88o8N00k53j58J83J93k29l9J57m8L64
$$ -156 -219 -119 159 99 76 124 -147 43 209 95 -193 -261 239 -14 -172 11 204 -25 -64 93 45 409
8168D09j43k97p7J66k04j2L31j34J7L6r2j42J40j62K09k3l4R1j67j87N03k96m7
$$ 409 266 -31 -108 58 -146 -158 173 39 56 92 0 -142 -2 -164 45 22 -12 79 -88 -275 228 -68 -115
8191a15
$$ Imaginary data points
##PAGE= N=2
##DATA TABLE= (X++(I..I)), XYDATA
0@%%%%%%%%%%Qj6J6j6K4l2L4m2N6p2Q4r6J16j36J60j87K15k49K88l33L81m32M89
$$ 0 0 0 0 0 0 0 0 0 0 0 8 -8 8 -8 16 -16 18 -24 32 -40 44 -52 64 -72 88 -99 116 -133 155 -178 203 -229 260
33B60n56O29p09P99q95R99j115J240j377J531j695J874k073K288k521K779l063
$$ 260 -296 333 -376 423 -472 527 -588 652 -725 806 -889 985 -1088 1200 -1321 1458 -1605
50a605L373l716M096m520M994n527O132o826P634q584R719j1108J2853j5120J8194
$$ -1605 1768 -1948 2148 -2372 2622 -2905 3227 -3599 4035 -4549 5170 -5938 6915 -8205 9989
65I989k2629K9620m2305P2523k75478k42881N76401J36288k76021l4896L39844
$$ 9989 -12640 16980 -25325 47198 -228280 -471161 105240 241528 -34493 -69389 270455
76B70455M961k23785N5318K31839j30822k65991J9127J36778j20503j53859N2895
$$ 270455 275416 51631 106949 338788 207966 -58025 -38898 97880 -22623 -176482 -123587
87a23587O7961j06542n1518J01545O0521n4950J6881J01786M4805j0244M1963
$$ -123587 -55626 -162168 -213686 -112141 -51620 -106570 -89689 12097 56902 46658 88621
98H8621L9776k5626j3043M1376j7435q7528l2979K6968l4609n7131L4396M4016
$$ 88621 128397 102771 89728 131104 113669 26141 -6838 20130 -14479 -71610 -37214 6802
110F802p3154o5694Q5026Q7113p3077p7295Q1299Q3867o6235n6752Q2376O1280
$$ 6802 -66352 -132046 -47020 40093 -32984 -110279 -28980 54887 -11348 -68100 14276 75556
122G5556o2682k6156P0898r75r0987J1270J11773J814j07914j3386Q5047R387
$$ 75556 12874 -13282 57616 56641 -34346 -23076 88697 90511 -17403 -30789 54258 63645
134F3645o8472p531L5218l7534p4583n66N1596J0307k7231q029K2889L0044K2868
$$ 63645 -4827 -12358 22860 -14674 -89257 -89823 -38227 -27920 -55151 -63180 -40291 -10247 12621
147A2621J2407R976J5659M385j3877J448K7775M878m1475l5714L670J236l0769
$$ 12621 25028 35004 50663 55048 41171 42619 70394 75272 33797 -1917 1753 2989 -27780
160b7780l2115p853L287N616J2701J1834P997J7567K4954J4111O139N594p457
$$ -27780 -59895 -67748 -64461 -58845 -46144 -34310 -26313 -8746 16208 30319 36458 42052 34595
173C4595j4234O033J2769j7941k5635J1004J3997l3537l2545K9497L1381l5744
$$ 34595 20361 26394 39163 21222 -4413 6591 20588 -12949 -45494 -15997 15384 -20360
185b0360l6573L6441L9579k7071j8600M9515K6673n2671k8764M9428K0497n5876
$$ -20360 -56933 -20492 19087 -7984 -26584 22931 49604 -3067 -31831 17597 38094 -17782
197a7782k1361N1688J1875n3693j893O4079Q456n4495j472M4911j1725m2236K1731
$$ -17782 -39143 12545 24420 -29273 -31166 32913 41369 -13126 -14598 30313 18588 -23648 -1917
210a917L8769l2074m1768L0489L3877l3416k9441K7178J0018l4889J762M4910
$$ -1917 36852 4778 -36990 -6501 27376 -6040 -35481 -8303 1715 -33174 -31412 13498
222A3498K147l3473J5466M1176j1861k8860K0775J7894l7133k1886L6331J0501
$$ 13498 15645 -17828 -2362 38814 26953 -1907 18868 36762 -371 -22257 14074 24575
234B4575m6643r986M5019j073n1174O039N1866j4018n2931K2679O0819j6339m7970
$$ 24575 -22068 -32054 12965 11892 -39282 -33243 18623 4605 -48326 -25647 35172 18833 -29137
247b9137L0337N1776k6666m3056K8654L0224m0992l3118L7357K0003m6245k0660
$$ -29137 1200 52976 26310 -16746 11908 42132 1140 -31978 5379 25382 -20863 -41523
259d1523M3436J4049m2543o675M3123N031l7863M349M2918K252k9626N893K6910
$$ -41523 1913 15962 -26581 -33256 9867 14898 -22965 -18616 24302 26554 -3072 2821 29731
272B9731q665k5584L241J0104j4477j0360Q364l380j4098J2311K2995o094j6446
$$ 29731 21066 -4518 -1277 8827 -5650 -16010 -7646 -11026 -25124 -12813 10182 4088 -12358
285a2358J3320J6556j4822r461K4339J2421k8370j6923K1712R996k3067q610J5656
$$ -12358 962 17518 2696 -6765 17574 29995 1625 -15298 6414 16410 -6657 -15267 389
298C89p905k6830J0644L4221l751k6558J3413L5332o958k9894J2575L2898j4232
$$ 389 -7516 -34346 -23702 10519 6768 -19790 -6377 28955 21997 -7897 4678 37576 23344
311B3344l8284O022K8392j4421l4481Q894L0435j0157l1937N217K7728J075j2587
$$ 23344 -14940 -8918 19474 5053 -29428 -20534 9901 -256 -32193 -26976 752 1827 -10760
324a0760J1528J6632j0914j0974J8965J7274j5816j7334P691N061j6327r145J2974
$$ -10760 768 17400 6486 -4488 14477 31751 15935 -1399 6292 11353 -4974 -14119 -1145
337a145N127j5792p250J1390N722q454O26J0605K148o069Q04L212r67O819J3635
$$ -1145 3982 -11810 -19060 -7670 -1948 -10402 -9776 829 2977 -3092 -2288 924 -43 6776 20411
352B0411m948k1147j109J9336L287j7761k412J2876o794j8843P262K1039q426
$$ 20411 15463 -5684 -6793 12543 15830 -1931 -4343 8533 1739 -17104 -9842 11197 2771
365B771k2817N010J7923p155j3318J2901J4981r603o602J7710N598k0334k466
$$ 2771 -20046 -15036 2887 -4268 -17586 -4685 10296 693 -5909 11801 17399 -2935 -5401
378e401K7371N628k9672j2992J8466O270j5656o19J1823j0299j8992R035K1625
$$ -5401 21970 27598 -2074 -15066 3400 9670 -5986 -6605 5218 -5081 -24073 -15038 6587
391F587j907j3725K763P741l882J571J3246j891j5745J843J6763l175j7356K310
$$ 6587 4680 -9045 -6282 1459 -2423 -852 12394 10503 -5242 -3399 13364 10189 -7167 -4857
405d857J4959j054j0820J919M411q868m355J3597O916j6484j3177O926P951k664
$$ -4857 10102 9048 -1772 147 4558 -4310 -8665 4932 11848 -4636 -17813 -10887 -2936 -5600
419e600J076O343n374j0755Q121K0437L831j3500l108J0464L676o727l167J773
$$ -5600 -4524 1819 -3555 -14310 -6189 14248 18079 4579 1471 11935 15611 8884 5717 7490
433G490m705q228j959J769m844p778J026Q721M276k922k166N969Q592N380M985
$$ 7490 2785 -5443 -7402 -5633 -10477 -18255 -17229 -8508 -4232 -7154 -9320 -3351 5241 10621 15606
448A5606J619n874o786L931Q250m716j4022n398J401n009m358P029M663q972k745
$$ 15606 17225 11351 4565 8496 16746 12030 -1992 -7390 -5989 -10998 -15356 -8327 -3664 -12636 -15381
463a5381J3714P846p469Q02J3352J249j2459J254J0265p122j5025O889J2029j3110
$$ -15381 -1667 6179 -1290 -488 12864 14113 1654 2908 13173 6051 -8974 -2085 9944 -3166
477c166j6664J1215J5668r162p158J6482P047j7787l075K2190L161k3517n067
$$ -3166 -19830 -8615 7053 -2109 -9267 7215 14262 -3525 -6600 15590 18751 -4766 -9833
490i833J6441n503k0547O352J8395j1727j7939J5322J9930j2315r438K3082J3623
$$ -9833 6608 1105 -19442 -13090 5305 -6422 -24361 -9039 10891 -1424 -10862 12220 25843
503B5843j9825n729K3639J707k6893k829J9888r417k9561L453J8937j3206j9488
$$ 25843 6018 289 23928 25635 -1258 -4087 15801 6384 -23177 -19724 -787 -13993 -33481
516c3481J6977J9291j6252r519K7561J6636j7430k189K5818J148k4163L275K1864
$$ -33481 -16504 2787 -13465 -22984 4577 21213 3783 1594 27412 28560 4397 7672 29536
529B9536j1444k9016M726J5376j8790k1075J5479J3326j9578q871K4745J1087
$$ 29536 18092 -10924 -6198 9178 -9612 -30687 -15208 -1882 -21460 -30331 -5586 5501
541E501j7441K969K6690J304k0063P007K2057r841k1314J0718J4420k0104j9418
$$ 5501 -11940 -8971 17719 19023 -1040 5967 28024 18183 -3131 7587 22007 1903 -17515
554a7515J4984J1862k0903j2019J8194P077j7087Q1K1543M60j7255N299J9818
$$ -17515 -2531 9331 -11572 -23591 -5397 1680 -15407 -15326 6217 6677 -10578 -5279 14539
567A4539n068j5581P491J2866j1257j1001J2114Q229j4372q118J3813N499j1518
$$ 14539 9471 -6110 1381 14247 2990 -8011 4103 12332 -2040 -10158 3655 9154 -2364
580b364k201R819j564r545M230Q528p283r454N842N649p667l902P907J818p910
$$ -2364 -4565 5254 3690 -5855 -1625 6903 -380 -9834 -3992 1657 -6010 -9912 -2005 -187 -8097
595h097K588J1994M16p189L793Q838j781o024K211K153o846n020L767m82q093
$$ -8097 -5509 6485 6901 -288 3505 12343 10562 4538 6749 8902 2056 -2964 803 321 -7772
610g772l816M038M88k696K046L408P98R70M781L660R77J146J70j105N8Q66l889
$$ -7772 -11588 -7550 -7062 -9758 -7712 -4304 -3506 -2536 2245 5905 6882 8028 8198 7093 7151 8017 4128
627D128o183M54K931m417n956K649K912l081L49P538J249p340R81J0684J321p761
$$ 4128 -2055 -1601 1330 -3087 -9043 -6394 -3482 -6563 -6214 1324 2573 -4767 -3786 6898 8219 458
643D58M51N006m695o765O624N857r416q268R045P723p152l984R158K774q943P79
$$ 458 909 5915 1220 -5545 1079 6936 -2480 -10748 -1703 6020 -1132 -5116 4042 6816 -2127 -1348
659a348J0316k892j1575K443R083n554j0977M497P176p565m382J2101M787j1623
$$ -1348 8968 6076 -5499 -3056 6027 473 -10504 -6007 1169 -6396 -10778 1323 6110 -5513
673e513j537J5562M502j1991L8J1831m578j3120N616J0200j1125j4716Q887R694
$$ -5513 -7050 8512 13014 1023 1061 12892 8314 -4806 810 11010 -115 -14831 -5944 3750
687C750j2136q732J3810P667j1614j702J6168K659j3075L808J6327l792j6440
$$ 3750 -8386 -17118 -3308 4359 -7255 -8957 7211 9870 -3205 603 16930 13138 -3302
700c302L967J1842q901j2908P589O029j3978p933J4377O362j3020k574J6142L121
$$ -3302 665 12507 3606 -9302 -1713 4316 -9662 -17595 -3218 3144 -9876 -12450 3692 6813
714F813j1718L332J4631k551j2312N680J1054r370j3000P344Q327j1235r840Q836
$$ 6813 -4905 -1573 13058 10507 -1805 3875 14929 5559 -7441 -97 8230 -3005 -12845 -4009
728d009M567j0562j207J3669J944j2475J304J4923J207j0532K840R753n774r739
$$ -4009 558 -10004 -11211 2458 4402 -8073 -6769 8154 9361 -1171 1669 11422 5648 -4091
742d091O264P424r918r108Q221N531r995m974R545L453p943J59R515p46q744L861
$$ -4091 2173 9597 -321 -9429 -1208 4323 -5672 -10646 -1101 2352 -5591 -5432 4083 3337 -5407 -1546
758a546J0567k561r203J933O587l955m933M784L000p384m037P433L153o181k253
$$ -1546 9021 6460 -2743 -810 5777 1822 -3111 1673 4673 -2711 -6748 685 3838 -2343 -4596
773d596N570J407m997J9N136j096m607K003N043k630n575K253N071r41l796J483
$$ -4596 974 2381 -2616 -2597 2539 1443 -3164 -1161 3882 1252 -4323 -2070 3001 2060 -1736 -253
789b53K059j933j292M327J691m717l266L459K747l387j937K513J15m465M63N207
$$ -253 1806 -127 -1419 2908 4599 -118 -3384 75 2822 -565 -2502 11 126 -4339 -3876 1331
805A331M09n124P23N652N43m420J3M459Q9l940N33K746k550m049K639L872l433
$$ 1331 1740 -3384 -2661 2991 3534 -886 -873 3586 3675 -265 268 3014 464 -3585 -946 2926 -507
822e07m634K983L244k723j778M172K338m864j217N643J929m856k065M704J052
$$ -507 -5141 -2158 1086 -1637 -3415 757 3095 -1769 -2986 2657 4586 -270 -2335 2369 3421
837C421m676p99M098n56l996J078L275k309l783L758L759l454l045L946K050m086
$$ 3421 -1255 -2054 2044 1488 -2508 -1430 1845 -464 -4247 -489 3270 -184 -3229 717 2767 -1319
853a319q96N216J74n315j093N541L32m313L06L697j993l371K648L310l969k440
$$ -1319 -2215 3001 3175 -2140 -3233 2308 2640 -1673 -1367 2330 337 -3034 -386 2924 -1045 -3485
869c485M208K607m800j870N221K427n119j490M729P97n140o36M935K21m969k18
$$ -3485 723 3330 -1470 -3340 1881 4308 -811 -2301 2428 3225 -1915 -2551 2384 2605 -2364 -2582
885b582L421q91k720J450K798k201k521L334L439k541k351L409K288l686k054
$$ -2582 839 -52 -2772 -1322 1476 -725 -3246 88 3527 986 -1365 2044 4332 646 -1408
900a408L276J694m517k306K677J316k881j244K796Q97k102J38K694K56j618Q35
$$ -1408 1868 3562 -955 -3261 -584 732 -2149 -3393 -597 300 -1802 -1664 1030 1286 -332 503
916E03K652j366k103J190K139k410k416J481J862k590k544K449K259k214j682
$$ 503 3155 1789 -314 876 3015 605 -1811 -330 1532 -1058 -3602 -1153 1106 -1108 -2790
931b790L268J799k714q29L225J65l426N10L070j271m106J656M581k826m462K791
$$ -2790 478 2277 -437 -1266 1959 2124 -1302 -792 2278 1007 -3099 -1443 3138 312 -4150 -1359
947a359N079k982m036L802L818m031l304M763L183n206k888M174Q55n227n79N385
$$ -1359 3720 738 -3298 504 4322 291 -3013 1750 4933 -273 -3161 1013 1868 -3359 -3938 1447
963A447j133n341J898O628k137m879L708N398l835m569N054L778n369l363M742
$$ 1447 314 -5027 -3129 3499 1362 -3517 191 5589 1754 -2815 2239 6017 648 -2715 2027
978B027J260n994j275N075k79o179J083N872j805m628L575M901l612l150N389
$$ 2027 3287 -2707 -3982 1093 814 -5365 -4282 1590 -215 -4843 -1268 3633 21 -3129 2260
993B260L617n466k654N577K020o023j271N313q87o281J080N579k851o171K857
$$ 2260 5877 411 -2243 3334 5354 -669 -1940 3373 2486 -3795 -2715 2864 13 -6158 -3301
1008c301N353l225l779M578L812m443k214N820K214n002j454N420K15m954K77
$$ -3301 2052 -1173 -4952 -374 3438 -1005 -3219 2601 4815 -187 -1641 3779 3994 -960 -683
1023f83L838j582l860J256K776l185k759L078K354k870j746K796J355k164J108
$$ -683 3155 1573 -2287 -1031 1745 -1440 -4199 -1121 1233 -1637 -3383 -587 768 -1396 -288
1038b88L248j468l510K008M088j909l179J611J713k067j341K155P01l532j258
$$ -288 2960 1492 -2018 -10 4078 2169 -1010 601 2314 247 -1094 1061 1762 -1770 -3028
1053c028L448O06l036p02K170K23j104J131J182j557j102K177K149m65j528K54
$$ -3028 420 1026 -2010 -2712 -542 -319 -1423 -292 890 -667 -1769 408 2557 2092 564 818
1069H18J085o0N1m34p75q31p23l30K23M44r36j941K63K663N38j552k95K581J076
$$ 818 1903 1843 1894 1460 685 -146 -869 -1199 -976 -532 -1468 -3409 -3146 -483 55 -1497 -1792 789 1865
1088A865p86R11P96j246j42J285L78l135j647J548M26k671l98J920r45k025J738
$$ 1865 1079 1990 2786 1540 1398 2683 3061 -74 -1721 -173 253 -2418 -2816 -896 -1841 -3866 -2128
1105b128L298o94k316J930K687j000q78J849L60k821J02K649j481m089N73L188
$$ -2128 1170 476 -1840 90 2777 1777 899 2748 3108 287 389 3038 1557 -2532 -1959 1229
1121A229j707l795K019L376k432k576L505L176k831k336L413J779k874m58K947
$$ 1229 -478 -4273 -2254 1122 -1310 -3886 -381 2795 -36 -2372 1041 2820 -54 -512 2435
1136B435n20l660J325L575k044m220K656L268l126l237L251K470l282j802K894
$$ 2435 1915 -1745 -420 3155 1111 -3109 -453 2815 -311 -3548 -297 2173 -1109 -2911 -17
1151a7J182l147l27L723l93l338J571L380j882k667L333K776m050k416M247J695
$$ -17 1165 -1982 -2309 1414 1021 -2317 -746 2634 752 -1915 1418 4194 144 -2272 1975 3670
1167C670m526k039M294O59m771l53L874m98l669J262L841j942k921L185K950k707
$$ 3670 -856 -2895 1399 2058 -2713 -3066 808 310 -3359 -2097 1744 -198 -3119 66 3016 309
1183C09k017L307K169l547j652L797R48m087j049L048K36l503R5K178j104k084
$$ 309 -1708 1599 3768 221 -1431 2366 3314 -773 -1822 1226 1462 -2041 -1946 232 -872 -2956
1199b956K084J670j836j531L143J285k562k4K705K8k713R21K816j090k807N55
$$ -2956 -872 798 -1038 -2569 574 1859 -703 -727 1978 2006 -707 214 3030 1940 -867 -312
1215c12K338j811k095J119J133j998q39J938O89k190Q0K836K35j935N28K216k33
$$ -312 2026 215 -1880 -761 372 -1626 -2465 -527 162 -2028 -1948 888 1123 -812 -284 1932 1699
1232A699k147P53J587n84j527L0R50n04j228M52L01q96K42M00N9JM11L59o4p23
$$ 1699 -448 305 1892 1308 -219 -189 761 257 -971 -519 -218 -1114 -872 -472 -413 -412 -1 358 294 -429
1252d29M69L50j49k0K58r8n99K83M68n24j86M50k19m45M48O42m14n38k30N79j71
$$ -429 40 390 241 221 479 381 -218 65 533 9 -177 273 54 -391 57 699 285 -253 -483 96 -75
1273g5k46P6L2o28P6L33K92J1J68L93l29J49J56K27o89L15L26m24r82O74M15n99
$$ -75 -321 -245 -213 -841 -765 -432 -140 -129 39 432 103 252 408 635 -54 261 587 163 -819 -145 270 -329
1295c29k55O89K62j184k38J373M18j034J2J061n0j104M78J145j176j182N07J014
$$ -329 -584 105 367 -817 -1055 318 736 -298 -286 775 725 -379 99 1244 68 -1114 -607 407
1313D07r12q37J196J228r71r63J159N86o83l40R22K07j302j10R13k47r30L74M28
$$ 407 -505 -1342 -146 1082 111 -852 307 893 210 -130 792 999 -303 -413 500 253 -677 -303 125
1332A25j038q20J297P09p93o28J635K88j071J26J236M22j160k18Q69k55j236N16
$$ 125 -913 -1733 -436 273 -520 -1148 487 775 -296 -170 1066 1488 328 110 979 724 -512 4
1350DP66q52j093N55N76p13p24J118N58j205J04J154O77q65k35R58K88p25m47
$$ 4 770 -82 -1175 -620 -44 -757 -1481 -363 195 -1010 -906 248 925 60 -175 783 1071 346 -101
1369a01P24J31l88j45j8m42m26M07L43l35j015O09K79n03L58P04J59o65J5J053
$$ -101 623 754 366 221 203 -239 -665 -258 85 -250 -1265 -656 -377 -880 -522 182 341 -324 -309 744
1389G44L04n59j35R8J92j81K19r9o30l51M54J16q95m34P60K67k39k25O32J72j000
$$ 744 1048 489 354 452 644 463 682 583 -47 -398 56 172 -723 -1157 -397 -130 -369 -594 38 210 -790
1410g90K16J341N30r23p74N14N84l1l77N47o53q59P03M62k96j155N22N11l77o11
$$ -790 -574 767 1297 374 -400 114 698 667 290 837 184 -675 28 490 194 -961 -439 72 -305 -916
1430i16L43O88o74K7O29N14q37p0O11M42k20j42K95k35m26O01K19q22r25P23L1
$$ -916 -573 115 -559 -532 97 611 -226 -296 315 757 537 395 690 455 29 630 849 27 -898 -175 -144
1451a44n34j75O48K83q70J74Q06M64r67P4P72k3n07J82Q92m91n39M34J11j104
$$ -144 -678 -853 -205 78 -792 -618 188 652 -315 -241 531 508 1 183 1075 584 45 479 590 -514
1471e14p69J087L07p33k73M65M68q11J96J055k1n72J72J79K08o1J78J08l45l53
$$ -514 -1283 -196 111 -622 -895 -430 38 -773 -577 478 457 -115 57 236 444 383 561 669 324 -29
1491b9K82j66k94k86M84m1p53M85M19L44n52j04N24n04Q3L65j8m68J56N72N7n40
$$ -29 253 87 -207 -493 -9 -50 -803 -318 101 445 -107 -211 313 -191 -108 257 239 -229 -73 499 556 16
1513A6J54J06j82n04L05N04l92n46K29M51J4m62Q2L16k98J60L16p2m64K27J39
$$ 16 170 276 94 -410 -105 399 7 -539 -310 141 155 -307 -225 91 -207 -47 269 197 -267 -40 99
1534I9P1j3J14l4m92M18Q8Qj16O1p5m04M5K99k0l16OL09j36k56K6O52l86j72N68
$$ 99 170 157 271 237 -255 163 251 259 143 204 129 -275 -230 69 49 -267 -261 48 -88 -344 -318 334 -52 -224 344
1559C44J67j41l15M03Qp54J92L38Oo49rM30m88j06J63P66n52m73P10M17k39j50
$$ 344 511 370 55 458 466 -288 -96 242 248 -401 -410 20 -468 -574 -411 355 -197 -670 40 457 218 68
1581F8P01j28p47p0Q95l86j081O21M5j54p76N37P90p88r2O22O96o53m14J050m9
$$ 68 769 641 -106 -176 719 333 -748 -127 -82 -236 -1012 -475 315 -473 -565 57 753 100 -314 736 687
1602F87p29K16P93n59r07L65P36q36p24P15L21l74k94N16M41q56J12J035j62q39
$$ 687 -42 174 967 408 -499 -134 602 -234 -958 -243 78 -296 -590 -74 367 -489 -377 658 496 -343
1622c43K55Q04l80p33P37K53r13l84Q39K33p40j75P75J22l75k25Q22m52m22L31
$$ -343 -88 716 336 -397 340 593 -320 -704 135 368 -372 -547 228 350 -25 -250 572 120 -302 29
1642B9O44p18q77P36N88p35k43P10K05n18m02R56M00j026M52L83l78m93L41L81
$$ 29 673 -45 -922 -186 402 -333 -576 134 339 -179 -581 375 775 -251 201 584 206 -287 54 435
1662D35n61o18P43M4p04p2P55K38o55q4N79M26o12J01R06m66o40K04M48l40m30
$$ 435 -126 -744 -1 43 -661 -733 22 260 -395 -479 100 526 -86 15 921 455 -185 19 467 127 -303
1683c03O68j4q41j33R40k85n94R6N67j55j06J18M81l66k51L84K09m98jL94R3o20
$$ -303 365 351 -490 -623 317 32 -562 -466 101 -54 -160 -42 439 73 -178 206 415 -83 -84 310 403 -217
1705b17J98J69k41k64N33P8l52j29R8L03l55j19N53K2o08M3K68M3k42L81K85m80
$$ -217 -19 150 -91 -355 178 256 -96 -225 -127 176 -179 -298 255 277 -331 -288 -20 23 -219 162 447 -33
1727c3l26N76L23l76j61O23l88l58K62q3n6k97L3L13j34m03M95j37l26L23N56
$$ -33 -359 217 540 164 3 626 238 -120 142 59 3 -294 -261 52 -82 -485 10 -127 -453 -130 426
1748D26k42n79N35O64k80n08K13J17n89J4O44l42q22oP29om02L24M39m76m35Q00
$$ 426 184 -395 140 804 524 16 229 346 -243 -229 415 73 -749 -755 -26 -32 -434 -110 329 -147 -582 218
1770B18N0m23m1N70K15q04J85K22M8o92M57N28o40j90J95N33l04k00K26km78J5
$$ 218 268 -155 -196 374 589 -215 -30 192 240 -452 5 533 -107 -297 -102 431 127 -73 153 151 -327 -312
1792c12O60l4p43P6M34q5k93M37K27k23o34Q82M04q12k70O50Q1n60k93L77J14
$$ -312 348 314 -429 -353 81 -4 -297 140 367 144 -490 392 796 -16 -286 364 445 -115 -408 -31 83
1813H3p06K77J014r52o50P11M29j4l61K85K88l71l14O97K6n08j99N39J97q03N9
$$ 83 -623 -346 668 -284 -934 -223 206 192 -169 116 404 33 -281 416 442 -66 -265 274 471 -332 -273
1834b73K50j75jj14P80n02l42N24M74n57k88M89N8k93l47P75l29l52J88K52m86
$$ -273 -23 -198 -199 -313 467 -35 -377 147 621 64 -224 265 323 30 -317 458 129 -223 -35 217 -269
1855b69j4J90J98j68l1M9K81l5j55K45j71jm44L22K29o24J03K27l06oJ57L70r8
$$ -269 -283 -93 105 -63 -94 -45 236 201 46 291 120 119 -325 -3 226 -398 -295 -68 -374 -380 -223 147 49
1878D9j11J80J28O1k04L32Q1o0n30J94n1q5o9j46J47j58l2K7J85k00R6K9J58J33
$$ 49 -62 118 246 307 103 435 516 456 -74 120 69 -16 -85 -231 -84 -242 -274 -247 -62 -262 -166 -137 21 154
1902A54j7J06L0K7o6P3K43m43K49O4l07j59n2L2J24l35l6J20j11m01K90K14l5
$$ 154 137 243 273 300 234 307 550 107 356 420 113 -46 -98 -66 58 -277 -313 -193 -304 -705 -415 -201 -236
1925b36q8J85K15O2P9OL27l43K52j21N4k56K6j79n5p3m9Kl11o8ol4m1j1K67O15
$$ -236 -324 -139 76 138 217 223 550 207 459 338 392 136 162 -17 -72 -145 -194 -192 -503 -571 -577 -611 -652 -663 -396 219
1951B19j56O2M57K26j15J4R3k97J72k69j61n79J70k61j52l2j01K77j54j96O75
$$ 219 63 125 582 808 693 707 800 503 675 406 245 -334 -164 -425 -577 -609 -710 -433 -587 -783 -108
1972a08Q5K99j93M02k9J01R0Q3lk95k29Pj84l53Q2J56l20l19K85K58o5J28L67
$$ -108 -23 276 83 485 456 557 647 730 727 432 203 210 26 -327 -245 -89 -409 -728 -443 -185 -250 -122 245
1995B45q7k64J2k0K64lk50K40k17k0M51j18j6j15J94Po6p8J07j06k71O9j41l19
$$ 245 158 -106 -94 -114 150 147 -103 137 -80 -100 351 233 217 102 296 303 237 159 266 160 -111 -42 -183 -502
2019e02j32N66j86j43K52K73k0j13N39M8j40j7L27j17l85L5J85n61n1k52M4j0
$$ -502 -634 -68 -254 -397 -145 128 108 -5 534 582 442 425 752 635 250 285 470 -91 -142 -394 -350 -360
2041c60m10L1K99j42N4J65N87p8%O06p7j56K49K96q04l33K45J63o17m11K51J2
$$ -360 -770 -739 -440 -582 -528 -363 224 146 146 752 675 519 768 1064 260 -73 172 335 -282 -693 -442 -430
2063d30l42r5N89P7m65K06Q43J37m29J69M35j83k57M13k76m42l82M41K95q39p
$$ -430 -772 -867 -278 -201 -666 -460 383 520 91 260 695 512 255 668 392 -50 -432 9 304 -535 -542
2084e42Q70n14l83L88M25k26m48N49N76n72n30L31M82o01N3P20n30l97J26M53
$$ -542 328 -186 -569 -181 244 18 -430 119 695 123 -407 -76 406 -195 -142 578 48 -349 -223 230
2104B30L1m52K12O15o24l69P17J57r38L18L68j33m01j31P73j56p71N32O49n79
$$ 230 261 -191 21 636 12 -357 360 517 -421 -103 265 132 -269 -400 373 217 -554 -22 627 48
2124D8m91O65J16k62j16L00n9m76J07N45l25n60L32J78j97l41N89K48n04J1M36
$$ 48 -443 222 338 76 -40 260 201 -275 -168 377 52 -508 -176 2 -195 -536 53 301 -203 -192 244
2145B44R7o33K31L31J2o31M25J48l72l44M24L48n42j57O32K03m66j65M49J9k01
$$ 244 341 -292 -61 270 282 -349 76 224 -148 -492 -68 280 -262 -419 213 416 -50 -215 234 253 52
2166E2J53K86m74m92N40m4j91L9L55n49k82K59L35J90m22J98M79l07k33P8N66
$$ 52 205 491 17 -475 65 21 -170 -131 224 -325 -607 -348 -13 177 -245 -47 432 125 -108 -30 536
2187E36n00K1J33M6o86m5O54j29n17J63M34l74l23P74M13l66m93M74K10n57K29
$$ 536 36 57 190 236 -450 -495 159 30 -487 -324 110 -264 -587 187 600 234 -259 215 425 -132 97
2208I7L72k93n17J93N40o35l35N19M00q07m29Q29L66k70k52N69J15p66K88O25
$$ 97 469 176 -341 -148 392 -243 -578 -59 341 -466 -895 -66 300 30 -222 347 462 -304 -16 609
2228F09q9p79J98K73l38j70L84K68o42j70P81k93n14L51L60r0o14K25M32J39m25
$$ 609 520 -259 -61 212 -126 -296 88 356 -286 -456 325 32 -482 -131 229 139 -475 -250 182 321 -104
2249a04L95L03p40J6M85j68o92M87N90m46l57k4M73k63l46K58L71k79j56J90K93
$$ -104 291 594 -146 -130 355 187 -505 -18 572 126 -231 -255 218 -45 -391 -133 238 -41 -197 -7 286
2270B86m30j6O58k43n44L99m0J87m32J90J88j27m31P19R9n95k52N50J71o48L87
$$ 286 -144 -160 498 255 -289 110 70 257 -175 15 203 76 -355 364 463 -132 -384 166 337 -311 76
2291G6J57j21j14LM21m76q9K01O9l46j23L36j32j17J92L63l27k10M22K41k16n3
$$ 76 233 112 -2 1 422 -54 -143 58 127 -219 -342 -6 -138 -255 -63 300 -27 -237 185 426 210 157
2313A57j28K88l39J02J95l36n84K89QN5j21L61j50R3j94M09J88j68p2K95O9j10
$$ 157 29 317 -22 80 275 -61 -645 -356 -348 -293 -414 -53 -203 -110 -304 105 293 125 53 348 417 307
2335C07k11L45k81k18K72k21nm48NM46j19l07J64J50o8K14L2j02L0p2L36L56m33
$$ 307 96 441 160 -58 214 -7 -12 -460 -455 -9 -128 -435 -271 -121 -189 25 57 -45 -15 -87 249 605 172
2358A72J75P3l9p7j89K7j00j8J12l50M6j41L5m47K00N1R6j37J17N24J9j0k9M35
$$ 172 347 420 381 304 115 142 42 24 136 -214 -168 -309 -274 -721 -521 -470 -374 -511 -394 130 149 139 110 545
2382E45j4J40l0O7k56j44j39J14l19n27p6K04l29J59J33Q0m8rO39L4J68R7j1K14
$$ 545 531 671 641 708 452 308 169 283 -36 -563 -639 -435 -764 -605 -472 -392 -440 -449 190 224 392 489 478 692
2406F92L6nl50j98j23j53K9k79ol07J67%L16j0j84J09K58L92R4J09l78J09K72
$$ 692 728 723 373 175 52 -101 -72 -351 -357 -664 -497 -497 -181 -191 -375 -266 -8 384 478 587 209 318 590
2429E90k39k19j70k34J39L4l9n6j24K67k00L48k56K75O0J18p7K6l17J02r5j74
$$ 590 351 132 -38 -272 -133 -99 -138 -194 -318 -51 -251 97 -159 116 176 294 217 243 -74 28 -67 -241
2451b41J67j29P0k01r1M74k7K5J5K10j72K48J68k26M5j41l57q4P5J17m09p3j82
$$ -241 -74 -203 -133 -334 -425 49 22 47 62 272 100 348 516 290 335 194 -163 -247 -172 -55 -464 -537 -719
2474g19K7M79j4NM48k15O57m8m22j99L77l0l20J02j0j99j68k49L1J07qQ8j6L11
$$ -719 -692 -213 -227 -222 226 11 668 620 198 -1 376 346 26 128 118 -81 -249 -498 -467 -360 -368 -280 -296 15
2498A5n4K01J54L9o9K47j86j62L75m11k92n3nJ81l93P1N0K88r3j50J83J78j56
$$ 15 -39 162 316 355 286 533 347 185 560 149 -143 -196 -201 -20 -413 -342 -292 -4 -97 -247 -64 114 -42
2521d2L76K35j38m67L7J10m25R5L2J52k34rM51K18k40j94K23K98k29q5m9j25j20
$$ -42 334 569 431 -36 1 111 -314 -219 -187 -35 -269 -278 173 391 151 -43 180 478 249 164 115 -10 -130
2544a30m2L11n27k9o6L34k41J09P4K76K3Q4K39n3l37L12L28m58m7j19K16m66j16
$$ -130 -172 139 -388 -417 -483 -149 -390 -281 -207 69 92 176 415 362 25 337 665 207 160 41 257 -209 -325
2567c25K39J92q18R1N28jk04K70L84j44k21M58Q6j80k09L03m7m52k97L38n0m17
$$ -325 -86 106 -712 -621 -93 -94 -298 -28 356 212 -9 449 535 355 146 449 402 -50 -347 -9 -59 -476
2589d76M89o2l22o3K95L47k1k19J32K80o42L5O45m46j09j04L67l16J95k0J00j7
$$ -476 13 -49 -371 -434 -139 208 187 -32 100 380 -262 -227 418 -28 -137 -241 126 -190 5 -15 85 68
2611F8o0M68rn32R5K46K40n30J17o8l80k40L62P5r9k78J82N58m00m2M68K22m52
$$ 68 8 476 467 -65 30 276 516 -14 103 35 -345 -585 -223 -148 -247 -525 -343 215 -185 -227 241 463 11
2634A1K65L97j14n81K98J10k59j50j79Jk56j59M32ll52J80L31R6k08L48M83m45
$$ 11 276 673 559 -22 276 386 127 -23 -202 -201 -457 -616 -184 -187 -539 -359 -28 68 -140 208 691 246
2656B46K89k39M7j5l36M14j48k57k90L95j20m65M28J31mj94O0K59m54K84K54j4
$$ 246 535 296 343 328 -8 406 258 1 -289 106 -14 -479 -51 80 76 -118 -58 201 -253 31 285 271
2678B71l35J92J82J15n31J03J17k07j21K24O6l57M9L19K77m43K40l9K36o31l9
$$ 271 -64 128 310 425 -106 -3 114 -93 -214 10 76 -281 -232 87 364 -79 161 122 358 -273 -312
2699c12M99j97n06J89P68p25j05M26Qk70J25M52J24m77K43L35K6o36K46P0p12
$$ -312 187 -10 -516 -327 441 -284 -389 37 45 -225 -100 352 476 -1 242 577 603 -33 213 283 -429
2720d29J22k6J65l09j18P12l34j83L67K94q8j28k3M00k11j09L43l8l24k7J76j14
$$ -429 -307 -333 -168 -477 -595 117 -217 -400 -33 261 173 45 22 422 211 102 445 407 83 56 232 118
2742A18m01j31M17n70j65kO22o3l10M21J54j78j44M58J53k3k71J63No31L18M84
$$ 118 -283 -414 3 -567 -732 -734 -112 -175 -485 -64 90 -88 -232 226 379 356 85 248 253 -378 -60 424
2764D24n22m04K38M55n37p1L61j18j14l8K34p6lk5O05l01l9J64J4j63k27L47J29
$$ 424 -98 -502 -264 191 -346 -417 -56 -174 -288 -326 -92 -168 -171 -196 409 108 69 233 247 84 -143 204 333
2787C33l04K3K56k42j52o6K84m38n2N8L65k69l18K89K17l61K43K02K26m75J91
$$ 333 29 52 308 66 -86 -152 132 -306 -358 -300 65 -204 -522 -233 -16 -377 -134 68 294 -181 10
2808A0K51j02N6J06J07m10n7J53j05p3k3j37r1k36K24R9j8n0M4P69l86K57j51
$$ 10 261 159 215 321 428 18 -39 114 9 -64 -87 -224 -315 -551 -327 -228 -246 -296 -252 517 131 388 237
2831B37M7qKJ82Rl98J57l22j37k48o4K38k08j83L49L90l27r3M03L34K26j94j13
$$ 237 284 276 278 460 469 71 228 -94 -231 -479 -543 -305 -513 -696 -347 43 -284 -377 26 360 586 392 279
2854B79Oj41K67j94k08j89J83Q6n56M54r4m0k6n8K22N4r4K46k40M20k64QK53l40
$$ 279 285 144 411 217 9 -180 3 89 -467 -13 -107 -147 -173 -231 -9 45 -49 197 -43 377 113 121 374 34
2878C4nj8J7k01O1j09J90l2O0j07P2j22K33O7K22l48J50j77k4j77J71k03k99J59
$$ 34 29 11 28 -173 -112 -221 -31 -63 -3 -110 -38 -160 73 140 362 14 164 -13 -37 -214 -43 -246 -545 -386
2902c86J32k9j47L25K97L6k16K36N8J0mP5M7n74k00K36Q1m96L77k06k65K96JK00
$$ -386 -254 -283 -430 -105 192 228 12 248 306 316 312 387 434 -140 -340 -104 -23 -519 -142 -348 -613 -317 -316 -116
2926a16j01J6J40J30J22r9M26j46j40m8J13l58J44k63k58M84n62K46j40j43N97
$$ -116 -217 -201 -61 69 191 92 518 372 232 184 297 -61 83 -180 -438 46 -516 -270 -410 -553 44
2947D4k2K8p8m6L78k17K50j98L0j30o5P0j24R9j88J08j9LJ32k95N98n59J75J71
$$ 44 22 50 -28 -74 304 87 337 139 169 39 -26 44 -80 19 -169 -61 -80 -77 55 -240 358 -201 -26 145
2971A45Pq2%k6M8k03PJ11q3l3J48OP7j06K10J08j30Q8k90j13K36ro6J19l54K06
$$ 145 152 70 70 44 92 -111 -104 7 -76 -109 39 45 122 16 226 334 204 292 2 -111 125 116 50 169 -185 21
2997B1q3N2J40l42R1Q4P0q0J28J11j8J27N4k94Nj69O8k77P3n2M7j3j78N58n3M1
$$ 21 -62 -10 130 -212 -121 -37 33 -47 81 192 174 301 355 61 66 -103 -35 -312 -239 -291 -244 -257 -435 123 70 111
3023A11j92Q8K61j79j2L36j40j73r6l4L5l25O1o4O2J60l8p7K3KM21P6k33Q5j01
$$ 111 -81 7 268 89 77 413 273 100 4 -30 5 -320 -259 -323 -261 -101 -139 -216 -193 -191 230 306 73 158 57
3048E7J15k09J25L00m92k12M36k37j41m7K24m3M4K2L32k85p2J82P8J28l62M80
$$ 57 172 -37 88 388 -104 -316 120 -117 -258 -305 -81 -124 -80 -58 274 -11 -83 99 177 305 -57 423
3070D23k03k6k69ml8j66P0K79j74m3L26L6l03L1K99k14K6J45j63Q4r6J6j82P6
$$ 423 220 194 -75 -79 -117 -283 -213 66 -108 -151 175 211 -92 -61 238 24 50 195 32 116 20 36 -146 -70
3094g0l3N3m5Q0L0J7j71J85J14o0J28j14j71l4K60j77o4k0J53j81J54k91K20l3
$$ -70 -103 -50 -95 -15 15 32 -139 46 160 100 228 114 -57 -91 169 -8 -72 -92 61 -120 34 -257 -37 -70
3118g0P8Q8o8J05j6j84L02k2j68J87n19J19K41R1l04K57j39l21L33K81l01l58
$$ -70 8 96 28 133 117 -67 235 213 45 232 -287 -168 73 164 -140 117 -22 -343 -10 271 -30 -388
3140c88L88J66m6j37PJ85l19nM83l75L5L4n5r7j33K54j7k8k00K29K25K3l10M50
$$ -388 0 166 120 -17 -10 175 -144 -149 334 -41 -6 28 -27 -124 -257 -3 -20 -48 -248 -19 206 229 -81 369
3164C69j2j35k02J32m0j57j7J7j58j20L8M03k75j54L92j88K6O3mj58J00J45J83
$$ 369 357 222 20 152 112 -45 -62 -45 -203 -323 -285 118 -157 -311 81 -107 -81 -18 -22 -180 -80 65 248
3187B48k13J82J03j81k92r0L06j55j42J24J98k08M2o3M5J76l2j76K71k98pK71
$$ 248 35 217 320 139 -153 -243 63 -92 -234 -110 88 -120 -78 -141 -96 80 48 -128 143 -155 -162 109
3209A09M4m83K24J08NM4L0k29J69j56J67M3j95M5J86m4m20L26O6P6j57n7J29k09
$$ 109 153 -330 -106 2 7 51 81 -148 21 -135 32 75 -120 -75 111 67 -353 -27 39 115 -42 -99 30 -179
3233a79p5J26M02j91q9R7j71q9K48O4J51m35K25J08j22j84J30j83J19j42K56R6
$$ -179 -254 -128 274 83 -6 91 -80 -169 79 143 294 -141 84 192 70 -114 16 -167 -48 -190 66 162
3255A62k44q5J44O3j72N31p8l5l90K39P6K33m05p1K92k83j12J41m0J26k07L84
$$ 162 -82 -167 -23 40 -132 399 321 286 -104 135 211 444 39 -32 260 -23 -135 6 -34 92 -115 269
3277B69l56o2L38r5j7q4ML77j99j38K02j23j3j15J01k38L7j53K33j51k92K78L28
$$ 269 -87 -149 189 94 77 -7 -3 374 175 37 239 116 103 -12 89 -149 -112 -265 -32 -183 -475 -197 131
3300A31l56J48J24L03k93J7J51j90j98mL51l47k11K72k21K9k6K44J25j15j7L23
$$ 131 -225 -77 47 350 57 74 225 35 -163 -167 184 -163 -374 -102 -323 -294 -320 -76 49 -66 -83 240
3322B40nj52j23L4K02j5J38j64j50p0J25k32j84K74j89O6K0j7K48q2kk09M57k54
$$ 240 235 83 -40 -6 196 181 319 155 5 -65 60 -172 -356 -82 -271 -205 -185 -202 46 -36 -38 -247 210 -44
3346d4J03j13K37m8J08m79J12j62K68j05o6j07k2L5J26K01k5J79l77K46j74J00
$$ -44 59 -54 183 135 243 -236 -124 -286 -18 -123 -189 -296 -318 -283 -157 44 19 198 -179 67 -107 -7
3368gj24R7O6L0j38J52j06Q7k99K36K64j00j62R6r7j06q0L99j57j92q6J75q3j81
$$ -7 -131 -34 32 62 -76 76 -30 57 -242 -6 258 158 -4 92 -5 -111 -191 208 51 -141 -227 -52 -135 -316
3392c16M7P3k01N06K3P9r3RJ19J7k14J72k9n1l26L12j13k34j19J10J49J73l1M2
$$ -316 -269 -196 -397 109 132 211 118 127 246 263 49 221 192 141 -185 127 14 -220 -339 -229 -80 93 62 104
3416A04k05K44l2K18p5j21m0K29k90j13J72l16Q3L4r6J05l95J23N22j45M6J5K73
$$ 104 -101 143 111 329 254 133 93 322 32 -81 91 -225 -142 -108 -204 -99 -494 -371 151 6 52 67 340
3439C40m26K62j4k92K16k3j19J33O6j22J41j82l49M27k39L64k08J95k20m5J43
$$ 340 -86 176 162 -130 86 63 -56 77 143 21 162 -20 -369 58 -181 183 -25 170 -50 -95 48
3460D8q5Q9j99L29k05N7o9L2Ml9K39m12J83n6K49j91j93J02J04J80j25j61k05
$$ 48 -37 52 -147 182 -23 34 -35 -3 1 -38 201 -211 -28 -84 165 -26 -219 -117 -13 167 42 -119 -324
3483c24L90l46J98n4n7J59j5J09j93J50M8L51j67j21J54J4l7M9k66J42l60j71
$$ -324 66 -280 -82 -136 -193 -34 -49 60 -133 17 65 416 249 128 282 296 259 308 42 184 -176 -347
3505c47L74l04j06Q0J32qJ85J68l75J18J58J34QJ08j59p9l6J80j33j48j80K86
$$ -347 27 -277 -383 -303 -171 -179 6 174 -201 -83 75 209 217 325 166 87 51 231 98 -50 -230 56
3527E6l22L8L43j18j64j70L86K7r8m2J10q0n3R4j42J57j36K42O3j36l0J41q0l4
$$ 56 -266 -228 115 -3 -167 -337 49 76 -22 -64 46 -34 -87 7 -135 22 -114 128 191 55 25 166 86 52
3551E2j50K02j16j40OK44j1j79J71n1O1j77j3K56J42l17N2q4m2r9J3K49l0J11
$$ 52 -98 104 -12 -152 -146 98 87 -92 79 28 89 -88 -101 155 297 -20 32 -52 -94 -193 -180 69 39 150
3575A50l3m3r7N6J1J6k27J27K06m96R5K28l18K14J59k41K46p8J15m5J25k9J58
$$ 150 117 74 -23 33 44 60 -167 -40 166 -330 -235 -7 -325 -111 48 -193 53 -25 90 45 170 141 299
3598B99k6l01L0q4k00J39k83K54q1l8J62O5J14k16K07J16k53O0K84k36M2K7K82
$$ 299 273 -28 2 -82 -282 -143 -426 -172 -253 -291 -129 -64 50 -166 41 157 -96 -36 248 12 54 81 363
3621C63l45p9J0R9l56K45M0N1k21j86J55M23l15m2L21ll46KQ6J88j10J94j14J79
$$ 363 18 -61 -51 48 -308 -63 -23 28 -193 -379 -224 199 -116 -158 163 160 -186 -184 -98 90 -20 174 60 239
3645B39m28J03P1J32j19K21J73k27j83J08K07k82J46j51J10j48J85j2O4k37K3
$$ 239 -189 -86 -15 117 -2 219 392 165 -18 90 297 15 161 10 120 -28 157 145 209 -28 -5
3666ej43K97j39j10K4J64K86k56O9l16K01J40k17k2K36M1l75L6J85m2k27q3K49
$$ -5 -148 149 10 -100 -76 88 374 118 187 -129 72 212 -5 -27 209 250 -125 -89 96 54 -173 -256 -7
3689gj2N8O3j31O9J55N5j00p9Q7n6K67n38kK57j56k27J51m6L82l55K45J41j90
$$ -7 -19 39 102 -29 40 195 250 150 71 158 102 369 -169 -171 86 -70 -297 -146 -192 190 -165 80 221 31
3713C1nQj57K37M3k62J20l19K95N8l3k40L63K0l02L06j59J63j75J01K89k37l5
$$ 31 26 34 -123 114 157 -105 15 -304 -9 49 16 -224 139 159 -143 163 4 167 -8 93 382 145 110
3736A10j73N18n89n5J71K15k24j70P9J62k90K21J3K11k35K04j75M2J73J42q9k62
$$ 110 -63 455 -134 -189 -18 197 -27 -197 -118 44 -246 -25 -12 199 -36 168 -7 35 208 350 261 -1
3758aJ76j07l0j65J23Q2N7m22M20qk5j33L13j40l65Q6r7O29l93l0J67j99J4J52
$$ -1 175 68 38 -127 -4 78 135 -287 133 125 100 -33 280 140 -225 -139 -236 393 0 -30 137 -62 -48 104
3782A04j29N2p9j16K61j29q8Q5O4j32O6k9J73l74L19k43L52lr8j72q3Q5J96m5
$$ 104 -25 27 -52 -168 93 -36 -124 -39 25 -107 -41 -70 103 -271 48 -195 157 154 56 -116 -199 -114 82 37
3806C7n7k34N17k84K4J78L2k41k8J21J60l41K25k64K21O9k92K57j22m5L4J61m1
$$ 37 -20 -254 263 -21 3 181 213 -28 -56 65 225 -116 109 -155 66 135 -157 100 -22 -67 -33 128 87
3829H7l0j23K04p8j56L49k80L8O3j40j11J71k66K28J6j26J14j08J99k7M14l14
$$ 87 57 -66 138 60 -96 253 -27 11 74 -66 -177 -6 -272 -44 -28 -154 -40 -148 51 24 438 124
3851A24O0L3j37K2PJ3J3l51q4Q8K55j04L3K7K12k68J9J86j93K75k52J02M0n8k32
$$ 124 184 217 80 102 109 122 135 -216 -300 -212 43 -61 -28 -1 211 -57 -38 148 -45 230 -22 80 120 62 -170
3876a70J93K2j14k17J88J18r6l9K51k11j06J70L1J63k17J44j01k32J98k8R5l8
$$ -170 23 45 -69 -286 -98 20 -76 -115 136 -75 -181 -11 20 183 -34 110 9 -223 -25 -53 42 4
3898Dn1J25k67J87j70R6l0PJ42p1K4J58q7j17k1Q0K50k02L1q6j49K97k96P0J78
$$ 4 -47 78 -189 -2 -172 -76 -106 -99 43 -28 -4 154 67 -50 -71 9 259 57 88 2 -147 150 -146 -76 102
3923A02k67J24j26n0M52l42J35p8J25J03k67J93j6l43N2K00J6K2o8j18O1m6P8
$$ 102 -165 -41 -167 -217 235 -107 28 -50 75 178 -89 104 88 -255 -203 -3 13 35 -33 -151 -90 -136 -58
3946e8J69j55p7J03J50k73Q8k51N00k54j63J53J67nk98L16m6k25K52Jj11J70K24
$$ -58 111 -44 -121 -18 132 -141 -53 -304 196 -58 -221 -68 99 94 -204 112 66 -159 93 94 -17 153 377
3969C77j55l92mJ74j3M1mP1j85P9M6J6n0J29K8k07K76o2j15n6K32j04m9l73L56
$$ 377 222 -170 -174 0 -13 28 24 95 -90 -11 35 51 1 130 158 -49 227 165 50 -6 226 122 73 -300 56
3994E6q1j71L23k15R8k76K37q5R6J09j97l5J84k3R7L9l30Q4J43Q5j88j9L10nl53
$$ 56 -25 -196 127 -88 10 -266 -29 -114 -18 91 -106 -141 43 20 117 156 -174 -90 53 138 -50 -69 241 236 -117
4019a17J92rJM6n6l7J08l32K33K05k96n8j0K54J2m40L38q3O0q9J7K15q0P0J62
$$ -117 75 66 67 113 57 20 128 -204 29 234 -62 -120 -130 124 136 -304 34 -49 11 -78 -61 154 74 144 306
4044C06l58m4J77p4K01j00j51m8K56l43K7LP6N1r6oK93o0p1Pj05J36j18N1q4j52
$$ 306 -52 -96 81 7 208 108 -43 -91 165 -178 -151 -148 -72 -21 -117 -123 170 110 39 46 -59 77 -41 10 -74 -226
4070b26M40j66j29N5J64l19j15K22J0J74J31j96J5K7P3j33q9r0J99K12l33k18
$$ -226 214 48 -81 -26 138 -181 -296 -74 -64 110 241 45 60 87 160 27 -62 -152 47 259 -74 -292
4092b92J14j54J88L60j29m49K32L22j57j17J05Lo5k4O4J3J39j89l1J27j36K13
$$ -292 -178 -332 -144 216 87 -362 -130 192 35 -82 23 26 -39 -63 1 14 153 -36 -67 60 -76 137
4114A37k5K1n1q8J38l1j76p6K51j81L45j10r1J6j0l00K72m2J96Jk6m81J22J97
$$ 137 112 133 82 -6 132 101 -75 -151 100 -81 264 154 63 79 69 -231 41 -1 195 196 170 -311 -189 8
4138HM2R2j84J28k34K62k64K26r7j60K29j3l06L63O9k0m6l08L49j97k19M46k17
$$ 8 50 142 -42 86 -148 114 -150 76 -21 -181 48 35 -271 92 161 141 95 -213 136 -61 -280 166 -51
4161e1R9J70l90N47m86N0R0o2k5O9j66P8K2J15n4k29K19j69J49J17J31j59j35
$$ -51 48 218 -172 375 -111 -61 29 -33 -58 11 -155 -77 -55 60 6 -223 -4 -173 -24 93 224 65 -70
4184g0K50n2rO3j83Q8l95M0J80L9K28K4o9k72O6K31k01j2J81J00k40R4n3J1%k67
$$ -70 180 128 119 182 -1 87 -308 -268 -88 -49 179 203 134 -138 -72 159 -42 -54 127 227 -13 81 28 39 39 -228
4210b28K67k4l35J37J29l3j43K94j84J74J51k52M5Q2N3r8j51L91L3k99j22K12
$$ -228 39 15 -320 -183 -54 -87 -230 64 -120 54 205 -47 -2 80 133 35 -116 275 308 9 -113 99
4232I9m58K95J81j65k00K50J1k42K06J28j39k0K77j83J19j44k18J75k6q1K38r7
$$ 99 -359 -64 117 -48 -248 2 13 -229 -23 105 -34 -54 223 40 159 15 -203 -28 -54 -135 103 6
4254Fj00J63p5J90j38o0j21M50k50J35m48K33n1L26m20rj01J94Q6o6j34K41j51
$$ 6 -94 69 -6 184 46 -14 -135 315 65 200 -248 -15 -66 260 -160 -169 -270 -76 10 -56 -190 51 -100
4277a00J83m6j33k9m5P2J6L05k53k0R5J51k65k4J20Pj60r1M03l29K07l1r6K68
$$ -100 83 37 -96 -125 -170 -98 -82 223 -30 -50 45 196 -69 -93 27 34 -126 -217 186 -143 64 33 -63 205
4301B05m2k25K48k03l8K10j53k70K36p6j29J15J30k8lL2k17M86k26j62K36j64
$$ 205 163 -62 186 -17 -55 155 2 -268 -32 -108 -237 -122 8 -20 -23 9 -208 278 52 -110 126 -38
4323c8L7k3q6r9J41j57n5L23q7L00m27L30J7k81J56q7j01J71o0K15j47j4r0k6
$$ -38 -1 -24 -110 -209 -68 -225 -280 43 -44 256 -171 159 176 -105 51 -36 -137 34 -26 189 42 28 -62 -88
4347h8MK89m2k13L9j4j35j03K90j02l24M24M6l16pJ06J61Q9k87K02p7n4O3L96
$$ -88 -84 205 163 -50 -11 -25 -160 -263 27 -75 -399 25 71 -245 -252 -146 15 104 -183 19 -58 -112 -49 347
4371C47j91Q7Nl39K15l9l73K81k62O3K66j66J4j3R4n8J25j00K34k87N4J78K9n9
$$ 347 156 243 248 -91 124 85 -288 -7 -269 -206 60 -106 -92 -105 -11 -69 56 -44 190 -97 -43 135 164 105
4395A05j27j8L15j05j97k04L03O1k77L69l95L20j47K59k48J49k36l4K63j59M7
$$ 105 -22 -40 275 170 -27 -231 72 133 -144 225 -170 150 3 262 14 163 -73 -107 156 -3 44
4416D4P3o5J69j53pk48L46k15j09o0J27L4O8r4J84k97J07J57k59K97Q3j26M0m8
$$ 44 117 52 221 68 61 -187 159 -56 -165 -225 -98 -64 4 -90 94 -203 -96 61 -198 99 182 56 96 48
4440D8j21oJ21k40k70N52Km3k21J95k6Q8pj53L80l38J21N1k90J44R5R2k25l3K75
$$ 48 -73 -79 42 -198 -468 84 86 43 -178 17 -9 79 72 -81 299 -39 82 133 -157 -13 82 174 -51 -84 191
4465A91k15k22L51j16K9j35j85M34Lk11J47J7k48J40R6k43j4J96k65K47J87j80
$$ 191 -24 -246 105 -11 18 -117 -302 132 135 -76 71 88 -160 -20 76 -167 -181 15 -250 -3 184 4
4487DJ3J59Ok56q8J03M3j08J27p6Q3J37n7j77L0N0q9J0r8P1J36j61L7K56R3m46
$$ 4 17 176 182 -74 -162 -59 -16 -124 3 -73 10 147 90 -87 -57 -7 -96 -86 -184 -113 23 -138 -101 155 248 -198
4513a98j8kL64j51N0J15l9q8k87P1J60J24j32Q4K6n2J42j30J16K9k05J99r4m4
$$ -198 -216 -218 146 -5 45 160 121 33 -254 -183 -23 101 -31 53 79 27 169 39 155 184 -21 178 84 40
4537D0j78J49o5Q3k21K10OK5P9j17N4j37p5O8K39k94M2R0N2J77j88p6K21j70k06
$$ 40 -138 11 -54 29 -192 18 24 49 128 11 65 -72 -147 -79 160 -134 -92 -2 50 227 39 -37 184 14 -192
4562a92P9K17J6k33R2N0k78M90k02j05K49L1k88K98p0k84K25q9L0On8P0j94k49
$$ -192 -113 104 120 -113 -21 29 -249 241 39 -66 183 214 -74 224 154 -130 95 6 36 42 -16 54 -140 -389
4586c89J18K22K0n4k04K22J03j4P9j5j09n2j6J05Ql8L0n9J52j7j46J71p7k1j83
$$ -389 -271 -49 -29 -83 -287 -65 38 24 103 88 -21 -73 -89 16 24 -14 16 -43 109 92 -54 117 40 19 -164
4611a64pJ59K32j23r0Qq2j16K28K6LJK62l77J19k03k8J17j05K64j34O9J37k04
$$ -164 -171 -12 220 97 7 15 -67 -183 45 71 74 75 337 -40 79 -124 -152 -35 -140 124 -10 59 196 -8
4635hj30R2J27j09N8O3k39K3K27j3K8k56J27J39j44J64l41J21q6j39P7J47J86
$$ -8 -138 -46 81 -28 30 93 -146 -123 104 91 119 -137 -10 129 -15 149 -192 -71 -157 -296 -219 -72 114
4658A14n2Mj17Q3N1J71m51K94L4j21Q2J29Jl74O5R7j58Q7R1K02j43j56m0K34j97
$$ 114 62 66 -51 32 83 254 -197 97 131 10 92 221 222 -152 -87 10 -148 -61 30 232 89 -67 -107 127 -70
4683g0k2o0K21j86R7K17k63l3j7J59J40K6j47J7K3q4J38j28k08K50L0j89k7RP4
$$ -70 -92 -152 69 -117 -20 197 -66 -99 -116 43 183 209 62 79 102 18 156 28 -180 70 100 -89 -116 -107 -33
4708c3L3o5J75l86J63J37N0L63m18N1J66k34J4r3K32k47j4P1j24K86q2o9j50L24
$$ -33 0 -65 110 -276 -113 24 74 437 19 70 236 2 16 -77 155 -92 -106 -35 -159 127 45 -24 -174 150
4732A50l09K36j72J1J87m8Q7p8M5j92O0m0J49K1p3l1J62k62J58j76m1L16l21P6
$$ 150 -159 77 -95 -84 103 55 142 64 109 -83 -23 -63 86 107 34 3 165 -97 61 -115 -156 160 -161 -85
4756h5J38J2m7NJ57j01k13M9Q3J05j36K86j70q5J73k66R5K29j81M3Q2j80J22k13
$$ -85 53 65 18 23 180 79 -134 -85 -2 103 -33 253 83 -2 171 -95 0 229 48 91 173 -7 115 -98
4780i8R4K31m30J65l2K58l0k71J41m3k02M59l94L2j36K23J83k13K25k81L88k91
$$ -98 -4 227 -203 -38 -70 188 158 -113 28 -15 -217 242 -152 -120 -256 -33 150 -63 162 -119 269 -22
4802b2Kj10K2K37j60j56J63K47k70p8J29j02%J44N5j26j8K9J33J37m98K30K9J31
$$ -22 -20 -130 -108 129 -31 -187 -24 223 -47 -125 4 -98 -98 46 101 -25 -43 -14 119 256 -242 -12 17 148
4826A48j41j15J58k46L74l39L62j11n27M69j23k46L65J21J34l06Q4j42K1n4K40
$$ 148 7 -108 50 -196 178 -161 201 90 -437 32 -91 -337 28 149 283 -23 61 -81 -60 -114 126
4847A26p0j50k14L85k12R1Q9K9L4J62j86n8j9P5j79O8k6k00N17n01J03j15N9K92
$$ 126 56 -94 -308 77 -135 -44 45 74 108 270 84 26 7 82 -97 -29 -55 -255 262 -239 -136 -251 -192 100
4871A00k71K38j57L3j6M3J90j20o2J72j98J69o1q9k66L80l1k56J88J36Rm7k06
$$ 100 -171 67 -90 -57 -73 -30 160 40 -22 150 -48 121 60 -29 -295 85 54 -202 -14 122 131 84 -122
4894a22P3j37j82M49k42K06j58J54k03K42j73P5M4p8o4K62k32J84J16l15P0p7
$$ -122 -49 -186 -368 81 -161 45 -113 41 -162 80 -93 -18 26 -52 -116 146 -86 98 214 -101 -31 -108
4916a08K00Mk19P7JJ42j09J02lJ6j13Q9j38m7M5R1k79K34J17L0k75K65m46L85
$$ -108 92 96 -123 -46 -45 97 -12 90 87 103 -10 79 -59 -106 -61 30 -249 -15 102 132 -143 122 -324 61
4940F1o5M1r4K26r4J6p7k88K12J03K2J74k12n6l85N64rk76J91j74q8K59r9l6o6
$$ 61 -4 37 -57 169 75 91 14 -274 -62 41 63 237 25 -31 -416 148 139 -137 54 -120 -208 51 -48 -84 -150
4965a50M1J04o3n8J25M6j47O4j18J11j0J8j5J01MK8j46m0J72k47J06kP1L5J19
$$ -150 -109 -5 -68 -126 -1 45 -102 -38 -156 -45 -55 -37 -52 49 53 81 -65 -105 67 -180 -74 -76 -5 30 149
4990A49M9k39J06k95M20m2j73M4j32J27J65k09Q7j18J98m14J08J70J18l83M25
$$ 149 198 -41 65 -230 190 148 -25 19 -113 14 179 -30 57 -61 137 -277 -169 1 119 -264 161
5011A61j02J3J82j81j76J59O4K02k70m6k77K61l84J23L49j71k0L2K16K3k41L5
$$ 161 59 72 254 73 -103 56 120 322 52 6 -271 -10 -394 -271 78 -93 -113 -81 135 158 -83 -48
5033d8J7j01Q0j77L16j95K5p4L17k55R3j27j69M30k68L54n2j94K15j57j1j73J0
$$ -48 -31 -132 -52 -229 87 -108 -83 -157 160 -95 -2 -129 -298 132 -136 218 166 -28 187 30 19 -154 -144
5056a44K53k70p2J63N1j52J34j63K43j50L21k71O8R1o3k90J6L2L69j38J28J73
$$ -144 109 -161 -233 -70 -19 -171 -37 -200 43 -107 214 -57 11 102 39 -251 -235 -203 166 28 156 329
5078C29l43o6j17K55L3J15o7j7k20o5nJ89l1m5p3O3L5j69L18q9j61L01n3J86m27
$$ 329 -14 -80 -197 58 91 206 139 122 -98 -163 -168 21 -10 -55 -128 -65 -30 -199 119 30 -131 170 117 303 -124
5103a24K54k47K25K3k79M06j39k83K00J48m03L12J6k73K56O5l97O4J70O9j23P2
$$ -124 130 -117 108 131 -148 258 119 -164 36 184 -219 93 109 -164 92 157 -240 -176 -6 63 -60 12
5125A2J2k06P8J59j8J63p9J11l0k22J96l42J46j69K3J38r8J17J7j68N2K03L13
$$ 12 24 -182 -104 55 37 200 121 232 202 -20 176 -166 -20 -189 -166 -28 -126 -9 8 -160 -108 95 408
5148D08m12L0j59J81j0j18Jr9K69N2l64J18J18Rj51K41j37P7j26M0J90j88K33
$$ 408 -4 26 -133 48 38 -80 -79 -178 91 143 -221 -103 15 24 -127 114 -23 54 -72 -32 158 -30 203
5171B03R5l15K19K8m84J99J41k32R5J9J81l72K30J62k58KO7p7Olj37J30J03p2
$$ 203 298 -17 202 230 -254 -55 86 -146 -51 -32 149 -223 7 169 -89 -87 -20 -97 -91 -94 -231 -101 2 -70
5195g0mJ93j25J03j14j6J27K09l76J89j22J3j64K79O6n9k20q9KM93l67j67M13
$$ -70 -74 119 -6 97 -17 -33 94 303 -73 116 -6 7 -157 122 188 129 -91 -180 -178 315 -52 -219 194
5218A94k39J45o0k1j05O9Q3j9p1K45m11M21l21lK81k23kJ42j09l0J63k22O6m1
$$ 194 -45 100 40 19 -86 -17 66 47 -24 221 -190 231 -90 -93 188 -35 -37 105 -4 -34 129 -93 -27 -68
5242f8L03o33N93m17J1L30J09j68J22j55j35M14l10M3O0k44J44J38m3j31l5J43
$$ -68 235 -398 195 -222 -211 119 228 60 182 27 -108 306 -4 39 99 -145 -1 137 94 -37 -72 71
5264G1k5K1q4J5j20J75Nj96J63ql3k59L07k90J12P2J07p2J30kJ46l82J91k87p1
$$ 71 46 67 -17 -2 -122 53 58 -138 25 17 -16 -275 32 -258 -146 -74 33 -39 91 89 235 -147 44 -243 -314
5289c14L32j78K01J11J42m97L79k06J42p9O8j40MQ9n5J46j28Rk50q9M48Q9j91
$$ -314 18 -160 41 152 294 -203 176 -30 112 33 101 -39 -35 54 -1 145 17 26 -224 -313 135 224 33
5312C3p8k17K18L5K4k19Q3J04Q9r3o9K71j37O3l95M21k18L8j8j15N4l9J11j93
$$ 33 -45 -262 -44 -9 15 -204 -121 -17 72 -21 -90 181 44 107 -288 133 -85 -47 -65 -180 -126 -165 -54 -247
5336b47K23o8J90j43K54j69n7N7R5j25J0q2J60j76J36m6J29k00k6N8J84l10K98
$$ -247 -24 -92 98 -45 209 40 -17 40 135 10 20 -62 98 -78 58 12 141 -59 -85 -27 157 -153 145
5359A45k33N8L8l04K69J24l59Q0P5J24N8J6q8j22p7J86J46l1k95J67L9j92N39
$$ 145 -88 -30 8 -296 -27 97 -262 -182 -107 17 75 91 3 -119 -196 -10 136 105 -190 -23 16 -176 363
5382C63m76J95r1q0K5J36j23J64j63R9%J73Nj20q4J6j68K38j3J31p4n1j7k36K69
$$ 363 -113 82 -9 -89 -64 72 -51 113 -50 49 49 222 227 107 23 39 -129 109 96 227 153 102 85 -151 118
5407A18J1n5rm35L24O3k3r0NJ4O6l6J22J5j74P1k40J71K62N9k68J94k07Mj50j42
$$ 118 129 74 65 -370 -46 17 -6 -96 -91 -77 -11 -47 75 90 -84 -13 -253 -82 180 239 -29 165 -42 -38 -188 -330
5433c30L00L4j9J4Qq6q6J32J32n5j37Q9O4k8P5r6j26k9j04Q0K09o2j60J90p4J43
$$ -330 -30 4 -15 -1 7 -79 -165 -33 99 44 -93 -4 60 32 107 11 -115 -144 -248 -168 41 -21 -181 9 -65 78
5459G8j10j11L88k57L01k01j53J85l08K48o7P4j60J91j45P4JQ1k46K45k00m3K13
$$ 78 -32 -143 245 -12 289 88 -65 120 -188 60 -7 67 -93 98 -47 27 28 109 -137 108 -92 -135 78
5482G8nj02j85J82K3j55J90p7o9J27J03l6P8j11k0j78O6L47Lj42k87R4J54J04
$$ 78 73 -29 -214 -32 -9 -164 26 -51 -120 7 110 74 152 41 21 -157 -91 256 259 117 -170 -76 78 182
5506A82p6M8r2j25j76K58j28J4K32l3Lk92J82j19p5L49k21K13l2M1p2K6j78O6
$$ 182 106 154 62 -63 -239 19 -109 -95 137 104 107 -185 -3 -122 -197 152 -69 144 112 153 81 107 -71 -5
5530ek18K23k7q6K8J71n1k26P9K00j6q7J16K4l5l75L1L42Q6j98K38k09J66k98
$$ -5 -223 0 -27 -113 -85 86 35 -191 -112 88 72 -15 101 125 90 -285 -254 88 174 -24 214 5 171 -127
5554a27K08j93J00Lm9M3M3l3nQ6j03q4L63q4j63q3J75k68m0K6R8m7j7J16J24j37
$$ -127 81 -112 -12 -9 -58 -15 28 -5 -10 76 -27 -111 252 168 5 -78 97 -171 -211 -185 -87 -134 -151 -35 89 -48
5580d8j2O8J39j43L1k38L39j45J11k9m6P8K7j23M31p11K51M4l05K97oJ1m1K27
$$ -48 -60 8 147 4 35 -203 136 -9 102 73 27 105 132 9 440 -271 -20 24 -281 16 10 21 -20 207
5604B07l9n4k10P4kk8q6J50j3k53L34j29J34k36Q6K57k13q8j01J2J18m3j77M32
$$ 207 168 114 -96 -22 -24 -52 -138 12 -1 -254 80 -49 85 -151 -65 192 -21 -109 -210 -198 -80 -123 -300 132
5628A32j93m5J06J12j0j6k97O0K01p1J44j38J86N1j10Q8j4k25O1J22J80l63J18
$$ 132 -61 -106 0 112 102 86 -211 -151 50 -21 123 -15 171 222 112 200 186 -39 22 144 324 -39 79
5651G9j29q6K24k52p2K29K4L66l40J94Q2l99K20k47M8K46k48L00l26J95k05p7
$$ 79 -50 -136 88 -164 -236 -7 17 383 43 237 319 -80 140 -107 -59 187 -61 239 -87 108 -97 -174
5673a74K53j63J67j66M2j04k5l8N4K50n8p4L4m8J2P5P4j84L2k05K99jR7P4j70
$$ -174 79 -84 83 -83 -41 -145 -170 -208 -154 96 38 -36 -2 -50 -38 37 111 -73 -41 -246 53 52 149 223 53
5698E3Nj38K68m49L74r2l9o6p4K48L1k40J8N5j9J86l82K99k11J93J04k18j4lK94
$$ 53 58 -80 188 -261 113 21 -18 -84 -158 90 121 -119 -101 -46 -65 121 -261 38 -173 20 124 -94 -108 -111 183
5723A83j06Rk04M49m66Q4N9j08J57l73L06o9K24j23m3K7l9l4J76k18L70j92p8
$$ 183 77 86 -118 331 -135 -51 8 -100 57 -316 -10 -79 145 22 -21 6 -33 -67 109 -109 261 69 -9
5746iq6O1J29j43J49O5k73j32L58k3R8k67p3N6J17j29K49j45p4J6Q2K00j43p6
$$ -9 -95 -34 95 -48 101 166 -107 -239 119 96 194 -73 -146 -90 27 -102 147 2 -72 -56 26 226 83 7
5770GJ6rK03j47o5j15K38Q2j86k05J81N1k03J07M9J94k78k0J00J28k31K24k89
$$ 7 23 14 217 70 5 -110 128 210 24 -181 0 51 -152 -45 4 198 -80 -100 0 128 -103 121 -168
5793a68J33jQ1o0J53j18Q1r5j7l8L8l8r8J76M9J74j22j99J40N0m8p7r0L5P6J88
$$ -168 -35 -36 45 -15 138 20 101 6 -11 -49 -11 -49 -147 29 78 252 130 -69 71 121 73 -4 -94 -59 17 205
$$ [...]
8191A42
##END NTUPLES=NMR FID
##END=
