##TITLE=1H_L1-Sph(Et20-B)
 CDCl3, 8 sc, 
 15.2.2019
##JCAMPDX= 6.0         $$ Bruker NMR JCAMP-DX V2.0
##DATA TYPE= NMR FID
##DATA CLASS= NTUPLES
##ORIGIN= UXNMR, Bruker Analytische Messtechnik GmbH
##OWNER= root
$$ XWIN-NMR		Version 3.5
$$ Fri Feb 15 16:09:51 2019 Russian Standard Time (UT+4h)  she@DPX200
##.OBSERVE FREQUENCY= 200.1313
##.OBSERVE NUCLEUS= ^1H
##.DELAY= (6, 6)
##.ACQUISITION MODE= SIMULTANEOUS
##.ACQUISITION SCHEME= undefined
##.AVERAGES= 8
##.DIGITISER RES= 18
##SPECTROMETER/DATA SYSTEM= spect
##.PULSE SEQUENCE= zg30
##.SOLVENT NAME= CDCl3
##.SHIFT REFERENCE= (INTERNAL, CDCl3, 0, 15.7039)
##AUDIT TRAIL= $$ (NUMBER, WHEN, WHO, WHERE, WHAT)
$$ ##TITLE= Audit trail, XWIN-NMR		Version 3.5
$$ ##JCAMPDX= 5.01
$$ ##ORIGIN= Bruker BioSpin GmbH
$$ ##OWNER= she
$$ F:/spectra/data/she/nmr/H-F/1/audita.txt
$$ ##AUDIT TRAIL=  $$ (NUMBER, WHEN, WHO, WHERE, WHAT)
(   1,<2019-02-15 16:07:31.40 +0400>,<she>,<DPX200>,
      <created by zg, POWCHK disabled, PULCHK disabled
       configuration hash MD5:
       00 E9 B6 7A A2 85 ED C7 34 08 36 98 17 FE 4E 26
       data hash MD5: 16K
       64 B6 45 84 DB 83 83 79 07 AC AD FD 69 C3 15 14>)
$$ ##END=
$$ 
$$ hash MD5
$$ EF F6 7F 7A 3F 17 1C 34 56 87 7F 0D C6 C8 CF 20
##$RELAX= 
##$RELAX= 
##$RELAX= 
##$RELAX= 
##$RELAX= 
##$RELAX= 
$$ Bruker specific parameters
$$ --------------------------
##$DU= <F:/spectra>
##$EXPNO= 1
##$NAME= <H-F>
##$PROCNO= 1
##$TYPE= <nmr>
##$USER= <she>
##$AMP= (0..31)
100 100 100 100 100 100 100 100 100 100 100 100 100 100 100 100 100 100 
100 100 100 100 100 100 100 100 100 100 100 100 100 100 
##$AQSEQ= 0
##$AQ_mod= 1
##$AUNM= <au_zg>
##$AUTOPOS= <>
##$BF1= 200.13
##$BF2= 200.13
##$BF3= 200.13
##$BF4= 200.13
##$BF5= 200.13
##$BF6= 200.13
##$BF7= 200.13
##$BF8= 200.13
##$BYTORDA= 1
##$CFDGTYP= 0
##$CFRGTYP= 5
##$CHEMSTR= <none>
##$CNST= (0..31)
1 1 145 1 1 1 1 1 1 1 1 1 1 1 1 1 1 1 1 1 1 1 1 1 1 1 1 1 1 1 1 1 
##$CPDPRG= <>
##$CPDPRG1= <>
##$CPDPRG2= <>
##$CPDPRG3= <>
##$CPDPRG4= <mlev>
##$CPDPRG5= <mlev>
##$CPDPRG6= <mlev>
##$CPDPRG7= <mlev>
##$CPDPRG8= <mlev>
##$CPDPRGB= <>
##$CPDPRGT= <>
##$D= (0..31)
0 1.2 0 0 0 0 0 0 0 0 0 0.03 0 0 0 0 0 0 0 0 0 0 0 0 0 0 0 0 0 0 0 0 
##$DATE= 1550232450
##$DBL= (0..7)
120 120 120 120 120 120 120 120 
##$DBP= (0..7)
150 150 150 150 150 150 150 150 
##$DBP07= 0
##$DBPNAM0= <>
##$DBPNAM1= <>
##$DBPNAM2= <>
##$DBPNAM3= <>
##$DBPNAM4= <>
##$DBPNAM5= <>
##$DBPNAM6= <>
##$DBPNAM7= <>
##$DBPOAL= (0..7)
0.5 0.5 0.5 0.5 0.5 0.5 0.5 0.5 
##$DBPOFFS= (0..7)
0 0 0 0 0 0 0 0 
##$DE= 6
##$DECBNUC= <off>
##$DECIM= 32
##$DECNUC= <off>
##$DECSTAT= 4
##$DIGMOD= 1
##$DIGTYP= 9
##$DL= (0..7)
0 120 120 120 120 120 120 120 
##$DP= (0..7)
150 150 150 150 150 150 150 150 
##$DP07= 0
##$DPNAME0= <>
##$DPNAME1= <>
##$DPNAME2= <>
##$DPNAME3= <>
##$DPNAME4= <>
##$DPNAME5= <>
##$DPNAME6= <>
##$DPNAME7= <>
##$DPOAL= (0..7)
0.5 0.5 0.5 0.5 0.5 0.5 0.5 0.5 
##$DPOFFS= (0..7)
0 0 0 0 0 0 0 0 
##$DQDMODE= 0
##$DR= 18
##$DS= 0
##$DSLIST= <SSSSSSSSSSSSSSS>
$$ [...]
##$SUBNAM2= <"">
##$SUBNAM3= <"">
##$SUBNAM4= <"">
##$SUBNAM5= <"">
##$SUBNAM6= <"">
##$SUBNAM7= <"">
##$SUBNAM8= <"">
##$SUBNAM9= <"">
##$SW= 20.0189088683792
##$SWIBOX= (0..15)
0 0 2 0 0 0 0 0 0 0 0 0 0 0 0 0 
##$SW_h= 4006.41025641026
##$TD= 16384
##$TD0= 1
##$TE= 0
##$TE2= 300
##$TE3= 300
##$TEG= 300
##$TL= (0..7)
0 120 120 120 120 120 120 120 
##$TP= (0..7)
150 150 150 150 150 150 150 150 
##$TP07= 0
##$TPNAME0= <>
##$TPNAME1= <>
##$TPNAME2= <>
##$TPNAME3= <>
##$TPNAME4= <>
##$TPNAME5= <>
##$TPNAME6= <>
##$TPNAME7= <>
##$TPOAL= (0..7)
0.5 0.5 0.5 0.5 0.5 0.5 0.5 0.5 
##$TPOFFS= (0..7)
0 0 0 0 0 0 0 0 
##$TUNHIN= 0
##$TUNHOUT= 0
##$TUNXOUT= 0
##$USERA1= <user>
##$USERA2= <user>
##$USERA3= <user>
##$USERA4= <user>
##$USERA5= <user>
##$V9= 5
##$VALIST= <valist>
##$VCLIST= <CCCCCCCCCCCCCCC>
##$VD= 0
##$VDLIST= <DDDDDDDDDDDDDDD>
##$VPLIST= <PPPPPPPPPPPPPPP>
##$VTLIST= <TTTTTTTTTTTTTTT>
##$WBST= 1024
##$WBSW= 4
##$XGAIN= (0..3)
0 0 0 0 
##$XL= 0
##$YL= 0
##$YMAX_a= 461573
##$YMIN_a= -651967
##$ZGOPTNS= <>
##$ZL1= 120
##$ZL2= 120
##$ZL3= 120
##$ZL4= 120
##$ABSF1= 10
##$ABSF2= 0
##$ABSG= 5
##$ABSL= 3
##$ALPHA= 0
##$AQORDER= 0
##$ASSFAC= 0
##$ASSFACI= 0
##$ASSFACX= 0
##$ASSWID= 0
##$AUNMP= <proc_1d>
##$AZFE= 0.1
##$AZFW= 0.1
##$BCFW= 1
##$BC_mod= 2
##$BYTORDP= 1
##$COROFFS= 0
##$CY= 11.3945322036743
##$DATMOD= 1
##$DC= 2
##$DFILT= <>
##$DTYPP= 0
##$F1P= 18.9103706918063
##$F2P= -1.10871071338519
##$FCOR= 0.5
##$FTSIZE= 0
##$FT_mod= 4
##$GAMMA= 1
##$GB= 0.15
##$INTBC= 1
##$INTSCL= 1
##$ISEN= 128
##$LB= 0.24
##$LEV0= 0
##$LPBIN= 0
##$MAXI= 10000
##$MC2= 0
##$MEAN= 0
##$ME_mod= 0
##$MI= 1.114404
##$NCOEF= 0
##$NC_proc= 0
##$NLEV= 6
##$NOISF1= 3.799351
##$NOISF2= 2.8
##$NSP= 1
##$NTH_PI= 0
##$NZP= 0
##$OFFSET= 15.70392
##$PC= 1
##$PHC0= -9051.151
##$PHC1= 9.800139
##$PH_mod= 1
##$PKNL= yes
##$PPARMOD= 0
##$PSCAL= 0
##$PSIGN= 0
##$REVERSE= no
##$SF= 200.130013532006
##$SI= 16384
##$SIGF1= 3
##$SIGF2= 2
##$SINO= 400
##$SIOLD= 16384
##$SREGLST= <1H.CDCl3>
##$SSB= 0
##$STSI= 0
##$STSR= 0
##$SW_p= 3612.71676300578
##$SYMM= 0
##$S_DEV= 0
##$TDeff= 0
##$TDoff= 0
##$TI= <>
##$TILT= no
##$TM1= 0
##$TM2= 0
##$TOPLEV= 0
##$USERP1= <user>
##$USERP2= <user>
##$USERP3= <user>
##$USERP4= <user>
##$USERP5= <user>
##$WDW= 1
##$XDIM= 8192
##$YMAX_p= 0
##$YMIN_p= 0
$$ End of Bruker specific parameters
$$ ---------------------------------
##NTUPLES= NMR FID
##VAR_NAME=  TIME,          FID/REAL,        FID/IMAG
##SYMBOL=    X,             R,               I
##VAR_TYPE=  INDEPENDENT,   DEPENDENT,       DEPENDENT
##VAR_FORM=  AFFN,          ASDF,            ASDF
##VAR_DIM=   8192,          8192,            8192
##UNITS=     SECONDS,       ARBITRARY UNITS, ARBITRARY UNITS
##FACTOR=    0.0002496,     1,               1
##FIRST=     0,             0,               0
##LAST=      2.0444736,     0,               0
##MIN=       0,             -651967,         0
##MAX=       2.0444736,     461573,          0
$$ Real data points
##PAGE= N=1
##DATA TABLE= (X++(R..R)), XYDATA
0@%%%%%%%%%%qJ6j6K4l2M0m8N6p2Q8j05J29j54J81k18K55k95L42l97M58n23N97
32C18o79P70q72R84j108J244j393J556j733J928k142K378k632K909l213L543l907
49b049M307m745N225n756O348p009P749q586R542j0642J1928j3454J5296j7577
63i423K0487k4342K9731l7858N1663q1236K57278k98080k73326O82820R9455m71018
75e3849j01816L98265j25200m11219J09246M08935j68477l85711Q5221K80925
85C6320j19012j53146J82905J68481j34393l3383J85754M0478j56125R984J16638
96A44501m5297q6572P3610J1092j41641j774J58295n0855k12820M929J21041j13214
108a38705j19662K01108J70228k04578j30896K95774K16123k30967j64303K36506
$$ y = [0, 0, 0, 0, 0, 0, 0, 0, 0, 0, 0, -8, 8, -8, 16, -16, 24, -24, 32, -40, 48, -57, 72, -82, 99, -119, 136, -159, 183, -214, 244, -279, 318, -361, 409, -463, 521, -587, 657, -736, 820, -913, 1015, -1127, 1251, -1381, 1528, -1685, 1858, -2049, 2258, -2487, 2738, -3018, 3330, -3679, 4070, -4516, 5026, -5616, 6312, -7142, 8154, -9423, 11064, -13278, 16453, -21405, 30258, -50978, 206300, -91780, -365106, 317714, 417169, -53849, -155665, 242600, 117400, -293819, -184573, 224362, 55885, -329826, -244605, 36320, -82692, -235838, -52933, 115548, -18845, -52228, 133526, 174004, 17879, 27863, 144501, 99204, 12632, 86242, 97334, -44307, -46081, 112214, 61359, -151461, -146532, -25491, -138705, -258367, -57259, 112969, -91609, -222505, 73269, 289392, 58425, -105878, 130628]
118A30628J37513k34823j24128J81623L7372j92140J3443J81386j15316k87405
128b71847O2101K83207k2361k33825J9676K01376J4222q3034R7116J35780q2790
139A19621j61780N562R8808P088o6172m3751j1459O319K1964J5048L910J1846
151G004j1584n4543r410Q7758O3419n6303o0226N2635O8734l3677p0180j0720
163b7093J1238j6807j0861J3896K578p677K2572M4100K3245j3463l0755j4787
175c814J5828O428l5450j7564N3855L2828p0944n0842Q2799P0196q5305q2247
187h4232O9551N3653q9358l1161J34944N2512j37147n1458J33139L2997j39592
198e6152k0960J37450l790j45316K1346J63566L11j22331K0029Q3107p4781r4941
$$ y = [130628, 268141, 33318, -90810, 90813, 128185, -63955, -50512, 130874, 15558, -271847, -209746, 73461, 51100, -182725, -163049, 38327, 52549, -30485, 66631, 202411, 119621, -42159, -36597, 62211, 69299, 3127, -40624, -52083, -45764, -23800, -8752, -4842, 7004, -4580, -59123, -68533, 19225, 82644, 26341, -33885, 18750, 87484, 53807, -16373, -27093, -15855, -32662, -43523, -29627, -27049, -34726, -12154, 31946, 55191, 41728, 10973, -3814, 12014, 18442, -17008, -34572, 19283, 52111, -18833, -69675, 13124, 83320, -1985, -84232, -14681, 38972, -50386, -81547, 53397, 105909, -31238, -82696, 50443, 83440, -56152, -77112, 60338, 56548, -88768, -67422, 96144, 96455, -25876, -5847, 77260, 2479, -92462]
210i2462Q1292P3922j10336q0772J06330P5749p4817k0190Q9868n319r1865L6242
222a2358J03541m4308r1838N9260P5376p5283n7490Q0428R742j34191k2419J28969
234A9429k416j31397L6230J56715k9557j23817Q5638J45942r9507j53742R9592
245C110J32413j22387j34673J13424J03034j25148q1861J28556N1070j42361l0278
256a05101J53962K2843j39574R828J52553p548j30469K7651J14345n5317j25289
267h2116L9581R1916n3915p6362N7990O4336m4614k8131N1114Q303m5202J9011
279A911M2342n0648n4185O3050O0223o2262m7258O6063K4970q6195j7103J01537
291D2445J9147j02930j7934R4430J1872p2100K0137O8465n8286r4560N9921R5977
$$ y = [-92462, -11170, 62752, -47584, -128356, -22026, 53723, -21094, -41284, 48584, 43265, -48600, -12358, 91183, 46875, -44963, 14297, 89673, 14390, -43100, 37328, 47070, -87121, -109540, 19429, 17013, -114384, -78154, 78561, 49004, -74813, 10825, 156767, 57260, -96482, 3110, 135523, 13136, -121537, -8113, 94921, -30227, -112088, 16468, 67538, -74823, -105101, 48861, 71704, -67870, -58042, 94511, 86963, -43506, -15855, 98490, 43173, -82116, -42535, 49381, -4534, -80896, -22906, 41430, -3184, -31315, 19799, 28102, -17100, 1911, 44253, -6395, -60580, 2470, 62693, 431, -46827, 19236, 44206, -41989, -59092, 42445, 61592, -41338, -59272, 35158, 47030, -25070, -4933, 63532, 5246, -89314, -29393, 66584]
303F6584o5493r4266P6691J02288p1130q9639Q5430R8151q0308r7347O8520P6662
315G6143q2525q2753P5589Q0421o5182p7416M3580N2815l3622j4977N5612J0475
327C8160o2445k357P7793J7634o1488j4688M0418j5733o0616N025M8028j2615
339b884m4667J3919L6327j2649j5790L3186K5612j8636m661J7150k3361k8542
351b4996M8613N5519n6929q6971L0586P2757l0816n9587L8658M5530n9529m5102
363g2267P6916N9982o3834m6939O3293L1382o6388j9768O7402N040o4967J6549
375a3599P0355l7370q6256M6226J04490l2370j04342P637O5354j9402l7073M4227
387G877K5709p0448l9454O7853M8959l6860j8968L2788m316k7284L8162M6809
$$ y = [66584, 1091, -93175, -16484, 85804, 14674, -74965, 10465, 108616, 28308, -69039, -519, 76143, -6382, -89135, -13546, 66875, 1693, -75723, -32143, 20672, -12950, -27927, 27685, 38160, -24285, -26642, 51151, 68785, 7297, -7391, 33027, 17294, -43322, -38297, 9731, -2884, -47551, -33632, 2695, -9954, -25744, 7442, 33054, 14418, 9757, 26907, 3546, -24996, 23617, 79136, 22207, -64764, -34178, 38579, 7763, -51824, -13166, 32364, -27165, -72267, 4649, 64631, 797, -46142, 17151, 48533, -17855, -37623, 29779, 34819, -30148, -13599, 56756, 19386, -66870, -20644, 83846, 51476, -52866, -45229, 20125, 723, -36350, 7877, 33586, -36862, -76316, -8463, 40496, 3636, -15332, 17456, 13140, -14144, 24018, 70827]
399G0827m3752n5872L9574M5069n5024n9997L4383L8300l5157k3875L3099J19
411a2306m3720K1528P9004P981o2131r062M8364P850j9913K3194J5996n9054n2543
424e4812M2867N4292l5600o0544J1303L7800j1207k0102K4567K3631j7264r347
436a4416L1043J6256k8359j5738L1784K4308k2118k7671J784L645q446R490K2151
449B3713j7305m7071l166M5407J6819k9865j1070J8760o412j9158K6166L8783
461C5601j9214l6332K4058L7785k4854k9649L3483K4877m5229k8100M0128P737
473B0291n8294o180O5328o27p5153k204P1243L76n1428L1255O1904m1241o1072
486d5802N7273O9585n4685o2120N0164L3938p3512k9062P8173J5541q8124j0476
$$ y = [70827, 27075, -28797, 10777, 55846, 822, -59175, -24792, 13508, -21649, -45524, -12425, -12306, -56026, -34498, 44506, 52487, -9644, -18706, 29658, 37508, 17595, 40789, 56785, -2269, -54812, -11945, 42347, 6747, -53797, -42494, -4694, -15901, -36003, -11436, 12195, -5069, -14416, 16627, 32883, 4524, -11214, 20570, 44878, 22760, -4911, -3127, 518, -7928, 1562, 23713, 6408, -40663, -43829, 1578, 18397, -11468, -22538, -3778, -10190, -29348, -3182, 35601, 16387, -19945, 4113, 41898, 17044, -12605, 20878, 45755, 526, -27574, 12554, 20291, -38003, -44183, 21145, 20518, -54635, -56839, 14404, 14780, -36648, -5393, 56511, 15270, -45802, 11471, 81056, 26371, -35749, 14415, 48353, -25159, -54221, 23952, 39493, -48631, -59107]
498e9107Q5484m470p8410K9486Q5803l8371p9039N3481P5565o1067o2241P2693
510A9807M8237q7070m3267Q4982K3588q7564l577R1199j3124r0542L0771R1093
522F4533l9227p8303N4161O2113p5928n6290Q5667M5888r3442l6299R2336J7151
534D2360r2298M712R7257j6698r0325L4946Q6873m5069p2904O3579O3175p8766
546c158n9094Q0209L9682r0744k7439R1938Q777r8727J796R9673o764q7984K0558
559c1277P7596l3145o1177N3826N7923o1325m7546O7018L7361o7889k5562O3550
571B9353M105p0715L704O6069j6867o5980J9189N6291k3618m0848L2520L1005
583B4208l5864j3478M9908J3342m6001j859M6151m960m3261R093L0723k6838l6255
$$ y = [-59107, 26377, 21907, -56503, -27017, 58786, 20415, -58624, -5143, 70422, 9355, -52886, 19807, 68044, -19026, -62293, 22689, 46277, -41287, -44864, 46335, 33211, -57331, -26560, 64533, 25306, -52997, 1164, 63277, -12651, -68941, 16726, 62614, -30828, -67127, 25209, 42360, -49938, -45226, 52031, 35333, -54992, -20046, 66827, 21758, -51146, 12433, 75608, -3158, -62252, 17957, 57639, -33105, -60544, 31394, 40171, -58556, -56760, 42913, 36149, -51835, -31277, 46319, 13174, -48003, 5823, 63746, 2421, -45125, 21893, 59254, -8635, -34197, 29353, 33458, -37257, -33553, 32516, 15649, -50331, -31142, 25149, 1531, -39317, -6797, 24208, -11656, -25134, 24774, 38116, -7885, -9744, 36407, 31447, -11814, -2721, 28002, 1164, -35091]
596c5091K5722K6699l3815k7815L1405K4807k3102r681K6412P386j8431Q959K7589
609C1044n261k4963L350J7220o618j7000j431R24j0495p107M081M039k71o13l66
624a3467P407J4879K520j2195L385K2835L823k1036l783J2896q694j6526J3074
637E118J0413l3382k6947K7879K5922k4218j6596K7463P979k7093J2226M9270
649C8034n933m6971J1004M7592j2089m0771J7928K8656l5277l2922L3560J6025
661A8836n0342j7391M9686R040n1842N27N3242l763l7900L1897M8938l6556m3542
674b9170M9936M7631m9708l9154M6141J5177o3963j2673O2502o859p7674N799
686e2015P0637j6521o4968L1541O7277l0836m7880N0510M6714n1501k7812O9374
$$ y = [-35091, -9369, 17330, -16485, -44300, -12895, 11912, -11190, -20871, 5541, 12927, -5504, 3455, 31044, 25783, 820, 4170, 21390, 14772, -2228, -3659, -2735, -13230, -20337, -16256, -12217, -12488, -13101, -13467, -6060, 8819, 11339, -856, 2529, 25364, 29187, 8151, 4368, 17264, 8570, -7956, 5118, 15531, -17851, -44798, -16919, 9003, -15215, -31811, -4348, 3631, -23462, -11236, 38034, 32101, -14870, -3866, 43726, 31637, -9134, 8794, 37450, 2173, -30749, 2811, 18836, -31506, -48897, 789, 9829, -42013, -41486, 11756, 7993, -29907, 1990, 50928, 14372, -29170, 20766, 68397, 18689, -20465, 25676, 40853, -23110, -35783, 26719, 19860, -57814, -52015, 18622, 2101, -62867, -31326, 35951, 5115, -42765, 7745, 54459, 2958, -24854, 44520]
698D4520K3473p5966k2513O7261M724o8819K873N4654l2064o4031L8218O1030
710C3360m3968n3665N1826M8061m9470k6033O4101K3369n9410m675O5736o303
722D2929o8345J2839O4909k3028o6291J9279M4808l6833l8050M7504K9752n9488
734c0015k9332O3421L1347n0739j3186N2029L167m6810J3920N2434k0109n3075
746b6948K2130M5953k9960m4304K6467L1597l2527k3359L3920J1290m1101m170
758c1012M9662P603m4751m973L7869K147k5864J0994K3371k2255k6212K4632K7005
771B8216k4062k4453J9492J6155j9824j0699K0649M414k2184J89K5119k586k7327
784a6901O96K7391L437k0203k251J1968m495p724J4360J2581j8015j9073J3967
$$ y = [44520, 67993, -7973, -30486, 36775, 41499, -27320, -24447, 30207, -1857, -65888, -27670, 33360, -10608, -64273, -12447, 35614, -13856, -39889, 24212, 47581, -11829, -16504, 49232, 42929, -25416, -12577, 52332, 29304, -36987, -17708, 27100, -9733, -47783, -279, 29473, -30015, -59347, 4074, 35421, -15318, -28504, 23525, 26692, -20118, -6198, 46236, 26127, -26948, -4818, 41135, 11175, -33129, -6662, 24935, -7592, -30951, 2969, 14259, -26842, -31012, 18650, 26253, -18498, -23471, 14398, 16545, -9319, 1675, 25046, 2791, -23421, 1211, 28216, 4154, -20299, -807, 15348, -4476, -15175, 5474, 9888, -12296, -12107, 13012, 10426, -16901, -16205, 11186, 14623, -5580, -7831, 4137, -358, -8082, 6278, 18859, 844, -18229, -4262]
797d262J9339r217j4808P857Q310j3526o427J8822R033k0686j0255K1515J1455
810A7150k0814j1592J9253R332j7018o304J4672j388j7839O886K3752p913k6135
823a7958P576K5620o175j9552J3015J7832j9229j9283K2473J9336k5074k1535
835b2954K1239J5803k1858j2339K1435P158j8892J509K2112n150k2487J1276K6118
848B2970j1379k4151J1379J7950j6779j5249K0437J1351k6185j3517K3920J1818
860A2565j9509n146J8508j091j6802R925J9025j3675j9148J6775J7887k0338j7918
873a8942K2207J6331k3790j3166K4532J0098k6156q352K5930O858k4218m927J9559
886E964j11j7044O855J7195j2120j8596J4802K0666j3893j7086J6131J6204j7279
$$ y = [-4262, 15077, 5860, -8948, -1091, 7219, -6307, -12734, 6088, 15121, -5565, -15820, 5695, 17150, -3664, -15256, 3997, 13329, -3689, -9993, 4679, 3291, -14548, -7662, 16090, 8177, -17958, -10382, 15238, 9063, -10489, 2526, 20358, 1129, -18154, 4319, 23655, -1419, -22954, -1715, 14088, -7770, -20109, 1326, 8484, -10408, -8899, 13213, 8063, -14424, -3148, 22970, 11591, -12560, -1181, 16769, -10, -15259, 5178, 16529, -9656, -23173, 747, 12565, -6944, -12090, 6418, 5327, -11475, -1550, 17475, 3800, -15348, 1427, 19314, -1024, -18942, 3265, 19596, -4194, -17360, 7172, 17270, -8886, -17238, 8692, 15550, -8668, -13595, 5964, 5853, -11191, -4336, 12859, 739, -17857, -3055, 17611, 3718, -13368, 2763, 18967, 1688]
899A688j5870J8021J4853j9437j7473J4266J3552j4135j0729J3052R005j0712
911c919l557J2632K800j0277K151J2695m412j4632N356J4131q441j6991O313J4222
925H071j0379j5106J0535J4684j0115r719J4548J0650j2880m826J6108J865j9241
938e805Q57J9233q568k4555J0023K6644j3717k9663J5187K9160j6308k5541K1633
951a420K5328k4064k1986K8073K0240k7668j5531K7404O001l1867j032L4678m992
964A3164l6413R332L6301j3016l3469J9813L1916k5450l1266K7270K6620k8111
976c309j9435K9696J2498l2173l520L5514j437l6435P242L4069j3405l1053J9732
989b016K6457k7932k4045L2209J8940l8023j5951M0629J2342l7999k482L9505
$$ y = [1688, -14182, 3839, 18692, -745, -18218, -3952, 9600, -4535, -15264, -2212, 6793, -3919, -7476, 5156, 7956, -2321, -170, 12525, 8113, -6519, -1163, 12968, 4527, -12464, -6151, 8071, -2308, -17414, -6879, 7805, -2310, -12029, 2519, 13169, 289, -4537, 11571, 13436, -5805, -4948, 14285, 5717, -18838, -8815, 17829, 4112, -25551, -10364, 18796, 2488, -23053, -1420, 23908, -156, -22142, 5931, 26171, -1497, -17028, 10376, 16377, -15490, -16522, 18156, 13164, -23249, -13917, 22384, 9368, -24101, -4288, 27628, 2178, -29088, -1818, 24802, -3309, -22744, 6952, 19450, -12723, -16243, 19271, 17834, -18601, -11359, 22710, 9305, -21748, -2016, 24441, -3491, -27536, 4673, 23613, -14410, -30361, 10268, 22610, -15389, -17871, 21634]
1001B1634l471l6945J4597L7211k1874l9544K2633L2886k8884k9286L0416K1136
1013B0509l5121j4938L9197J1769l7499k290L9736K90l5169O335L2399j0690k6979
1026a2451J4114J6044k5905j7054K7260J3118k8683j0454K4161M310j6678J2359
1038A41K1523j9509k4593K4878K9082k0950k5900J6639J5471j9145p651K1330
1050A1316p78k9192M27K9308l27k6776L77K0784k148j1779R927R401j6599j0074
1064a6133K0760J5220j4507j4176P931J0765j007j572n22n920m524K585N49k720
1078c271J93l328r171J538J5485K558j5278k292J7826P551q435p2O567l329j354
1093E188J2610P8k2657q084J8565N211k0999p039J3167k004j3410J0217J8688
$$ y = [21634, 18163, -18782, -4185, 33026, 11152, -28392, -5759, 27127, -1757, -31043, -627, 20509, -14612, -29550, 9647, 21416, -16083, -18373, 21363, 21653, -13516, -7181, 25218, 14528, -12451, 1663, 17707, -8198, -25252, 2008, 15126, -13557, -24011, 150, 4460, -12218, 141, 21664, 2155, -22438, 2440, 31522, 10572, -15328, 1311, 16782, -2363, -10014, 11316, 10538, -18654, -18227, 11081, 10754, -16022, -15645, 5139, 2991, -8788, 1139, 10540, -6059, -16133, 4627, 19847, 5340, -8836, -905, 9860, 8853, 7281, 6759, 839, -3685, -1100, -551, -3271, -3078, -6406, -15577, -14039, 1446, 4004, -11274, -13566, 4260, 11811, 3376, 3304, 9871, 6542, 5188, 17798, 17876, -4781, -12865, 5700, 10911, -10088, -17127, -3960, -5964, -19374, -9157, 9531]
1106I531r327j6289J2597J6196p668n172J2083j666j6540Q189K0336j4189k5829
1119a7748J4331K4012j9717k4697K0647K0408k4246j6839K7306J2355k8679p797
1131b0664K9208K828k6444O161K6623j3302k3922K3803K6436k7776k4694L1383
1143I640K2567l4439k0615L2188J2126l4289q623K8527k437k8212J0830K7028
1155A4291j7480k2800K6951K3204k7347j4683L4794J1183l8029n504M0625n78
1167B4627m4704J328M0441q357l8465J0758L1006j7403k4372K5856K0570l1337
1179a0052j4742L8301J2504l9403q300L9354J841l8316L241L7917q026l6122J1338
1192a0465L2869j1890k5285J3933J5757j9127q135K4233M37l0184J221L0578m489
$$ y = [9531, 204, -16085, -3488, 12708, 5040, -132, 11951, 10285, -6255, 1934, 22270, 8081, -17748, -3417, 20595, 878, -23819, -3172, 17236, -7010, -23849, 3457, 15812, -12867, -20664, 8544, 11372, -15072, -8911, 17712, 4410, -19512, 4291, 30727, 2951, -21743, 9640, 32207, -2232, -22847, 9341, 21467, -12822, -21445, 7082, 4645, -23567, -12737, 14291, -3189, -25989, 962, 24166, -3181, -17864, 16930, 28113, -9916, -15420, 25205, 24627, -20077, -18749, 21692, 13335, -25130, -14372, 16634, -769, -25141, 715, 21285, -10052, -24794, 13507, 26011, -13392, -21692, 17662, 19503, -18813, -15572, 22345, 14319, -21803, -10465, 22404, 10514, -14771, -838, 14919, -4208, -12343, 11890, 12327, -17857, -16636, 13942, 9453]
1205I453k9839Q285K6835j2641k2335J9394K3268j8824j8691K0763J5234k0693
1217B09r541J8451Q87k1992K321K0465q074k1570J1312K2222j2312k0040J3627
1230d035J9178j2402j4347J3445J1606j3326r095J2127O527j0567m822N918q21
1243f14m644M604N394n591l351P305L794o321l210M369K43m314Q07J779l917j249
1259d916N322L091l937j207K812k339k287O358M752o422p001M299N834k058l018
1274g17J374j866m001R94N145J137j452J008o6j028J815J823l849k884L327q84
1290a24p356J76Q918P05p541K898Q807n077r271Q714J2929q058j2285Q673R800
1305A1908j0844q322J2548M580j8091q548J6211N149j6087p37J8436J931j6605
$$ y = [9453, -20386, -12101, 14734, 2093, -20242, -848, 22420, 3596, -15095, 5668, 20902, 209, -9332, 9119, 10006, -11986, -9665, 10800, 2726, -18844, -7532, 14690, 2378, -17662, -4035, 15143, 2741, -11606, 1839, 13445, 119, -8976, 3151, 9678, -889, -5711, 207, -614, -5258, -654, 4740, -851, -4202, 3103, 6897, 576, -2634, 1735, 1978, -2336, -1529, 250, -3667, -4916, 406, 3497, -440, -1647, 1165, -1174, -3461, 2897, 7649, 1227, -5774, -1475, 4359, 2301, -717, 657, -1209, -5210, -4216, 929, 2066, 614, 1622, 1556, 528, 2343, 4166, 317, -2567, 760, -124, -7480, -7304, 1614, 2319, -5222, -2324, 6483, 1406, -7865, 849, 13778, 5720, -6565, 2108, 11908, 1064, -7258, 5290, 9870, -8221, -16769, -558, 4591, -11496, -12233, 6203, 8134, -8471]
1318h471K114J7616j477j3954M722J0359r018r783J0547Q435j1549n669J0857
1331D729q37j5783K133J7097k615j7443M139J6218n260j2886J0008J4485j1007
1344B978j4730R120J0370o877l355J1291K05j5000J137J6354j395j7421K23J1832
1358D732n912j3353Q061J4272p808j2359Q624J2425p654q890P731Q923m176l500
1372A116M717j660p101N828J0634q037j7564M88J1806p69o566M304N405p786m874
1387a0059J2237J0533p674j0095L384N334j853P81L613n401p442P439J0190r538
1401A449j5875N883J6106l295j3462L835J0543n194p489J1788J1112j3680j6554
1414a4833Q548J5093k717q207L168J257p500K680J3160k093j7568j403J4731o3
$$ y = [-8471, -6357, 11259, 9782, -4172, 550, 10909, 1891, -7892, 2655, 11090, -459, -6128, 4729, 3892, -11891, -9758, 7339, 4724, -12719, -8580, 7638, 2378, -10508, -500, 13985, 2978, -11752, -2632, 7738, 861, -2494, 8797, 9002, -5998, -4861, 11493, 10098, -7323, -7100, 4732, -1180, -14533, -6472, 7800, -8, -12367, -3743, 8682, 1028, -7862, -131, 8792, 4616, 1116, 5833, 4173, -2928, 2900, 13534, 5497, -12067, -11579, 227, -542, -7108, -2804, 2601, -5185, -10059, 2178, 12711, 5037, -5058, -1674, 3660, 1807, 2588, 6201, 800, -6642, 797, 10987, 1449, -14426, -8543, 7563, 4268, -9194, -5359, 5184, -10, -7499, 4289, 15401, 1721, -14833, -6285, 8808, 6091, -2116, 1052, 2309, -5191, -2511, 10649, 8556, -9012, -10415, 4316, 4253]
1428D253j3494J497J3877j943j1271M793R979o594q489Q968Q579p548o540O383
1442B450K130o054M603P736j1615j6228Q731J6691p959j5104Q687J3163q465p988
1456i222J4358R019j4183o935J4276M457j4282j186J3047k514j4534M817J1884
1469I002j1284j5169J1242J4788j1477j3522J2342J3109r287o598J3054N943j2780
1482f37m559J0479J794q002K681O828p416q705P570P186q479p050O569Q18r559
1497a0482J741J3187Q0j0768J247R026j084l927O013K449r309k197J2573K851
1511A1400j2358l450R614l17j0527l47O886m170q802N805R346l168n700M013M814
1526C039j816R55L909k367n321L341N357k912m751K646J014n272j966L425j518
$$ y = [4253, -9241, -7744, 6133, 4190, -7081, -2288, 7691, 1097, -7392, 1576, 10155, 2607, -3933, 2450, 4580, -1474, 3129, 10865, -750, -16978, -8247, 8444, 485, -14619, -5932, 7231, -1234, -9222, 5136, 14155, -28, -6963, 7313, 11770, -2512, -3698, 9349, 6835, -7699, -2882, 9002, -2282, -17451, -6209, 8579, -2898, -16420, -4078, 9031, -256, -6854, 6200, 12143, -637, -5196, 5283, 7077, -925, 1756, 8584, 1168, -7537, 33, 7219, -1260, -8310, -1741, -923, -10482, -8741, 4446, 4526, -6242, -4995, 4031, 2947, -980, 5033, 7482, -1827, -4024, 8549, 11400, -958, -4408, 5206, 4889, -5638, -5985, 901, -3269, -12071, -6266, 3080, -88, -5788, -1775, 3039, 1223, 2178, 6087, 3720, -1601, 1740, 7097, 4185, -566, 2080, 3094, -2178, -4144, -719, -2237]
1541b237m270K782M526k890k549M839L071l541N81N120m190p119M713R135m834
1556C137q041N029N458o383l152Q742L07j1290j083J2068O37j0993J362R234m082
1571I50o986P027N349j1278o168J3312O301j1187l102J1844j132j1209N879J3840
1585A3440q784j5858P821J3178q744r179J1190N082j5358l756J7115J553j7650
1598i950P73J6815l917j5469Q018J6360q688j3657J1878J0473j4773q323J7127
1611F667O241j7334l910J5087j434j5026O268J4787j2184j6486J2914J5794j3526
1624b142j1798J6590R587j6548n721J9955K980j9567O28J9312m082j9090M921
1637d975J5676r232j2738J2107Q282j8600q440K0854R497j8091n790J6548J845
$$ y = [-2237, -6507, -3725, 801, -2089, -4638, 201, 3272, -269, 312, 5432, 1242, -5877, -1164, 7971, 3137, -4904, 125, 5583, -800, -3952, 4790, 5097, -6193, -7276, 4792, 5429, -5564, -4202, 5032, 950, -6036, 991, 6340, -4938, -11106, 2206, 8507, -2680, -5782, 6062, 4930, -6279, -400, 13440, 4656, -11202, -3381, 9797, 1053, -8126, 3064, 8146, -7212, -10968, 6147, 7700, -9950, -9177, 7638, 3721, -11748, -3730, 12630, 3942, -9715, 2163, 12636, -2137, -10460, 6667, 12908, -4426, -8336, 6751, 5317, -9709, -3441, 11346, -838, -17324, -4410, 11384, -2142, -13940, 2650, 12237, -4311, -10032, 9923, 12903, -6664, -6036, 13276, 9194, -9896, -4975, 10701, 1469, -11269, 838, 9120, -9480, -17920, 2934, 12431, -5660, -11450, 5098, 6943]
1650F943j3817N833J6521q443j7074P617J3353r163r100J1106L560j5771k792
1663a1227J6590N62j6387K305J6247m352j4883Q147J4449p661r590J0068O293
1676A0561j3170n232J3815K924j4111p97J1291m155j2425P159J3889q119j2920
1689a1290P488J0799p401n698J0436M913j1116l244J0180J257q195J423N893n677
1703b32p097O681N240q048l463Q093K488r032p28Q269K92n030M244N107o598n041
1719d855P578N760o172l640L859k908o765N536R084n691j1376L126Q754k196l374
1734c280M646J122o802P91R323P4q687J207O908j526n277K656K007o674p87R218
1750D919P47j1141l356Q723K626m336K323K176p930l608J1653P273r883p005Q236
$$ y = [6943, -6874, -1041, 15480, 7037, -10037, -2420, 10933, 1770, -7330, 3776, 7336, -8435, -11227, 5363, 5925, -10462, -8157, 8090, 3738, -11145, -2998, 11451, 3790, -5800, 4268, 10561, -2609, -7841, 5974, 8898, -5213, -6010, 5281, 1126, -11299, -4140, 9749, 1630, -11290, -3802, 6997, -404, -6102, 4334, 9247, -1869, -5113, 5067, 6324, -1871, -448, 5445, -232, -7329, -648, 4592, -3456, -6919, 1174, 3662, -5370, -6098, 2171, 2463, -2567, 1677, 6784, 186, -4855, 2723, 8483, 2311, -1329, 2530, -378, -7143, -1607, 7477, 1786, -9590, -6464, 2290, 94, -3280, 1366, 2488, -4314, -3523, 5800, 5874, -2813, -1606, 5302, 3776, -1501, 1155, 3162, -3512, -4299, 4919, 5666, -5475, -8831, -108, 2518, -1818, 505, 2681, -5249, -8857, 2796, 10069, 186, -6819, 1417]
1765A417L515o665J225Q305l962j0928M781J1631n981j0924M770Q564n893n490
1779e635N682J527r072J223J2602q13j2523m08J1269M03o001M687M795q491n415
1794f170J0523O569j0482o015P369J837q590Q65P671m232q600N489Q364o492p432
1809i326Q194P988o429m054Q027J753q724J322J1173j812j2352M5R112j999q223
1824e305L288N633p225o473P925O169o945l979Q161L117o787l67P927O25o078
1839c14J691N420m101o369M172M977n021n561L801J594n071m98N942M53n649M21
1855d113O261o9l532K528M550k816m120K749K767l194k548L098P51n434j822M199
1871g45J455l272l94L267m93k894J971M606l12l229K71K582j129j997R10J566
$$ y = [1417, 4932, -1733, -508, 7797, 3835, -7093, -2312, 9319, 3338, -7586, -2816, 5748, -145, -5635, 47, 1574, -7498, -6275, 6327, 5514, -7009, -7417, 3852, 4255, -1746, 2941, 7736, -755, -6170, 4353, 10922, 440, -5575, 1794, 3631, -4959, -4094, 3577, -655, -9255, -3766, 4598, -1894, -9326, -1132, 6856, 427, -3627, 4400, 6153, -2571, -1249, 9924, 8112, -4240, -4195, 4917, 2918, -5305, -2017, 3616, -3609, -10082, -2157, 4012, -2933, -6912, 1249, 4366, -2421, -2788, 5139, 5764, -314, 1377, 6797, 2696, -3673, 499, 5476, 455, -5106, -1305, 289, -4782, -5280, 662, 1115, -4534, -4113, 2148, 2079, -1453, 1075, 5625, 2809, -1311, 1438, 4205, 1011, -1537, 1561, 2312, -3122, -4944, -745, 710, -2562, -2956, 311, -182, -3076, -1105, 3501, 3189, -40, 231, 2813, 1684, -313, 597, 2163]
1887B163j851k773J66J719r95p40J361J497j273j537J802K214k39rJ007p6k253
1904A83k00J670N59k320j127L83o05j979J114K222p26j690J058J878n05p85K483
1921A613K442k291j738K222R11k686m24K208o68m085q02K729j90k355R51J949
1937b14j767k031L564L113j914j697L255J399l230p32L771J30l469p03J996j425
1953D6k765Q25K408j337k223J023J023j198R85L233k14l154M44K716K35j403J255
1970A899O25k320j227J929P20k199l42J590n82k172O65J914j305j418K468J263
1986A508k892j572K647J764j412k67R25q06q53K015J677j884j131J583L23k078
2002d53N69K131j201l173J007J902k249k107K508J610k724p85K860o9j961K632
$$ y = [2163, 312, -2461, -2295, -576, -1571, -2311, -950, 547, -726, -2263, -461, 1753, 1514, 1505, 2512, 2436, 183, -17, 1653, 2212, -108, -1235, -852, -1457, -3436, -2322, -100, -826, -2516, -1458, 420, -85, -870, 1613, 4055, 1764, 26, 2248, 3159, 473, 49, 2257, 1589, -2496, -3298, -569, -759, -3114, -2163, -214, -1981, -4012, -448, 2665, 751, -946, 2309, 3708, 478, -254, 3517, 3647, 178, -525, 1471, 46, -2719, -1894, 514, -823, -3046, -2023, -1000, -2198, -1213, 2020, 1806, -1348, -904, 1812, 2047, 644, 1899, 2524, 204, -1023, 906, 1626, -573, -915, 675, 93, -2079, -1414, 500, -805, -2223, 245, 1508, -1384, -2956, -309, 1455, 43, -224, 701, -105, -958, 1057, 2734, 850, -281, 1302, 1625, -453, 116, 2247, 1046, -2127, -1120, 782, -1467, -3574, -1066, 544, -2180, -2965, -105, -174, -2135, 497]
2018D97L622j941l549L017L625k977k623L401J098n496k075M309k97n291O33M771
2034G24k575m735K835N488k000k484M673K453n181j53P721J050p124j481N740
2049D951j639n870J842L857n870n406N114M070o519l020P474L264n765J23P605
2064D211o40n503M403Q617n021q690L520O707m955n312M289L7r249o53R369J77
2080A307r328J40Q536n99n155M959O833n166m353Q680M345q895l827Q062K134
2095G673q870j846N319l228p520N001P671o876q361O292P998m634k623P266J561
2110D823p887J424J0487q56j0040J179P698l413p599L774M388o661m401P270K405
2125B591q331k197Q942K260o385P17O164k741m899O535O128o569o187N441L868
$$ y = [497, 4119, 2178, -1371, 1646, 5271, 2294, -329, 3072, 4170, -1326, -3401, 908, 611, -4680, -4047, 724, -1851, -6586, -3751, 1737, -263, -2747, 1926, 4379, -802, -955, 6766, 7816, 692, -789, 4951, 3312, -2558, -716, 3141, -2729, -8135, -3021, 1049, -5470, -8490, -1016, 2248, -3517, -3394, 4211, 3571, -1932, 2471, 11088, 6067, -2623, 897, 7604, 2649, -2663, 1626, 1663, -7586, -8239, 1130, 1307, -8021, -7881, 655, 56, -5099, -140, 6693, 1527, -2826, 5854, 10199, 1304, -2523, 5539, 7673, -1197, -3043, 2276, -952, -8472, -3471, 4200, -2676, -11037, -4745, 3253, -1381, -4004, 3262, 4823, -3064, -1640, 8847, 7991, -2049, -870, 6828, 3415, -4184, -410, 3978, -2683, -7084, 186, 2591, -5740, -7937, 1005, 3265, -3120, -2403, 3761, 1020, -3879, 2656, 8784, 2215, -3972, 1469, 5337]
2140E337n730k469O128p69p998R26P161j586o491L793N576n103m270O867L820
2155E192o257j782O864N20p811O66P667j434p185J826M816l730m026N266L109
2170C701n507k149N544N80n605J851O261k355o028K628N199l814l874N400K122
2185C954o227k025N536R35m674J431N006l450n125M550N410n074m009N408K449
2200D095o387k043O629J520o151k89M554j884m663M125N097m805m134N137K431
2215C232n149k7O626q18p749R33P110j522n853K459L941l938l908N147K272n269
2231b513j097O339l85o834J702O814k256n590M079N722n837m898O125M822n960
2246B33l733M856R18n958J040O295k640o759K643O042l677m225N305M177n667
$$ y = [5337, -393, -2862, 3266, 2497, -5501, -4575, 2586, 1000, -5491, -1698, 3878, -1225, -5495, 1372, 5192, -1065, -2847, 4017, 4537, -3274, -2608, 5059, 3625, -3560, -1734, 3082, -648, -4674, 592, 3701, -1806, -3955, 1589, 2169, -3436, -1585, 4676, 2321, -3707, -1079, 4120, 306, -3568, 1832, 3954, -2273, -4298, 1238, 2173, -2501, -1070, 3936, 486, -4639, -89, 5321, 247, -3762, 1646, 4095, -2292, -4335, 2294, 3814, -2337, -2626, 1928, 44, -4619, -494, 4603, -202, -4336, 801, 3232, -1917, -1944, 4682, 3864, -3885, -2952, 4158, 2636, -3217, -758, 3183, -755, -4663, 484, 2756, -2513, -3610, 2729, 2344, -4490, -2788, 4026, 1770, -3820, 259, 5981, 144, -4754, 1371, 6193, 233, -3500, 1356, 2274, -3684, -2644, 3651, 1011, -5748, -3105, 2937, -740, -4965, 340, 4517, -1150]
2261a150k837O423K663n473q29N475n60o323J624M875l291m159L680K495o623
2276d010k290P379K014o877j082P019J10n539K307O692k381o330L276N840m276
2291A852l890L396K174n649j274N125q19o142Q18O299j452n344K303M602j556
2306D43k632L783K770m408j347M606J731m627n97K563j496l756K918K833m366
2321a582l940L684L511l067k214L617J174l210J322M268r65l825J475L979j883
2336B344l758J876J966l441j752L247M89m106r11M862Q13l298p57L540L23j433
2352DJ908J123k453j660K324J491k797j350N97k51j013J027R72j908j626K578
2368a034K915j452r49J985R43j145R13J365j565k801J013K105j632l235l41Q72
$$ y = [-1150, -3987, 2436, 5099, -374, -1203, 4272, 3712, -2611, -987, 3888, 597, -3562, 118, 2613, -4010, -6300, 1079, 3093, -3784, -4866, 2153, 2263, -3276, -969, 5723, 3342, -2988, 288, 6128, 1852, -2038, 1358, 3532, -2117, -3391, 1734, 915, -5227, -4409, 1890, 438, -4906, -2603, 1999, 443, -2189, 1594, 4364, -44, -1391, 3215, 4946, 319, -278, 2285, 789, -2967, -49, 2784, -1582, -5522, -1838, 1673, -1394, -3608, 9, 1183, -2027, -705, 3563, 2598, -1227, 248, 4227, 2344, -1414, 462, 2428, -1013, -2765, 482, 971, -3135, -4046, 816, 1629, -1669, -2426, 1114, 1437, 4, 1912, 3035, 582, -1078, 1246, 2737, -60, -1410, -813, -1064, -2077, -1050, -78, -1986, -3612, -1034, 1881, 429, -520, 1465, 2408, 1263, 2176, 3541, 1976, -825, 188, 2293, 661, -2574, -2915, -2043]
2384b043l76k77J506j14k242M31M008J761j443j81R67N13J80J070J22k093j712
2401G7J60K97j660j171l79n38m13O11L81m67k26K823J946k47o23J253J333P62
2419C919L38m16j147k093o3L76o09j575j320p15o78K79J402N23p14k1J587K009
2437A082J85J66R90J224p7o36q37lk57o04j189q12p37j098k95J35R27M44k02n27
2457b121M20J533J987N47p71m06P8O09j7M85k50j898j967K86P61L31o00k93o44
2476a930m35J360J937n10j468R88J997o97j549P12J335n90j191N49J83j679j053
2493b041J822J127j110j330L95j86O91K331J037k712k180K101K223n43j470M40
2509E95m33j499K62K038p08k177J29J937o93j021J688R59j684J21L226l55l641
$$ y = [-2043, -2419, -2696, -1190, -1304, -3546, -3115, 893, 2654, 1211, 1030, 1997, 2510, 2690, 3760, 3882, 1789, 77, 237, 534, -1126, -2297, -2676, -3214, -3627, -3016, -2635, -3102, -3328, -505, 1441, 1194, 571, 1824, 3157, 3919, 4257, 3841, 2694, 601, 538, 914, 305, -1270, -2590, -3305, -3983, -3704, -2302, -1779, -2493, -2514, -927, 1082, 1267, 1433, 2423, 3647, 3570, 2934, 2097, 2094, 1837, 1233, 44, -768, -1505, -2603, -2898, -2763, -1836, -1392, -1594, -2121, -1701, -168, 1819, 2366, 1595, 1189, 1267, 1876, 1859, 2344, 2094, 196, -1771, -1485, -724, -393, -993, -1286, -1930, -2365, -1005, 932, 422, -1046, -58, 1939, 1242, -307, 405, 1740, 1150, -41, 508, 691, -988, -2041, -219, 908, -202, -1532, -1137, -1323, -632, 1699, 2736, 24, -2156, -55, 2168, 1625, 155, 595, 162, -1337, -1075, 963, 255, -1922, -1793, 144, -549, -1570, 118, 1077, -607, -486, 2740, 2385, -1256]
2526a256k85M142J197l739j640J759o91j366K007J779l332k875K728K896j203
2541A21q13J885l04k317J598L682j291l532N28L026j318k688R41R83j682l56K008
2558D71k30l180J063L469j89k566O54K216j966j113L785J716m465k713L671K009
2574B632k804r92K182j262k794K008L131j980l223K612K642k303j845L023J449
2589B476l357j58L436n77l861M80L986q23l039Q38J551k211p05L731M93m362o78
2606b780L776Q17k691O60K289k160k626L428K835l776k735L240J886l221q04L299
2622A437m37l487J301L736k194l366K288L913k552k784K604J151l066o2L983n36
2638A929m515p0M317j33k731J339J638l108j428M230J727m135j489L647N85l227
$$ y = [-1256, -1541, 2601, 3798, 59, -1581, 178, -513, -1879, 128, 1907, -1425, -4300, -1572, 1324, 121, -692, 1193, 889, -1428, 170, 3852, 2561, -971, -443, 2583, 1265, -1423, -482, 501, -1181, -1537, 471, 241, -2939, -1876, 1593, 1404, -1162, -508, 1708, -258, -1371, 2414, 4130, -335, -3048, 623, 2632, -172, -1164, 1018, -244, -3038, -1030, 2101, 121, -3102, -490, 2152, -151, -1996, 1027, 2476, -881, -1039, 2397, 1820, -2041, -1561, 2425, 1602, -1437, -599, 952, -1259, -1964, 1767, 2260, -2102, -2780, 996, 1813, -878, -218, 2071, -89, -2715, 713, 3548, -228, -2963, 277, 2163, -1058, -1862, 1437, 1000, -2487, -1186, 2550, 356, -3010, -722, 3191, 639, -2145, 459, 1610, -1456, -1518, 2465, 1929, -2586, -2656, 1661, 1528, -1203, 136, 1774, -1334, -2762, 1468, 3195, -940, -2429, 1218, 1803, -1424]
2654a424N79L424k439l484L009L234l478l014L866K569l131j422L186K95l963
2669b193J352M309j399m703J085L960j607k367K125J491m021j128M411R99m363
2684b049l15L800m56l019J821K910k719k172L131J789l448j764M441P63m210k68
2700a765L883j159l252J604L302k810l548K822L028k357k226L667N78l829K57
2715a805M596p01m288J400L945k268l266L042K670k742l081K775J195l348n55
2730b431L729j71l687P02L429j366k576K797K346l453j827L907J346l266p14L550
2746B315k5m260K96L605j193l226J959K113l163j672L728K337m029q74L209J41
2762A261l247J173L905j440l847J525L101j351k659K203J285l473j184L376P66
$$ y = [-1424, -845, 2579, 140, -3344, -335, 2899, -579, -3593, 273, 2842, -289, -1711, 1475, 1770, -2193, -841, 3468, 2069, -2634, -1549, 2411, 804, -1563, 562, 2053, -1968, -3096, 1315, 2314, -2049, -2364, 1436, 980, -2039, -218, 2692, -27, -2199, 932, 2721, -727, -2491, 1950, 2713, -1497, -1765, 2118, 959, -2293, -689, 2613, -197, -3745, -923, 2105, -252, -2478, 1189, 1767, -2062, -1805, 2791, 2090, -2198, -798, 3147, 879, -2387, 655, 3325, 583, -2498, 277, 1472, -1876, -2431, 1298, 1127, -2560, -1858, 1571, 205, -2371, 426, 2772, -681, -2508, 1399, 2745, -521, -1235, 2315, 2290, -1970, -1674, 1931, 738, -2488, -529, 1584, -1579, -3251, 477, 2814, -1215, -2089, 1120, 1261, -1986, -813, 3092, 1652, -2195, -670, 2431, 1080, -1579, 624, 1909, -1564, -2748, 628, 1394]
2777A394l305M76L375j229l372J991L343j884k580J935K047k567p76L038J37k635
2793f12p95L058j183k631J080K513j784k147K732J505k803q96L382O72k916r25
2809a750K583N92k293J316J966k442k134K168K049k149j661J738L5j614R85K340
2825A729l83l146P08K530n10k443J243J028j277k47J984J6k667M74K644K01l177
2842a293l7J813n27o89J617O84k485j181K218J630j788j615Q42J94p16J461J444
2859A572j291k465J994K294j152j405P47M61j096M87J552o40k498N01K085n20
2875F26k191j70R91m61J9J785K24k204j29K853P67q21p57J12Pm87J265J167k204
2894C92j908R99J080j334p82M20m38o48Q27J739m69j242J171J857k02q69K26O42
$$ y = [1394, -1911, -1435, 1940, 711, -2661, -670, 2673, 789, -1791, 144, 2191, -376, -1152, 1886, 2023, -612, -1407, 1651, 468, -2163, -1083, 1430, -354, -2501, 231, 1736, -1067, -1963, 1419, 2091, -825, -1750, 833, 1425, -868, 448, 2414, -28, -2162, 6, 2055, -94, -1755, -17, 18, -1596, -611, 1729, 1346, -1800, -1092, 1438, 928, -1515, -272, 756, -521, -768, 1216, 1232, -1435, -961, 1683, 1884, -1293, -1330, 483, -44, -733, 884, 1568, -917, -2098, 120, 1750, -38, -1653, -811, -617, -1333, 128, 1572, 281, -2184, -190, 2104, 952, -453, 294, 755, -341, 146, 1698, 1058, -1440, -939, 1146, 626, -1565, -1735, -744, -1205, -1186, 599, 823, -1381, -1510, 1343, 2110, 1289, 532, 644, 651, 164, 1429, 2596, 392, -1516, -517, 563, -771, -1553, -1133, -1571, -2219, -1392, 347, -122, -1364, -193, 1664, 1462, 593, 819, 1461]
2912A461m70J99O64n07k245j07J257k54r74o85l04n85J42K066O39j258k36J777
2930E80J160m74K39J67l66o62O37N49r56j447R8P49o08j274j82n6L49O08P42m66
2950f13l52M92J613P66k8p22o97k26M40P24J13j327j617K24P28J02l93r90m3J19
2970a687P95R09K46l14L62J083N03m06p04j07K36K03l49n85j267k61L39O88n4
2989c70j206n03O65P02Q97O64j67o50M7J499N68l75j340j94J22l55J05j59r40
3008i90m87L45L59j59r83O90R71J71n7Q45Pn27N88J556l87j563n57P09%m35mk8
3030F4j642p72J179J424j071k97L62L45m22Q44J226j72j002L82J384p05p99N03
3048H31L46j354n21Q62K27j809J80J175O9j687O23J176o17m45J562R87j413j012
$$ y = [1461, 991, 1190, 1854, 1347, -898, -1005, 252, -2, -976, -1661, -1965, -2550, -2408, -342, 297, -961, -1197, 580, 1740, 1266, 1505, 1672, 1306, 644, 1281, 1830, 874, -573, -475, 274, -334, -1608, -1790, -1846, -1497, -889, -147, -613, -965, -473, 1140, 1906, 1878, 1156, 459, 233, 673, 1397, 1510, 183, -1434, -1210, -482, -380, -773, -1763, -1806, -1687, -892, 17, 263, -51, 311, 1394, 1897, 1491, 787, 680, 916, 1119, 770, 185, -1082, -1343, -1004, -316, -370, -1576, -2079, -1414, -712, 185, 849, 682, 32, 79, 1578, 2146, 1771, 431, 237, 359, 4, 109, -50, -990, -1477, -1132, -773, -932, -1915, -1225, -254, -83, -140, 705, 712, 185, 773, 2329, 1942, 379, -178, 531, 531, 96, 92, 64, -1578, -2350, -1171, 253, -818, -1115, -753, -408, -830, 14, 1240, 1068, 66, 448, 1832, 1127, 328, 831, 1177, -177, -698, 164, 391, -1418, -1238, -63, 6, -1681, -1058, 118, -499, -944, 618, 1605, 192, -820]
3066h20J316J027q53k42N79p24j485O19J913p17j890N68P80r76k96J662K82j641
3084h98l13K080P0j590J48J210k69j153R76J066j849q09J869Q36j897j153J981
3101C05L99j444O58J332j393j723J638J916j440j614J221Q96j376j81J803j11
3117H86j928M3K276m19k009J147J307j201j041J533O51k083k65K000l9j669k12
3134a023J696k07j874J031J589j384j523J901J622k010j048K137L42j878J44J694
3150A209k86j887O26J810j414j761J840J233j907j232K014L39j689MK176l38k333
3167a596J060K199r55j918J310J595j642r75K135J15k583J95K175n4k671N89J838
3184H17o96j612J455J297k252p29K370J165k361n74K046L32j724M83J577j093
$$ y = [-820, 496, 1523, 670, 428, 1007, 283, -1202, -583, 1330, 613, -1277, -709, 71, -905, -1201, 461, 743, -898, -1211, 869, 939, -651, -503, 707, 438, -715, 261, 1327, -522, -1331, 538, 1374, -523, -1676, 305, 704, -740, -82, 1250, -143, -1866, -228, 1688, 248, -1366, -145, 751, -625, -806, 997, 886, -1042, -999, 1277, 858, -1151, -4, 1303, 102, -939, 594, 1245, -838, -1103, 897, 858, -811, -1023, 673, 466, -1408, -377, 1212, -172, -1695, 206, 1828, -182, -1230, 907, 1249, -629, -485, 1209, 923, -964, -338, 1472, 58, -1703, 137, 1370, -537, -1769, 245, 584, -1105, -1101, 1075, 737, -1596, -536, 1663, 708, -1210, 100, 1695, 53, -922, 1213, 1328, -1255, -1060, 1115, 1061, -1610, -1021, 817, 121, -1491, -36, 1261, -991, -1720, 650, 1815, -546, -1120, 926, 1258, -466, 17, 1594, 501]
3200E01j981J559J807j960j686J166J497j838m42K136m5k887Q78K683l67k348
3216a327R53J724j130j119J964M87k431j84K319K31k712Q4J875m62j868J267J287
3233I58j547j818K579J720k165j244K114N07j740R52J681j164k404R65K459j278
3249E75k086J231Q31j268o82J892K78k180J82K338m01k032Q15J671p06j164J530
3266H24O82k417n52K351N51j978n91J764m99j397J391J449j714j475J321J976
3282A686j423j127J660O6j559P8K007p37j907K52K130p30j964Q14J445j336q1
3299g26J360L26j658k93K070N58j871J97R76j081q33J689N79k041j273J693R43
3316F15j680n7J530q6j407P27K036j129j612J548J504j260j211J158M47j540p1
$$ y = [501, -1480, 79, 1886, -74, -1760, -594, 903, -935, -1377, 759, 714, -2173, -1295, 1388, 1021, -1327, -374, 1350, 220, -899, 1065, 1552, -879, -1063, 1256, 1487, -1225, -1141, 734, 272, -1596, -329, 958, -589, -2407, 172, 1892, -273, -1517, 597, 1104, -636, 316, 1997, 833, -1571, -606, 1853, 575, -1511, -280, 551, -717, -1399, 493, 771, -1409, -1227, 1111, 710, -1322, -507, 1164, 458, -706, 824, 1506, -911, -1463, 888, 1439, -539, -1130, 634, 135, -1262, 129, 1578, -136, -1611, -290, 1686, 263, -864, 796, 862, -697, -619, 1388, 651, -1256, -1004, 1126, 396, -1568, -754, 691, -645, -726, 634, 960, -698, -991, 1079, 1637, -234, -37, 939, -142, -975, 714, 1293, -748, -2021, -328, 615, -1065, -1122, 408, 322, -1085, -358, 1678, 549, -1063, 485, 1989, 729, -482, 676, 1123, -417, -488]
3333d88J543q31k071OK116k37j395N50Q86j149j71K166P44j580o76J791O45j662
3351A87L14Q67n81j351L27R68j428j065Q25J043j142q24J288N42j035O74J870
3368A479o62j631J274J606o80j146M40O59j411m05J076M5j688o96J715l8j556
3385a619O24J068n10n89Q85J157r24l29J302M27j137m47J240k2j595L94Q50q55
3403h0j259N62O20n48n81J021M21p80l1J093K38l94l83J128j64p31M11P92q47
3422D88r42M65L19p98m80O72K2n52k30J063N3o03K09Q35J82n56P1L92j62k06N06
3443G48n0o12l03K29K31o93L7J63l51l09M55O18k41m23P02L85k94r4K84k2k93
3464A67J88N18p74j46j2L47j54m46k34OL3lK35L7N7J43K06J26o3m0j45M24l7j47
$$ y = [-488, 1055, 224, -1847, -1841, 275, 38, -1357, -807, 79, -1070, -1241, 925, 1669, 89, -587, 1204, 1849, 187, 501, 1368, 787, -564, -237, 731, -697, -1762, -937, 106, -1036, -1860, -572, -30, -1065, -391, 1479, 817, -814, 460, 2066, 1386, 240, 680, 1339, -72, -477, 599, 644, -1044, -1740, -25, -63, -1619, -995, 73, -437, -1026, -141, 1016, 92, -237, 1065, 1492, 355, -92, 1148, 1126, -469, -75, 775, -80, -1339, -777, -157, -705, -1286, -265, 156, -624, -655, 438, 676, 282, -101, 1027, 863, 132, 543, 1335, 488, -454, 11, 330, -468, -948, -276, -254, -806, -1036, 27, 80, -523, -314, 521, 703, 147, 218, 610, 448, 242, 748, 698, 86, -217, 12, 243, -450, -413, -250, -601, -910, -455, 163, -78, -501, 201, 586, 292, 198, 482, 460, 167, 355, 873, 99, -47, -59, 288, 134, -312, -546, -540, -507, -510, -275, -238, -181, -38, 168, 294, 231, 191, 46, 470, 433, 286]
3488B86j94p2L44k0j95Pm63l86M05M26l44k45R9K45kM37P6l76j88M4K29L07l07
3511A13k87N77K12k74J7m36j80n8M92j13m37l10M19J73Q6j07N2l90J16L58K61
3532B84j61r6K16J72p6J39J60o61m33L59M64m33n71K92N70l74K66j59l08m62N35
3553b77M68r0n15K59K30L17q2K69M3r42K8P38K37q03k49L64j71j68K04J75n84
3574e49k69J013q0l66k39O52N77n30J77M14l47p22K02Q00o15p18M40L22o42J42
3594c38O94m68j060M06J117j57n15L89O55n02k92P53J34o80n65J078k10j297q6
3613i44J076j53o68N80L95q77o38J459O51j207k10R95M84j134L27J050n95j134
3631e43M60J001r51p21L73N39j007l85J408j30r31J33R84K30q68K61J304o74n57
$$ y = [286, 92, 20, 364, 344, 149, 156, -307, -693, -288, 138, -206, -451, -352, -107, -109, 328, 404, 28, -160, -116, 113, 420, 113, -174, 403, 615, 341, 358, -78, -258, -316, 176, 63, -374, -684, -265, -92, -6, -113, -61, -451, -335, 23, 284, 123, 27, 243, 415, 339, 478, 638, -23, -456, -97, 367, -66, -637, -345, 225, -149, 117, -42, -350, -812, -277, 191, 101, -414, -155, 75, 392, 310, 579, 622, -320, -292, 446, 683, -120, -369, -5, -176, -344, -140, 35, -549, -818, 195, 115, -251, -490, 162, 739, 209, 386, 800, 453, -269, -67, 733, 118, -600, -160, 162, -480, -338, 356, -112, -1172, -766, 351, 194, -321, 68, 723, 221, -71, 682, 816, 136, -429, 649, 439, -858, -944, 132, -21, -689, -109, 286, -591, -1229, 230, 881, -326, -536, 459, 943, -191, 136, 1186, 591, -543, -83, 918, -33, -754, -381, 158, -849, -1234, 174, 44, -887, -754, 230, 460, -408, -147, 1157, 483, -74]
3650g4J205J94j236p57J258J69j224n56Q18j12r08M97J125q43r74R19J362p44
3668A19p80J279N32j202K07J319k34j766M08J473o56j718M40Q49r26n10R03O40
3686C77j240o05J706N32j469J86J295k88n71N62Q92q26q10J051O04j349n40M36
3704e7L14j032J45J088p10j369P56J409q01o43O05J101p31m60J189L21r36m39
3722b50J442l80j303M26R82q99r44P62Q36j412m53J269L30j409L22R27j58o99
3740f11J37J153j58j155J134O68j062m69R29L52j287k52J300r8j167J12R38p40
3758b76o90Q43N49r72n81J286L98j148L88J011j59j154M52J387j253p38Q39O73
3776H55j210j51O13K19q89o9J150n96j097O80J223n32r41Q19N95o49n10J140K67
$$ y = [-74, 1131, 1325, 89, -668, 590, 759, -465, -1021, -203, -315, -1223, -726, 399, -444, -1418, -499, 863, 119, -661, 618, 1150, -52, 155, 1474, 1240, -526, -118, 1355, 699, -1019, -579, 270, -656, -1166, -263, 377, -863, -1468, 238, 770, -699, -513, 782, 494, -77, 485, 1377, 551, -259, 792, 1396, 47, -493, -57, 257, -775, -630, 458, -252, -1621, -865, 544, -257, -900, -295, 806, 75, -385, 804, 1125, 189, -250, 1192, 812, -491, -65, 917, 18, -926, -164, 672, -740, -1193, 76, 406, -1003, -681, 246, 88, -611, -474, 679, 521, -634, 500, 1168, 106, -363, 566, 918, -369, -621, 679, 581, -586, -474, 464, -276, -966, -123, 426, -546, -1127, 159, 557, -591, -203, 808, 649, -505, -53, 1334, 81, -657, 182, 855, -355, -506, 107, 326, -563, -632, 518, -78, -1175, -495, 728, 196, -745, 74, 669, 20, -490, 650, 917]
3795I17r78p09J510j02j334M54R54p44r67J140M68p39n80J273L09j019o40J435
3813F48l41p78K92R43o24j276P47J076o75o51O90N02o84j4Q65j20r75R0J452m99
3833F68j304O09R50r33p49R30J50j138k80J340O03j620q0J212J35j077O93Q37
3851I46q03r86J356P14q36q21P12K96r49j87R56k60r27J16J285k95j366M81R40
3870C72k09n09M32O58q98k07J382J00j213k28P75k82l62K69K25p36o67R88L42
3889B32p39j32M09M58k08k00P29k4o32L30N75o41m10L10N01o29j08M00l09l12
3909d00j11P78j47q76L47M36n1k10L96K09m22pK82K02n61K09K65l05k66K14L37
3930C19l83n50Q98k1o71m6L86M56o20J39L47l62n03O77K59k28m01L16K47l27J30
$$ y = [917, -61, -770, 740, 638, -696, -242, 712, -32, -999, 141, 609, -130, -710, 563, 872, -147, -787, 648, 307, -471, -179, 764, 140, -1136, -389, 687, 12, -639, 51, 553, -131, -145, 720, 600, -375, -285, 1167, 668, -636, -27, 923, -10, -759, 171, 321, -817, -1097, 243, 846, -774, -854, 358, 493, -584, 109, 946, 143, -843, 513, 1227, 391, -430, 282, 578, -371, -558, 398, 138, -789, -673, 612, 317, -1049, -568, 372, 163, -346, 86, 744, -154, -361, 1021, 1121, -92, -320, 455, 173, -189, 80, 305, -431, -1098, -110, 232, -507, -639, -230, 228, 20, -180, 549, 525, -107, 223, 798, 157, -253, 57, 558, -71, -179, 221, -88, -400, -511, 267, 120, -756, -409, 27, -24, -234, 162, 371, -51, -58, 224, 426, -135, 74, 339, 34, -232, -18, 319, -64, -614, 284, 263, -408, -454, -68, 388, -232, -93, 254, -108, -611, 66, 325, 97, -304, 12, 259, -68, 62]
3951F2K39r7l92k7M95k36j80q0L05q1k87M01J6m08J09L55L47p33J83J49j84r0
3973a34N35J85n70q3J78N25q47J38R8k0k37J00K90l15m11L13M64j63n73L79M70
3994C22k88Q8L28k43l37j32O95r4m39K07j18l61L4Q0o8k0j27Q6N93l83m2L99p0
4017A10J91M6K59k81p6kK20j13o55o2K93j97n9Q7j22l14Q7R3N78l25m0N67R3j90
4041A88J2M61nl82j55k6P8l30k29M10l40j94k8K01L05n10K25J63k65M66J31L51
4063E27ml72N88L9n23P4M09m15n06P0M64p19o75N13N60m81l72L79N92l72J77N93
4085E46j05n16L03N01J16q62J29L23l18m34J49L63o53j68M85K00m97k63O30j26
4105a97N8j40O90l74j82L11O68j00q61O7O01m92r2K72K21p85j76P10k57m55M0
$$ y = [62, 301, 204, -188, -215, 280, 44, -136, -216, 89, 8, -279, 122, 138, -270, -161, 194, 541, -192, -9, 140, -44, -134, 401, 586, 16, -67, 111, 636, -211, -73, 25, 5, -232, -132, 158, -157, -568, -255, 209, 46, -527, -148, 322, 34, 122, 450, 207, -130, -262, 433, 339, -100, 107, -11, -372, -338, -258, -326, -346, -473, -387, 206, -177, -219, 180, 110, 301, 347, 606, 325, 249, 247, 467, 354, -301, -363, -70, -267, -326, -239, -361, -675, -588, -495, 83, -242, -282, 285, 378, 188, 200, 661, 656, 274, 119, 93, 171, -159, -388, 22, -318, -512, -540, -339, -34, -544, -319, -156, -421, 45, 176, 527, 523, 151, 739, 778, 255, 329, 738, 323, -183, -113, 351, -368, -1043, -530, 30, -451, -823, -444, 148, -224, -47, 546, 441, -75, 228, 729, 845, -17, 112, 435, 117, -317, -168, 195, -458, -626, -141, 59, -438, -701, -71, -197, -139, -279, 411, 37, -145, 166, 834, 734, -127, -60, 541, 49, -43, 229, 450, -335, -511, 199, -58, -513, -473]
4126d73O10m47l87O05N32q39l9N33K02m22p2O44J81o61J18M72Jo90K84Q2m04l78
4148e48M89J87o10q7K70L21o92K2Q43J96n46L00K72l03p8K12P36n99m83L55K71
4169E28p50K11K52k41p98J12P56l41m51L47M69m27QO74J28m85p2N02J74l73r6
4190A27L99k42j13j28K74n59m75N91J13n36LM36j7m65M67L30k16l17K58J012m77
4211D65l94L51r6m57K22M56l47q15M38L08m20r9K70L38p52J45O08k03m08J11O47
4232C68J22o94k0P62l54n09O15L32o41m07N68K88p18K59M23m13p27O17N64p41
4252c06l87O95J53l60q8L75J61n64j3Q16o1r93P01O24l60o55K91M15q32pP18J6
4274C39o16l64P59J57o84l8P59m19n14M36J033q19l83N87M98p66K4P90l83r20
$$ y = [-473, 137, -310, -697, -92, 440, -399, -438, 95, 297, -125, -197, 447, 628, -33, 85, 557, 558, -132, 152, 234, -170, -548, -59, 128, -482, -569, -299, 22, -670, -648, 195, 391, -155, 145, 417, 114, 36, 248, 984, 385, -98, 257, 528, -222, -11, 241, 0, -798, -686, 70, -271, -722, -375, 94, -333, -325, 349, 477, -8, -80, 422, 596, 223, 127, 526, 284, 171, 43, 317, -242, -717, -126, -13, -549, -546, -110, -127, -592, -125, 205, -11, -328, -70, 942, 465, 71, 422, 326, -131, 91, 547, 200, -615, -177, 131, -289, -388, -118, 220, -532, -387, 221, 18, -390, -279, 368, 490, -204, -224, 538, 184, -325, 290, 622, -19, -426, 142, 430, -288, -29, 394, -19, -746, -129, 435, -306, -693, 2, 155, -205, -293, 82, 243, -321, -334, 482, 421, -572, 129, 753, 393, -262, 29, 444, -388, -395, 323, 339, -277, -641, 118, 275, -409, -447, 312, -107, -621, -185, 848, 29, -354, 233, 731, -35, -11, 779, 396, -524]
4294e24J02J119l55q04L77N47m83o82O16L20o10j31O74L00j112P6Q80J69o70O6
4314a25O43m23p26P37N95o57m08O38L33j019k5N73K00p43R6L75R3q54M87K97j62
4335g5m95O88J15n63K40L56J26q05J17P09L8m51J29M35l45m85M85N7j83n84M42
4356d9O6n17N3K05O7m69L62N56j65l83M96L03k2l39K94J85j87l83K95q9q36J58
4378c99L51l00l06q3M37l16R7N43J87l22J20P00j06k29K27p6k99N7J85j29p16
4399c77n9K61j34l65K26P1k79j08L99L11j64J52K68M65j54k31L14L67l07k51P5
4420D80o94n3p8L36l79m62j29N01J12r1J79lj67M62M39j34j05K84J27k06j37L49
4442F31j47n04l15L66l39m79J09M05j13j23j6N46m00q9O12L39m4l24N91k76M8
$$ y = [-524, -422, 697, 342, -462, -85, 462, -21, -703, -87, 233, -377, -508, 166, 466, -646, -570, 310, 479, -191, -125, 518, 95, -631, 106, 701, 44, -364, 274, 607, -412, -437, 136, 336, -407, -311, 64, 157, -697, -210, 87, -75, -570, 118, 233, -330, -90, 266, 392, -413, -296, 413, 451, 0, 129, 564, 219, -266, 219, 276, 93, -491, -49, 17, -500, -447, -242, -175, -644, -282, 274, 109, -274, 222, 525, 503, 164, 458, 643, 456, 73, 368, 279, -557, -399, -48, -348, -654, -737, -300, -616, -519, 24, 211, -111, 9, 709, 603, 374, 601, 525, 226, 283, 468, 339, -377, -436, -175, -309, -674, -448, -377, -656, -764, -365, -54, -218, -66, 202, 667, 513, 282, 596, 963, 656, 405, 480, -214, -267, -345, -9, -388, -850, -979, -478, -366, -457, -278, -281, -448, 14, 453, 319, 214, 498, 625, 419, 282, 631, 484, -20, -335, 31, -308, -787, -678, -273, -386, -509, -525, 21, -379, -468, 144, 483, 439, 115, 706, 430, 478]
4463D78l01K28j08p84J43J35j60Rk09K03J18l82N46K39l25K21L08Q8l43K07K52
4484E63k02j57J83J97m93k78q6J19j39j77M79n2o09L10K43J68k08J38L64k86m2
4505C5L01J9k07j2J14pj92m04R8L20k60M5J69N0l09j10L82L26m39m7K50k1N3k0
4529A34l2j32l3K11K10n04q8M7P5L08k47nm4j24J14M38j42l97j35L12K04m29K23
4552c6M0j78n1K61M78n92k05J03L98P4k48J32om66M71N4j08k46j54L74m7j35r9
4575a86J58O7o6J56J51m63j53M05Q8Q5k22J1j77K46nJ56k17j43J4M44l75k8k92
4598c46J40k61K33L30k6l45K55L52m2k42k51M26j49r0K5L16k45n22M23K50k26
4619Ej64j05J40j41K72j1L4l78K08R6K75j59n5j79J45K14mm6J75m93L28k30j6
$$ y = [478, 177, 405, 297, -487, -344, -209, -369, -360, -569, -366, -248, -630, -84, 155, -170, 51, 359, 447, 104, 311, 563, 361, 204, 387, 584, 91, -187, -273, -154, -293, -470, 9, -43, -652, -342, -99, 69, -139, -1, 363, 77, 35, 336, 355, 148, 136, 250, 243, 51, -353, -255, 65, -195, -150, 19, 69, -240, -350, 32, 358, -81, -128, 122, 101, 154, 134, 102, -30, -63, 148, 358, -146, -234, -187, -112, 196, -51, -56, -100, -224, -110, 328, 186, -211, -346, -34, 170, -259, -36, 4, -174, -225, 36, 514, -78, -283, -180, 218, 292, 44, 176, 170, -296, 175, 229, 121, -125, -279, 95, 48, -87, -186, -28, 39, -27, 129, 280, -183, -336, 69, 157, 242, 20, 31, -146, 100, 95, 251, 34, -109, -95, 349, -26, -54, -346, -206, -467, -234, 96, 70, -275, -20, 332, 290, 48, -203, 223, 74, -16, 9, 325, 80, -442, -19, 231, 5, -159, -264, -124, -265, 7, -4, 30, -348, -140, -44, 231, 72, 17, -162, -17, 197, 193, 147, 322, -171, 157, -73, -89]
4642h9K31r6m01J50J64p0q2J16R8J17j11R9J92n33P4K15J90l84R0K66j70j23J07
4665E0R3q0k05M7J84R9m43L50R0l34r0M24l17k51J22O35k74l00M23l5k35j38K12
4688B7J06l79J17L34Q1n72K46L9J24k24K22J61o97J49J65M6l05Q5J06L07j38m8
4710d8L66l7l82J80M98l25j85J09Kk45l71N74jn44L9N14k37k74k7L89o0l24M59
4733G0K18m08n7M42L65m03j85M17j44l85N8M68j31p37j51O44m45k84J44L04m80
4754f80J19O14n6k29K57M37P1l19J86J55l58k45N8L57l65m36K74J32p26L17L18
4775a19j1k62j64P70q4l43J92N68m16J17M51j0k83l48L08K4l73k15J78j35l67
4796e22J18K53n0m59M14L37l30K4K65L91l5l81O50k19q9j01L77l25p15J68L18
$$ y = [-89, 142, 46, -355, -205, -41, -111, -193, -77, 21, 138, 27, 126, 318, -215, -141, 74, 264, -120, -30, 236, 66, -57, 50, 143, 63, -142, -95, 89, 188, -255, 95, 185, -149, -239, 185, -132, -383, -261, 374, 100, -200, 223, 188, -47, -185, 27, 133, -246, -129, 205, 286, -286, -40, -1, 123, -101, 121, 282, -415, -266, -101, -55, -360, -275, -169, 138, 0, -48, 318, 281, -101, 79, 577, 252, 67, 176, 178, -67, -438, 136, 135, -409, -370, 144, -93, -367, -394, -5, -65, -389, 70, 288, -120, -177, 265, 630, 227, 42, 459, 315, -70, -12, 456, 325, -412, -563, 81, -364, -648, -504, -200, -680, -561, 53, -3, -232, 25, 462, 533, 214, 400, 555, 197, -48, 10, 367, 2, -434, -160, -28, -754, -437, -119, -130, -392, -556, 214, 130, -213, -21, 547, 131, 248, 699, 689, 406, 58, 366, 390, 17, -198, -20, -155, -522, -404, -151, -201, -660, -246, 91, -239, -215, 50, 441, 406, 25, 675, 456, 367, 266, 643, 318, -397, -229, 89]
4817H9k90QJ60l3n34K19N73k25l39K62K82j08L4k23N53j67k96K90J08n53K5J06
4839e9J05k50J00J61j78l7K71j04j77p8R1L90j89p7L63k54m7K24J00j00m74K20
4861AL85j75j98N2J36m12J5L78j42l07J63K36k81r4k6R5P1j11L98J6l02j70J60
4884a12L91l29P7J87j06M0ML31n96k02M70o3l75p1M97r7l33l1O05m24j86N97K33
4907E07n97m8J78J98j54p1K30k2n59J27L73k44r5L62nm84L61p4M10o05j23M39
4929A04J2r7j17J1L52o61M60k6k47k89L12L56k88j40J51L33m16j28O56R5l47j54
4951f8L15q7j99RO1k99k6L48K2m49Q5K99j82j49P8M10q8j70J69L26l46rM5L57
4975D52m72N5k70N20k88k32R8j23j69L79k39N5L6q9L63j78K15J35J62j43k38M24
$$ y = [89, -201, -193, -33, -66, -600, -381, 192, -33, -372, -110, 172, 64, 98, -125, 428, 261, -35, 255, 363, -190, -165, -59, 46, -204, -104, 57, -121, -158, 113, 9, -168, -246, -155, 235, 46, -31, 332, 78, 31, 255, 355, 255, -219, 1, 386, 211, 13, 65, 201, -211, -196, 182, 40, -267, -104, 132, -149, -243, -269, -174, -103, -214, 184, 200, -102, -272, -112, 279, -50, 27, 214, 108, 148, 152, 483, -113, -315, 155, 92, -283, -354, 143, 46, -287, -318, 287, -137, -323, 274, 507, -90, -138, 40, 238, 84, 13, 243, 221, -338, -211, 162, -82, -177, 185, 180, -304, 57, -17, 393, -212, -335, 104, 116, 19, -98, -87, 265, -396, 64, 38, -209, -498, -186, 170, -118, -258, -107, 226, -190, -318, 338, 433, 86, -68, 247, 160, -39, -30, 31, -268, -294, 54, 76, -373, -288, 11, -171, -320, -242, 168, 80, -90, 79, 405, 59, 50, 95, 452, -20, 35, -235, 285, -3, -235, -137, -260, -429, -50, -289, -234, -198, -287, 76, -102, 113, 248, 410, 267, 29, 453]
4997D53j62k03qmj32k47j56L74j68m7j33K39K47j20L11k05Q3J65l5Q9m3N7k22
5020A33K7l35J65q0k2R4k34J81r8j81%M50j12K43J29r1J68j77J21j35L4q5j04
5043I1%o9o4Q6j99j16k05L93l13K66j08K4J85N5N6J06rq2O6K16k28MK0n0k40K82
5069A67k89R9l89J68QR5j30J12P5J34P4j35J41J21k94K08L6r5Q5l0r8K00l18m1
5093i6o3l9o6J46J5j34j48J46Q8L23q7J05k42L93k55J35j38K88m72J22J16P2k34
5116b5l08M05k94J08j33L33lk03j1L0K5LJ14p1O7K80l86N8K35j3r9j79P7r1K3
5141e8r4K73k41j30J38J21R3K9J3k59K39L2K37m76J72J5l58L80j91K80m16K55
5163E4K24l75J10j21l8P7O0J90J31p31L31o4K95m57K74K29j48k53J16Q1L8l2J7
$$ y = [453, 291, 88, 80, 76, -56, -303, -459, -85, -253, -300, -433, -194, 53, -67, 244, 39, 122, 287, 252, 341, 298, 355, 133, 160, -175, -10, -90, -112, -18, -252, -71, -169, -350, -350, 100, -12, 231, 360, 269, 437, 260, 381, 246, 280, 195, 91, 91, 22, -42, 44, -155, -271, -476, -83, -396, -130, -238, -214, -29, 26, 82, 188, 179, 97, 163, 379, 151, 155, 175, 125, -115, 167, -122, -23, -412, -244, -236, -141, -271, -159, -84, 50, 124, -11, 130, 251, -43, 165, 201, 106, 191, 161, 63, 263, -55, -96, -159, -198, -264, -118, -103, -237, -385, -239, -151, 172, 85, 190, -52, 341, 86, 221, 83, 371, -101, 21, 137, 209, -25, -333, 72, -222, -114, -247, 86, 83, -120, -131, -101, -76, -73, 41, -30, 37, 317, -69, -11, 224, 211, 112, -67, 10, -81, -58, -152, 121, -120, -250, -112, 9, 102, 131, 144, -115, 124, 156, 393, -83, 89, 104, -254, 126, -65, 215, -201, 54, 278, -97, 13, -108, -146, -69, -9, 181, 312, -419, -88, -152, 143, -314, -40, 189, 41, -212, -96, -15, 23, -9, 8]
5186HJ47r9k37M05j48j84R2r7j2O1QO7J0l2J68J08l53k75M50R5j94J27L5m5k12
5211a07J02L54l46j85L66k42j10J4J85k14k34Q1K68L98r1o07M95k24J76P0J17
5232B66j78j39L01qp9j21K94j95l10o4l1M17m83J62q4P1q9K07J78l13j25O23n2
5255B48j48l70N50k14J21k12O5P2n46M56L1j05k27NK70k7k45J45L2j46L04j31
5277g2K93j47l53O10o5l07R1K21n16K21M7J02l2k21J9Q6j82K88j36m8PR8J26k9
5301A01k5j23J06j52J13p9J18M3L8r1k62L87p5Jk11O4O4J83l45J10q1k4J22O8
5325E0j30j07J43j5k79K89j74N2L07k67j71K95o7j41K82J14m63L42N0rr6k32L33
5348A06Q2k73j5Jr2Q1J47R3k86N0K06r8J37k01K95j5o4Qj91J86m28M22%k76j45
$$ y = [8, 155, 56, -181, 224, 76, -108, -16, -113, -125, -64, -56, 11, 21, -11, 157, 265, -88, -363, 87, 182, -12, 115, 150, 105, -107, -5, 349, 3, -182, 184, -58, -168, -154, 31, -183, -417, -336, -68, 330, 239, -368, 127, -97, 79, 149, 266, 88, -51, 250, 242, 163, 42, 336, 141, -169, -233, -264, 153, -330, -168, -252, -181, -270, -63, 115, -198, -323, 300, 248, 100, -270, 280, 66, 187, -25, 40, 112, -434, 22, 53, -52, -279, -274, -4, -31, -276, -131, -99, -245, 59, -72, 221, 74, -279, 331, 266, -41, 50, 271, -245, -24, 23, 125, 93, -128, -109, -23, -205, 83, -53, -101, -94, 4, 130, 101, 76, -47, 59, -93, 20, -59, 59, 102, 140, 49, -213, 174, 99, 100, -111, -47, 17, 200, -145, -35, -116, -140, -18, 50, -80, -187, -44, -59, -338, -49, -223, -171, 136, -131, -302, -7, -74, -215, 67, 181, -282, 60, 110, 101, 5, -227, 106, 188, -85, -100, -99, -191, -110, 37, 130, -156, -106, 100, 2, 139, -62, 233, 218, 154, 162, -29, 157, -271, 151, 151, -125, -270]
5373b70L12j51p7k45K95kj56L19J37J46l34Q3M41k48j93K14j08Rq4J06l42n0J27
5396g1j01J39k49j35M44k36o7K38P6n2J25mL16j46r9m1K77m18K77j08k9l30J5
5419a79J31q1o7L7L33m98p4M75P0J68n52O75j52l24L38k2J1r2k5j62lj64O2M5
5443e0j76kJ15J8j83R7K19lk08J84J95o6k31K90P4l46oM08l73j06PK41j70j25
5467a97L9J02j38j05L28O7k36j18L45q3J05r3J76p8j49L3R8j17r7O7J54r3j13
5490a03K69k87M7j65J96o4K2M16l42J1J34j36K2K16j74R2o5l09M06k86J43m33
5512c90L03j68K11j17K78j92P4K45k20O5J19l4j44k60j26M73k37J00J6J07M5k41
5534i3J85J20p8PNoL0k55o7J56o1L4Q8r7N5j39l5M76r0k22J63r4j05P2J12j35
$$ y = [-270, 42, -109, -186, -431, -136, -138, -294, 25, 162, 308, -26, 57, 498, 250, 57, 271, 163, 172, 88, 194, -148, -198, -71, -172, -33, -282, -417, 27, -209, -276, -38, 38, -14, 111, 107, 423, 277, 178, 137, 414, -4, 273, 165, 136, -194, -179, -48, -129, -196, -159, 174, -324, -398, 77, 147, 315, -237, 438, 286, -38, 300, 278, 289, 197, 172, 10, 7, -157, -95, -50, -226, -228, -113, -95, -278, -181, 38, 35, -173, 11, 206, 140, -91, 199, 273, -73, -79, 329, -44, -150, -143, 98, -72, -197, -158, -56, -194, -299, 29, 96, -140, -258, 87, 4, 109, 16, 192, 114, -35, -2, 96, -21, -118, -51, 103, 10, -103, 166, -121, -74, -239, -43, -107, -85, 331, -11, 0, 134, -2, 20, 236, 62, 154, 89, -220, 186, -100, 43, -390, -87, -255, -44, -161, 117, -75, -1, 244, 24, 89, 208, 174, 30, -230, -356, 117, -120, -20, -4, 103, 148, -93, 92, 212, 134, 141, 146, 140, 170, -85, -152, 4, -57, -23, 65, -32, 23, -116, -151, 325, 235, 13, 176, 82, -23, 49, 161, 26]
5560B6J63k62J20j25J47j98J05O1J77k88J6o1L6J64l7n4K10k75J26n8n0J19m08
5583c46N12k78K28l7J7j28J6J68l16K53J27m38R1K20m5k5M2r8k7J36j06Q4j71
5606a21j63L20l2Rr3%J63k39L40j62k5N8r4J88o8l2PQ8j19Nj23J85j70J94j31
5631a5L9j03l4O4j11j12L28q3l5J06K3Jnj42J27r8j44L6J15J42J02l29j6J48k93
5656b89L10r1P5j33J68J68k06K50k59K62l89L01k14n9L20l76K19J66l74KM01l47
5678i5n4K57K8l28J69o6J06l5j10k7K13j15J03lo5j06j4J56n4Q7j53K34l30p6
5702b78J72K41N7m00J42q2O4K31k1J6j37j34N75m25j41J8Q3K1j63J53r2r7OJ15
5726g6j5K51l56L28k38J04o3J75m2l21K41k78L43r9n6J57M3l18K10N2N7k46L02
$$ y = [26, 189, -73, 47, -78, 69, -129, -24, 37, 214, -74, -58, -119, -83, 81, 44, -10, 200, -75, 51, -7, -57, 62, -346, 166, -112, 116, 79, 96, -32, -16, 152, -164, 89, 216, -222, -131, 89, 44, 19, 61, -37, -64, 72, -34, 50, -121, -284, 36, 4, 13, -80, -80, 83, -156, 184, 22, -3, 55, -39, 149, 81, 49, 56, 144, 25, 30, -93, 92, -78, 116, -15, 24, -79, -113, -49, -160, -272, 56, -27, -62, 44, 67, 68, 63, -79, 48, -50, -194, -158, -43, 99, 201, -128, -144, 4, -289, 21, -70, 5, -128, 40, 208, 2, 252, -7, 255, -134, 167, -47, -106, 214, -162, 57, 223, -151, -149, 252, -95, -149, 108, 136, -192, -23, -89, 17, -18, -128, -155, 58, -57, 46, 43, -22, -128, -142, 14, -40, 47, -106, 128, -202, -278, -106, 135, 192, -208, -66, -148, -84, 147, 126, 142, 5, -129, 446, 21, -120, -102, -19, 2, -161, -8, -100, -197, -191, -76, -91, 160, -196, 132, -106, -2, -65, 110, 68, -253, -12, -290, 53, -46, -102, 55, 98, -220, -10, 42, 99, -147, 155]
5749A55j36J48j23J81k69M8K8J4k30k1K4J01L63n52J32N2R3K04k23j08j5J99j78
5772a13J70QQ0m3K20k22q8r8J00P0j10P2l88J78J11j43M10k58J69k37K14j35m0
5795g3N6L09k03j40O8J22r9J63lj96J99l59J16J8K21k25R3p8k28L65O4j22k9p5
5819c6m6K16l49Q4K12m6j35K14J06l47j81K43N3R9r7J58R2k71j19K47k8j09J09
5842F9O5j16j42J86m4p6K5M2p9K42J0l2J62n69J78P0l7o1J39j70J7j11K20j41
5866a53K10O7l65K36pK67r9l76j8L56J06j40Q6o7l24qL09j14j11n1M9L29J40l94
5890g2K19j43o1j4j05J85Q6j11Q2l4k7j96K07m4J17j4lJ38k29o4J36p6J26j45
5914d2O4J46J01k23q5l9jJ33L2Rk16O3Q2j3J7r7L7r9L67k07j89L62k57M9P2m5
$$ y = [155, 19, 167, 44, 225, -44, 4, 32, 46, -184, -205, -181, -80, 283, -269, -137, -85, 8, 212, -11, -119, -134, 65, -113, 57, 65, 145, 102, 322, 100, 12, -86, 14, 84, -26, 46, -342, -164, -53, -196, 214, -44, 125, -112, 102, -33, -73, -17, 292, 89, -51, 17, 139, 40, 203, 200, 4, 203, -156, -40, -22, 199, -26, 67, -11, -239, 126, 190, 68, 39, -36, -82, 134, -215, -131, 81, 35, -100, 114, 220, -127, -308, -65, -12, 87, -10, 148, 240, -31, -150, 97, 69, -40, 69, 134, 18, -124, 62, 18, -58, -33, 9, -70, 172, 182, 150, 312, -257, -79, -9, -46, -107, 32, -138, -121, -232, -12, -153, 57, 124, -241, -5, -12, 255, 156, -220, -238, 118, 224, 84, 170, 103, -221, -229, 80, -34, -145, -196, -147, 182, 322, -72, 147, 4, -57, -71, -176, 9, 95, -16, 66, 32, 5, -191, 16, -28, 89, 75, 72, 210, -19, -83, 53, -23, 103, -42, 22, 168, 269, 46, -39, -78, -79, 54, 86, 95, -121, -58, 24, 11, 28, -69, -32, -131, 236, 29, -160, 202, -55, -6, 66, 21]
5940B1N6k17M8J7k8l1J23J45R6m03K11J31r8Lk24J07M9n8j97K69l1j5j24O8j9
5965a01p4N5j57K86J84l53K25o3m4K13p9j51J11j9L8l4j67P3j23N6L38k58m4K20
5989A32j49n1l1J04j14p6P9J01j17J50j38K06Pj32M9p2oN8m5P3m0K7m1j9j70L25
6015A10j51N4L3j7j8m5J17J9l05Q3Q0J06j53RJ40R9m45J16J83K25o5J1J1j39n4
6040Dj75M55l53j19K57k24N2m7O7j21R4J15J63o0l52K77j24L9L1J92l25J81j21
6063i4P3L0L6j24P2J56l16J80k21K01Nj79L49J14j77j2j08k2P9J24k23JM8k04
6087b12K70k46N2N0M1O3M0m9j25J26j1J91Q8m89K69k10L88k74R8R3k05J55p3k30
6111b00J90j46K98l63J89N2R2j75P2J16l28J56J96m27M08r6mL9j37K36k26l23
$$ y = [21, 77, -140, -92, -75, -103, -134, -11, 134, 230, -173, 38, 169, 71, 74, -150, -43, 6, -52, -249, 20, -11, -26, -150, -82, -101, -175, -120, -277, 9, 193, -160, 65, 2, -42, 171, 92, -59, 52, 33, 71, 37, -130, -57, -180, -124, 214, -44, -88, 132, -17, -68, -99, 5, -109, -185, -106, -5, -122, 28, -110, 96, 103, -29, 20, -52, -58, 0, -45, 28, -12, 15, -26, -45, -215, 110, -41, 13, 46, 29, 11, -34, 83, 102, -203, -120, -40, 66, -87, -78, 62, 161, -284, -168, 15, 240, 175, 186, 197, 58, 4, -171, 284, -69, -188, 69, -155, -103, -150, -83, -204, -110, 5, 168, 108, -244, 33, -91, -52, -21, 171, -154, 27, -94, -21, 9, 45, -79, -7, 149, -167, 13, -208, -7, -2, -181, 168, 282, 105, 93, -15, -37, 42, 166, -57, -56, -8, -212, 58, -188, -136, -86, -45, 18, 58, 9, -116, 10, -1, 190, 278, -211, 58, -152, 236, -38, 60, 153, -52, 103, 30, -200, -10, -156, 142, -221, -32, 20, 112, -63, 9, 125, -203, -47, 149, -278, 130, 34, 30, 69, -68, 168, -58, -381]
6133c81J88J50J69j93pK22k46K04K9k73L45Rq4k00J1K23k1l02L5L21p4j14K3o
6157B8J5k47J41O0J20l8jj60q0J93j0J87m49K65n7N2o1R9l2k1L1N5mk62K23j69
6183a22L73l21O4j74L99k82pk7J7P0nk8p3L02o5J78l52j6K31j55j8J90l38o6K68
6208D3J78k20L6Q2j58J9j80M2n4M84m98J81j66L27J46j7k43j61J31J60j76R7q2
6231b9J36j50j07k17L92N8J24p9j66n5L04m57M65k72L96n00P0L16k17M9l59J86
6253a12L9kj51J43m9K62k40J72p7m6O3K51l03P3P1k52L51l54K40j36j59J55R9
6276C8J95k07j42J36r3N2M2J44l33m8J33L25m33J51J51k35K78k12j0J30m3q9q2
6299a52J42M9r1J68k14k9M08j52k67J13K22k95M5n5K82n4n8K5J0J80q5k39K51
$$ y = [-381, -193, -43, 126, -67, -74, 148, -98, 106, 135, -138, 207, 216, 132, -68, -57, 166, 145, -157, -122, 199, 125, 11, 34, 28, 43, -204, -63, -3, 117, 79, 78, -82, -162, 31, 21, 208, -241, 24, -33, 19, -42, 57, 25, 4, 35, 90, 86, -176, 47, -122, 251, -70, -6, -180, 219, -63, -70, -97, -80, -10, -15, -43, -116, 186, 121, 299, -53, -69, 162, 7, -11, 179, -159, -225, 43, 221, 1, 37, 119, -39, -20, -200, -158, -212, 272, -226, -45, -211, 116, 262, 245, 2, -159, -28, 132, -44, 53, -29, 107, -43, -150, -367, 25, 83, 207, 128, -38, -93, 211, -246, 219, -53, 343, -157, -87, 229, 12, 61, -298, -112, -73, -75, -226, -83, -132, 130, -110, 62, -15, -61, 2, 253, -50, 23, 94, -158, 193, -161, 79, -57, -216, -61, 38, 233, 26, -116, 20, -73, -21, 21, 165, -168, -216, -83, 242, -191, -40, 111, -124, 154, -58, -68, 62, 19, -70, -152, -10, 39, -52, 116, -98, -127, 281, 129, -138, -25, 197, -98, -53, -108, 174, 120, 62, 87, 97, 277, 192, -47, 204]
6322B04l35k32N63j58J61k13l8K06m4m4l1j02J36j48N6K88j24j72m2J13M2k74
6344a88R1J12n3j64J11j70R5L04j21J04k17K28j7k51J93Q7Q5j07j07k71K59r0
6366h7K63j64j52N9j32J06K07n1j24L2n8K77r9j16J57j00J10j78J80k05J74k60
6388a61L11M5k93j01L05k37O5qP5Q1j98K74k54mJ02N3k4J27j90j9K14j17L6k15
6412a33R9M3j74N0j6K59KQ2l14O5J65j73O5Q7k44J71%J30l25J84p5R4R2k6k45
6437a37r9K33J82p3j54J2j24P7Q1rlJ26q9k2N3o7J17k76K36K21m06J13j63J01
6461g0R4k43L41K0k10J42j50M3L7P7j8j26K09j41J51q9L6o7M4k9j96M3K14j73
6485f1j28J78L0L4q0L3J2r9n6L32j07k11J70k81PJ65O1K67l91M0M8M1k0K21k5
$$ y = [204, -131, -363, 200, 42, 203, -10, -48, 158, 114, 70, 39, -63, 73, -75, -19, 269, 145, -27, -69, 44, 86, -188, -97, 15, -38, -202, -91, -261, -166, 138, 17, 121, -96, 132, 115, -136, 57, 144, 229, 122, 15, -256, 3, -87, 176, 12, -140, -81, -213, -107, 100, 49, -75, -43, -101, 176, 77, -39, 118, 18, 128, -50, 130, -75, 99, -161, 150, 195, -98, -199, 106, -131, -66, -74, 1, 82, -116, 158, -96, -100, 2, 55, 31, 158, -32, -51, 163, 46, 82, -133, -34, 9, -165, -115, -131, 128, 130, 212, -102, -37, 128, -45, 20, 107, -137, 34, 34, 164, -161, 23, -52, 42, 134, 108, -137, -236, -3, 179, 106, -48, -36, -160, -83, -2, -11, -14, 112, 23, 1, 54, -13, 104, -172, 64, 285, -121, -8, -171, -70, 24, -219, 122, 142, -68, 74, -76, -33, 4, 81, 63, -63, 146, 5, 156, 67, 103, 36, 80, 51, -145, -102, 112, -61, -189, -11, 19, 53, -27, 6, 18, -81, -137, 195, 88, -123, 47, -234, -227, -62, -1, 266, -125, -85, -37, 4, -16, 205, 180]
6510A80J00l48rJ20L1k50K17J36l12K29l8p6j78J65N4k09L26l36L20k92K64kJ62
6533B54l11m6J80l0Nj32r1K01j45k3J80j02l3q3J06K13k41J28K14k58j8K8J9j2
6557CJ28j83r9J54n5Q8j91Nj27J56L3j36K35N7r6J98j22q2m1L20l55Rj57L36o0
6582A8R5M4j18R6l20L32l96K56j39P1K89k79j6l6r5K93N3j08j06K51j45O3j01
6605Bj6k80M1J14L19k84J72j01ok50J65K13k13J5q0J62J6p2N8J12j66Q0l44J25
6629b18K27k49L14l6r2J33np2j26J09q8J09J25j67L2k52K45j93K72j52n1L26k02
6652a1J60k56%L32q2l32L47J6k62m7R6K7Q5j82K1q1J41k1nJ20J44l50q4J89P5
6677D0k0k63K86K0O3rk22pJ4J16K50m61Q7k7M9o9L0K30j86K2k9J09o3J40j32m7
$$ y = [180, 280, -68, -77, 43, 74, -176, 41, 177, -135, 94, 56, -20, -198, -33, 21, -188, 138, -198, 122, -170, 94, 92, 254, -57, -103, 77, 47, 52, -80, -171, 30, -115, -138, 42, -60, -93, -176, -70, 143, -98, 30, 244, -14, -32, -4, 15, 3, 131, -52, -151, 3, -52, 36, -155, -150, -277, -121, -88, -224, 11, 68, -28, 170, 48, -34, -75, 245, -110, -101, -258, 78, 18, 113, 157, 39, 135, -185, 147, -249, 7, -132, -61, 228, -51, -67, -103, -198, 95, 148, 40, -66, 185, 40, 103, 2, -14, -294, -253, -139, 180, -104, 68, -33, -39, -289, -124, 89, -124, -109, -189, -27, -11, -83, -25, 87, -79, 1, -343, -218, 9, -240, 74, 38, -54, 79, 74, 2, -124, -15, -103, 6, 131, -36, -4, -256, -11, -204, 68, -84, -135, 191, -11, 149, -107, -107, 225, 143, -189, 158, 174, -88, -135, -39, -12, 73, -109, -88, -169, -28, -49, -54, 66, 210, -140, -224, -35, 40, 20, -243, 43, 63, 126, 117, -105, -112, -98, 18, 268, -193, -106, -133, -84, -153, -123, 107, -79, -57, -86, 23, -40, 100, -32, -79]
6703g9q3L11k30J55j16j40K42J92l99J1Q2L5m1q6J49p5K50l50K40j9j50P3J91
6726A63l77L44p4N2q3j02K16q4l53K15K0J16Oo4K2k5J67k84K24j30j9q1K99j70
6750bP2j77L3R1j2K08j03m9j22K29m03J73j69L06o4Q4q0M7q6j90L26k54K14l09
6774b37M13J8j61r1J64k59N4K5J22K39m95L37j36NJ99k31K09j89q6nL70k26K9
6797F8m31K40J22k16K51r2l3l2J61k59K41M9q3q3Mq2K49q7R8r7l9k13J88M0R6
6822F0M9r8jj47P8N1K7J11k69K35j59K6K06k45j71J24J97m4J6J09k22j01K23J46
6846B01l69K61j81J98l6rj82p7K59j00j05K16j12m8J76j32r9K12p3j97Q1M2mj43
6870b21M23k61N4j05k10L47J5n6J71k77J33m6O3q0K2k5J04j5j47J54l2Qj10J40
$$ y = [-79, -162, 149, -81, 74, -42, -182, 60, 252, -147, -136, -54, -19, -60, -146, 3, -72, 178, -172, 68, 49, -101, -28, 163, -214, 130, 56, 108, 25, -77, 139, 55, -298, -83, -63, 53, 59, -5, 17, -8, 159, -125, 99, -31, -50, -131, 168, -2, 70, -107, -74, 17, 5, 213, 110, 61, -61, 168, -235, -62, -231, 75, 11, 95, 15, 62, -24, -214, 112, -142, 72, -237, 176, 194, 33, -58, 106, -153, -99, -74, 48, 287, -208, 129, -7, -2, 197, -34, 175, -14, -100, -105, 265, 39, 68, -363, -123, -1, -217, 34, -58, -91, -123, 38, -221, 20, 69, -14, -97, -93, -175, 74, -13, 85, -12, -51, -264, -76, -36, 60, 109, 11, 10, -137, -59, -8, 19, 130, -139, 96, -63, -37, 169, -76, -247, -123, 74, 30, 46, 155, -67, -168, 55, 201, -168, 93, -88, 110, 74, 65, -117, -194, 65, -35, -140, 76, -36, -84, 92, -40, -139, 73, 0, -197, -116, -74, -78, -221, 202, -59, -5, -110, -320, 27, 42, -14, 157, -120, 13, -33, 30, -50, -28, -53, 51, 36, -111, 43, 11, 19, -91, 49]
6894D9m0O3nj4l9p9j4K42j93R5q2q1l7R9k1J38m39J72J09J47k59K49m4J37J17
6919B70k43j33K9M6j00J08J3j64K78k07J95j08J44k03Q7N8q6O4j35J14k26Q7J45
6942C3K47k58j99J95o4J0o6p9R0O4o8R9R8j14P0m06N66j96r8J87k72J59L9J69
6966B06k19K3q3P8nJ21K8m2o1J1j40L7j19N3K14r5Mj48K83j15j12o6K50k31J29
6991AM9Pj72n4K25n2n8j1K05K9kk0l52P03p19K27J86k52M2J02j20n9J89j61J75
7016A08O1j53j95J96J3j33R4R0n4P9k51J90J22j97K30l88J54K29l77K24K6j04
7038c6j31J19J01j23K03j88R5k57K55m5J49j22j6J60j69p8P6m4O2k05M05j16J81
7061B76l09J29l1J3J39k40m8J03j1o7l3j81K25J08j42O6K03j49k56M02j85o6r5
$$ y = [49, 9, 72, 67, 53, 14, -65, -79, 163, -30, 65, -17, -98, -135, -36, -57, 81, -358, -186, -77, 70, -189, 60, 16, 153, 270, 27, -106, -77, -31, -131, -23, -10, -174, 104, -103, 92, -16, 128, -75, 12, 70, -16, 48, -87, 27, -199, -112, 33, 280, 22, -177, 18, -46, -36, -102, -181, -91, -27, -95, 4, 102, -12, 58, -348, 218, 22, -76, 111, -161, -2, 37, 206, -13, 10, -73, 5, 0, 121, 149, 107, 46, 57, -83, -46, -165, -112, 102, 7, 11, -137, 146, 31, -81, -147, 103, -128, 1, 50, 57, -115, -169, 56, 4, -54, -65, 140, 169, 167, 147, -205, 498, -221, 6, 192, -60, -18, 84, -36, -95, 94, -67, 108, 169, 16, -179, 17, 30, -103, -9, 81, 27, 106, -145, 45, 167, -30, 200, -188, -34, 195, -182, 42, 68, -36, -167, -48, 53, -70, 133, -55, 40, -217, 38, -7, 142, 20, 4, 164, -5, -83, -7, -51, 11, -194, 211, 95, 276, -33, 96, 65, 78, 217, -23, -71, 32, 21, -46, -79, -260, -35, 73, -69, -3, 200, 51, -205, 197, 12, -54, -149]
7084a49M30m76J96o7O7L0K3k55Q4K34p9j19J19p8K45k54O4m8rM0k07J56%K50l79
7109a82J92J7N2k3j21K79k40L6p9k7pp2r2K14l2P8N9r0n3K27N7k90J13K7J14j74
7135a7p0OK14l94J82J70r6k78J85J53m6K23q9k53L44k77J48k22K33q3o1J0R6o6
7159A2k37M65k52l45K84J83j54O8r6J67j06k3l5J37j71K7K64o5kk31l4K57j83
7182g0jR8J43j60j75J72o3K19j75N9mq9J30j03R3K3Pr2K13k00j17K93j66q7K13
7207A61o3k72L6K47j32m5pR6O2n3K16j81o7p8K01k40k04K12L83k15m4K6J13j36
7231A6RR5l33J41n8O8K64l88O6L62o6k13P3J0q6r2J81N3l03jR6n6P1j0L6J60n
7258I0k66K12J21jk58L66k64j52K31J37q7k8j56O7O2k92Q8K81k25q0R2k7K53k17
$$ y = [-149, 281, -195, 1, -66, 1, 31, 54, -201, -117, 117, 38, -81, 38, -40, 205, -49, 15, -33, -42, -2, -209, -53, -53, 197, -182, 10, 27, 79, 56, -65, 214, -26, 10, -69, -96, -103, -175, -267, -53, -85, -7, 52, -38, -91, 136, 193, -97, 16, 43, 157, -17, -87, -81, 133, -261, -79, 91, -5, -283, -98, 55, 9, 232, 143, -110, 234, -43, 105, -117, 116, 33, -28, -18, 78, 12, -225, 240, -12, -357, -73, 110, -44, 24, -72, 95, -11, -34, -69, 68, -103, -76, 188, 123, 121, -110, -144, 113, -70, -71, 27, 170, 10, -165, 7, -56, 163, -12, 47, 43, -46, 84, -19, 74, 97, 104, 12, 225, 25, -92, 201, 35, -52, 161, 98, -174, -138, 109, -23, -68, -75, 21, 83, 30, 246, 65, -2, -80, 121, -119, -323, -111, 272, 57, 13, 39, 152, 16, 25, 120, -213, -72, -130, -62, 202, -186, -120, 242, 176, -37, 36, 46, -40, -132, 49, 102, -201, -202, -106, -162, -91, -101, -65, 95, 90, -176, 36, 157, 156, -102, 264, 0, -152, 79, 216, 129, 101, -55, 12, 74, -218, -130, 151, -74, -154, -62, -89, 164, -53]
7282e3J86n7l7n7K03j02p6Q7M8k18P5P6k2Q2j73m6P3K00k41K7j9J69J0j30r7N
7308h7K19j31pj91P7L05o5l9J20k04m7o1lO9n7J06J83k71j47J82J09k27J47K3
7332Cj02M9J2J4J95k52P5j32L6J12j04J01J50j10p5J31k51L02K1qj4J9p4K5k25
7357a02N2J68k75J74r4J30j67q5K65k39K76k90pK69j52M13l80P3PM9n7j18J3J7
7381f0l4N6K12l66K22j32m7J37L00j58l76J45J40J78k44k1oR1N7o3j40NK68r3
7405G1Q2r2P7j43R1J3q7j1k10J58J2q5J94ok27L35k23j84M65j91J23j29K93j97
7429A29lq1p9N5m8L38k74k09K22n0K9J11j24J26L5j27l20M2K27j74J66n3K66l43
7453a39M9Q6j2J33j73J07m21M77J5k52J68N1P3q8l7j34j4N6n5L01l25N1K27j34
$$ y = [-53, 133, 76, 39, -18, 185, 83, 7, 94, 142, -76, -1, 75, 53, 135, -38, -84, -11, 189, -52, -25, -44, 125, 135, 5, -92, -87, 132, 1, -6, -197, -120, 185, 120, 81, 201, -3, -50, -111, -114, -45, -102, 4, 187, -84, -231, -49, 60, -167, -20, 3, -99, -50, -38, -24, 171, -81, -6, -138, -102, 10, -94, 7, 157, 47, -28, 103, -148, 154, 175, 167, 153, 172, 98, 123, -102, -50, 118, -157, 17, -77, 53, -114, -199, 66, -173, 103, -187, -194, 75, -77, 336, -44, 29, 36, 85, 28, -90, -77, -60, -94, -38, 174, -192, 30, -102, -149, -12, 288, 130, -246, -101, 39, 217, -27, -48, -54, 37, 94, 31, -109, -104, 164, 71, 153, 61, 138, -5, 86, 99, 12, 1, -209, -51, -39, -124, 70, 64, -163, 172, -51, -235, 230, 39, 162, 33, 326, 129, 126, 45, -34, 21, -27, 311, 37, -172, 50, 0, 29, 140, 16, 142, 177, 50, -270, -228, -1, -175, -9, -62, 204, -139, -90, -4, -16, 117, -56, 51, -370, 107, 122, -130, 38, 89, 162, 74, 37, -97, -111, -55, -110, 191, -134, -83, 144, 10]
7477A0K9R2J14k94N6J55l32L79m6l07P3j14J62j50J70k99K38K33j30o8k27K86
7499C0q2q7J76J12J79m12J98M7j74q9K06j98q4J5J57q5j88K56K29k00J41l2k26
7522a11K01k20J72Q8j99p9K30j31r1K44k1J82l78K76l04J35J75j37LLk39M2Q1
7545g8J56K3q3R0j76l2K6K0RL65m29p5L57j94L1l1J44k91JL19p2M6l4k95K67j1
7571E3j71L6R8O9l9l9l56L27J48J1nJ34j53k62J16J18j27p2r8K96J51l32J53j4
7595D2j71J20kk0n3J2N9j6k56R7J42R7j9k88J01J90M4k32J52J04N8q5r5p1K29
7620A39M6k36J51l9K09j44j8j95P1N5j14O9N2j3J25k40J88j8k11j3K68R2m34J68
7644d2J04O8j51p4M2l4J5M1M3P6l46J69J33K95l80j2Q4M2J07kk39N0q6nj5L3M6
$$ y = [10, 39, 131, 245, -49, 7, 162, -170, 209, 163, -144, -71, -185, -23, -173, -3, -302, -64, 169, 39, -29, -256, 30, -52, -139, 37, 149, 328, -84, 114, 161, -13, -102, 104, -94, -178, -163, -6, -91, -279, -23, 206, 6, 147, 115, -111, 90, -130, 42, 130, -69, -148, 82, -49, -140, 104, 83, 265, -113, 163, -141, -6, 169, 32, 35, 38, -201, -159, -78, 78, 101, 18, 108, -68, -100, -74, -54, -45, 320, -109, -184, 173, -21, 10, -21, 123, -168, -167, 152, 80, 126, 92, -203, 64, 53, -118, -82, 16, 85, 46, 7, -349, -22, 126, 137, 132, 266, 113, -149, -33, 85, -42, -114, -212, 84, 235, -97, 56, 42, -129, -9, -11, -31, -84, -72, -13, -29, -285, -188, -46, 51, 32, -256, -155, 35, 79, -153, -1, 103, 161, 76, -19, -90, 139, 185, -51, 100, 61, 270, 126, 108, -87, -16, 39, -75, -6, 46, 33, 158, -82, 106, 88, -123, -136, 132, 224, -210, -42, 62, 130, -21, -95, -53, -87, -72, -31, 12, 88, -258, -89, 44, 339, -41, -53, 31, 73, 180, 178, -61, -11, -97, -102, -117, -84, -38]
7671c8K30k54k58L69M2k43J02L90l48j00K14K02l05J2K77k53k60J75J77j93OJ11
7693E5Q3q6jj39O6R8j8J8j56N4O1k64K28j48M58q8m60L13L7j66K54k37m2K5o1
7718a16J31J30O4j55j94Q7J17j29o2qR3L9k3OK3n4O6p8qK4p9J43J08j18j49J14
7744b8M3j74L06j57O2k23J58q5J08k22J39L1K79k10M7Kk23K53j19m8k4L5K01k02
7768e1n7J61j28K99k36n4J24K41j27k75rL50l15l0n5J76N9o4Nj1J9l1Q7j72J46
7793E2k2%j42J07k26J87o2K26Kj61O6p5N2q3kj04J66K51j81Q3j15k00J24mK6j52
7819a87K55o4r4M14k38k2k42J04K68j50j10J44j12J97k65P3j4J27j50J09ll01
7841b61K63R6k44K74j97J35k75K88j84n8L16m7O7l39J7J23O5k0J73k6o9j19J92
$$ y = [-38, 192, -62, -320, 49, 91, -152, -50, 340, -8, -108, 106, 308, 3, 15, 292, 39, -221, -46, 131, -62, -56, 55, 138, 52, 51, -88, -22, 76, 58, 76, -80, -26, 35, -229, -1, -149, 309, 221, -239, 74, 111, -55, 199, -38, -80, -55, -116, 15, 145, 209, 54, -140, -53, 64, -65, -127, -135, -42, -3, -26, -20, 3, -51, 15, -63, -71, -47, -126, 17, 125, 7, -142, -28, 15, -159, 147, -10, 52, -171, -13, -98, 10, -212, -73, -42, 237, 27, 74, 76, -147, 106, -13, -61, -85, -50, 151, -51, -108, 53, -75, 224, -12, -66, 58, 299, 172, -103, -112, 238, -77, -107, -162, 14, 73, 9, 14, 3, 22, -9, 78, -94, 52, 30, 30, -112, -5, -231, -44, -106, 120, 122, -39, 27, -48, 4, -79, -81, -185, -19, 232, 51, 134, 19, -181, -57, -61, -35, -187, 68, 4, -90, 324, 86, 64, -178, -74, 194, 44, -66, 78, -34, 163, -102, -29, -43, 84, -66, 43, 40, -261, 2, 98, -146, 128, -69, 66, -209, 79, -105, -163, 153, 106, 173, -166, -149, -26, 39, 19, 192, 166, 97, -22, 170]
7864A70j2q7n0O2j34J07pJ45k69J07o2P5j31J53r4oJ97l09P1r9L40k86K91k08
7888c6J01p9K9R0r9o8n9J44M6j26l4J05j16J07J7J8n7j00N8k7K44Pj56j72L16
7913A53j87P0k5J47n3k36L5K71k07m8P8k13K04K64j10k05j1nO9K3j76k9K28r1
7937e4J34q5j8j15K67r6r7J02k43K98j11K3J24k12n2q5J87J7K0N6P4j16K09j10
7961A17j74L15j43o4j74J63j55K02j06n6P3p1r0J40LJ45O6k34KL9j08R5K22ok34
7986c3j8J4K18k25m0l04M24j3j09L60k51J51j0j01j53K49l75L76j54J9J02j62
8008c5J0K9K3j35N4J67J55n7j37J97l85J68p6j00O4j30L39k83M6J29j22k10M64
8031A75k96j45J87J74J24l10K43j81j54M0J29J41k56J77j27K9np6J47n1j24L62
$$ y = [170, 158, 71, 21, 83, -51, 56, 49, 194, -75, 32, -30, 45, -86, 67, -27, -33, 164, -145, -74, -173, 167, -119, 172, -36, 65, -14, 15, 105, 6, -62, -121, 23, 69, -57, -91, 14, -102, 5, 22, 40, -17, -117, -59, -86, 158, 165, 9, -163, 153, -34, 36, 11, 158, 105, -131, -96, 175, -32, -80, -2, -215, -11, 253, 143, -62, -73, -78, -9, 14, -162, -191, 37, -54, 80, -5, -23, -138, 129, 33, -64, 38, -205, 93, -18, 5, 129, -83, -135, -220, -33, -16, 4, 60, 134, 18, 227, 117, -57, 258, 115, 51, -123, 40, -115, 87, -19, -75, -2, -73, -163, -23, -20, 125, 191, -43, -41, -2, -110, -15, 207, 201, -33, -51, -37, 181, -44, -84, -388, 36, 23, -86, 274, 23, 174, 164, 63, -90, 159, -216, 160, 6, 25, 127, -35, -25, 4, 27, -108, -54, 113, 268, 211, 74, 271, -114, 54, -22, -122, -58, -188, 151, -132, -86, 43, -79, -289, 175, -121, -266, -79, 95, 219, -91, 152, -29, -183, -143, -14, 127, -129, 48, -79, -50, -55, -131, 16, -35, -159, 203]
8053B03k82k4M34l41K4J13k16j9j17O2J79J7o8j0J5o6j56L02K2j80M2K92L7j26
8077A37k12J45K04k34J96p1J6J86k67OJ9j45j3K84l08R3j00k4j8K19l09l8P1K5
8101a38M6K47l5L9q7K2j18L13j79o8J80j30Nk19K96k78K32j89K04m06L76k27j36
8124b50L97p6l45L33k65K25J67k68K38k89J50J65j24n7k9J2N1j0j36J3O3k6l1
8147i2M4J06J0J49k18j79J67L17j83l7R7L5k84o8j4K55q8k04L81j48j75m3K63
8170I1R0j09k49N1K75k36P1K12r6j64K15j79j71K81j13P1j76M4N4p6K05
$$ y = [203, -79, -103, 331, -10, 14, 127, -89, -108, -225, -163, 16, 33, -35, -45, -30, -96, -252, 50, 72, -108, -66, 226, 263, 137, -75, 70, 274, 40, 236, 165, 181, 367, 100, 106, 125, -20, -33, 251, -57, 36, -64, -88, -106, 113, -196, -234, -163, -138, -92, 155, 120, 159, 72, 94, -24, 289, 110, 42, 222, 92, 97, -122, 174, -104, 128, -61, 143, -263, 113, -114, -250, 147, 71, -274, 59, -206, 19, 186, -82, 156, -133, 17, 182, 58, 1, -28, -16, 35, 25, -111, -98, -35, -61, -92, -48, 58, 68, 217, -1, -180, -13, 304, 121, 84, 181, 216, -68, -136, -150, 105, 17, -187, 194, 46, -129, -172, 91, 181, 72, -177, -126, 149, -87, -16, 196, 100, -64, 151, -28, -199, 82, -31, 40, -136, -92, -38, -114, 91]
8191I1
$$ Imaginary data points
##PAGE= N=2
##DATA TABLE= (X++(I..I)), XYDATA
0@%%%%%%%%%qJ6j6J6k4L2m0M8n6P2q8J04j28J52j76K08k44K84l28L81m38N02n73
32c04O51p36Q30r38J054j181J320j472J639j821K020k237K475k736L020l330L669
49A923m043M453m904N408n969O594p298Q100r022J0090j1343J2845j4689J7007
63I152k0019K4114l0031L9379n6392R7065l70026l45209Q23877J86535m64944
74a06499q7665M96722l247l61204J12987M10479j90193m39905O3843K93248j53908
85C4658k50398J09299J35763j84595j02429J62548N7426j45165L0299J85161K7411
96E9978n5022J04177P8526q6450k507J40721n5467k28572j9047J28448r1360j45582
108a72157J34365J26207k16133j52035K59224J87972k49832j72735K58139J79165
$$ y = [0, 0, 0, 0, 0, 0, 0, 0, 0, 0, -8, 8, -8, 8, -16, 16, -24, 24, -32, 40, -48, 56, -72, 80, -96, 112, -132, 152, -176, 205, -233, 269, -304, 347, -389, 441, -497, 557, -624, 696, -776, 863, -958, 1062, -1175, 1300, -1436, 1584, -1746, 1923, -2120, 2333, -2571, 2837, -3132, 3462, -3836, 4264, -4758, 5332, -6011, 6834, -7855, 9152, -10867, 13247, -16784, 22595, -33797, 63268, -306758, -651967, 171910, 358445, -106499, -194164, 302558, 299311, -61893, 51094, 461573, 271380, -168525, -104682, 188566, 34658, -215740, -106441, 29322, -155273, -257702, -95154, -37728, -182893, -152594, 32567, 59978, 4956, 109133, 187659, 101209, 98702, 239423, 183956, -44616, -63663, 64785, -26575, -172157, -37792, 88415, -127718, -279753, -20529, 167443, -82389, -255124, 3015, 182180]
118A82180k08623j05859K30620R9592j77938j6561J67712q9836k54910P6682K74693
129A77752n7962k76887Q226K15124J884j35973M2508J02803r7277j47421N7721
140a09502J50461K0442o8648j7337L3473L2155K2957K448k0802k0106k5068m5460
152d4987m031P0079L4963p5784o3566N6471O8184m0243o6847J6141M9208Q499
164H087n61K2627J0312j0067P559J8007j4085m7165m3410j2429J8558J3211j7242
177d6598j290N6597L6622n1164l1601Q4962O5076q6005q1515P1172O4158q3275
189b861m7897J02329K8575j50076o3798J29515M1985j32465j9268J50367K3190
200E9596j24815L0211J69115l484j45293J376R2749n6942r7935O9477P4886j05501
$$ y = [182180, -26443, -132302, 98318, 197910, 19972, 3411, 171123, 81287, -173623, -96941, 177752, 119790, -157097, -148871, 66253, 68137, -67836, -25328, 77475, -19802, -167223, -109502, 40959, 61401, -7247, -24584, 8889, 41044, 64001, 66449, 45647, 25541, 473, -44987, -49018, 21061, 56024, -19760, -83326, -26855, 41329, 1086, -65761, -49620, -412, 8087, 7526, 30153, 40465, 30398, 37957, 55964, 41879, -5286, -48696, -61125, -42567, -29356, -46598, -47888, 8709, 45331, -5833, -37434, 47528, 112604, 26599, -54916, 16256, 80414, -2861, -50758, 51571, 80146, -69930, -133728, -4213, 37772, -94693, -113961, 36406, 59596, -65219, -35008, 134107, 130623, -14670, -13294, 79455, 22513, -75422, -5945, 68941, -36560]
212c6560q2702J06912P9758r0278m8996Q2687J0486q4172L0681J07863l1866r1967
224d8154N6387Q6788o8032p2228O9586K4951j15400k0075J30504J0148j29833
235g5358K0276J46152l1759j40370N5617J32128r5491j50353J02779J47954j05853
246E722j28810J22941J23516j17394r3243J24243O2856j39437m3404J45462K3620
257H6072j49800r005J44298j0956j44097J5791J21705m0746j16051N4942J17691
268F9844l8862p7280O1534P2562n3053n1304M0768J0519n6885k719L7369l9273
280b6780m8730O0387O1304n9520n0854O7700M1473o9199j4216R9320K0401j03509
292b2223k0288R7607J2499q8959m720N8965m7886q4801N9447R8290n9067r0114
$$ y = [-36560, -119262, -12350, 67408, -22870, -71866, 10821, 21307, -62865, -32184, 75679, 43813, -48154, 8233, 95021, 26989, -45239, 24347, 49298, -66102, -86177, 44327, 54475, -75358, -55082, 91070, 59311, -81059, -25442, 106686, 11195, -139158, -36379, 111575, 5722, -123088, -147, 123369, 5975, -87268, 36975, 99831, -39606, -83010, 62452, 86072, -63728, -72733, 71565, 60609, -83488, -67697, 54008, 13262, -102789, -47847, 69844, 30982, -46298, 15236, 87798, 34745, -16559, 24209, 34728, -22157, -24876, 12493, -26780, -75510, -15123, 46181, -13339, -64193, 3507, 44980, -24219, -38435, 60885, 81286, -22223, -42511, 55096, 67595, -21364, -26084, 32881, -15005, -99806, -40359, 57931, -1136, -91250]
304i1250P7347J04717o8375r1055Q1826R4890q4495j00447P1453Q4125p8067q1107
316h0438P7155P8419p5248q3548N2626O6490l4791l0989M5527J3590n7072j367
328b9646P4539J2363p0957j9653M8823j621n0073J2533N6072q938m6985J2177
340a1366L9069j4407k7879K1026J7245l0380j9357J5914p681j8029M0945M4292
352D9392n2290o9483M8659Q7386k4499o4227L3756M9932n1530m7257O5650M7035
364G2524p8679o2599N6435L4965o6363k4709O9849J7948n9472J2236P4427k0472
376B6090p0266M9635R9058m1187j10429J5020Q2044j6139n6395K3002K1395o5938
388d4110l6295P0931M7103n1450l3068L7475J3286k0979K9475M2766l7954m9415
$$ y = [-91250, -13903, 90814, 22439, -68616, 13210, 108100, 23605, -76842, -5389, 78736, 669, -80438, -3283, 75136, -112, -83660, -31034, 35456, 665, -30324, 15203, 28793, -28279, -29646, 44893, 57256, -13701, -33354, 15469, 13848, -36225, -23692, 32380, 23442, -23543, -11366, 27703, 13296, -14583, 6443, 23688, -6692, -26049, -10135, -17816, -35845, 5100, 49392, -2898, -72381, -23722, 63664, 39165, -25062, 8694, 58626, 7096, -40161, 25489, 72524, -6155, -68754, -12319, 22646, -43717, -68426, 1423, 19371, -40101, -27865, 46562, 26090, -44176, 5459, 104517, 63330, -47099, -32079, 49965, 33826, -22569, 433, 21828, -44110, -80405, -9474, 37629, -13821, -46889, -9414, 3872, -17107, 12368, 55134, 17180, -32235]
400c2235M3408N1059m9150n4729M2692M6896l9032l7584K7263P179m0562J0000
412b4795O0583j0119p4670q865N9937J5682k6835J1239J9525l8403k7335N8693
424A4637N8910l8402o0336K0137M5808j5082l4189J0380J3577k8138k2030J9529
436a5199J0166k9616j2508L6122K6592k0679j9671J9477K4892L787Q602J5558
448D7523j7383l9409L038M2085L275m7620k5011J5214k194j9965J7278L0882k0155
461a2442l3663K8239M4894j5823k6489L4792L1152l7733k6635M0465J5282n2695
473a0656j1732N5694m058p6958n492P1804K164o1023J5525N7612l4420n7771N4846
486d465O9927n3474o5263N3283M9705n9866k9761P5814K1251q6091j5578Q4665
$$ y = [-32235, 11173, 62232, 13082, -41647, 1045, 47941, 8909, -28675, -1412, 5767, -34795, -24795, 35788, 25669, -49001, -57866, 2071, 17753, -9082, 2157, 21682, -16721, -44056, 14637, 73547, 35145, -25191, -5054, 40754, 25672, -8517, 1863, 15440, -12698, -34728, -15199, -5033, -34649, -47157, -11035, 15557, -5122, -24793, -5316, 19576, 23363, 31965, 47523, 30140, -9269, -6231, 35854, 39129, -8491, -33502, -18288, -20482, -40447, -23169, 7713, -12442, -46105, -17866, 27028, 11205, -15284, 19508, 50660, 12927, -13708, 26757, 42039, -10656, -22388, 33306, 29248, -47710, -53202, 18602, 20766, -40257, -24732, 32880, -1540, -59311, -4465, 65462, 11988, -53275, 8, 49713, -10153, -39914, 35900, 57151, -28940, -44518, 40147]
498D0147J308q3489J4796Q0259l5777q3904M5289P8467n5984o7954O7916N6216
510E7290p9482m4354Q8410L6153q4984j3121Q9480n430r1724K1690R0485l6068
522B8345q6713M4734O9340o4580n8635Q2950N1894r0062m1296R2702K6912r2772
534c7181p063R3142j2489r5611K4635Q9307m0058p9273N5714O9790p0183n8458
546f7728Q3069N2989q2762l1998R1802J7201r7327n939R6662r228r9595R009P8820
559C4975k9118o9806M3995O0695n5501m8324O9461M8035o2450k7445O9582J7198
571E1297o5760j26O7056j4402p1568J2661N6364k6548n3718K3672L3591l4874
583b2355k0084M5834J6798m3703k405N1716L428m1081R890L8715j7692l4339K4664
$$ y = [40147, 41455, -42034, -27238, 53021, 17244, -66660, -21371, 57096, 1112, -66842, 1074, 57290, -22192, -66546, 21864, 58017, -26967, -40088, 49392, 43962, -47762, -26072, 64413, 28345, -58368, -13634, 55706, -8874, -67509, 15441, 67335, -22727, -64023, 28679, 55591, -37181, -44244, 48898, 36409, -59202, -34567, 54740, 14682, -64591, -8877, 60913, -9270, -67728, 15341, 68330, -14432, -46430, 45372, 62573, -34754, -40693, 55969, 46741, -52854, -43845, 34975, 5857, -63949, -19954, 40741, -14760, -63084, 6377, 54412, -8038, -35483, 34099, 51297, -14463, -14589, 52467, 38065, -33503, -20842, 35522, 8974, -44744, -21072, 12519, -22355, -42439, 3395, 20193, -23510, -25915, 25801, 29229, -11852, -1962, 36753, 19061, -15278, 9386]
596I386K7602l4278l2265K8266K1920l1267k0808K2320Q128k0515L970K6726l587
609E598k2034R709K6000r52j4720M020Q473n928n879M169P29p370p538n014M5
624a0692M407l819j3745K462K1335M870j7099J408K2857L941r641J2983J3242
637C2509k4909k0907K7739K2465l2307k9190J8488O644l0515L25L7383r241m6300
650d7816J3058N4812m057l6828K1815M0636k2415k7922L5726K3228m5455k1899
662a7117M4039N667n8883j1806M6253o027m8772J6354M3532l2009m1255N1108
674h916N4101m2418l7190N3925L3004n0740j1765O3370o33p5471L46O8000j8227
687B7386p5372J7242O0832l5741o0659M0189M9287m7270l1625O7067L1633o6403
$$ y = [9386, 36988, 2710, -29555, -1289, 20631, -10636, -31444, -9124, -996, -21511, -17541, 9185, 5598, -16436, -6727, 19273, 18321, 3601, 7621, 16094, 10166, 4287, 8456, 9185, 1815, -5723, -10737, -10692, -6285, -10104, -23849, -21387, -52, 4818, -12281, -10873, 11984, 15925, 6284, 19267, 32509, 7600, -13307, 14432, 36897, 4590, -24600, -6112, 532, -29983, -29658, 7725, -1516, -47816, -34758, 20054, 15997, -20831, 984, 41620, 19205, -8717, 27009, 50237, 4782, -17117, 26922, 32589, -26294, -38100, 8153, 2126, -46646, -30292, 13240, -18769, -60024, -8916, 45185, 2767, -34423, 19502, 52506, 1766, -9999, 53371, 52738, -22733, -22387, 45613, 27386, -47986, -30744, 30088, -5653, -66312, -26123, 23164, -24106, -55731, 11336, 42969, -23434]
699b3434j6096P8143J9396o4925k08N9692k0403o2963L0434N7473m8605o4656
711e6152M1759M6755n3764l8733N7099K6167n9003r818O7932M694o1341J5500
723a8905P1892j4833o5244K1672N4889k8949m3879L7957K8238n9114l3988N9185
735H921K8274n9688k4283N1022R198m6930Q792N3217j4613m9852K4801N2477k4221
748A7115m3705K8831L8044l0803k9304L0513J4550l9555r422M3665L036m9752
760b6787p322M1908N192l0565N474K5372j5590k2317K6331K8623k3327k5896K1400
773B496K0594k0180j4221J8989N665k2800k702K2636k643k6710K370K8885J613
786A3992k3375l131J6618K24q623J0013R332j7156j6901J6111J9564j1341j8236
$$ y = [-23434, -39530, 38613, 58009, -6916, -7124, 52568, 32165, -30798, -364, 57109, 8504, -56152, -14393, 32362, -21402, -60135, -3036, 23131, -35872, -45690, 22242, 26936, -34405, -18905, 52987, 38154, -27090, -5418, 49471, 20522, -23357, 14600, 42838, -16276, -50264, 8921, 37195, -22493, -46776, 4246, 13444, -33486, -24694, 28523, 13910, -35942, -11141, 41336, 17115, -26590, 2241, 40285, 9482, -19822, 10691, 25241, -14314, -23736, 19929, 22965, -26787, -34109, 7799, 12991, -17574, -12100, 13272, -2318, -24635, 1696, 30319, 6992, -18904, 2496, 23090, 2910, -11311, 7678, 13343, -9457, -12159, 10477, 7834, -18876, -16506, 12379, 13992, -9383, -12514, 4104, 4328, -4295, 5718, 15050, -2106, -19007, -2896, 16668, 5327, -12909]
799a2909P484J1330j0090o232J6816Q431j9792r104K1888J0974k0964j1993J9684
812E523J0373j9087r065J4871J807j6547M653K0243p611k5076Q184K6944n461
825I751k1493R767J8702j5960j7758K1476J9413k4640k0907K2655J8408k1895
837b481j4637K1035R838k0605l756K0345l856k2709R015K4715j1233k5183J1756
850g756K2032j2939j5199J9197J3227k3366j2083K5429J3352k2533r882J7885
862G364O22j8562M712J6404j2724j9440J5661J9503j7830j6798K3253J8404k1419
875h50j3486K4649J1857k5744r505K5416O304k7001p267K0685J879j9326L262
888i127J6621r472j7228J5472K0668j2962j7583J5379J7799j6324j6110J7210
$$ y = [-12909, -5425, 5905, -4185, -10417, 6399, 14830, -4962, -14066, 7822, 18796, -2168, -14161, 5523, 15896, -3191, -12256, 2615, 4422, -12125, -7472, 12771, 5160, -19916, -11732, 15212, 9751, -11742, -1975, 16727, 767, -16991, 4485, 23898, -742, -21649, 1006, 19414, -2481, -17118, 3917, 13755, -6850, -10606, 9739, 5883, -16826, -7811, 16904, 5671, -19512, -7756, 14276, 1337, -13862, 5335, 18562, -4804, -16887, 8542, 21894, -639, -10521, 7364, 7986, -10576, -5864, 10540, -2184, -21624, -5963, 13540, -4290, -21088, 2165, 20569, -850, -14336, 10313, 22170, -3574, -13079, 12337, 18641, -8360, -15627, 5058, 6937, -12389, -9127, 7494, -1978, -19206, -3734, 16934, 3972, -13611, 1768, 19567, 3243, -12867, 4343]
900D343J4671j9860j7182J6029J4855j4523j2611J3232R698j1679o049J1658L992
913F574j0838K19J1701k896j2800N135J4268o703j5954P285J5304q827j5054J0318
927b268J4872j0554j2631J1912R777j3879q421J4748L679j7998o6K0059l652k0634
941a5056J0170K6601j1753k8210J3904K9175j6165k8585J7446K4229k3508k4409
953b6161K5582K0860k8014j7933K8267J2065k8101j570L4425o30l4646P539L6410
966B8093j1886l6050J5231L0366k4635l3030K5793K8576k8021k2931K9472J7414
978A8392k9846o121L5182K230l5492M848L5983j0095l3454J5311K7688k5060k6676
991b7110K8693K0161l5944j7609M0251J5195l7894o910L9764O46l7218R814L7493
$$ y = [4343, 19014, -846, -18028, -1999, 12856, -1667, -14278, -1046, 8652, -3027, -9076, 2582, 6574, -4264, -4045, 7656, 4760, -8040, -2905, 11363, 4660, -11294, -4009, 11295, 2468, -12586, -2268, 12604, 2050, -10581, 1331, 11108, -2771, -11192, 3556, 7235, -10763, -10829, 9230, 5578, -15056, -4886, 21715, 9962, -18248, -4344, 24831, 8666, -19919, -2473, 21756, -1752, -26161, -579, 20281, -7733, -25666, 2601, 14666, -13435, -15005, 19420, 18790, -15856, -8317, 28093, 16207, -19843, -4612, 25754, 1119, -31911, -6118, 22458, -5563, -28494, 978, 18392, -11454, -17575, 17607, 19837, -15655, -10807, 25176, 15081, -18373, -3062, 24626, -434, -27110, 1583, 21744, -14200, -31809, 8442, 23637, -14257, -21167, 18597, 19243, -17975, -8161, 29332]
1004B9332j8642l9023K2130L6331k6239l2040K8967K4495l3813j8589L6970J2849
1016B2728l8806o897L8860K093l7039M071L4592p378k8990J2355K1739j9609j5686
1029a7967K7761J4923k9324j2827K5551P016k1606K134J6837j8244k3542K2777
1041f511K7957k2669k6930K0598K3329j5439r412K2016M397k4634J197K9343j274
1054B1968l0417j983K1457l446j9020L678Q120j4642r260K0120J4277j6024j3042
1067a8214J4547J5743j139m008O01k265j525L954J791m557k785k970p121R97J0713
1082C762j319j7067k860J7129N952j2244k788R176J158j888R448J547j6646l052
1096i692K1981P768k0292p535J6180J465j4373M430J3985j2186k0349R950J5396
$$ y = [29332, 10690, -28333, -6203, 30128, 3889, -28151, 816, 25311, -8502, -27091, 9879, 22728, -16078, -22975, 15885, 17978, -19061, -14990, 19602, 12224, -16766, -4411, 17328, -2281, -17967, 9794, 24717, -4607, -17434, 8117, 15133, -6473, -4339, 12498, -5746, -29288, -6511, 21446, -1223, -28153, -7555, 15774, 335, -9077, 12939, 17336, -7298, -6101, 23242, 21968, -8449, -10432, 11025, 7579, -11441, -7763, 357, -14285, -23545, -3425, 10852, -5172, -18214, -3667, 12076, 10937, 6929, 7530, 5265, 3740, 7694, 9485, 4928, 2143, -827, -7948, -6951, 3762, 2443, -14624, -17484, -355, 5597, -6647, -9435, -259, 899, -989, 8459, 10006, -6640, -9692, 12289, 20057, -235, -7770, 8410, 9875, -4498, -68, 13917, 1731, -18618, -8668, 6728]
1109F728j0495j1164J0085K387j2418P373K0873q876k1129J6896K6942j5836k4217
1122a2851K0188K1966k3882k0747K2999J2038l0903j2704K7506M380k8731J500
1134a9241K7208q254k2972K0661K7374k4120k3927L1634K5234l2925k1613L3074
1146A2133J5743l4369j1904L0111K055k9687N356K6706j4911k5472K2360K3086
1158B1207k7066j8904L1301J3501l6026p323M0511L334m1850J827M3839m258l9109
1171a9016R496L4938j4400k8218K1014K1121l0435j8564L3821J2097l9655j1261
1183b9062L8819N495l7703J505M0031n066l5741J1476L5723j0943k9348J3219
1195a595K0259j6795j2326K0667K988k8418l10L0132l416l0817O031K8160r739
$$ y = [6728, -3767, -14931, -4846, -2459, -14877, -7504, 13369, 4493, -16636, 260, 27202, 11366, -12851, 7337, 29303, 5421, -15326, 7673, 19711, -11192, -23896, 3610, 7990, -20741, -19241, 7967, -287, -23259, -2598, 24776, 656, -23271, 8363, 33597, 672, -20941, 12133, 27876, -6493, -18397, 11714, 13769, -15918, -10562, 16144, 1233, -24239, -1879, 21207, -5859, -24763, 6538, 20039, -15987, -23310, 17201, 20535, -21315, -19488, 24351, 20093, -19016, -9520, 25418, 11018, -17200, 3814, 24935, -5500, -24064, 9757, 21854, -17801, -29062, 9757, 15252, -22451, -20946, 19085, 14019, -21722, -10246, 25477, 14534, -14814, -1595, 18664, 1869, -10457, 10210, 13198, -15220, -15530, 14602, 11186, -19631, -13600, 14560, 4821]
1208D821k3877J6596K3379j9207k1183K0408J7113k0351j2876J9248N842j9625
1220i712Q98K1574m661k0887R565K1978j2388k1882J2758J9225j3507j7380J2491
1233a928J2402j3773j0593J2971Q433j1277n067Q975K959m252L491N502m836n261
1247b254O490K865p622m702M649J447n198K88L433j803p69N334K770m658j735
1262a465L330n86j883M146K970p128o971N431O185l275n309J261O47k323K403
1277b567O096J059k404J17K44n07Q34J184l595l205K501N22n627K97Q285L36q850
1294e280Q16P758l686q618P826J1902q169j1970Q799J1711r319q831J1655N964
1308A0558j6013o553J7438O497j5960l798J6846K38j8616m47J6499k527j6192
$$ y = [4821, -19056, -2460, 20919, 1712, -19471, 937, 18050, -2301, -15177, 4071, 9913, -9712, -8814, 12760, 8099, -12788, -3223, 18755, 6367, -15515, -2757, 16468, 2961, -14419, -1928, 10474, -3299, -13892, -921, 7512, -3765, -8832, 143, 3102, -1150, 2341, 7843, 3007, -2254, 4236, 7101, -521, -5223, -574, 873, -4325, -4037, -604, -2407, -3176, 2158, 4928, 270, -1465, 1865, 1279, -604, 3542, 6512, -616, -7587, -2156, 4029, 754, -4555, -3294, -2647, -4970, -2567, 3529, 4588, 2184, 2301, 2545, 2038, 2872, 4056, 461, -2744, -243, 279, -5348, -5051, 3234, 3570, -5280, -4464, 3294, -392, -9010, -1184, 10718, 2549, -9421, -622, 11089, 1770, -7061, 4594, 10558, -5455, -12008, 5430, 11927, -4033, -7831, 9015, 9253, -9363, -9810, 6689, 4162, -12030]
1321a2030L379J2374n711q779J1716J0656j0283o205J1775K389j3269J534J6304
1334A3850l151j8992K018J5321n616j5792O686J2661j1302j4604J0440J4621n549
1347E91n486J0537K634j2046J569J6171j445j7620k24J3364l713j3213O473J2898
1361A0490q760j4757P445J2125q221j0893Q703J0460n615n170N476J423m666M651
1375B691Q889p909j4825M291J4993Q0r765J662M929p039n372R570P152j0897j1362
1390a2912N640Q625j322j561L533k190m749P177Q989q546j3085Q115J5998m781
1404H931j5582K223J1423n285r418P897P844j3916j4256J2451J7803m038j1135
1417e058L534N441m039J495J0606l210j6412m52J5495L08j4576K15J2777k720
$$ y = [-12030, -8651, 3723, -1988, -10767, 949, 11605, 1322, -4883, 6892, 9281, -3988, -2454, 13850, 10699, -8293, -6275, 9046, 3430, -12362, -5676, 6985, -4317, -18921, -8481, 6140, 591, -4895, 5642, 8276, -3770, -2201, 13970, 12525, -5095, -5319, 8045, 4332, -8881, -2408, 10490, 1730, -13027, -5582, 6543, -1678, -12571, -3868, 6592, 977, -4193, 1283, 2706, -1960, 2691, 11580, 3671, -11154, -6863, 8130, 8210, -1555, 107, 5036, -2003, -7375, 2195, 9347, -1550, -12912, -7272, 1353, 31, -1530, 2003, -187, -4936, 2241, 11230, 2684, -10401, -2286, 13712, 8931, -6651, -4428, 6995, 1710, -7708, 189, 8033, -5883, -20139, -7688, 10115, 6077, -5058, -1524, 3917, -122, 1373, 11979, 8769, -7643, -8095, 7400, 7708, -6868, -6653, 6124, 3404]
1431C404j3361L197J0288n168q200Q695R673p464o626P914N406n553R96O171r478
1446a06j2806J0241J6325q793j7215P550J3522r013j0958J1313Q172j4257p734
1459a3759J5009O822j2456j914J4878K33j3181L874J2766q427j3703J0960J4174
1472A5276j2969j5483J1022J2424j1973j0733J0366N887j2965m693J2928N336
1484D423p140K093Q573l863o844Q039Q355r045q277O298K357q905k89R766k302
1499C239j3357o30R775n89o366M483M609o122k08J2720M094j1704l085J1362J309
1514I530j0630q62P752l218q677M192Q023n126q739K634N123k554j830L247o64
1529a799l621M201O712k414m114L268K824l946j835M186l06m446J898L646l677
$$ y = [3404, -9957, -6760, 3528, -1640, -9840, -1145, 8528, 1064, -5562, 2352, 7758, 2205, 3201, 9372, -106, -12912, -2671, 13654, 4861, -12354, -4804, 8718, -295, -11253, 60, 8232, -6025, -13759, 1250, 8072, -4384, -6298, 8580, 8813, -4368, -494, 12272, 3845, -9858, 1102, 15276, 2307, -13176, -2154, 10270, -1703, -12436, -2070, 3817, -9148, -13841, -913, 4423, -2717, -624, 7949, 4086, -2758, 5281, 13636, 4591, -3686, 2612, 4969, -3936, -4225, 5541, 3239, -10118, -10748, -973, -1562, -7928, -3445, 1164, -4958, -5166, 7554, 11648, -56, -3141, 8221, 9530, -1100, -1962, 5790, 2572, -6105, -1913, 6110, 984, -7755, -5121, 2, -2552, -4382, -1135, -1799, -5420, -1219, 5493, 3079, -1035, 2233, 5057, 1111, -724, 3462, 3156, -1290, 608, 4254, 577]
1544E77m147L321K314m771j701M398k418n557N207R174m244q158N239P431n464
1559A201l944P061J661j0468o81J2117K69j1941j09R996k652q548N187N869r244
1574d226n585J2874O504j2463m970J1531R10j1472L785J2594p700j4892R118J5363
1588A1371p437j0987R876O965j3136m107J5957K080j7843j288J6623k888j6599
1601a1413N611J5568q731j5046J0504J2127j2407q267J7100Q155j6502m709J6693
1614H683J928j5481L591J4186j0247j6965J1760J5966j4055j4697J4405J0760
1626I834j6807p425J8908M805j8484m93K0633j283j8807N053J8108o814j4539
1639g311R213R551j6018r248J9584Q596k0765q832J7283M043j5008K781J5868
$$ y = [577, -3570, -249, 2065, -2706, -4407, -9, -2427, -7984, -2777, 6397, 2153, -6005, -766, 6665, 1201, -2743, 4318, 5979, -4489, -5170, 6947, 7216, -4725, -4834, 5162, 2510, -6038, -851, 5018, -4226, -9811, 3063, 9567, -2896, -7866, 3665, 4575, -6897, -3112, 9482, 1782, -13110, -3992, 11371, 3934, -7053, 2823, 9788, -3348, -7455, 8502, 10582, -7261, -8549, 8074, 5186, -11413, -5802, 9766, 1035, -14011, -3507, 8620, -3787, -12054, 5046, 13201, -3301, -8010, 8683, 10611, -4870, -1279, 12907, 2660, -14305, -2545, 13421, -634, -15331, -926, 9834, -6973, -14398, 4510, 9315, -9169, -9662, 10971, 9688, -9119, -4066, 14042, 7228, -7311, 1902, 11453, -4565, -13813, 5771, 14367, -6398, -15230, 2053, 6096, -8912, -6131, 9737]
1652I737o803j6698R185J6736p887j0380J0060O304j3775l629J5753J222j7615
1665g790p3J5761m535j5691O127J4568p375j1713R351Q724j0915m921J4505M830
1679A0853j3553j927J2602j841j2474N187J2422q826j4602P146J1590p786p805
1692i014Q774N509j0346l296J1482L330q235N18P216l235o438O402N926q243n203
1707d853P106K478r694k292Q463M87o454J939M853m778m118Q320O556o798m561
1722c346N179P43m856M380P966o349j1709L754R954k726o852K777J853o017N6
1737e193Q640k75q902J062Q557j133n657K415M273m533p17Q213K2j0957k073R857
$$ y = [9737, 2934, -13764, -4579, 12157, 4270, -6110, 3950, 10254, -3521, -7150, 8603, 9825, -7790, -7863, 7898, 3363, -12328, -6201, 8367, 992, -10721, -1370, 7354, -3561, -8482, 6023, 10853, -2700, -4627, 7975, 6134, -6340, -1153, 11269, 2443, -12159, -5013, 6577, -1209, -9014, -240, 5269, -5077, -8373, 3109, 6439, -1796, -1278, 5938, 2703, -3735, 2667, 8593, 350, -4853, 2253, 4731, -4963, -7255, 1208, 1695, -4759, -2820, 2033, -2745, -6863, 1457, 8013, 1215, -3346, 1833, 2576, -2280, 2100, 10066, 3717, -7992, -4238, 5716, 2990, -3862, -1085, 768, -5249, -5193, 3447, 3172, -5730, -4668, 3889, 2756, -2901, -486, 3787, -746, -1463, 6750, 6772, -4185, -6258, 3599]
$$ [...]
8191b69
##END NTUPLES=NMR FID
##END=
