##TITLE=1H_L1-SePh(A)(2)
 CDcl3, 32 sc, 
 11.2.2019
##JCAMPDX= 6.0         $$ Bruker NMR JCAMP-DX V2.0
##DATA TYPE= NMR FID
##DATA CLASS= NTUPLES
##ORIGIN= UXNMR, Bruker Analytische Messtechnik GmbH
##OWNER= root
$$ XWIN-NMR		Version 3.5
$$ Mon Feb 11 16:21:06 2019 Russian Standard Time (UT+4h)  she@DPX200
##.OBSERVE FREQUENCY= 200.1313
##.OBSERVE NUCLEUS= ^1H
##.DELAY= (6, 6)
##.ACQUISITION MODE= SIMULTANEOUS
##.ACQUISITION SCHEME= undefined
##.AVERAGES= 32
##.DIGITISER RES= 18
##SPECTROMETER/DATA SYSTEM= spect
##.PULSE SEQUENCE= zg30
##.SOLVENT NAME= DMSO
##.SHIFT REFERENCE= (INTERNAL, DMSO, 0, 15.7039)
##AUDIT TRAIL= $$ (NUMBER, WHEN, WHO, WHERE, WHAT)
$$ ##TITLE= Audit trail, XWIN-NMR		Version 3.5
$$ ##JCAMPDX= 5.01
$$ ##ORIGIN= Bruker BioSpin GmbH
$$ ##OWNER= she
$$ F:/spectra/data/she/nmr/H-F/1/audita.txt
$$ ##AUDIT TRAIL=  $$ (NUMBER, WHEN, WHO, WHERE, WHAT)
(   1,<2019-02-11 16:19:32.73 +0400>,<she>,<DPX200>,
      <continue with go, POWCHK disabled, PULCHK disabled
       configuration hash MD5:
       00 E9 B6 7A A2 85 ED C7 34 08 36 98 17 FE 4E 26
       data hash MD5: 16K
       E7 AF A5 9B 49 53 1F A1 A0 8D CA 1D 51 41 55 90>)
$$ ##END=
$$ 
$$ hash MD5
$$ 58 B2 94 56 16 26 51 A5 3B 76 CC 88 FE 43 F7 DF
##$RELAX= 
##$RELAX= 
##$RELAX= 
##$RELAX= 
##$RELAX= 
##$RELAX= 
$$ Bruker specific parameters
$$ --------------------------
##$DU= <F:/spectra>
##$EXPNO= 1
##$NAME= <H-F>
##$PROCNO= 1
##$TYPE= <nmr>
##$USER= <she>
##$AMP= (0..31)
100 100 100 100 100 100 100 100 100 100 100 100 100 100 100 100 100 100 
100 100 100 100 100 100 100 100 100 100 100 100 100 100 
##$AQSEQ= 0
##$AQ_mod= 1
##$AUNM= <au_zg>
##$AUTOPOS= <>
##$BF1= 200.13
##$BF2= 200.13
##$BF3= 200.13
##$BF4= 200.13
##$BF5= 200.13
##$BF6= 200.13
##$BF7= 200.13
##$BF8= 200.13
##$BYTORDA= 1
##$CFDGTYP= 0
##$CFRGTYP= 5
##$CHEMSTR= <none>
##$CNST= (0..31)
1 1 145 1 1 1 1 1 1 1 1 1 1 1 1 1 1 1 1 1 1 1 1 1 1 1 1 1 1 1 1 1 
##$CPDPRG= <>
##$CPDPRG1= <>
##$CPDPRG2= <>
##$CPDPRG3= <>
##$CPDPRG4= <mlev>
##$CPDPRG5= <mlev>
##$CPDPRG6= <mlev>
##$CPDPRG7= <mlev>
##$CPDPRG8= <mlev>
##$CPDPRGB= <>
##$CPDPRGT= <>
##$D= (0..31)
0 1.2 0 0 0 0 0 0 0 0 0 0.03 0 0 0 0 0 0 0 0 0 0 0 0 0 0 0 0 0 0 0 0 
##$DATE= 1549887441
##$DBL= (0..7)
120 120 120 120 120 120 120 120 
##$DBP= (0..7)
150 150 150 150 150 150 150 150 
##$DBP07= 0
##$DBPNAM0= <>
##$DBPNAM1= <>
##$DBPNAM2= <>
##$DBPNAM3= <>
##$DBPNAM4= <>
##$DBPNAM5= <>
##$DBPNAM6= <>
##$DBPNAM7= <>
##$DBPOAL= (0..7)
0.5 0.5 0.5 0.5 0.5 0.5 0.5 0.5 
##$DBPOFFS= (0..7)
0 0 0 0 0 0 0 0 
##$DE= 6
##$DECBNUC= <off>
##$DECIM= 32
##$DECNUC= <off>
##$DECSTAT= 4
##$DIGMOD= 1
##$DIGTYP= 9
##$DL= (0..7)
0 120 120 120 120 120 120 120 
##$DP= (0..7)
150 150 150 150 150 150 150 150 
##$DP07= 0
##$DPNAME0= <>
##$DPNAME1= <>
##$DPNAME2= <>
##$DPNAME3= <>
##$DPNAME4= <>
##$DPNAME5= <>
##$DPNAME6= <>
##$DPNAME7= <>
##$DPOAL= (0..7)
0.5 0.5 0.5 0.5 0.5 0.5 0.5 0.5 
##$DPOFFS= (0..7)
0 0 0 0 0 0 0 0 
##$DQDMODE= 0
##$DR= 18
##$DS= 0
##$DSLIST= <SSSSSSSSSSSSSSS>
$$ [...]
##$SUBNAM2= <"">
##$SUBNAM3= <"">
##$SUBNAM4= <"">
##$SUBNAM5= <"">
##$SUBNAM6= <"">
##$SUBNAM7= <"">
##$SUBNAM8= <"">
##$SUBNAM9= <"">
##$SW= 20.0189088683792
##$SWIBOX= (0..15)
0 0 2 0 0 0 0 0 0 0 0 0 0 0 0 0 
##$SW_h= 4006.41025641026
##$TD= 16384
##$TD0= 1
##$TE= 0
##$TE2= 300
##$TE3= 300
##$TEG= 300
##$TL= (0..7)
0 120 120 120 120 120 120 120 
##$TP= (0..7)
150 150 150 150 150 150 150 150 
##$TP07= 0
##$TPNAME0= <>
##$TPNAME1= <>
##$TPNAME2= <>
##$TPNAME3= <>
##$TPNAME4= <>
##$TPNAME5= <>
##$TPNAME6= <>
##$TPNAME7= <>
##$TPOAL= (0..7)
0.5 0.5 0.5 0.5 0.5 0.5 0.5 0.5 
##$TPOFFS= (0..7)
0 0 0 0 0 0 0 0 
##$TUNHIN= 0
##$TUNHOUT= 0
##$TUNXOUT= 0
##$USERA1= <user>
##$USERA2= <user>
##$USERA3= <user>
##$USERA4= <user>
##$USERA5= <user>
##$V9= 5
##$VALIST= <valist>
##$VCLIST= <CCCCCCCCCCCCCCC>
##$VD= 0
##$VDLIST= <DDDDDDDDDDDDDDD>
##$VPLIST= <PPPPPPPPPPPPPPP>
##$VTLIST= <TTTTTTTTTTTTTTT>
##$WBST= 1024
##$WBSW= 4
##$XGAIN= (0..3)
0 0 0 0 
##$XL= 0
##$YL= 0
##$YMAX_a= 115167
##$YMIN_a= -157302
##$ZGOPTNS= <>
##$ZL1= 120
##$ZL2= 120
##$ZL3= 120
##$ZL4= 120
##$ABSF1= 10
##$ABSF2= 0
##$ABSG= 5
##$ABSL= 3
##$ALPHA= 0
##$AQORDER= 0
##$ASSFAC= 0
##$ASSFACI= 0
##$ASSFACX= 0
##$ASSWID= 0
##$AUNMP= <proc_1d>
##$AZFE= 0.1
##$AZFW= 0.1
##$BCFW= 1
##$BC_mod= 2
##$BYTORDP= 1
##$COROFFS= 0
##$CY= 11.3945322036743
##$DATMOD= 1
##$DC= 2
##$DFILT= <>
##$DTYPP= 0
##$F1P= 18.9103706918063
##$F2P= -1.10871071338519
##$FCOR= 0.5
##$FTSIZE= 0
##$FT_mod= 4
##$GAMMA= 1
##$GB= 0.15
##$INTBC= 1
##$INTSCL= 1
##$ISEN= 128
##$LB= 0.24
##$LEV0= 0
##$LPBIN= 0
##$MAXI= 10000
##$MC2= 0
##$MEAN= 0
##$ME_mod= 0
##$MI= 1.114404
##$NCOEF= 0
##$NC_proc= 0
##$NLEV= 6
##$NOISF1= 3.799351
##$NOISF2= 2.8
##$NSP= 1
##$NTH_PI= 0
##$NZP= 0
##$OFFSET= 15.70392
##$PC= 1
##$PHC0= -8678.604
##$PHC1= 13.80018
##$PH_mod= 1
##$PKNL= yes
##$PPARMOD= 0
##$PSCAL= 0
##$PSIGN= 0
##$REVERSE= no
##$SF= 200.130013532006
##$SI= 16384
##$SIGF1= 3
##$SIGF2= 2
##$SINO= 400
##$SIOLD= 16384
##$SREGLST= <1H.CDCl3>
##$SSB= 0
##$STSI= 0
##$STSR= 0
##$SW_p= 3612.71676300578
##$SYMM= 0
##$S_DEV= 0
##$TDeff= 0
##$TDoff= 0
##$TI= <>
##$TILT= no
##$TM1= 0
##$TM2= 0
##$TOPLEV= 0
##$USERP1= <user>
##$USERP2= <user>
##$USERP3= <user>
##$USERP4= <user>
##$USERP5= <user>
##$WDW= 1
##$XDIM= 8192
##$YMAX_p= 0
##$YMIN_p= 0
$$ End of Bruker specific parameters
$$ ---------------------------------
##NTUPLES= NMR FID
##VAR_NAME=  TIME,          FID/REAL,        FID/IMAG
##SYMBOL=    X,             R,               I
##VAR_TYPE=  INDEPENDENT,   DEPENDENT,       DEPENDENT
##VAR_FORM=  AFFN,          ASDF,            ASDF
##VAR_DIM=   8192,          8192,            8192
##UNITS=     SECONDS,       ARBITRARY UNITS, ARBITRARY UNITS
##FACTOR=    0.0002496,     1,               1
##FIRST=     0,             0,               0
##LAST=      2.0444736,     0,               0
##MIN=       0,             -157302,         0
##MAX=       2.0444736,     115167,          0
$$ Real data points
##PAGE= N=1
##DATA TABLE= (X++(R..R)), XYDATA
0@%%%%%%%%%%%%%%%%%%pL9o4O4o4O4o6R8j28J29j52J83j95K28k62K94l39L75m23
37b26M80n38O00o66P40q21R12j008J110j227J354j495J646j812J996k199K426
54A272k681K970l292L659m083M577n167N887o783P931r464J1632j4950K0763l3975
69b1704J34761l7429j20154J20048L6698p5630o8507N0203N75n4629l0706L2551
81c3923k729l1341j2527K9924K4563Q713o51K5416L1922L380k6108L475K2626
94D2740q532k7925J7184K7487k6472m5150J2309L3047r411l6261p177J1767N665
107a0729r001o417K365L158j7812j8329K1365L9324r12j8489K8064M3180r026
120D6741k2339K2372J7973l3266k1722K5320M453m3953k5667J4681k547l3663
$$ y = [0, 0, 0, 0, 0, 0, 0, 0, 0, 0, 0, 0, 0, 0, 0, 0, 0, 0, 0, -7, 32, -32, 32, -32, 32, -34, 64, -64, 65, -87, 96, -99, 129, -133, 161, -178, 197, -226, 254, -284, 316, -350, 390, -431, 481, -527, 583, -644, 710, -785, 861, -951, 1045, -1154, 1272, -1409, 1561, -1731, 1928, -2155, 2422, -2745, 3142, -3641, 4290, -5174, 6458, -8492, 12271, -21704, 113057, 75628, -44526, 75522, 112220, 36590, -31917, 18286, 18861, -35768, -66474, -33923, -36652, -67993, -80520, -50596, -26033, -17320, -17971, 7445, 39367, 42747, 16639, 20114, 42740, 34208, 6283, 23467, 50954, 24482, -20668, -8359, 24688, 15277, -20984, -28161, -16394, -10729, -19730, -26147, -23782, -20624, -38436, -56765, -35400, 3924, 3012, -15477, 12587, 55767, 46741, 24402, 46774, 64747, 31481, 9759, 35079, 39532, -4421, -30088, -15407, -17954, -51617]
132e1617k1647R280J5931J1666J0044J4017K0716J1635j472J1194K5703l292l3588
145A8570k612L2322j510m0325j0482J5211j3678l1135K085J3813j0760j0402J3169
158b5734J1369l687j512N062O914R933P336n472M027K0412M619j5850N17J5850
172C3784j0424k4775P457K0934j3729k5973j907L813j1439j2084l4q68J777R940
186b3528J0378R755J2988N009n368P051J4064n760j2393J1225J4017j4633j6283
199F522O290l641k4520p925J2299m855j7631M360J7418J251m562M114L811j038
213h107N555P860L231O547M102l799J292R459l289j6611l14J0970p761j6907J401
228f371L585j5474j0249P973o70r368Q364J6837J607K34J0882K607n540Q403J1819
$$ y = [-51617, -73264, -63984, -48053, -36387, -26343, -12326, 8390, 20025, 18553, 29747, 55450, 52158, 18570, 15958, 48280, 46770, 6445, -4037, 11174, -2504, -33639, -31554, -17741, -28501, -38903, -25734, -14365, -18052, -19564, -14502, -7588, 2345, 9681, 4209, 8236, 28648, 33267, 17417, 17934, 33784, 23360, -1415, 6042, 26976, 13247, -12726, -14633, -10820, -22259, -34343, -34377, -35245, -33468, -23528, -13150, -3395, 9593, 14602, 9234, 16285, 30349, 24589, 12196, 23421, 37438, 22805, 6522, 12812, 9171, -15349, -23274, -10975, -15830, -33461, -29101, -11683, -10432, -14994, -10880, -7069, -8107, -2552, 5308, 8539, 15086, 19188, 15389, 16681, 26140, 22851, 6240, 5926, 16896, 9135, -7772, -6371, -2786, -18260, -28509, -20536, -21206, -30574, -22210, -5373, -3766, -3532, 7350, 9957, 4417, 12820, 24639]
243B4639p583n624J1702J379j4305j989N684j6983j9808O334R550j1541o753J4090
257a1208P462n434Q7P664q37j168M967L031P61N547J270m748K638O628n959j1065
273c64M795N881p586m383N680n909j3347J969P602o984p414O850O756k131K443
288f142N957j260K471R342R95l084Q535Q396r737q380O417k000j8490p966Q216
303f730q96q337K744M510l024Q89P301q37n108N379P596J98N338O337m107m090
319G163O892n05j3156j195R346o476j1678Q802R262j3913j1286J2697N723j3698
333a2022l091J2853K61q881O458R006n400m657Q643P014j499Q91J729j371j36
348I798j290o212l987K471l376p935M706P822q500j0359O481P897o323m673Q224
$$ y = [24639, 17056, 11432, 23134, 24513, 10208, 8219, 13903, -3080, -22888, -16554, -7004, -18545, -25298, -11208, -3746, -9180, -9093, -1429, -2266, -3434, 1533, 4564, 5325, 10872, 12142, 7394, 10032, 16660, 10701, -364, 4431, 10312, 2726, -1657, 4023, -1886, -15233, -13264, -5662, -12646, -20060, -13210, -6454, -8585, -6142, -185, -1445, 1026, 10368, 11363, 8279, 16814, 25210, 15473, 7093, 13510, 11510, -6980, -14946, -6730, -7626, -15963, -13219, -8709, -11733, -10844, -3543, -4380, -9488, -4109, 3487, 3685, 9023, 15360, 11253, 7163, 14055, 13550, 394, -801, 8545, 2069, -9609, -807, 8455, -5458, -16744, -4047, 1676, -12022, -15113, -2260, -1999, -10880, -4422, 4584, -816, -5473, 3170, 10184, 8685, 9576, 11305, 9934, 9798, 8508, 2296, -1691, 780, -2596, -10531, -5825, 1997, -6503, -16862, -10381, -2484, -8807, -13480, -5256]
363e256N878J515N346K803k507J689L187o532n388P457J640j1669k904J1479l146
378C592j2709Q24N290p394o125J1084M812r347P26J3610K120p988K373O692J10
393G670L11J200m302k384N986n69q952k93L799n730m994N905K150p320k137M613
409e047l637l061R490O667o881j550J1848J727o665J049N741o081m447O680J182
424G015n712K441L487p904o025L880j164q559J426Q815k437n040O650O040l121
439b08L71O047j941l456M513M844k693o39R89n285m184M727p71q223o6N249m312
456e038n488N732M659o753j916R672J596n953M132O333k154l707M238m96n114
471b57K667M244j822k424K450l487o827K012M165o126o097N125K968j732K752
$$ y = [-5256, 622, 2137, 7483, 10286, 7779, 9468, 12655, 6123, 735, 8192, 9832, -1837, -4741, 6738, 3592, -9117, -8293, -3003, -10397, -16522, -5438, -626, -9973, -9247, 4363, 6483, -1505, 868, 7560, 7670, 7981, 9181, 4879, 2495, 8481, 7912, -1040, -1333, 2466, -3264, -8258, -2353, -203, -7523, -9660, -5047, -8684, -11745, -2255, 4412, -2469, -4019, 7829, 9556, 2891, 3940, 9681, 3600, -847, 5833, 7015, 1303, 3744, 7231, -673, -6698, -2818, -3982, -12541, -11115, -2300, -4737, -9777, -3127, 2913, -208, 163, 6210, 4269, 813, 5326, 10170, 7477, 6838, 7827, 2542, -1642, 3085, 2314, -5909, -5975, -726, -5038, -10526, -4794, -135, -6888, -8804, 868, 2464, -3489, 643, 6976, 4822, 1115, 5353, 4857, -257, 2410, 6654, 4832, 2408, 4858, 1371, -5456, -3444, 721, -5405, -11502, -6377, -3409, -5141, -2389]
486b389M379m003k958O823L414n632K405P099k078n342N709K338q636l799M343
501A673o07p680Q95L288m193n9P019j019o788L888P125k344k525L864N15m598
517a546K928N371k956l754K578Q86k905K633K340n681n230K941J365l671M08K706
533a587k772r24N579m18n780K460O563k257k851O271L176l751M14O211l542q044
549a252Q14J934n021j005M073l389n431L841N385l002j643L745P37j813N013L775
565F761m615q21O028k308n886L029L217o227l314O504J52p965M63O453l156l081
581d766N867O18p378J551Q779l561p649L605M875l577J39P753n48m921K230M091
597G108n013l074M266j293o743J247N257l211m915K059J663k888Q18K373j301
$$ y = [-2389, 1990, -2013, -4971, 1852, 5266, -366, 2039, 9138, 7060, 1718, 7427, 9765, 1129, -2670, 1673, 1066, -6614, -5719, -2431, -6624, -6683, 336, -683, -7471, -3583, 3542, 1198, -1327, 2537, 3052, -1546, 1382, 6753, 3797, 43, 2621, 3507, 602, 3235, 5575, -106, -5336, -2395, -1030, -4701, -4293, -1587, -4359, -5283, 296, -122, -5902, -3442, 3121, 864, -1987, 4284, 7460, 3709, 4123, 10334, 6792, -1252, -438, 1496, -3525, -4530, -457, -3846, -9277, -5436, -51, -3053, -4696, -951, -214, -2027, 2986, 6761, 2146, 1325, 7353, 5045, -841, 2188, 5405, -822, -4136, 2368, 2520, -5445, -4982, 1471, -1685, -4766, 1101, 1719, -5659, -4108, 4671, 1110, -6539, -2934, 1941, -1636, -1497, 6256, 5708, 787, 3017, 7108, 2095, -979, 3287, 1994, -4749, -3502, 1755, -1456, -6371, -4312, -2649, -5537, -4719, -2346, -3647]
612c647J763N922O86k729K622K962m186m51L220k840p448K708N220o151m277M875
628a751J232o916R65Q480j669n638L866M557l448l46M874j858l605M263L720n975
644G51k251O073m2o387Q9L525k668k748M169M53n086R11K455l214j893M847M17
661e99l880K922N519j335j799M880O3n568J373M216m079l960M202P57o399j130
677d817M724k901m654K846M110k826o68M988J176l034L596K908m488m97O011m92
693E982n397q8L937m719k995M318m54n091R48L545j920j902K686J099m408J360
709c099M005r90r65L448K515m330n31L804j067j920J428K39l543L01L677k171
725H01l834J261J326m065j115L562q44j108M855J664m152L35N833r75l654L260
$$ y = [-3647, -1884, 4038, 4724, 1995, 4617, 7579, 3393, 2942, 6162, 3322, -4126, -1418, 3802, -2349, -6626, -1751, -519, -7435, -6470, 2010, 341, -5297, -1431, 3126, -322, -668, 4206, 2348, -1257, 3006, 6726, 751, -1500, 4573, 4531, -1856, -1767, 1758, -910, -3658, 511, 964, -4122, -3211, -756, -3970, -5863, -1016, -599, -4479, -1557, 3962, 2627, 828, 5708, 5771, 203, 1576, 5792, 1713, -2247, 1955, 2712, -3687, -4817, -93, -2994, -7648, -4802, -692, -3518, -4186, 802, 1978, -1056, 2540, 5448, 960, 463, 6474, 5982, 585, 497, 4434, -285, -3280, 1038, 584, -4507, -3559, -14, -1934, -3836, -1150, -51, -4459, -3099, 906, -84, -1049, 2399, 4914, 584, 53, 3857, 2790, 870, 2298, 2537, -1006, -705, 2972, 801, -3033, -1772, -446, -4511, -5626, -2064, -2908, -4016, 839, 2503, -1649, -1314, 4519, 3544, -110, 3150]
741C150K800m462j614N043m36p098J4M523m034l598L928J443n010J278N754k652
757i71l596M029M737m183k59M857o01m466J523K757l176k243L136M79l942L91
773a528K980j406k756J242L85k184P60J704j532Q2K814M67l057K069K608k576
789G2P18K779n90k881K724J920l892j294K073j700m234J370L442k867l072K699
805b733K419k375M38L290k94o90L608J228l250K38K169j180l155J869o67l785
821b870P09L245j260m015K232J657k671M9M947j044l617J945L372k083k108L056
837A544o42k821J807L058j800j677K815J168l433K01K347k462k523K324Q12m138
853c420n54K793r94j316K583P90l622J838N077Q01k425P77J813j363q82K030j865
$$ y = [3150, 5950, 1488, -126, 4917, 4481, -2617, -2603, 1920, -2114, -5712, -1784, -341, -5351, -4073, 1681, -971, -4567, -538, 4199, 16, -243, 4614, 4013, -453, 1070, 3827, 651, -1592, 1544, 2023, -1919, -1528, 1452, 46, -2710, -1468, -1083, -3267, -2507, -803, -2335, -2253, 561, 1028, -2029, 40, 2648, 72, 790, 3569, 2979, 98, 2822, 4742, 850, -444, 1629, -71, -4305, -2935, 507, -2360, -5432, -2733, -314, -2689, -2251, 1039, 745, 55, 3663, 4891, 1641, 1879, 4048, 2868, -287, 1582, 915, -2870, -2161, 1084, -176, -4191, -1959, -302, -2973, -2924, 2023, 979, -2638, -693, 2679, 596, -1512, 1544, 902, -1919, -112, 2946, 1146, -531, 2284, 3452, 19, 220, 2567, 105, -2418, -94, 718, -3420, -3974, -1181, -2175, -3491, -908, -118, -3740, -1902, 3175, 3976, 1551, 2328, 4141, 2778, 1896, 3926, 2061]
870B061l100Q52M21k774R3Q24j622j537L198J944k478J35M022O5l081K377J712
887C112l437j407N165P83m690j141K797O36k031J123O23l839O43K373l75k046
903a711P33l00l340J414L005j341j575K569K549j507P70L236j314j624K274J756
919E594m377j676K962j003l508K49K70l964j048N396J478m614N57M254r41j28
935d99L075J086l425M19L297m84j932O64K38l147M11J422o54k207P21J438k527
952b104O1O52j828l09K118P87k404M20K676J205K52J615N15k365N43L160l29k088
970B577o6r25k895o52K228k161l687Q28J500j594L08L162J319k904K846L538o56
987B766j635K129J608j623J85O98l376j352K893l91l845m87J547k041j036L441
$$ y = [2061, -1039, -187, 234, -2540, -2447, -1623, -3245, -4782, -1584, 360, -2118, -1983, 2039, 2104, -977, 1400, 3112, -325, -1732, 3433, 4216, -474, -1615, 1182, 1818, -213, 910, 1533, -2306, -1663, 710, 335, -1711, -978, -1278, -4618, -3204, -199, -1540, -3115, -546, 2003, 496, 1266, 4502, 3188, 1564, 3838, 5594, 1217, -459, 2503, 1500, -2008, -1759, -1489, -5453, -6501, -1105, 373, -4241, -3684, 570, -371, -499, 2576, 3662, 237, 656, 3953, 3469, 1537, 2201, 2439, -708, -297, 1125, 471, -1736, -1015, 423, -2104, -2043, -1391, -3219, -3528, -1410, -623, -3027, -2607, 69, 1274, 1526, 3141, 3656, 1291, 1834, 4994, 4665, 2577, 2511, 1586, -1309, -1961, 267, -1894, -5581, -4753, -3253, -4847, -4539, -1377, -58, -2962, -116, 3422, 2766, 1131, 3260, 4868, 3245, 3430, 4128, 752, -600, 2293, 1902, -1943, -2430, -883, -2924, -3960, -519]
1003e19k66m602J7M269N93j978K027K698k032r8M359J000l277K01K223k77k501
1020A837M92k46l240n95R18k605j877J30R38k41L04J708m23K09L083K723L17K56
1038C688n59l06O42K193q07l728m49k76j376n86J474k348l202J362L620k743k213
1055e614L300K461k658K97M246k42k522K704M002j884k731K593Q55j226j26N23
1071C978l401j901n04J62j803m53l99k602L43L542J620q90R80K720R9P54L209
1088E454O11k013N53J549j789l426N30r51k746L95J92k202k889K290K638j810
1104c614m95K677m1p89K677K941k040j484K182K144q63L87O13r31j489P11M46
1121C032k935j585J71p95j206o90n96r95O18J799q03K93K849J409O26L007J853
$$ y = [-519, -785, -5387, -5370, -1101, -508, -2486, -459, 2239, 207, 109, 4468, 5468, 2191, 2392, 4615, 4338, 1837, 2329, 2083, -1157, -1752, -834, -3439, -5316, -5186, -4248, -4489, -4185, -2477, -2900, -2691, 392, 3115, 3432, 3688, 3129, 2823, 3465, 5658, 4851, 1123, 674, 398, -978, -1564, -90, -2438, -5640, -4278, -658, -3401, -5614, -2314, 147, -2511, -2214, 2032, 1790, -732, 1972, 5974, 4090, 1359, 3952, 4807, 3581, 3455, 3978, 577, -1324, -1828, -1666, -3469, -3922, -4321, -6923, -6580, -3038, -1418, -2308, -1328, 1392, 1491, 2245, 5454, 6065, 4052, 4605, 6154, 4365, 939, 1469, 518, -2228, -1833, -1641, -3843, -6732, -4442, -1804, -3614, -4109, -1432, -1473, -2262, 415, 3356, 1316, -168, 2014, 4158, 3295, 3682, 4295, 3364, 1875, 2586, 3032, 97, -1488, -1317, -2112, -3318, -4008, -4604, -5599, -4981, -3182, -3985, -3692, -843, 566, 1192, 4199, 6052]
1138F052j663k63K446J57l129q77P85l217m009J997J0l702j444K182J80r55K024
1155c426J943K05L73K077K072j110R11J595j127K3Q44j007k536P87Q42k517j444
1172a495O19k17l118O97J606k407j579K230O02k5M97K843M12j23K129K301n86
1189D386M77J327j294j986N69q4l330j977N29j811k620L63J081o36l40K239Q49
1206b258j7J791K186j3J199J503K24j125Q98J80j536j228P38j905l033P79J374
1223b43k825j505J394M46k265J183K976j338r99K556K417j568J561K414j13r05
1239C186J488M33k252o43L68q58k620l07P5k933o49J072J41k025J358K118n98
1256b646J771K706J018k070K263K302j268j622J727j88k991m92J525j786l677
$$ y = [6052, 4389, 4126, 6572, 6729, 3600, 2723, 3508, 291, -3718, -1721, -1711, -5413, -6857, -4675, -4495, -5450, -3426, -1483, -1278, -905, 1172, 3244, 2134, 3045, 4640, 3513, 3536, 4380, 3373, 837, 1624, 2466, -51, -1495, -876, -1093, -4211, -3514, -1908, -4315, -5894, -3664, -3062, -3087, -2590, 253, 665, 542, 2671, 4972, 4386, 4863, 6190, 4896, 2910, 3479, 3395, 65, -1912, -1383, -3194, -5814, -5451, -4370, -5006, -5346, -3107, -2258, -2275, -484, 1702, 1689, 2888, 4391, 4615, 3490, 4388, 4568, 3032, 1804, 2542, 637, -2396, -1617, -243, -3068, -4573, -3179, -2733, -4998, -3815, -839, -2177, -3176, -620, 1797, 229, 1790, 4204, 4091, 3186, 4674, 5107, 2855, 2212, 2580, 1722, -898, -1205, -1130, -4063, -4712, -3640, -3499, -5524, -4166, -2048, -2646, -875, 1831, 2849, 779, 3042, 5344, 4076, 2454, 4181, 3993, 1002, 510, 2035, 249, -3428]
1271c428J521J330k783p30J926m37j073J495J672j357o01K628O01k64J314J808
1287C622l93q32J554M8j284n03l10p12j310j362o48r96p10p71O0J185P78p48Q58
1306b474K979J204o93N19K920O9j947J266N72k659j831J044N71l785j338J766
1322a817j15j867J135J444p07l29J704O23k55N29J227l94k24J420o90q28O79J021
1340B556j254l0J21m70q67q4L80l58j364Nq51q41M83O15j185j00K494R76m89J474
1360A211K137m47q88K242m01j366r20J116j609k872m84J164j164j203Q11l1k15
1377b919K22K065O04J174K4Q95p03P11N80q23q64M56j515j60P93j87j967M09J412
1396B07o51j195P89J383j131o73J254r1j547J035J212j459o9Q34J061j160P18
$$ y = [-3428, -1907, -577, -3360, -4090, -2164, -2601, -3674, -2179, -507, -1864, -2465, 163, 764, 500, 1814, 3622, 3229, 2397, 3951, 3999, 2715, 2212, 1902, 1190, -120, -1482, -2130, -3126, -3836, -4607, -4547, -3362, -2584, -3332, -2474, 505, 1709, 1016, 1535, 4455, 4524, 2577, 3843, 4415, 1756, -75, 969, 1540, -2245, -3583, -1817, -1932, -3799, -2664, -1220, -1927, -2256, -552, 71, -184, 345, 1572, 1178, 954, 2374, 1684, 856, 1535, 2556, 1302, 1272, 1393, 923, 56, -28, 352, -6, -1370, -1365, -2216, -3057, -2574, -1959, -3144, -3244, -750, 226, -263, 1211, 3348, 2901, 2013, 4255, 3854, 2488, 1568, 2684, 1075, -1797, -2281, -1117, -2281, -3484, -2673, -2704, -2919, -2697, -632, -28, 1146, 1170, 2065, 1362, 2073, 2653, 1830, 966, 1422, -93, -253, 540, 353, -1614, -1205, 207, -444, -1639, -850, 533, -598, -1271, -17, -108, -1655, -620, 592, -867, -936, -102, 959, -201, 517]
1413E17J889J2k274J215R85k87j368l11l65k080P49J03n36m96O87R2J2O08J255
1432D07n50R73J523l52r23J233R94j919m98O35j161j872K63J711j206j644J239
1449a147L54j149Q05J479O3j629R56J355q62M1M11r4j275Q78L58j42o62M99N33
1468G72n43k0M44m31r20J013p94m63J84o37m71O03J617j154j160J207J725m20
1486E52O26N58n26o30Q55O82j530j458O54J53j014n43Q61l67j139J190L07l99
1504a168Q6J463k02kO45O44r88j58J191j99j052n09M09o66O47O24n13j392R8J193
1524A51p69K81K90p37r02Q58R50q09l74J204N47r57L88J400K5j181J329l2n11
1543A151j020j76J85p2j222l45q29J44P00Q49m03N27L74p29J270J234K84q11M00
$$ y = [517, 2406, 2418, 144, 1359, 2344, 2057, 689, 378, 13, -2067, -1318, -1215, -1751, -2247, -1560, -1468, -1456, -848, 407, -143, 830, 2353, 2001, 1078, 2311, 3305, 1386, 888, 1523, 362, -1510, -1247, 464, -742, -2386, -1147, -793, -1942, -1137, 342, 405, -1224, -268, 1087, 225, 266, 677, 583, -692, 186, 544, 402, -260, 239, 772, 229, 209, 653, 222, -698, 315, -479, -942, -758, -1395, -1866, -1263, 354, -800, -1960, -753, 972, 552, 1178, 1736, 1210, 580, 1435, 2117, 587, -871, -217, -64, -1078, -1621, -760, -1127, -2266, -1076, -769, -1168, -1082, 381, 179, 177, 822, 1466, 478, 320, 1511, 1312, 260, -249, 160, -506, 141, 765, 252, -1140, -1042, 151, -618, -337, -47, -784, -1686, -828, 122, -687, -1061, 143, 690, -267, 121, 1521, 1546, 365, 1694, 1662, 1151, 131, -45, 140, 68, -1154, -1499, -2328, -2184, -1484, -635, -1038, -511, -137, -866, 404, 1638, 1922, 1111, 1511]
1562A511nj044n12J542j143j458M64Q80q43j345J556n2n15J240J85j121M74J673
1580A487p6j999J52J186r79j132O45J663p94n81N41J468k83J56o93m36m42P7r3
1599a33q36m64n32m39R50M35P0J33J281J093r97J121J632q54j724J003q67q48
1617B4r44M11m45j460P25O82j469N8K777M47o11l8K207o72q43J082L08j961n32
1636b54o9K60p59j7o6L9K71Q80R92r45J159j058J8O54k21r28j085R13J29p40n98
1657a425J679m32n75J023N35L09L21K03j37n95j22l10j994l7Q42k28j055m30J678
1676g50j07k46J197J492o75N19J417m42j234R9Jj336j144M94m92j39j87l33P13
1695a153K26J502o84K0P74J276r15o38Q70q38j201O97Qj93q65R59J47M94q24L35
$$ y = [1511, 1506, 462, -50, 1492, 349, -1109, -645, 235, -608, -1953, -397, -449, -964, 276, 461, -660, -186, 1487, 1411, -588, -436, 750, -229, -1361, -716, 947, 153, -428, 113, 1581, 1298, 1454, 761, 325, -117, -40, -133, -969, -1433, -1965, -2404, -1454, -1019, -949, -816, 465, 1558, 561, 1682, 3314, 2460, 736, 1739, 872, 24, -920, -509, -954, -2414, -1689, -1007, -2476, -2418, 359, 806, 195, 157, 2364, 1692, 849, 1931, 2239, 278, -254, -323, -63, -822, -839, -905, -866, -595, 285, 1277, 332, 1491, 433, 451, 1105, 884, -44, -1129, -216, -87, -827, -1425, 254, -178, -753, 270, 805, 1114, 1435, 1638, 1501, 906, 784, 474, -1520, -1557, -715, -943, -1998, -2428, -750, -857, -1103, 94, 1586, 911, 1430, 2847, 2405, 1171, 1270, 1271, -65, -1209, -715, -1207, -1346, -1533, -1866, -1153, -927, 575, -109, -89, 685, 1961, 1046, 408, 1278, 440, -761, -64, -56, -249, -1114, -155, -8, 486, -338, -3]
1715cJ24k7O27m71k79q18N27k08m1k19k72M26L99J504o16K38K12K80p62P72M68
1736A861j414p89Q9P5j227O23l50q50R1P89R87l88L75R34j90j09J474l26j351
1755C04j57J099m97j337J75J25m73n6J184m96p07k70J893m0q49N8k97k94N08J64
1775C7n72q34J271L66L76Q2J032p44J83M62R4j209j049L23p73k04K02o71r32K76
1795b284J062O19n60Q81J114k55P11J130p67k65p1j88j07n44j7j533j144J543
1813f75J22n73k36L11jN06P81l92j29K42Q56o4r58k69P6K92L60M07n8n42M01Q43
1835A300k19p46Q76q95j175kJ354j288j258l85J033J97j30j53J337J31J291P91
1853B059k51m22N33P6p21m59l49l74o03l37j80q12o03J059l94K63J853L6j213
$$ y = [-3, 121, 94, 721, 250, -29, -847, -320, -528, -569, -788, -1060, -634, -235, 1269, 653, 891, 1103, 1383, 621, 1393, 1861, 447, -342, -253, -178, -1405, -782, -1132, -1982, -1891, -1102, -115, -503, -128, 806, 616, 507, 1981, 1655, 304, 147, 1246, 749, -588, -413, -288, -761, -817, 367, -129, -836, -1106, 787, 747, -102, -44, -341, -635, -127, 37, -535, -1369, -98, 268, 644, 726, 1758, 1014, 1197, 1659, 1753, 544, -505, -182, -955, -1159, -957, -1628, -2560, -2284, -1222, -603, -1163, -282, 832, 577, 1288, 2418, 1651, 1386, 1315, 1127, 1020, 476, 459, -1074, -2218, -675, -553, -1126, -1362, -1051, -1052, -546, 235, -157, -286, -44, 812, 748, -210, -479, -403, -111, 249, 656, 598, 56, 457, 1300, 1081, 335, 1211, 316, -859, -861, 493, -795, -2053, -2438, -1405, -1208, -1338, -1491, -154, -23, 1268, 2059, 1808, 1386, 1919, 1995, 1274, 815, 466, 92, -511, -848, -1028, -1840, -2443, -1384, -1778, -1515, 338, 374, -839]
1872h39O85Q50Q64n89L7q0L12o7K23n30j006r3L42n79J62M40n97N4l41N69p47
1893i30p26N52K71n69R02O46j83l61J131J190o72n57R97n0O4P81j251j079k10
1912e4j76m86p32j6J48q29j68J227K67m01O85Q45o9M81M00m17L40J099K80j135
1932A289n72j21l70n32J35j26r19l15l66J081l58P2J19m24K90J186R24o57L32
1951F68j8K8O23j92n35M04M7m2J63q57k50k14n62O4q71Oj75N31P6O78r67J050
1973c45K29l5R20O51l39j43O31j21M77k79o12p22L8q0o40j014K14m23j7Jm29L34
1995a704K7J041Q33j35n59J165N56p37O97K55n9j3p04R23o93j30q69q42k58M79
2015g27J12p59m11M57J04L26P28r96K86m41J430Q07K4M20L57O78n63L98p65r06
$$ y = [-839, -154, 696, 1560, 971, 1008, 928, 1240, 1173, 1396, 866, -140, -233, 109, -470, -308, 132, -465, -411, -752, -183, -930, -1656, -1104, -833, -1402, -500, 146, -37, -398, 733, 1923, 1251, 694, 1691, 1641, 1705, 2486, 1235, 156, -54, -230, -716, -1448, -1464, -1316, -2145, -2313, -1086, -819, -1220, -535, 310, 241, 722, 1122, 705, 1045, 2144, 2424, 1289, 717, 596, 226, -306, -171, -297, -1216, -1531, -1897, -816, -1174, -1102, -983, -1407, -1117, 69, 993, 336, 668, 650, 678, 1301, 1109, 574, 978, 1025, 983, 1146, 289, 39, -175, -737, -673, -1544, -1538, -1713, -1182, -1106, -428, -1395, -345, -116, -151, 769, 1420, 1081, 938, 1569, 1448, 1925, 1646, 1034, 312, 350, 270, -370, -1384, -1170, -1593, -1610, -1609, -2038, -1704, -1677, -636, 197, 62, -497, 668, 1224, 487, 1184, 1439, 1380, 1367, 663, 1586, 893, 763, -106, -948, -1206, -727, -615, -1374, -1785, -1328, -1224, -898, -170, -1166, -880, -1321, 109, 916, 940, 1360, 1717, 2395, 1832, 2230, 1465, 559]
2035E59N42p12m16l52j091j57k52j10N0o50J93P83J443j65N30P11n53J163L83
2054A899N97n31m73m4j8p96j53j092k60J40o54L17o2p83O46J24O29q4n85M73l21
2075a031Q60Q43O89l77j83J10J575K61o47p34N6k27L5r70l21j557n70O9m80l55
2095b954l13P58N56J011K90J271M98K2J557K47M87m64n74L18r05p06j552r17r4
2114a464j48q57J81m61M46K55J90Q17N51K80L79L96JJ038O71j193M92k9O25j075
2134A095j41K32o65L25J1k62j222p94k93p9q17l95L77K48M47K93J266P69K23J185
2154A803P83R54J71n41l97M10m96j054j392j328j019l95m76o89k15j85Q99Q49
2172b318N65J331P51Q75N90J273K71k80l47k14m06o29Q6p77r08k12j60n62l46
$$ y = [559, 1101, 389, -27, -379, -1470, -1627, -1879, -1989, -1939, -2589, -2396, -1613, -170, -335, 195, 906, 353, 1516, 1899, 2496, 1965, 1492, 1448, 1430, 634, 481, -611, -871, -731, -1385, -1068, -1130, -1913, -1267, -1143, -514, -598, -1183, -710, -1031, -171, 672, 1361, 984, 801, 911, 2486, 2747, 2100, 1366, 1422, 1195, 1230, 260, -61, -1618, -2188, -2119, -2599, -2954, -3267, -2509, -1953, -942, -652, 619, 1117, 1139, 2696, 2943, 3430, 2966, 2392, 2710, 1805, 1099, -453, -1370, -1464, -1612, -2469, -2288, -2749, -2303, -2048, -1858, -1041, -490, -210, 169, 565, 566, 1604, 2275, 1082, 1574, 1545, 2170, 1095, 954, 1186, 521, 846, 857, 595, -627, -1421, -1714, -1793, -2610, -3005, -2628, -2380, -1933, -1640, -374, 395, 618, 1803, 2586, 3540, 3711, 3170, 2773, 3183, 2687, 1633, 241, -1087, -2106, -2501, -2977, -3666, -3881, -4066, -3167, -2318, -1753, -422, 329, 1204, 1794, 3067, 3338, 3058, 2711, 2497, 2091, 1462, 1548, 771, -137, -349, -509, -1071, -1417]
2191a417q26k35l11N92J01L72LN22J82N54J210j27K95O59J227P44j37n31J03j220
2211A760q4n59k175o01j137m17K35r65k7K55K64J050J604J179l28J633J365M94
2229C546K65j75r10N06q48p66j23j579p41j192l86J47j254j50P33L52J377o1N2
2248a207R38M84N04J370l08j84O17M53q6K3j09n80q74l49n04o78p05j309J57l1
2268b378k80l01n73L14R72J619K35N56P92J770O79O03l05m26p93L42q20n45j007
2287D54j510j065p46l75l39j22M21J53O33Q15O48Q89N5J368O64K24m9O83N42K03
2307C546p91j00j329j065n96j84m38j243m76l59Q36m08J14r44J119R11O01O68
2325a38N48J024M42R13J31N37o43k09j04o55j29j036o88j936m92j88q83L00l65
$$ y = [-1417, -2243, -2478, -2789, -2197, -2096, -1724, -1721, -1199, -1017, -463, 747, 620, 915, 1574, 2801, 3545, 3408, 2877, 2980, 1760, 1676, 1117, -1058, -1659, -2796, -3213, -2978, -3943, -3970, -3715, -3451, -2401, -797, 382, 54, 1687, 3052, 3546, 3811, 3636, 2726, 3232, 2384, 1618, 1495, -84, -825, -2017, -2403, -2256, -3510, -3660, -2927, -2575, -1198, -1259, -1207, -269, 215, 719, 2089, 1781, 1597, 2214, 2667, 2581, 2604, 2495, 1915, 1041, 692, 188, -490, -1195, -2504, -2347, -2378, -2658, -2959, -3532, -3218, -2246, -627, -392, 164, 956, 2726, 3405, 4008, 3703, 3277, 2484, 2826, 2006, 1461, 454, -1056, -2121, -2867, -3242, -3581, -3703, -3282, -3129, -2496, -1681, -1033, -144, -89, 1279, 1943, 2167, 2118, 2801, 3343, 3546, 2755, 2655, 1326, 261, -335, -519, -957, -2200, -2676, -3035, -2199, -2607, -2493, -3437, -2318, -1407, -806, -138, 410, 1434, 1876, 2789, 2920, 3457, 2814, 2605, 2501, 1846, 1717, 681, -7, -1943, -2435, -2623, -3506, -3206, -3571]
2344c571O48P79L70J049R9L97J281J518l61Q09J63p5l72k42n20j014k41q92m97
2363f72n38p44k83l1m02J14m32J104N9J042J43J282N07M12Q05M38j80L53o8p97
2383B112m66l55k25j130m90j200q03M74o54j51m60P69P24K18J165K91O27R04Q29
2402B179O67pM1K47k58q48n60q41q10k62m00m64m40m19n12Q7M05L01J20M66O54
2423f54Q04R60P50n59O06N5M65n83l55p9l2p10J12j88j686l08L53p80n60l70P7
2444b682j69P62O27Q87J31M07J388R81r6R46k32n21n6l96r4n54j535q71k86j68
2464a531q12o15m49M12J099j91J047L94K60J720K8L75k28L57j1J38l55L17q33
2483A122j1p89M84j103q58n30K16l47P39M5q28L52j74R06n44Q97O92M13J57J047
$$ y = [-3571, -2923, -2144, -1774, -725, -626, -229, 1052, 2570, 2209, 3018, 3181, 3106, 2734, 2492, 1972, 958, 717, -175, -672, -1210, -1954, -2237, -2268, -2670, -2556, -2988, -1884, -1825, -783, -640, 642, 1149, 1561, 2366, 2804, 2624, 2977, 2909, 2112, 1646, 1291, 1066, -64, -554, -1754, -2557, -2083, -2737, -2888, -3348, -2579, -1855, -1637, -472, -181, 446, 1350, 2179, 2846, 2839, 2880, 3127, 2869, 2021, 1461, 620, -190, -452, -852, -1316, -1756, -2175, -2687, -2600, -2195, -1894, -1774, -1308, -654, 150, 1110, 1860, 1301, 1907, 1962, 2427, 1844, 1489, 1410, 1378, 668, 780, 592, -1094, -1402, -1049, -1829, -2389, -2759, -2682, -2851, -2089, -1462, -575, -444, -37, 1351, 2332, 2236, 3182, 2950, 2429, 2373, 1977, 1883, 1329, -206, -1077, -1363, -1531, -2343, -2958, -3407, -2995, -1896, -2087, -1040, -646, -386, 1334, 1362, 1737, 1509, 1866, 1855, 1993, 1638, 1955, 1122, 1111, 322, 806, -297, -1155, -1685, -1469, -1816, -1077, -1032, -1860, -1508, -1682, -776, -1320, -423, 269, 682, 839, 1886]
2503A886j25O27k55N05m91j82p38q77j012K79j030l50o75o27l27R40L66M08P33
2522i45J48J587P61P25K01L36j90l42J4o91k02j010p29p57r1l24k47j86r1N76
2542a457Q0O68o10R81N07L88J40r14O66M90L78l53K95P9J61K28o83n29Jk23r02
2563f09J26q78l91n5p1l91l14N44J112K97M23O11J146J12P88K85k46M01p78q6
2583B026j053q55n70p20o92l03j96k76M19J5N81J059P71k42M64K59N43N8N08p8
2603A718J97n34J65l39p36l5k92L53j103km06k56j16L83k83L38p79L32O61O01
2623a33j97O44L57L64N16K63P63q59L46p10l0o64j80o46r20r16k5M06n62K61M05
2644a517J08N30O69J50L80P15M33J33N83n52L59n33o26o38J96k83p58p56N15m25
$$ y = [1886, 1761, 2388, 2133, 2638, 2147, 1965, 1227, 350, -662, -383, -1413, -1763, -2438, -3065, -3392, -2452, -2086, -1678, -945, -797, 790, 1551, 2276, 2477, 2813, 2623, 2281, 2295, 1604, 1402, 392, -337, -1094, -1185, -1509, -1756, -1942, -2033, -1457, -1377, -709, -1319, -338, 169, 557, 697, -217, 449, 939, 1317, 964, 1259, 1338, 1499, 1727, 1044, 515, 516, 293, -609, -483, -1361, -1752, -1807, -1878, -2269, -2583, -2039, -927, -630, -207, 404, 1550, 1662, 2450, 2735, 2489, 2890, 2112, 2026, 973, 118, -452, -1172, -1864, -2167, -2363, -2639, -2220, -2205, -1624, -565, 206, -36, 428, 687, 1230, 1288, 1796, 1718, 1915, 1381, 1546, 1207, 471, 436, 144, 497, -606, -608, -1014, -1270, -1386, -1003, -1286, -948, -1727, -1395, -734, -133, -330, 314, 671, 1035, 1551, 1814, 2577, 1718, 2064, 1354, 1324, 660, 480, -166, -1086, -2002, -2027, -1621, -2183, -1922, -1517, -1409, -879, -210, -60, 320, 1035, 1468, 1601, 2184, 1632, 1991, 1458, 832, 194, 390, 107, -651, -1407, -892, -1317]
2664a317l27M29K05m78L48K4j26L63M60O44L14L21k29J124k85L29o40j03J73n32
2684F97J7r84K95j106r75K51K75J9n10L71N60N10J44M79M18P10J43N02M72p72
2704A516n28Q25n06m32q97m40l1k13J03n31k65p18R67k83J20K30J26J128n88J150
2724G33j44M29J12OJ21N45k66j15n04k69k35n11n99j26q90R2p32M90L69n60J061
2745i93K6N32N93O68o3Q69O14L96p85O34j161k34k99l98j446M62r06L32k48m99
2765a906J97L30O64l83J65N91N45O34L74l36O39o70J08J02j59L90m14l53j42r8
2785B78l57j34q36q23M21R3k75L83l4L75N65P5M01M73q7P43J091n89N09l90r14
2806I68k65m9m26m01m20j022K12K1j17j14o4M25M02M74M66O25j28Q70M72k77l07
$$ y = [-1317, -1644, -1215, -1010, -1488, -1140, -1116, -1242, -879, -419, 225, 539, 860, 631, 1755, 1470, 1799, 1159, 1056, 1229, 697, 714, -270, 25, -1081, -2056, -1805, -1530, -1511, -2021, -1650, -1090, -580, -436, 43, 461, 1171, 1314, 1816, 2288, 1516, 988, 1813, 1307, 875, -22, -462, -493, -706, -603, -1134, -1399, -2117, -1150, -1433, -1313, -1083, -957, 171, -417, 733, 589, 1018, 1130, 1136, 1257, 1802, 1536, 1421, 917, 648, 413, -98, -697, -823, -1713, -1621, -2353, -1863, -1494, -2054, -993, -967, -435, 158, 826, 763, 1632, 2246, 2642, 1857, 2491, 1330, 1096, 797, 399, -1047, -585, -1491, -1159, -1407, -1906, -1709, -1379, -715, -1098, -933, -342, 203, 837, 1211, 875, 1514, 844, 952, 1054, 895, 1285, 871, 518, 376, 278, -79, -213, -1049, -1872, -1451, -1358, -1633, -1250, -1284, -909, -344, -269, 132, 605, 518, 1261, 2352, 1763, 2272, 1882, 968, 703, 654, 228, -173, -593, -1615, -1403, -1382, -1499, -1613, -1677, -1252, -850, -376, 90, 715, 587, 1457, 1929, 1652, 1345]
2827A345l05j47M00k89o0p42o09k16K37q81K50l19l84M71K20N77m36P26l97J146
2847E87k01j35P46o8M09K85k55k67m13k85Q2n65j78M6p97J20r7n55N42m56j74
2868a629J080M83N67m3RK48Q82k34L91p50J79j43n8k95o12m48j93k87K0O3r66
2889a736J45L86k26O22L37O5N3O16M20N74n4j63J79R19l15o56l22m16m5p37q45
2910a199L00K8r99K78K60K28J74k45O26O52L32pJ83j70P03M90k66k3m72n30J20
2931D63o00M3j73l25m79M41k25j96r1K32O99q6J04k3J87N1Q37p6m0O31k39O8L74
2954A577n27k0j05r12r9l64K95p56n00k42L03K01k31P73k36L08O13P41L61j47
2974A033K69M42L67n64o99m94K01k24k23q65p07K1L8K11m07J65K18M62P50j32
$$ y = [1345, 1040, 893, 1293, 1004, 944, 202, -407, -623, -386, -1267, -1017, -1336, -1720, -1249, -1029, -452, -888, -162, -559, 587, 386, 251, 997, 929, 1338, 1623, 1368, 1101, 688, 403, 485, -80, -258, -212, -1009, -889, -986, -1541, -999, -1455, -1629, -549, -66, 501, 458, 467, 715, 1597, 1363, 1754, 1004, 1183, 1040, 982, 687, 75, -373, -566, -853, -833, -770, -1736, -1591, -1205, -1431, -809, -472, -407, -354, 262, 682, 1256, 1202, 1039, 1218, 2137, 1822, 1166, 844, 428, 383, -354, -1199, -899, -871, -1870, -1592, -1332, -1104, -930, -1175, -549, 103, 435, 428, 611, 441, 1144, 1634, 1368, 1345, 873, 343, 463, -137, -94, -267, -592, -1071, -630, -855, -1051, -1142, -910, -211, -297, -193, -216, -29, 22, 859, 783, 743, 1374, 1135, 1203, 1577, 1050, 1030, 925, 13, -86, -450, -155, -911, -1411, -1653, -1350, -1149, -1380, -607, -843, -535, 78, 819, 1180, 1033, 1302, 1744, 2111, 1547, 848, 354, 555, 331, 108, -757, -1464, -1443, -1405, -1194, -1601, -1436, -1218, -756, -6, -138]
2994a38R06o0K41mL35k85k68L62K30n12p73N47r20M89n28k00J5l31N3l6j58M84
3016e51m26R9J39O48j7N96M91k10K62J95l16Q34r25j72j34o73j02O8k96o21l31
3037a442j19K29m54R03j1R6J048N58o09O59L8K9Q59k96j15j62r05Q0K76j467k58
3058a063P15p38M94m69K04j46m0K25M28K65k66O10M25P93j50n47J91N30p4p46
3078F41k28j46k3n70k38O9l03r43J45K74L67m26Q21k13j21R07O78p8N16O9K36
3099A434L9m6l69k40j74l75k27q28l39K40l47M68m81O2O4K42M37QQ5O9Q48J48
3121G18O85K69m35l93o2L34J47q45l45L78n59o01j43m36m61m83P81K91r2M57N7
3142g38O73P35K49L73L2M14J71O5o55j12n57j18m71o15m31q02N02k55N2O04k73
$$ y = [-138, 768, 708, 949, 945, 1280, 995, 727, 1089, 1319, 807, 34, 581, -339, 150, -378, -578, -563, -894, -841, -877, -1035, -551, -977, -878, -739, -91, -108, 488, 979, 769, 1031, 1226, 910, 1744, 819, 647, 513, -160, -262, -194, -490, -1111, -1442, -1561, -1332, -1786, -883, -894, -798, 250, 808, 199, 858, 896, 925, 1784, 1488, 1373, 1211, 306, 386, 662, -805, -1063, -348, -1086, -592, -1061, -857, -1003, -1043, -818, -390, -125, -391, 219, 644, 1437, 1287, 740, 931, 1461, 1387, 641, 413, 267, 244, -326, -564, -495, -798, -1741, -1596, -1322, -955, -1381, -560, -773, -894, 13, 691, 613, 1129, 1198, 1434, 1473, 1427, 1058, 818, 644, 269, 42, -786, -1125, -885, -1232, -764, -1245, -1183, -1119, -877, -440, -432, -347, -278, 570, 718, 1403, 1672, 1237, 844, 782, 1116, 1263, 418, 73, 451, -108, -709, -852, -1288, -1749, -2232, -1451, -1160, -1252, -795, -738, -65, 670, 919, 1292, 1324, 1738, 1909, 1974, 1319, 1207, 650, 532, 61, -554, -985, -1787, -1285, -1540, -1488, -884, -1157]
3163a157l4L53k9Q44O0P13Q2K38Q4O7k47K5l13O5k93k47L33o31L1p90P7o12P0
3186a311N39p42K82J20L21L48o3K60J406n67J109j6j56N54q74K00m92k83j18r7
3206D20j101n71n08N1J73n23Q22j75K54K95N18J014j33J086m20J40P05k39j91
3225A617n78l47l8n05k15l57p23Q8k19J39n3k88N24n69J162L8J14O51K78k75O05
3246A049M33k86L0N39j32J0o28l32p28j40p87k15m95j13K04l63M61K04M18P9N65
3267b27O89J71O42K28K0Q46p25J24q01l14k93o14j38j20k38m95J4K0p4L6k78O14
3289i13L7N25P64k00M13J64K14m04O26j10k1J44j21j57kp04o54K42o33o95N0m82
3311a917P7N25j99R73o46O66N84N73Q59N75j73N1p0J98n81q31Mq11m36n35k19
$$ y = [-1157, -1191, -838, -867, -23, 37, 750, 832, 1070, 1154, 1221, 974, 999, 686, 751, 458, 211, 544, -87, -56, -846, -769, -1381, -1311, -772, -1514, -1232, -1112, -791, -443, -506, -246, 1160, 593, 1702, 1686, 1530, 2084, 1210, 1410, 918, 635, 517, 420, -681, -1252, -1760, -1709, -1536, -2059, -1237, -1412, -1158, -863, -345, 669, 536, 1622, 1202, 1342, 2047, 1808, 1617, 1039, 692, 654, 149, -66, -423, -1146, -1058, -1277, -1138, -1191, -1479, -955, -1524, -362, -324, -210, 441, 719, 444, 1049, 1482, 1196, 1226, 1765, 1633, 1643, 1015, 683, -45, -185, -972, -1187, -1682, -1795, -1591, -1954, -1493, -1289, -871, -792, -227, 462, 633, 1275, 1503, 1523, 2369, 1644, 1768, 967, 653, 360, -254, -392, -512, -750, -1245, -1231, -1211, -1285, -1249, -1527, -913, -876, -351, 413, 213, 626, 790, 1004, 600, 1226, 1116, 1095, 1239, 1118, 961, 959, 255, -399, -157, -790, -1485, -1435, -1917, -1840, -1315, -1514, -541, -1187, -521, 63, 636, 1495, 2070, 1897, 1948, 1878, 2076, 1495, 664, 668, -143, -579, -1114, -1333]
3332a333m04j09K59q7M06l06J041Q9L25M35J75J06K00N44K13m61K59n46k06O77
3352A277q52q3l76k24m23j29k71n38K36M30n33J43j08N65M96J49O52N33M40q1
3372A303Q35n7j18Qp44k06n07p65q55l62k82k34l73j65M26J19J191o84J542R57
3392A029l52M30N10J66m56K81L47j368L87m00n45l66l56m03k61L37o7m58O76k10
3412a079L20J10R3j87M00K21L49K05L90N21L9N8j50Or1k45q45m60l95J58j021
3433a603K97l93m20K0N70M57L39J77K89N91K51J272j00J81R0k04M07j168j28k39
3453F86o89q25m5k12o60K79m33N59l77O25N73k55Q33lL59K21L59P81k65j29J6
3474A398o38j85j92l93j7o01l07Pn14N62q87N90n70J052J80p5M30k32M60R52K70
$$ y = [-1333, -1737, -1846, -1587, -1674, -1268, -1574, -533, -444, -119, 316, 491, 597, 797, 1341, 1554, 1093, 1352, 806, 600, 1277, 425, 342, -34, -258, -681, -810, -1081, -1619, -1383, -953, -1486, -1343, -1451, -886, -390, -241, 411, 944, 1384, 1303, 2138, 2081, 1963, 1971, 1227, 1021, 514, -251, -1106, -1468, -1750, -1984, -2357, -2522, -2096, -1977, -786, -1470, 72, 1029, 677, 1107, 1617, 1783, 1327, 1608, 1955, 587, 974, 574, 29, -337, -693, -1096, -1357, -1020, -1087, -1545, -869, -1079, -759, -649, -556, -743, -343, -122, 227, 432, 822, 1343, 1382, 1440, 1290, 1296, 1205, 960, 115, -345, -740, -582, -1603, -1306, -1699, -2119, -2099, -1529, -1072, -733, -556, -267, 324, 575, 1847, 1747, 1928, 2018, 1814, 2221, 1053, 925, 686, -3, -828, -873, -1085, -1745, -1466, -1899, -1340, -1717, -1092, -519, -774, 59, 56, 415, 636, 995, 1776, 1511, 1382, 1398, 760, 575, 383, -10, -27, -628, -935, -928, -1442, -880, -1767, -1177, -1747, -695, -515, -590, -160, -392, 68, 1020, 1290]
3495A290m0K83k38L34n15k01l79%q73l09%m81Q5m75O0J85P0O9J52K80j86P95N05
3518D11k8O43L70K10r6r2l35rl22k44o36m82R0p69m53M81m72l69M95J13O33J99
3540f62R34K26L20Q02k26M24q1K57l38r20Q7j41j091k5p4q26J64K13q97M03K12
3561a239J90L16o5N35n3L24O94j91O69k98M34K74l71p10J81L45o45k49n06p27
3581a092J85O7n55j97M95m13L25K69J53P76P5K83J156j10k62L94N9j88m55K09
3601A174n82o97M04r86m14m6K1k00P9j92N93M69k13O31k67P35M07m29Q70n98M10
3622A169L11M7k09k30o69o2j97p18O1m64p0q69K09L37k55j93P42L56J243m39J28
3643B28J030J56J81J38l94j06j60o44R1l03o08n87k96K43l25n6O52l43L87J49
$$ y = [1290, 1250, 1533, 1295, 1629, 1114, 913, 534, 534, -339, -648, -648, -1129, -1044, -1519, -1459, -1274, -1204, -1135, -983, -703, -889, -94, 411, 383, 1026, 1396, 1606, 1510, 1418, 1083, 1074, 752, 508, -128, -610, -520, -1289, -1742, -1261, -1733, -2102, -1607, -1494, -861, -662, 272, 498, 818, 1620, 1394, 1818, 1737, 1994, 1656, 736, 823, 682, -409, -434, -508, -1334, -1170, -957, -1854, -1451, -1239, -1049, -733, -798, -263, -316, 8, 702, 511, 1180, 882, 1316, 1590, 1219, 509, 690, 1035, 390, 141, -365, -1092, -907, -840, -1395, -1592, -1097, -1510, -1185, -916, -763, 13, 88, 371, 1527, 1417, 1155, 1549, 1608, 1420, 965, 1174, 592, -105, 299, -687, -1101, -1147, -1126, -1326, -1247, -1439, -846, -377, -590, 41, -226, 509, 916, 487, 1357, 759, 1169, 1480, 1527, 1318, 1088, 419, 357, 160, -558, -497, -961, -1031, -1900, -1691, -1354, -1609, -1802, -1060, -704, 539, 100, 228, 1258, 1414, 1595, 1733, 1339, 1233, 1073, 429, 520, 217, -391, -978, -1274, -1031, -1356, -1412, -760, -1103, -716, -567]
3663e67L25K34n8L19J46P2J83J96o5j16N79j71q14J56n91M41J09p20k62p27N82
3684g49n22p4j97l15Q29L54N95K94P46L67l01N99mL36o00j57m23p80O03j508l51
3705a258m05P72p16M66k15N68M57q7M15K19%Q28N6L20n5m69K17j85k49m81J20
3726C18K2o65l04m5R8j79J61n40K68o0j88L16M27K32j11R28l22J83N5M77m37R96
3748A630k7r19J50o83j00n13K9n48l18o2o92M88J94K24K74R61R4L60J4K54K76
3769A086P45j98o36n21N87j042k10n9q5l10k11J37L30m00j55K06J03R46n24K10
3789aJ70L55r2P3k48K8J096l61J83q54M25p19J27n82m25K99k57J1q84M40K80m30
3811a366O92J91P42K19L80J71n5o2J97L80m15j01o58j63p5n80n7j22j39J6j93
$$ y = [-567, -242, -8, -66, 253, 399, 471, 654, 850, 785, 669, 1248, 1077, 263, 419, -172, 269, 378, -342, -604, -1331, -749, -1271, -1345, -1542, -1857, -1028, -674, -79, 215, 961, 1328, 1027, 1626, 1622, 1958, 1358, 1201, 778, -2, 601, -907, -1258, -1663, -891, -1607, -1141, -1356, -788, -331, -418, -3, 216, 216, 1044, 1100, 1420, 1365, 896, 1113, 928, 679, 198, 318, 340, -325, -629, -674, -576, -755, -594, -1134, -866, -926, -1114, -798, -371, -139, -250, 678, 356, 539, 594, 1071, 634, 1630, 1603, 684, 834, 151, 51, -462, -433, -981, -1299, -1361, -2053, -1565, -1371, -1147, -873, 88, 182, 542, 556, 810, 1086, 1831, 1633, 997, 476, 1063, 21, -189, -248, -333, -643, -854, -717, -387, -787, -942, -736, -633, 313, -211, -1, 169, 524, 432, 505, 257, 285, 1381, 1020, 1203, 349, 774, 55, 182, -400, -825, -526, -783, -772, -1656, -1216, -936, -1366, -674, -483, 259, 478, 858, 1029, 974, 912, 1109, 1489, 1074, 973, 315, 152, 77, -503, -560, -682, -821, -805, -998]
3832i98j4L56m3L97J61jL48l96P22q8J53O56j062K60j87J41J97P82q19n54p1j42
3854b02k0m06o97j36P4K89m60P52o1K57M14Q19Q3l8L36j58M2L11m71k77q41j39
3876e29N21j077J80J48n05L80M38j89NN17M54J09L74k49j52j00j21K27l42M37
3896E26m07K62k00m50K07L54m91k4J45l57j63j46N61l84n90Q20k8q0O54Q26n06
3917E29r9Q44k83M4K47o34J93n36m94j62o6j70m51p55O02j8O25O82P1K92j2O22
3939A071n47N24n21J01P06p63m1o38J81k67m30O39n18K03k23j46L71n4M74J31
3959B53l81L80p79K46P09n48O70o0J04j00j52K23l91N79k68k42l13J13n89J40
3979d06k37j51o7m07O84l11N40m25J019N35K84j07j06K38M6J04l08q98k56nj18
$$ y = [-998, -1012, -656, -699, -302, -141, -142, 206, -190, 532, 444, 597, 1253, 191, 451, 264, 405, 602, 1384, 565, 11, -60, -202, -222, -628, -1325, -1461, -1387, -1098, -1558, -806, -867, -610, -196, 623, 706, 668, 1004, 846, 888, 1199, 728, 451, -390, -529, -8, -1085, -905, -757, -1262, -882, -444, -633, -628, -111, 343, 452, 826, 577, 425, 325, 204, 431, 89, 526, 119, 381, 181, -269, -62, 292, -199, -223, -78, -435, -598, -744, -183, -567, -1157, -337, -365, -445, 209, 1035, 529, 430, 1274, 991, 1035, 1282, 648, 841, 305, -189, -351, -417, -587, -1038, -1793, -1191, -1209, -584, 98, 169, 461, 449, 1071, 524, 1048, 527, 628, 1334, 571, 530, -108, 73, -194, -624, 15, -503, -300, -523, -669, -298, -352, 122, 253, -128, 252, -527, -281, 428, -120, 550, 490, 594, 494, 342, 565, 174, 753, 485, 243, -70, 43, -546, -406, -643, -794, -861, -1268, -584, -895, -355, -780, 239, 774, 1058, 951, 845, 1083, 1129, 1233, 925, 27, -229, -234, -352]
4000c52l96J06r6m18R8l95R82l3K00k07M21M86n73Q13k97L14j50J09J00K23j32
4021H03j16p58M3L70o81m59M19M95q31n68L21L21L97j93K52N97j50M86j80M77
4041A045k74M04j06l4o35j95k85j7m49m56K42lk25r9j87P01LN04M27k61K5O94
4063H19j0l44J53l67R56n47l7o21O4m47L75l02m01k45R0K31m99O49k20J33M77
4084i3O5M01m3O15k83K41l48M58l72L53k75O9m31k48o67k64l35L90p33L81L25
4105g94k07O68m89P25l25L54P30o9M00N31r87N4L90p2q89K12o06N71l06o82Q44
4126E3j158O34l00j32L53n07P45L33K35l01R34J85L4k55M47m66k82m94N14k07
4146C65k90l48p26m4N50k13j99j27j39O63M1p2R92j27K10N64k27N1l43L22k0j47
$$ y = [-352, -748, -642, -738, -1156, -1058, -1453, -471, -504, -304, -511, -90, 396, -177, 636, 339, 653, 503, 612, 712, 935, 803, 687, -71, -28, 342, -339, -798, -379, 116, -715, -1283, -962, -641, -244, -437, -185, 412, 262, 748, 568, 1045, 771, 1175, 1069, 1035, 400, 205, -80, -97, -546, -1002, -760, -763, -988, -1087, -1274, -573, -570, -66, 361, 100, 125, 819, 809, 465, 618, 251, 1207, 660, 623, 2, 66, -381, -6, -308, -709, -954, -864, -633, -1132, -483, -703, -570, -93, -28, 373, 330, 945, 662, 903, 555, 1013, 641, 994, 719, 788, 357, 109, -558, -822, -1157, -767, -1500, -1119, -794, -1001, -333, -822, -97, -422, -68, 662, 593, 993, 1524, 537, 591, 981, 909, 20, 232, -374, 197, -109, -791, 53, -1105, -471, -771, -903, -550, -1057, -312, 21, 256, -45, 889, 1074, 1108, 853, 1300, 834, 552, 58, 572, 365, 75, -273, -999, -1043, -493, -706, -905, -1032, -1171, -508, -467, -539, 453, 326, 536, 1100, 873, 924, 581, 903, 883, 736]
4168G36n5M26j034j43j57l58m33N1oK1j43K98m9K97l9O33J32K74L80m28Q37j7
4190A223J86m47p02L33M0q56k24K65n61j94k47R7n77O99q5J22N31M72k55O48Q6
4211E54N06n40M57M48l46K21m08l34m11M7j04k25j014L07l9n47j99K79O61K55
4231d32l15M20K85M77O85m50M72j48M76k9k56r4n17Kq00l69K10m30l54j5j39P03
4253f18m24O16k22P30J68J88L86j97N42R1L47k81J27l30j065K18J29q16K91o37
4273g57J74j21k2j78p22M70L20l26J032o26J217j48L57J83nK62l56O82l26k37
4293H73K6k62J7j439J57k12k48o6J70q75L88O91o61O29R34L65M76R9k19L10K41
4314A394J33n72j82J3j76o73k22K69j92o69l35P5O4KQJ10R83m91J09O63NP86l70
$$ y = [736, 681, 1107, 73, -70, -227, -585, -1018, -967, -973, -952, -1095, -797, -846, -549, -588, 45, 177, 451, 831, 403, 1240, 1223, 1409, 962, 260, 593, 633, -223, -447, -182, -743, -937, -1184, -1087, -1664, -965, -1050, -928, -397, 75, -180, 468, 554, 1060, 520, 977, 1425, 1079, 1300, 892, 558, 147, 194, 90, -135, -1149, -842, -881, -1428, -1627, -1348, -687, -432, -747, -327, -42, 435, 1120, 670, 1142, 994, 1470, 1441, 1185, 1091, 574, 576, -224, -593, -383, -813, -1167, -1182, -1321, -618, -1042, -426, -648, 82, 250, 438, 824, 627, 1169, 1260, 1607, 1326, 1453, 1123, 58, 276, 405, -411, -120, -757, -583, -704, -726, -904, -1626, -1156, -836, -1162, -130, -756, 461, 313, 670, 853, 848, 1110, 754, 1436, 1110, 873, 899, 637, 654, -785, -628, -840, -1088, -1154, -984, -1859, -1471, -780, -1441, -812, 122, 487, 963, 1062, 843, 1153, 1394, 1527, 955, 773, 786, 610, -63, -285, -16, -208, -877, -1212, -1137, -1073, -1071, -1063, -953, 30, -461, -352, 311, 316, 1102, 732]
4337G32N50k63O0j22P5L9m18j59o12L31p08J60l53m19p7k05J60j64Q24J6Q73p1
4359B49n6Q99l16J25K6M75m23J34k24j58m3o84L03m63j05j220N30k37K43Q4k37
4380a098K54P68K54l65O79q8L74L41m44L78o5m64L43o8j345O09o88K92p03N0P5
4401i11R3j31O3L11j53M17M02l94O44K70K62M18q7J02R7o84L98N4j043M26q22
4422b68o05K56o94o4L57o16N99J99L23L87n88P55N06j49O71N17n04j72m33O80
4442A157m36K30p94j77j53n58j94j86p0o45N09l1N55N67l00L45M1M81J85M21j60
4463G87jL13j00k61j34k6l38k83r9j030L70n77R7J90k18P59O5j6J24p3J37J018
4485G04k23P87l84J12L24P1o94m62Q8o4q23N28l36o57KJ29k17j2L2l94R53L87
$$ y = [732, 1282, 1019, 1079, 957, 1032, 1071, 653, 494, -118, 213, -495, -335, -688, -1107, -1184, -1389, -1229, -1393, -569, -553, 320, 249, 193, 1092, 776, 901, 927, 1402, 979, 1113, 889, 731, 688, 4, 307, -156, -261, -1481, -951, -1188, -945, -861, -1098, -844, -76, 178, -187, 492, 404, 778, 1119, 675, 1053, 988, 524, 867, 799, -546, 63, -625, -333, -1036, -986, -911, -818, -949, -886, -575, -728, -311, 91, -303, 341, 611, 873, 1291, 1204, 1306, 1403, 719, 1117, 1171, 128, 554, -268, -873, -617, -1311, -1375, -1018, -1634, -1035, -836, -513, -126, -714, 41, 547, 398, 1069, 1586, 1082, 910, 477, 1157, 721, 951, 157, -20, -173, -731, -925, -1111, -1181, -1826, -1317, -1348, -793, -226, -526, -181, -140, 341, 526, 947, 787, 786, 1099, 999, 738, 604, 578, 240, -43, -142, -1172, -802, -1379, -1282, -1092, -1310, -551, -486, -502, -378, -451, -314, 704, 481, 1268, 884, 996, 1320, 1391, 697, 235, 323, 259, -564, -36, -372, -1029, -1027, -898, -1115, -1127, -1095, -1489, -536, -149]
4507a49l07N60L43J09J031l74k90m5L6r4J67j5l01q14L47n82l63k61m5K64o68
4528a451L26N44k15N5O12L43l16J198K19m20K18R81n30o03n92N86n54k55l59o44
4548h57n7j56p9l47N88K95m12M90J71M71k32O82N25Q2k38J22P7K2o1n34K50m26
4570C76q78j24L32p89J31M08o62j40K93M34K69l1J83R8Q07m64L80o6l05P32nJ77
4592A156o25o9m2k12j00p67j18o5p82N09o1J87k91O48L86j33N56j55Q94M21L5
4613A372n56K03L00j096M43k26P2m95r67L56k59l27jK27j96N87L27n31P08l23
4633c82L54Q01q4J41L37k84Q6J56q74J68O6n35k23K79J9j200L10J62M47p60L19
4654f97N2L20NO97n45O04L58j86K50M16m9l66R8J37q18L7l42j78p36J65k87l73
$$ y = [-149, -456, 104, 447, 556, 1587, 1213, 923, 878, 914, 820, 987, 972, 671, -143, 204, -378, -741, -1002, -1047, -783, -1451, -1125, -581, -796, -741, -129, 214, -102, 1096, 1315, 895, 1113, 2094, 1564, 961, 369, 955, 401, 146, -213, -857, -914, -1070, -1149, -1496, -908, -613, -1025, -535, -364, 107, -125, 557, 1082, 1164, 926, 1048, 1125, 1147, 1086, 552, 802, 376, -502, -626, -294, -1083, -952, -544, -1206, -1346, -1053, -619, -350, -381, -198, -100, 707, 243, 623, 557, 252, 984, 979, 1156, 531, 462, 420, 208, 108, -659, -777, -842, -1624, -1115, -1176, -989, -1280, -632, -246, -379, 177, 22, 916, 1337, 1372, 816, 1019, 1319, 223, 666, 440, 512, 17, -950, -594, -853, -1180, -1181, -954, -1150, -563, -236, -767, -59, -382, -28, 773, 689, 830, 1167, 883, 969, 1125, 251, 419, 485, -50, -273, 6, 25, -1175, -865, -703, -256, -1016, -697, -645, -325, -320, 377, -168, 436, 794, 608, 858, 1274, 1225, 859, 957, 1094, 276, 313, -29, -207, -943, -778, -1065, -1438]
4676a438L19o2M77O6L76K08J37L51k41L81P71o92L29P2m48N71n00p36n46j6j38
4697g59J03k5o70P34K28l60J62j89J62K49L01O03p34P94n87J328Q8n05k68j97
4717D58M21o43m69K03J75n72k62N3n2n44J71O92o48O53L93M75q8k22M78l9n2J32
4739G13M60o42J66l59j31l71J38k33q83O07l21L11J65r13J089l46Q4K25N23l51
4759f9O59J5K08Q8J51l53N89p80L39o86J4j041O72p93M73j190Q84l77L72O21j72
4780c76j25O26L63k85K69K39NM81q18n30M89QJ26m27J83J8o55L4J6k30k39l89
4802a217M54P9J84O50P7m40L82M10k39J2P68N4j17m22l80O87o10Q4n95l15k58
4823g52N1k45K3J31M30l53J6M39j52P96J59L5M59m22K74K24l73J80j5r73L86j83
$$ y = [-1438, -1119, -1181, -704, -638, -262, -54, 83, 434, 193, 574, 1345, 653, 982, 1054, 606, 1177, 677, -59, -605, -621, -759, -656, -681, -1351, -617, -389, -749, -587, -776, -614, -365, -64, 539, -195, 599, 12, 1340, 1428, 923, 655, 458, 879, 236, -233, -30, 145, -427, -689, -636, -688, -1232, -1061, -369, -1017, -364, 29, 504, 416, 194, 672, 633, 581, 713, 1173, 531, 697, 338, 207, -164, -26, -259, -1142, -535, -856, -545, -380, -1293, -204, -550, -466, -241, 282, -69, 590, 605, 813, 901, 1052, 699, 1288, 508, 847, 161, 175, -866, -194, -987, -514, -1704, -820, -1197, -825, -204, -376, -501, 125, 488, 203, 472, 711, 716, 1197, 379, -151, 338, 346, 472, 45, 228, 246, -409, -375, -359, -589, -828, -1217, -763, -684, -500, 150, 227, -213, 169, 579, 340, 352, 1120, 1174, 1057, 635, 255, 942, 332, 416, -179, -494, -752, -701, -946, -923, -792, -362, -715, -699, -260, -412, 384, 543, 578, 1037, 615, 889, 1113, 740, 920, 905, -68, 318, 135]
4845A35n19j07J68j68n35L56l10K76Q04o10J86M02M77l66O54l99N68m52M1P7M58
4866A136q55k62K1o11P11q36L85r37M88K02j6k38J41O93k74L44k0M91NL68m96
4887D40O30k05m36J73n92K32J48l70k24j17m89m82R85m53l08P53J89l45R87q10
4907b94O16k1K28l0k45M19m7j74m23P36m15j22n24L36p84K98k79L7J23k24L91
4928c98pK77j19K06M0L28O27m69K93R3L6j69l27K38k48r73K66o96j30P46n85L00
4950f71N13N43k27j47q2L11k74o2rM43q8K62k65P3K79n92QL09m68Q97o46p83O84
4973Hk64k64K56Ll82M08k01Ok28O93L53L90j11l22J69k72O71m90M20n58k86q27
4995h28N84m96K48K10r72M37N56n21L40P65n59L31J63N15j06q2J5M09o88K51l5
$$ y = [135, -384, -491, -323, -491, -1026, -670, -980, -704, 100, -510, -324, 78, 555, 189, 843, 444, 1012, 560, 601, 678, 1136, 281, 19, 40, -571, 140, -696, -311, -1248, -760, -558, -574, -812, -671, 22, -252, 92, 72, 563, 568, 936, 440, 1070, 865, 429, 602, 10, 242, 390, 20, -204, -321, -810, -1292, -307, -760, -1068, -315, -126, -471, 516, -294, 322, 301, 529, 499, 254, 673, 626, 452, 29, 765, 350, 228, -296, 40, -744, -446, -725, -688, -565, -789, -398, -405, -128, -247, -41, -1, 327, 954, 485, 778, 871, 907, 738, 411, 649, 401, -572, -306, -1002, -1132, -386, -971, -671, -158, 385, 158, 11, -71, 240, -34, -96, -105, 338, 250, 512, 247, 320, 599, 7, 15, 324, -144, 753, 107, -676, 8, -256, -520, -264, -261, -643, -235, -436, -430, -658, 35, 388, 778, 667, 345, 514, 242, 913, 423, 843, 285, -1, -828, -244, -740, -492, -282, -1254, -817, -261, -782, -442, 323, -236, 95, 258, 773, 667, 585, 600, 1009, 321, 572, 537]
5016E37l61p66Q69l13j17p48J40N16o14Q07p6k45j10j06P35j85J48k3M77Q3l43
5037C05N17j77jj52m97M74l5m09p00M01j58r3J79n75L31m3M71K88j12L68L87O4
5059H33p03Q37l65l35L68m43K07n59N84l62l48k21K35k74l77J82L33mK45L6L17
5080A86m2M14o31M42O4r7k01L13r8K14j27l43J92m29K76o45l31Q6k19l5M05k15
5102h21O8M75K18Q2J24M59L6K6L60m50k6L47m28q51O21o54J96n76M22l52L26l8
5124d36L2L42n42N13J03r1L83M20K82o67R3J45j86l60L14J13n02J04k65k26Rj32
5146e54J90l14J56K26l41N7J72L59J96J76J74j52J26M31L9m7j09k92m7m96j67
5167b17l14R0J39l36l02m2Q38j27J67K04k47N96l65N26K11n38K64M18k94o10O39
$$ y = [537, 176, -590, 279, -34, -151, -899, -759, -243, -857, -50, -126, -371, -481, -587, 148, -37, 111, 88, 565, 648, 305, 822, 645, 644, 492, -5, 469, 434, 25, -675, -274, -432, -525, -346, -921, -590, -633, -162, 126, 14, 382, 769, 833, 130, 967, 602, 267, 635, 192, 399, -160, 424, 62, -286, -507, -272, -546, -923, -741, -408, -412, -167, -131, 186, 144, 558, -73, 369, 433, 336, 135, 448, 350, 564, 437, 94, 286, -143, 133, -512, -843, -757, -976, -1011, -606, -821, -753, -278, -60, 22, 146, 605, 641, 667, 1027, 577, 551, 898, 470, -381, 240, -414, -218, -794, -372, -724, -398, -436, -404, -62, -604, -91, 12, -79, 304, 724, 1006, 339, 432, 577, 391, 31, 345, 458, -44, 60, -205, -431, -422, -554, -364, -678, -522, -296, -637, -580, -408, -49, 147, 323, 497, 345, 471, 902, 941, 894, 785, 493, 446, -50, -217, -531, -441, -302, -638, -940, -982, -144, -271, -104, 100, -147, 449, 84, 610, 821, 283, 547, 965, 671, 61, 700]
5188G00p13j98L44o69M68o88m1K47L71k65m1j76M03k59J68M70j36N66m23J80K97
5209F05j04K57q4Q2j18m71l33P0n45k07N47j5n98L26j41J34M17q8L93K82N7L81
5231H47k39L57j59j00R2K21j613R61p5l37l19j24r3k08O6o40O06j44L02K18M34
5252E3J60Q5J89k28K66j37M46J90k73l53j3L47r85n6R1j55q55L60o2O49j64k78
5274g23M32nR7J93M87L06Q6K07p46N21J32p55L36k01k90J02m75op82M76k17M89
5296c36n91k86M22N22j94O27K65o02N13L46R0j55l5L49n61K9l36J72p83L25m2
5317b61o66j85M33J11l86Q09p18L70r4J133K7m33J81P18k40M65l93k00k58K31
5337F44l00J39l64q96L17k2l63J50J20n14L71M32j44M62k67R02P0k04L56J96J08
$$ y = [700, -13, -211, 133, -536, -68, -756, -797, -550, -179, -444, -485, -661, -258, -517, -349, 121, -15, 551, 128, 308, 605, 501, 758, 674, 756, 638, 167, -166, -96, -641, -848, -301, -316, -914, -588, -729, -595, -178, -266, 127, 409, 466, 847, 608, 965, 806, 706, 798, 1019, -594, 367, 292, -45, -364, -488, -581, -789, -723, -1363, -757, -901, -599, -381, 53, 213, 298, 487, 259, 525, 388, 834, 1024, 751, 398, 385, 732, -253, -309, -218, -373, -1228, -868, -930, -281, -445, -723, -291, -296, -199, -6, 481, 787, 873, 1080, 334, 855, 987, 232, 568, 367, 77, 179, -296, -302, -1084, -608, -825, -336, -927, -1213, -791, -269, -463, 164, 429, -173, 340, 686, 776, 621, 586, 935, 374, 403, 67, 239, -544, -219, -261, -927, -1112, -679, -568, -954, -145, -863, -493, -587, 546, 573, 140, 321, 1039, 799, 1264, 871, 671, 413, 644, 344, 483, 119, -777, -460, -482, -845, -695, -575, -1089, -718, -286, -430, 32, -235, 667, 737, 533, 889, 1085, 1193]
5358A193j82j57j15m98L39n42m68oQn43K93o98J86Q92m57L05J57M66l60O82N1
5379E46O27l75j30p2J50L82r26k90L73n10j37j62l88L55m82N28n32K49R9L97m82
5400g80O19P82l79J03k9Q37j32j53J29p4J49l07n44l80j28K3k27l16k59K86m79
5421a259M14M51L23J50K8K28L70p1P77m0l33K10r10K12k46m13n36m76M13OP3l26
5443i55L17j77R6r3K79O16J66P8J68P7J07r2J73j29O7k89J76j6j21m0k11m91m08
5466g02k47N96p08J48l15q7Q41J34L32p1L50o0N02M87j53P3L22k62n91o64n8l5
5488a68k67n79K30q57P3J079n12L49K32J71K79L05K50J25r6K16k28N23J64m20
5508H69q33O80m16j76l82n9L5o54L39R0M5m05O37n82O28j72K4K61j41P11M86j53
$$ y = [1193, 1011, 854, 739, 241, 580, 38, -430, -436, -428, -971, -678, -1376, -1190, -298, -755, -450, -293, 173, -187, 495, 546, 1173, 798, 668, 596, 746, 1128, 202, -88, 285, -225, -362, -524, -912, -557, -1039, -511, -1043, -794, -695, -298, -780, -161, 621, 242, 345, 316, 1153, 1021, 868, 997, 923, 1072, 765, 221, -159, -287, -264, -491, -807, -1066, -780, -1259, -845, -394, -71, 79, 107, 335, 705, 634, 1411, 1371, 1038, 1248, 338, 550, 304, -109, -645, -1121, -708, -702, -629, -955, -638, -815, -719, -812, -533, 83, 249, 327, 495, 572, 679, 587, 760, 631, 698, 409, 585, 569, 448, 408, 197, -294, -702, -949, -353, -1061, -913, -1228, -1315, -474, -340, -8, -79, 271, 211, 713, 1200, 1047, 1120, 1442, 1180, 589, -75, -133, -168, -435, -1014, -784, -1641, -1568, -489, -1001, -652, -420, -249, 30, 335, 585, 710, 614, 830, 602, 1125, 1289, 869, 36, 716, 300, 124, -258, -317, -282, -936, -597, -507, -462, -867, -230, -812, -184, -356, -332, -71, -212, 499, 985, 832]
5530H32m19J029o84K46j53k65l30q77N78r82P1J68j55k54K88O75m72O14q8L37
5550A59M80k67L43j35N15l67r8Q5k41j52l17L7m80j49M8J90n00o1K44M10k73K22
5572c07p0N65j02j85l9N11O58k60J11k29M49l86O0l18l2j014M47j02m73p31R33
5593e14j7m01J99m88N90P92J52l13L95L15J83K2k38J3O2q2L13r09o6m34o3j81
5615f70M25n61j57P34k59O93j093M83L76j28M63L18J67m8jQ5j64m82Q56k28j99
5636F10l03Q5k70k26m21J08j41m80M13K83j31j25M86J24K5J78R29k62M92j058
5656C16Q0M14k89J71q53k5K9q11O16L83j052j1l12K17Q65ol36Q45j67JM22o2k09
5679B26RM16m53K62k82Qk99J46R4J19q54J69k51J42j87M5K54j21M25j86P61k50
$$ y = [832, 413, 1442, 758, 1004, 851, 586, 256, -621, -43, -1025, -954, -786, -941, -1195, -907, -232, -704, -90, -178, 159, 639, 372, 715, 580, 1095, 728, 630, 715, 474, 322, 5, 42, -438, -587, -539, -349, -849, -910, -666, -256, -529, -307, -377, 188, 86, -99, -138, 373, 1031, 771, 882, 653, 1102, 716, 776, 458, 426, -588, -141, -243, -716, -1447, -514, -531, -932, -733, -1221, -631, 161, 313, 0, 395, 710, 893, 915, 677, 690, 752, 670, 983, 74, 8, -426, -489, -670, -245, -806, -963, -229, -488, 205, -888, -405, -29, -157, 306, 624, 791, 743, 742, 827, 663, 181, 1037, 809, 610, 307, 392, 122, -104, -525, -417, -558, -1038, -625, -342, -473, -598, -112, 12, 37, 215, 1144, 882, 1374, 316, 396, 810, 521, 692, -161, -186, -157, -968, -352, 31, -1021, -1032, -1344, -1127, -262, -268, -604, 241, 74, 75, 497, 435, 226, 235, 651, 198, 460, 178, 186, -113, 33, 127, 246, -608, -439, -690, -548, -735, -690, -436, -557, -132, -318, 443, 193]
5701A93M6N99l25K0N88o84J14J56l10p22N93J14r09q1J18o84p8M63M46j63J48
5722c58j64O66k30L33L81o58K15L78J3L37r0q98J41kJ22m24n33K4Jp1J93k07O09
5745b22j45k2Nj08L74P2N48j5k80N8N65o02L64J79m56J65l95n5l79j72J81k37
5767e77k94K45QJ56M6j26K41J41N78k20L99M48k24K14r84M46Q5k70l64j73K88
5788F3k66j70n73p2K69N24j67K71J9k03L41M41n6J02k79J44J56j11L8m05M01k29
5810B38M3n37n27N82k88m6J24m37J00K27K76P9K2L87m55m3P87k00k41O52q60j05
5832b22Q45k63M48m87J33n78j16L00k76Q8p33O8M69Q9j93O28l24M20o0J11Q1K32
5854F60L9j75K82m96j40n47K49l23K56M75l10l78M41k54M05k29l36Q0L37j3m64
$$ y = [193, 239, 838, 513, 533, 1121, 437, 551, 707, 397, -325, 268, 382, -527, -608, -490, -1174, -1252, -789, -343, -506, -358, -522, 144, -86, 247, 628, -30, 185, 563, 576, 913, 823, -75, 66, 64, 186, -238, -771, -747, -746, -817, -624, -831, -222, -367, -389, -384, -492, -118, -46, 502, 487, 207, 265, 830, 228, 592, 771, 315, 480, 85, 30, -349, -521, -340, -577, -871, -626, -618, -462, -416, -542, -301, -160, 418, 198, 597, 1045, 821, 1035, 51, 497, 582, 312, -52, -225, 63, -203, -373, -946, -1018, -749, -225, -392, -121, -102, -305, 36, 477, 421, 523, 244, 388, 544, 433, 471, 66, 467, 238, 281, -256, -783, -201, -489, -535, -411, -848, -748, -521, -245, -166, -144, 243, -212, -255, 532, 332, 91, 743, -117, -222, 623, 360, 808, 321, 454, -124, -240, 60, -216, -128, -861, -793, -324, -235, -428, 200, -124, 296, 236, 347, 428, 660, 699, 524, 806, 310, 170, -377, -128, -451, -195, 280, -30, -408, 33, -221, 184, -45, -381, -301, 36, 23, -441]
5875d41L9L3N51K42k49L4Q72o92j55M91k55k85r8m72QJm35J78L1L16n65M62K0
5898c69K15qN87L46q10L69K22N05m06m43L36n03K04n10j87l54n4N36p2M80J92
5919B76n43N81j088J570p56l60M41R3N1j77L18o54J57L57n56N42k66N5M1N48P9
5940G09k67r46M40r29K38L15L22K90j79J7j38k57M47N51P0J04j95L55q60J31j06
5961A12q8j58n24L3k86O61o5m27N98J23L43l30P61k36L3k55P3K59j41%n73J86
5983I9J17o08L48j39N90M5k28q2q31N19N9K68k96r6o5J97l72P69j76m24L77k37
6005a66M47l35L88K32K39n58k30k49j60Q6L07m88j32p26J262r5P2m62J051K96
6025G79n78M80p9Qn60j23K20l68L59j23k99Ml85N04O34j024M47p2R4P3p3K70n37
$$ y = [-441, -402, -369, 182, 424, 175, 209, 1081, 389, 234, 725, 470, 185, 87, -385, -377, -376, -811, -633, -602, -286, -851, -389, -369, -154, -162, 425, 771, -39, 330, 552, 1057, 651, 208, 544, 41, 245, -265, -452, -806, -860, -324, -396, 84, 276, -267, 314, -774, 796, 40, -320, 121, 214, 265, 88, 406, -248, -91, 266, -290, 252, -14, 41, 82, 630, 709, 442, -504, -64, -993, -755, -440, -118, 172, -7, 10, -128, -385, 62, 613, 683, 787, 592, 947, 87, 218, 112, 24, -134, -658, -625, -911, -250, -315, -742, -144, -21, 322, -8, 753, 517, 550, 295, 368, 627, 486, 486, -87, 99, 216, -392, -44, -183, 407, 452, 224, 142, -689, -170, -111, 157, -139, -235, -300, -103, -475, 294, 118, -306, 71, -166, 281, -54, 334, 566, 805, 247, 17, -232, -392, -306, 1, -487, -619, -1345, -83, -178, -106, -568, 483, 779, 201, 681, 602, 610, 50, -73, 147, -221, 138, 15, -284, -280, -665, -161, 473, -551, -104, -176, -82, -9, -82, 188, -349]
6048c49L00n42P80k36l08Q51m62j10l49P75J6m54K00j87K59k9p2q6K9o92J15J75
6070c76j65K30J139j002L09Q4l8P97l30l18k11K0M40o64Q5k1k71J54o9K96l52
6091b63K39j30N74l00Q4l43K91p2l32k67K84N82m51M64l76K33K69k85M17n62j57
6112a01J36J67o01J27m68P50n53N84L3m35N25k31J54k61J99M72l21M71o36R51
6132I62r60M35n87k31K53o5j0Q3k32K23J93M2J71k00k15K62Q6j95J94N9k18k4
6154B6j86O29m58n46O25J17J23l92o5R9k62l05M36m15L93l8K49J10k62J57K76
6175C11n38N65Mkk65N76l85j82K09n44j9j61n1q7k3L28K35k86L12j99M44j67L03
6198C78k33M65m23l00P91n58L55q99L48J03l47K68o56J171k59Pm09l1kQ6K40j13
$$ y = [-349, -49, -591, 189, -47, -355, 496, 34, -76, -425, 350, 366, -88, 112, -75, 184, 155, 83, -3, 26, -666, -551, -376, -541, -311, 828, -174, 135, 219, 181, 978, 648, 330, 119, 139, 579, -85, 0, -21, -292, -138, -207, 89, -263, -24, -154, 420, 120, 204, -139, 152, 80, -252, -519, -235, 347, -104, 360, -16, 217, 486, 201, 618, 56, -101, 35, 202, -399, -272, -740, 10, -543, 41, 74, -361, 164, -67, 87, -174, 25, 497, 176, 647, 11, 962, 2, 437, -150, -381, -128, -193, -203, -120, -352, -129, 64, 106, 277, 77, -138, 124, 210, 15, 209, 268, 50, 26, -160, 469, 11, -535, 90, 207, 330, -62, -127, -28, -290, -595, -159, -574, -181, -219, 30, 140, -122, 35, 311, -227, 338, 342, 340, 75, 651, 266, 84, 293, -251, -270, -431, -482, -569, -592, -264, -29, -315, -3, -202, 242, 75, 378, 145, 610, 187, -113, 678, 120, 475, -424, -76, 27, -320, -52, -708, 463, 204, 211, -198, -229, -231, -145, 95, -18]
6220a8l87L50JO93m60k29J88p0M56q8k88K22m87N1k4n4p9j25J00K06j79J32L38
6243B49j70k04k07P90l54j77L94j0nk66M23n72J99k70k8M65K22P1q88K09m47J90
6265c86N27n78k68L57O7M28J98j22k94M92o11O02m32P2J83J7k88P01l06o75L56
6286D0j73o06M77K08p03N43q1K34J17j83q8K87L28k07J10k42O7Q3J60m00qj72
6308b09M03m66rk29M74m79K09p1l08Q62j46J11m8k58J96M14K43m16M4k12J52J48
6330D05P8l97j50ON7j21l62J58m9k36K83N9L84m11M43K77J59m74j25j8K42M16
6352F24l15o13l6N96k9k83j93k65j5M72j93K48j53J19J28k89K67Ro50M42P74n55
6374I0m48Q87L5K71n35L26k91m6j32P8p37Q8L4MK38l79M5Q16j7j7m13N26o12N81
$$ y = [-18, -405, -55, -54, 639, 179, -50, 138, 68, 524, 436, 148, 370, -117, -66, -90, -144, -223, -348, -248, -42, -221, -89, 249, 79, -125, -332, 458, 104, -73, 321, 311, 306, 40, 463, -109, 90, -180, -208, 257, 479, 550, -338, -129, -576, -386, 141, -437, -705, -348, -281, 147, 345, 223, -71, 421, -190, 412, -20, 52, 235, 252, -36, 665, 359, -316, 40, -133, -739, -262, -54, -757, -214, -295, -61, 56, -127, -215, 72, 400, 193, 303, 61, 128, 211, 371, -29, -37, -209, 194, -272, -281, -510, -36, -515, -306, -377, -685, 177, 31, 142, 94, -164, 32, 446, 689, 273, 317, 105, 257, 405, 483, 86, -64, -58, -1, -122, -484, -326, -375, -611, -328, -269, 115, -296, 147, 424, 583, 109, -16, -34, 208, 624, 309, -304, -340, 256, 227, -56, -249, -514, -529, -57, -250, -2, -155, -36, 92, -197, 70, 79, -571, -129, 645, 90, -358, 529, 564, 835, 300, 626, 335, 289, 157, 235, -502, -414, -380, -376, -138, -517, -472, 344, 327, 310, -103, 423, -189, 392]
6398C92P0J45m7o7n37j23O17n42J06p0n10k28J106m86j67J91j67n74O65N4J6L57
6420B01J64k53N18k84M34l62L10k81m59m2m1j12m03N68q71L48R2k66r4M55L31
6441d7k28K63k44K65Q8N12K85k91N7K43p42M52k93K02p92j89M22n35l0P4J24J19
6463b85J03j25l59N14M0M88M78k1m20L53p97O12P9p64M09l28k75O83o71k48nK31
6485c08q6M12n27N2K28L55Q0o19Q34p32M41M02r1K80j39nLo89l6J30J10l71J22
6508a54k29k01J06J03j4K5l80O17k33N00J09J06K0K48m9n70P26k67L3k62m64k28
6530d58J79L1j10K62l52l78L47N15m96n47O60L8N11m20O21n11M19J48N7j87R20
6551A249o75k19k51l4J27j058N96l28j50kj30j08O34k16J66L35K0J0L66M58p6
$$ y = [392, 462, 607, 560, 493, -44, -167, 450, -92, 14, -56, -566, -794, 312, -174, -341, -150, -317, -891, -226, -172, -156, 201, 365, 112, 630, 346, 780, 418, 728, 447, -12, -54, -95, -207, -610, -42, -913, -565, -473, -739, -833, -378, -47, -275, -12, -256, 9, 97, 609, 894, 603, 660, 903, 161, 613, 320, 522, -270, -459, -37, -572, -602, -528, -404, -285, -182, -307, -666, -152, -112, 376, 854, 833, 413, 766, -31, 581, 660, -104, 305, -23, -298, 385, -286, -534, -539, -308, -394, 18, -509, -457, -229, 126, 206, -413, 421, -311, 130, 532, 441, 721, 582, 577, 580, -109, -145, -15, 95, -276, -154, -383, -584, -478, -375, -389, -364, -744, -127, -360, 140, 249, 355, 375, 623, 574, 4, 730, 463, 496, 234, -230, -458, -279, -248, -358, -96, -448, -826, -479, 36, -460, -1007, -347, -309, 202, -218, 403, -108, 311, 459, 516, 329, 1249, 574, 355, 104, 70, 197, -861, -265, -593, -743, -745, -875, -983, -349, -565, -399, -64, -44, -34, 332, 790, 714]
6572G14j35j63n7q9P2l50j52J85K3m35n44K24k40L94p2q3J45P52l72o8J45j12
6594b18O51k35j63Q87q28J04R61p15k60P2m78K06m17l50L47m7O4o20Q93m86L17
6615c15n9J55J04N33j95N71m66kM20n41K9M92r2Q9p05m47K0K46j94k03m60N00
6637e20J78J14k45J65ON82j03M36K74k82l72M08L58k91l18k37q7L8k63r0p47k26
6659a222K07L44K23J29J07p09O41m99J000j28K17P4K36L62q1n82K91n6n29K87
6679C12o26r3J68k87J34J93l60J35k98N30m25O15L1j2K14N15j08j68j26n5L47
6700F36k32k77J32M12q45J5l14l16M18n71M50j68k99J85J27P53j54K7M27J41J09
6721F56L75r1P3o57k15J76n16J2k99j58K69nm45M28r9m80M99k5L29L37n96O02
$$ y = [714, 579, 416, 359, 270, 342, -8, -160, 25, 48, -387, -931, -707, -947, -553, -625, -708, -563, 189, -183, -251, -106, -218, 433, 198, 35, 922, 94, 198, 1159, 444, 184, 256, -222, -16, -433, -783, -436, -483, -419, -1039, -146, -632, -315, -374, -219, -115, 418, 223, 794, 328, 326, 746, 205, 234, 726, 634, 723, 18, -429, -409, -163, -357, -560, -1020, -520, -342, -228, -473, -308, -302, 280, 177, 613, 887, 605, 233, 641, 999, 708, 390, 153, 66, 104, -159, -249, -996, -1222, -1015, -671, -448, -319, -212, -921, -280, -779, 221, 93, 310, 384, 620, 982, 901, 319, 610, 554, 25, 312, -314, -407, -239, -526, -392, -199, -559, -424, -722, -192, -617, -2, 29, 17, 231, 746, 638, 470, 344, 289, 636, 404, 127, 259, 671, -174, -159, -473, -789, -371, -942, -492, -660, -959, -774, -647, 106, -48, -21, 406, 547, 656, 1031, 940, 1013, 356, 141, 317, -199, -187, -486, -644, -375, -380, -825, -397, -496, -976, -477, -502, -173, 164, -432, 170]
6743A70k43P09qK99l64L50r2j28j92K17j319L42J96J92o40J00J92n67M39O21q69
6764e95J0M66L94J00l9K6L38l69J99K84o80K30J04n07k79m08J29m7L83l29j77
6785g67LK13J44l31J031l14J28j14M43J4K75j13n13K23J54m47P98n1o03n57L94
6806A0j34j2n71L79l75L44K54k65J75Q4L22j83J32R8j02P03n58J91l61O08r3k81
6828C65p9m74K88m24m96N05m06K02K20j69N13m3j34j19L14K05k84O32K9q6J15
6849F74L66r80J85j49m68M56L9j05r4J72n98k2OL79j54N95p65P50j12J43l28M47
6871D37N42l00K71q04L61j64j08Q4n86J33n86J77j05l07K80K23N32m91O10l55
6891a56K53o5K14P71l87k79j73K82p9j07l7M08n80j63k78Ql51K26k73J30L35p68
$$ y = [170, -73, 636, 628, 927, 563, 913, 821, 693, 501, 718, -601, -259, -63, 129, -511, -411, -219, -786, -347, 274, -595, -585, -119, 275, 375, 336, 362, 700, 331, 530, 814, 134, 364, 468, -39, -318, -726, -597, -644, -261, -590, -767, -764, -551, -407, -738, 293, -21, 107, -7, 436, 450, 725, 612, 99, 322, 476, 29, 827, 776, 173, -384, 10, -124, -136, -707, -328, -703, -359, -105, -370, -195, -111, 211, 28, 160, 258, 156, 859, 301, 492, 131, 739, 646, 365, 286, -188, 100, -324, -820, -315, -721, -519, -299, -468, 45, 2, -132, -251, 63, 268, -16, 616, 645, 559, 674, 1040, 60, 245, 96, -372, 84, 123, 18, -76, 96, -502, -524, -518, -139, -293, 302, -463, 287, 175, 318, -10, 437, 979, 679, 950, 146, 507, 343, 235, 319, -267, -134, -720, -543, -648, -955, -675, -452, 80, -411, 199, -156, 97, 32, 246, 1017, 630, 351, 178, 460, 381, 274, 237, 645, 65, -98, -376, -368, -719, -493, -766, -636, -301, -1069]
6913a069M39j8J115k46n02L40M4j21P8M55o56L46J44l5m68K46n46k48J70N50j071
6934a053L42K76k47M32k3J49J72J55M7p2k53O59P01j315K91O13p04J22J57n26
6954g7m13L09P9r17L97K28j83K08m40Q04O0l61R95m26O94p68M3L90L09n70k61
6975A00j3Q5j25j01l43J18o45q5P24l26Q0R6K91j52JK71N77m23L53j01p3J55j37
6998C27J54n39K54n25j5M15k65K78j72k86O4m33L48k60K19L6O08R1o65O81M30
7019G45n56j44K30j85K93M4l68l5J95n36J64n95j51Q53k80M69n58l68P21M69o5
7040C42p66N81K62L44j08k72K48K47k84m11n62P02p47J33K20L80n23l54L37m91
7060g22J60M28J88R6J27n40M67j56N30L2j47l8n4N27n06l70J15K50n56J75j90
$$ y = [-1069, -630, -648, 467, 221, -281, 59, 103, -18, 60, 515, -141, 205, 349, 314, -154, 92, -454, -702, -532, 18, -1053, -711, -435, -682, -250, -273, -124, 48, 203, 250, 178, -75, 584, 1285, -30, 261, 874, 170, 292, 449, -77, -490, -181, -102, -1019, -622, -394, -577, -369, -809, -5, 55, -306, 689, 263, 957, 189, 232, 622, 931, 361, 100, 87, 172, 47, -54, -397, -279, -924, -1009, -285, -611, -531, -435, -144, -296, -295, -24, 553, 130, 483, 382, 309, 464, 327, 481, -58, 196, -329, -344, 71, -194, 84, -88, -374, -310, -743, -395, -655, -436, -400, 208, 299, -366, 315, 745, 189, 45, 275, 90, 383, 427, 59, 24, 219, -317, -153, -748, -899, -46, -326, 143, -415, -783, -62, 407, 342, -424, 157, 419, 763, 655, 383, 631, 878, 594, 183, -379, 323, -424, -291, -71, 309, -214, -568, -231, -722, -562, -134, 54, 150, 277, -263, 204, 48, 578, 610, 463, 425, 371, 898, 392, 22, 137, 387, -169, 6, -184]
7081a84n1J89k75o8j33K00J07j84O41j35m76N63M24j37l36M4k84R40o32n32K71
7102d8m9o44R01k90j01j70j76Q7L8L22j46O9o5Q75l01n24M60J43j82P1l02O50
7124F18K1Q0l45n43j57P90r83K57K18l72M1p0N25q69Q34n85M29R4M70m68L71l42
7146A4K78L3K53n05J21l37j51J03l4K54n00n0L60l86M88P6l59P84j86l37j31j03
7168c15O01n11N48p79K47k4O64m58J77l96N67m00P1n52L14K78l65N07J4j0q11
7189f33O5Q53k43K66o93O15L32j35l56k3N82k69p08M91k26r1J17n23j67P73j18
7210i1K0J54m5M69p0n11n57N65L07J76l46k84M77q00Q04J62k21m08j86K96j50
7231b39J80k39O72k51P0j11R3k79l60N18J07L88l58K32l51j67j18NQ23o89j08
$$ y = [-184, -235, -46, -321, -389, -522, -322, -215, -399, 242, 107, -369, 194, 618, 481, 145, 189, -95, 845, 213, -319, -48, -97, -741, 160, -130, -231, -401, -577, -490, -452, -130, -276, -207, -272, 603, 302, -222, 238, 381, 199, 270, -32, 618, 639, 719, 374, -169, -326, 464, -519, -262, -44, -416, -375, -445, 80, -789, 45, -540, -111, -17, 453, -15, 356, 14, 292, 325, 578, 73, 194, -143, -294, -191, -225, 29, -471, -521, -161, -547, -59, 17, -342, 442, 256, -81, -212, -315, 286, -225, 323, -456, -209, -233, 431, -27, 150, -246, 321, -79, -8, -560, -246, 32, -333, 174, 188, 178, -633, -568, 285, 42, 308, -385, 230, 562, 427, 71, 48, 630, 361, -347, 144, -82, -173, -56, -579, -746, 27, -91, -71, 83, 38, 507, 437, -74, -631, -66, 241, 417, 71, -213, 264, -536, 268, 430, 209, -199, -385, -89, -239, -59, -298, 374, 123, 193, 82, 175, -104, -464, 54, 161, 549, 191, 423, 72, -95, -213, -208, 615, -74, -182]
7252a82k58K10j63L49m84N62m12p6M12j52O50m72L22L49l75n2N98m35oM06l07
7273D84l76k06j92L84l74L86J7k01k56r1K32k4P11n52L05k67J51J64L1P4o35L44
7295A09k35K0L46j17l46R8n4k33J062o79k8k36N4J40j93k4J27j23N67l99J23j32
7317a53P9N11m82q9m88N24j5M4J38m58J05L0K27l98J14J77J66n8lk76L24J57o5
7340A11j74J27L60k43j63M77p78J98l74K79j33p6J67L8L1m05M84p3L30J42j20
7361B05L46o73L52l6k70O2J0j65j8mM57k8m57M70P8l89l01k72N72K16p72J15O10
7384A08k59n8J80J88M71n25L41q14J214j274O39m3j71j23j88L73J40p95O57k17
7404a56j54J92L2m7ML57r0l03L04M12n17L05k13K35n19l73O37p39N23k41L37J
$$ y = [-182, -440, -230, -393, -44, -528, 34, -378, -454, -42, -194, 456, -16, 306, 655, 280, 228, 826, 391, 385, 791, 484, 108, -98, -290, 94, -280, 106, 123, -78, -334, -425, -193, -217, 494, -58, 247, -20, 131, 295, 326, 400, -235, 109, -126, -106, 240, 123, -223, -125, -179, -412, 650, -29, -57, -293, -239, -99, -292, -316, -189, -312, 255, -144, -21, -153, -74, 437, -45, -134, -622, -98, -113, -69, 69, -389, -284, -254, -27, -425, -311, -134, 32, -26, -29, -305, 19, 176, 111, -63, 64, 424, 181, 18, 495, -283, -85, -459, -180, -313, -389, -222, -184, -153, -558, -74, -147, 183, 325, 205, 551, -122, 230, 194, -76, -14, -4, -169, -187, -191, 266, 238, -219, 251, 329, -60, -361, -633, -61, 155, -617, -502, 108, -151, -209, -29, 159, 630, 105, 446, -368, 846, -428, 211, 168, -3, -126, -314, 59, 199, -596, 61, -156, -310, -118, -86, -133, -129, 228, 138, -165, 139, 551, 34, 339, 126, 361, -158, -531, 106, -633, -110, -351, -14, -13]
7426a3N9m80L05m26O16r54Q12K11m67K02M87o8L47L33l54k33l80j67J004o99N0
7447A85J31j67k29l54J30k22L41o41M00n3M04p4J89J20J55l75Q85p68L6K12m30
7468a25P45m00P0l43j45K82m85K98q1J70N9k01k32M37k02J11M1K43p94Q96j84
7489A60K07K86p12N65Q9k63n5L09l33m12j17l84K16L52j4k52j86P13p08K88O6
7510a85O5j53N26RL07J66j75o0k56M53l68J64m74k85q2M21l54j69K2j15L30k20
7532d33O28j90L06n31MQ99o46N18J83o37J21k68qN14m48k09j79K60k39K01l49
7553e03L92k88m2k24K46N37j64j55N09j46J60L85l23N17l75m57K53j60k59k48
7573c45n79N76n8m32M32l01O62k77L18l01J85l1J81J65J01L56m20K95K7k06j0
$$ y = [-13, 46, -434, -129, -555, 61, -893, -81, 130, -337, -135, 352, 284, 631, 964, 610, 377, -3, -170, 834, 135, 185, 316, 149, -80, -434, -304, -526, -185, -826, -426, -479, -75, -149, 40, 160, 315, -60, 825, 57, 93, 305, -125, 620, 220, 290, -53, -198, 84, -401, -103, -184, -14, 45, -156, -388, 49, -153, -42, -1, 242, -552, 344, 160, 367, 653, -59, 506, 595, 332, 277, 586, 253, -159, -276, -660, -444, -92, -106, -358, -544, 169, -539, -251, -185, -120, -273, 253, 262, 569, 735, 560, 500, 244, 697, 329, 493, 19, -266, -348, 73, -281, -450, -428, -543, -213, -433, 195, 5, 311, -220, -216, 683, 37, 555, 738, 101, 222, -46, -54, 460, 12, -197, -376, -116, -355, -154, -503, -111, -399, -441, -665, -419, 118, -46, -201, 308, 162, 322, 707, 384, 901, 526, 69, 322, 162, -97, -345, -924, -348, -406, -838, -406, -707, -45, -322, -4, -305, -120, -151, 30, 195, 296, 652, 232, 527, 554, 348, 338]
7594C38J0J2j39n74N76o8m31M89q48J52L05k86J84pL09l77N28l64Q28R0n0l91
7616B86L83l18j40N74j000K48K97o43l94j22M12l77K92k50J13P15o71N86L71K08
7636E70k51L9K00P0J66m42m42Q2M32m94J36j38q0j40L33l99n1j61p6Q91o06J80
7658a81R24n37k41M49m23P49n48N3k03M23K10j77n38J9l05M32p12m8K59L49n78
7679f24P7N01j46Q0K79n3nL94l28O5P54m66l11P9k03j23N2j45j58L90r4J45o10
7702d50J37l80P07N3M3l47J85N40m41L78j40l61J92J24K91m39K90oj34n99K42
7723a15k28K26M9K00r20n9K30k09K37N22p45J581m98q5O8L00J22j82l42L17j41
7744C28M2n83J29l55N33k77j3l45P6Mj86M02M17k18l39j14K88J00J89K30oM19
$$ y = [338, 348, 360, 221, -353, 223, 155, -276, 213, -635, -483, -178, -464, -280, -287, 22, -355, 173, -191, 637, 727, 677, 286, 669, 351, 211, 785, -215, 33, 330, -313, -707, -829, -417, -794, -502, -752, -639, 76, -595, -9, 362, 570, 319, 358, 558, 628, 794, 352, -90, -8, 424, -70, 66, -72, -152, -292, 41, -358, -409, -570, -646, 245, -361, -181, 743, 206, -35, 414, -9, 740, 192, 245, 42, 465, 675, 498, -40, -21, -326, 106, -606, -654, -395, -46, -624, -547, -46, -192, -112, 167, 114, 109, 503, 175, 240, 994, 528, 217, 296, 93, -30, 22, -123, -281, 109, 15, 160, -450, -313, -693, 14, 67, 110, -237, -52, 488, 47, 425, 285, -76, 116, 240, 531, 92, 382, 376, 242, -357, -115, -343, -117, -68, 132, -788, -847, -617, -826, -589, -67, -812, 769, 271, 186, 254, 554, 676, 494, 152, 469, 328, 370, -213, -84, -439, 94, -183, -196, -541, -465, -461, -647, -245, 172, -46, -385, -499, -211, -111, 78, 308, 302, 721]
7766G21l64P3n1q9J31p23O59l02j80m07J97N3k49k91J85K71J25M05o48N27M86
7787E29k94N04J69l72N79p68o8J63P6m19k57j15j37j50j58R2K62k32N37k64K95
7808b8L11j79L01N4m26R30J6n71o61K30L54m8J61n87N6K45k26k86n76K6K99M82
7830a23o27J13M98L5Q59l84k75J37l61J044k08j0m85j09N91l20n63J25n55J94
7850d24O0o88M13l51N04k74M27L00J32q2k0K87K41J31j35L59n53J03j56m9l14
7871h9m60Q14l18n48n38M27J41o8RL46k41Q24q67O73J87J0K23n80P77j40j32j32
7893C18o00O05m93j00J45j56k97O03l74m35N17n94K77K79M05N34p69N89l01P44
7913H97j38k09o8m24L16p0p7O0j117P27n88K41K96m11L60J9j82r2J27K88Q6M48
$$ y = [721, 357, 430, 379, 290, 421, -302, 357, 55, -125, -532, -335, -282, -531, -822, -637, -366, -241, 164, -484, 43, 529, 235, 739, 908, 536, 1115, 347, 279, 442, 518, 99, -158, -273, -410, -560, -718, -626, -364, -596, -59, -323, -28, 283, 104, 405, 459, 33, 963, 979, 408, -253, -23, 331, 283, 444, -143, -87, 158, -68, -354, -930, -904, -605, -123, -750, -637, -139, -104, 755, 371, 96, 233, -128, 916, 708, 698, 213, 104, 695, 375, -188, -63, -618, -424, -364, -1052, -639, -990, -486, -760, -333, -33, 99, 17, -3, 284, 525, 656, 521, 880, 327, 430, 274, 225, -89, -549, 265, -53, -601, -1139, -712, -571, -639, -630, -284, -525, 299, -568, 105, 292, 302, 525, -55, 722, 582, 450, 318, -282, 323, -170, -270, -125, -281, -578, 25, -349, -784, -267, -861, -584, -305, 100, 634, -135, 454, 153, 897, 759, 550, 482, 58, 374, 304, 227, 287, -830, -103, -691, -450, -154, -565, -205, -186, -368, -460, -333, -45, 41, 489]
7935D89p92Q22l60J74Q15j221R45m98o44N09n16J66o8p9J24k83q0j8J34k35l7
7956f53O87L81m69M81j32l85N57K02l04k8m10K66k73L69n6n11l2j26n8M43j66
7977b17l78j75L17O4o75O46K39J16J98M76n14R23p36k73P28Qm35M9m89L06o90
7998e12j80J9K91l8k5k25N93n51L50N26J11N1L7N15J67p01O7K43k33p62K44O2
8020D9K07l7l04P0l73K6k57K79q3k86R4M85k50N38j13k71Q75l78j2J79o8J56m69
8043E7J25o9N99o50m83Q6J76l78L1j0o56P15K68rJ67k78J047o5J99j32J9k89L53
8066H23K6p99J7K67n42k41M93k26l69M61k39L85m0pk4r7K10j26j46N75K49m91
8088A59P6q6k88R00o80o1M44p68Q1J32L01o54K94l86N34j68J08j62M82m93N16
$$ y = [489, -303, 519, 159, 333, 1148, -73, 872, 374, -270, 239, -277, -111, -179, -258, -134, -417, -497, -515, -381, -616, -653, 34, 415, -54, 427, 295, -90, 467, 669, 365, 337, -73, 193, -80, 289, 233, -278, -310, -436, -494, -51, -217, -595, -770, -453, -389, -1064, -418, -179, -63, 135, 611, 97, 1020, 284, 11, 739, 747, 312, 361, -128, 178, -512, -692, -673, -382, -420, -445, -670, -77, -628, -278, 248, 359, 410, 447, 962, 1129, 428, 495, 738, 505, -257, -13, 49, 256, 219, -85, -15, -388, -362, -619, -340, -423, -709, -615, -130, -380, 158, 45, -226, 649, 271, 259, 438, 370, 526, 57, 182, 113, 712, 62, -421, -335, -159, -537, -506, -516, -1172, -457, -189, -198, -31, -309, 738, 673, 872, 740, 759, 470, 823, 849, 50, 67, 334, -208, -449, 44, -182, -551, -90, -329, 56, 16, 9, -15, -112, 98, -28, -174, 401, 650, 159, 235, 149, -139, 761, 81, 20, 464, -304, -223, -91, 210, -444, -150, -536, -2, -170, -62, -224, 258, -235, 281]
8109B81j43L56J2j44K71L5p09O07q2m92J43k02m9l28l0j27J82K11j96j82K01K68
8131a17M8K27N46o29M09l15L2R9J39Jj10k35J70k66j59N34q60K30p2l38K78Q78
8153D90j127M89qQ3j78J16Q12n55K3K12R3J01J30n8l02n25k75J70P5N8k0k10k70
8176f76J39J8P91q0n36N91L24l97r8n01P16L22j47j70j29
$$ y = [281, 138, 494, 506, 362, 633, 668, -41, 566, 484, -8, 135, -67, -116, -444, -474, -601, -419, -208, -404, -586, -385, -117, -69, 158, 704, 75, 484, 169, 201, 300, 439, 440, 330, 95, 265, -1, -160, 374, -486, -256, -328, -666, -388, 490, -637, -148, -156, -73, -251, -135, 677, 122, 145, 357, 450, 551, 681, 623, 321, -204, -479, -309, -234, -176, -196, -406, -676, -537, -519, 272, 192, -344, 247, 571, 174, 76, -425, 291, 613, 466, 296, 167]
8191A67
$$ Imaginary data points
##PAGE= N=2
##DATA TABLE= (X++(I..I)), XYDATA
0@%%%%%%%%%%%%%%%%%%%%%j3M5o4O4o4O4o4P4j05J27j29J41j71J94k11K43k71
38a40L02l36L73m21M64n12N70o27O89p62Q42r30J021j122J242j374J517j675J857
57I78k067K313k607K951l368L897m591N536o899R053j2985K2480r3125p8868J70804
72A3502Q5156n7423m2514Q2347L4099n0838l2743K7694j3496n1124k7454J2794
84b0000K342j8019j8480J0216J8391n156k2910J1181L7337R165j4751K1437L1644
97D2397j9635l5039K2207M0052j1771l6372J816K5678P725j2298j1369k860m159
110F372j9171j9399R186J9089j9031l5483J1219L0923j5954k4115K9216L7644
122A0496q661O6M6338K6179k6667j2113K5123Q61m0027k5579L918L334j4692j8241
$$ y = [0, 0, 0, 0, 0, 0, 0, 0, 0, 0, 0, 0, 0, 0, 0, 0, 0, 0, 0, 0, 0, 0, -13, 32, -32, 32, -32, 32, -32, 42, -63, 64, -65, 76, -95, 99, -112, 131, -140, 162, -174, 199, -222, 242, -270, 300, -327, 362, -400, 442, -488, 533, -589, 653, -721, 796, -879, 978, -1089, 1224, -1383, 1568, -1800, 2097, -2494, 3042, -3857, 5196, -7789, 14691, -78434, -157302, 13502, 98658, 41235, -1279, 81068, 115167, 64329, 31586, 59280, 45784, -5340, -32794, -20000, -17658, -35677, -54157, -43941, -25550, -30706, -53616, -42435, -5098, 4067, -10684, 10753, 42397, 22762, -12277, 9930, 49982, 38211, 1839, 3655, 29333, 37058, 24760, 13391, 10531, 6372, -12799, -32198, -23012, -3923, -22954, -58437, -47218, -16295, -32249, -56364, -27148, 10496, 1835, 1901, 48239, 74418, 47751, 35638, 60761, 61622, 21595, -3984, -66, 3268, -11424, -29665]
136b9665j0926k679k669q661O625K3919O143j3628J7679N0370J2074k9072r91
149A8519K8801l086k7572J760J3740j4700j9877M807L004j7248j2514J006J915
162b1445J568K45p931M76J6995M972j3749K271K2498J821r826J9285K9831q195
176C8816k2550M730J3172j0465j5951l606m247p382k124l139p834n481n241p993
190c9295N237J6872K011l101K0414K4262m649r607J2281P210j6136l589J5462
203B7372m448k1392r06J2804p920j8075n669q53m381J780N161j96N64L417k6L608
219i160J2780L307q490O688K0983O3j1345M604P710j1288j0352O048k268j5886
233f606k212O842q726j2673O59j026p340Q759J6220r27n85J6038J1850o855Q42
$$ y = [-29665, -40591, -43270, -45939, -54600, -47975, -24056, -17913, -31541, -13862, 36508, 48582, 19510, 18519, 47320, 44234, 16662, 18422, 32162, 17462, -2415, 2392, 5396, -11852, -24366, -23360, -21445, -19877, -19632, -27563, -27087, -10092, -5120, -18869, -16598, 5900, 7721, -2105, 17180, 47011, 38816, 16266, 20996, 34168, 23703, 7752, 4146, -101, -7483, -9607, -12746, -20580, -26061, -31302, -39295, -34058, -17186, -15175, -18276, 2138, 26400, 21751, 12144, 24425, 31635, 15499, 11910, 27372, 22924, 1532, 626, 13430, 5510, -12565, -18234, -19087, -23468, -21688, -16527, -16723, -16159, -12742, -12768, -9160, 3620, 6927, -1563, 5125, 26108, 26171, 14826, 19430, 27140, 15852, 5500, 11548, 9280, -6606, -8818, -1976, -10702, -23375, -22716, -23742, -31082, -22323, -6103, -7030, -7615, 8423, 20273, 13418, 14260]
248A4260J1016q439j5661J0271J2635j2269j4206O869K651j5054o589M340l364
261a3540m515L321N566J91M201K114m095K873R524k804p346P545J0905l224l137
276G579P205j595j0523L356R942p408j2320K128K748q990n664K29m027l441P377
291a3404K917j170Q916J0731n196m188J3012O913j0862k229J3800J568r997k081
305H730M35r679p600K202m464q523L180O352P3K031O605l184l286P703M929p803
321b299J565J3098j647j0520Q485J0934j2743j2414J1661N544j3999n158J1503
334D010j771j3180J878P640o706p553P354O331k880n18M029J113J334K834J21
349D036Q95O845N29n268L551N974q702j3768K634O317r619p327N895M057k952
$$ y = [14260, 25276, 16837, 1176, 11447, 24082, 11813, -2393, 4476, 7127, -7927, -14516, -10176, -13540, -18055, -14734, -9168, -8977, -4776, -2662, -6757, -3884, 5640, 2836, -4510, 3035, 13940, 10716, 7579, 14784, 13189, 2666, 6022, 15964, 8556, -3764, -1636, 1112, -7878, -13542, -13313, -17340, -20781, -13404, -10487, -11657, -2741, 7990, 2794, -1394, 11618, 18531, 7669, 5440, 19240, 20808, 10811, 8730, 9165, -514, -8114, -5912, -10376, -18899, -15719, -9367, -9294, -7263, -658, -3842, -7128, 575, 5504, -2299, -734, 12364, 10717, 197, 8682, 19616, 6873, -5541, 6120, 11664, -2335, -7493, 4010, 2239, -10941, -9063, -1423, -8129, -15682, -8328, -1997, -4877, -5395, -1366, -253, 1081, 3915, 4036, 4931, 11776, 12305, 7037, 10588, 16562, 7860, -5908, -3274, 3043, -6576, -13903, -8008, -3951, -6903]
364f903q74K472j925L05M809k163n93J0452P055p086j275J1558o5j3301J30O156
380H752o691q428P537M810j2673m754Q699R01j0437N16Q163m5k016L475O30Q12
396g49N905K152m847J505P648l555n319M137K168q501l927L937k958n803O026
411b181M706r283m561Q845J364q463J098Q232k914k842R135N986l363J419L526
426A0704m887n871O005J863q090m49O622l603q843K225L549o863l529N158L14
441e695m043N135O809j352L6L740r48j814N794K980o746j402N936l887p595L906
457H54L231p915m592O419J629p425R58N975k921m464M457M013k612K098N926p44
473D887j613L117k79n348J969N105m329n104M612K682n760k045K207n829n330
$$ y = [-6903, -7777, -5305, -7230, -6925, -2116, -4279, -4872, 5580, 12635, 5549, 4274, 15832, 15767, 2466, 2596, 8752, 2061, -6367, 1170, 5980, -6693, -11447, -2748, -1847, -12284, -11768, -3605, -3650, -5666, -2191, -1561, -749, 5156, 7308, 2461, 3966, 11614, 8059, 2740, 6877, 9045, 544, -3383, 554, -2404, -8207, -2181, 2525, -6758, -11319, -2474, -1110, -9573, -8475, -243, -3157, -5999, 3136, 9122, 5759, 7178, 10704, 5817, -54, 5951, 7814, -276, -725, 5897, 2294, -6549, -4324, -775, -7638, -11167, -6009, -5695, -9738, -4603, 2206, 854, 890, 4630, 3682, 1868, 7662, 10642, 3896, 2494, 8430, 4543, -3052, 854, 4085, -3830, -8422, -2003, -374, -7799, -6841, -866, -3787, -8251, -3794, 219, -2393, -295, 5631, 4887, 3274, 6391, 6112, 764, 2733, 7838, 3509, -1595, 3017, 5699, -61, -2106, 101, -5728, -11058]
488a1058M704K498m414J480Q385j187m034O353O385o478k789O729J403o407J326
503B896M604m947l812L113j768p050J647O054l843m647L564K906l589J207O249
518B584k277l431M154K708k489R52L721l764l576L601L518l380j22K783l464l304
534a786K542j709o512J120M852k781m675M918N293l055M7N876n92n458M446N675
550H201k720j908L482j622o146J368L428o574m901K538J062l880L426L838l625
565d033n56O673L42n292L212O766l971l928N542J144p117n53P067k704n312L563
581H43K113o570J71O966k963q830L329O897l441l323O086n6o104K759N265l249
597a07k630O104L039m347J652N236l124n628Q04J324m727l082J537p34n46L301
$$ y = [-11058, -6354, -3856, -8270, -6790, 1595, 408, -3626, 2727, 9112, 2634, -155, 6574, 7977, 1570, 2896, 7500, 2553, -1259, 1854, 86, -6964, -5317, 737, -3106, -7753, -4189, -1283, -4872, -3665, 2584, 307, -3124, 1030, 3738, 1249, 2201, 5922, 2158, -1418, 2183, 5701, 2321, 2199, 4982, 1518, -1786, 756, -953, -7465, -6345, -1493, -4274, -8949, -4031, 1262, -1793, -1746, 4130, 3538, -1920, 2526, 8201, 5481, 3573, 7055, 5433, -713, 655, 4083, -2491, -7392, -4854, -3792, -7672, -4246, -408, -4033, -4589, 2084, 2426, -2866, 346, 7112, 3141, -787, 4755, 5899, -1218, -1771, 5296, 2592, -2720, 843, 2956, -3614, -3443, 3523, 560, -8270, -4941, 1956, -1485, -4808, 1278, 1222, -4882, -2123, 3142, -107, -2737, 3367, 6406, 2059, 3711, 8947, 5823, 195, 999, 2323, -2404, -5486, -3949, -4683, -5229, -1928]
613a928r03m562L881M605j314r74M607N89m567M646N889n440n833M317J754o897
629b130j103N960k154p122K605M687l970k523M937K88l382M327L203m891k247
644c515O587J483o073L47N246r86k451M090N93o001j383M440k579k824K253K03
660e70m413J147M825k370m342L616J808l549K526N753j703l004M979L326n677
675B352j460M616k208o117J888L186m975k439M021l78m042J593L210k840m85O560
691B482J494o272J841N207k009k601L755N30m727L56M395k184n050J936J090m171
707c928J47M348k037l127L340K028l605j025L700J07j927K776K360k968J178M126
723E493j229m148K240J174l645j593L305j142l058K502j39m603k89M598k49m270
$$ y = [-1928, -2831, -7393, -3512, 1093, -221, -1195, 3412, 4001, -566, 4080, 9969, 4529, -1304, 3013, 4767, -2130, -3233, 2727, 573, -6549, -3944, 743, -3227, -5750, -813, -525, -3907, 420, 3623, -1268, -3515, 3072, 4555, -1518, -1171, 4075, 3089, 638, 4728, 5321, -680, -2063, 2377, -202, -3026, -773, -570, -4983, -3836, 989, -1381, -5723, -2107, -299, -3848, -1322, 4431, 2728, -276, 4703, 8029, 2352, 892, 5508, 3300, -2817, -929, 2257, -2718, -5157, -1136, -1514, -5556, -3963, -753, -3593, -4078, 2482, 3976, -2296, -455, 4752, 2743, 142, 3897, 4427, -300, 56, 4451, 2267, -2783, -847, 243, -3928, -3781, 567, -1470, -4597, -1257, 771, -2834, -3859, -159, -52, -1979, 797, 3157, 189, 1367, 5493, 4264, 116, 2356, 3530, -115, -1708, 1597, 455, -2603, -101, -240, -4843, -5132, -534, -783, -5053]
739e053K836M264j904j093N806N8n315J432N136j985m829K729J124m875m96L984
755A819l089n435L440M312m042j612M035J026m041K663L346k662j932M163K401
770D392l520l06K280j340k228Q95J113j321j270K268j365o44J782j769k542M72
786c103J897j550j05K995q55k079L360L476k690j791M108Q06l881J634L107l535
802A794m436K736K023m634k769K883l12j313K612J397l468L18M491J044j558J470
818B278P60k006J87L810k233n069J182K455k544j248L530p21m147J821L710k204
834d39k832K249L11j686J396L086k618k346L547K034l041p44L506j116o28K996
850C675J774m910p19K488n76k846j30n5l811Q0M847r7m088L25L337R73N47J874
$$ y = [-5053, -2217, 2047, 143, -950, 4856, 4914, -401, 1031, 6167, 4182, -647, 2082, 3206, -1669, -2165, 1819, -1270, -6705, -3265, 1047, -2995, -4607, -572, 454, -3587, -924, 2422, -240, -2172, 1991, 4392, 872, 566, 2846, 1506, -722, 173, 1286, -35, -1305, 963, -402, -1046, 736, -1033, -3575, -3103, -1206, -2756, -2861, 134, -721, -2800, 560, 4036, 1346, -445, 3663, 4469, 588, 2222, 5329, 1794, -2642, 94, 2117, -2517, -5286, -2403, -2715, -4028, -1416, -19, -3487, -3169, 1322, 2366, 808, 2278, 3038, 1032, 1219, 5029, 2796, -2273, -1091, 1364, -1180, -2428, 1102, 381, -3766, -1945, 1765, -439, -3271, -1022, -711, -2397, -1001, 2085, -533, -2879, 668, 2702, -339, -1083, 2423, 1307, 679, 3675, 5449, 539, -180, 2308, 1732, -1114, -1244, -1299, -5110, -5030, -183, -280, -4368, -4043, -706, 267, 814, 2688]
868B688P87k229J427K340j881j509L64j572k741K586J178l925j822L981j58l594
884d080J948K388k397p19N192J995n542j689M785J34j608O04P95k561K89M483
900D017r3l144L60m72j740N75K425k507l879J747J731k764r4K888j085j293K982
917c46L765k830Q9M000J044l445N97R86l165k326M465k31n743j658K863j002j501
934d438K709N20j779m13M416J285k301J55J644j415O3K363Q74k714O74J347j423
951A567r82J203j962j091O52R22k369j687J830j24r93K62M02j302R39M051J559
968B877j833J280J134p56Q77K667k362k856q9J054k220k285J942j769l605Q31
984e113K694p24k170L354K003j055Q41K159n17l48K574J084l051m88K591j511
$$ y = [2688, 3475, 1246, 2673, 5013, 3132, 1623, 1987, 415, -2326, 260, 1438, -2487, -4309, -328, -486, -4080, -2132, 256, -2141, -2860, 2332, 4327, -1215, -2904, 1881, 2015, 407, 1011, 1806, -755, -466, 4017, 3924, 780, 1140, 668, -1072, -497, 1928, -579, -4458, -2711, -980, -3744, -3838, -950, -2035, -3328, -346, 3419, 589, 678, 4678, 5722, 2277, 2874, 3860, 695, -1631, 2834, 2603, -3140, -4798, -1935, -2937, -4438, -1729, -1209, -2988, -3401, 1015, 2300, -1, 154, 1798, 383, 446, 2809, 3683, 969, 1643, 2990, 1567, 585, 1788, -174, -1265, -613, 309, -2060, -3747, -1917, -2041, -3034, -2772, -2370, -3672, -2733, 1318, 2877, 1044, 2324, 3458, 2702, 3579, 6246, 3884, 1028, 939, 1993, -227, -2512, -570, -2339, -5944, -5113, -2419, -3143, -5313, -1959, 44, -1011, -170, 1989, 1472, 1124, 3698, 4782, 1731, 1243, 3834, 2323]
1000B323j590J837m2n591p7L489k24l594q4K240k767j836L888K117l366J24M193
1017A040Q29p95J920J782q99m55J458l73k484j27p1k444j674J70j659j382R74
1034d190Q90m49j108J469J471J177K757M66j270J391J905n03m59J653j005l491
1050G04L31K048k859k807J638J110l672r51K364m31k857J604L413k047k177L550
1066a039K810l23J181J199m70l91J917K117k687j261n70k461j192L53j140l255
1082e212n27J282r55j342K405K391q54J890L306J65j273K617K681j723n88O74
1098D937j938k385J216J480m516k302J626l05j659P68J334k540j567L215J856
1113g80p72L6K174N37p15K132K126j166K3J095N62j678n90p66j179p76j173k357
$$ y = [2323, 733, 2570, 2528, -3063, -3140, 349, 125, -3469, -3553, -1313, -4080, -5916, -2028, 89, -3277, -3153, 1040, 1869, 1074, 2994, 4776, 3877, 3422, 4880, 4507, 2023, 1896, 1825, -619, -2293, -2123, -3782, -5164, -4190, -3300, -3749, -4857, -3388, -1917, -740, 2017, 2483, 1213, 2604, 4509, 4006, 3547, 5200, 4195, 704, 1035, 3083, 224, -2583, -945, 165, -3507, -4458, -2094, -2525, -5382, -3778, -365, -2412, -4589, -1039, 1771, 1448, 2629, 3828, 3358, 2967, 4884, 7001, 4314, 3053, 2483, 22, -1170, -817, -1957, -5212, -5739, -4457, -5412, -6754, -4349, -1958, -2812, -922, 2384, 2549, 1276, 3893, 6574, 4851, 4263, 4937, 2999, 614, 1830, 3310, -1206, -3508, -1882, -2187, -3846, -3078, -1744, -4284, -5851, -2636, -780, -1552, -1516, 658, 1195, 480, 2612, 4738, 3572, 3595, 4690, 5252, 3574, 2984, 2218, 1039, 263, -910, -3267]
1131c267j594L82j069n43P36J688n12L72M872J561j666J715K902N09j781K000
1147F305J081m064k247J582j017m361o42O90r18j680P26J286j363P45L227m86
1163a136J08J909J82j26J687K347j639j305J767M94k095J93J254k710k714J114
1179f70N33k565j370J91o58j199J426J469j234J505K654J279k64K265K318j807
1195C873L68K120p01l135k54Q21k737k541k97o66j879r52K178o23n86J817R76
1212b218K11J969J817K01m46K381N49j844J313J229k461j539J668p94l013p11
1228a688J127j587k090P30P94j675n97K830N06j209K114K180l23M88K609Q60j985
1245C084P15J538j777j231M99j400k881m09O24l042p80J678l31j299J346K767
$$ y = [-3267, -4861, -4479, -5548, -6091, -5355, -3667, -4179, -3807, 1065, 2626, 960, 2675, 5577, 6086, 4305, 6305, 7386, 3322, 1075, 2657, 1640, -2721, -3363, -2673, -3591, -5271, -4545, -3259, -4622, -3877, -650, -1136, -1028, 881, 1063, 937, 2624, 4971, 3332, 2027, 3794, 4288, 2193, 2386, 3640, 930, -1784, -670, -137, -2702, -4072, -3881, -4539, -5738, -4312, -2843, -4077, -2572, 82, 1361, 1097, 3362, 5680, 3873, 4241, 6361, 5660, 2525, 2271, 3092, 355, -2186, -2483, -3149, -5028, -5980, -3802, -4425, -5011, -3194, -2218, -2007, -38, 1779, 1980, 1534, 3915, 4464, 2620, 3933, 5162, 2701, 1162, 2830, 2036, -977, -1688, -561, -2148, -4238, -3508, -2714, -4389, -4986, -2156, -1650, -2859, -745, 1435, 1112, 1600, 4209, 5069, 3084, 3799, 5337, 3560, 2329, 2828, 1428, -1453, -1862, -1238, -4280, -5060, -3382, -3713, -5012, -3666, -899]
1261h99j002l52L241J863j121J72K653p63j474M15J931k792j535J041p04j679
1277a005o76N83j434j898K137O11j434o11J641p6k30J666J524p1J12K623K19l00
1295C381Q60k39n20n83n16j529j407n80k068r93Q07k83j747j09L595J363j509
1312b077J390K704K88l50K149J472l304j116K523q18k920L82J55k161j417J095
1328b005N95j116J75R84L83l32P30k2r60J136J348n56o70O58P91k98Q43J455j562
1347A577n08M55N16q01m91k23k068j343J487o73j468K74Q50J67p37K545R50o79
1365a70J251K572k82q66j85J817r17j872r8o68k138p83P92o00n95k12L58K57J602
1384g37R41j58J49Q11P23n20O81k67j446J36J084l41j918O21J332j202k30P64
$$ y = [-899, -1901, -2253, 988, 2851, 1730, 1902, 4555, 3792, 2318, 2733, 4664, 1872, 337, 1378, 674, -1005, -1681, -1098, -2532, -4430, -2293, -1682, -3116, -3727, -2086, -2162, -2392, -726, 798, 727, 839, 3462, 3681, 3381, 4241, 4002, 3482, 2899, 2383, 854, -553, -1133, -3201, -4194, -3387, -3670, -5417, -5526, -1931, -568, -2077, -687, 2017, 2305, 1955, 4104, 5576, 2272, 1156, 3679, 2861, -59, 323, 478, -1683, -3100, -2005, -1410, -2526, -2351, -1367, -984, -1316, -586, -608, -1568, -432, 916, 360, -310, 348, 1139, 841, 1684, 3139, 1577, 1069, 1524, 2040, 1239, 748, 525, -1543, -2886, -1399, -2072, -3540, -3266, -2416, -2249, -2986, -441, 509, -170, 1081, 3653, 3371, 2505, 2320, 4137, 3220, 1348, 1250, 582, -1556, -2339, -1547, -2147, -2742, -2954, -2596, -2339, -737, 204, 46, 195, 1006, 1729, 1209, 1890, 1623, 177, 313, 1397, 1056, -862, -241, 1091, -111, -341, 423]
1402D23K37j424M40N74q11q28m37Q57j207M19K147p47j479J027K460l24k73Q99
1420A953m60J81N37P87k382n07k50m03j473K26L89q61n01J182M4m21J982P24l09
1439D38l48J713q8j108O48J130p85j359K10Lj837j2J929n5l087P06K270m4q64
1458e40M38j57o81L14J364P2j664J310K55k85k16L11R4k71N44Rr68O73l01q13
1478e12K55Q08j661r26O53J124r25k0Q36l68o90J819J492n50r96J055J44l54m96
1497F88P73p65j603M65Qm85o62R62o65o50J394O22l50n01J947j96r77L49N67p18
1517B03L31M95j82j281L54J226j038l75L83L85j705O39J369o03r33P3p2j109N37
1536a303J420l45q84P68J152Pn83R93Q96q12M0K03r00k39J07l94j272N2r0o72
$$ y = [423, 660, -764, -324, 250, -561, -1389, -1826, -969, -2176, -1757, 390, -357, -1836, -809, 1651, 1327, 1054, 1953, 1493, 1674, 2211, 2998, 616, 109, -141, -544, -2017, -1791, -1402, -2263, -2764, -1582, -1538, -1959, 23, 747, 438, 90, 1803, 1715, 607, 1255, 2385, 1600, 241, 451, 454, -1383, -1395, 534, 479, -2608, -1902, 368, 324, -540, -102, -259, -940, -626, 738, 810, -854, 456, 711, 426, 210, 521, 615, 344, 888, 897, -71, 602, 301, -512, -257, 551, -1110, -2036, -1383, -259, -1184, -1204, -368, -736, -1426, 393, 1885, 1335, 339, 1394, 1538, 1184, 688, 1461, 696, -907, -442, -434, -919, -1581, -619, -1284, -1934, -540, 82, -268, -769, 1178, 982, 5, 354, 921, 203, 534, 1029, 847, -434, -80, 1146, 108, -267, 116, 501, -1204, -565, 804, 201, -732, -659, -731, -1840, -1303, 117, -228, -1112, -344, 808, 815, 232, 1225, 2121, 1309, 1349, 1552, 652, 413, 520, 126, -1146, -1094, -1184, -1856]
1556a856K07J290k66m53Q80M22K49L78J504j125j376R99K14p89m47N71j88j784
1574a570M84R76n51L09N81P22j522N22J137j88j629O86M87j354o46J252O96o1
1592C31k46M46k90J138J023m75o86k49j18k095Q32M56j414j119J192m67n70M30
1610a881K852q91m1P59R42j18j29Q34K12j298n67J37j371j354J213m39j628O4
1628b704J645P53n27J039O31O69p02P00n6q19n2k99p47l70P37j95m25m4L55P6
1648c35M96O33k68q1M82k17j179O90J6n59j150M2L61N15l55J085L05K05L97Q34
1668A917o29J01J260j166j701k08M40j535q54K71O01n79K43J972kl62J203J105
1686B077m69n70J254j95j049j103j38o05J44K2j053k09R19M53k39M2J135j28n74
$$ y = [-1856, -1649, -359, -625, -1078, -198, 224, 473, 851, 2355, 1230, -146, 853, 1067, 278, -169, 402, 214, -1570, -1086, -110, -661, -352, 229, 951, -571, -49, 1088, 900, -729, -43, 444, -910, -1556, -304, 392, 331, 85, 531, 241, 1379, 2402, 1927, 1241, 992, 874, -1221, -389, 67, -1347, -2466, -1274, -1741, -2311, -1881, 971, 80, 39, 798, 1740, 1622, 1493, 2327, 2539, 1241, 674, 811, -560, -1914, -701, -1140, -2768, -2704, -1059, -306, -833, 206, 837, 1506, 804, 1504, 1448, 629, 577, 278, -469, -839, -102, -297, -722, -766, -411, -335, 161, 794, 526, 445, 927, 710, -469, 221, 237, -322, -1472, -1430, -1069, -554, -909, 176, 481, 686, 1083, 1917, 1288, 1389, 2649, 1483, -218, -426, 14, -1521, -2375, -2104, -1503, -2082, -1839, 133, 131, -231, 972, 2077, 1608, 1038, 2292, 2097, 1048, -55, -193, -798, -654, -632, -1685, -1894, -975, -522, -761, -719, 416, 288, -286]
1705b86oJ564j068k10N07o3p45o7N49kK4R6N84k2j021R32k1n97kk97j541Q08K33
1728f51l43l95M9O66j3K09J237J76q2O70N31l69o75K51q90q18m09L3q16l55R20
1749a074N39j022J198J46j89N54P39N8p69K82R28r69l91J86O04j976K97J364O10
1768A115j458J99L19j99k75p4p32l50N66R35p50k10K57j97K22N64R80n05N70J009
1788A986M11l87m79o06n78o58J86m68j595j26N03L83j48J50N26L10R21N43O63
1807A537M46k24P2p64L14O1j397j109P50M1Q0n76J26r51J495K31j34r41J58Q88
1827A03j82k65N47r05q71O53J324j25j47M60R51p88P70O84r25k043P63O89n57
1846A36j241R5r23q1N16k34L6NJ045M25Q54O64Q7O12P02q58J15j097mj38o49o47
$$ y = [-286, -292, 1272, 204, -6, 501, 438, -307, -374, 175, 173, 197, 293, 877, 855, -166, 766, 745, 148, 146, -151, -1692, -884, -651, -994, -1389, -1340, -674, -687, -478, 759, 935, 853, 1523, 2054, 1685, 1010, 1261, 371, -447, -856, -823, -1639, -1994, -1074, -535, -1557, -359, -213, -402, 152, 891, 949, 180, 462, 1390, 421, 30, 216, 820, -1156, -859, 505, 1115, -343, -144, 175, -24, -299, -373, -1105, -1455, -889, 46, -704, -914, -657, -854, -632, -68, 912, 407, 977, 1986, 2397, 2010, 1531, 925, 347, -311, -125, -593, -2188, -2314, -1811, -1428, -1576, -1426, -900, -590, 331, 874, 1537, 1983, 1759, 1831, 1067, 1381, 1442, 45, -1064, -314, -273, -193, -769, -643, -1594, -99, 132, -2, -943, -785, 103, -79, -344, 203, -702, -1573, -920, 404, 279, 132, 592, 1543, 755, 1525, 2209, 1284, -759, 4, 693, 136, -1105, -1010, -1933, -2014, -1498, -1732, -1696, -1691, -646, -221, 633, 1297, 1384, 1996, 2698, 1840, 1955, 858, 854, 716, 67, -580]
1868e80K84p20j735L41J149K71Kj92M08R35O93j90j33n75O17J44L30KJ00l77j14
1889F60k11L79p30n22M3K49l15M04j028m38n71Q92L29k72o61N72J193N2J473n34
1909I64k85L86P16n4o19N80n12r24l10N16q76j163J80J27r97Q1Q77mk5Q31J426
1930I15n64k79J037Q64n27O36l79n29n01Q07m56m10j815K35O9j83R5L30j307l11
1950b273P01N30J04R9R03n93J310R08k36l97M11j39Q6l15l78R2k18k93n77n65
1970h40o15P05l13q94N25O04p44l80J677K34Q00l32k74J93R53P94j19o36J66j12
1990A392p88k92J17n70q94k91O25m85j439J235J12K35N08M47Q9l16J389j5J55
2009A214N45j075J91L17Q83l04o51j305L61J9l01m52l15n04m33J24Q47j241K20
$$ y = [-580, -296, -1016, -2751, -2410, -1261, -990, -988, -1180, -772, 163, 856, 666, 533, -42, 575, 719, 1049, 1051, 1151, 774, 660, 449, 828, 98, -424, -381, -132, -447, -43, -1071, -1509, -2080, -1188, -859, -1131, -1792, -1220, -27, 25, 1498, 964, 679, 1065, 1781, 1727, 1108, 1688, 1176, 252, -58, 458, -418, -1581, -1401, -1274, -2271, -2190, -1313, -1317, -1342, -511, 915, 351, 72, 1109, 1973, 1446, 2082, 1703, 1174, 673, 1480, 1024, 614, -1201, -966, -897, -1080, -985, -655, -1962, -2273, -1572, -1042, -938, -839, 64, -529, 781, 1689, 1453, 1056, 1467, 1328, 1414, 1099, 721, 813, 595, 302, -275, -840, -1455, -750, -1063, -1957, -1432, -828, -1572, -1952, -275, -41, 759, 427, 153, 346, 1299, 2093, 1974, 1338, 1504, 1392, 604, 312, 429, -141, -1035, -1326, -701, -1186, -2625, -1390, -1278, -1043, -535, -88, 1, -315, 1074, 1059, 1214, 1759, 684, 875, 1192, 2075, 1771, 1120, -185, 176, 195, -106, -558, -873, -1377, -1810, -1686, -839, -2080, -1860]
2028a860O74J92P7J326M6K9Q49O94OK91J49l60n31q88J89j248n95n16J93m17m27
2049b127m00k56N00J074N05L79N56J09J244K72j21k67J4k55O11j62m47q64K19
2068E84p23m05K48p97p43Q19k06O43p07Ok91j64J296K80m28K98J444N41Q31l26
2088B200N97n48lk06j42j046p90j320j61k94n22n45j399P43L40J841L32L71J242
2107F90M44J080J13l12M96r9K19n64l36r71p90n73m83q09m3k82k85N84p0Q95M78
2128f18l87k95Q24P65L29j9M89O4Q40P01k46r46M08j24J70n91q71j94q19j122
2148a642n35p30p05k30M33Q39J153J82L02N56J862J208O80J73M49k15o94K69j073
2167B282k133o01r56p01r18j53m22O8K94M36J131M72M33P59Q98P61R38K9k14j09
$$ y = [-1860, -1186, -994, -917, 409, 455, 484, 1333, 2027, 2033, 2324, 2473, 2113, 1582, 694, 883, -365, -960, -1476, -1283, -1700, -2127, -2527, -2783, -2283, -1209, -704, -325, 231, 340, 1584, 1856, 1735, 1468, 1482, 1227, 1838, 1676, 1229, 365, 584, -139, -544, -296, -1093, -1836, -1017, -1223, -580, -1287, -1281, -1572, -1736, -440, -160, -588, -290, 1154, 1695, 2526, 2200, 2797, 2249, 2246, 2040, 1898, 852, 62, -1258, -1419, -1713, -2235, -2780, -4179, -3436, -3096, -1255, -923, -552, 690, 1134, 2214, 2327, 2015, 2511, 2412, 2631, 2067, 1731, 760, -30, -603, -1086, -1895, -1938, -2220, -2505, -1921, -1991, -1096, -618, -1005, -1300, -476, 289, 618, 599, 1088, 1152, 1992, 2693, 2447, 1501, 1909, 1785, 1955, 1364, 493, 299, -520, -1642, -2177, -2907, -3612, -3842, -3409, -2570, -1417, -1235, -933, -377, 1485, 2693, 3373, 3546, 3995, 3780, 3086, 3355, 2282, 149, -452, -1408, -2109, -3027, -3180, -3602, -3534, -3240, -2804, -1673, -1201, -768, -9, 889, 1650, 2588, 2617, 2403, 2294]
2187B294K16P3j265l87k02l41K31j019m22p13j97K52q35o4k23j52m4J248O05K84
2207f61P11K62J744M64O82q9j51O85O4o75j622j301q86p17j198l59p81o64K39
2226d253R00P16K96J131J135N21J388R97J06P96L2m37k81n17j379o82j99k82r10
2245i22p85j053M2J3k24q4O41j17Q64Q14Q82R8O57M41J02N07P89M65m13l98L69
2266B688p59r70j087p79j45r67m38p66n43l18O32J130rQ97R00J155J134O15J059
2285C429k53L82k73k28m36q03r62n26n63r82r10m96j037M94K2J22P41j92J369
2304a102J845m08O11N77J53J91O78O61p2p85l35K03p73q42j027l54p54J57j100
2323b476p0k46k68J91R52L57J41R65R82R30J019M35r5K41r3L78k05j604j225m30
$$ y = [2294, 2510, 2583, 1318, 931, 729, 388, 619, -400, -822, -1535, -1732, -1480, -2315, -2379, -2602, -2754, -2798, -1550, -945, -661, 50, 312, 2056, 2520, 3202, 3113, 2962, 3647, 3711, 3036, 1414, 113, -773, -1490, -2688, -3047, -3828, -4492, -4253, -3353, -2637, -2341, -1210, -75, 446, 1834, 2831, 2937, 3733, 3765, 3328, 3047, 2530, 1151, 469, 270, -12, -922, -1707, -2760, -2718, -2705, -2929, -3013, -2372, -2489, -1625, -811, 71, 169, 826, 1267, 1369, 1876, 2665, 3130, 2717, 2319, 2688, 1929, 959, -128, -907, -1052, -2019, -2457, -3223, -3766, -4084, -3452, -2322, -2331, -1434, -534, 621, 1755, 2370, 3429, 3176, 3558, 3285, 3057, 2621, 1818, 856, 330, -233, -1215, -2125, -2621, -3658, -3164, -3142, -3020, -2279, -2471, -1102, 743, 335, 946, 1523, 1676, 1867, 2545, 3206, 3134, 2349, 2014, 2217, 1444, 602, -425, -779, -1533, -1376, -2476, -2546, -2792, -3060, -2869, -1917, -1560, -1419, -454, 528, 1458, 2477, 2912, 2817, 3058, 2965, 3343, 3138, 1534, 309, -121]
2343a21j02q53q83r73q98K52K82O95l9M57J882L55N35O11N59M97j23O85LJ18m70
$$ y = [-121, -223, -1076, -1959, -2932, -3830, -3578, -3296, -2601, -2640, -2183, -301, 54, 589, 1200, 1759, 2256, 2133, 2818, 2821, 2939, 2469]
$$ [...]
8191D02
##END NTUPLES=NMR FID
##END=
