##TITLE=1H_L1(magrari)
 CDCl3, 32 sc, 
 1.06.2021
##JCAMPDX= 6.0         $$ Bruker NMR JCAMP-DX V2.0
##DATA TYPE= NMR FID
##DATA CLASS= NTUPLES
##ORIGIN= UXNMR, Bruker Analytische Messtechnik GmbH
##OWNER= root
$$ XWIN-NMR		Version 3.5
$$ Tue Jun  1 11:29:09 2021 Russian Standard Time (UT+4h)  she@DPX200
##.OBSERVE FREQUENCY= 200.131506
##.OBSERVE NUCLEUS= ^1H
##.DELAY= (6, 6)
##.ACQUISITION MODE= SIMULTANEOUS
##.ACQUISITION SCHEME= undefined
##.AVERAGES= 8
##.DIGITISER RES= 18
##SPECTROMETER/DATA SYSTEM= spect
##.PULSE SEQUENCE= zg30
##.SOLVENT NAME= CDCl3
##.SHIFT REFERENCE= (INTERNAL, CDCl3, 0, 15.7039)
##AUDIT TRAIL= $$ (NUMBER, WHEN, WHO, WHERE, WHAT)
$$ ##TITLE= Audit trail, XWIN-NMR		Version 3.5
$$ ##JCAMPDX= 5.01
$$ ##ORIGIN= Bruker BioSpin GmbH
$$ ##OWNER= she
$$ F:/spectra/data/she/nmr/H-F/1/audita.txt
$$ ##AUDIT TRAIL=  $$ (NUMBER, WHEN, WHO, WHERE, WHAT)
(   1,<2021-06-01 11:28:08.20 +0400>,<she>,<DPX200>,
      <created by zg, POWCHK disabled, PULCHK disabled
       configuration hash MD5:
       00 E9 B6 7A A2 85 ED C7 34 08 36 98 17 FE 4E 26
       data hash MD5: 16K
       6C 78 AF EE E3 59 69 00 D1 0B 15 FC 00 C0 16 7B>)
$$ ##END=
$$ 
$$ hash MD5
$$ C8 9D 91 49 46 D7 19 CD F8 D9 66 A0 F7 6F 6D D3
##$RELAX= 
##$RELAX= 
##$RELAX= 
##$RELAX= 
##$RELAX= 
##$RELAX= 
$$ Bruker specific parameters
$$ --------------------------
##$DU= <F:/spectra>
##$EXPNO= 1
##$NAME= <H-F>
##$PROCNO= 1
##$TYPE= <nmr>
##$USER= <she>
##$AMP= (0..31)
100 100 100 100 100 100 100 100 100 100 100 100 100 100 100 100 100 100 
100 100 100 100 100 100 100 100 100 100 100 100 100 100 
##$AQSEQ= 0
##$AQ_mod= 1
##$AUNM= <au_zg>
##$AUTOPOS= <>
##$BF1= 200.13
##$BF2= 200.13
##$BF3= 200.13
##$BF4= 200.13
##$BF5= 200.13
##$BF6= 200.13
##$BF7= 200.13
##$BF8= 200.13
##$BYTORDA= 1
##$CFDGTYP= 0
##$CFRGTYP= 5
##$CHEMSTR= <none>
##$CNST= (0..31)
1 1 145 1 1 1 1 1 1 1 1 1 1 1 1 1 1 1 1 1 1 1 1 1 1 1 1 1 1 1 1 1 
##$CPDPRG= <>
##$CPDPRG1= <>
##$CPDPRG2= <>
##$CPDPRG3= <>
##$CPDPRG4= <mlev>
##$CPDPRG5= <mlev>
##$CPDPRG6= <mlev>
##$CPDPRG7= <mlev>
##$CPDPRG8= <mlev>
##$CPDPRGB= <>
##$CPDPRGT= <>
##$D= (0..31)
0 1.2 0 0 0 0 0 0 0 0.06 0 0.03 0 0 0 0 0.0002 0 0 0 0 0 0 0 0 0 0 0 0 
0 0 0 
##$DATE= 1622532487
##$DBL= (0..7)
120 120 120 120 120 120 120 120 
##$DBP= (0..7)
150 150 150 150 150 150 150 150 
##$DBP07= 0
##$DBPNAM0= <>
##$DBPNAM1= <>
##$DBPNAM2= <>
##$DBPNAM3= <>
##$DBPNAM4= <>
##$DBPNAM5= <>
##$DBPNAM6= <>
##$DBPNAM7= <>
##$DBPOAL= (0..7)
0.5 0.5 0.5 0.5 0.5 0.5 0.5 0.5 
##$DBPOFFS= (0..7)
0 0 0 0 0 0 0 0 
##$DE= 6
##$DECBNUC= <off>
##$DECIM= 32
##$DECNUC= <off>
##$DECSTAT= 4
##$DIGMOD= 1
##$DIGTYP= 9
##$DL= (0..7)
0 120 120 120 120 120 120 120 
##$DP= (0..7)
150 150 150 150 150 150 150 150 
##$DP07= 0
##$DPNAME0= <>
##$DPNAME1= <>
##$DPNAME2= <>
##$DPNAME3= <>
##$DPNAME4= <>
##$DPNAME5= <>
##$DPNAME6= <>
##$DPNAME7= <>
##$DPOAL= (0..7)
0.5 0.5 0.5 0.5 0.5 0.5 0.5 0.5 
##$DPOFFS= (0..7)
0 0 0 0 0 0 0 0 
##$DQDMODE= 0
##$DR= 18
##$DS= 0
##$DSLIST= <SSSSSSSSSSSSSSS>
$$ [...]
##$SUBNAM2= <"">
##$SUBNAM3= <"">
##$SUBNAM4= <"">
##$SUBNAM5= <"">
##$SUBNAM6= <"">
##$SUBNAM7= <"">
##$SUBNAM8= <"">
##$SUBNAM9= <"">
##$SW= 16.9725357007746
##$SWIBOX= (0..15)
0 0 2 0 0 0 0 0 0 0 0 0 0 0 0 0 
##$SW_h= 3396.73913043478
##$TD= 16384
##$TD0= 1
##$TE= 0
##$TE2= 300
##$TE3= 300
##$TEG= 300
##$TL= (0..7)
0 120 120 120 120 120 120 120 
##$TP= (0..7)
150 150 150 150 150 150 150 150 
##$TP07= 0
##$TPNAME0= <>
##$TPNAME1= <>
##$TPNAME2= <>
##$TPNAME3= <>
##$TPNAME4= <>
##$TPNAME5= <>
##$TPNAME6= <>
##$TPNAME7= <>
##$TPOAL= (0..7)
0.5 0.5 0.5 0.5 0.5 0.5 0.5 0.5 
##$TPOFFS= (0..7)
0 0 0 0 0 0 0 0 
##$TUNHIN= 0
##$TUNHOUT= 0
##$TUNXOUT= 0
##$USERA1= <user>
##$USERA2= <user>
##$USERA3= <user>
##$USERA4= <user>
##$USERA5= <user>
##$V9= 5
##$VALIST= <valist>
##$VCLIST= <CCCCCCCCCCCCCCC>
##$VD= 0
##$VDLIST= <DDDDDDDDDDDDDDD>
##$VPLIST= <PPPPPPPPPPPPPPP>
##$VTLIST= <TTTTTTTTTTTTTTT>
##$WBST= 1024
##$WBSW= 4
##$XGAIN= (0..3)
0 0 0 0 
##$XL= 0
##$YL= 0
##$YMAX_a= 137704
##$YMIN_a= -160884
##$ZGOPTNS= <>
##$ZL1= 120
##$ZL2= 120
##$ZL3= 120
##$ZL4= 120
##$ABSF1= 10
##$ABSF2= 0
##$ABSG= 5
##$ABSL= 3
##$ALPHA= 0
##$AQORDER= 0
##$ASSFAC= 0
##$ASSFACI= 0
##$ASSFACX= 0
##$ASSWID= 0
##$AUNMP= <proc_1d>
##$AZFE= 0.1
##$AZFW= 0.1
##$BCFW= 1
##$BC_mod= 2
##$BYTORDP= 1
##$COROFFS= 0
##$CY= 11.3945322036743
##$DATMOD= 1
##$DC= 2
##$DFILT= <>
##$DTYPP= 0
##$F1P= 15.9154993809931
##$F2P= -4.1035820241983
##$FCOR= 0.5
##$FTSIZE= 0
##$FT_mod= 4
##$GAMMA= 1
##$GB= 0.15
##$INTBC= 1
##$INTSCL= 1
##$ISEN= 128
##$LB= 0.24
##$LEV0= 0
##$LPBIN= 0
##$MAXI= 10000
##$MC2= 0
##$MEAN= 0
##$ME_mod= 0
##$MI= 1.114404
##$NCOEF= 0
##$NC_proc= 0
##$NLEV= 6
##$NOISF1= 3.799351
##$NOISF2= 2.8
##$NSP= 1
##$NTH_PI= 0
##$NZP= 0
##$OFFSET= 15.70392
##$PC= 1
##$PHC0= -11124.92
##$PHC1= 18.60099
##$PH_mod= 1
##$PKNL= yes
##$PPARMOD= 0
##$PSCAL= 0
##$PSIGN= 0
##$REVERSE= no
##$SF= 200.130013532006
##$SI= 16384
##$SIGF1= 3
##$SIGF2= 2
##$SINO= 400
##$SIOLD= 16384
##$SREGLST= <1H.CDCl3>
##$SSB= 0
##$STSI= 0
##$STSR= 0
##$SW_p= 3612.71676300578
##$SYMM= 0
##$S_DEV= 0
##$TDeff= 0
##$TDoff= 0
##$TI= <>
##$TILT= no
##$TM1= 0
##$TM2= 0
##$TOPLEV= 0
##$USERP1= <user>
##$USERP2= <user>
##$USERP3= <user>
##$USERP4= <user>
##$USERP5= <user>
##$WDW= 1
##$XDIM= 8192
##$YMAX_p= 0
##$YMIN_p= 0
$$ End of Bruker specific parameters
$$ ---------------------------------
##NTUPLES= NMR FID
##VAR_NAME=  TIME,          FID/REAL,        FID/IMAG
##SYMBOL=    X,             R,               I
##VAR_TYPE=  INDEPENDENT,   DEPENDENT,       DEPENDENT
##VAR_FORM=  AFFN,          ASDF,            ASDF
##VAR_DIM=   8192,          8192,            8192
##UNITS=     SECONDS,       ARBITRARY UNITS, ARBITRARY UNITS
##FACTOR=    0.0002944,     1,               1
##FIRST=     0,             0,               0
##LAST=      2.4114304,     0,               0
##MIN=       0,             -160884,         0
##MAX=       2.4114304,     137704,          0
$$ Real data points
##PAGE= N=1
##DATA TABLE= (X++(R..R)), XYDATA
$$ [...]
$$ plain form
1741 46 127 -141 -189 460 -141 172 251 16 204 166 169 365 300 421 215 -112 -81 436 135 77 339 -165 289
1764 289 202 398 281 -124 197 -15 -62 401 42 -284 195 40 179 218 172 -85 -280 -68 -149 -481 301 -343
1786 -343 -331 66 -103 -63 28 -178 31 -222 -22 -125 -368 21 -389 -268 70 -77 219 -147 -19 -207 -298
1807 -298 102 32 29 178 -187 30 244 249 385 424 -18 -417 170 282 95 311 -57 144 64 557 251 409
1829 409 102 209 -244 492 200 -49 221 212 160 296 629 113 227 389 -25 46 232 -18 -90 40 7 -13
1851 -13 -40 314 126 -86 150 -411 -504 224 -172 -158 -25 -415 24 46 290 -177 -148 -267 -322 35 68 -80 -460
1874 -460 -288 -320 -89 96 -159 -470 -422 -118 7 24 -118 -118 -181 220 -61 60 240 -59 -32 127 36 38 109 15
1898 15 425 277 -74 524 80 47 327 -181 113 -61 56 471 -20 344 149 33 564 305 336 42 -350
$$ packed form
1741D6Q1k68m8O49o01L13P9k35J88l8LJ96o5J21k06l27L1N17l01n8K62n04M54
1764B89q7J96j17m05L21k12m7M63l59l26M79j55J39L9m6k57j95K12q1l32P82o44
1786c43J2L97j69M0R1k06K09k53K00j03k43L89m10J21L38j47K96l66J28j88r1
1807b98M00p0lJ49l65K17K14NJ36L9m42l99N87J12j87K16l68K01q0M93l06J58
1829D09l07J07m53P36k92k49K70rn2J36L33n16J14J62m14P1J86k50p2J30l3k0
1851a3k7L54j88k12K36n61r3P28l96J4J33l90M39K2K44m67K9j19n5L57L3j48l80
1874d60J72l2K31J85k55l11M8L04J25J7j42%o3M01k81J21J80k99K7J59r1KP1r4
1898A5M10j48l51N98m44l3K80n08K94j74J17M15m91L64j95j16N31k59L1k94l92
$$ plain form
1919 -350 -90 -74 -78 389 -46 266 172 -273 550 53 -419 -82 -218 2 234 -226 -245 -194 -64 232 105 -138
1941 -138 35 -232 -185 -21 -314 -411 -267 -114 -111 223 19 -124 -151 -77 -503 -432 -285 -444 166 -120 -84 61 -168
1964 -168 119 331 -79 41 -173 -232 -11 147 39 -111 -204 -162 346 101 532 135 -52 30 -408 74 -243
1985 -243 155 151 -131 408 276 536 -146 -23 65 -64 227 -641 6 -146 548 7 -20 -152 -71 256 -152 -215
2007 -215 -111 -297 -17 -190 17 138 152 208 172 41 -46 -550 -276 -286 -186 125 269 -607 -256 2 -130 -162
2029 -162 57 -508 150 -490 -216 -131 140 -4 220 1409 -83 540 -307 -107 -12 83 -245 419 -548 -26
2049 -26 386 173 627 223 17 202 133 117 78 156 355 19 -175 -51 214 206 360 312 62 250 189 -343 -84
2072 -84 267 -103 -73 129 200 430 137 13 -28 -251 -215 100 -40 82 116 109 26 158 23 -90 -47 -280 234
$$ packed form
1919c50K60J6mM67m35L12r4m45Q23m97m72L37j36K20K32m60j9N1J30K96j27k43
1941a38J73k67M7J64k93r7J44J53LL34k04j43k7P4m26P1J47j59O10k86L6J45k29
1964a68K87K12m10J20k14n9K21J58j08j50r3M2N08k45M31l97j87Q2m38M82l17
1985b43L98mk82N39j32K60o82J23Q8j29K91q68O47j52O94n41k7j32Q1L27m08o3
2007b15J04j86K80j73K07J21J4N6l6j31q7n04K74j0J00L11J44q76L51K58j32l2
2029a62K19n65O58o40K74Q5K71j44K24J189j492O23q47K00R5R5l28O64r67N22
2049b6M12k13M54m04k06J85o9j6l9P8J99l36j94J24K65qJ54m8k50J88o1n32K59
2072h4L51l70L0K02P1K30k93j24m1k23L6L15j40J22L4pq3J32j35j13M3k33N14
$$ plain form
2095 234 -157 -61 -279 -45 -208 -271 67 52 42 3 -267 -34 -131 -141 -108 -153 -116 -139 8 190 258 -262 -134 -306
2119 -306 -114 54 20 23 129 -58 -97 283 18 91 83 6 121 191 151 271 -86 12 290 487 671 -91 941
2142 941 -89 80 260 10 -61 130 141 239 -10 144 -75 113 131 -63 -106 -36 -38 52 -45 36 -37 242 116 -129
2166 -129 -14 -4 -262 -376 -355 -139 -301 -64 -101 317 342 -62 -2 -416 -332 -245 6 64 238 -383 -81 -125 41
2189 41 158 -382 -15 -75 -67 -362 -208 -10 -152 116 154 42 465 220 210 122 -7 -7 -225 12 -58 101 102 213
2213 213 -41 295 227 93 25 -22 -132 -49 227 163 27 118 45 281 166 324 163 -184 24 -125 -167 26 -169
2236 -169 -263 -15 43 519 184 -175 -292 -214 -31 -166 108 -327 -253 79 -114 -155 85 -162 -324 106 -18 -104
2258 -104 -207 -185 -478 -393 51 186 -58 -397 199 -618 234 -133 632 116 -18 -135 936 730 711 402 1100
$$ packed form
2095B34l91R6k18K34j63o3L38j5j0l9k70K33r7j0L3m5L7k3J47J82O8n20J28j72
2119c06J92J68l4LJ06j87l9L80k65P3qp7J15P0m0J20l57R8K78J97J84p62J032
2142I41j030J69J80k50p1J91J1R8k49J54k19J88J8j94m3P0kR0r7Q1p3K79j26k45
2166a29J15J0k58j14K1K16j62K37l7M18K5m04O0m14Q4Q7K51N8J74o21L02m4J66
2189D1J17n40L67o0Qk95J54J98j42K68L8j12M23k45j0q8j29%k18K37p0J59JJ11
2213B13k54L36o8j34o8m7j10Q3K76o4j36R1p3K36j15J58j61l47K08j49m2J93j95
2236a69r4K48N8M76l35l59j17P8J83j35K74m35P4L32j93m1K40k47j62M30j24q6
2258a04j03K2k93Q5M44J35k44l39N96q17Q52l67P65n16j34j17J071k06j9l09O98
$$ plain form
2279 1100 811 -228 -354 889 -616 29 -49 -464 499 18 398 240 -99 257 -94 130 43 -103 -115 -32
2299 -32 91 196 129 200 216 -35 -225 107 -124 127 -26 136 19 -469 -55 74 218 63 -65 -138 -33 -40
2321 -40 -111 -98 -5 255 5 29 241 108 -130 -249 -306 -109 84 -142 -268 -126 -253 397 45 43 -98 -100 40
2344 40 19 191 283 -226 -137 94 254 -149 -2 158 236 -103 132 -64 -42 171 112 191 276 -18 238 123 160
2367 160 91 -210 -270 -105 62 -152 65 199 -56 343 269 129 320 -206 117 154 -136 -35 98 -323 117
2388 117 8 138 89 -96 -101 81 -221 -157 -259 -209 -37 139 157 -59 232 11 -96 -94 -39 -177 -354 -220 -291
2411 -291 -83 -50 57 111 70 236 103 -84 -262 -87 -66 -146 -22 63 20 57 48 135 -27 -104 -186 9 198 1
2435 1 127 45 180 109 280 -17 364 -213 -47 358 28 -362 -28 -109 121 413 124 169 31 -69 -121 -212 -189
$$ packed form
2279A100k89j039j26J243j505O45p8m15R63m81L80j58l39L56l51K24q7j46j2Q3
2299c2J23J05o7P1J6k51j90L32k31K51j53J62j17m88M14J29J44j55j28p3J05p
2321d0p1J3R3K60k50K4K12j33k38j19n7J97J93k26j26J42j27O50l52kj41kJ40
2344D0k1J72R2n09Q9K31J60m03J47J60P8l39K35j96K2K13n9P9Q5k94K56j15L7
2367A60o9l01o0J65J67k14K17J34k55L99p4j40J91n26L23L7k90J01J33m21M40
2388A17j09J30m9j85nJ82l02O4j02N0J72J76J8k16K91k21j07KN5j38j77J34p1
2411b91K08L3J07N4m1J66j33j87j78J75K1q0J24Q5m3L7rQ7j62p7q2J95J89j97
2435AJ26q2J35p1J71k97L81n77J66M05l30l90L34q1K30K92k89M5j38j00n2r1K3
$$ plain form
2458 -189 82 -84 5 -35 353 56 94 18 -154 -66 23 22 156 27 -77 -419 -88 34 135 94 -91 -4 -46 -250
2482 -250 78 -244 -362 -342 -68 -18 258 150 -62 -246 -141 -442 -215 -124 32 -89 -119 109 -4 113 291
2503 291 132 0 84 23 3 175 -64 57 31 167 50 196 367 124 228 26 -109 -112 129 -80 315 194
2525 194 208 141 -212 221 137 -243 -369 119 212 -142 2 -92 -608 -237 -347 -197 -209 166 1018 218 270 -347
2547 -347 -168 49 -8 33 45 -40 -105 -197 -103 -193 -209 -126 -53 -82 -356 -249 35 -67 -132 -47 -297 127 -76 -1 173
2572 173 -23 -203 -122 5 -67 273 266 -196 66 -7 -33 46 83 131 36 101 146 39 157 67 103 109 -97 -88 15 134
2598 134 37 -20 101 205 -55 288 159 292 167 -99 -345 -153 192 174 162 -91 208 -70 -198 28 -430
2619 -430 -299 2 21 29 -97 111 -67 49 -20 214 -45 -178 -11 40 -272 -202 -133 -2 -81 32 -63 183 -231
$$ packed form
2458a89K71j66Q9m0L88k97L8p6j72Q8Q9jJ34j29j04l42L31J22J01m1j85Q7m2k04
2482b50L28l22j18K0K74N0K76j08k12j84J05l01K27R1J56j21l0K28j13J17J78
2503B91j59j32Q4o1k0J72k39J21k6J36j17J46J71k43J04k02j35lK41k09L95j21
2525A94J4o7l53M33q4l80j26M88R3l54J44r4n16L71j10J50j2L75Q52q00N2o17
2547c47J79K17n7M1J2q5o5r2R4r0j6Q3P3k9k74J07K84j02o5Q5k50M24k03P5J74
2572A73j96j80Q1J27p2L40pm62K62p3k6P9L7M8r5O5M5j07J18r0L6Ok06RJ03J19
2598A34r7n7J21J04k60L43j29J33j25k66k46J92L45j8j2k53K99k78j28K26m58
2619d30J31L01J9Qj26K08j78J16o9K34k59j33J67N1l12P0O9J31p9J13r5K46m14
$$ plain form
2642 -231 -130 -170 -196 -368 8 -175 1 216 136 222 80 -21 -200 110 -124 70 1 -36 -85 150 137 10 127
2665 127 84 61 -110 33 175 198 -121 -131 -19 235 458 227 299 102 -43 67 -52 -92 71 110 71 279 -76
2688 -76 -139 -51 -77 96 -3 -137 -44 -337 -198 -11 -249 64 23 13 -331 189 -89 -56 -176 -138 -40 -46 19 -279 -198
2713 -198 -214 -44 -97 101 -98 -116 -139 -83 58 -87 104 -130 -47 63 67 -167 141 -32 -132 76 61 -69 54
2736 54 58 18 115 -81 110 -63 84 -52 71 96 242 39 221 126 333 99 -98 -100 -32 206 -48 117 -7
2759 -7 -87 152 -5 -91 152 97 271 61 -136 -125 -139 -230 -111 237 89 13 51 321 -259 -61 114 -104 -32 88
2783 88 -98 -128 -156 -78 0 -90 214 -8 -238 -109 -150 -97 -137 -345 -164 117 -74 -32 -16 -4 -35 -160 -112 -105 -9 -116
2809 -116 -130 56 131 54 184 121 111 203 -32 53 135 -14 183 -22 148 249 40 110 74 127 83 72 20 -31 -102
$$ packed form
2642b31J01m0k6j72L76j83J76K15q0Q6j42j01j79L10k34J94o9l7m9K35j3j27J17
2665A27m3k3j71J43J42K3l19j0J12K54K23k31P2j97j45J10j19m0J63L9l9K08l55
2688g6o3Q8k6J73r9j34R3k93J39J87k38L13m1j0l44N20k78L3j20L8R8oO5k98Q1
2713a98j6J70n3J98j99j8k3N6J41j45J91k34Q3J10Mk34L08j73j00K08j5j30J23
2736E4Mm0R7j96J91j73J47j36J23K5J46k03J82r5K07k34j97kO8K38k54J65j24
2759gq0K39j57q6K43n5J74k10j97J1j4r1J19L48j48p6L8K70n80J98J75k18P2J20
2783H8j86l0k8P8P8r0L04k22k30J29m1N3m0k08J81K81j91M2J6J2l1j25M8PR6j07
2809a16j4J86P5p7J30o3j0R2k35Q5Q2j49J97k05J70J01k09P0l6N3m4j1n2n1p1
$$ plain form
2834 -102 96 47 185 136 123 6 165 162 45 -183 -2 -55 -185 -139 260 184 -390 39 -15 193 -135 -151 -221 162
2858 162 -54 17 -103 111 -23 -258 -16 -38 42 -93 -17 -23 11 44 168 86 3 71 -196 -56 -103 -76 -209 29
2882 29 99 -66 -194 -130 -139 -15 175 -64 280 -86 277 41 77 -75 40 185 143 43 51 35 -72 167 -124
2905 -124 76 23 163 150 -12 175 -80 -17 -15 16 74 125 236 137 -132 -161 -70 65 50 -20 9 106 -20 19 -100
2930 -100 -52 -306 -195 -78 -40 -77 68 -17 289 -222 -173 -62 90 -141 -53 -103 -2 -146 86 -163 203 -9
2952 -9 -66 127 65 -36 -89 -109 -65 56 158 72 -87 186 144 -85 -15 -135 -141 -181 50 85 14 31 -46 72 115 27
2978 27 55 35 16 295 134 52 -137 -271 14 257 -27 34 -176 -22 55 169 -43 -93 259 21 -9 102 179
3001 179 -42 244 -160 -123 -132 -83 -43 -54 119 -12 -135 -28 -94 -44 -10 -173 -208 -134 -210 -183 -215 -106 -42 12 137
$$ packed form
2834a02J98m9J38m9j3j17J59lj17k28J81n3j30M6L99p6n74M29n4K08l28j6p0L83
2858A62k16P1j20K14j34k35K42k2Q0j35P6oL4L3J24q2q3O8k67J40m7K7j33K38
2882B9P0j65j28O4rJ24J90k39L44l66L63k36L6j52J15J45m2j00Qj6j07K39k91
2905a24K00n3J40j3j62J87k55O3KL1N8N1J11r9k69k9R1J35j5p0K9R7j26L9j19
2930a00M8k54J11J17L8l7J45q5L06n11M9J11J52k31Q8n0J01j44K32k49L66k12
2952in7J93o2j01n3k0M4J21J02q6j59K73m2k29P0j20om0K31L5p1J7p7J18M3q8
2978B7K8k0j9K79j61q2j89j34K85K43k84O1k10J54P7J14k12n0L52k38l0J11P7
3001A79k21K86m04L7rM9M0j1J73j31j23J07o6N0L4j63l5P4p6K7l2J09O4N4J25
$$ plain form
3026 137 -163 -233 86 65 -103 -64 -171 3 -59 138 -23 320 109 111 24 5 156 -31 129 99 -197 -7 36
3049 36 72 86 -1 87 6 11 70 -70 30 249 -30 123 280 -31 -55 13 -28 65 -34 -112 -133 73 -98 -92 197 -165
3075 -165 105 168 -47 180 58 -102 -62 -281 94 -12 -313 31 -285 36 -259 -127 -27 -19 -69 17 -59 -143 -231
3098 -231 41 115 -93 41 111 -116 177 66 170 221 139 -324 -15 98 -63 -86 191 -53 -191 -35 -90 187
3120 187 37 -40 72 84 29 -139 -92 -8 65 -5 -146 -31 -33 -59 144 78 -233 5 251 100 114 -57 -22 62 126
3145 126 167 -73 -106 58 -14 115 135 148 -56 78 26 -131 -35 41 -51 84 -157 -171 92 -150 -36 226 152 -174
3169 -174 9 -102 -123 -16 -73 -111 -101 13 -189 177 14 -196 84 2 -65 -139 -321 -169 95 35 -43 -49 137 41
3193 41 196 41 -148 142 -43 59 1 186 133 169 -54 -240 -140 48 -67 96 -207 96 313 -23 -40 100
$$ packed form
3026A37l00p0L19k1j68L9j07J74o2J97j61L43k11Kq7j9J51j87J60l0k96J90M3
3049C6L6J4q7Q8q1NN9j40J00K19k79J53J57l11k4O8m1R3r9p8k1K06j71OK89l62
3075a65K70O3k15K27j22j60M0k19L75j06l01L44l16L21k95J32J00Qn0Q6p6q4q8
3098b31K72P4k08J34P0k27K93j11J04N1q2m63L09J13j61k3K77k44j38J56n5K77
3120A87j50p7J12J2n5j68M7Q4P3p0j41J15kk6K03o6l11K38K46j51J4j71L5Q4O4
3145A26M1k40l3J64p2J29K0J3k04J34n2j57R6P6r2J35k41j4K63k42J14K62p4l26
3169a74J83j11k1J07n7l8J0J14k02L66j63k10K80q2o7p4j82J52K64o0p8oJ86r6
3193D1J55j55j89K90j85J02n8J85n3L6k23j86J00J88j15J63l03L03K17l36j7J40
$$ plain form
3215 100 95 9 40 -151 19 -106 -104 -143 18 0 195 32 -241 147 55 -127 53 -25 113 -57 -6 -74 229 185
3239 185 187 -228 -34 22 -132 36 -124 228 -289 -70 115 100 -247 81 -152 -38 -116 -59 -27 174 -44 -250
3261 -250 -184 39 -212 76 156 158 134 217 -170 -259 9 13 -96 12 -143 -220 45 203 85 18 7 200 4 98
3285 98 119 -16 -49 201 39 144 -142 186 316 -21 209 39 194 31 -61 -29 -32 57 187 85 188 -2 162
3308 162 -130 -208 30 37 12 204 -161 95 17 103 -79 -227 155 124 -212 -8 -107 -31 -251 -322 240 -37 62 -144
3332 -144 -161 -46 -48 6 132 -176 -52 127 -2 256 -138 -89 406 -50 -60 12 -89 -111 -124 -62 -147 145 -26 22
3356 22 -85 -69 42 107 49 37 23 300 63 -10 -112 86 -99 17 5 68 -67 182 -106 -89 -1 -49 0 53 152
3381 152 102 -106 267 158 83 -76 -67 -367 -129 85 32 100 -43 -208 -189 157 -206 120 -43 208 -93 1 -50
$$ packed form
3215A00nq6L1j91J70j25Kl9J61j8J95j63k73L88r2j82J80p8J38j70N1o8L03m4
3239A85Km15J94N6j54J68j60L52n17K19J85j5l47L28k33J14p8N7L2K01k18k06
3261b50O6K23k51K88Q0Kk4Q3l87q9K68Mj09J08j55p7K65J58j18o7j1J93j96R4
3285I8K1j35l3K50j62J05k86L28J30l37K30j70J55j63r2L2lQ9J30j02J03j90J64
3308A62k92p8K38Pk5J92l65K56p8Q6j82j48L82l1l36K04r9P6k20p1N62k77R9k06
3332a44j7J15kN4J26l08J24J79j29K58l94M9M95m56j0P2j01k2j3O2q5K92j71M8
3356B2j07J6J11O5n8j2j4K77k37p3j02J98j85J16j2O3j35K49k88J7Q8m8M9N3R9
3381A52n0k08L73j09p5j59Rl00K38K14n3O8j43j65J9L46l63L26j63K51l01R4n1
$$ plain form
3404 -50 -112 -287 -52 145 111 -33 203 -107 -86 -39 -359 -242 -141 168 -183 121 -48 -43 60 -53 129 89 37
3427 37 282 -49 -172 133 47 -51 -108 -258 259 0 157 186 -118 117 -148 -63 110 -99 168 15 -38 -165
3449 -165 -131 197 -52 -74 150 -137 -44 -4 167 105 -80 -26 114 -73 3 -49 -77 145 -79 -242 54 6 -25 -76
3473 -76 116 -264 -160 -101 -45 65 -134 -132 -133 -237 -98 -78 -104 158 106 -39 43 91 -217 -266 2 -126 -71 110 21
3498 21 107 242 -31 192 -85 156 141 42 173 130 -81 259 -34 196 36 -60 158 251 -8 34 -99 80 -33
3521 -33 -32 -118 127 24 -69 31 -6 75 118 5 -44 95 -135 56 -20 18 -68 -96 48 -61 -125 186 -148 -85 -38
3546 -38 -142 -30 -68 -155 -93 -254 166 55 31 125 -149 -79 46 -4 -15 -99 73 -46 -376 -65 3 -220 -80 82
3570 82 105 -107 40 -115 -92 43 -18 40 -48 40 -78 81 -12 28 -79 121 -4 62 124 52 51 164 74 -108 73
$$ packed form
3404e0o2j75K35J97l4j44K36l10K1M7l20J17J01L09l51L04j69NJ03j13J82m0n2
3427C7K45l31j23L05q6r8n7j50N17k59J57K9l04K35k65Q5J73k09K67j53n3j27
3449a65L4L28k49k2K24k87R3M0J71o2j85N4J40j87P6n2k8K22k24j63K96m8l1n1
3473g6J92l80J04N9N6J10j99Kjj04J39K0k6K62n2j45Q2M8l08m9K68j28N5J81q9
3498B1Q6J35k73K23k77K41j5r9J31m3k11L40k93K30j60r6K18R3k59M2j33J79j13
3521c3Jq6K45j03r3J00l7Q1M3j13m9J39k30J91p6L8q6k8J44j09o4L11l34O3M7
3546c8j04J12l8q7O2j61M20j11k4R4k74P0J25n0j1q4J72j19l30L11O8k23J40J62
3570H2K3k12J47j55K3J35o1N8q8Q8j18J59r3M0j07K00j25O6O2p2jJ13r0j82J81
$$ plain form
3595 73 -213 168 194 -160 53 67 -107 122 48 143 -73 -73 134 -176 8 72 33 -134 105 -39 101 178 -48
3618 -48 92 -87 83 -279 96 -8 212 -240 -23 75 -72 296 -122 -150 -129 112 67 -69 -132 52 -7 -73 5
3641 5 -11 -47 -154 -43 -68 -31 403 -65 -44 71 -47 -146 -248 77 153 -134 17 -20 201 -16 123 151 175 35
3665 35 125 175 3 131 56 99 -119 94 -255 253 -82 -83 236 -244 117 57 158 -316 -161 -187 -235 -128 22
3688 22 110 -160 -46 -68 15 -31 -33 11 -100 -34 -110 27 -223 -413 -157 -103 74 -169 188 -28 -72 15 -367 -132
3712 -132 84 77 -138 147 17 -127 142 -42 -113 -36 -5 -50 110 -13 -14 -47 290 -133 80 248 -11 -194 -84
3735 -84 58 -111 235 46 -123 97 27 58 99 8 71 268 181 80 281 24 55 -39 259 -32 158 47 17
3758 17 29 -1 159 141 -137 146 114 297 105 -72 101 -64 -55 -30 -82 84 -150 65 87 -14 -73 193 -226 92
$$ packed form
3595G3k86L81K6l54K13J4j74K29p4R5k16%K07l10J84O4l9j67K39j44J40P7k26
3618d8J40j79J70l62L75j04K20m52K17R8j47L68m18k8K1K41m5j36o3J84n9o6P8
3641Ej6l6j07J11k5L7M34m68K1J15j18r9j02L25P6k87J51l7K21k17J39K8K4j40
3665C5R0N0j72J28p5M3k18K13l49N08l35jL19m80L61o0J01m74J55k6m8J07J50
3688B2Q8k70J14k2Q3m6kM4j11O6p6J37k50j90K56N4J77k43L57k16m4Q7l82K35
3712a32K16pk15K85j30j44K69j84p1P7L1m5J60j23jl3L37m23K13J68k59j83J10
3735h4J42j69L46j89j69K20p0L1M1r1O3J97q7j01K01k57L1r4K98k91J90j11l0
3758A7J2l0J60j8k78K83l2J83j92j77J73j65RK5n2J66k34K15K2j01n9K66m19L18
$$ plain form
3782 92 -314 -59 -113 -236 141 -6 -132 -4 98 -92 21 -85 -193 9 -431 -62 71 93 -132 246 43
3803 43 74 214 -11 -69 1 -173 178 169 -163 -13 -104 16 181 -233 42 87 203 160 27 101 66 -139 25 10
3827 10 -189 -139 -45 6 22 153 -190 -120 -41 5 -144 -64 -36 19 81 -291 161 -259 0 11 159 -117 -79 40 158
3852 158 54 -23 -40 36 -97 47 -37 41 16 -66 -137 3 -163 -166 -20 41 229 141 74 -142 -61 -59 -87 142 -43 60
3878 60 -58 -222 66 -23 45 -28 13 73 72 164 68 184 -29 54 213 -32 65 -105 168 -101 28 141 91 112 179
3903 179 24 287 97 -51 -40 -33 54 178 103 66 -56 266 -131 150 -97 124 -88 -274 127 -152 -50 89
3925 89 23 -174 105 -158 31 -293 -136 119 -53 -95 169 -81 -13 -161 -29 -3 -226 -298 -143 13 -54 57
3947 57 -80 -108 -11 9 -37 -143 90 26 129 -156 31 -54 -151 107 -22 -53 165 177 -24 170 -43 230 -138
$$ packed form
3782I2m06K55n4j23L77j47j26J28J02j90J13j06j08K02m40L69J33K2k25L78k03
3803D3L1J40k25n8P0j74L51rl32J50r1J20J65m14K75M5J16m3j33P4l5k05J64j5
3827A0j99N0R4N1J6J31l43P0P9M6j49Q0K8N5O2l72M52m20K59J1J48k76L8J19J18
3852A58j04p7j7P6j33J44q4P8k5q2p1J40j66lJ46O1J88q8o7k16Q1Kk8K29j85J03
3878F0j18j64K88q9O8p3M1O0jR2r6J16k13Q3J59k45R7j70K73k69J29J13n0K1O7
3903A79j55K63j90j48J1PQ7J24p5l7j22L22l97K81k47K21k12j86M01k79J02J39
3925H9o6j97K79k63J89l24J57K55j72m2K64k50O8j48J32K6k23p2J55J56o7J11
3947E7j37k8R7K0m6j06K33o4J03k85J87q5r7K58j29l1K18J2k01J94k13K73l68
$$ plain form
3970 -138 75 180 16 145 2 101 -135 153 95 169 116 -85 235 24 103 339 -29 5 262 -7 -2 -43 -46 -59
3994 -59 -85 35 -22 81 190 -258 20 156 284 -9 35 220 -117 -207 -33 -57 -4 -141 -152 197 -25 -241 -50
4017 -50 -132 -114 -119 87 -110 -237 23 -78 -98 -30 55 171 -26 -75 -25 -136 -224 45 -218 -89 -158 94 167 -61
4041 -61 -83 -118 20 87 -57 130 56 0 -19 -55 -109 -129 101 7 254 -49 0 -103 -22 85 206 132 -60 -71 198
4066 198 255 -3 93 -26 -95 -105 -80 -132 -79 -127 -11 133 -96 38 -18 -99 -47 -39 35 -184 -100 -69 84 -14 -45 -23
4092 -23 -143 54 -120 85 -107 41 -164 -182 79 -64 -116 182 -389 -93 66 -48 84 162 -58 -32 -8 -12 8
4115 8 -209 -90 -129 50 -45 72 95 53 -54 -105 28 109 -7 -213 -107 91 154 21 16 77 95 68 52 111 248
4140 248 -149 76 -182 138 -96 -77 185 247 286 44 -207 -146 -63 -169 52 -136 90 -72 79 -172 -38 114
$$ packed form
3970a38K13J05j64J29j43R9k36K88n8P4n3k01L20k11P9K36l68L4K57k69Nm1lj3
3994e9k6J20n7J03J09m48K78J36J28k93M4J85l37r0J74k4N3j37j1L49k22k16J91
4017e0q2J8nK06j97j27K60j01k0O8Q5J16j97m9N0j11q8K69k63J29o9K52P3k28
4041f1k2l5J38O7j44J87p4n6j9l6n4k0K30r4K47l03M9j03Q1J07J21p4j92j1K69
4066A98N7k58R6j19o9j0K5n2N3m8J16J44k29J34n6q1N2QP4k19Q4L1J53r8l1K2
4092b3j20J97j74K05j92J48k05j8K61j43n2K98n71K96J59j14J32P8k20K6K4mK0
4115Hk17J19l9J79r5J17K3m2j07n1J33Q1j16k06J06J98O3j33nO1J8k7j6N9J37
4140B48l97K25k58L20k34J9K62O2L9k42k51O1Q3j06K21j88K26j62J51k51J34J52
$$ plain form
4162 114 65 -216 -74 -49 -239 114 172 12 66 118 32 -68 58 -108 -60 130 -169 -167 187 86 116 158 97 -8
4186 -8 -119 25 -30 135 153 141 -42 94 -161 -42 21 49 -112 25 125 236 233 101 117 19 111 -3 -230 68
4210 68 13 -52 -84 26 -49 109 105 22 39 113 135 -20 39 -27 -133 -58 263 -73 -114 149 -34 -94 61 -169 184
4235 184 -57 -285 -147 14 -70 73 131 -258 124 -67 153 29 -51 -22 -22 76 -25 9 -13 -128 25 -164 186
4258 186 -136 186 -175 -33 -117 146 155 -120 267 -8 -26 79 -70 15 -11 -126 6 142 88 89 -154 -36 119
4281 119 60 -325 38 37 -49 4 101 60 82 134 317 47 -30 143 18 145 17 -37 5 70 62 68 -70 13 -87 1
4307 1 -57 -106 -6 128 -179 -178 -173 157 -31 -218 -153 -105 -14 97 -30 -58 179 57 -256 -58 164 -90 57 -109
4331 -109 60 -152 -338 -5 -184 -44 188 -151 -36 -130 -67 -90 -66 77 68 100 61 126 220 236 112 44 -48 130
$$ packed form
4162A14m9k81J42K5j90L53N8j60N4N2q6j00J26j66M8J90k99KL54j01L0M2o1j05
4186hj11J44n5J65J8j2j83J36k55J19O3K8j61J37J00J11lj32J6r8R2j14k27K98
4210F8n5o5l2J10p5J58mq3J7P4K2j55N9o6j06P5L21l36m1K63j83o0J55k30L53
4235A84k41k28J38J61q4J43N8l89L82j91K20j24q0K9%R8j01L4k2j15J53j89L50
4258A86l22L22l61J42q4K63Rk75L87k75j8J05j49Q5k6j15J32J36n4Jk43J18J55
4281A19n9l85L63jq6N3R7m1K2N2J83k70p7J73j25J27j28n4M2O5qOj38Q3j00Q8
4307An8m9J00J34l07JNL30j88j87O5M8R1J11j27k8K37j22l13J98K22k54J47j66
4331a09J69k12j86L33j79J40K32l39J15r4O3k3K4J43rL2l9O5R4J6j24o8r2J78
$$ plain form
4355 130 48 46 -189 39 94 71 91 -65 -72 189 90 -173 134 161 -44 -73 23 162 35 10 -32 -9 -37 77 -175
4380 -175 -45 111 -233 68 -176 93 -41 -292 -65 -129 -11 -46 -148 -162 -79 -35 -295 -90 -172 73 -76 65
4402 65 -15 -121 -13 -171 48 -2 95 37 209 41 -88 -139 -106 6 25 239 77 -15 -75 36 -93 50 -76
4425 -76 -152 -31 -188 -53 99 -265 15 89 -49 -39 -66 144 -69 -43 61 208 99 3 77 147 -163 -266 25
4448 25 -11 330 -322 125 29 141 -50 9 14 186 -126 -9 16 120 170 117 72 -115 102 131 147 50 53 -11 -150
4473 -150 144 194 -131 48 -6 -97 -150 3 129 2 223 74 110 186 -97 46 306 -93 156 -98 -84 92
4495 92 51 49 76 -211 117 33 -43 -81 -59 8 -82 -61 57 23 -236 110 -74 164 60 212 107 -109 -73 165 -83
4520 -83 255 64 -148 84 -247 -159 -15 97 69 -298 -159 280 -7 30 17 -169 -305 7 -271 -66 -11 63
$$ packed form
4355A30q2kk35K28N5k3K0j56pK61r9k63L07K7k05k9R6J39j27k5m2K3k8J14k52
4380a75J30J56l44L01k44K69j34k51K27o4J18l5j02j4Q3M4k60K05q2K45j49J41
4402F5q0j06J08j58K19n0R7n8J72j68j29n1L3J12J9K14j62r2o0J11j29J43j26
4425g6p6J21j57J35J52l64K80P4j38J0k7K10k13K6J04J47j09r6P4P0l10j03K91
4448B5l6L41o52M47r6J12j91N9NJ72l12J17K5J04N0n3m5j87K17K9J6r7Lo4j39
4473a50K94N0l25J79n4r1n3J53J26j27K21j49L6P6k83J43K60l99K49k54J4J76
4495I2m1kK7k87L28q4p6l8K2O7r0K1J18l4k59L46j84K38j04J52j05k16L6K38k48
4520h3L38j91k12K32l31Q8J44J12k8l67J39M39k87L7j3j86j36L12k78K05N5P4
$$ plain form
4542 63 -110 -103 -73 24 -198 -138 83 31 -161 -258 25 -79 -97 -105 -73 -29 96 72 114 -27 17 88 -73 -82 207 131 60
4569 60 297 -166 178 62 121 -179 -70 38 -166 -67 86 -71 -125 -72 -3 -67 201 -64 -99 192 163 70 60 133
4593 133 -10 -150 -146 105 206 213 -145 86 -44 -4 59 2 107 46 -208 -56 -140 157 -70 -96 -55 63 -124 123
4617 123 19 -37 13 -3 -88 -205 -62 78 170 6 100 -44 203 83 180 16 56 216 -278 -249 -24 18 256
4640 256 15 -26 8 234 69 -25 -63 -76 53 129 -143 216 204 74 -11 -64 6 187 -16 -43 52 -260 -268 63 -80
4665 -80 -177 68 -196 -78 5 -228 202 -59 94 122 22 -102 28 -149 247 94 190 -21 48 -122 -79 -80 -250
4688 -250 -41 64 255 209 -54 140 61 62 -62 9 -60 25 -7 -141 19 -78 -73 -39 -17 -165 -6 -246 -108 27
4712 27 9 -15 -159 -20 -127 59 -189 -117 166 -24 -64 141 7 124 104 3 -67 -43 -174 -163 29 -3 -46 38
$$ packed form
4542F3j73PL0R7k22O0K21n2j92r7K83j04j8qL2M4J25k4M2j41M4P1j61rK89p6p1
4569F0K37m63L44j16N9l00J09J08k04R9J53j57n4N3O9o4K68k65l5K91k9r3j0P3
4593A33j43j40MK51J01Pl58K31j30M0O3n7J05o1k54J52q4K97k27k6M1J18j87K47
4617A23j04n6N0j6q5j17J43J40R2j64R4j44K47j20R7j64M0J60m94K9K25M2K38
4640B56k41m1L4K26j65r4l8j3J29P6k72L59j2j30q5n3P0J81k03k7R5l12qL31j43
4665h0r7K45k64J18Q3k33M30k61J53K8j00j24J30j77L96j53R6k11O9j70M3jj70
4688b50K09J05J91m6k63J94p9Jj24P1o9Q5l2j34J60r7NL4K2j48J59k40J38J35
4712B7j8k4j44J39j07J86k48P2K83j90m0K05j34J17k0j01p0K4j31J1J92l2m3Q4
$$ plain form
4736 38 73 -49 71 126 66 -98 29 -112 221 -190 9 -19 111 -82 93 348 -77 -78 -30 -114 -15 133 5
4759 5 -216 -239 -203 -11 30 -12 72 40 124 -102 -21 -126 -200 -139 -96 -162 -195 14 -20 153 -107 -157 -34 -27 -134 -7
4785 -7 -297 -21 -15 -137 -147 -165 77 -102 21 -155 -186 75 78 84 98 -194 -22 254 303 46 162 -15 12 135 -42
4810 -42 -9 -38 319 266 100 -21 -178 22 22 122 -89 -14 -123 -164 -99 -83 -65 150 78 114 88 20 -104 109 -60
4835 -60 -181 -95 146 79 42 127 105 92 -38 -78 132 90 213 273 -124 -71 -161 88 158 2 -85 36 -134 53 284
4860 284 -32 -46 -15 -26 -198 0 32 4 -33 75 93 110 88 66 -210 -258 16 193 60 -43 57 -76 22 -34
4884 -34 205 45 173 17 112 7 -121 -260 99 65 123 62 16 203 190 -62 -81 157 -120 90 191 -159 -117
4907 -117 147 -182 -163 222 10 -103 61 -54 -121 -107 134 -118 54 152 26 19 160 41 -240 -1 162 1
$$ packed form
4736C8L5j22J20N5o0j64J27j41L33m11J99k8J30j93J75K55m25jM8q4R9J48j28
4759Ek21k3L6J92M1m2Q4l2Q4k26Q1j05p4O1M3o6l3K09l4J73k60n0J23Pj07J27
4785gk90K76Oj22j0j8K42j79J23j76l1K61LOJ4k92J72K76M9k57J16j77K7J23j77
4810d2L3k9L57n3j66j21j57K00%J00k11P5j09m1O5J6J8K15p2L6k6o8j24K13j69
4835f0j21Q6K41o7l7Q5k2j3j30m0K10m2J23O0l97N3r0K49P0j56q7J21j70J87K31
4860B84l16j4L1j1j72J98L2k8l7J08J8J7k2k2k76m8K74J77j33j03J00j33R8n6
4884c4K39j60J28j56R5j05j28j39L59l4N8o1m6J87j3k52j9K38k77K10J01l50M2
4907a17K64l29J9L85k12j13J64j15o7J4K41k52J72R8j26pJ41j19k81K39J63j61
$$ plain form
4929 1 -138 -46 -143 34 113 -39 -112 30 -19 -196 106 9 -171 74 -192 -128 147 113 -119 -59 232 -354 315 27
4953 27 76 10 28 -58 -125 1 19 83 -31 123 -55 -16 8 226 121 102 -185 -23 -95 103 93 -116 159 70 86
4978 86 -30 -146 173 -262 -13 -15 -53 -9 157 165 -226 173 -30 15 -79 -36 50 -110 -177 -96 26 29 70 -46 178
5003 178 11 77 -110 46 212 -221 -64 25 101 25 -73 209 -130 310 -136 -118 24 105 13 -17 -179 100 102 116
5027 116 62 55 -45 -35 63 -34 51 -9 430 9 120 -60 26 153 -18 110 31 75 -199 300 136 56 89 80 164
5052 164 -127 -61 -72 -33 10 42 -132 -8 -17 -94 23 184 98 128 79 43 71 84 170 -107 542 50 141 -21 -28 -128
5078 -128 12 -63 -51 -48 -136 80 -67 -155 -149 9 -11 -16 198 56 -25 -56 -137 -90 -51 -45 22 -192 -32 -155 75 -227
5104 -227 219 -29 44 57 167 205 113 -26 173 38 108 -181 80 47 -110 -54 -24 -97 -162 -2 68 -139 153 -94
$$ packed form
4929Aj39R2r7J77P9j52p3J42m9j77L02r7j80K45k66O4K75l4k32O0K91n86O69k88
4953B7M9o6J8q6o7J26J8O4j14J54j78L9K4K18j05j9k87J62p2J98j0k09K75q9J6
4978H6j16j16L19m35K49kl8M4J66Ql91L99k03M5r4M3Q6j60o7Q1J22LM1j16K24
5003A78j67O6j87J56J66m33J57Q9P6p6r8K82l39M40m46J8J42Q1r2l0j62K79KJ4
5027A16n4pj00J0R8r7Q5o0M39m21J11j80Q6J27j71J28p9M4k74M99j64q0L3rQ4
5052A64k91O6j1L9M3L2j74J24rp7J17J61q6L0m9l6K8J3Q6k77O49m92R1j62pj00
5078a28J40p5J2Lq8K16j47q8OJ58k0nK14j42q1l1q1M7L9OO7k14J60j23K30l02
5104b27M46k48P3J3J10L8r2j39J99j35P0k89K61l3j57N6L0p3o5J60P0k07K92k47
$$ plain form
5128 -94 66 7 87 -82 220 -36 -66 318 -100 -222 103 151 -24 -204 119 242 22 -161 -203 -26 132 27
5150 27 5 197 -292 -194 -208 39 28 -32 -267 59 98 257 -193 143 -39 -15 -155 18 -58 -70 -17 -48 4 -91 97
5175 97 82 133 -11 -54 67 157 -131 -442 -237 21 52 12 -99 -115 219 -70 -35 243 -207 55 210 122 -6
5198 -6 -75 70 118 345 -152 118 -52 150 209 -91 171 -135 -59 20 7 63 152 -82 79 -109 -116 -82 90 -144
5222 -144 264 123 64 42 -20 -98 -5 -143 44 -32 -48 -63 77 95 -27 62 -86 -184 78 -91 -132 -182 35 -71
5246 -71 56 47 -39 -224 -82 119 68 -46 -22 12 -159 56 270 39 229 -166 73 -156 -5 -108 137 -75
5268 -75 126 46 -194 -41 -73 170 -24 6 22 -204 172 45 3 123 -41 -186 160 287 -21 206 29 1
5290 1 -6 -5 19 -46 -180 118 126 -293 119 -36 181 -79 36 109 -12 82 130 -69 -44 -177 -39 135 121 -19 -137
$$ packed form
5128i4J60n9Q0j69L02k56l0L84m18j22L25M8j75j80L23J23k20j83m2J77J58j05
5150B7k2J92m89R8j4K47j1o0k35L26L9J59m50L36j82K4j40J73p6j2N3l1N2r5J88
5175I7j5N1j44m3J21R0k88l11K05K58L1m0j11j6L34k89L5K78m50K62J55q8j28
5198fo9J45M8K27m97K70j70K02N9l00K62l06P6P9j3N6Q9k34J61j88pL4J72k34
5222a44M08j41n9k2o2p8R3j38J87p6j6j5J40J8j22Q9j48r8K62j69m1n0K17j06
5246g1J27rq6j85J42K01n1j14K4L4j71K15K14k31J90l95K39k29J51j03K45k12
5268g5K01q0k40J53l2K43j94L0J6k26L76j27m2J20j64j45L46J27l08K27j77k8
5290ApJK4o5j34K98Qm19M12j55K17k60J15P3j21R4M8j99K5j33J38J74j4j40j18
$$ plain form
5315 -137 2 116 70 -142 54 -17 102 -131 47 -65 188 -10 -214 -118 -95 11 59 -261 130 -121 64 236
5337 236 -122 -185 4 -54 -332 48 187 329 87 43 -118 -127 -168 26 181 174 9 172 -144 -1 0 -107 69
5360 69 -223 163 44 117 123 14 -6 52 -32 -49 -220 -166 -36 49 99 5 -2 53 17 -93 -207 19 -36 63 139 -58
5386 -58 70 -181 -89 19 -144 53 -134 70 1 -75 -111 108 43 -96 -67 -70 62 -23 51 -49 -67 128 -130 320
5410 320 97 16 225 -17 127 160 -130 58 241 -245 237 18 210 -98 169 -81 -94 167 48 153 56
5431 56 -32 -90 -101 87 69 -45 -19 47 -149 91 127 5 51 8 57 -68 81 -174 -141 -52 -168 -164 -93 -144 -308 -288
5457 -288 -184 -167 -21 -87 -71 166 28 47 97 -138 19 67 18 -54 50 -227 16 -54 -184 128 -153 40 52
5480 52 -52 -59 61 43 77 41 45 -66 -8 289 108 164 -100 -90 -23 -110 14 30 25 34 204 145 -29 141 -14 -16 160
$$ packed form
5315a37J39J14m6k12J96p1J19k33J78j12K53j98k04R6K3J06M8l20L91k51J85J72
5337B36l58o3J89n8k78L80J39J42k42m4j61rm1J94J55pj65J63l16J43Jj07J76
5360F9k92L86j19P3Oj09k0N8q4j7j71N4J30Q5N0r4pN5l6j10j14K26n5R9P6j97
5386e8J28k51R2J08j63J97j87K04o9p6l6K19o5j39K9lJ32q5P4j00j8J95k58M50
5410C20k23q1K09k42J44L3k90J88J83m86M82k19J92l08K67k50j3K61j19J05r7
5431E6q8n8j1J88j8j14K6O6j96K40L6j22M6m3M9j25J49k55L3Q9j16MP1n1j64K0
5457b88J04J7J46o6J6K37j38J9N0k35J57M8m9p2J04k77K43p0j30L12k81J93J2
5480E2j04pJ20j8L4l6Mj11N8K97j81N6k64J0O7q7J24J6nRJ70n9j74J70j55kJ76
$$ plain form
5507 160 22 -88 118 -15 -76 111 -87 189 156 89 -56 381 94 -167 155 88 73 258 18 72 -4 -144
5529 -144 -87 -170 -43 -100 -103 15 -34 -176 -211 -16 -67 -336 -4 30 -237 -210 -31 -37 -158 102 136 -180 366 103
5553 103 107 108 134 26 11 -142 84 31 -83 143 -79 -164 90 -106 201 -12 46 -101 -53 -7 -126 54 -176 -150
5577 -150 159 -106 7 157 58 -44 68 1 56 336 159 -30 -20 -79 67 69 203 -69 132 60 -96 47 -5
5600 -5 42 6 77 64 115 -77 -105 -82 35 -75 80 47 -147 -14 50 155 -86 -162 -110 -7 270 0 73 -155 -255
5625 -255 185 -53 153 -105 -42 -34 -213 -39 -166 -115 -221 -186 -163 -55 299 9 176 141 112 -142 -140 -9 160
5648 160 132 94 165 -28 -217 79 87 189 50 93 14 139 -198 69 43 -81 -73 -3 -120 187 105 -122 -57 191
5672 191 -19 -69 104 43 198 81 131 119 301 -238 -368 74 96 20 31 -35 -216 269 324 -6 -55 54 -108
$$ packed form
5507A60j38j10K06j33o1J87j98K76l3o7j45M37k87k61L22o7j5J85k40N4p6j40
5529a44N7q3J27n7lJ18m9j42l5J95n1k69L32L4k67K7J79oj21K60L4l16N46k63
5553A03MJK6j08j5j53K26n3j14K26k22q5K54j96L07k13N8j47M8M6j19J80k30K6
5577a50L09k65J13J50r9j02J12o7N5K80j77j89J0n9J46KJ34k72K01p2j56J43n2
5600eM7l6P1j3N1j92k8K3J17j10J55l3j94J33O4J05k41p6N2J03K77k70P3k28j00
5625b55M40k38K06k58O3Qj79J74j27N1j06L5K3J08L54k90J67l5k9k54KJ31J69
5648A60k8l8P1j93j89K96QJ02j39M3p9J25l37K67k6j24QP0j17L07q2k27O5K48
5672A91k10n0J73o1J55j17N0j2J82n39j30M42K2p6J1o6j81M85N5l30m9J09j62
$$ plain form
5695 -108 -63 -57 -86 17 83 -109 -48 69 17 -51 -104 84 -31 8 91 -246 103 -65 30 91 325 -31 6 31 -99
5720 -99 62 10 71 18 -225 199 144 -23 40 -38 -167 -20 388 77 -169 35 -134 -105 26 -5 -55 40 -13 59
5744 59 68 -38 216 121 -139 -59 -123 -172 43 -133 17 217 140 -137 36 63 -12 139 87 -126 -172 -31 43 -213
5768 -213 252 -2 278 234 39 -3 -15 26 1 -51 77 -136 71 174 126 -68 5 224 103 75 -8 -99 -126 60
5792 60 93 24 -265 -148 41 379 -72 96 29 -234 3 -33 190 115 95 -120 -126 66 73 196 -11 8 34 -29 -142
5817 -142 131 35 13 56 2 -84 163 -22 72 136 247 -6 152 -34 34 371 46 -17 -70 1 -267 -97 -14 -79
5841 -79 -179 6 -119 -91 -281 -117 1 -22 -182 -25 -282 143 9 29 84 -107 12 318 -2 120 243 -158
5863 -158 158 -82 -196 26 -59 208 -90 -24 68 -63 -1 -36 -154 85 -421 185 -159 57 -137 -51 67 -3
$$ packed form
5695a08M5Ok9J03O6j92O1J17n2o8n3J88j15L9Q3l37L49j68R5O1K34l56L7K5j30
5720i9J61n2O1n3k43M24n5j67O3p8j29J47M08l11k46K04j69K9J31l1n0R5n3P2
5744E9Rj06K54r5k60Q0o4m9K15j76J50K00p7k77J73K7p5J51n2k13m6J41P4k56
5768b13M65k54K80m4j95m2j2M1k5n2J28k13K07J03m8j94P3K19j21k8q3r1k7J86
5792F0L3o9k89J17J89L38m51J68o7k63K37l6K23p5k0k15oJ92PJ23k07J9K6o3j13
5817a42K73r6k2M3n4q6K47j85R4O4J11k53J58j86O8L37l25o3n3P1k68J70Q3o5
5841g9j00J85j25K8j90J64J18k3j60J57k57M25j34K0N5j91J19L06l20J22J23m01
5863a58L16k40j14K22q5K67k98O6R2j31O2l5j18K39n06O06l44K16j94Q6J18p0
$$ plain form
5885 -3 12 149 45 1 283 -368 -30 -110 -34 -304 34 79 -126 -113 -154 4 150 -60 93 -57 48 97 -21
5908 -21 2 -134 -61 63 -205 89 -280 -76 -151 13 -142 -208 -49 12 90 -11 186 47 123 -87 -91 111 -162
5931 -162 -7 -82 179 38 -26 -45 -62 83 81 182 -131 118 78 75 -153 461 2 159 -219 -4 148 15 -169
5954 -169 257 83 210 124 -230 140 -148 -59 -8 -116 47 -5 159 59 -86 31 -112 -114 -51 232 156 105 96 14
5978 14 -34 31 153 85 -15 59 -134 6 -133 158 -36 -31 97 -34 -42 100 13 -71 54 -110 35 40 -1 73 -190
6003 -190 -135 -136 57 -37 -205 -92 -25 -200 -15 -328 29 -88 -98 -499 240 -43 -8 -89 178 -42 -15 226 -53
6026 -53 84 -188 161 -49 -24 98 -70 -56 -105 137 -22 101 318 -90 -115 78 7 -62 -100 4 30 193 14
6049 14 -88 -228 -51 233 32 39 -223 -111 -54 318 -247 85 -4 -131 94 -35 26 186 -34 -3 131 -119
$$ packed form
5885cJ5J37j04m4K82o51L38q0P6k70L38M5k05J3m1J58J46k10J53j50J05M9j18
5908b1K3j36P3J24k68K94l69K04p5J64j55o6J59O1P8j01J97j39P6k10mK02k73
5931a62J55p5K61j41o4j9j7J45kJ01l13K49m0lk28O14m59J57l78K15J52j33j84
5954a69M26j74J27q6l54L70k88Q9N1j08J63n2J64j00j45J17j43kO3K83p6n1rq2
5978A4m8O5J22o8j00P4j93J40j39K91j94NJ28j31qJ42q7q4J25j64J45Nm1P4k63
6003a90N5jJ93r4j68J13O7j75J85l13L57j17j0m01P39k83L5q1K67k20K7K41k79
6026e3J37k72L49k10K5J22j68J4m9K42j59J23K17m08k5J93p1o9l8J04K6J63j79
6049A4j02j40J77K84k01Pk62J12N7L72n65L32q9j27K25j29O1J60k20L1J34k50
$$ plain form
6071 -119 -169 -75 37 172 102 191 -40 -38 -109 -88 39 244 -155 -293 26 42 -214 188 213 34 -190 204 -124
6094 -124 38 -80 58 42 -141 -162 -12 -79 13 99 161 -154 -25 109 -110 6 47 -95 -124 -78 -46 -17 -92 54
6118 54 135 50 68 70 261 5 119 44 34 176 -56 32 -12 133 -200 -201 -152 -88 128 242 105 56 65 -48 -328 40
6144 40 125 102 -56 154 -78 -81 -93 100 25 59 -157 -122 12 -249 46 40 -124 -190 -9 -64 11 160 132 10 -77
6169 -77 27 -164 -36 -61 -26 160 -165 26 -215 140 -118 -90 201 6 151 -71 38 195 -163 -254 75 343
6191 343 133 -50 118 5 -101 -4 -52 -123 -198 114 -58 -20 -36 74 127 -148 188 74 -35 81 -51 97
6213 97 -30 -72 -29 -48 -7 -23 -3 36 -111 21 -116 69 40 -194 156 -19 -94 28 -52 -58 -104 -193 95 -50 -123
6238 -123 69 -159 111 114 -15 326 5 -140 113 -112 109 -150 -187 -36 -156 104 116 -6 -123 -294 -356 23
$$ packed form
6071a19n0R4J12J35p0Q9k31Kp1K1J27K05l99j38L19J6k56M02K5j79k24L94l28
6094a24J62j18J38j6j83k1J50o7R2Q6O2l15J29J34k19J16M1j42k9M6L2K9p5J46
6118E4Q1q5J8KJ91k56J14p5j0J42k32Q8m4J45l33jM9O4K16J14j37m9Rj13k80L68
6144D0Q5k3j58K10k32lj2J93p5L4k16L5J34k61K95oj64o6J81n5P5J49k8j22q7
6169g7J04j91J28k5L5J86l25J91k41L55k58K8K91j95J45k22J09J57l58r1L29K68
6191C43k10j83J68j13j06R7m8p1p5L12j72L8j6J10N3k75L36j14j09J16j32J48
6213I7j27m2M3j9M1j6K0L9j47J32j37J85k9k34L50j75p5J22q0om6q9K88j45p3
6238a23J92k28K70Lj29L41l21j45K53k25K21k59l7J51j20K60J2j22j17j71o2L79
$$ plain form
6260 23 60 -36 145 73 59 -57 107 3 -87 109 -59 21 -46 110 -13 -100 85 32 30 -334 -32 287 -6 70
6284 70 65 270 -83 -34 -19 -183 85 -169 129 229 91 63 -193 -4 69 56 -93 19 21 -71 -260 -61 -43 -136
6308 -136 -100 99 -114 110 -196 46 -124 -90 -117 -83 91 -68 -24 144 -214 -58 68 20 -90 -216 41 -27
6330 -27 -28 22 -70 -105 -110 18 2 74 -10 -133 71 -18 160 168 168 61 -113 71 -36 -79 -113 225 75 38 181 67
6356 67 13 -53 38 174 -127 42 125 -26 -161 -93 94 54 -9 198 103 64 -39 -52 282 35 -9 154 -73 44
6380 44 117 -113 185 11 70 19 69 43 127 77 -192 175 -83 -128 -94 -4 -32 -70 14 -165 7 -17 -17 -134 -28 50
6406 50 -9 -20 104 145 -66 332 34 43 -244 -3 42 3 33 -185 166 -57 128 254 -122 3 -4 21 -97 -202
6430 -202 -8 87 69 -88 -154 156 260 47 71 -179 201 5 98 -20 -97 -73 -33 -41 -117 149 -200 100 250 57
$$ packed form
6260B3L7r6J81p2j4j16J64j04r0J96j68Q0o7J56j23q7J85n3kl64L02L19k93P6
6284G0nK05l53M9J5j64K68k54K98J00j38k8k56J89P3j3j49J12Kr2j89J99J8r3
6308a36L6J99k13K24l06K42j70L4k7L4J74j59M4J68l58J56J26m8j10j26K57o8
6330b7jN0r2l5nJ28j6P2q4j23K04q9J78Q%j07j74J84j07m3l4L38j50l7J43j14
6356F7n4o6R1J36l01J69Q3j51j35O8J87m0o3K07r5l9j03j3L34k47m4J63k27J17
6380D4P3k30K98j74N9n1N0k6Q4n0k69L67k58m5L4R0k8l8Q4j79J72k4%j17J06P8
6406E0n9j1J24M1k11L98k98Rk87K41M5l9L0k18L51k23J85J26l76J25pK5j18j05
6430b02J94R5j8j57o6L10J04k13K4k50L80j96R3j18p7K4M0qp6K66l49L00J50j93
$$ plain form
6454 57 -155 -186 -260 293 -144 -21 12 123 275 -128 222 -138 -43 222 148 58 -160 148 -86 146 67 140 81
6477 81 147 -87 0 78 -76 46 96 233 -243 -50 -92 -96 133 41 21 -49 11 103 -114 103 -104 -114 -39 21 174
6502 174 -93 33 -55 -230 37 100 80 15 167 -109 133 -25 -46 -171 34 -49 -17 -68 7 -183 -17 -94 -1 -67
6526 -67 93 17 58 4 36 -173 -21 40 -73 -104 118 -69 -53 -4 -236 158 249 72 -184 68 64 243 60 45
6550 45 -110 14 -105 45 66 -139 57 -146 57 116 84 -124 -55 94 107 169 -118 94 -213 -186 325 -152 68
6573 68 92 16 38 80 15 16 -189 104 -81 -30 175 -403 -218 -64 264 127 122 338 196 -173 112 234 -181 -97
6597 -97 116 127 -32 -67 -65 -232 -104 485 337 -28 -156 202 36 199 -512 -212 52 29 129 185 166 -93 29
6620 29 -187 318 3 307 -212 238 419 191 270 -73 -158 -284 -113 -149 279 119 -177 44 -14 -277 -351 -653
$$ packed form
6454E7k12l1p4N53m37J23L3J11J52m03L50l60R5K65p4r0k18L08k34K32p9P3n9
6477H1O6k34Q7P8j54J22N0J37m76J93m2mK29r2k0p0O0R2k17K17k07j0P5O0J53
6502A74k67J26q8j75K67O3k0o5J52k76K42j58k1j25K05q3L2n1P5j90J66p7R3o6
6526f7J60p6M1n4L2k09J52O1j13l1K22j87J6M9k32L94R1j77k56K52mJ79j83j5
6550D5j55J24j19J50K1k05J96k03K03N9l2k08O9J49J3O2k87K12l07K7N11m77K20
6573F8K4p6K2M2o5Jk05K93j85N1K05n78J85J54L28j37nK16j42l69K85J22m15Q4
6597i7K13J1j59l5Kj67J28N89j48l65j28L58j66J63p11L00K64k3J00N6j9k59J22
6620B9k16N05l15L04n19M50J81k28P9l43q5j26J71l6M28j60k96K21n8k63p4l02
$$ plain form
6642 -653 107 331 51 -500 94 553 -247 45 -379 88 -153 248 -295 -307 609 -274 19 296 -184 89
6662 89 66 379 356 86 -417 -108 -133 136 -189 -15 341 -64 149 -259 18 320 497 -247 -197 -544 -194 -279
6684 -279 72 286 -28 39 92 462 427 213 141 278 106 -178 -96 172 -242 -82 -564 295 -340 -238 156 -198
6706 -198 -21 -22 -297 -248 -317 -141 93 31 -59 217 204 26 81 73 191 47 -37 -199 -37 -172 -24 -116 -97 58
6730 58 72 125 -55 -87 65 102 29 176 -73 -66 103 177 -111 -56 165 220 24 19 -33 185 -161 -3 13 18 32 110
6756 110 36 -101 -238 -8 -58 -65 282 -99 -208 -185 152 -72 -145 74 37 43 -67 -39 -15 94 -122 -19 51 67
6780 67 -323 -124 -50 98 148 -125 -40 7 -28 71 233 135 -149 -21 -137 -27 238 82 34 -119 69 -142 132
6803 132 38 -113 22 -2 45 -190 93 17 12 -2 -5 218 91 -22 -59 -235 51 -36 -241 -2 169 24 -45 -72
$$ packed form
6642f53P60K24k80n51N94M59q00K92m24M67k41M01n43j2R16q83K93K77m80K73
6662H9k3L13k3k70n03L09k5K69l25J74L56m05K13m08K77L02J77p44N0l47L50q5
6684b79L51K14l14O7N3L70l5k14p2J37j72k84Q2K68m14J60m82Q59o35J02L94l54
6706a98J77jk75M9o9J76K34o2r0K76j3j78N5qJ18j44q4j62J62j35J48r2J9J55
6730E8J4N3j80l2J52L7p3J47k49PJ69P4k88N5K21N5j96nn2K18l46J58J6NJ4P8
6756A10p4j37j37K30n0pL47l81j09K3L37k24p3K19l7Oj10K8K4J09k16J03P0J6
6780F7l90J99P4J48N0k73Q5M7l5R9J62r8k84J28j16J10K65j56m8j53J88k11K74
6803A32r4j51J35k4M7k35K83p6nj4lK23j27j13l7j76K86q7k05K39J71j45o9k7
$$ plain form
6827 -72 -127 205 -110 -238 26 16 -80 -122 97 -42 90 -259 27 -93 -136 -29 228 33 105 -85 192 -92
6849 -92 -235 -150 4 110 -22 139 24 -290 163 -29 -27 21 41 199 -335 -99 -69 11 -266 -1 -33 138 2
6872 2 275 -41 195 27 15 24 -143 11 72 138 -86 119 -45 57 93 -1 179 169 -66 181 198 268 19 110
6896 110 46 -138 -103 72 -31 58 -24 11 340 97 26 211 -231 -196 -207 2 42 -143 115 -236 247 -109 -72
6919 -72 -85 199 -62 120 62 55 23 70 185 -24 86 -167 -86 23 74 75 11 60 198 -9 -120 38 -71 -106 -240
6944 -240 -41 14 -69 -65 -166 33 230 128 143 -169 -264 80 63 2 -197 -111 74 -122 -62 87 125 -126 -73 -146
6968 -146 35 82 145 -19 59 94 -68 185 46 -75 116 -41 55 30 177 -72 87 44 -122 -4 -150 161
6990 161 -7 -192 -197 -242 -76 -42 -77 -39 99 73 -31 81 182 22 -142 20 52 -164 6 95 193 50 -44 61
$$ packed form
6827g2n5L32l15j28K64j0r6m2K19j39J32l49K86j20m3J07K57j95P2j90K77k84
6849i2j43Q5J54J06j32J61j15l14M53j92KM8K0J58n34K36L0Q0k77K65l2J71j36
6872BK73l16K36j68j2Rj67J54O1O6k24K05j64J02L6r4J80j0k35K47J7P0k49R1
6896A10o4j84L5J75j03Q9q2L5L29k43p1J85m42L5j1K09M0j85K58l51M83l56L7
6919g2j3K84k61J82n8pl2M7J15k09J10k53Q1J09N1Jo4M9J38k07j11J58j09l5j34
6944b40J99N5q3Mj01J99J97j02J5l12r5L44j7o1j99Q6J85j96O0J49L8k51N3p3
6968a46J81M7O3j64P8L5j62K53j39j21J91j57R6k5J47k49J59m3j66J18j46L11
6990A61j68j85nm5J66L4l5L8J38k6j04J12J01j60j64J62L2k16J70Q9R8j43r4J05
$$ plain form
7014 61 3 -3 -60 211 112 -113 144 -11 -4 113 -239 3 -7 -30 -31 -54 300 84 54 204 9 41 108 123 66 -143
7040 -143 38 14 -94 15 60 -81 204 101 122 -98 -134 -11 84 151 -28 16 -58 131 -116 62 216 -116 38
7063 38 -16 122 -211 74 -116 60 80 -137 56 -296 78 -63 271 -165 -49 -57 23 78 121 -126 -46 32 -223
7086 -223 -61 -100 -35 -99 53 -230 -59 57 57 139 -18 -109 -66 -8 80 -149 188 -88 30 -246 -73 -281 -53
7109 -53 34 153 23 -28 -13 -272 -91 -40 -64 -38 -10 54 -9 11 -46 -168 105 -346 -108 -6 13 148 10 -20 -183
7134 -183 -73 121 31 -79 -50 -165 -193 8 4 258 -77 -16 12 173 112 -46 -209 -28 14 -108 179 -137 121
7157 121 -47 -51 4 -238 -15 -24 151 75 228 56 -90 -97 -182 -201 -9 29 126 208 68 31 169 192 200 -140 97 61
7183 61 117 320 -65 26 53 -147 -239 -146 -40 22 93 34 226 191 117 -61 171 196 118 6 -56 96 -126 -2 54
$$ packed form
7014F1n8on7K71r9k25K57j55PJ17l52K42j0k3jk3L54k16l0J50j95L2O7J5n7k09
7040a43J81k4j08J09M5j41K85j03K1k20l6J23R5O7j79M4p4J89k47J78J54l32J54
7063C8n4J38l33K85j90J76K0k17J93l52L74j41L34m36J16qQ0N5M3k47Q0P8k55
7086b23J62l9O5o4J52k83J71J16%Q2j57r1M3N8Q8k29L37k76J18k76J73k08K28
7109e3Q7J19j30n1J5k59J81N1k4K6K8O4o3K0n7j22K73m51K38J02J9J35j38l0j63
7134a83J10J94r0j10K9j15k8K01mK54l35O1K8J61o1j58j63J81M2j22K87l16K58
7157A21j68mN5k42K23rJ75p6J53j72j46pq5j9J92L8R7Q2j40l7J38K3Ql40K37l6
7183F1N6K03l85R1K7k00r2R3J06O2P1n9J92l5p4j78K32K5p8j12o2J52k22J24N6
$$ plain form
7208 54 -101 265 -29 27 -2 125 -12 -51 -19 -8 77 120 12 168 187 103 -31 74 -17 -164 17 1 11 -264
7232 -264 -62 119 202 -54 -151 51 13 -226 -41 -45 -14 104 -41 151 -106 0 -130 -40 -48 39 142 169 35 -29
7256 -29 150 -153 -72 27 -158 99 205 -23 -143 290 80 36 26 -22 -49 -128 -180 -35 -36 318 182 44 23 -96
7280 -96 -89 48 -109 -104 18 -12 93 -105 -144 195 247 -26 -62 -48 188 47 1 140 90 216 -58 -75 -108 49 45
7305 45 152 101 73 -224 -130 -100 -121 95 98 26 -253 164 51 6 2 372 -92 -173 -131 -143 23 191 19 -203 41
7330 41 -31 -136 -112 -109 189 94 85 92 -186 -108 56 -213 9 -150 85 114 -63 165 127 -181 -96 59 -81 97 79
7355 79 182 123 -228 129 -43 -10 159 -198 23 92 16 -60 242 -59 27 113 149 91 80 -65 -8 77 100 -344 -53
7380 -53 -148 101 439 -74 -44 260 -3 -127 185 -127 -113 -229 -29 54 111 -385 235 -161 -147 80 -193 47
$$ packed form
7208E4j55L66k94N6k9J27j37l9L2J1Q5M3j08J56J9q4j34J05r1j47J81j6J0k75
7232b64K02J81Q3k56r7K02l8k39J85mL1J18j45J92k57J06j30R0qQ7J03K7j34o4
7256b9J79l03Q1R9j85K57J06k28j20M33k10m4j0m8k7p9n2J45jL54j36j38k1j19
7280i6PJ37j57NJ22l0J05j98l9L39N2k73l6J4K36j41m6J39n0J26k74j7l3J57m
7305D5J07n1k8k97R4L0k1K16Lp2k79M17j13m5mL70m64q1M2j2J66J68j72k22K44
7330D1p2j05K4LK98r5rPk78P8J64k69K22j59K35K9j77K28l8l08Q5J55j40J78j8
7355G9J03n9l51L57j72L3J69l57K21O9p6p6L02l01Q6Q6L6n8j1j45N7Q5K3m44K91
7380e3r5K49L38n13L0L04k63j24L12l12J4j16K00Q3N7m96O20l96J4K27k73K40
$$ plain form
7402 47 -126 -64 -231 -182 7 -98 137 -175 81 -332 95 155 158 16 -13 -34 -157 56 109 -143 263 -57 86
7425 86 54 14 -122 110 325 -15 18 -266 24 137 216 307 -192 263 -80 -72 41 -285 193 -64 220 14 21
7448 21 135 -26 -151 300 242 -72 15 -105 -23 55 -97 -15 -175 -91 235 -121 109 -233 149 104 51 -78 12
7471 12 -62 25 66 -11 74 -37 39 169 -155 35 -72 140 204 -64 204 -107 13 128 -6 -98 -202 -37 47
7494 47 -203 -99 85 -11 -5 144 -186 167 -136 36 -22 256 -37 17 88 121 37 -67 -100 -112 -9 66 -148 -65
7518 -65 -193 -163 -8 148 -137 -29 -102 137 -137 54 78 33 52 141 -263 279 114 4 -229 -110 -66 25 -90
7541 -90 -256 94 238 63 148 -153 128 78 117 -60 79 282 -99 90 -34 230 80 71 41 -392 -9 120
7563 120 -78 107 5 231 -21 44 126 35 -203 20 7 9 -202 39 74 159 80 130 65 108 179 114 88 48 134 -198
$$ packed form
7402D7j73O2j67M9J89j05K35l12K56m13M27O0Lj42k9k1j23K13N3k52M06l20J43
7425H6l2m0j36K32K15l40L3k84K90J13P9R1m99M55l43QJ13l26M78k57K84k06P
7448B1J14j61j25M51n8l14Q7j20Q2P8j52Q2j60Q4L26l56K30l42L82m5n3j29R0
7471A2p4Q7M1p7Q5j11P6J30l24J90j07K12O4k68K68l11J20J15j34r2j04J65Q4
7494D7k50J04J84r6OJ49l30L53l03J72n8K78k93N4P1L3q4j04l3j2J03P5k14Q3
7518f5j28L0J55J56k85J08p3K39k74J91K4m5J9Q9m04N42j65j10k33J19M4R1j15
7541i0j66L50J44j75Q5l01K81n0L9j77J39K03l81J89j24K64j50rl0m33L83J29
7563A20j98J85j02K26k52O5Q2r1k38K23j3Kk11K41L5Q5p9N0o5M3P1o5k6m0Q6l32
$$ plain form
7589 -198 106 263 214 47 49 11 -62 -69 84 63 7 46 92 -5 14 160 -134 -62 27 -271 -186 -123 -83 -74 25 -199 113
7616 113 10 17 244 -132 -205 -6 -55 76 91 41 -11 -73 27 -6 80 -62 -139 -96 23 -79 -298 64 -88 -161
7640 -161 74 -188 -1 -66 -258 14 200 3 -86 -132 150 91 -33 268 -147 84 309 102 -1 224 27
7661 27 156 -66 -39 94 -109 68 21 18 -167 -10 -7 -52 -85 96 -93 37 60 -264 -37 -113 215 -154 131 -89
7685 -89 -799 334 -29 267 -296 -461 -606 -394 -330 93 108 136 123 113 -116 677 -157 -366 5 -432 -388 -650
7707 -650 -269 54 81 -53 171 -252 -22 150 144 -236 -12 -127 42 84 -66 -142 -31 -29 -8 431 46 42 4 -127
7731 -127 -328 107 -10 113 -193 -149 30 -159 -66 -22 -155 173 110 -82 -117 -291 39 -5 -122 3 -117 -79
7753 -79 42 65 -88 -63 37 -130 -81 186 -134 -39 159 29 -115 -57 -116 88 -170 -89 13 -88 72 42 164
$$ packed form
7589a98L04J57m9j67Kl8p3pJ53k1n6L9M6r7J9J46k94P2Q9k98Q5O3M0RR9k24L12
7616A13j03PK27l76p3J99m9J31J5n0n2o2J00l3Q6j42p7M3J19j02k19L62j52p3
7640a61K35k62J87o5j92K72J86j97q9m6K82n9j24L01m15K31K25k07j03K25j97
7661B7J29k22K7J33k03J77m7lj85J57Lm5l3J81j89J30K3l24K27p6L28l69K85k20
7685h9p10J133l63K96n63j65j45K12O4M23J5K8j3j0k29P93q34k09L71m37M4k62
7707f50L81L23K7j34K24m23K30J72ol80K24j15J69M2j50p6J11KK1M39l85ml8j31
7731a27k01M35j17J23l06M4J79j89R3M4j33L28o3j92l5j74L30m4j17J25j20L8
7753g9J21K3j53K5J00j67M9K67l20R5J98j30j44N8n9K04k58Q1J02j01J60l0J22
$$ plain form
7776 164 41 -79 76 147 253 111 -6 -101 102 -187 -125 29 86 100 115 -8 -67 -158 32 -38 -56 98 11 58
7800 58 51 -271 -17 14 -34 -15 -3 -25 4 -39 -149 -89 -165 -143 120 6 46 -107 138 -98 -33 2 49 0 13 -31 98
7827 98 181 166 70 -92 -84 118 102 153 -53 38 -98 222 -235 2 -23 -11 43 -175 -64 118 -192 171 56 -15
7851 -15 225 -99 -91 45 -23 -18 31 123 -27 -83 116 -228 59 -83 -98 170 -5 -50 -124 -70 65 52 83 60 36 13
7877 13 -122 -97 -124 -64 -62 -61 -22 144 -133 217 129 -5 -189 174 -185 -163 -158 35 159 -162 116 -35 80 -37
7901 -37 -20 153 -119 -48 -19 -485 13 193 -106 147 -71 200 56 -96 44 -35 -37 122 40 -32 -28 -35 -44 -108 -43 63
7927 63 100 127 71 -147 -8 -71 267 -61 18 164 -76 402 -109 180 -17 -154 128 -17 4 46 202 33 -56
7950 -56 -36 -144 22 74 -27 210 129 -11 -126 157 -178 -76 -51 152 28 137 302 -63 83 171 159 106 -34
$$ packed form
7776A64j23j20J55P1J06j42j17r5K03k89O2J54N7J4J5j23n9r1J90p0j8J54q7M7
7800E8pl22K54L1m8J9J2k2K9m3j10O0p6K2K63j14M0j53K45k36O5L5M7m9J3m4J29
7827I8Q3j5r6j62QK02j6N1k06R1j36L20m57K37k5J2N4k18J11J82l10L63j15p1
7851a5K40l24QJ36o8NM9R2j50n6J99l44K87j42j5K68j75m5p4N4J35j3L1k3k4k3
7877A3j35K5k7O0KJL9J66k77L50q8j34j84L63l59K2NJ93J24l21K78j51J15j17
7901c7J7J73k72P1K9m66M98J80k99K53k18K71j44j52J40p9kJ59q2p2Mpro4O5J06
7927F3L7K7n6k18J39o3L38l28P9J46k40M78n11K89j97j37K82j45K1M2J56j69q9
7950e6K0j08J66N2j01K37q1j40j15K83l35J02K5K03j24J09J65l65J46Q8j2n3j40
$$ plain form
7973 -34 -93 -144 -4 92 136 264 40 -314 -40 -219 144 -115 -103 169 141 144 204 -269 20 129 210 68 -17 137
7997 137 -54 37 -231 185 -14 -17 67 31 -41 96 -162 7 -33 54 205 -24 -275 -143 119 210 124 23 204
8020 204 -183 -43 -147 53 95 -71 -169 -40 -21 -83 -77 117 134 -84 -34 -7 -12 -67 -90 31 -39 1 80 218 12
8045 12 36 114 -36 -6 73 -12 213 227 -65 56 -67 33 229 -189 35 -223 -172 54 -23 117 -56 -136 -190 20
8069 20 -68 -173 -257 67 189 44 -47 -347 -55 27 108 1 -77 86 -59 -88 14 139 -198 -46 164 -28 75
8092 75 241 -48 -11 198 -125 156 -183 36 -226 -102 71 -82 -66 -76 -151 -38 -131 -62 -8 256 -22 66 233
8115 233 -182 30 84 -1 -90 137 4 212 -57 -9 -83 -42 57 99 64 25 59 -157 -213 -5 -56 71 85 93 112 -111
8141 -111 61 106 -144 35 156 37 23 142 -10 165 86 -37 -135 -132 274 73 -145 -68 214 -144 5 120
$$ packed form
7973c4n9n1J40R6M4J28k24l54K74j79L63k59J2K72k8LO0m73K89J09Q1j42q5J54
7997A37j91R1k68M16j99lQ4l6p2J37k58J69m0Q7J51k29k51J32K62R1q6j01J81
8020B04l87J40j04K00M2j66r8J29J9o2OJ94J7k18N0K7nn5k3J21p0M0P9J38k06
8045A2K4P8j50L0P9q5K25J4k92J21j23J00J96m18K24k58N1K26p7J40j73q0n4K10
8069B0q8j05q4L24J22j45r1l00K92Q2Q1j07p8J63j45k9J02J25l37J52K10j92J03
8092G5J66k89L7K09l23K81l39K19k62J24J73j53J6j0p5J13r3O9N4K64k78Q8J67
8115B33m15K12N4q5q9K27j33K08k69M8p4M1R9M2l5l9L4k16n6K08n1J27J4QJ9k23
8141a11J72M5k50J79J21j19j4J19j52J75p9j23r8LM06k01k18P7K82l58J49J15
$$ plain form
8163 120 -136 13 35 -98 -51 -127 -81 130 -37 434 -44 -123 33 16 -72 22 -87 250 202 -61 71 -8 71 -39
8187 -39 -55 195 -10 -5
$$ packed form
8163A20k56J49K2j33M7p6M6K11j67M71m78p9J56j7q8R4j09L37m8k63J32p9P9j10
8187c9j6K50k05N
8191e
$$ Imaginary data points
##PAGE= N=2
##DATA TABLE= (X++(I..I)), XYDATA
$$ plain form
0 0 0 0 0 0 0 0 0 0 0 0 0 0 -8 8 -8 8 -16 16 -17 24 -32 32 -40 48 -56 68 -80 92 -105 121 -142 160 -184 208
34 208 -234 265 -298 336 -375 419 -467 519 -576 638 -707 781 -864 953 -1050 1156 -1273 1402
52 1402 -1545 1703 -1880 2077 -2300 2556 -2846 3187 -3589 4072 -4668 5420 -6408 7762 -9752
67 -9752 13010 -19620 65597 -145877 -9246 76852 -160884 93967 30190 -67513 39294
78 39294 -15939 -5748 59058 1460 -22883 -17568 -2052 -7199 32737 -12444 -24560 5245 -52864
91 -52864 24588 40674 -54386 36435 19480 -21271 16138 -25566 -18548 -28095 -18740 22358 -3763
104 -3763 13569 -7728 11994 28831 -32647 7400 -34579 -35840 47764 -22249 27303 13601
116 13601 -76578 36098 10727 -5808 50148 -30583 -6789 2948 -13224 33154 -13424 -29999
$$ packed form
0@%%%%%%%%%%%%qJ6j6J6k4L2l3M1n6O4p2Q8j04J24j48J72j97K26k63L02l44L92
34B08m42M99n63O34p11P94q86R86j095J214j345J488j645J817k003K206k429K675
52A402k947L248l583L957m377M856n402O033o776P661q740J0088j1828J4170j7514
67i752K2762l2630Q5217k11474J36631Q6098k37736K54851o3777r7703J06807
78C9294n5233J0191O4806n7598k4343N315J5516n147L9936m5181j2116K9805n8109
91e2864P7452J6086r5060R0821j6955m0751L7409m1704P018r547R355M1098k6121
104c763J7332k1297J9722J6837o1478M0047m1979j261Q3604p0013M9552j3702
116A3601r0179J12676k5371j6535N5956q0731K3794R737j6172M6378m6578j6575
$$ plain form
128 -29999 -11205 13890 32293 15384 35407 -18932 -24959 17906 -28557 21847 7052 -37403
140 -37403 38624 1039 5811 32926 -22869 3787 -7513 -1648 24125 -11646 7556 -8845
152 -8845 -6034 5939 -25335 28259 5876 -6706 39404 -22158 -7064 -1972 -32190 17543 -9325
165 -9325 -7880 11547 -9896 22938 4361 -2175 -2660 -34309 -2910 -1914 6114 7728 -16430 8029
179 8029 -18946 -1204 24982 -21821 11252 -4017 -17948 24528 -16767 -5531 -4706 -23635 14423
192 14423 219 18973 16372 -12988 11408 -21676 -7412 8446 -18797 19138 -4340 -773
204 -773 23746 -13898 20008 2772 -17134 16288 -18815 6017 18990 -9254 10558 -11008
216 -11008 -4756 7963 4991 23765 -3809 4862 2494 -19679 13416 -8768 -9516 7526 -9529
$$ packed form
128b9999J8794K5095J8403j6909K0023n4339o027M2865m6463N0404j4795m4455
140c7403P6027l7585M772K7115n5795K6656j1300N865K5773l5771J9202j6401
152h845K811J1973l1274N3594k2383j2582M6110o1562J5094N092l0218M9733k6868
165i325J445J9427k1443L2834j8577o536m85l1649L1399R96Q028J614k4158K4459
179H029k6975J7742K6186m6803L3073j5269j3931M2476m1295J1236Q25j8929L8058
192A4423j4204J8754k601k9360K4396l3084J4264J5858k7243L7935k3478L567
204g73K4519l7644L3906j7236j9906L3422l5103K4832J2973k8244J9812k1566
216a1008O252J2719k972J8774k7574Q671k368k2173L3095k2184p48J7042j7055
$$ plain form
229 -9529 21182 11020 4547 8984 -21957 -11 -7368 -7429 13819 -13205 6927 -1142 -9128 16599
243 16599 -13541 6244 5414 -17569 14850 -12179 -9155 6506 -17005 2728 -9544 -2465 13170
256 13170 -1499 21073 -8778 -15401 1722 -29422 7540 8123 -13987 12731 -7092 4437 12169
269 12169 -1749 7049 -21004 -2176 8407 -9866 19402 -6814 -16632 7012 -2701 13400 10280
282 10280 6707 753 -11327 13858 -6653 -8314 6590 -17491 9405 9596 7420 20981 -10996
295 -10996 10060 -517 -20335 17245 -11506 -4865 17595 -7856 6054 -1834 896 6996 -5243
308 -5243 19415 -8419 -12291 14207 -17584 259 5296 -16911 1554 2771 12736 8870 -518
321 -518 722 -21964 -4185 2097 -8706 4826 -10239 181 4886 27 16265 -13407 -7175
$$ packed form
229i529L0711j0162o473M437l0941K1946p357o1K1248k7024K0132q069p986K5727
243A6599l0140J9785q30k2983L2419k7029L024J5661k3511J9733j2272P079J5635
256A3170j4669K2572k9851o623J7123l1144L6962N83k2110K6718j9823J1529P732
269A2169j3918Q798k8053J8828J0583j8273K9268k6216r818K3644r713J6101l120
282A0280l573n954j2080K5185k0511j661J4904k4081K6896J91k176J3561l1977
295a0996K1056j0577j9818L7580k8751O641K2460k5451J3910p888K730O100j2239
308e243K4658k7834l872K6498l1791J7843N037k2207J8465J217R965l866r388
321e18J240k2686J7779O282j0803J3532j5065J0420M705m859J6238k9672O232
$$ plain form
334 -7175 2328 -15544 14302 -697 -11226 2574 -16492 6625 3743 -2608 16818 -7975 3633
347 3633 5636 -12686 1297 -10383 -1827 1791 -1243 15970 -4681 9896 10975 -14598 10850
360 10850 -10016 -10464 17938 -8499 7064 6280 -13216 9477 3100 4395 8929 -1863 -586 -1925
374 -1925 7302 -2392 -6041 1721 -13914 9896 13048 829 16245 -11061 -5707 4190 -14255 9918
388 9918 -5264 -8767 12106 -7283 8820 5276 -10372 3700 -7672 356 2571 -5792 3582
401 3582 -9383 -1013 -1435 -8080 8293 -3939 4977 7853 -9951 3446 -10322 -8571 3898 -9482
415 -9482 3366 -331 1393 10100 -2225 5440 -9760 -9822 5426 -9243 11515 3556 -11968 10028
429 10028 -7429 3124 11900 -7792 6864 -2754 -43 10225 -7584 3416 -6235 -7157 11217
$$ packed form
334g175R503j7872K9846j4999j0529J3800j9066K3117k882o351J9426k4793J1608
347C633K003j8322J3983j1680Q556L618l034J7213k0651J4577J079k5573K5448
360A0850k0866m48K8402k6437J5563p84j9496K2693o377J295M534j0792J277j339
374a925R227r694l649P762j5635K3810L152j2219J5416k7306N354R897j8445K4173
388I918j5182l503K0873j9389J6103l544j5648J4072j1372Q028K215q363R374
401C582j2965Q370m22o645J6373j2232Q916K876j7804J3397j3768J751J2469j3380
415i482J2848l697J724Q707j2325P665j5200o2J5248j4669K0758p959j5524K1996
429A0028j7457J0553Q776j9692J4656r618K711J0268j7809J1000r651r22J8374
$$ plain form
442 11217 831 11503 6133 -3313 5221 -6963 796 -1587 -7192 8582 -1808 4666 9291 -3026
456 -3026 3621 -1572 -171 -1155 -2916 5816 -5709 3989 2382 -11798 4993 -4278 1198 11859
470 11859 -3891 5354 -6305 -7653 4150 -12412 2379 -1653 -9020 12920 -24 4984 2671
483 2671 -12696 269 -10654 50 6640 -11065 7848 -3054 -7098 10881 -5983 -351 2089
496 2089 -3815 4142 -2626 1730 -4534 -7510 3887 -5590 4598 8076 244 8522 -1402 -602 -3464
511 -3464 -7806 4598 -4351 3514 8186 -3586 8756 2516 279 3673 -6278 2895 -2158 2221
525 2221 8535 -7534 3163 -1917 -4914 10753 527 6427 2393 -5237 6420 -8016 -1325 363
539 363 -12263 7180 1889 2077 11086 -4147 -437 -3802 -4470 28 -7093 4353 -2040 -2834 6615
$$ packed form
442A1217j0386J0672n370r446Q534j2184P759k383n605J5774j0390O474M625j2317
456c026O647n193J401r84j761Q732j1525R698j607j4180J6791r271N476J0661
470A1859j5750R245j1659j348J1803j6562J4791m032p367K1940j2944N008k313
483B671j5367J2965j0923J0704O590j7705J8913j0902m044J7979j6864N632K440
496B089n904P957o768M356o264k976J1397r477J0188L478p832Q278r924Q00k862
511c464m342J2404q949P865M672j1772J2342o240k237L394r951R173n053M379
525B221O314j6069J0697n080k997J5667j0226N900m034p630J1657j4436O691J688
539C63j2626J9443n291J88R009j5233L710l365o68M498p121J1446o393p94R449
$$ plain form
554 6615 -6483 1675 -1257 -4501 7943 -6314 1016 1147 -10184 3764 -7006 -4685 5466 -5947
568 -5947 6846 7093 -1030 258 -6635 -2254 -5098 -1392 3409 -4443 4646 921 2233 8289 -7192
583 -7192 762 -432 -5191 8584 -1324 1556 545 -8039 5995 556 1608 6477 -1244 6259 -370
598 -370 -549 2838 -8666 -477 -78 2114 7878 -428 6604 310 -2395 3287 -6845 1914 -2034
613 -2034 -3336 9805 -4611 1226 2200 -7077 7225 -3175 -331 6168 -9480 3580 44 -6839
627 -6839 1374 -8133 1069 4704 -650 6775 -2012 -4098 -3347 -4833 1442 -4152 -718 543 -528
642 -528 5420 -1957 1675 -1675 -7362 3853 -1949 797 2053 -5919 3501 -3625 -995 6533 -4443
657 -4443 3917 1984 -200 5084 -5796 -362 -2025 -3655 5600 -1661 7026 4425 -4095 8028 -3523
$$ packed form
554F615j3098Q158k932l244J2444j4257P330J31j1331J3948j0770K321J0151j1413
568e947J2793K47q123J288o893M381k844L706M801p852R089l725J312O056j5481
583g192P954j194m759J3775r908K880j011q584J4034n439J052M869p721P503o629
598c70j79L387j1504Q189L99K192N764q306P032o294k705N682j0132Q759l948
613b034j302J3141j4416N837R74r277J4302j0400K844O499j5648J3060l536o883
627f839Q213r507R202L635n354P425q787k086P51j486O275n594L434J261j071
642e28N948p377L632l350n687J1215n802K746J256p972R420p126K630P528j0976
657d443Q360j933k184N284j0880N434j663j630R255p261Q687k601q520J2123j1551
$$ plain form
672 -3523 -2970 2526 -5129 5175 306 853 5791 -4885 3065 2131 -1500 4946 -2540 645 1646
687 1646 -1808 1082 -3106 641 -2212 -331 7874 -1809 2310 521 -6133 1487 -5438 -1064 1278
702 1278 -5327 5601 -284 25 4271 -6950 267 -1698 -3827 3419 -2877 397 -2262 -3147 2879
717 2879 -4580 2515 1697 -3366 4706 -3245 -707 -177 -6789 1688 -2492 22 5289 -1812 4886 252
733 252 -2883 1949 -4297 -789 -518 185 3319 -717 4140 -491 -930 4574 -3066 3637 1715 -2793
749 -2793 4999 -4041 452 1899 -4795 6011 552 1588 6795 -3281 1347 -1237 -3408 1521 -2339
764 -2339 1768 213 350 4918 -1733 2337 -379 -4467 1793 -2948 1264 787 -3682 2072 -3688 85
780 85 2320 -3265 3605 -679 -1704 1812 -4080 -1124 -3970 -2177 1399 -1661 4715 -33 -1412 2844
$$ packed form
672c523N53N496p655J0304m869N47M938j0676P950r34l631O446p486L185J001
687A646l454K890m188L747k853J881Q205r683M119j789o654P620o925M374K342
702A278o605J0928n885L09M246j1221P217j965k129P246o296L274k659q85O026
717B879p459P095q18n063Q072p951K538N30o612Q477m180K514N267p101O698m634
733B52l135M832o246L508K71P03L134m036M857m631m39N504p640O703j922m508
749b793P792r040M493J447o694J0806n459J036N207j0076M628k584k171M929l860
764b339M107j555J37M568o651M070k716m088O260m741M212m77m469N754n760L773
780H5K235n585O870m284j025L516n892K956k846J793L576l060O376m748j379M256
$$ plain form
796 2844 -4937 281 -1073 -4354 2760 -3076 1572 2492 -3423 2964 -1458 -853 3128 -1947 1789 -811
812 -811 -703 1060 -2948 1981 -866 669 4868 -114 4504 81 -2843 1608 -4158 1466 1279 -1647
828 -1647 5162 -396 2106 3011 -2332 1917 -1943 338 2181 -1969 2592 -1828 -721 2434 -2621
843 -2621 3552 -370 -711 3746 -3411 1487 -694 -5497 1970 -2951 242 3584 -1470 2299 -1022
858 -1022 -1387 -297 -3802 -630 -1983 -545 1065 -1170 1161 -1991 -649 731 -2125 2269 -1226
873 -1226 -1549 1284 -3514 285 -928 -1463 2282 -1176 3588 1109 -1743 2987 -3809 -714 834 -3133
889 -3133 3224 -661 800 4165 -1792 2193 -794 -1562 2431 -1664 2289 1069 -733 1669 -1655
904 -1655 2083 696 -558 4355 -1229 1492 2015 -3469 1575 -2112 -1185 3085 -982 2512 1685 -223
$$ packed form
796B844p781N218j354l281P114n836M648R20n915O387m422O05L981n075L736k600
812h11J08J763m008M929k847J535M199m982M618m423k924M451n766N624j87k926
828a647O809n558K502R05n343M249l860K281J843m150M561m420J107L155n055
843b621O173l922l41M457p157M898k181m803P467m921L193L342n054L769l321
858a022l65J090l505L172j353J438J610k235K331l152J342J380k856M394l495
873a226l23K833m798L799j213n35L745l458M764k479k852M730o796L095J548l967
889c133O357l885J461L365n957L985k987p68L993m095L953j220j802K402l324
904a655L738j387j254M913n584K721N23n484N044l687R27M270m067L494q27j908
$$ plain form
920 -223 978 -1867 -81 -1407 -1418 92 -793 2120 -1000 -350 1055 -3352 1118 -526 -2147 2389
936 2389 -2765 -702 -139 -3388 94 -1261 298 1152 -449 1992 -2134 -1145 -251 -3548 1123 -1572
952 -1572 -235 3042 -2243 2563 435 -2469 1975 -2406 229 1689 -1697 1975 -530 -164 1125
967 1125 -845 2119 -191 1302 2253 -1143 1865 -1222 -1371 1655 -1634 2586 2092 717 2672 -359
983 -359 432 -227 -1399 1236 -1150 1031 1152 -580 2280 -1206 764 961 -1742 1583 -447 -323 910
1000 910 -2055 314 -1299 -1166 889 -406 1636 -63 -30 66 -3062 -211 -1940 -1912 1294 -1451 1304
1017 1304 647 -1569 1382 -2812 -199 -37 -2642 2243 -1447 -835 1491 -2818 909 244 -839 2081
1033 2081 -915 860 109 -1450 798 -1639 142 774 -28 2841 99 1285 1414 -1922 1027 -495
$$ packed form
920b23J201k845J786j326j1J510q85K913l120O50J405m407M470j644j621M536
936B389n154K063N63l249L482j355J559Q54j601K441m126R89Q94l297M671k695
952a572J337L277n285M806k128k904M444m381K635J460l386L672k505L66J289
967A125j970K964k310J493R51l396L008l087j49L026l289M220m94j375J955l031
983c59P91o59j172K635k386K181J21j732K860l486J970J97k703L325k030J24J233
1000I10k965K369j613J33K055j295K042j699L3R6l128K851j729K8L206k745K755
1017A304o57k216K951m194K613J62k605M885l690O12K326m309L727o65j083K920
1033B081k996J775p51j559K248k437J781O32q02K869k742J186J29l336K949j522
$$ plain form
1049 -495 -816 2061 -25 1011 1077 218 494 28 755 -573 1215 1149 -1219 2092 -741 -913 1897 -1568
1067 -1568 1733 1529 -697 2390 -942 -609 47 -1823 426 -922 650 497 -874 2082 -1760 -741
1083 -741 978 -3133 680 -376 -1572 2036 -1535 -426 -15 -1449 768 -381 148 157 -1216 -23
1099 -23 -1914 -436 -385 -1583 1494 -625 561 1718 -1429 472 -414 -1454 422 -528 632 598 148
1116 148 1067 -586 1099 88 -106 1646 -454 1032 817 -839 1287 -733 181 1215 -232 2438
1132 2438 332 449 771 -1465 762 -664 -347 1807 -542 1657 709 -749 1516 -969 -2 430
1148 430 -1099 676 -587 -20 311 -873 381 -680 370 392 -613 1067 -1446 -765 76 -2298 115
1165 115 -591 -376 1384 -981 480 -27 -1725 142 -1552 -650 218 -1197 673 -629 -18 -316 -810
$$ packed form
1049d95l21K877k086J036O6q59K76m66P27j328J788o6k368L311k833j72K810l465
1067a568L301k04k226L087l332L33O56j870K249j348J572j53j371K956l842J019
1083g41J719m111L813j056j196L608l571J109M11j434K217j149N29Rj373J193
1099b3j891J478N1j198L077k119J186J157l147J901q86j040J876r50J160l4m50
1116A48R19j653J685j011j94J752k100J486k15j656K126k020R14J034j447K670
1132B438k106J17L22k236K227j426L17K154k349K199r48j458K265k485R67M32
1148D30j529J775j263N67L31j184J254j061J050K2j005J680k513O81Q41k374K413
1165A15p06K15J760k365J461n07j698J867j694R02Q68j415J870j302O11k98m94
$$ plain form
1182 -810 902 -971 245 1121 -1536 868 -515 -713 1090 -822 695 673 210 1360 -123 334 24
1199 24 -777 337 91 1240 835 630 1425 -481 685 733 -727 1617 -90 176 1192 -721 1058
1216 1058 -346 -9 982 -533 1177 520 -601 731 -1104 -200 -293 -1022 629 -447 528 636 -1029
1233 -1029 327 -997 -833 -156 -689 107 -458 157 -66 -1320 420 -924 -510 503 -1012 690 -384
1250 -384 -1023 387 -1869 269 271 -969 1304 -663 -50 689 -915 -123 -494 -373 306 8 1074 5
1268 5 214 555 -682 530 45 -66 1103 -222 842 835 -553 913 -209 448 1088 346 804 19 438
1287 438 17 -205 850 -457 881 688 -93 1258 -354 -120 135 -1347 984 -17 -157 1098 -846
1304 -846 465 196 -842 343 -927 121 202 -1001 739 -1263 -464 194 -1033 486 -230 -148 224
$$ packed form
1182h10J712j873J216Q76k657K404j383j98J803j912J517k2m63J150j483M57l10
1199B4q01J114k46J149m05k05P95j906J166M8j460K344j707K66J016j913J779
1216A058j404L37R91j515J710o57j121J332j835R04r3p29J651j076R75J08j665
1233a029J356j324J64O77n33P96n65O15k23j254J740j344M14J013j515J702j074
1250c84o39J410k256K138Kj240K273j967O13P39j604P92l71J21O79k98J066j069
1268EK09L41j237J212m85j11J169j325J064pj388J466j122O57O40p42M58p85M19
1287D38m21k22J055j307J338j93p81J351j612K34K55j482K331j001j40J255j944
1304h46J311k69j038J185j270J048Q1j203J740k002P99O58j227J519p16Q2L72
$$ plain form
1321 224 -957 -30 -718 -1038 82 -876 269 409 -282 267 -601 -375 -257 -315 154 -668 165 539 -254
1340 -254 705 -287 -27 175 -47 995 -158 559 389 -688 810 191 136 778 291 975 343 454 698
1359 698 -863 659 130 -286 1404 -97 337 893 -167 752 -329 -298 256 -483 994 -435 -170 375
1377 375 -1002 658 266 -99 798 -785 285 181 -782 200 -1044 -593 8 -288 406 -34 -335 -365 -624
1396 -624 146 -518 -541 -105 -516 227 -234 -497 -182 -738 297 -148 148 365 -797 241 -377 -261 481
1415 481 -412 121 218 116 628 -307 196 -214 -559 977 -206 170 641 -254 1042 249 311 623 -457
1434 -457 793 341 102 921 -381 93 164 30 949 -385 513 271 -311 1186 -202 -387 458 -871
1452 -871 502 251 -294 102 -475 35 -130 -189 -13 -693 -248 57 -296 93 -459 -560 -333 -392 164 -320
$$ packed form
1321B24j181R27o88l20J120r58J145J40o91N49q68K26J18n8M69q22Q33L74p93
1340b54R59r92K60K02k22J042j153P17j70j077J498o19n5O42m87O84o32J11K44
1359F98j561J522n29m16J690j501M34N56j060R19j081L1N54p39J477j429K65N45
1377C75j377J660l92l65Q97j583J070j04r63R82j244M51O01k96O94m40l01l0k59
1396f24P70o64k3M36m11P43m61k63L15n56J035m45K96K17j162J038o18J16P42
1415D81q93N33R7j02N12r35N03m10l45J536j183L76M71q95J296p93O2L12j080
1434d57J250m52k39Q19j302M74P1j34R19j334Q98k42n82J497j388j85Q45j329
1452h71J373k51n45L96n77N10j65n9J76o80M45L05l53L89n52j01K27n9N56m84
$$ plain form
1472 -320 -43 -401 -299 68 -666 64 -651 -418 517 -303 14 258 -1001 18 -24 -133 530 -354 -111 -80
1492 -80 193 122 -488 468 -300 308 1141 -322 723 189 -451 1060 -86 -124 738 -416 420 599 -294
1511 -294 739 247 -119 444 43 375 -11 97 227 172 364 -28 -72 -115 101 442 7 -35 -263 -226 -34
1532 -34 23 217 -296 -123 212 -483 382 303 -1143 317 -414 -554 254 -562 -367 -247 -417 19 -581 324
1552 324 -510 -582 239 -452 -71 -105 -701 35 -56 -31 426 -87 379 -259 -330 174 -474 -87 247 -145 338 -22
1574 -22 655 -112 289 633 -17 493 386 -280 572 196 337 451 -195 716 189 330 478 -291 457 147
1594 147 -132 692 100 -220 57 140 278 259 300 -99 -98 292 -177 -121 -311 -292 -210 -783 396 220 -705 -25
1616 -25 -586 -346 116 -559 -311 -91 -231 -291 -487 226 -439 -289 34 -611 311 -105 -658 243 -502 336 -284
$$ packed form
1472c20K77l58J02L67p34P30p15K33R35q20L17K44j259J019m2j09O63q84K43L1
1492h0K73p1o10R56p68O08Q33j463J045n34o40J511j146l8Q62j154Q36J79q93
1511b94J033m92l66N63m01L32l86J08J30n5J92l92m4m3K16L41m35m2k28L7J92
1532c4N7J94n13J73L35o95Q65p9j446J460p31j40Q08q16J95J20j70M36o00R05
1552C24q34p2Q21o91L81l4n96P36r1K5M57n13M66o38p1N04o48L87L34l92M83l60
1574b2O77p67M01L44o50N10j07o66Q52l76J41J14o46R11n27J41J48p69P48l10
1594A47k79Q24n92l20K77Q3J38j9M1l99JL90m69N6j90J9Q2n73J179j76r25O80
1616b5n61K40M62o75K48K20j40o0j96P13o65J50L23o45R22m16n53R01p45Q38o20
$$ plain form
1637 -284 -369 411 -386 -129 349 -478 -226 345 14 151 327 274 -74 127 455 -328 398 22 -137 487 265
1658 265 460 56 30 220 -169 432 481 134 214 -205 -30 611 100 367 95 227 614 41 -5 -251 -307 136
1680 136 -147 33 296 0 219 29 114 -24 -236 -307 -345 -97 -389 -404 -215 -265 -35 -74 -70 -117 -231 48 -412
1703 -412 -508 -21 -551 -467 -9 -379 145 -105 -414 362 -295 136 -19 -416 24 -99 191 391 -39 146 103
1724 103 198 132 -46 199 -262 211 329 190 269 378 -52 577 31 648 645 -49 132 -21 -65 95 45 266
1746 266 417 105 365 94 -68 160 1 -78 24 -145 -193 369 133 -54 107 -282 -53 161 -46 -247 -411
1767 -411 -420 28 -487 13 -248 -405 128 -177 93 212 -196 -248 -402 -104 -104 -403 95 -235 -501 143 -56 30
1789 30 27 -79 131 -318 112 -115 -11 277 114 149 461 -124 108 230 14 -135 -191 203 235 139 201 530 -33
$$ packed form
1637b84q5P80p97K57M78q27K52N71l31J37J76n3l48K01L28p83P26l76j59O24k22
1658B65J95m04k6J90l89O01M9l47Q0m19J75O41n11K67k72J32L87n73m6k46n6M43
1680A36k83J80K63k96K19j90Q5j38k12p1l8K48k92j5J89n0K30l9Mm7j14K79m60
1703d12r6M87n30Q4M58l70N24k50l09P76o57M31j55l97M40j23K90K00m30J85m3
1724A03R5o6j78K45m61M73J18j39P9J09m30O29n46O17lo94J81j53m4J60n0K21
1746B66J51l12K60k71j62K28j59p9J02j69m8N62k36j87J61l89K29K14k07k01j64
1767d11rM48n15N00k61j57N33l05K70J19m08n2j54K98%k99M98l30k66O44j99Q6
1789C0lj06K10m49M30k27J04K88j63L5L12n85K32J22k16j49n6L94L2r6O2L29n63
$$ plain form
1812 -33 186 552 135 322 249 -340 88 571 95 51 -30 -54 291 278 389 -120 -132 -91 -50 207 342 -162 93
1835 93 -311 -120 235 147 4 -301 -127 -100 -231 97 -19 -131 193 117 -79 -58 -98 -232 -526 -182 -106 -400
1857 -400 -46 234 -392 -47 -364 -182 165 -199 -5 -311 -183 247 2 126 29 -155 202 -50 311 187
1877 187 33 -136 -32 72 250 111 180 85 44 352 491 63 243 93 107 95 190 318 354 -150 260 378
1899 378 -75 421 160 0 156 -20 -69 68 201 343 -199 -110 60 -81 176 117 -203 -214 -437 -123 161
1920 161 -96 -27 -282 -530 148 -240 189 -328 -814 -307 -145 136 216 -478 -435 -285 -98 95 67 -281 -236 -187
1942 -187 -128 131 8 -149 96 374 142 238 385 168 -265 -19 -36 -82 122 119 310 241 -89 36 201 284 365
1965 365 172 129 86 -97 171 262 -72 144 123 465 409 501 165 106 -344 -396 398 360 193 327 207 262 95
$$ packed form
1812c3K19L66m17J87p3n89M28M83m76m4q1k4L45j3J11n09j2M1M1K57J35n04K55
1835I3m04J91L55q8j43l05J74K7j31L28j16j12L24p6j96K1m0j34k94L44P6k94
1857d00L54K80o26L45l17J82L47l64J94l06J28M30k45J24r7j84L57k52L61j24
1877A87j54j69J04J04J78j39O9r5m1L08J39m28J80j50J4j2R5J28L6n04M10J18
1899C78m53M96k61j60J56j76m9J37J33J42n42Q9J70j41K57n9l20j1k23L14K84
1920A61k57O9k55k48O78l88M29n17m86N07J62K81Q0o94M3J50J87J93k8l48M5M9
1942a87N9K59j23j57K45K78k32R6J47k17m33K46j7m6K04lJ91o9l30J25J65Q3Q1
1965C65j93m3m3j83K68R1l34K16k1L42n6R2l36n9m50n2P94l8j67J34j20N5j67
$$ plain form
1988 95 -369 -984 468 185 104 -339 -190 112 -498 22 -52 94 215 -100 -118 -80 -253 -457 -59 -154 -328 254
2010 254 -117 184 213 85 91 -375 -84 -823 -394 416 66 -134 -14 -305 110 432 -53 -236 20 74 -404
2031 -404 539 552 -253 -436 -423 -461 -196 464 606 -705 -520 -419 -351 198 346 81 237 495 163 193 187 -269
2053 -269 -56 223 76 107 266 -101 43 -26 56 89 88 -39 143 75 -174 -84 -382 -145 21 -264 48 348 1
2076 1 -165 -76 -469 -343 -310 -191 -66 -71 -96 -276 -195 -157 -343 -338 -44 -249 -10 94 -12 -221 -231 -182 -110 37 151
2101 151 158 240 2 -68 -195 26 127 30 295 356 266 189 81 458 -235 -121 79 141 513 438 41 -249 14
2124 14 194 268 301 341 58 146 -95 -22 129 112 -182 119 247 262 43 102 -321 -1292 561 -98 -48 -138 180
2147 180 134 201 -48 -224 -182 -109 -86 -205 -100 -319 -159 9 137 -61 147 -16 276 143 -221 -84 -474 -443
$$ packed form
1988I5m64o15J452k83q1m43J49L02o10N20p4J46J21l15j8L8j73k04L98r5j74N82
2010B54l71L01K9j28Om66K91p39M29Q10l50k00J20k91M15L22m85j83K56N4m78
2031d04R43J3q05j83J3l8K65O60J42j311J85J01O8N49J48k65J56K58l32L0om56
2053b69K13K79j47L1J59l67J44o9Q2L3jj27J82o8k49R0k98K37J66k85L12L00l47
2076Aj66Q9l93J26L3J19J25nk5j80Q1L8j86NK94k05K39J04j06k09j0M9P2J47J14
2101A51PQ2k38p0j27K21J01r7K65O1r0p7j08L77o93J14K00O2L72p5l97k90K63
2124A4J80P4L3M0k83Q8k41P3J51j7k94L01J28J5k19N9m23r71J853o59N0r0L18
2147A80m6O7k49j76M2P3K3j19J05k19J60J68J28j98K08j63K92j33l64J37l90L1
$$ plain form
2169 -443 -236 -33 -204 87 -83 188 60 -238 -31 -428 -359 -126 100 210 91 -45 -36 230 240 70 197
2190 197 -143 156 92 57 138 175 -56 50 189 468 111 180 104 52 2 -8 -133 95 136 256 80 159 -44 -60
2214 -60 -38 22 -273 -353 48 19 331 -161 -115 62 -19 -97 -61 -22 -541 -183 -115 -133 -87 -191 -251 -166 233 2 128
2239 128 212 -337 -273 -504 -66 108 -48 130 10 146 122 43 -78 5 -222 7 -81 -290 -156 96 -164 221
2261 221 106 236 -89 -402 -12 442 270 130 271 247 -2 -57 -53 567 390 622 317 -589 76 882 319
2282 319 299 -434 -5 -98 263 190 -115 154 -385 -334 -104 -122 45 -31 -260 249 77 206 -94 -43 -185 -164 15
2305 15 -167 -194 73 -9 -386 -9 -179 -213 -189 -128 62 147 -417 -73 -62 40 -8 -538 -85 122 174 174 47 -285
2329 -285 -79 -356 -100 305 -186 47 108 195 -36 147 -74 72 224 -105 74 189 -12 -177 133 -73 287
$$ packed form
2169d43K07K03j71K91j70K71j28k98K07l97O9K33K26J10j19j36RK66J0j70J27
2190A97l40K99o4l5Q1L7k31J06J39K79l57O9p6n2n0j0j25K28M1J20j76P9k03j6
2214f0K2O0k95q0M01k9L12m92M6J77q1p8L6L9n19L58O8j8M6j04o0Q5L99k31J26
2239A28Q4n49O4k31M38J74j56J78j20J36k4p9j21Q3k27K29q8k09J34K52k60L85
2261B21j15J30l25l13L90M54j72j40J41k4k49n5MO20j77K32l05r06O65Q06n63
2282C19k0p33M29r3L61p3l05K69n39N1K30j8J67p6k29N09j72J29l00N1j42K1J79
2305A5j82k7K67q2l77L77j70l4K4O1J90Q5n64L44J1J02m8n30M53K07N2%j27l32
2329b85K06k77K56M05m91K33O1Q7k31J83k21J46J52l29J79J15k01j65L10k06L60
$$ plain form
2350 287 305 95 127 31 -176 90 155 47 257 25 200 420 -78 33 -148 -32 -29 -207 -34 105 72 -29
2372 -29 12 -18 -79 91 -147 -74 -220 -42 -178 -172 132 -42 30 -224 -71 196 -101 238 -127 -111 -382 -221 -247
2395 -247 310 45 50 287 -129 -42 29 5 -46 62 89 352 -245 -24 62 237 333 159 70 -19 178 35 146 94
2419 94 -49 213 188 122 176 275 144 139 40 204 53 175 -240 398 304 -24 137 -152 246 212 71 -20 13 -54
2443 -54 142 -79 -77 -165 -162 -169 70 115 -79 -237 -335 -374 -5 -131 -271 -77 103 -31 -117 -95 -168 -59 -425 23 24
2468 24 -109 -113 -389 -155 -172 93 48 -54 -1 59 -160 -234 -305 -213 -80 -203 74 182 379 340 151 -11 -12 -146
2492 -146 99 321 311 61 335 321 132 115 -102 219 -19 132 186 -38 -149 -250 12 85 97 271 140 109
2514 109 201 21 -94 -154 -166 57 -67 128 135 -67 -91 32 81 -198 -258 -180 -95 96 26 -149 517 -313 -332 213
$$ packed form
2350B87J8k10L2r6k07K66O5j08K10k32J75K20m98J11j81J16Lj78J73J39l3j01
2372b9M1l0o1J70k38P3j46J78j36OL04j74P2k54J53K67k97L39l65J6k71J61k6
2395b47N57k65NK37m16Q7P1k4n1J08K7K63n97K21Q6J75R6j74q9q9J97j43J11n2
2419I4j43K62k5o6N4R9j31nr9J64j51J22m15O38r4l28J61k89L98l4j41r1L3o7
2443e4J96k21Kq8LpK39M5j94j58r8l9L69j26j40J94J80j34q6K2p3J09l66M48J
2468B4j33mk76K34j7K65m5j02N3O0k19p4p1R2J33j23K77J08J97l9j89j62jj34
2492a46K45K22j0k50K74j4j89j7k17L21k38J51N4k24j11j01K62P3J2J74j31l1
2514A09R2j80j15o0j2K23j24J95Pk02k4J23M9k79o0P8Q5J91p0j75O66q30j9N45
$$ plain form
2538 213 -84 -624 -95 -806 -179 64 -283 -335 -273 25 314 -2 76 -59 -243 -243 -156 88 17 -13 -56 7 -7 296
2562 296 -9 -42 -107 256 89 -18 -40 -183 205 67 -65 249 65 101 173 118 72 -147 -239 135 -95 124 -176
2585 -176 96 305 105 285 63 -178 -30 23 88 32 180 -46 -71 0 -67 208 104 -3 127 230 -31 -140
2607 -140 -212 55 3 -7 256 72 -112 23 -239 -183 -106 -131 -32 -5 -20 96 -184 -147 -22 -61 -36 149 -186 4
2631 4 -199 -74 -228 54 4 155 204 322 198 16 64 53 236 102 88 105 121 162 145 188 124 123 81 -123 251
2656 251 66 65 -50 141 -22 -5 127 102 139 113 -71 22 -141 -69 67 203 181 76 10 145 -9 -135 -290
2679 -290 87 -224 17 -203 127 -119 -320 129 -113 -23 -159 -96 -105 -18 81 -177 -339 93 -126 14 -9 -114
2701 -114 138 -61 39 -168 -34 -122 43 34 -39 233 119 230 -175 -400 5 10 -210 21 252 -10 70 -28 103
$$ packed form
2538B13k97n40N29p11O27K43l47n2O2K98K89l16P8j35j84%Q7K44p1l0m3O3j4L03
2562B96l05l3o5L63j67j07k2j43L88j38j32L14j84L6P2n5m6k19r2L74k30K19l00
2585a76K72K09k00J80k22k41J48N3O5n6J48k26k5P1o7K75j04j07J30J03k61j09
2607a40p2K67n2j0K63j84j84J35k62N6P7k5R9K7j5J16k80L7J25l9K5J85l35J90
2631Dk03J25j54K82n0J51M9J18j24j82M8j1J83j34j4J7J6M1j7M3o4jm2k04L74
2656B51j85jj15J91j63J7J32k5L7k6j84R3j63P2J36J36k2j05o6J35j54j26j55
2679b90L77l11K41k20L30k46k01M49k42R0j36O3rQ7R9k58j62M32k19J40k3j05
2701a14K52j99J00k07J34q8J65rp3K72j14J11m05k25M05Nk20K31K31k62Q0r8J31
$$ plain form
2724 103 27 99 213 82 24 100 -149 -6 109 -93 293 -41 -41 245 104 81 -128 96 37 -31 -20 197 14
2747 14 196 -170 83 68 -55 31 -116 8 64 150 -177 49 87 -59 25 -119 -43 -169 -38 -378 -45 -287 -33
2770 -33 74 54 29 -105 -157 -110 -45 -213 -91 28 -105 31 -250 -34 196 -57 -27 34 -10 -79 -63 15 -64 -72 -22
2795 -22 44 82 67 288 469 -151 68 -67 -398 33 146 -50 -41 -138 -206 89 34 -9 -62 114 43 191 -101 123
2819 123 -80 -332 -163 -9 -12 -133 -66 -19 -92 49 230 165 -293 162 -120 25 176 114 -143 -11 -132 -56 50
2842 50 -209 68 -49 -281 -182 8 136 -17 32 115 -1 -259 147 -15 -150 14 -33 148 59 70 130 58 13
2865 13 -76 7 -251 -56 -37 147 192 239 -91 258 109 -149 7 101 241 34 113 -180 -44 103 -51 20 -140
2888 -140 -11 -51 -47 -62 -189 90 -57 -19 -123 204 28 212 60 -19 -130 -246 15 -4 62 -53 -12 30 46 7
$$ packed form
2724A03p6P2J14j31n8P6k49J43J15k02L86l34%K86j41k3k09K24n9o8J1K17j83
2747A4J82l66K53j5j23Q6j47J24N6Q6l27K26L8j46Q4j44P6j26J31l40L33k42K54
2770c3J07k0k5j34n2M7O5j68J22J19j33J36k81K16K30k53L0O1m4o9J6P8p9qN0
2795b2O6L8j5K21J81o20K19j35l31M31J13j96Rr7o8K95n5m3n3J76p1J48k92K24
2819A23k03k52J69J54lj21O7M7p3J41J81o5m58M55k82J45J51o2k57J32j21P6J06
2842E0k59K77j17k32R9J90J28j53M9Q3j16k58M06j62j35J64m7J81q9J1O0p2m5
2865A3q9Q3k58J95J9J84M5M7l30L49j49k58J56R4J40k07P9k93J36J47j54P1j60
2888a40J29m0Mj5j27K79j47L8j04L27j76J84j52p9j11j16K61j9O6j15M1M2J6l9
$$ plain form
2912 7 1 -215 -210 -188 -452 -200 -147 -305 115 -41 -18 -180 195 -226 -172 -74 2 -122 -88 -65 33 25 79 -130 55 106
2938 106 -114 13 -15 138 -185 -37 -164 -107 -31 24 -21 27 165 -51 173 26 35 35 101 97 32 37 341 -150 99
2963 99 -111 54 -43 85 -149 137 -103 177 75 252 77 128 274 219 -100 -145 -169 62 -242 -239 -84 -108 83
2986 83 101 -9 -96 35 -176 -36 -19 6 -162 10 -19 -189 -55 -22 -250 166 135 -30 -105 -127 -149 -187 -178 152 -146
3011 -146 -120 177 44 101 -61 -122 -39 -234 -124 -61 10 -13 119 261 110 -88 -54 -103 -123 135 -197 206 26
3034 26 141 -125 -199 -62 -100 284 -58 51 237 -165 89 117 10 57 137 299 176 -10 117 -149 -85 -63 -185
3057 -185 52 81 -57 124 -121 -19 285 -63 223 -28 -166 11 -13 -16 -56 -8 -262 -175 193 68 -181 -150 -120
3080 -120 132 130 3 187 20 -45 -119 -18 -32 -417 -112 222 -4 35 95 -66 150 32 -305 -128 120 117 -88
$$ packed form
2912Gok16NK2k64K52N3j58M20j56K3j62L75m21N4R8P6j24L4K3R8qN4k09J85N1
2938A06k20J27k8J53l23J48j27N7P6N5m5M8J38k16K24j47R%O6mo5NL04m91K49
2963I9k10J65r7J28k34K86k40K80j02J77j75N1J46n5l19m5k4K31l04LJ55k4J91
2986H3J8j10q7J31k11J40J7K5j68J72k9j70J34L3k28M16l1j65p5k2k2l8RL30k98
3011a46K6K97j33N7j62o1Q3j95J10O3P1k3J32J42j51j98L4m9k0K58l32M03j80
3034B6J15k66p4J37l8L84l42J09J86m02K54K8j07M7Q0J62j23j86J27k66O4K2j22
3057a85K37K9j38J81k45J02L04l48K86k51j38J77k4lm0M8k54Q7L68j25k49L1L0
3080a20K52kj27J84j67o5p4J01j4l85L05L34k26L9O0j61K16j18l37J77K48lk05
$$ plain form
3103 -88 -42 183 9 22 51 85 152 261 31 -219 406 141 27 -2 -76 -150 -36 49 318 51 134 83 -46 100
3127 100 -44 25 -31 -148 -116 95 20 108 20 121 -153 252 51 -116 -84 -24 -279 -87 -142 139 119 -12 41 -81
3151 -81 -32 -155 -197 48 -156 -70 -30 -48 127 103 -15 -137 69 52 113 -272 121 120 -169 -28 -168 12 63 230
3175 230 99 88 97 -312 -240 70 111 -38 96 232 135 43 77 133 53 185 -57 -123 42 -177 74 79 57 104 73
3200 73 43 -53 71 -26 13 64 29 100 -162 -65 163 104 64 68 -19 207 81 28 -227 -149 133 106 -130 29 -196 -92
3226 -92 -173 -215 -312 -99 -50 -272 -201 16 20 -223 -71 2 132 45 -61 -114 -146 -65 56 222 208 -126 -266 170 46
3251 46 -160 -178 -43 -68 116 -132 44 108 60 -19 -30 80 49 212 -199 -85 -36 -6 38 41 -72 246 -18 38 -51
3276 -51 50 349 -173 142 248 -207 72 -47 92 -6 -250 -23 201 -30 174 56 -53 -14 -78 33 -184
$$ packed form
3103h8M6K25j74J3K9L4O7J09k30k50O25k65j14k9p4p4J14Q5K69k67Q3n1j29J46
3127A00j44O9n6j17L2K11p5Q8q8J01k74M05k01j67L2O0k55J92n5K81k0j31N3j22
3151h1M9j23m2K45k04Q6M0j8J75k4j18j22K06j7O1l85L93jk89J41j40J80N1J67
3175B30j31j1Rm09P2L10M1j49J34J36r7r2L4N6q0J32k42o6J65k19K51Nk2M7l1
3200G3l0r6J24r7L9N1l5P1k62R7K28n9m0Mq7K26j26n3k55P8K82k7k36J59k25J04
3226i2q1m2r7K13M9k22P1K17Mk43J52P3J30q7j06n3l2Q1J21J66j4l34j40M36j24
3251D6k06j8J35k5J84k48J76O4m8p9j1J10l1J63m11J14M9L0M4Lj13L18k64N6q9
3276e1J01K99n22L15J06m55K79j19J39r8k44K27K24k31K04j18j09L9o4J11k17
$$ plain form
3297 -184 -95 9 9 -23 159 60 -118 -178 175 29 98 8 -115 -269 -164 -235 -10 57 -13 142 -126 -36 68 44
3321 44 93 -201 44 -16 330 166 86 419 123 -249 -236 -192 -131 297 200 349 -47 95 -20 -2 290 -12 68
3344 68 -246 -38 -82 -215 302 -82 131 215 -53 102 61 47 -92 -10 -245 155 -283 -89 -51 205 33 -71
3366 -71 -93 -56 -18 0 -64 -118 -102 -94 176 -45 5 46 -52 -13 -21 13 -87 -323 16 235 -244 -80 139 5 -63 10
3392 10 -187 -29 97 -8 53 -42 -216 214 97 236 89 -78 7 -67 185 121 77 27 -166 21 97 -100 -50
3415 -50 -58 207 186 9 340 24 -58 -77 144 163 32 129 164 -182 179 240 185 52 275 22 185 1 52 14
3439 14 -43 274 -49 128 -218 103 43 -107 111 22 -135 165 -190 -153 -94 -281 -117 7 12 78 38 7 216 -261
3463 -261 158 9 -37 -116 -101 -84 -130 -101 -21 228 -50 -81 0 -94 -199 10 52 -106 -129 136 -27 -62 103 -44
$$ packed form
3297a84Q9J04%l2J82r9j78o0L53j46O9r0j23j54J05p1K25O7p0J55k68R0J04k4
3321D4M9k94K45o0L46j64q0L33k96l72J3M4O1M28r7J49l96J42j15J8K92l02Q0
3344F8l14K08m4j33N17l84K13Q4k68J55m1j4j39Q2k35M00m38J94L8K56j72j04
3366g1k2L7L8J8o4n4J6QK70k21N0M1r8L9qL4j00k36L39K19m79J64K19j34o8P3
3392A0j97J58J26j05O1r5j74M30j17J39j47j67Q5p4K52o4m4n0j93J87P6j97N0
3415e0qK65k1j77L31l16q2j9K21J9j31R7L5l46L61O1n5j33K23k53J63j84N1l8
3439A4n7L17l23J77l46L21o0j50K18q9j57L00l55L7N9j87J64J24NO6m0l1K09m77
3463b61M19j49m6p9J5J7m6K9Q0K49k78l1Q1r4j05K09M2j58k3K65j63l5J65j47
$$ plain form
3487 -44 176 69 -69 77 -157 33 -73 6 168 65 -6 -83 -91 -125 138 65 -89 -36 22 20 -43 -124 -185 246 -225
3512 -225 141 157 70 38 -239 -92 -45 26 94 -100 -87 66 137 -49 78 -340 15 -144 -155 -1 -125 -69 84
3535 84 28 -154 -103 108 103 10 120 -241 -247 35 -201 301 -196 135 -25 -110 -7 48 -47 -128 63 -162 45 20
3559 20 112 -144 -113 -64 -120 -27 -233 -58 29 -7 8 -193 -387 50 35 47 -141 144 56 74 82 26 47 -71 77 54
3585 54 -56 -247 -63 -70 -11 15 -205 11 -108 84 -130 11 32 -79 -125 20 -33 -178 74 123 45 -103 -10 -76
3609 -76 -90 -229 -98 35 -140 110 114 12 194 -138 -114 23 -138 -145 21 -53 222 237 -78 2 149 -13 83 332
3633 332 184 -199 152 266 -68 229 -64 -79 66 -39 155 72 68 -187 272 40 110 54 118 -79 55 -23 65
3656 65 351 66 207 -63 79 -186 -92 77 256 216 207 90 -134 105 165 24 -140 120 -92 120 22 31 -19
$$ packed form
3487d4K20j07j38J46k34J90j06P9J62j03p1p7ql4K63p3j54N3N8ko3q1o1M31m71
3512b25L66J6q7l2k77J47M7P1O8j94J3J53P1j86J27m18L55j59j1J54j24N6J53
3535H4n6j82N1K11nr3J10l61oK82k36N02m97L31j60q5J03N5r5q1J91k25K07k5
3559B0R2k56L1M9n6R3k06J75Q7l6J5k01j94M37j5J2j88K85q8J8Qn6K1j18J48k3
3585E4j10j91J84pN9K6k20K16j19J92k14J41K1j11m6J45n3j45K52M9p8j48R3o6
3609g6j4j39J31J33j75K50Mj02J82l32K4J37j61pJ66p4K75J5l15Q0J47j62R6K49
3633C32j48l83L51J14l34K97k93j5J45j05J94q3mk55M59k32P0n6O4j97J34p8Q8
3656F5K86k85J41k70J42k65R4J69J79m0rj17k24K39O0j41j64K60k12K12r8Rn0
$$ plain form
3679 -19 10 -29 58 35 -187 -106 62 -15 152 -6 -59 68 30 77 -209 221 137 104 39 -53 -144 -42 -131 -182 64 -209
3705 -209 16 243 324 -282 -261 299 -39 83 141 -49 -62 -28 130 -161 -34 249 228 53 165 36 76 -132
3727 -132 3 -224 189 -259 -70 -11 85 -137 -61 189 111 -110 81 -25 -36 -73 -78 38 93 -79 122 118 28 -4
3751 -4 -153 -228 -29 -54 40 -187 6 -68 -185 214 -93 -135 18 -32 277 159 124 31 -155 -177 194 21 -170 -206
3775 -206 -13 -184 -211 -7 -34 -17 -130 39 219 -42 -47 265 -159 -27 75 56 10 166 16 238 -63 197
3797 197 163 -181 164 -114 59 73 0 63 -85 -82 124 156 -30 180 -11 101 102 231 264 -226 208 -84 134
3820 134 171 162 174 -126 243 177 94 185 35 75 -360 -35 -161 130 59 -9 136 -5 18 -282 -93 -5 -213 173
3844 173 -287 -71 0 56 -240 131 70 -153 165 -267 123 -51 284 29 133 -18 80 -49 -284 35 150
$$ packed form
3679a9K9l9Q7k3k22Q1J68p7J67j58n3J27l8M7k86M30q4l3o5r2r1J02q9n1K46k73
3705b09K25K27Q1o06K1N60l38J22N8j90j3L4J58k91J27K83k1j75J12j29M0k08
3727a32J35k27M13m48J89N9R6k22P6K50p8k21J91j06j1l7nJ16N5j72K01mr0l2
3751dj49p5J99k5R4k27J93p4j17L99l07m2J53n0L09j18l5r3j86k2L71j73j91l6
3775b06J93j71k7K04k7J7j13J69J80k61nL12m24J32J02j9m6J56j50K22l01K60
3797A97l4l44L45k78J73J4p3O3j48LK06L2j86K10j91J12JJ29L3m90M34k92K18
3820A34L7rJ2l00L69o6q3R1j50M0m35L25j26K91p1o8J45j41K3l00J89Q8k08L86
3844A73m60K16P1N6k96L71o1k23L18m32L90j74L35k55J04j51R8j29k35L19J15
$$ plain form
3865 150 -13 38 148 35 -232 169 174 283 -90 29 196 -207 -166 3 -46 -28 4 17 -29 109 232 -115 -26
3888 -26 77 31 -65 -133 -96 31 -76 29 -208 59 39 -28 -36 61 -107 -83 201 19 144 -16 -158 86 -105 -8
3912 -8 -139 -189 -177 91 -78 -77 -152 -157 5 -16 55 -372 -155 41 -106 17 67 107 -145 -81 -111 -161 236 -20 2 -7
3938 -7 197 109 -97 -25 70 -258 3 38 -405 18 167 -131 52 52 236 270 -33 139 -6 115 -303 38 84
3961 84 -141 12 -15 161 173 -306 111 -151 98 42 -67 110 -90 -85 27 -20 -9 -147 49 -104 13 124 -116
3984 -116 84 63 147 -74 -88 114 10 -93 -86 77 145 -102 -22 61 -27 -56 220 -19 -67 -235 -72 167 14 0
4008 0 -52 56 96 -67 26 21 102 1 -55 46 -4 -131 63 48 42 -156 48 -78 110 -248 191 34 36 -28 132
4033 132 55 193 215 266 -181 -134 -69 -65 -15 -69 -83 -44 -14 -128 81 2 173 -115 128 24 112 34 75 142 -73 25
$$ packed form
3865A50j63N1J10j13k67M01NJ09l73J19J67m03M1J69m9J8L2J3m6J38J23l47Q9
3888b6J03m6r6o8L7J27j07J05k37K67k0o7qR7j68K4K84j82J25j60j42K44j91R7
3912hj31n0J2K68j69Jp5nJ62k1P1m27K17J96j47J23N0M0k52O4l0n0L97k56K2r
3938gK04q8k06P2R5l28K61L5m43M23J49k98J83%J84L4l03J72j45J21m18L41M6
3961H4k25J53k7J76J2m79M17k62K49n6j09J77k00NJ12m7J1j38J96j53J17J11k40
3984a16K00k1Q4k21j4K02j04j03PJ63O8k47Q0Q3q8k9K76k39m8j68J63K39j53j4
4008@n2J08M0j63R3nQ1j01n6J01n0j27J94j5oj98K04j26J88l58M39j57Ko4J60
4033A32p7J38K2N1m47M7O5MN0n4j4L9L0j14K09p9J71k88K43j04Q8p8M1O7k15R8
$$ plain form
4059 25 -88 244 187 -124 -72 210 159 149 14 -42 32 -194 76 42 -148 59 -188 141 49 83 26 144 142 209 14
4084 14 70 -302 -81 -97 14 29 65 117 131 -58 -116 83 108 -39 -1 89 -176 298 134 169 -103 -90 102 145 72
4109 72 34 111 -174 124 169 -77 -11 -123 8 99 2 306 -218 31 185 67 -15 -265 85 70 96 -87 107
4132 107 25 209 -31 -103 73 95 23 -63 31 -174 -293 -230 80 -71 49 -226 52 -68 -139 -94 -50 -51 -258 -57
4156 -57 188 91 -295 92 -219 49 -7 99 -141 230 -48 -295 103 27 46 -62 131 170 31 -100 175 -152
4178 -152 6 37 28 28 35 25 -12 36 -61 156 -136 -254 -116 -67 -152 256 -183 -435 121 135 -230 -90 88 -314 31
4203 31 -333 118 -226 -30 -39 -340 204 81 -92 80 -2 33 -182 -38 -61 -85 -146 -138 -90 -14 -195 152 -6 44
4227 44 -40 69 -119 -33 -103 110 33 28 99 -79 -73 191 88 -141 -160 -168 214 27 59 72 -120 28 78 167 188 66
$$ packed form
4059B5j13L32n7l11N2K82n1j0j35n6P4k26K70l4j90K07k47L29r2L4n7J18kO7j95
4084A4N6l72K21j6J11J5L6N2J4j89n8J99K5j47L8R0k65M74j64L5k72J3J92M3p3
4109G2l8P7k85K98M5k46O6j12J31R1r7L04n24K49J54j18q2k50L50j5K6j83J94
4132A07q2J84k40p2J76K2p2q6R4k05j19O3L10j51J20k75K78j20p1M5M4jk07K01
4156e7K45r7l86L87l11K68n6J06k40L71k78k47L98p6J9j08J93L9j39j31K75l27
4178a52J58L1r%Pj0l7M8r7K17k92j18J38M9q5M08m39k52N56J4l65J40J78m02L45
4203C1l64M51l44J96rl01N44j23j73J72q2L5k15J44k3k4o1QM8P6j81L47j58N0
4227D4q4J09j88Q6p0K13p7nP1j78OK64j03k29j9qL82j87L2J3j92J48N0Q9K1j22
$$ plain form
4253 66 2 72 -10 220 -2 105 87 289 156 165 54 147 31 12 175 -59 -69 159 184 0 132 -148 57 -144
4277 -144 108 -160 83 -47 31 -106 -79 -94 215 291 -173 72 113 68 143 83 -218 -116 39 -191 -201 -194 -214 -231
4301 -231 -28 155 -139 -214 -152 25 64 289 -99 76 211 -130 20 200 -135 141 11 8 -146 25 117 201
4323 201 46 141 -63 68 -83 20 190 -10 -45 280 -54 17 -70 -92 47 93 45 216 76 94 -17 219 216
4346 216 -142 162 180 40 21 63 -24 -51 15 -146 -183 -18 -148 60 -48 302 -78 -10 30 -81 -167 132 220 119
4370 119 -12 -53 -262 16 253 -269 -164 54 -21 -66 49 42 -19 -49 43 -119 147 28 -88 88 -112 -148 2
4393 2 -5 -274 -161 -162 -29 -188 -68 89 73 -185 19 218 10 118 -190 114 -46 -61 8 74 40 43 -128 114
4417 114 223 -192 -49 -99 14 98 -115 -40 177 -61 21 99 -393 205 -107 -17 132 -43 -44 164 20 -106 192
$$ packed form
4253F6o4P0q2K30k22J07j8K02j33Rj11R3j16j9J63k34j0K28K5j84J32k80K05k01
4277a44K52k68K43j30P8j37K7j5L09P6m64K45M1m5P5o0l01J02J55k30j0Pk0j7
4301b31K03J83k94p5O2J77L9K25l88J75J35l41J50J80l35K76j30lj54J71R2Q4
4323B01j55R5k04J31j51J03J70k00l5L25l34P1q7k2J39M6m8J71j40J8j11K36l
4346B16l58L04J8j40j9M2q7k7O6j61l7J65j30K08j08L50l80O8M0j11q6K99Q8j01
4370A19j31m1k09K78K37n22J05K18p5m5J15po1l0R2j62K66j19j16J76k00l6J50
4393Bpk69J13jJ33j59J20J57j6k58K04J99k08J08l08L04j60j5O9O6l4Lj71K42
4417A14J09m15J43n0J13Q4k13P5K17k38Q2P8m92N98l12R0J49j75jK08j44j26K98
$$ plain form
4440 192 105 -71 56 -196 75 49 54 49 -101 -16 45 -131 -146 58 36 51 -4 139 -197 176 -57 204 -26 77
4464 77 145 172 -47 -41 50 1 134 -93 -33 12 72 -172 -9 -149 -63 49 70 99 -299 -85 230 79 61 -137 118
4489 118 358 53 90 141 -3 -29 136 -192 -179 -2 165 70 64 1 -59 58 19 -278 -96 -43 44 -83 -59 30 125
4514 125 -166 -163 71 156 -11 -135 -247 -244 -174 -93 -126 -30 -196 -51 114 -192 14 -19 -285 -92 -19 -199 74 85
4538 85 -81 -103 143 -140 128 -67 33 127 -92 -177 -253 83 268 -36 58 -35 133 263 75 -236 -38 46 141
4561 141 60 28 -25 -187 -145 178 168 -211 222 181 0 -214 37 2 93 9 -107 71 10 -23 -98 -100 -63 -76 -45 45
4587 45 -97 -45 80 37 -52 -35 -27 30 -98 -22 30 240 80 39 -21 -101 -90 -189 24 -64 -62 53 72 35 -108 271 -77
4614 -77 45 69 17 -99 74 -423 2 -99 -72 143 26 178 -55 59 -116 -207 110 45 -18 36 -22 -26 134 -86
$$ packed form
4440A92q7j76J27k52K71k6Nnj50Q5O1j76j5K04k2J5n5J43l36L73k33K61k30J03
4464G7O8K7k19OR1m9J33k27O0M5O0k44J63j40Q6J12K1K9l98K14L15j51j8j98K55
4489A18K40l05L7N1j44k6J65l28J3J77J67r5oo3o0J17l9k97J82N3Q7j27K4Q9R5
4514A25k91LK34Q5j67j24j12LP0Q1l3R6j66J45J65l06K06l3k66J93P3j80K73J1
4538H5j66k2K46k83K68j95J00R4k19q5p6L36J85l04R4r3J68J30j88l11J98Q4R5
4561A41q1l2n3j62M2L23j0l79M33m1j81k14K51l5R1q4j16J78o1l3p5kL7j3L1R0
4587D5j42N2J25m3q9J7QN7j28P6N2K10j60m1o0q0J1r9K13q8KJ15J9l7j43L79l48
4614g7J22K4n2j16J73m97M25j01K7K15j17J52k33J14j75r1L17o5o3N4n8mJ60k20
$$ plain form
4638 -86 -154 -14 -247 102 13 -136 55 219 88 48 -213 80 -97 153 -20 -116 210 73 -69 144 -16 -211
4660 -211 -62 311 -114 264 -167 114 51 -244 -47 -44 72 -13 60 -281 -294 -149 -170 -61 -249 -234 -143 18 60
4683 60 31 -41 -37 -147 -275 -190 79 -90 183 53 -138 -133 -246 263 -56 0 -96 -46 13 -142 -39 -24 65 -33 -65
4708 -65 -101 -188 -204 5 -78 -11 19 -95 72 -103 6 -18 -39 248 -120 -15 105 28 -89 -130 195 -233 -9 132
4732 132 54 208 246 -149 -16 -341 -16 -150 72 148 -17 -90 86 93 140 -89 152 -262 -122 -52 18 46 -6 -17
4756 -17 78 33 93 80 -57 96 90 -1 -198 165 214 -259 -60 162 49 74 70 -51 87 85 31 125 220 -165 -105 -57
4782 -57 -47 -74 45 -75 15 184 -51 183 32 214 136 110 51 57 -135 160 -23 147 -31 -90 -106 -170 -29 133
4806 133 268 -171 89 31 3 -9 46 -91 -45 9 80 -88 23 69 -136 88 156 -280 -118 -72 -5 151 64 -107
$$ packed form
4638h6o8J40k33L49q9j49J91J64j31m0k61K93j77K50j73r6L26j37j42K13j60j95
4660b11J49L73m25L78m31K81o3k95J97LJ16q5P3l41j3J45k1J09j88J5R1J61M2
4683F0k9p2Mj10j28Q5K69j69K73j30j91Nj13N09l19N6r6N0N9j55J03J5Q9r8l2
4708f5l6q7j6K09q3O7L0j14J67j75J09k4k1K87l68J05J20p7j17m1L25m28K24J41
4732A32p8J54L8l95J33l25L25j34K22P6j65p3J76PM7k29K41m14J40P0P0K8n2j1
4756a7R5m5O0j3j37J53or1j97L63M9m73J99K22j13K5mj21J38kn4R4R5l85O0M8
4782e7J0k7J19j20R0J69k35K34j51J82p8k6n9Oj92K95j83J70j78n9j6o4J41J62
4806A33J35m39K60n8k8j2N5j37M6N4P1j68J11M6k05K24O8m36J62M6O7J56q7j71
$$ plain form
4830 -107 -115 -191 -165 57 -50 -23 -75 -56 -178 -84 95 81 -45 29 -13 -154 106 -239 -104 0 -99 196 -40 -20
4854 -20 160 21 46 -33 -236 -33 -276 40 -140 -103 -55 -42 -114 179 -162 -97 40 62 48 -67 -72 185 -206 224
4878 224 -241 182 2 -92 -10 51 42 302 -35 141 -97 -51 -5 -345 -122 31 13 -72 -93 189 278 61 64 -44
4902 -44 -178 29 -56 -26 82 96 -116 -142 92 265 -137 -89 9 0 -12 66 80 5 70 73 39 -164 -200 16 -124 206
4928 206 75 -136 20 -280 124 -160 -195 -144 -68 51 -166 -88 76 78 -1 84 24 16 -60 -192 54 -36 -166 94
4952 94 -14 32 -2 168 67 -75 35 81 103 128 -46 -11 -60 -117 106 -25 21 148 -128 51 36 57 -158 -4
4976 -4 99 114 129 78 -11 166 -307 -109 -256 -172 -1 -113 57 -6 -358 -57 -92 21 21 -90 -26 -188 348 -88
5000 -88 72 241 54 110 33 -90 -148 -27 62 139 5 -23 174 157 -140 112 149 -45 101 91 101 -147 8 -115
$$ packed form
4830a07qp6K6K22j07K7n2J9j22R4J79j4j26P4m2j41K60l45J35J04r9K95k36K0
4854b0J80j39K5p9k03K03k43L16j80L7M8J3p2K93l41O5J37K2j4j15nK57l91M30
4878B24m65M23j80r4Q2O1rK60l37J76k38M6M6l40K23J53j8q5k1K82Q9k17Lj08
4902d4j34K07q5L0J08J4k12k6K34J73m02M8R8rj2P8J4p5O5Ll4k03l6K16j40L30
4928B06j31k11J56l00M04k84l5N1P6J19k17P8J64Kp9Q5o0qp6j32K46r0j30K60
4952I4j08M6l4J70j01j42J10M6K2K5j74L5m9n7K23j31M6J27k76J79j5K1k15J54
4976dJ03J5J5n1q9J77m73J98j47Q4J71j12J70o3l52L01l5J13%j11O4j62N36m36
5000h8J60J69j87N6p7j23n8J21Q9P7j34k8J97j7k97K52L7j94J46j0J0k48J55j23
$$ plain form
5024 -115 230 -146 170 -4 80 299 -31 67 221 -267 123 153 -157 89 -57 97 -22 157 -180 111 69
5045 69 -110 2 121 12 208 -158 -154 -106 149 -49 -66 -55 46 -25 71 -62 -83 -154 -154 -39 -13 -29 -176 -128 -55
5070 -55 102 -59 -253 116 5 189 -183 -215 75 -26 48 -198 -42 -119 -154 -42 61 -132 16 -183 -116 -111 11
5093 11 -39 -219 21 -36 -25 154 175 -9 8 78 19 -29 232 71 -14 13 6 -53 55 -52 33 122 -110 82 17 40
5119 40 136 -32 40 -5 113 -99 -70 105 -55 148 -34 175 28 319 -5 -97 -103 -53 -37 -8 -254 92 -5 204
5143 204 -169 -60 -151 188 132 -109 226 -41 213 -68 -42 19 -64 -35 59 14 99 -18 -93 88 -149 -56 -51 83
5167 83 13 -205 -156 49 -233 22 -18 154 223 25 -159 151 27 -49 157 157 92 10 8 24 -222 194 137 171 -124
5192 -124 238 105 13 -51 102 -77 -166 -252 103 -74 -77 -87 -50 116 -222 -8 100 -193 -153 86 -103 -201 69
$$ packed form
5024a15L45l76L16j74Q4K19l30R8J54m88L90L0l10K46j46J54j19J79l37K91m2
5045F9j79J12J19j09J96l66MM8K55j98j7J1J01p1R6j33k1p1%J15K6j6j47M8P3
5070e5J57j61j94L69j11J84l72l2K90j01P4k46J56p7l5J12J03j93J48j99O7NJ22
5093A1n0j80K40n7J1J79K1j84J7P0n9m8K61j61q5K7pn9J08j07Q5Q9k32J92o5K3
5119D0R6j68P2m5J18k12K9J75j60K03j82K09j47K91l24r2oN0J6K9k46L46r7K09
5143B04l73J09r1L39n6k41L35k67K54k81K6O1q3K9R4m5Q5j17p5J81k37R3NJ34
5167H3p0k18M9K05k82K55m0J72O9j98j84L10j24p6K06%o5q2kJ6k46M16n7L4k95
5192a24L62j33r2o4J53j79q9q6L55j77lj0L7J66l38K14J08k93M0K39j89r8K70
$$ plain form
5215 69 205 -31 57 -97 -56 48 -221 -222 84 38 -78 -227 -75 -68 -40 118 -19 -138 242 146 -21 101 5 81
5239 81 -213 -28 -45 -99 259 -29 -94 344 232 -35 85 -106 -75 -290 -35 175 -224 -101 102 100 65 52 90
5262 90 170 -82 126 -144 -77 58 258 127 118 -173 110 318 286 -66 -204 -2 -67 42 -108 2 -234 -50
5284 -50 174 12 -108 181 -38 29 85 -102 128 65 -129 -102 102 -118 -74 -54 24 -37 123 61 -186 -214 -207 -107
5308 -107 106 -63 -140 145 180 171 -98 -32 -152 -13 -39 6 133 66 206 -22 150 -75 46 132 214 -19 -283
5331 -283 -81 286 95 7 61 -75 56 -61 -35 -68 -46 82 78 16 104 -15 -14 60 -82 30 -32 73 8 124 -126
5356 -126 -46 -61 6 -120 37 53 -43 187 -57 -73 -150 -97 123 -22 177 -86 -142 -15 -9 57 -80 -228 65 198
5380 198 209 -129 -251 347 -72 184 51 -46 -48 49 129 -141 42 -83 -242 0 181 124 58 88 78 205 -204
$$ packed form
5215F9J36k36Q8j54M1J04k69jL06m6j16j49J52PK8J58j37j19L80r6j67J22r6P6
5239H1k94J85j7n4L58k88o5M38j12k67J20j91L1k15K55K10l99J23K03kl5j3L8
5262I0Q0k52K08k70O7J35K00j31rk91K83K08l2l52j38K02o5J09j50J10k36J84
5284e0K24j62j20K89k19O7N6j87K30o3j94K7K04k20M4K0P8o1J60o2k47k8PJ00
5308a07K13j69p7K85L5rk69O6j20J39k6M5J27o7J40k28J72k25J21Q6Q2k33k64
5331b83K02L67j91q8N4j36J31j17K6l3K2J28mo2Q8j19JP4j42J12o2J05o5J16k50
5356a26Q0j5O7j26J57J6r6K30k44j6p7N3K20j45J99k63n6J27OO6j37j48K93J33
5380A98J1l38j22N98m19K56j33r7kR7Q0k70J83j25j59K42J81n7o6L0j0J27m09
$$ plain form
5403 -204 -120 -26 73 63 88 138 -94 -43 -2 -11 -63 68 -61 30 82 59 182 88 -99 -20 27 210 259 -144 -45 59
5429 59 -69 -61 22 19 115 45 -93 -60 113 83 90 137 -112 36 -70 85 49 138 -177 23 -145 -293 135 38 -121
5454 -121 -85 20 -105 -34 -75 19 -93 -55 59 -169 53 23 -174 140 -314 54 266 141 168 109 -87 92 -152
5477 -152 56 56 -39 -158 69 -61 -278 -65 -15 -6 -135 111 286 -23 95 97 10 153 -78 62 -72 11 -111
5500 -111 98 -168 -29 -139 -284 55 -44 5 159 57 120 -43 27 99 26 -19 -179 197 -29 -124 -91 37 -218
5523 -218 55 28 -11 110 45 31 -67 131 161 -76 244 -6 -53 -40 56 -82 -26 51 -55 -18 -8 -90 -236 -80 -48
5548 -48 -140 -187 4 55 -141 -56 -44 180 -84 -32 127 -65 -77 112 -6 188 125 0 -143 80 375 152 6
5571 6 0 106 189 -160 -33 41 -37 116 18 -134 -106 -52 -28 -101 -49 166 -206 102 -8 116 53 -165 43 -41 109
$$ packed form
5403b04Q4R4R9j0K5N0k32N1M1rn2J31j29R1N2k3J23r4j87P9M7J83M9m03R9J04
5429E9j28QQ3lR6p0j38L3J73l0PM7k49J48j06J55l6Q9l15K00j68j48M28r7j59
5454a21L6J05j25P1m1R4j12L8J14k28K22l0j97L14m54L68K12j25K7n9j96J79k44
5477a52K08%r5j19K27j30k17K13N0Rj29K46J75l09J18Kq7J43k31J40j34Q3j22
5500a11K09k66J39j10j45L39r9M9J54j02O3j63P0P2p3m5j60L76k26r5L3J28k55
5523b18K73k7l9J21o5j4r8J98L0k37L20k50m7J3R6j38N6P7j06L7J0q2j46J56L2
5548d8r2m7J91N1j96Q5J2K24k64N2J59j92j2J89j18J94o3j25j43K23K95k23j46
5571FoJ06Q3l49J27P4p8J53r8j52K8N4K4p3N2K15l72L08j10J24o3k18K08q4J50
$$ plain form
5596 109 -44 168 -11 183 -61 70 78 -74 -135 17 -228 -65 202 -389 -87 -184 -24 66 22 213 -50 66
5618 66 -108 16 -13 -13 87 28 81 -114 201 -180 -141 -69 -69 -106 74 162 -190 -110 -30 -133 -33 116 -173 -123 -230
5643 -230 -71 -78 -15 81 -111 -16 163 136 116 76 -44 -97 120 47 43 62 -184 -88 -54 110 -35 125 236 -174 13
5668 13 16 -119 175 -161 -23 -173 -125 7 -42 163 88 -180 -130 -95 -70 -193 18 -226 -57 -41 27 58 -37 46 48
5693 48 34 268 6 85 82 170 -35 -58 30 110 4 -177 -56 -15 -31 -73 -73 128 49 -1 104 80 -15 47 17 -68 -43
5720 -43 4 -94 114 167 -105 -58 55 108 -4 -101 91 211 -8 131 67 -104 -54 -77 23 -107 -39 99 -233 184
5744 184 -230 -165 -186 -193 -132 199 -75 21 -118 -10 58 199 -104 -172 68 120 183 -180 86 -124 37 6 65 -208
5768 -208 -98 -57 64 -212 -83 -28 -56 -54 -35 -68 31 93 -67 75 24 192 47 170 223 20 -61 99 -111 69
$$ packed form
5596A09j53K12j79J94k44J31Qj52o1J52k45J63K67n91L02r7J60R0m4J91k63J16
5618F6j74J24k9%J00n9N3j95L15l81L9P2%l7J80Q8l52Q0Q0j03J00J49k89N0j07
5643b30J59pO3R6j92R5J79k7k0m0j20n3K17p3mJ9k46R6L4J64j45J60J11m10J87
5668A3Lj35K94l36J38j50M8J32m9K05p5k68N0L5K5j23K11k44J69J6O8L1r5Q3K
5693D8j4K34k62P9lQ8k05k3Q8Q0j06j81J21M1j6m2%K01p9n0J05k4r5O2l0q5K5
5720d3M7r8K08N3k72M7J13N3j12r7J92J20k19J39o4j71N0k3J00j30O8J38l32M17
5744A84m14O5k1pO1L31k74R6j39J08O8J41l03o8K40N2O3l63K66k10J61l1N9k73
5768b08J10M1J21k76J29N5k8KJ9l3R9O2j60J42n1J68j45J23N3k03q1J60k10J80
$$ plain form
5792 69 -4 -112 127 -344 -33 33 142 34 -47 -36 26 -92 25 192 -42 227 145 71 -45 51 128 -97 -164 -9
5816 -9 -15 -130 -128 -114 84 24 -145 -38 -25 264 114 -45 221 -6 176 -93 -66 121 -74 7 -4 63 -176 -265 -83
5841 -83 -120 57 -146 -16 -122 -94 -202 251 253 -166 -72 132 -17 105 75 84 -53 10 -165 -107 -56 -35 159 52
5865 52 -34 76 -32 70 90 19 77 76 75 139 -85 -117 116 -156 -117 228 71 -109 -132 43 54 -114 15 -64 47
5890 47 -174 -39 8 108 110 -136 27 -106 97 -18 89 384 64 -131 5 44 -25 230 -14 32 -77 184
5912 184 -82 54 -128 -256 29 12 71 72 152 -278 -118 -22 17 29 68 38 89 134 -109 -164 -141 28 -26 -129 55
5937 55 170 190 55 19 -90 -39 -153 -43 142 -54 71 8 -115 -156 74 109 -72 -136 -130 201 -73 -137 -128 152
5961 152 -33 113 -175 -181 190 -72 122 -29 51 7 -2 -176 -17 27 141 93 -45 -20 -85 -159 -160 199 -101 78
$$ packed form
5792F9p3j08K39m71L11O6J09j08q1J1O2j18J17J67k34K69q2p4j16R6P7k25o7J55
5816ioj15KJ4J98o0j69J07J3K89j50j59K66k27J82k69K7J87j95Q1j1O7k39q9J82
5841h3l7J77k03J30j06K8j08M53Km19R4K04j49J22l0Rj37O3j75N8N1K1J94j07
5865E2q6J10j08J02K0p1N8jjO4k24l2K33k72L9L45j57j80k3J75J1j68J29p9J11
5890D7k21J35M7J00Kk46J63j33K03j15J07K95l20j95J36L9o9K55k44M6j09K61
5912A84k66J36j82j28K85j7N9JQ0m30J60R6L9J2L9l0N1M5k43n5K3J69n4j03J84
5937E5J15K0j35l6j09N1j14J10J85j96J25o3j23m1K30L5j81o4OL31k74o4RK80
5961A52j85J46k88oL71k62J94j51Q0m4rj74J59M4J14m8j38K5o5p4jL59l00J79
$$ plain form
5985 78 -71 13 -129 -51 66 104 145 226 -122 67 -146 -83 103 106 43 -60 -115 28 -84 -122 -40 28 -197 -88 38
$$ packed form
5985G8j49Q4j42P8J17L8M1Q1l48J89k13O3J86Lo3j03n5J43j12l8Q2O8k25J09J26
$$ [...]
8191e3
##END NTUPLES=NMR FID
##END=
