##TITLE=1H_L1(3-06)
 CDCl3, 8 sc, 
 4.06.2021
##JCAMPDX= 6.0         $$ Bruker NMR JCAMP-DX V2.0
##DATA TYPE= NMR FID
##DATA CLASS= NTUPLES
##ORIGIN= UXNMR, Bruker Analytische Messtechnik GmbH
##OWNER= root
$$ XWIN-NMR		Version 3.5
$$ Fri Jun  4 11:20:22 2021 Russian Standard Time (UT+4h)  she@DPX200
##.OBSERVE FREQUENCY= 200.131506
##.OBSERVE NUCLEUS= ^1H
##.DELAY= (6, 6)
##.ACQUISITION MODE= SIMULTANEOUS
##.ACQUISITION SCHEME= undefined
##.AVERAGES= 8
##.DIGITISER RES= 18
##SPECTROMETER/DATA SYSTEM= spect
##.PULSE SEQUENCE= zg30
##.SOLVENT NAME= CDCl3
##.SHIFT REFERENCE= (INTERNAL, CDCl3, 0, 15.7039)
##AUDIT TRAIL= $$ (NUMBER, WHEN, WHO, WHERE, WHAT)
$$ ##TITLE= Audit trail, XWIN-NMR		Version 3.5
$$ ##JCAMPDX= 5.01
$$ ##ORIGIN= Bruker BioSpin GmbH
$$ ##OWNER= she
$$ F:/spectra/data/she/nmr/H-F/1/audita.txt
$$ ##AUDIT TRAIL=  $$ (NUMBER, WHEN, WHO, WHERE, WHAT)
(   1,<2021-06-04 11:19:23.96 +0400>,<she>,<DPX200>,
      <created by zg, POWCHK disabled, PULCHK disabled
       configuration hash MD5:
       00 E9 B6 7A A2 85 ED C7 34 08 36 98 17 FE 4E 26
       data hash MD5: 16K
       1C C0 55 C0 FE 51 CB 8C F8 2A 65 07 96 A3 C2 4A>)
$$ ##END=
$$ 
$$ hash MD5
$$ 00 C6 41 EF F2 CE C3 7B 22 BF 5B 6A 34 89 62 F5
##$RELAX= 
##$RELAX= 
##$RELAX= 
##$RELAX= 
##$RELAX= 
##$RELAX= 
$$ Bruker specific parameters
$$ --------------------------
##$DU= <F:/spectra>
##$EXPNO= 1
##$NAME= <H-F>
##$PROCNO= 1
##$TYPE= <nmr>
##$USER= <she>
##$AMP= (0..31)
100 100 100 100 100 100 100 100 100 100 100 100 100 100 100 100 100 100 
100 100 100 100 100 100 100 100 100 100 100 100 100 100 
##$AQSEQ= 0
##$AQ_mod= 1
##$AUNM= <au_zg>
##$AUTOPOS= <>
##$BF1= 200.13
##$BF2= 200.13
##$BF3= 200.13
##$BF4= 200.13
##$BF5= 200.13
##$BF6= 200.13
##$BF7= 200.13
##$BF8= 200.13
##$BYTORDA= 1
##$CFDGTYP= 0
##$CFRGTYP= 5
##$CHEMSTR= <none>
##$CNST= (0..31)
1 1 145 1 1 1 1 1 1 1 1 1 1 1 1 1 1 1 1 1 1 1 1 1 1 1 1 1 1 1 1 1 
##$CPDPRG= <>
##$CPDPRG1= <>
##$CPDPRG2= <>
##$CPDPRG3= <>
##$CPDPRG4= <mlev>
##$CPDPRG5= <mlev>
##$CPDPRG6= <mlev>
##$CPDPRG7= <mlev>
##$CPDPRG8= <mlev>
##$CPDPRGB= <>
##$CPDPRGT= <>
##$D= (0..31)
0 1.2 0 0 0 0 0 0 0 0.06 0 0.03 0 0 0 0 0.0002 0 0 0 0 0 0 0 0 0 0 0 0 
0 0 0 
##$DATE= 1622791163
##$DBL= (0..7)
120 120 120 120 120 120 120 120 
##$DBP= (0..7)
150 150 150 150 150 150 150 150 
##$DBP07= 0
##$DBPNAM0= <>
##$DBPNAM1= <>
##$DBPNAM2= <>
##$DBPNAM3= <>
##$DBPNAM4= <>
##$DBPNAM5= <>
##$DBPNAM6= <>
##$DBPNAM7= <>
##$DBPOAL= (0..7)
0.5 0.5 0.5 0.5 0.5 0.5 0.5 0.5 
##$DBPOFFS= (0..7)
0 0 0 0 0 0 0 0 
##$DE= 6
##$DECBNUC= <off>
##$DECIM= 32
##$DECNUC= <off>
##$DECSTAT= 4
##$DIGMOD= 1
##$DIGTYP= 9
##$DL= (0..7)
0 120 120 120 120 120 120 120 
##$DP= (0..7)
150 150 150 150 150 150 150 150 
##$DP07= 0
##$DPNAME0= <>
##$DPNAME1= <>
##$DPNAME2= <>
##$DPNAME3= <>
##$DPNAME4= <>
##$DPNAME5= <>
##$DPNAME6= <>
##$DPNAME7= <>
##$DPOAL= (0..7)
0.5 0.5 0.5 0.5 0.5 0.5 0.5 0.5 
##$DPOFFS= (0..7)
0 0 0 0 0 0 0 0 
##$DQDMODE= 0
##$DR= 18
##$DS= 0
##$DSLIST= <SSSSSSSSSSSSSSS>
$$ [...]
##$SUBNAM2= <"">
##$SUBNAM3= <"">
##$SUBNAM4= <"">
##$SUBNAM5= <"">
##$SUBNAM6= <"">
##$SUBNAM7= <"">
##$SUBNAM8= <"">
##$SUBNAM9= <"">
##$SW= 20.0188882624521
##$SWIBOX= (0..15)
0 0 2 0 0 0 0 0 0 0 0 0 0 0 0 0 
##$SW_h= 4006.41025641026
##$TD= 16384
##$TD0= 1
##$TE= 0
##$TE2= 300
##$TE3= 300
##$TEG= 300
##$TL= (0..7)
0 120 120 120 120 120 120 120 
##$TP= (0..7)
150 150 150 150 150 150 150 150 
##$TP07= 0
##$TPNAME0= <>
##$TPNAME1= <>
##$TPNAME2= <>
##$TPNAME3= <>
##$TPNAME4= <>
##$TPNAME5= <>
##$TPNAME6= <>
##$TPNAME7= <>
##$TPOAL= (0..7)
0.5 0.5 0.5 0.5 0.5 0.5 0.5 0.5 
##$TPOFFS= (0..7)
0 0 0 0 0 0 0 0 
##$TUNHIN= 0
##$TUNHOUT= 0
##$TUNXOUT= 0
##$USERA1= <user>
##$USERA2= <user>
##$USERA3= <user>
##$USERA4= <user>
##$USERA5= <user>
##$V9= 5
##$VALIST= <valist>
##$VCLIST= <CCCCCCCCCCCCCCC>
##$VD= 0
##$VDLIST= <DDDDDDDDDDDDDDD>
##$VPLIST= <PPPPPPPPPPPPPPP>
##$VTLIST= <TTTTTTTTTTTTTTT>
##$WBST= 1024
##$WBSW= 4
##$XGAIN= (0..3)
0 0 0 0 
##$XL= 0
##$YL= 0
##$YMAX_a= 200738
##$YMIN_a= -140631
##$ZGOPTNS= <>
##$ZL1= 120
##$ZL2= 120
##$ZL3= 120
##$ZL4= 120
##$ABSF1= 10
##$ABSF2= 0
##$ABSG= 5
##$ABSL= 3
##$ALPHA= 0
##$AQORDER= 0
##$ASSFAC= 0
##$ASSFACI= 0
##$ASSFACX= 0
##$ASSWID= 0
##$AUNMP= <proc_1d>
##$AZFE= 0.1
##$AZFW= 0.1
##$BCFW= 1
##$BC_mod= 2
##$BYTORDP= 1
##$COROFFS= 0
##$CY= 11.3945322036743
##$DATMOD= 1
##$DC= 2
##$DFILT= <>
##$DTYPP= 0
##$F1P= 15.9154993809931
##$F2P= -4.1035820241983
##$FCOR= 0.5
##$FTSIZE= 0
##$FT_mod= 4
##$GAMMA= 1
##$GB= 0.15
##$INTBC= 1
##$INTSCL= 1
##$ISEN= 128
##$LB= 0.24
##$LEV0= 0
##$LPBIN= 0
##$MAXI= 10000
##$MC2= 0
##$MEAN= 0
##$ME_mod= 0
##$MI= 1.114404
##$NCOEF= 0
##$NC_proc= 0
##$NLEV= 6
##$NOISF1= 3.799351
##$NOISF2= 2.8
##$NSP= 1
##$NTH_PI= 0
##$NZP= 0
##$OFFSET= 15.70392
##$PC= 1
##$PHC0= -11126.76
##$PHC1= 20.60099
##$PH_mod= 1
##$PKNL= yes
##$PPARMOD= 0
##$PSCAL= 0
##$PSIGN= 0
##$REVERSE= no
##$SF= 200.130013532006
##$SI= 16384
##$SIGF1= 3
##$SIGF2= 2
##$SINO= 400
##$SIOLD= 16384
##$SREGLST= <1H.CDCl3>
##$SSB= 0
##$STSI= 0
##$STSR= 0
##$SW_p= 3612.71676300578
##$SYMM= 0
##$S_DEV= 0
##$TDeff= 0
##$TDoff= 0
##$TI= <>
##$TILT= no
##$TM1= 0
##$TM2= 0
##$TOPLEV= 0
##$USERP1= <user>
##$USERP2= <user>
##$USERP3= <user>
##$USERP4= <user>
##$USERP5= <user>
##$WDW= 1
##$XDIM= 8192
##$YMAX_p= 0
##$YMIN_p= 0
$$ End of Bruker specific parameters
$$ ---------------------------------
##NTUPLES= NMR FID
##VAR_NAME=  TIME,          FID/REAL,        FID/IMAG
##SYMBOL=    X,             R,               I
##VAR_TYPE=  INDEPENDENT,   DEPENDENT,       DEPENDENT
##VAR_FORM=  AFFN,          ASDF,            ASDF
##VAR_DIM=   8192,          8192,            8192
##UNITS=     SECONDS,       ARBITRARY UNITS, ARBITRARY UNITS
##FACTOR=    0.0002496,     1,               1
##FIRST=     0,             0,               0
##LAST=      2.0444736,     0,               0
##MIN=       0,             -140631,         0
##MAX=       2.0444736,     200738,          0
$$ Real data points
##PAGE= N=1
##DATA TABLE= (X++(R..R)), XYDATA
$$ plain form
0 0 0 0 0 0 0 0 0 0 0 0 0 0 -8 8 -8 8 -8 16 -16 16 -24 28 -32 40 -48 56 -64 72 -80 96 -105 120 -136 154
34 154 -176 197 -221 248 -275 307 -341 379 -420 466 -515 568 -625 690 -760 836 -923 1018
52 1018 -1123 1236 -1370 1518 -1685 1884 -2112 2384 -2717 3124 -3647 4340 -5305 6741 -9096
67 -9096 13622 -25332 116120 200738 -140631 -1162 130025 -92121 -95939 105420 18665
78 18665 -58884 17028 6347 -48719 4114 57130 43281 -12325 -12044 9136 -24517 -7913 59119
91 59119 5388 -23126 38429 -27798 -77952 47306 40730 -65015 4247 54715 -11788 10766
103 10766 37841 -2257 1325 -14835 -47690 -6638 3442 -13657 13409 -8899 -21397 43386
115 43386 22704 -15570 32498 -11655 -68185 10436 8548 -38298 47423 37607 -74812 -24764
$$ packed form
0@%%%%%%%%%%%%qJ6j6J6j6K4l2L2m0N2o0P2q8J04j20J36j52J76k01K25k56K90
34A54l30L73m18M69n23N82o48P20p99Q86r81J083j193J315j450J596j759J941
52A018k141K359k606K888l203L569l996M496n101N841o771P987r645J2046j5837
67i096K2718l8954J41452Q4618l41369J39469J31187k22146l818K01359q6755
78A8665p7549P5912j0681n5066N2833N3016j3849n5606K81K1180l3653J6604O7032
91E9119n3731k8514O1555o6227n0154J25258o576j05745O9262N0468o6503K2554
103A0766K7075m0098L582j6160l2855M1052J0080j7099K7066k2308j2498O4783
115D3386k0682l8274M8068m4153n6530P8621j888m6846Q5721r816j12419N0048
$$ plain form
127 -24764 26020 -30693 7805 47637 -9835 -9786 3792 -26995 6135 34449 -4777 -19667 -31929
140 -31929 -38647 2722 8056 6076 51706 19581 -31204 8954 138 -34870 23963 17606 -48510
153 -48510 -4178 19762 -22320 14643 35504 -8637 6347 8474 -26177 7202 23097 -9430
165 -9430 11387 10567 -18144 10859 381 -35529 11768 19346 -24889 22379 43856 -8137 8277
178 8277 16838 -28174 -5250 14825 -22913 -3657 7911 -20475 8348 27627 667 21759
190 21759 23098 -25402 -16594 -526 -13391 12926 12571 -15055 7881 -2469 -32952 12166 21659
203 21659 -19281 11213 16927 -28358 2833 24894 -14381 551 7970 -33478 -18735 -1142
215 -1142 -18166 12697 25247 -5455 14088 14952 -24048 -4059 4435 -27189 -1059 8606 -25182
$$ packed form
127b4764N0784n6713L8498L9832n7472M9J3578l0787L3130K8314l9226j4890j2262
140c1929o718M1369N334j980M5630l2125n0785M0158q816l5008N8833o357o6116
153d8510M4332K3940m2082L6963K0861m4141J4984K127l4651L3379J5895l2527
165i430K0817q20k8711K9003j0478l5910M7297P578m4235M7268K1477n1993J6414
178H277Q561m5012K2924K0075l7738J9256J1568k8386K8823J9279k6960K1092
190B1759J339m8500Q808J6068j2865K6317l55k7626K2936j0350l0483M5118R493
203B1659m0940L0494N714m5285L1191K2061l9275J4932P419m1448J4743J7593
215a142j7024L0863J2550l0702J9543Q64l9000J9989Q494l1624K6130R665l3788
$$ plain form
228 -25182 1932 15060 -18283 10270 24876 -16951 147 16198 -25142 -9250 20875 -4715
240 -4715 1986 13223 -17062 -12811 -3208 -14321 13529 21611 -4964 15725 17511 -19700 3111
253 3111 18127 -17633 -5311 4485 -25688 -3633 19910 1094 19673 26261 -10419 148 8516
266 8516 -19179 931 14823 -13634 2963 13408 -17140 2363 16114 -15034 3440 20112
278 20112 -12417 2377 22300 -9226 -4155 12515 -10594 -5606 1677 -20707 -7186 4963 -8151
291 -8151 18944 26881 -8413 5107 9886 -31625 -13246 15570 -13963 -8643 9706 -15334 -7523
304 -7523 12835 -1199 12108 14325 -22913 -10202 9197 -17369 192 26113 -8369 -17931 -1289
317 -1289 -15879 -9444 9068 2272 11892 9661 -14630 6175 17850 -12942 -2837 8177 -23366
$$ packed form
228b5182K7114J3128l3343K8553J4606m1827J7098J6051m1340J5892L0125k5590
240d715O701J1237l0285M251R603j1113K7850Q082k6575K0689J786l7211K2811
253C111J5016l5760J2322R796l0173K2055K3543j8816J8579O588l6680J0567Q368
266H516k7695K0110J3892k8457J6597J0445l0548J9503J3751l1148J8474J6672
278B0112l2529J4794J9923l1526N071J6670k3109M988P283k2384J3521J2149j3114
291h151K7095P937l5294J3520M779m1511J8379K8816k9533N320J8349k5040P811
304g523K0358j4034J3307K217l7238J2711J9399k6566J7561K5921l4482r562J6642
317a289j4590O435J8512o796R620k231k4291K0805J1675l0792J0105J1014l1543
$$ plain form
330 -23366 -14615 5305 -9677 9193 22654 -6155 7525 21192 -16300 -6808 18086 -13075
342 -13075 -14291 13556 521 -1539 7883 -7475 1462 8164 -12043 10255 26755 -11800 -6022
355 -6022 22675 -5612 -11528 15531 -575 -15006 -6100 -10168 2724 17342 6821 16240 17465
368 17465 -15188 -10233 8291 -9130 -3111 8352 -13321 -6899 6352 -9373 8906 24804 -8885
381 -8885 -7435 10205 -16886 -9737 20108 -471 -7120 6998 -13883 -13781 5905 -8979 -4918
394 -4918 14853 -2843 -4295 14331 998 -3629 3309 -10704 -8933 -3401 -16116 -698 10390
407 10390 -12379 4164 23034 -7279 -2825 17745 -16223 -19201 13103 -3955 -10785 15634 529
420 529 -14912 3702 8 -4443 9678 5697 846 1872 -5052 3584 12392 -4387 -1280 3717
$$ packed form
330b3366Q751J9920j4982J8870J3461k8809J3680J3667l7492R492K4894l1161
342a3075j216K7847j3035k060R422j5358Q937O702k0207K2298J6500l8555N778
355f022K8697k8287n916K7059j6106j4431Q906m068J2892J4618j0521R419J225
368A7465l2653M955J8524j7421O019J1463k1673O422J3251j5725J8279J5898l3689
381h885J450J7640k7091P149K9845k0579o649J4118k0881J02J9686j4884M061
394d918J9771j7696j452J8626j3333m627O938j4013J771N532j2715J5418J1088
407A0390k2769J6543J8870l0313M454K0570l3968k978L2304j7058o830K6419j5105
420E29j5441J8614l694m451J4121l981m851J026o924Q636Q808j6779L107M997
$$ plain form
434 3717 -20400 -10446 12416 -973 7621 24645 -608 -4481 12532 -7740 -7712 14307 -7263
447 -7263 -13914 9310 -2072 -5662 17785 6549 -3952 8052 -2790 -6591 6986 -1813 -1297
460 -1297 9462 -4255 -5086 5989 -9426 -7522 6968 -6793 -2865 16732 1320 -1528 11746
473 11746 -5628 -12401 4685 -6413 -12192 1185 -7069 -5558 9566 2352 5478 13301 -8124
486 -8124 -11049 2612 -13484 -7651 15416 -4152 -11719 7941 -6539 -11247 11371 3155 -5848
499 -5848 6645 -2750 -6748 9911 1778 -3227 8844 -7755 -16223 198 -4047 -3827 13680 5106
513 5106 -990 11196 -221 -4209 7468 -6447 -11337 5812 -3680 -8204 9996 5676 -2141 7883
527 7883 2915 -1519 6203 -3517 -3533 7713 -4428 -1399 13160 -2485 -8583 5457 -4909 -7107
$$ packed form
434C717k4117R954K2862j3389Q594J7024k5253l873J7013k0272K8K2019k1570
447g263o651K3224j1382l590K3447j1236j0501J2004j0842l801J3577q799N16
460a297J0759j3717q31J1075j5415J904J4490j3761L928J9597j5412k848J3274
473A1746j7374o773J7086j1098n779J3377q254J511J5124p214L126P823k1425
486h124k925J3661j6096N833K3067j9568p567J9660j4480m708K2618q216r003
499e848J2493r395l998J6659q133n005J2071j6599q468J6421m245K20J7507q574
513E106o096J2186j1417l988J1677j3915m890J7149r492m524J8200m320p817J0024
527G883m968m434P722r720j6J1246j2141L029J4559j5645o098J4040j0366k198
$$ plain form
541 -7107 11452 5545 868 13145 68 -5413 8572 -4108 -9170 6284 -6551 -14096 4810
554 4810 3427 1436 14871 5519 -4045 3398 -7604 -10213 8431 -2676 -10603 7582 341 -12831
568 -12831 4393 4752 -6843 2069 378 -4752 3214 873 -1441 7007 -3470 -10484 3154 -5769
582 -5769 -13570 3555 987 -4273 8818 6096 -2019 7433 -4707 -9787 3510 -4875 -10573 7006
596 7006 836 -7175 6233 5051 -2267 8084 1288 -5567 3614 -4352 -5426 10750 1504 -6722
610 -6722 7048 -3282 -10937 4249 3647 -87 10860 2378 -2942 9509 2346 -6262 8690 -2851
624 -2851 -15513 1707 1174 -6294 8637 11402 839 5982 1065 -2276 3605 -3987 -6058 5052
638 5052 -1779 -6810 7320 2780 -5918 7058 -1076 -6943 8362 1860 -6352 7607 1908 -9149
$$ packed form
541g107J8559n907m677J2277j3077n481J3985j2680n062J5454j2835p545J8906
554D810j383j991J3435r352r564P443j1002k609J8644j1107p927J8185p241j3172
568a2831J7224L59j1595Q912j691n130P966k341k314Q448j0477p014J3638q923
582e769p801J7125k568n260J3091k722q115R452j2140n080J3297q385n698J7579
596G006o170q011J3408j182p318J0351o796o855R181p966j074J6176r246q226
610f722J3770j0330p655J5186o02l734J0947q482n320J2451p163q608J4952j1541
624b851j2662J7220n33p468J4931K765j0563N143m917l341N881p592k071J1110
638E052o831n031J4130m540q698J2976q134n867J5305o502q212J3959n699j1057
$$ plain form
652 -9149 6128 958 -12994 172 1547 -12114 308 8869 2632 5684 1635 -5110 -305 -5663
666 -5663 -8356 2007 -3198 -8030 3168 -1850 -4654 10678 3612 -6859 3813 -1735 -10176 3389
680 3389 3859 -4096 6310 -431 -11342 1147 2599 -5479 3879 3311 -3976 5888 3934 -3659 6431
695 6431 3594 -8856 -3242 -2821 -6137 4333 3560 -980 8148 5010 -1723 6086 738 -6010 3573
710 3573 -3052 -8422 7467 3589 -4786 6547 2206 -7120 5891 4015 -6365 7507 6340 -8375
724 -8375 3476 6794 -5063 1416 588 -10772 -755 3596 -2451 5828 8648 696 2098 -1125
738 -1125 -6415 1385 161 -6631 -281 -2080 -5077 5340 3503 -2718 6904 1093 -10240 614
752 614 688 -5813 4247 1759 -8056 2244 -78 -10111 2676 4161 -6288 680 3361 -2616 4291
$$ packed form
652i149J5277n170j3952J3166J375j3661J2422Q561o237L052m049o745M805n358
666e663k693J0363n205m832J1198n018k804J5332p066j0471J0672n548q441J3565
680C389M70p955J0406o741j0911J2489J452q078R358n68p287R864j954p593J0090
695F431k837j2450N614M21l316J0470p73m540R128l138o733P809n348o748R583
710C573o625n370J5889l878q375J1333m341r326J3011j876j0380J3872j167j4715
724h375J1851L318j1857O479q28j1360J0017M351o047Q279K820p952J402l223
738a125n290P800j224o792O350j799k997J0417j837o221R622n811j1333J0854
752F14P4o501J0060k488r815J0300k322j0033J2787J485j0449O968K681n977O907
$$ plain form
767 4291 4124 -5238 74 -2478 -8551 -681 -589 -5606 7119 4948 -5576 5765 6687 -5321 375
782 375 456 -7683 567 2522 -4979 3838 5576 -5083 1483 4346 -4058 2173 4566 -2964 1127 3874
798 3874 -1544 2564 910 -3981 1780 -2402 -7187 6069 6654 -2020 6577 6194 -4214 2283 2061
813 2061 -7356 1117 1828 -7402 943 5127 -2721 5035 7052 -3903 -7 2703 -4774 -603 2582
828 2582 -2286 2008 733 -5343 1435 734 -6275 2526 3453 -5545 2634 4768 -3868 2508 2941 -7770
844 -7770 -2415 -236 -8379 -762 3609 -3921 2722 6405 -3135 -15 3033 -4502 -2509 -1474 -5353
859 -5353 95 1152 -3628 3404 2574 -5124 2586 2790 -5262 2338 4331 -4447 2002 3868 -5355 150
875 150 2733 -6725 -1074 3613 -3745 2623 8309 -59 1369 4077 -2870 -1211 773 -4252 276
$$ packed form
767D291j67r362N312k552o073P870R2n017J2725k171j0524J1341R22j2008N696
782C75Q1q139Q250J955p501Q817J738j0659O566K863q404O231K393p530M091K747
798C874n418M108j654m891N761m182m785J3256N85q674Q597l83j0408O497k22
813B061r417Q473P11r230Q345M184p848P756K017j0955L896K710p477M171L185
828B582m868M294j275o076O778p01p009Q801R27q998Q179K134q636O376M33j0711
844g770N355K179q143P617M371p530O643L683r540L120L048p535J993J035l879
859e353N448J057m780P032q30p698P710K04q052P600J993q778O449J866r223N505
875A50K583r458N651M687p358O368N686q368J428K708o947J659J984n025M528
$$ plain form
890 276 1523 -3592 3104 5080 -1721 4404 5504 -4090 17 2765 -3910 1622 4281 -3334 1085
905 1085 2558 -5053 565 3953 -3393 933 5129 -1738 983 4396 -1663 130 -121 -6328 -1990
920 -1990 279 -4328 2521 4524 -2651 2601 4459 -4074 -253 2059 -5978 -2035 1090 -5511 -353
935 -353 4334 -3203 -555 3355 -3782 -1490 2698 -2245 -299 2087 -2776 -92 772 -4562 -744 424
951 424 -5138 -287 3163 -1900 3566 5332 -2887 280 1906 -5650 -1171 2407 -4746 -1105 4126
966 4126 -1823 1306 5461 -626 904 2755 -3343 -593 2880 -1849 1263 3200 -2849 77 2681
981 2681 -2622 1109 4157 -2431 1604 5113 -1721 1353 5021 -3689 -2464 2151 -4263 -2414 4070
996 4070 90 1150 4462 -29 820 3058 -2121 -1941 807 -3043 -1050 1793 -1548 970 2549 -2632
$$ packed form
890B76J247n115O696J976o801O125J100r594M107K748o675N532K659p615M419
905A085J473p611N618L388p346M326M196o867K721L413o059J793k51o207M338
920a990K269m607O849K003p175N252J858q533L821K312q037L943L125o601N158
935c53M687p537K648L910p137K292M188m943J946K386m863K684Q64n334L818J168
951D24n562M851L450n063N466J766q219L167J626p556M479L578p153L641N231
966D126n949L129M155o087J530J851o098K750L473m729L112J937o049K926K604
981B681n303L731L048o588M035L509o834L074L668q710J225M615o414J849O484
996D070l980J060L312m491Q49K238n179J80K748l850J993K843l341K518J579n181
$$ plain form
1012 -2632 -79 1608 -3140 795 2965 -3324 -363 2758 -3460 -1253 1030 -4388 -1710 1225 -3884
1027 -3884 739 4495 -1947 831 3958 -3672 -2790 1738 -4523 -3136 1552 -2847 -1429 3958 263
1042 263 276 2752 -1984 -1504 1498 -2360 -1255 2399 -1206 18 1473 -2901 324 2486 -2817 225
1058 225 4413 -1706 836 5195 -1068 -1454 2871 -2756 -3175 2177 -780 -652 3535 1574 1040 3544
1074 3544 133 -34 1809 -1974 -1339 753 -1860 975 3045 -1824 967 3900 -2318 -857 3324
1089 3324 -1952 -747 4078 -1015 -1609 2730 -1097 -2595 501 -1931 -1308 1821 -564 1159 2937
1104 2937 -1115 -65 1618 -3461 -1744 379 -3992 -1242 2828 -2015 -730 4106 -1086 -1820 2109
1119 2109 -2026 -2668 1936 -1420 -2343 1464 -1036 -1221 979 -1834 -1266 1632 -1561 -684 3054 -746
$$ packed form
1012b632K553J687m748L935K170o289K961L121o218K207K283n418K678K935n109
1027c884M623L756o442K778L127p630Q82M528o261J387M688m399J418N387l695
1042B63J3K476m736M80L002l858J105L654l605J224J455m374L225K162n303L042
1058B25M188o119K542M359o263l86M325n627m19N352k957J28M187j961n34K504
1074C544l411j67J843l783O35K092k613K835K070m869K791K933o218J461M181
1089C324n276J205M825n093n94M339l827j498L096k432O23L129k385J723J778
1104B937m052J050J683n079J717K123m371K750M070m843J285M836n192p34L929
1119B109m135o42M604l356r23L807k500j85K200k813N68K898l193Q77L738l800
$$ plain form
1135 -746 -244 2904 -1806 -2452 1302 -2273 -2419 1542 -77 87 3546 993 803 2361 -1279 -1039 1460
1152 1460 -1857 -960 2207 -846 345 3769 -601 -774 3176 -456 -1142 2798 -25 -481 3192 9
1168 9 -1394 1459 -749 -1425 979 -866 81 2775 304 1036 3055 -1120 -1163 1301 -2771 -2371 1383
1185 1383 -1371 -560 3119 -164 -398 2689 -1181 -1762 1292 -1739 -2047 1970 -937 -2083 1806 -690
1201 -690 -2406 1141 -899 -1779 1381 -470 -602 1549 -916 -1205 866 -2014 -2282 400 -1896 -1484
1217 -1484 2176 -404 -731 3203 79 -2141 1003 -884 -3000 456 -108 -1355 1005 731 221 1235
1233 1235 -527 105 1443 -1435 25 2443 -1032 -321 2975 -1298 -1684 1707 -491 -1374 2215 980
1249 980 -266 2754 1638 -237 1296 6 -1293 33 -1299 -362 1949 -236 627 3353 -232 -644
$$ packed form
1135g46N02L148m710o46L754l575j46L961j619J64L459k553j90J558l640K40K499
1152A460l317Q97L167l053J191L424m370j73L950l632o86L940k823m56L673l183
1168Ij403K853k208o76K404j845R47K694k471P32K019m175m3K464m072M00L754
1185A383k754Q11L679l283k34L087l870n81L054l031l08M017k907j146L889k496
1201f90j716L547k040q80L160j851j32K151k465k89K071k880k68K682k296M12
1217a484L660k580l27L934l124k220L144j887k116L456n64j247K360k74n10J014
1233A235j762O32J338k878J460K418l475P11L296m273l86L391k198q83L589j235
1249I80j246L020j116j875J533j290j299J326j332R37K311k185Q63K726l585m12
$$ plain form
1265 -644 2908 -713 -2589 1779 182 -1837 1490 816 -1465 905 2 -990 468 -626 -347 1656
1281 1656 -224 -281 1043 -1289 -1352 641 -2119 -2513 1314 -894 -1541 2543 427 -1387 1532 208
1297 208 -2759 -330 -817 -1868 150 -876 -401 746 37 -746 911 -673 -1163 1013 -390 -916 1389
1314 1389 -725 -1276 915 -319 -1491 699 65 -924 2007 485 -62 2099 389 -1017 959 -671
1330 -671 -1859 840 -66 -859 2305 1530 -718 2010 507 -1057 1498 513 -704 800 418 -591
1346 -591 1629 634 -868 931 -27 -344 1118 360 -192 1962 392 -686 982 -500 -1478 823 -324
1363 -324 -1426 1558 804 -520 1602 65 -1137 576 -418 -2068 12 -284 -985 465 173 -728 793
1380 793 -592 -1057 1047 -669 -1951 1274 109 -1388 622 266 -1585 293 -259 -2228 -106 283
$$ packed form
1265f44L552l621j876M368j597k019L327o74k281K370r03r92J458j094K79K003
1281A656j880n7J324k332o3J993k760l94L827k208o47M084k116j814K919j324
1297B08k967K429m87j051K018j026M75J147p09p83J657j584m90K176j403n26K305
1314A389k114n51K191j234j172K190o34r89K931j522n47K161j710j406J976j630
1330f71j188K699r06p93L164p75k248K728j503j564K555r85j217J504l82j009
1346e91K220r95j502J799r58l17J462p58n52K154j570j078J668j482r78K301j147
1363c24j102K984p54j324K122j537j202J713r94j650K080k96p01J450k92r01J521
1380G93j385m65K104j716j282L225j165j497K010l56j851J878n52j969K122L89
$$ plain form
1396 283 -577 704 339 -1682 256 78 -1467 -536 -566 -912 319 -107 -70 1536 566 -911 1185 -87
1414 -87 -1366 1205 571 -1207 1139 609 -538 1271 359 -1014 1066 193 -867 1663 1103 -941 1397
1431 1397 1196 -1024 209 337 -1119 770 611 -538 1284 1438 -143 970 613 -984 15 194 -870
1448 -870 364 -204 -271 1102 329 -753 1034 117 -1633 829 53 -1409 849 489 -1154 307 -133
1465 -133 -1978 185 333 -1836 454 652 -681 143 463 -980 52 -318 -1571 -380 -607 -1028 974
1482 974 318 -824 534 220 -1421 307 -223 -1788 64 526 -1112 597 1031 -904 164 382 -1224
1499 -1224 -132 689 8 626 497 -344 767 65 -840 808 113 -947 763 717 -344 1226 1167 -537
1517 -537 634 446 -1179 554 1002 -790 756 1319 -503 860 1344 -223 534 718 -405 596 678
$$ packed form
1396B83q60J281l65k021J938j78j545R31l0l46J231m26L7J606r70j477K096j272
1414h7j279K571o34j778K346n30j147J809r12j373K080q73j060K530n60k044K338
1431A397k01k220J233J28j456J889j59j149J822J54j581J113l57j597R99J79j064
1448h70J234n68o7J373p73j082J787r17j750K462p76j462K258l60j643J461m40
1465a33j845K163J48k169K290J98j333Q24L20j443J032l70j253J191k27m21K002
1482I74o56j142J358l14j641J728n30j565J852M62j638J709M34j935J068K18j606
1499a224J092Q21o81O18j29q41J111p02r05J648o95j060J710m6j061J570n9j704
1517e37J171j88j625J733M48j792J546N63j822J363M84j567P57J84j123J001Q2
$$ plain form
1534 678 -616 791 983 -1084 179 545 -904 64 572 -212 659 379 -437 748 444 -1506 -328
1551 -328 160 -1404 -135 614 -432 170 133 -862 -453 -50 -965 34 -324 -1403 -28 361 -588 -288 343
1570 343 -800 -354 -369 -1040 47 368 -638 53 265 -1057 -42 628 -658 -212 187 -656 273 340 -39
1589 -39 777 448 -1083 283 448 -1116 445 1064 -499 200 609 -228 538 945 -330 386 475 -780
1607 -780 628 942 -372 615 880 -899 335 706 -373 565 1045 -563 321 1431 -239 209 875
1624 875 -692 -491 574 -150 198 743 233 201 31 -709 308 335 -644 51 -14 -1082 87 973 -266
1643 -266 110 373 -1100 -311 167 -707 331 648 -928 -539 237 -861 28 394 -763 -369 13 -646
1661 -646 -17 1108 -916 314 -135 -1240 -253 -19 -773 -175 569 -515 -508 648 282 133 183 -535 -252
$$ packed form
1534F78j294J407J92k067J263L66j449R68N08p84Q71k80q16J185l04j950J178
1551c28M88j564J269P49j046O02l7r95M09M03r15R99l58j079J375L89r49L00O31
1570C43j143M46j5o71J087L21j006O91K12j322J015O70j286M46L99q43R29O7l79
1589c9Q16l29j531J366J65j564J561O19j563O99M09q37P66M07j275P16Q9j255
1607g80J408L14j314R87K65j779J234L71j079R38M80j608Q84J110j670M48O66
1624H75j567K01J065p24L48N45n10l2j70p40J017K7r79O95o5j068J169Q86j239
1643b66L76K63j473P89M78q74J038L17j576L89P76j098Q89L66j157L94L82o59
1661f46O29J125k024J230m49j105R87K34p54N98P44j084PJ156l66j49N0p18K83
$$ plain form
1680 -252 50 270 768 393 -731 -141 577 -747 513 561 235 543 396 -844 516 839 -93 360 212
1699 212 -1292 -398 389 152 213 9 107 383 -439 -40 31 1442 -709 -868 850 505 424 244 479 -148
1719 -148 0 -776 663 -437 -508 809 378 -685 550 588 -431 265 58 -1091 -219 711 -452 342
1737 342 1366 -1214 -367 278 -62 -1031 99 -65 -363 -714 -240 -44 -376 -422 303 -125 -408 507 392
1756 392 -1068 22 324 -1202 -285 961 -544 -809 535 -707 -462 546 -85 -602 444 -428 -49
1773 -49 -299 253 -215 32 456 243 618 -20 128 1031 -23 -143 316 -374 362 1418 19 528 130
1792 130 -348 -273 372 353 736 573 80 370 -118 -823 -100 1092 -1023 -345 1141 16 -634 995 -473
1811 -473 464 224 -796 -106 507 -490 -100 -107 -583 -223 -88 -534 -208 824 758 -525 -30 -640 -427 358
$$ packed form
1680b52L02K20M98l75j124N90P18j324J260M8l26L08j47j240J360L23r32M53j48
1699B12j504Q94P87k37O1k04R8K76q22L99P1J411k151j59J718l45q1j80K35o27
1719a48J48p76J439j100p1J317m31j063J235L8j019O96k07j149Q72R30j163P94
1737C42J024k580Q47O45l40r69J130j64k98l51M74J96l32m6P25m28k83R15j15
1756C92j460J090L02j526R17J246j505k65J344j242K45J008o31n17J046q72L79
1773d9k50N52m68K47M24k13L75o38J48R03j054j20M59o90P36J056j399N09l98
1792A30m78P5O45j9L83j63m93K90m88p05P23J192k115O78J486j125o50J629j468
1811d73R37k40j020O90O13r97L90pm76L60J35m46L26J032o6j283M95o10K13P85
$$ plain form
1831 358 -85 -604 -304 -826 -288 -112 -298 -835 476 -195 -65 74 -857 -344 -46 -453 -64 544 -736
1850 -736 -35 260 -561 -282 400 35 49 586 -316 -481 207 -138 -250 681 -101 -286 674 -47 -726 536
1870 536 509 -46 120 231 -74 308 385 359 834 119 94 542 15 170 168 185 335 221 -163 363 862 -165
1892 -165 265 528 -330 -678 512 421 4 28 42 146 120 115 307 498 -322 -174 403 -409 -625 155 22 -240
1914 -240 -12 -387 -31 127 -304 -546 156 -525 -311 291 69 -671 -371 -162 -262 -595 -403 -36 -61 -580
1934 -580 -158 244 -110 -202 40 -532 -617 175 -64 -11 433 -11 -6 -44 -254 81 669 75 181 -81 -208 -524
1956 -524 312 -120 -330 514 70 106 278 -156 -139 1355 -53 -663 65 286 267 427 -45 -81 -189 24 83
1977 83 257 268 -563 -552 516 17 -124 -128 -463 -138 84 312 283 237 -243 345 -163 23 487 683 -845 156
$$ packed form
1831C58m43n19L00n22N38J76j86n37J311o71J30J39r31N13K98m07L89O08j280
1850g36P01K95q21K79O82l65J4N37r02j65O88l45j12R31p82j85R60p21o79J262
1870E36k7n55J66J11l05L82P7k6M75p15k5M48n27J55kJ7J50j14l84N26M99j027
1892a65M30K63q58l48J190r1m17K4J4J04k6nJ92J91q20J48N77q12k16P80j33k62
1914b40K28l75L56J58m31k42P02o81K14O02k22p40L00K09j00l33J92L67k5n19
1934e80M22M02l54r2K42n72q5P92k39N3M44m44Nl8k10L35N88n94J06k62j27l16
1956e24Q36m32k10Q44m44L6J72m34J7J494j408o10P28K21j9J60m72l6j08K13N9
1977H3J74J1q31J1J068m99j41ml35L25K22K28k9m6m80N88n08J86M64J96j528J001
$$ plain form
1999 156 -920 -1058 176 -320 -205 -64 107 -500 33 395 -339 228 -127 -661 -433 -502 -724 120 249 9
2019 9 -92 -145 -459 196 35 -29 51 -239 -414 -215 -308 -240 282 -442 -436 197 316 -61 414 147 -228 251 -118
2042 -118 -141 -146 -28 -258 -113 272 165 -37 40 312 224 251 502 160 384 440 111 -353 -170 655 -43 69
2064 69 581 38 -227 678 472 528 476 -532 -383 -108 -298 -241 479 92 -107 -141 371 60 688 403 -295
2085 -295 -30 -399 -770 134 286 -278 92 -77 -187 -87 109 -50 196 3 -431 241 -22 -41 -56 295 -532
2106 -532 -178 295 -509 74 -66 -81 208 360 50 16 -191 -88 -995 217 -470 -139 -109 -411 -587 -649 79
2127 79 2 288 339 56 266 63 -195 232 -90 660 -164 -226 -82 761 643 1258 -42 230 -125 -5 -738
2148 -738 191 607 -113 278 -318 -337 -176 673 609 482 -123 -472 45 -115 -187 -831 -250 -49 456 1271 -10
$$ packed form
1999A56j076j38J234m96J15J41J71o07N33L62p34N67l55n34K28o9k22Q44J29k40
2019Ij01n3l14O55j61o4Q0k90j75J99r3O8N22p24OO33J19l77M75k67l75M79l69
2042a18k3nJ18k30J45L85j07k02P7K72q8K7K51l42K24N6l29m64J83Q25o98J12
2064F9N12n43k65R05k06N6n2j008J49K75j90N7P20l87j99l4N12l11O28k85o98
2085b95K65l69l71R04J52n64L70j69j10J00J96j59K46j93m34O72k63j9j5L51q27
2106e32L54M73q04N83j40j5K89J52l10l4k07J03r07J212o87L31L0l02j76o2P28
2127G9p7K86N1k83K10k03k58M27l22P50q24o2J44Q43j18O15j300K72l55J20p33
2148g38R29M16p20L91n96j9J61Q49o4j27o05l49N17j60p2o44N81K01N05Q15j281
$$ plain form
2169 -10 943 1545 194 468 -740 -1292 141 192 380 934 579 93 464 452 979 -488 -602 -433 -439 -742
2189 -742 -847 -283 -668 -456 -938 0 -272 -46 20 -825 217 303 746 157 -760 -292 -1376 -691 -437 759
2209 759 -325 -446 -256 -724 342 -199 503 -30 -258 57 58 -16 54 -333 556 324 655 897 -312 163
2229 163 468 -78 -67 -234 161 521 375 -338 -342 255 403 256 913 1 -404 -75 858 449 254 221 -149
2250 -149 -229 -334 -224 -143 959 121 -6 440 101 -66 358 177 -696 -561 -191 110 304 192 0 -395
2270 -395 125 88 -176 220 104 9 -386 53 -159 -436 -218 -60 -356 -51 -506 110 -158 129 354 -173 -276
2291 -276 403 -348 -335 -354 -63 -134 -297 124 161 -79 367 -749 -423 434 384 -148 -421 77 -408 347 24
2312 24 64 -9 -215 -210 -286 370 218 262 138 -153 -131 -919 257 196 362 228 -126 -587 -456 -36 333 860 221
$$ packed form
2169a0R53O02j351K74j208n52J433N1J88N54l55m86L71j2N27j467j14J69ol03
2189g42j05N64l85K12m82R38k72K26O6q45J042Q6M43n89r17M68j084O85K54J196
2209G59j084j21J90m68J066n41P02n33k28L15Jp4P0l87Q89k32L31K42j209M75
2229A63L05n46J1j67L95L60j46p13mN97J48j47O57r12m05L29R33m09j95l3l70
2250a49q0j05J10Q1J102q38j27M46l39j67M24j81q73J35L70L01J94j12j92l95
2270c95N20l7k64L96j16r5l95M39k12k77K18J58k96L05m55O16k68K87K25n27j03
2291b76O79p51J3j9K91p1j63M21L7k40M46j116L26Q57n0n32k73M98m85P55l23
2312B4M0p3k06Np6O56j52M4j24k91K2p88J176o1J66j34l54m61J31M20L69N27o39
$$ plain form
2335 221 414 -21 269 312 334 261 201 -229 -258 289 -210 730 963 -355 316 -8 69 -92 -114 18 -40 -109 431
2358 431 -340 852 256 472 -376 -112 -15 -265 311 -220 -1243 -169 41 -938 1083 147 -191 -333 -5
2377 -5 -669 -865 -86 637 -858 563 -340 351 -309 252 547 -161 -248 -106 488 155 -22 29 484 443 98
2398 98 228 761 -312 -103 353 17 220 -128 352 685 405 -460 314 51 334 -20 -263 -557 391 -256
2418 -256 149 111 77 -52 46 77 -596 -31 156 642 80 192 387 -76 47 -258 -1048 559 474 127 323
2439 323 -530 -331 17 -7 16 -120 302 46 25 383 160 482 232 -20 -399 -451 -21 -225 141 197 -101 100
2461 100 86 -93 -735 -31 395 -56 -33 177 -271 -80 -712 -428 -457 -213 -187 -234 147 -26 -99 -37 -90 198 -253
2484 -253 -173 -412 -347 6 282 316 228 -389 125 -363 37 561 647 79 -60 -425 341 42 325 105 36 171
$$ packed form
2335B21J93m35K90M3K2p3o0m30k9N47m99R40K33j318O71l24P7j61k2J32n8o9N40
2358D31p71J192n96K16q48K64R7k50N76n31j023J074K10r79K021r36l38j42L28
2377eo64j96P79P23j495J421r03O91o60N61K95p08q7J42N94l33j77N1M55m1l45
2398I8J30N33j073K09M56l36K03l48M80L33k80q65P74k63K83l54k43k94R48o47
2418b56M05l8l4j29R8L1o73N65J87M86n62J12J95m63J23l05p90J607q5l47J96
2439C23q53J99L48k4K3j36M22k56k1L58k23L22k50k52l79n2M30k04L66N6k98K01
2461A00j4j79o42P04M26m51K3K10m48J91o32K84k9K44K6m7L81j73p3O2n3K88m51
2484b53Q0k39O5L53K76L4q8o17N14m88M00N24Q6n68j39l65P66k99K83k20o9J35
$$ plain form
2506 171 -25 37 852 872 9 498 32 155 -359 132 -107 -104 31 230 291 590 147 293 -431 617 -550
2527 -550 -793 339 -29 -58 440 -51 -245 178 181 134 -573 -516 -363 83 -538 627 46 -479 126 614 -347
2548 -347 672 -202 -435 -92 365 -56 -147 543 -38 -437 -827 -605 -680 129 362 123 -534 -96 -91 59 195
2569 195 355 -328 -248 -289 -283 -14 -174 138 -38 -152 -121 -172 227 196 89 194 79 -115 -59 -181 -506 -140 -68
2592 -68 -100 370 251 465 184 25 251 111 33 -213 24 347 376 56 335 189 70 293 -618 -64 647
2613 647 269 502 -345 144 -244 -282 927 -10 682 -323 23 -539 261 690 903 1037 779 696 -385 -535
2633 -535 1195 -269 -332 -882 -1177 -4 -104 -745 849 -69 -327 338 -414 177 -443 -169 -1367 537
2651 537 143 941 -926 387 528 -92 311 -516 741 -81 -505 123 -325 -330 -450 120 -576 487 130
$$ packed form
2506A71j96O2Q15K0q63M89m66J23n14M91k39LJ35J99O1K99m43J46p24J048j167
2527e50k43J132l68k9M98m91j94M23Lm7p07N7J53M46o21J165n81n25O05M88r61
2548c47J019q74k33L43M57m21r1O90n81l99l90K22p5Q09K33k39o57M38NJ50J36
2569A95J60o83Q0m1OK69j60L12j76j14L1n1L99l1j07J05j15j94N6j22l25L66P2
2592f8l2M70j19K14k81j59K26j40p8k46K37L23K9l20K79j46j19K23r11N54P11
2613F47l78K33q47M89l88l8J209r37O92j005L46n62Q00M29K13J34k58q3j081j50
2633e35J730j464o3n50k95J173j00o41J594r18k58O65p52N91o20K74j198J904
2651E37l94P98j867J313J41o20M03q27J257q22m24O28m48nj20N70o96J063l57
$$ plain form
2670 130 -313 709 204 569 -58 495 -646 597 409 113 489 -99 458 -516 -211 -137 964 581 -409
2689 -409 -12 489 -96 591 222 362 -372 23 -414 -292 322 272 -375 121 -353 146 -981 -814 568 133
2709 133 -804 -716 -510 1120 597 -203 243 199 67 -653 -182 -394 -122 281 -302 40 -278 -159 192 186 -120
2730 -120 -507 428 -150 -393 -274 -654 -454 -409 -646 21 -607 809 21 -241 163 197 180 168 -115 -658 -920
2751 -920 -275 -397 445 56 -41 230 -259 182 731 132 -119 -153 644 -350 651 -141 -544 -25 -278 444
2771 444 261 412 181 58 -19 -167 63 -123 206 -145 -154 142 456 319 187 286 -24 246 -107 291 -28
2792 -28 -79 -319 -60 55 363 108 269 -10 65 -289 -87 415 309 136 114 -41 -239 -649 -63 -161 -135 94
2814 94 -185 -274 355 190 -49 58 -42 -107 -549 -401 -118 -500 -215 103 -194 -189 -396 357 -76 -312 -23 200
$$ packed form
2670A30m43J022n05L65o27N53j141J243j88k96L76n88N57r74L05P4J101l83r90
2689d09L97N01n85O87l69J40p34L95m37J22O14n0o47M96m74M99j127J67J382m35
2709A33r37Q8K06J630n23q00M46m4j32p20M71k12K72M03n83L42l18J19L51ol06
2730a20l87R35n78k43J19l80K00M5k37O67o28J416p88k62M04L4j7j2k83n43k62
2751i20O45j22Q42l89r7K71m89M41N49n99k51l4P97r94J001p92m03N19k53P22
2771D44j83J51k31j23p7j48K30j86L29l51rK96L14j37j32R9l10K70l53L98l19
2792b8n1k40K59J15L08k55J61k79P5l54K02N02j06j73k2j55j98m10N86r8K6K29
2814I4k79q9O29j65k39J07j00o5m42J48K83l82K85L18k97Nk07P53m33k36K89K23
$$ plain form
2836 200 115 -6 -101 -243 -569 -280 -61 -388 -267 -59 107 484 223 96 -3 7 -262 -84 -159 -172 -50 536
2858 536 255 559 245 95 381 459 -8 209 148 -439 305 289 -37 -46 242 -126 221 191 257 658 373 45
2880 45 97 -99 128 269 65 -156 433 144 351 430 476 196 551 51 -147 54 -144 72 -231 -89 -142 97
2902 97 332 -106 -193 2 -128 -213 42 -89 -118 75 -156 -345 -61 51 -182 -321 -22 144 -137 277 5
2923 5 -42 -122 -330 -137 -157 -271 -136 -65 8 117 103 -247 -55 78 183 -242 56 -48 -149 -71 86 -37 -11
2946 -11 -69 64 25 427 243 99 258 107 44 158 -48 -205 -213 8 -162 275 244 474 412 245 343 274 79
2969 79 -87 -215 -181 91 -95 451 441 298 139 132 -104 -401 -168 350 -130 55 -502 468 298 35 337 -393
2991 -393 -333 391 665 581 611 -437 559 -917 142 478 -203 453 269 327 -346 -1280 236 -326 1023 1018
$$ packed form
2836B00q5j21r5j42l26K89K19l27J21K08J66L77k61j27r9J0k69J78p5j3J22N86
2858E36k81L04l14j50K86P8m67K17o1n87P44j6l26rK88l68L47l0O6M01k85l28
2880D5N2j96K27J41k04k21N89k89K07P9M6k80L55n00j98K01j98K16l03J42n3K39
2902I7K35m38q7J95j30q5K55j31k9J93k31j89K84J12k33j39K99J66k81M14k72
2923Em7q0k08J93k0j14J35P1P3J09j4l50J92J33J05m25K98j04j01P8J57j23K6
2946a1n8J33l9M02j84j44J59j51o3J14k06j57qK21j70M37l1K30o2j67R8o9j95
2969G9j66j28L4K72j86N46j0j43j59pk36k97K33N18m80J85n57R70j70k63L02p30
2991c93O0P24K74q4L0j048R96j476J059L36o81O56j84N8o73r34J516n62J349n
$$ plain form
3011 1018 -553 -813 660 783 49 86 168 717 -78 660 300 -128 211 347 376 652 -42 545 -458 -647
3031 -647 -262 24 121 544 599 -10 375 581 686 -231 380 -384 -41 -153 -320 -278 148 646 -437 84 190
3052 190 70 -180 115 609 45 434 -82 -530 140 -274 -163 -220 436 177 179 478 221 -137 211 -63 -296
3073 -296 -739 22 -159 -158 -181 699 421 -256 598 -200 -165 -162 252 81 -64 188 88 262 -120 -192 -301 -66
3095 -66 -132 -218 -85 257 -127 20 138 -306 -206 -123 -372 -235 -347 -159 -282 -13 -165 266 64 -225 -61
3116 -61 -461 -149 -185 35 -89 85 -145 -207 77 144 12 57 167 -61 23 68 -45 -85 -36 -261 -82 -54 -94 217
3140 217 301 165 177 285 208 87 -47 159 -99 -173 119 10 338 279 54 280 183 112 106 125 179 0 42 -108
3164 -108 -208 21 28 -104 46 -34 -33 188 96 61 -132 136 -42 -171 -179 -50 -330 178 -13 158 135 188 -119 -244
$$ packed form
3011A018j571k60J473J23p34L7Q2N49p95P38l60m28L39J36K9K76o94N87j003j89
3031f47L85K86R7M23N5o09L85K06J05r17O11p64L43j12j67M2M26M98j083N21J06
3052A90j20k50K95M94n64L89n16m48O70m14J11n7O56k59KK99k57l58L48k74k33
3073b96m43P61j81Jk3Q80k78o77Q54p98L5LM14j71j45K52j00J74l82p2j09K35
3095f6o6q6J33L42l84J47J18m44J00Q3k49J37j12J88j23K69j52M31k02k89J64
3116f1m00L12l6K20j24J74k30o2K84O7j32M5J10k28Q4M5j13m0M9k25J79K8m0L11
3140B17Q4j36J2J08p7j21j34K06k58p4K92j09L28n9k25K26r7p1oJ9N4j79M2j50
3164a08j00K29Pj32J50q0JK21r2l5j93K68j78j29qJ29k80N08j91J71k3N3l07j25
$$ plain form
3188 -244 -82 -270 -141 -184 -10 -202 -88 -159 97 -1 73 52 -197 -366 170 -27 179 -44 36 -182 -191 -68 -137
3211 -137 -69 54 -33 -369 320 31 105 -123 178 -161 266 93 -92 -92 -100 -88 510 454 249 -610 -54 248 924
3234 924 -492 378 -216 879 630 503 -6 411 143 -122 -192 -240 126 90 229 -22 -287 236 -572 -435
3254 -435 213 -264 71 460 -660 233 -617 -354 52 -483 -423 -372 59 70 -178 514 355 -238 -427 -227 -177
3275 -177 -559 680 -541 614 -164 -147 80 185 87 -167 -491 231 359 879 82 887 532 628 -151 -255
3295 -255 -322 -165 -349 -519 -460 221 -41 357 346 467 63 -14 474 -708 856 -369 373 -356 82 -312
3315 -312 436 -354 424 390 -711 -537 632 290 -340 -416 375 -432 177 -186 116 59 14 788 -19 68 790
3336 790 627 -878 -257 -253 -474 -78 735 19 100 51 66 192 -438 -465 885 -26 170 21 -254 100 286
$$ packed form
3188b44J62j88J29m3J74j92J14p1K56r8P4k1k49j69N36j97K06k23Q0k18rJ23o9
3211a37O8J23q7l36O89k89P4k28L01l39M27j73j85%qJ2N98n6k05q59N56L02O76
3234I24j416Q70n94J095k49j27n09M17k68k65p0m8L66l6J39k51k65N23q08J37
3254d35O48m77L35L89j120Q93q50K63M06n35O0N1M31J1k48O92j59n93j89K00N0
3275a77l82J239j221J155p78J7K27J05r8k54l24P22J28N20p97Q05l55R6p79j04
3295b55o7J57j84j70N9O81k62L98j1J21m04p7M88j182J564j225P42p29M38l94
3315c12P48p90P78l4j101J74J169l42o30p6P91q07O09l63L02n7m5P74q07Q7P22
3336G90j63j505O21Mk21L96Q13p16Q1m9J5J26o30k7J350r11J96j49k75L54J86
$$ plain form
3357 286 -245 153 -169 -290 -257 92 -48 -375 -546 -460 -234 -425 -287 62 -30 -290 -61 264 419 78 175
3378 175 13 -201 -217 -16 -117 -10 7 32 -26 39 -31 -331 -117 131 -65 -19 27 112 109 -128 231 -403 -494 -245
3402 -245 71 110 48 101 184 180 178 292 -84 278 -107 66 -348 -77 184 53 250 343 -125 -187 117 184 73 105
3426 105 97 -183 -320 -105 48 43 56 -151 411 38 -93 394 284 -5 283 -9 -76 -289 -75 -281 -62 -188
3448 -188 15 -137 86 181 7 -561 -239 30 79 -208 -373 -203 -10 -255 109 -119 -128 -58 -99 -4 -145 78
3470 78 246 -138 95 152 -223 -95 53 -427 -253 192 202 159 -24 12 -197 -86 -465 -378 -54 -49 -190 407 124
3493 124 240 203 -131 -395 27 392 850 96 125 95 124 -216 -90 -93 421 79 218 435 377 -4 -244 -366
3515 -366 -282 -23 144 -504 -66 205 99 588 285 461 136 -626 14 -436 -475 44 -198 -113 93 684 401
$$ packed form
3357B86n31L98l22j21L3L49j40l27j71Q6K26j91J38L49r2k60K29L25J55l41R7
3378A75j62k14j6K01j01J07J7K5n8O5p0l00K14K48j96M6M6Q5lk37L59o34r1K49
3402b45L16L9o2N3Q3mkJ14l76L62l85J73m14K71K61j31J97R3m68o2L04O7j11L2
3426A05qk80j37K15J53nJ3k07N62l73j31M87j10k89K88k92o7k13K14k06K19j26
3448a88K03j52K23R5j74n68L22K69M9k87j65J70J93k45L64k28rP0m1R5j41K23
3470G8J68l84K33N7l75J28J48m80J74M45J0m3j83L6k09J11l79Q7L24Nj41N97k83
3493A24J16l7l34k64M22L65M58p54K9l0K9l40J26lN14l42J39K17n8l81k40j22
3515c66Q4K59J67o48M38K71j06M89l03J76l25p62O40m50l9N19k42Q5K06N91k83
$$ plain form
3536 401 1 784 -396 -98 -229 -366 -22 311 -99 271 -520 -516 -101 -379 -237 -361 83 42 -150 384 -78
3557 -78 -209 -67 -324 -137 -436 -501 53 77 -172 128 -44 395 -246 73 204 3 4 -97 247 -178 -287 227
3579 227 10 -326 223 349 134 75 -93 -470 438 217 -93 151 -487 199 325 76 609 208 455 -410
3599 -410 329 156 61 888 8 451 105 -236 -428 -268 292 567 1067 54 15 -334 194 -237 487 -12
3619 -12 -12 -207 182 -181 12 -97 314 -180 89 -396 -227 -41 -464 -33 151 -603 -131 207 267 266 -336 -52
3641 -52 223 -104 -236 -185 -751 -268 7 290 362 -456 58 -289 231 -409 107 -23 -92 167 114 533 -58 144
3663 144 -188 157 -251 -423 -103 127 -420 203 610 549 259 -80 -268 -108 -415 13 -184 -151 -132 -351 168
3684 168 30 230 -447 97 136 271 384 69 614 5 -1066 -116 126 -331 229 552 193 -250 213 -401
$$ packed form
3536D01m00P83j180K98j31j37L44L33m10L70p91MM15k78J42j24M44m1j92N34m62
3557g8j31J42k57J87k99o5N54K4k49L00j72M39o41L19J31k01Jj01L44m25j09N14
3579B27k17l36N49J26k15n9j68l77R08k21l10K44o38O86J26k49N33m01K47q65
3599d10P39j73r5Q27q80M43l46l41j92J60N60K75N00j013l9l49N28m31P24m99
3619a2%j95L89l63J93j09M11m94K69m85J69J86m23M31J84p54M72L38O0jo02K84
3641e2K75l27j32N1n66M83K75K83P2q18N14l47N20o40N16j30o9K59n3M19n91K02
3663A44l32L45m08j72L20K30n47O23M07o1k90l39j88J60l07M28j97L3J9k19N19
3684A68j38K00o77N44L9J35J13l15N45o09j071R50K42m57N60L23l59m43M63o14
$$ plain form
3704 -401 231 131 -105 132 240 -205 -159 -246 -338 43 330 2 45 -126 -299 -22 443 -195 -396 438 -75
3725 -75 -185 69 231 221 249 -736 100 552 163 -161 -245 -565 -297 -553 -483 -192 -112 -91 274 -84 160 46
3747 46 325 321 282 -214 -172 -446 -215 -376 -142 112 404 -374 338 -82 453 326 -498 426 492 -233 -221 460
3769 460 -44 -271 -366 -69 475 845 132 -125 -38 83 74 137 -500 22 100 -25 220 188 217 4 380 184 153
3792 153 17 -45 -224 196 10 -104 -245 101 66 73 -258 -150 230 112 52 70 24 -45 -3 -248 -284 106 -229
3815 -229 -553 -129 -90 2 -324 -122 154 396 -520 0 -214 -268 369 -317 111 205 -67 -3 469 -366 -693 1
3837 1 -276 -261 423 -38 -399 -280 -694 -492 -43 134 -442 17 54 -736 -131 25 -205 -193 597 385 -220 271
3859 271 664 405 35 432 257 799 -277 -364 110 159 -438 -253 -562 249 205 -242 419 937 -117 381
$$ packed form
3704d01O32j00k36K37J08m45M6q7r2L81K87l28M3j71j73K77M65o38k01Q34n13
3725g5j10K54J62j0K8r85Q36M52l89l24q4l20K68k56P0K91Q0K1L65l58K44j14
3747D6K79ml9m96M2k74K31j61K34K54K92p78P12m20N35j27q24R24O6p25J2O81
3769D60n04k27r5K97N44L70p13k57Q7J21rO3o37N22P8j25K45l2K9k13L76j96l1
3792A53j36o2j79M20j86j14j41L46l5Pl31J08L80j18o0J8m6o9M2k45l6L90l35
3815b29l24M24L9R2l26K02K76K42r16N20k14n4O37o86M28R4k72O4M72q35l27O94
3837Ak77J5O84m61l61J19m14K02M49J77n76M59L7p90O05J56k30J2P90k12o05M91
3859B71L93k59l70L97j75N42j076q7M74M9n97J85l09Q11m4m47O61N18j054M98
$$ plain form
3879 381 599 -92 -225 105 -2 -267 4 -29 54 179 -24 -142 91 -212 -117 126 -199 1 -116 41 -39
3900 -39 65 -193 -75 54 -163 -248 33 132 -22 208 16 -254 -12 -39 -248 -265 121 -158 -47 -151 -123 234
3922 234 -58 141 158 -50 -248 84 -312 -196 -21 140 -74 139 216 -66 -48 195 -359 83 22 -165 235
3943 235 287 2 132 187 -136 9 124 -313 449 118 -111 310 -54 -150 -153 240 27 -80 -156 -133 256 -71
3965 -71 -115 140 -120 121 250 -201 -74 -90 -166 114 -13 -26 -33 -19 59 91 158 22 -11 59 66 -199 -251 62 -23 4
3991 4 6 -93 -286 -285 -85 -167 -79 -59 -293 -39 -114 21 4 -69 -78 -223 -200 62 -168 -146 -25 -28 -123 -124 -42 75 120 18
4019 18 87 178 0 28 157 -200 -156 139 76 -36 358 133 -373 58 236 16 -153 147 -113 343 291 128
4041 128 -84 213 4 -53 -153 133 38 298 33 -181 453 50 86 252 -384 -462 348 -500 -307 0 223
$$ packed form
3879C81K18o91j33L30j07k65K71l3Q3J25k03j18K33l03R5K43l25K00j17J57q0
3900c9J04k58J18J29k17q5K81R9j54K30j92k70K42k7k09j7L86k79J11j04K8L57
3922B34k92J99J7k08j98L32l96J16J75J61k14K13P7k82J8K43n54M42o1j87M00
3943B35N2k85J30N5l23J45J15m37P62l31k29M21l64r6lL93k13j07p6K3L89l27
3965g1m4K55k60K41J29m51J27j6p6K80j27j3pJ4P8L2O7j36l3P0Pk65n2L13q5K7
3991DKr9j93JK00q2Q8K0k34K54p5J35j7p3rj45K3K62k30K2J21lr5jQ2J17M5j02
4019A8O9R1j78K8J29l57M4K95o3j12L94k25n06M31J78k20j69L00k60M56n2j63
4041A28k12K97k09n7j00K86r5K60k65k14O34m03L6J66o36p8Q10q48J93L07K23
$$ plain form
4062 223 -575 -23 -46 -356 -311 160 456 -9 216 -286 -164 395 29 -331 -1142 76 653 393 370 -514 -307
4083 -307 387 -448 -438 -898 410 -929 -527 -241 -553 512 334 -470 -820 -531 -380 -116 -737 -8 44 -5
4103 -5 274 -116 334 -664 -364 -87 188 351 -357 -166 85 449 -965 -77 274 -55 -193 237 339 521
4123 521 -453 434 -586 -164 -321 550 14 528 370 153 95 17 109 272 110 -212 272 251 18 -211 98
4144 98 -13 185 -278 -45 -360 -384 81 104 -35 743 -232 309 173 243 -1 352 126 80 190 -283 118 4
4166 4 -104 630 153 -340 -173 -653 44 655 445 -453 21 -208 -463 -121 168 -358 624 281 -804 394
4186 394 133 95 -159 363 23 -272 -1 -209 -804 -169 676 44 832 -324 -460 586 -376 686 -187
4205 -187 -6 -515 111 -188 -461 499 -382 76 -111 973 -320 -393 -249 206 546 110 -400 -179 -192 621
$$ packed form
4062B23p98N52k3l10M5M71K96m65K25n02J22N59l66l60q11J218N77k60k3q84K07
4083c07O94q35J0m60J308j339M02K86l12J065j78q04l50K89J51K64o21P29N2m9
4103eK79l90M50r98L00K77K75J63p08J91K51L64j414Q88L51l29j38M30J02J82
4123E21r74Q87j020M22j57Q71n36N14j58k17n8p8R2J63j62l22M84k1k33k29L09
4144I8j11J98m63K33l15k4M65K3j39P78r75N41j36P0k44L53k26m6J10m73M01j14
4166Dj08P34m77m93J67m80O97O11k10q98M74k29k55L42K89n26R82l43j085J198
4186C94k61l8k54N22l40k95K71k08n95O35Q45o32P88j156j36J046r62J062q73
4205a87J81n09O26k99k73R60q81M58j87J084j293p3J44M55L40m36n10K21j3Q13
$$ plain form
4225 621 -642 -128 384 -27 190 -451 207 146 89 88 108 21 365 -271 540 -48 316 44 -233 185 59 -234
4247 -234 -217 429 -253 -16 38 -108 -38 -194 -44 -149 76 36 -195 -200 169 -130 -185 128 -315 -248 -87 -133 -67
4270 -67 88 93 -159 -18 -92 178 109 11 294 -39 -265 20 77 -184 101 135 -214 304 82 -218 100 176 -149
4293 -149 110 -102 -291 -109 57 56 -26 -186 -103 88 131 -62 -16 192 -155 277 -62 4 74 107 -87 88 254
4316 254 -96 175 296 18 194 194 53 -132 -130 -112 -173 -49 -221 -153 -37 133 -70 -27 134 -41 127 -161 -36
4339 -36 -28 -304 -92 -84 -255 -271 -127 95 -337 105 -457 -184 63 -369 75 -412 -298 316 -196 -443 165 -103
4361 -103 -348 -82 -17 233 64 -180 -677 -709 -161 -13 -606 -112 -196 168 97 356 -226 -357 -175 61 194
4382 194 -353 198 82 -167 -53 -58 -38 11 303 -372 87 323 80 147 119 189 101 220 108 -81 38 -100 129
$$ packed form
4225F21j263N14N12m11K17o41O58o1n7jK0q7L44o36Q11n88L64k72k77M18j26k93
4247b34J7O46o82K37N4j46P0j56J50j05K25m0k31nL69k99n5L13m43O7J61m6O6
4270f7J55Nk52J41p4K70o9r8K83l33k26K85N7k61K85L4l49N18k22l00L18P6l25
4293a49K59k12j89J82J66jq2j60Q3J91M3j93M6K08l47M32l39O6P0L3j94J75J66
4316B54l50K71J21k78J76%j41j85KJ8o1J24j72O8J16J70k03M3J61j75J68k88J25
4339c6Qk76K12Qj71j6J44K22m32M42n62K73K47m32M44m87J14O14n12k47O08k68
4361a03k45K66O5K50j69k44m97l2N48J48n93M94q4L64p1K59n82j31J82K36J33
4382A94n47N51j16k49J14nK0M9K92o75M59K36k43O7k8P0q8J19j12j89J19j38K29
$$ plain form
4405 129 171 0 -98 20 73 40 200 196 -53 9 -153 -196 -12 -126 37 143 -126 -117 94 44 -39 -257 123 -164
4429 -164 272 -270 -176 -8 -103 -28 10 -82 -42 -51 159 -104 -49 -155 -85 16 -276 187 -154 -5 -159 157 -196
4452 -196 -166 -163 82 61 -276 -120 96 -14 273 4 693 -509 -243 131 31 735 -226 45 -481 133 426
4473 426 722 374 -422 218 340 -246 113 -69 -104 -388 -404 -26 -371 -445 -169 359 191 206 391 408 -347 -214
4495 -214 88 -1 256 120 -145 -75 903 -188 256 -433 86 -596 -170 -524 -311 -37 -34 140 357 -73 -95
4516 -95 366 383 1063 -581 302 129 -1062 -224 -1318 -276 -134 152 230 -549 687 877 -477 -400 -399 47
4536 47 227 -791 -38 -563 636 217 -207 1003 91 324 685 303 392 120 201 691 514 -175 178 -107
4556 -107 517 835 166 -53 -937 704 -177 88 355 756 -629 114 127 117 210 -56 -176 2 -515 -290
$$ packed form
4405A29M2j71r8J18N3l3J60mk49O2j62m3J84j14J63J06k69RK11n0q3k18L80k87
4429a64M36n42R4J68r5P5L8r2M0rK10k63N5j06P0J01k92M63l41J49j54L16l53
4452a96L0LK45k1l37J56K16j10K87k69O89j202K66L74j00P04r61K71n26O14K93
4473D26K96l48p96O40J22n86L59j82l5k84j6L78l45p4K76N28j68J5J85J7p55J33
4495b14L02q9K57j36k65P0R78j091M44o89N19o82M26l54K13K74LJ74K17m30k2
4516i5M61J7O80j644Q83j73j191Q38j094J042J42K86P8p79J236J90j354P7JM46
4536D7J80j018P53n25J199m19m24J210r12K33L61l82Q9k72Q1M90j77o89L53k85
4556a07O24L18o69k19q84J641q81K65K67M01j385P43J3j0R3k66j20J78n17K25
$$ plain form
4576 -290 -435 -264 251 -45 851 307 554 -209 228 -284 306 45 -178 -189 446 337 183 425 516 -154 -18
4597 -18 448 123 530 124 -82 100 2 136 7 18 115 43 -78 -220 86 386 -73 5 23 -62 -97 -18 38 -140
4621 -140 178 21 -319 -346 -25 -278 36 -37 -279 46 -403 -46 126 -140 -73 33 -156 -196 87 22 -108 -23
4643 -23 -112 -34 -14 -162 -41 128 127 59 162 70 16 177 -40 55 161 176 49 -60 36 -105 14 -84 64 6 -172
4668 -172 82 122 -156 -49 -53 -71 -48 195 186 -227 413 -28 -165 53 -27 56 -76 150 -153 72 110 -333 52
4691 52 -274 46 236 -252 -2 85 35 -33 -244 -150 -33 -84 -94 -115 373 -423 -137 318 88 -91 28 -429 -488
4714 -488 -158 -793 -42 289 -108 88 69 -896 777 -371 35 303 508 126 -85 298 -133 -126 17 241
4734 241 -107 126 -222 -526 113 -110 -372 137 -142 267 -122 -2 -452 236 -132 2 163 314 35 214
$$ packed form
4576b90j45J71N15k96Q96n44K47p63M37n12N90k61k23j1O35j09j54K42R1o70J36
4597a8M66l25M07m06k06J82r8J34j29J1R7p2j21j42L06L00m59P8J8q5l5P9N6j78
4621a40L18j57l40k7L21k53L14p3k42L25m49L57J72k66O7J06j89m0K83o5j30Q5
4643b3q9P8K0j48J21J69jo8J03r2n4J61k17R5J06J5j27j09R6j41J19r8J48n8j78
4668a72K54M0k78J07mj8K3K43rm13O40m41j37K18q0Q3j32K26l03K25L8m43L85
4691E2l26L20J90m88K50Q7n0o8k11R4J17n1j0k1M88p96K86M55k30j79J19m57n9
4714d88L30o35P51L31l97J96j9r65J673j148M06K68K05l82k11L83m31PJ43K24
4734B41l48K33l48l04O39k23k62N09k79M09l89J20m50O88l68J34J61J51k79J79
$$ plain form
4754 214 23 -202 37 27 -93 -76 -8 268 405 3 82 -267 93 -219 -118 134 -82 227 171 -50 81 -336
4776 -336 -217 112 -175 -195 15 228 15 144 3 -250 30 -132 -271 -60 -17 22 12 -93 0 -1 -209 76
4798 76 105 -334 -102 -30 -244 -23 -13 99 -91 247 37 61 -255 -11 0 -138 -150 91 -21 41 -99 235 -131
4821 -131 200 476 -218 -279 -229 -25 -165 263 -166 -70 228 -34 -160 -110 62 141 245 23 -42 -102 191 122 66
4844 66 24 -103 -54 60 -47 255 -14 270 4 37 3 63 364 -122 -44 148 214 148 162 -217 -177 -5 213 38
4868 38 16 43 213 -76 79 394 85 195 -55 1 409 250 -180 -51 261 498 -178 -483 -219 -24 418
4889 418 16 -1033 -168 61 -31 39 -331 -922 48 -15 -205 -451 -459 -257 -316 4 462 -112 532 -89 -527 50
4911 50 83 497 -77 -56 -276 79 -120 673 -397 -546 41 489 544 649 -98 -107 235 135 -436 -83 -791 -356
$$ packed form
4754B14j91k25K39j0j20J7O8K76J37m02P9l49L60l12J01K52k16L09n6k21J31m17
4776c36J19L29k87k0K10K13k13J29j41k53K80j62j39K11M3L9j0j05R3jk08K85
4798G6K9m39K32P2k14K21J0J12j90L38k10K4l16K44J1j38j2K41j12O2j40L34l66
4821a31L31K76o94o1N0K04j40M28m29R6K98k62j26N0J72P9J04k22o5o0K93o9n6
4844F6m2j27M9J14j07L02k69K84k66L3l4O0L01m86P8J92O6o6J4l79M0J72K18j75
4868C8k2K7J70k89J55L15l09J10k50N6M08j59m30J29L12K37o76l05K64J95M42
4889D18m02j049Q65K29r2P0l70n91R70o3j90k46qK02n9L20M58n74O44o21m38N77
4911E0L3M14n74K1k20L55j99P93j070j49N87M48N5J05p47rL42j00n71L53p08M35
$$ plain form
4933 -356 5 -331 33 -55 -149 230 -233 -255 147 -7 134 345 -282 -143 550 365 496 -347 137 137 87 109
4955 109 359 -261 -307 256 -278 -127 -30 -139 51 198 -324 -95 -160 -100 -264 90 -218 148 -10 281 -56
4976 -56 73 -187 -120 -337 92 130 50 14 41 12 -51 -155 -10 10 227 300 -285 17 402 -247 -134 -81 -216 57
5000 57 45 23 177 88 -417 391 -165 295 -44 -137 89 289 -66 -173 201 -206 778 -59 124 -31 -114 459
5022 459 326 101 350 556 -175 765 65 175 -217 -482 342 210 306 -277 -342 125 -151 952 -118 -472
5042 -472 -273 -387 -266 143 -1277 201 549 -99 -104 620 939 -468 -560 649 290 -517 610 -185 -35
5061 -35 770 80 111 589 44 -23 415 -267 -29 25 321 -79 -476 -22 -286 306 -382 277 -414 337 -81
5082 -81 -365 -94 453 496 420 244 93 153 198 -99 88 -727 130 306 -765 24 -287 -356 -144 574 433 1143
$$ packed form
4933c56L61l36L64q8r4L79m63k2M02j54J41K11o27J39O93j85J31q43M84%n0K2
4955A09K50o20m6N63n34J51R7j09J90J47n22K29o5O0j64L54l08L66j58K91l37
4976e6J29k60O7k17M29L8q0l6K7k9o3j04J45K0K17P3n85L02L85o49J13N3j35K73
5000E7j2k2J54q9n05Q08n56M60l39r3K26K00l55j07L74m07R84q37J83j55q3N73
5022D59j33k25K49K06p31R40p00J10l92k65Q24j32R6n83o5M67k76J103j070l54
5042d72J99j14J21M09j420J478L48o48nP24L19j407r2J209l59q07J127p95J50
5061c5Q05o90L1M78n45o7M38o82K38N4K96m00l97M54k64N92o88O59o91P51m18
5082h1k84K71N47M3p6j76j51O0M5k97J87q15Q57J76j071P89l11o9K12P18j41P10
$$ plain form
5104 1143 171 567 -315 121 67 -522 189 -556 319 423 20 521 1067 -827 -25 228 434 -434 41 657
5124 657 -1115 -709 440 893 -232 131 241 765 -229 -365 -424 -9 307 1187 348 721 46 -607 1277
5143 1277 -245 -104 233 73 -621 243 -80 -969 902 82 -807 -460 232 -18 -520 -539 311 140 -546
5162 -546 -268 129 155 652 110 -486 -561 -382 -360 99 788 3 -469 -347 224 263 35 -374 -170 -295 -832
5183 -832 195 -272 555 -214 -100 506 -23 110 79 -350 -121 84 733 89 -117 185 -464 80 -26 235
5203 235 10 462 -15 184 -64 7 -585 -121 -287 53 -685 -358 -170 -1001 15 -297 -176 509 235 202
5223 202 17 -201 262 -638 -422 706 -633 -164 -97 -138 97 322 -1170 -213 -519 382 36 -23 280 -694
5243 -694 1190 -584 -473 302 -419 -292 -418 229 -55 6 148 167 -197 -176 -58 463 -654 280 306 194
$$ packed form
5104A143r72L96q82M36n4n89P11p45Q75J04m03N01N46j894Q02K53K06q68M75O16
5124F57j772M06J149M53j125L63J10N24r94j36n9M15L16Q80q39L73o75o53J884
5143A277j522J41L37j60o94Q64l23q89J871q20q89L47O92k50n02j9Q50j71o86
5162e46K78L97K6M97n42n96p5J79K2M59O89p85m72J22N71L9k28m09K04j25n37
5183h32J027m67Q27p69J14O06n29J33l1m29K29K05O49o44k06L02o49N44j06K61
5203B35k25M52m77J99k48P1n92M64j66L40p38L27J88q31J016l12J21O85k74l3
5223B02j85k18M63r00K16J128j339M69O7m1K35K25j492R57l06R01l46n9L03r74
5243f94J884j774J11P75p21J27j26O47k84O1J42J9l64K1J18N21j117R34K6j12
$$ plain form
5263 194 652 54 -543 -92 560 357 11 361 282 86 -193 -355 126 648 295 -223 308 -600 -35 -528
5283 -528 -414 480 339 -220 448 399 155 -44 413 -190 -806 230 187 -167 426 -633 178 152 444 -146
5303 -146 -301 -33 90 -122 -1394 18 336 -78 -161 -160 -222 -325 -644 7 -768 -397 109 -786 -394 104 -795
5324 -795 312 -158 83 -580 -340 596 -255 -294 528 281 590 147 587 732 -261 217 -158 -37 -23 88
5344 88 -5 193 -18 67 -123 -219 170 230 -46 -110 133 95 18 -32 52 -77 -33 -127 116 18 -160 99 -332 40
5368 40 -10 -119 206 20 -91 -3 72 -139 160 241 293 74 226 -118 -34 30 -32 24 147 55 178 55 115 21
5392 21 16 160 239 -22 145 -12 19 25 212 47 -7 56 24 -221 -183 -191 -84 -29 -116 34 136 101 179 143 133 -215
5418 -215 -133 -290 108 414 450 349 316 54 -310 -110 -279 341 22 -126 148 -107 -129 119 -83 -100 21 88
$$ packed form
5263A94M58n98n97M51O52k03l46L50p9j96k79j62M81N22l53n18N31r08N65m93
5283e28J14Q94j41n59O68m9k44j99M57o03o16J036m3l54N93j059Q11k6K92n90
5303a46j55K68J23k12j272J412L18m14q3Jo2j03l19O51p75L71N06q95L92M98q99
5324g95J107m70K41o63K40R36q51l9Q22k47L09m43M40J45r93M78l75J21J4J11
5344H8r3J98k11Q5j90r6L89O0k76o4K43l8p7n0Q4j29M4r4K43r8j78K59m31L72
5368D0n0j09L25j86j11Q8P5k11K99Q1N2k19J52l44Q4O4o2N6J23r2J23j23O0r4
5392B1nJ44P9k61J67j57L1OJ87j65n4O3l2k45L8qJ07N5q7J50J02l5P8l6j0l48
5418b15Q2j57L98L06L6j01l3k62l64K00j69O20l19j48K74k55k2K48k02j7J21O7
$$ plain form
5440 88 31 112 -9 -255 37 -80 -22 71 180 1 195 -240 -165 -193 86 22 59 32 -12 117 13 -79 193 138
5464 138 153 285 115 175 167 256 37 -8 140 248 145 -90 -87 141 -182 -84 -254 135 256 156 92 62 -146 -221
5488 -221 -294 175 85 108 -45 13 -253 -55 -66 -5 31 -2 161 -61 -174 222 27 -44 -253 -10 -21 -201 -318
5511 -318 167 -84 -435 -35 -174 378 167 98 307 -583 364 20 -159 653 -182 -247 -250 -26 -360 -615 42
5532 42 -257 707 -241 37 599 -281 590 1170 24 -266 198 -44 459 469 -77 -427 -157 32 -817 255
5552 255 360 289 389 -65 -211 -291 -44 -42 -294 -32 -77 132 -22 -95 131 -284 -49 -120 -166 -69 118 58 47 68
5576 68 49 -113 36 -103 12 51 295 -126 -24 413 73 -137 -56 184 -24 -48 -155 21 -174 -133 169 213
5598 213 137 31 143 78 -63 -15 -17 5 15 -58 86 27 -196 -28 80 133 228 -487 -4 -447 150 -308 -479 54
$$ packed form
5440H8n7Q1j21k46K92j17N8R3J09j79J94m35P5k8K79o4L7k7m4J29j04r2K72n5
5464A38J5J32j70O0qQ9k19m5J48J08j03k35LK28l23R8j70L89J21j00o4l0k08p5
5488b21p3M69r0K3j53N8k66J98j1O1L6l3J63k22j13L96j95p1k09K43j1j80j17
5511c18M85k51l51M00j39N52k11o9K09q90R47l44j79Q12q35o5lK24l34k55O57
5532D2k99R64r48K78N62q80Q71N80j146k90M64k42N03J0n46l50K70J89q49J072
5552B55J05p1J00m54j46q0K47Kk52K62m5K09j54p3K26m15K35p1m6R7J87o0j1K1
5576F8j9j62J49j39J15L9K44m21J02M37l40k10Q1K40k08k4j07J76j95M1L02M4
5598B13p6j06J12o5j41M8kK2J0p3J44n9k23J68J08N3R5p15M83m43N97m58j71N33
$$ plain form
5622 54 463 829 -129 -85 -86 -158 -147 -166 179 1054 328 178 330 -222 -223 -442 -141 71 -370 312 -250 -189 729
5645 729 177 -92 -100 351 -168 342 -31 167 -116 -140 -77 92 -28 -44 110 244 -136 189 187 -33 51 52 -61
5668 -61 152 -12 13 59 -54 101 -92 130 -57 -18 -185 225 -97 217 3 154 112 -356 -28 -93 -100 -36 21
5691 21 -14 237 -62 -32 62 85 48 22 -233 45 17 13 141 264 209 2 20 -124 102 -130 98 -163 171 -126
5715 -126 -2 -170 -136 -43 -5 -95 -15 45 54 103 10 113 51 31 399 90 -113 157 -69 20 126 391 -39 -128 210
5740 210 -145 197 172 155 -147 9 74 -122 -134 -184 97 -69 3 20 7 63 51 223 75 172 -3 -120 190 -28
5764 -28 179 -155 -287 161 -102 263 112 -50 -175 -120 0 57 120 -168 -108 -173 -223 -66 48 -54 -111 -88 -137
5787 -137 281 -162 -130 192 185 44 -507 -146 67 12 -122 235 5 -369 -177 -57 42 164 -176 -7 191 -141
$$ packed form
5622E4M09L66r58M4jp2J1j9L45Q75p26j50J52n52jk19L01K12m41O82n62O1R18
5645G29n52k69qM51n19N10l73J98k83k4O3J69j20j6J54J34l80L25kk20Q4Jj13
5668f1K13j64K5M6j13J55j93K22j87L9j67M10l22L14k14J51m2m68L28o5pO4N7
5691B1l5K51k99L0R4K3l7k6k55K78k8mJ28J23n5k07J8j44K26k32K28k61L34k97
5715a26J24j68L4R3L8r0Q0O0RM9r3J03o2k0L68l09k03K70k26Q9J06K65m30q9L38
5740B10l55L42k5j7l02J56O5j96j2n0K81j66P2J7j3N6j2J72j48R7j75j17L10k18
5764b8K07l34j32M48k63L65j51j62j25N5J20N7O3k88O0o5n0J57J14j02n7K3m9
5787a37M18m43L2L22pj41n51L61K13n5j34L57k30l74J92J20R9J22l40J69J98l32
$$ plain form
5809 -141 38 235 -36 -79 -58 95 251 21 69 -243 -95 -205 -104 207 11 -35 -145 289 146 62 -111 -52
5831 -52 125 72 192 217 99 -21 -111 107 234 -246 145 -33 146 -33 -177 36 28 -154 178 27 -98 101
5853 101 -128 159 -67 -30 -20 -132 -2 -221 -72 -49 -43 173 7 -105 47 -68 10 144 -48 -292 -152 -27
5875 -27 -147 -54 -57 -224 77 166 -48 -162 99 -65 -53 19 -150 14 87 89 -82 215 -129 -247 29 87 -54 -180
5899 -180 11 61 45 9 -111 -157 285 110 78 92 -131 59 -102 -56 139 122 -187 -10 -297 112 16 -223 48
5922 48 184 63 189 -112 -176 86 -83 59 -143 -324 57 289 -219 0 207 -15 262 58 -374 49 -79
5943 -79 109 58 -146 -77 -81 90 190 186 49 37 60 -182 -67 -193 -72 -37 41 39 -229 -25 0 -146 -111 72 -66
5968 -66 203 19 -87 -98 -152 84 171 -159 -107 -29 98 188 196 231 -215 -59 187 -57 8 -55 63 -162 463 92
$$ packed form
5809a41J79J97k71m3K1J53J56k30M8l12J48j10J01L11j96m6j10M34j43q4j73N9
5831e2J77n3J20K5j18j20r0K18J27m80L91j78J79j79j44K13qj82L32j51j25J99
5853A01k29K87k26L7J0j12J30k19J49K3OK16j66j12J52j15P8J34j92k44J40J25
5875b7j20R3lj67L01Q9k14j14K61j64J2P2j69J64P3Kj71K97l44j18K76N8j41j26
5899a80J91N0j6l6j20m6M42j75l2J4k23J90j61M6J95j7l09J77k87M09r6k39K71
5922D8J36j21J26l01o4K62j69J42k02j81L81K32n08K19K07k22K77k04m32M23j28
5943g9J88n1k04O9mJ71J00mj37j2K3k42J15j26J21L5P8kk68K04K5j46L5J83j38
5968f6K69j84j06j1n4K36Q7l30N2P8J27R0QL5m46J56K46k44O5o3J18k25O25l71
$$ plain form
5992 92 -81 223 99 308 -100 686 -30 -38 76 -84 190 -32 -219 -100 -360 472 -72 95 -576 356 118
6013 118 285 374 -279 206 -261 272 491 235 -219 495 -711 296 145 68 465 -327 -780 -236 -221 -177 454
6034 454 78 -627 -432 -241 -240 673 -175 -347 20 -56 114 223 276 232 763 -144 488 -25 -101 -137 98 -349
6056 -349 5 -202 -362 93 -23 240 92 96 35 41 49 61 218 127 152 230 135 -24 99 114 65 -12 61 135 -76 120
6082 120 -145 37 145 -123 41 271 132 102 -93 102 -85 -85 52 -76 222 -45 -5 -159 164 -88 140
6103 140 72 -351 -113 123 142 -45 200 322 236 -128 -1 139 10 123 -194 17 176 320 46 -183 -111
6124 -111 125 -4 89 30 -67 110 -309 -143 326 -579 -622 100 -134 38 36 135 -79 -106 122 269 385 -7 296
6147 296 274 -9 271 401 -710 121 -106 -222 46 515 12 -183 183 91 258 201 38 -145 -350 -14 313
$$ packed form
5992I2j73L04j24K09m08P86p16qJ14j60K74k22j87J19k60Q32n44J67o71R32k38
6013A18J67Q9o53M85m67N33K19k56m54P14j206J007j51p7L97p92m53N44J5M4O31
6034D54l76p05J95J91JR13q48j72L67p6J70J09N3m4N31r07O32n13p6l6K35m47
6056c49L54k07j60M55j16K63j48Mo1OQJ2J57r1K5P8r5j59J23J5m9p7P3P4k11J96
6082A20k65J82J08k68J64K30j39l0j95J95j87%J37j28K98k67M0j54L23k52K28
6103A40o8m23K38K36J9j87K45J22q6l64J27J40j29J13l17K11J59J44k74k29P2
6124a11K36j29R3n9r7J77m19J66M69r05m3P22k34J72kR9k14k7K28J47J16l92L03
6147B96k2k83K80J30j111Q31k27j16K68M69n03j95L66r2J67n7j63j83k05L36L27
$$ plain form
6168 313 -132 -73 -147 -51 -3 -49 114 256 167 107 223 -3 -103 -59 250 87 -159 63 205 -158 137 33 112
6191 112 99 5 -294 -143 -37 262 12 -243 93 78 149 -93 -21 -16 -101 -45 38 -9 207 290 96 -77 -377 574
6215 574 -205 -533 -1 -4 -422 -137 -528 360 476 -131 -376 -260 35 -1133 -217 -210 -471 116 262 359 972
6236 972 357 -45 -95 -778 -728 -592 266 -3 -21 299 -332 -755 -173 20 352 40 -99 -34 403 -255 336
6257 336 -89 -31 115 -151 104 -127 -29 -95 49 120 52 153 290 168 -63 69 103 -50 49 -26 -69 -218 76
6280 76 82 -125 67 -71 -153 41 -47 17 280 177 19 -116 101 -204 -192 182 -118 -97 160 1 -126 129 184
6303 184 -96 -76 -64 -152 22 -123 -210 -151 44 -52 203 -45 -210 -23 111 213 -78 -11 162 -140 -30 -179
6325 -179 -244 -61 -97 105 -50 -29 37 -188 91 102 135 210 56 -18 -129 -49 -92 -27 -301 -106 157 48 78 239
$$ packed form
6168C13m45N9p4R6M8m6J63J42q9o0J16k26j00M4L09j63k46K22J42l63K95j04P9
6191A12j3r4k99J51J06K99k50k55L36j5P1k42P2Nq5N6Q3m7K16Q3j94j73l00R51
6215E74p79l28N32lm18K85l91Q88J16o07k45J16K95j168R16Pk61N87J46R7O13
6236I72o15m02n0o83N0J36Q58k69j8L20o31m23N82J93L32l12j39O5M37o58N91
6257C36m25N8J46k66K55k31R8o6J44P1o8J01J37j22k31J32L4j53R9p5m3j49K94
6280G6Ok07J92j38q2J94q8O4K63j03j58j35K17l05J2L74l00K1K57j59j27K55N5
6303A84k80K0J2q8J74j45q7N9J95r6K55k48j65J87J34J02k91O7J73l02J10j49
6325a79o5J83l6K02j55K1O6k25K79J1L3P5j54p4j11Q0m3O5k74J95K63j09L0J61
$$ plain form
6349 239 -212 -144 179 128 386 -19 15 -222 -112 -68 98 90 129 99 -225 -1 -38 -103 18 -188 -6 -83 179 123
6373 123 334 267 131 -143 -7 -375 -27 -234 -30 38 206 -110 42 -183 102 -39 231 547 -1557 799
6393 799 64 -452 -190 -413 -682 520 -59 654 486 -1197 718 245 -1042 444 268 -462 327 -144
6411 -144 529 602 -195 -361 -234 154 490 -201 -347 -21 -165 -169 -95 -661 -165 314 -234 95 -15 203 -160
6432 -160 -51 -528 -43 -231 -359 236 -76 358 238 -51 87 -174 166 195 -99 19 537 -374 78 146 -121
6453 -121 157 54 -35 154 -41 -74 246 76 -1 -69 39 -169 160 285 153 56 346 238 -3 134 8 -92
6475 -92 145 101 -118 93 95 80 -56 1 -46 -37 -219 -91 -111 -97 308 -32 174 162 -3 39 193 51 -141 156
6499 156 -109 -27 -27 102 -105 -108 -68 -56 -361 32 -98 175 174 -344 132 -30 223 -110 72 83 215 261 -7 447
$$ packed form
6349B39m51O8L23n1K58m05L4k37J10M4J66qL9l0l24K24l7o5J21k06J82p7K62n6
6373A23K11o7j36k74J36l68L48k07K04O8J68l16J52k25K85j41K70L16k104K356
6393G99p35n16K62k23k69J202n79P13j68j683J915m73j287J486j76p30P89m71
6411a44O73P3p97j66J27L88L36o91j46L26j44mP4n66M96M79n48L29j10K18l63
6432a60J09m77M85j88j28N95l12M34j20k89J38k61L40K9k94J18N18r11M52O8k67
6453a21K78j03q9J89j95l3L20j70p7o8J08k08L29J25j32r7K90j08k41J37j26j00
6475i2K37m4k19K11Kj5j36N7m7Rj82J28k0J4M05l40K06j2j65M2J54j42j92K97
6499A56k65Q2%J29k07lM0J2l05L93j30K73jn18M76j62K53l33J82J1J32M6k68M54
$$ plain form
6523 447 -206 -69 -338 -283 -27 -182 -507 47 294 269 30 204 50 -270 116 -25 30 169 -2 155 -243
6544 -243 -540 37 248 862 216 755 -472 -13 117 373 237 -626 192 503 -51 -123 -64 743 181 -384
6564 -384 593 386 -256 -341 -596 -767 -642 53 -45 645 -76 789 -3 -71 228 51 916 116 -237 393 642
6585 642 -666 76 1239 473 793 317 658 -99 250 40 -432 -284 632 62 -103 -37 195 595 439 -154
6605 -154 424 32 -421 -867 -457 497 -192 226 -532 621 450 -559 -90 -313 -808 93 -881 61 423
6624 423 180 84 20 161 571 -513 -360 -901 24 -305 -153 -323 -123 -197 30 711 481 -312 351 -361 -395
6645 -395 -312 151 -450 1135 -476 483 -163 -185 24 -595 150 332 -1150 -792 220 431 102 107 -270 563
6665 563 87 616 391 -528 -341 -293 -69 268 24 367 260 286 622 -772 -591 -233 551 -129 186 -172
$$ packed form
6523D47o53J37k69N5K56j55l25N54K47k5k39J74j54l20L86j41N5J39j71J57l98
6544b43k97N77K11O14o46N39j227M59J30K56j36q63Q18L11n54p2N9Q07n62n65
6564c84R77k07o42q5k55j71J25O95r8O90p21Q65p92o8K99j77Q65q00l53O30K49
6585F42j308P42J163p66L20m76L41p57L49k10m72J48R16n70j65O6K32M00j56n93
6605a54N78l92m53m46M10R54o89M18p58J153j71j009M69k23m95R01r74R42L62
6624D23k43r6o4J41M10j084J53n41R25l29J52j70K00p4K27O81k30p93O63p12l4
6645c95Q3M63o01J585j611R59o46k2K09o19P45J82j482L58J012K11l29Nl77Q33
6665E63m76N29k25r19J87M8K24L37k44L43j07K6L36j394J81L58P84o80L15l58
$$ plain form
6685 -172 624 75 -473 -519 15 224 25 -319 -82 99 -19 464 240 202 128 243 -846 76 273 -600 74
6706 74 337 -335 22 59 -80 -293 240 520 -172 -347 -125 177 -63 276 -225 77 -55 24 243 -296 464
6727 464 161 81 -89 88 381 -79 -265 -156 125 156 84 22 192 -131 90 18 48 -190 -73 -71 -211 -58 -228
6750 -228 -113 -127 -41 23 -5 -23 -275 -132 181 -40 -63 -342 -38 -9 -205 287 -31 -77 282 146 -85 124 -220
6773 -220 -13 52 -156 205 26 -105 -109 -81 -112 253 -21 218 10 32 -126 16 -244 -243 318 -215 77 -272 149
6796 149 -199 -128 29 271 -217 201 16 120 158 -193 -262 288 334 593 -133 249 325 89 717 44 392 -275
6818 -275 -47 198 344 -95 -82 129 -426 -458 641 279 -33 283 109 48 -177 -543 -347 69 136 245 -187
6839 -187 508 -85 458 271 -294 422 24 -121 -104 -229 -182 -263 232 585 -647 342 -156 -458 -242 -269 -119
$$ packed form
6685a72P96n49n48m6N34K09j99l44K37J81j18M83k24l8p4J15j089R22J97q73O74
6706G4K63o72L57L7j39k13N33K80o92j75K22L02k40L39n01L02j32P9K19n39P60
6727D64l03q0j70J77K93m60j86J09K81L1p2o2J70l23K21p2L0k38J17Kj40J53j70
6750b28J15j4Q6O4k8j8k52J43L13k21k3k79L04K9j96M92l18m6L59j36k31K09l44
6773b20K07O5k08L61j79j31mK8l1L65k74K39k08K2j58J42k60JN61n33K92l49M21
6796A49l48P1J57K42m88M18j85J04L8l51o9N50M6K59p26L82P6k36O28o73L48o67
6818b75K28K45J46m39J3K11n55l2J099l62l12L16j74o1k25l66J96M16O7J09m32
6839a87O95n93N43j87n65P16l98j45J7j25M7q1M95L53j232R89m98l02K16k7J50
$$ plain form
6860 -119 290 -36 154 228 134 2 -107 222 -27 210 161 62 -207 -190 74 2 -18 413 85 -125 184 32
6882 32 19 -160 97 31 -92 -380 64 -37 79 274 34 -253 -264 -116 -362 -311 230 -119 -118 -24 -221 278 302
6905 302 -45 -165 502 -87 -345 192 -100 132 68 -488 155 227 108 -754 55 -519 273 -111 829 504 -371
6926 -371 502 -62 -563 -509 -402 -473 165 -58 572 306 -103 658 883 239 -569 444 -39 352 -145 14
6946 14 36 -87 -64 -188 454 -564 60 422 -96 317 -377 434 -567 28 -1098 338 211 -738 -448 -13
6966 -13 -523 -718 562 243 -388 -51 738 -562 -129 35 -7 272 206 116 89 -711 -281 -166 98 -819 934
6987 934 -963 720 60 905 -401 -2 -659 -96 -99 -340 179 373 462 776 567 -71 -6 -58 -523 196 -166
7008 -166 -469 -238 -46 245 -368 148 79 151 -589 -161 198 -282 21 154 160 209 -361 209 -65 -365 -47 -16
$$ packed form
6860a19M09l26J90P4r4j32j09L29k49K37m9r9k69J7K64p2k0M31l28k10L09j52
6882C2j3j79K57o6j23k88M44j01J16J95k40k87j1J48k46N1N41l49JR4j97M99K4
6905C02l47j20O67n89k58N37k92K32o4n56O43P2j19q62Q09n74P92l84R40l25q75
6926c71Q73n64n01N4J07p1O38k23O30k66m09P61K25o44q08J013m83L91m97J59
6946A4K2j23K3j24O42j018O24L62n18M13o94Q11j001N95j126J436j27r49K90M35
6966a3n10j95J280l19o31L37P89j300M33J64m2K79o6r0k7q00M30J15K64r17J753
6987I34j897J683o60Q45j306L99o57N63lk41N19J94Q9L14k09o38O5n2m65P19l62
7008a66l03K31J92K91o13N16o9P2p40M28L59m80L03J33OM9n70N70k74l00L18L1
$$ plain form
7030 -16 -422 -53 102 -163 -256 -149 203 355 66 562 315 -68 -236 -119 556 -214 -20 35 133 155 -620 -391
7052 -391 -48 -344 77 134 14 108 -64 -20 -202 99 -275 106 86 -189 6 -97 20 165 152 -322 60 -117
7074 -117 121 7 243 33 -235 -244 -14 -317 153 56 144 -383 -68 135 -179 164 -129 -147 32 126 148 63 -213
7097 -213 116 93 -220 3 -46 -62 50 -126 204 33 138 -122 12 -147 -146 115 63 204 109 -68 232 -97
7119 -97 -16 -169 36 29 75 -76 -50 4 -120 -37 40 227 -20 9 42 -109 13 116 114 69 194 42 289 88 84
7144 84 249 -121 -104 -103 -7 -82 71 111 -33 159 -1 -83 -96 -95 224 -264 201 184 -64 135 -163 60 -54 -17
7168 -17 42 44 113 119 -53 3 22 33 -70 -41 -23 -47 -184 -151 -106 -9 335 -36 67 17 -136 314 -20 -120 -26 -226
7194 -226 111 133 109 -39 169 34 -161 -98 -229 20 -14 -180 2 -39 166 59 146 136 207 -3 164 -75 -107
$$ packed form
7030a6m06L69J55k65r3J07L52J52k89M96k47l83j68J17O75p70J94N5R8K2p75K29
7052c91L43k96M21N7j20R4j72M4j82L01l74L81k0k75J95j03J17J45j3m74L82j77
7074a17K38j14K36k10k68rK30l03M70r7Q8n27L15K03l14L43k93j8J79R4K2q5k76
7097b13L29k3l13K23m9j6J12j76L30j71J05k60J34j59JK61n2J41r5j77L00l29
7119i7Q1j53K05pM6j51K6N4j24Q3P7J87k47K9L3j51J22J03km5J25j52K47k01m
7144H4J65l70J7JR6p5J53M0j44J92j60q2j3JL19m88M65j7k48J99k98K23j14L7
7168a7N9KO9Oj72N6J9J1j03K9J8k4j37L3M5R7L44l71J03n0j53M50l34j00R4k00
7194b26L37K2k4j48K08j35j95O3j31K49l4j66J82m1K05j07Q7j0P1k10J67k39l2
$$ plain form
7217 -107 107 60 106 -99 146 -122 93 -111 -162 -36 26 134 237 80 32 -77 -122 16 159 129 93 -167 -145
7240 -145 265 -18 -135 -50 -12 -13 -17 147 -8 6 -225 58 -243 -19 170 120 301 -113 -108 -237 20 80 169 155
7264 155 27 64 -140 -242 -30 41 103 35 194 -63 111 49 -35 -155 -50 188 -162 112 21 -77 -52 -205 -28
7287 -28 -10 115 5 -238 168 -115 89 78 -133 -137 -63 -120 -72 171 40 -100 -61 -150 -132 140 279 143 172 -137
7311 -137 -80 22 0 -116 -19 -24 319 -16 -248 -77 51 -102 146 118 -123 434 239 97 -27 193 129 -434
7333 -434 -43 268 98 578 -10 330 -740 -277 547 -212 -19 -216 -105 -31 -371 679 464 -15 -110 294
7353 294 303 -114 -47 515 649 -2 -365 52 -623 -556 144 -649 50 37 733 -122 -488 -236 129 -340 -213 858
7375 858 -12 -980 357 -323 387 -135 394 67 418 -11 -422 -155 436 132 -57 -962 -615 30 716 -451
$$ packed form
7217a07K14m7M6k05K45k68K15k04n1J26O2J08J03j57m8j09m5J38J43l0l6k60K2
7240a45M10k83j17Q5L8jmJ64j55J4k31K83l01K24J89n0J81m14Nj29K57O0Q9j4
7264A55j28L7k04j02K12P1O2o8J59k57J74o2q4j20J05K38l50K74r1r8K5j53J77
7287b8J8J25j10k43M06k83K04j1k11mP4n7M8K43j31j40L9q9J8K72J39j36K9l09
7311a37N7J02k2j16R7nL43l35k32J71J28j53K48k8k41N57j95j42j24K20o4n63
7333d34L91L11j70M80n88L40j070M63Q24p59J93j97J11P4l40J050k15m79r5M04
7353B94Rm17O7N62J34o51l63M17o75O7P00p93O99j3O96q55l66K52L65m69J27J071
7375H58q70r68J337o80P10n22N29l27L51m29m11K67N91l04j89r05L47O45O86j167
$$ plain form
7395 -451 216 382 322 -258 170 -281 -456 -355 -579 183 -746 421 325 198 -211 -1506 639 -31 -332 128
7415 128 -272 -266 218 292 -395 -97 -207 567 391 562 89 139 38 -119 57 67 -58 907 -264 -293 297 407
7437 407 -63 -401 -14 893 -73 667 -334 -140 401 -38 47 -96 327 103 0 -49 -34 -175 -55 -320 -1
7458 -1 -135 79 -187 -263 -517 385 52 230 -309 369 445 372 -74 -20 218 345 342 41 -45 -120 -58 183 -116 -104
7482 -104 -87 -202 328 173 145 -15 -135 149 119 126 -184 28 310 73 48 -22 219 -74 164 -187 -176 -84 92
7505 92 -35 29 130 -191 -49 -14 -154 -39 -94 5 -44 53 -28 111 177 -79 -155 19 49 34 -10 -111 -132 228 213
7530 213 38 -136 -107 -39 172 -65 19 33 270 -173 -27 364 11 -236 195 -67 160 -182 -92 27 103 -135
7552 -135 -55 97 -52 -1 79 -105 -105 -155 -182 249 212 -130 -59 178 -165 -113 -162 28 69 46 -51 -18 -52 77 58 -24
$$ packed form
7395d51O67J66o0n80M28m51j75J01k24P62r29J167r6j27m09j295K145o70l01M60
7415A28m00OM84P4o87K98j10P74j76J71m73N0j01j57J76J0j25R65j171k9N90J10
7437D07m70l38L87R07r66P40j001J94N41m39Q5j43M23k24j03m9J5j41J20k65L19
7458aj34K14k66p6k54R02l33J78n39O78P6p3m46N4K38J27ll01q6p5O2K41k99J2
7482a04J7j15N30j55k8j60j20K84l0Pl10K12K82k37k5p0K41k93K38l51J1R2J76
7505I2j27O4J01l21J42L5j40J15n5R9m9R7q1J39O6k56p6J74L0j5m4j01k1L60j5
7530B13j75j74K9O8K11k37Q4J4K37m43J46L91l53k47M31k62K27l42R0J19P6k38
7552a35Q0J52j49N1Q0j84%n0k7M31l7l42P1K37l43N2m9J90M1k3r7L3l4J29j9q2
$$ plain form
7578 -24 215 28 257 42 -82 -65 144 -32 46 46 74 266 -265 121 -145 -201 3 201 330 254 -217 -37 -174
7601 -174 -212 -166 28 -309 -150 -163 60 319 -103 -173 222 60 100 -132 -39 -187 4 -135 334 -139 -69 -121 568
7624 568 33 16 266 -387 -305 79 95 -198 -278 70 227 378 -276 -56 -484 433 -198 -373 -296 566 -6 -259
7646 -259 455 -37 -377 800 375 -146 325 -27 317 -238 -17 -33 132 -16 -73 -88 105 -169 -38 65 -115
7667 -115 187 -194 192 -91 49 271 -191 -83 2 222 -263 -146 38 94 53 107 -187 -163 -408 -51 225 -10
7689 -10 -104 102 274 -107 -162 -179 337 210 408 81 224 34 -215 -246 -286 75 213 -141 34 -27 182 -160
7711 -160 -238 -104 134 266 88 110 122 210 -554 138 94 193 -287 358 79 52 -154 60 -70 77 215 362
7733 362 17 175 162 120 127 33 -144 -74 173 -110 42 155 29 -217 293 -44 -56 -44 65 -152 286 -27 9
$$ packed form
7578b4K39j87K29k15j24J7K09j76P8%K8J92n31L86k66n6K04J98J29p6m71J80j37
7601a74l8M6J94l37J59j3K23K59m22p0L95j62M0k32R3j48J91j39M69m73P0n2O89
7624E68n35j7K50o53Q2L84J6k93q0L48J57J51o54K20m28R17o31j75P7Q62n72k53
7646b59P14m92l40J177m25n21M71l52L44n55K21j6J65j48n7j5J93k74J31J03j80
7667a15L02l81L86k83J40K22m62J08Q5K20m85J17J84N6m1N4k94K4k45L57K76k35
7689a0r4K06J72l81n5j7N16j27J98l27J43j90k49l1m0L61J38l54J75o1K09l42
7711a60p8J34K38J32j78K2J2Q8p64O92m4R9m80O45k79k7k06K14j30J47J38J47
7733C62l45J58j3m2Pr4j77P0K47k83J52J13j26k46N10l37j2J2J09k17M38l13L6
$$ plain form
7756 9 14 -146 -127 -181 -20 41 154 166 -67 -229 -1 -20 70 -69 25 -44 -108 -125 111 -83 63 3 210 188 54
7781 54 -153 241 -80 57 136 169 -277 -10 -8 200 233 44 -104 -152 92 114 228 -77 71 -128 69 384 -416
7804 -416 -103 522 187 -64 -17 387 -503 -98 -161 210 129 115 309 1018 -144 -27 119 210 -156 -53 253
7825 253 -216 217 -376 126 10 88 150 -218 -90 -153 283 14 246 128 -37 197 -61 -116 -234 -73 -77 43
7847 43 -188 -109 62 -52 -104 -53 234 127 -59 61 8 -14 367 69 129 34 -116 333 188 -139 23 -194 -79
7870 -79 -87 -256 -84 -14 80 185 28 -195 -268 -266 -17 119 35 72 246 -121 81 -315 86 19 141 -91 42 -103
7894 -103 236 143 -106 -1 258 -35 -108 22 -200 -8 30 6 159 183 155 -21 -136 249 89 28 65 -102 88
7917 88 7 33 -103 -30 134 -148 59 -309 165 17 22 -252 74 -14 33 234 -108 -169 278 -70 60 68 -73 -97
$$ packed form
7756INj60J9n4J61O1J13J2k33j62K28j9R0j39R4o9o4j7K36j94J46o0K07k2j34
7781E4k07L94l21J37P9L3m46K67KK08L3j89j48m8K44K2J14l05J48j99J97L15q00
7804d16L13O25l35k51M7M04q90M05o3L71q1j4J94P09j162J17J46R1l66J03L06
7825B53m69M33n93N02j16P8O2l68J28o3M36k69K32j18j65K34k58n5j18J61mJ20
7847D3k31P9J71j14n2N1K87j07j86J20n3k2L81k98O0r5j50M49j45l27J62k17J15
7870g9qj69J72P0R4J05j57k23p3KK49J36q4L7J74l67K02l96M01o7J22k32J33j45
7894a03L39r3k49J05K59k93p3J30k22J92L8k4J53K4k8j76j15L85j60o1L7j67J90
7917H8q1K6j36P3J64k82K07l68M74j48Nk74L26q8M7K01l42o1M47l48J30Qj41k4
$$ plain form
7941 -97 107 291 -188 46 117 -140 301 -16 -160 -134 251 -13 -29 26 256 119 62 34 121 -165 173 32 -109
7964 -109 6 67 -39 9 -59 -140 -130 -35 165 -110 218 16 -38 -51 43 203 -14 -37 260 -23 134 -186 97
7987 97 315 -104 161 -159 87 192 76 162 -239 -173 -81 210 78 -5 -42 94 150 141 -208 -37 70 173 -57
8010 -57 12 125 -11 -90 -89 187 122 -100 -218 140 -106 28 72 -28 -47 46 -265 -210 -257 -46 40 79 -71 -39 66
8035 66 -5 -47 15 128 99 -62 4 -19 -4 -25 134 47 46 251 -242 -162 -199 -180 112 -40 101 186 -35 -167 -195 48
8061 48 107 24 422 170 125 0 125 -5 -91 -149 107 -326 -99 97 53 -101 -38 -53 -109 117 -312 93 -120
8084 -120 18 430 3 99 -213 -80 68 -36 172 -52 83 90 8 201 135 -112 116 219 5 20 58 -87
8106 -87 55 110 52 32 73 66 -99 80 114 -180 -206 -54 4 172 44 -238 45 -12 -51 -164 -179 -137 -246 -188 91
$$ packed form
7941i7K04J84m79K34P1k57M41l17j44K6L85k64j6N5K30j37n7k8Q7k86L38j41j41
7964a09J15O1j06M8o8q1J0R5K00k75L28k02n4j3R4J60k17k3K97k83J57l20K83
7987I7K18m19K65l20K46J05j16Q6m01O6R2K91j32q3l7J36N6rl49J71J07J03k30
8010e7O9J13j36p9JK76o5k22j18L58k46J34M4j00j9R3l11N5m7K11Q6L9j50L2J05
8035F6p1m2O2J13k9j61O6k3J5k1J59q7jK05m93Q0l7J9K92j52J41Q5k21j32k8K43
8061D8N9q3L98k52m5j25J25j30q6n8K56m33K27J96m4j54O3j5n6K26m29M05k13
8084a20J38M12m27R6l12J33J48j04K08k24J35Pq2J93o6k47K28J03k14J5L8j45
8106h7J42N5n8k0M1pj65J79L4k94k6J52N8J68j28k82K83n7l9j13j5M2j09N8K79
$$ plain form
8131 91 129 -13 -195 29 314 -98 -156 126 -210 -37 266 93 194 196 -113 85 82 -80 504 -357 -438 239 -153
8154 -153 -73 383 234 -76 -667 -309 671 147 284 127 -20 5 -286 407 268 -230 -280 -33 191 -193 -315
8175 -315 -37 -178 -477 673 -335 700 -153 71 -455 566 717 47 250 49 -215 -369
$$ packed form
8131I1L8j42j82K24K85m12n8K82l36J73L03j73J01Kl09J98lj62N84q61q1O77l92
8154a53Q0M56j49l10n91L58R80n24J37j57j47K5k91O93j39m98n0K47K24l84j22
8175c15K78j41k99J150j008J035q53K24n26J021J51o70K03k01k64j54
8191c69
$$ Imaginary data points
##PAGE= N=2
##DATA TABLE= (X++(I..I)), XYDATA
$$ plain form
0 0 0 0 0 0 0 0 0 0 0 0 0 0 -8 8 -8 8 -8 16 -16 24 -24 32 -34 40 -48 56 -66 80 -89 104 -120 136 -154 176
34 176 -199 223 -250 282 -314 353 -392 434 -482 536 -592 656 -722 796 -877 969 -1066 1173
52 1173 -1293 1427 -1574 1743 -1932 2149 -2399 2690 -3041 3463 -3990 4665 -5566 6837 -8769
67 -8769 12095 -19380 73243 -121959 -119949 141755 -69829 -116494 101455 60137 -89251 6729
79 6729 29401 -28660 8776 63632 21956 -33174 -37417 6138 -9245 -10572 43496 7465 -53146
92 -53146 8894 -8679 -67099 38073 66144 -57148 -13553 67037 -9574 -23349 23661 -20476
104 -20476 -32145 -16910 -37986 -759 29031 -3816 9230 9016 -16733 30971 25470 -37677 -3322
117 -3322 -6153 -63861 6970 43302 -24688 21779 40979 -70034 -34062 55897 243 -2057
$$ packed form
0@%%%%%%%%%%%%qJ6j6J6j6K4l2M0m8N6o6P4q8J04j22J46j69J93k24K56k90L30
34A76l75M22m73N32n96O67p45Q26r16J018j128J248j378J518j673J846k035K239
52A173k466K720l001L317l675M081m548N089n731O504p453Q655j0231J2403j5606
67h769K0864l1475R2623j95202K010K61704k11584m6665K17949m1318j49388R5980
79F729K2672n8061L7436N4856m1676n5130m243M3555j5383j327N4068l6031o0611
92e3146O2040j7573n8420J05172K8071j23292M3595Q0590p6611j3775M7010m4137
104b0476j1669J5235k1076L7227K9790l2847J3046k14k5749M7704n501o3147L4355
117c322k831n7708P0831L6332o7990M6467J9200j11013L5972Q9959n5654k300
$$ plain form
129 -2057 48140 -10166 -32113 7411 -12692 -267 33414 -10240 -33030 -15124 -9908 26386
141 26386 40213 13633 31770 11289 -47865 -9742 14330 -26508 11772 29394 -39143 -7857
153 -7857 43699 -4091 5084 38015 -10647 -14557 9697 -18881 -1138 29367 -8843 -5937 10754
166 10754 -19509 -2544 11534 -24645 8538 34945 -14952 7070 39995 -18267 -22979 8462
178 8462 -29099 -17434 19587 -12770 -10886 18783 -7644 4340 31208 -3265 -5077 7462 -33747
191 -33747 -28684 9475 -2688 6299 14548 -17559 -6210 5754 -23515 7465 31497 -17388 -5894
204 -5894 19516 -23581 -9162 26562 -14278 -18289 8194 -24043 -16247 20577 4576 13895 30969
217 30969 -6886 -6402 9237 -26259 -15271 12998 -15017 -2916 22397 -10691 -136 27747
$$ packed form
129b057N0197n8306k1947L9524k0103J2425L3681m3654k2790J7906N216L6294
141B6386J3827k6580J8137k0481n9154L8123K4072m0838L8280J7622o8537L1286
153g857N1556m7790R175L2931m8662l910K4254k8578J7743L0505l8210K906J6691
166A0754l0263J6965J4078l6179L3183K6407m9897K2022L2925n8262m712L1441
178H462l7561J1665L7021l2357J884K9669k6427J1984K6868l4473j812J2539m1209
191c3747N063L8159j2163Q987Q249l2107J1349J1964k9269L0980K4032m8885J1494
204e894K5410m3097J4419L5724m0840m011K6483l2237P796L6824j6001R319J7074
217C0969l7855M84J5639l5496J0988K8269k8015J2101K5313l3088J0555K7883
$$ plain form
229 27747 -6832 487 27362 -14116 -13510 18302 -14755 -12765 27732 3187 -8922 11045 -11790
242 -11790 -14394 11478 3912 14866 27070 -5731 -1650 12856 -21295 -10791 18811 -14235 -14696
255 -14696 12800 -9482 44 31920 7865 3729 15626 -18965 -18758 6873 -14512 -6710 18444
268 18444 -9339 -7344 15318 -11500 -6752 18822 -9223 -7342 19582 -9504 -11143 17608 -9952
281 -9952 -18398 8388 -9054 -14686 4706 -10392 -4913 17621 2827 10033 20886 -17058 -17383
294 -17383 4119 -26389 -17037 23636 -1956 -13179 14390 -2921 -7326 19305 4916 -1247 7884
307 7884 -21302 -16284 17158 -3744 -4592 24386 -5954 -25352 3783 1071 -1558 19859 11090
320 11090 4784 7894 -13189 -2862 16970 -12214 -13723 10079 -12486 -11390 20338 8092 8118
$$ packed form
229B7747l4579P319K6875m1478O06L1812l3057J990M0497k4545j2109J9967k2835
242a1790k604K5872p566J0954J2204l2801M081J4506l4151J0504K9602l3046m61
255a4696K7496k2282R526L1876k4055m136J1897l4591K07K5631k1385P802K5154
268A8444k7783J995K2662k6818M748K5574k8045J881K6924k9086j639K8751k7560
281i952q446K6786j7442n632J9392j5098N479K2534j4794P206J0853l7944l25
294a7383K1502l0508R352M0673k5592j1223K7569j7311m405K6631j4389o163R131
307G884k9186N018L3442k0902q48K8978l0340j9398K9135k712k629K1417q769
320A1090o306L110k1083J0327J9832k9184j509K3802k2565J096L1728j2246K6
$$ plain form
333 8118 24167 -4533 -7505 15068 -14569 -17467 17808 -4214 -17155 16736 8921 -6911 6941
346 6941 -2557 -3577 11863 -5010 2039 22663 -11395 -19286 16854 -2463 -21094 9400 2523
359 2523 -18781 -1992 3734 7574 20024 5369 -1361 3384 -22008 -20673 8253 -3510 -9024
372 -9024 8374 -6777 -9178 12565 -196 1946 19249 -11337 -20779 7312 -8057 -12616 19252
385 19252 3398 -17248 1913 -6536 -13492 11593 3675 -4058 16042 2949 -9764 10100 1142
398 1142 -12312 -1068 -7326 -9740 4368 -2423 3443 19412 -1602 -45 22201 -4847 -14995
411 -14995 12285 -8899 -21231 16186 9693 -11242 13359 7670 -15367 4299 10584 -2249 8572
424 8572 7228 -4603 -150 -2846 995 10166 -5749 -8707 3007 -10694 -6263 21495 9685 882
$$ packed form
333H118J6049k8700k972K2573k9637k898L5275k2022j2941L3891p815j5832J3852
346F941r498j020J5440j6873P049K0624l4058p891L6140j9317j8631L0494o877
359B523k1304J6789N726L840J2450j4655o730M745k5392J335K8926j1763n514
372i024J7398j5151k401K1743j2761K142J7303l0586r442K8091j5369m559L1868
385A9252j5854k0646J9161q449o956K5085p918p733K0100j3093j2713J9864q958
398A142j3454J1244o258k414J4108o791N866J5969k1014J557K2246k7048j0148
411a4995K7280k1184j2332L7417o493k0935K4601n689k3037J9666O285j2833J0821
424H572j344j1831M453k696L841R171j5915k958J1714j3701M431K7758j1810q803
$$ plain form
438 882 17049 -4603 -18399 6008 -4157 -13875 11150 -1285 -16256 10155 7198 -5882 13055
451 13055 6654 -12717 13 -1145 -10005 4379 1410 -5676 5537 -3680 -10693 4473 -3094 -9192
465 -9192 9901 1598 -4957 13681 2034 -12049 3607 -5523 -17621 2959 1268 -10147 4662
478 4662 3960 -2217 12566 6400 -2763 4903 -9672 -16130 3954 -2213 -5916 15752 2940 -14476
492 -14476 7139 3600 -9278 11692 9191 -8625 3604 2925 -7561 8344 6318 -8192 2935
505 2935 -3445 -14085 6855 9866 1525 14594 8613 -6009 4147 -324 -10033 2488 -2094 -11402
519 -11402 7017 6198 -5178 10844 10045 -5131 3346 3329 -5825 2230 -937 -5055 5564 -54 -4756
534 -4756 9206 -839 -13506 4129 3412 -7436 10672 8719 -6649 3422 -2149 -12623 3049
$$ packed form
438H82J6167k1652j3796K4407j0165r718K5025j2435j4971K6411k957j3080J8937
451A3055o401j9371J2730j158q860J4384k969p086J1213r217p013J5166p567o098
465i192J9093q303o555J8638j1647j4083J5656r130j2098K0580j691j1415J4809
478D662p02o177J4783o166r163P666j4575o458K0084o167l703K1668j2812j7416
492a4476K1615l539j2878K0970k501j7816J2229o79j0486J5905k026j4510J1127
505B935o380j0640K0940L011q341J3069n981j4622J0156m471r709J2521m582r308
519a1402J8419q19j1376J6022p99j5176Q477j7r154Q055l167m118J0619n618m702
534d756J3962j0045j2667J7635p17j0848J8108j953j5368J0071n571j0474J5672
$$ plain form
547 3049 -1304 -12276 2483 986 -11061 8233 11416 -487 7401 1203 -13494 -3567 -4385 -11074
561 -11074 6692 4385 -11068 4692 6411 -11772 3408 9382 -6249 -821 3409 -4675 2236
574 2236 2417 -3481 2630 -3804 -11996 2876 2613 -6773 7656 10119 -2736 6641 6194 -5739 -387
589 -387 -3204 -12369 2473 2724 -5518 8360 8600 -5926 6050 9756 -2941 2531 2427 -8492 879
604 879 1631 -4146 9357 5085 -9116 1956 2393 -9690 5982 10038 -1472 5597 2932 -7788
618 -7788 3110 2154 -11090 -390 1186 -13101 2144 9901 -2568 5852 11572 -5118 -3305 -1149
632 -1149 -7033 -1362 -1578 -6518 3566 1294 -7607 5946 4097 -7936 1283 1681 -8879 3725
646 3725 5007 -9803 1533 3497 -11750 -98 2979 -12758 -1323 7462 -5887 1567 12254
$$ packed form
547C049m353j0972J4759j497j2047J9294L183j1903P888o198j4697R927q18o689
561a1074J7766k307j5453J5760J719j8183J5180N974j5631N428M230q084O911
574B236J81n898O111o434q192J4872k63r386J4429K463j2855R377m47j1933N352
589c87k817r165J4842K51q242J3878K40j4526J1976L706j2697N472j04j0919R371
604H79P52n777J3503m272j4201J1072M37j2083J5672M056j1510P069k665j0720
618g788J0898r56j3244J0700J576j4287J5245P757j2469Q420N720j6690J813K156
632a149n884N671k16m940J0084k272q901J3553j849j2033R219L98j0560J2604
646C725J282j4810J1336J964j5247J1652L077j5737J1435Q785j3349P454J0687
$$ plain form
659 12254 982 -2064 -1535 -7975 -4073 -1186 -5571 2533 2964 -5380 4842 5146 -1826 8301 5958
674 5958 -10789 -659 1950 -8009 4038 10407 -4101 1863 3346 -10101 1781 9123 -2282
687 -2282 3060 6252 -2881 2499 6038 -5954 968 2653 -9862 -3926 3436 -789 6100 8629 -806
702 -806 4617 4385 -5819 2 654 -8273 572 1363 -6976 6427 7853 -6535 1784 4724 -7636
717 -7636 1995 6553 -7049 2050 5286 -9869 -3200 6925 -6466 -3814 2108 -7524 -1007 8958
731 8958 -172 1968 6870 -4080 -5801 -3097 -7913 -1231 1969 -5889 -654 3217 -2554 4913 5553
746 5553 -4210 1289 501 -10976 -1264 5413 -4193 1269 4215 -7642 -100 4358 -6311 1777 8640
761 8640 -4495 -320 6921 -1749 890 3903 -7008 -4032 1590 -5098 1152 6111 -895 6193 8203
$$ packed form
659A2254j1272l046N29o440L902K887m385Q104M31q344J0222L04o972J0127k343
674E958j6747J0130K609r959J2047O369j4508N964J483j3447J1882P342j1405
687b282N342L192r133N380L539j1992O922J685j2515N936P362m225O889K529r435
702h06N423k32j0204N821O52q927Q845P91q339J3403J426j4388Q319K940j2360
717g636R631M558j3602R099L236j5155O669J0125j3391K652N922r632O517R965
731H958r130K140M902j0950j721K704m816O682L200p858N235L871n771P467O40
746E553r763N499p88j1477R712O677r606N462K946j1857P542M458j0669Q088O863
761H640j3135M175P241q670K639L013j0911K976N622o688O250M959p006P088K010
$$ plain form
776 8203 -5343 1586 6878 -7001 -4047 2915 -5094 504 6809 -2302 1918 7344 -3898 -1686
790 -1686 5834 -2254 -646 5415 -2701 -1985 3886 -1966 -1335 978 -4280 -178 1540 -3996 5650 9105
806 9105 -3100 580 4348 -7381 -3927 1602 -6493 -1636 4290 -5032 194 7072 -1554 425 5421
821 5421 -6355 -5330 2102 -4193 -2756 3455 -2256 -1492 927 -5195 -36 3092 -4622 1060 5762
836 5762 -4151 -654 5302 -4263 -2567 2355 -7250 -3931 4045 -3323 369 7715 -463 1124 6306
851 6306 -3266 -3804 2545 -3378 -3717 1650 -1431 1505 4908 -961 2268 4354 -3979 799 5307 -3910
867 -3910 246 5970 -3269 -969 5133 -4346 -2019 4729 -3674 -1074 7595 272 1103 8070 -793
882 -793 -3789 1954 -3298 -3681 1653 -2185 119 4298 -989 1843 5710 -2021 -562 3611 -5349 -3989
$$ packed form
776H203j3546O929N292j3879K954O962q009N598O305r111M220N426j1242K212
790a686P520q088J608O061q116P16N871n852O31K313n258M102J718n536R646L455
806I105j2205L680L768j1729L454N529q095M857N926r322N226O878q626J979M996
821E421j1776J025P432o295J437O211n711P64K419o122N159L128p714N682M702
836E762r913L497N956r565J696M922r605L319P976p368L692P346q178J587N182
851F306r572n38O349n923l39N367l081K936L403n869L229K086q333M778M508r217
867c910M156N724r239K300O102r479K327O748q403K600Q669p323Q31O967q863
882g93k996N743n252l83N334l838K304M179n287K832L867p731J459M173q960J360
$$ plain form
898 -3989 2982 -2752 -1167 4273 -3008 -2440 3008 -3895 -1483 4948 -2079 -1694 4711 -2130 -3096 2556
914 2556 -3136 -4195 -734 -5258 -2157 3600 -824 1643 5623 -2290 -1637 3290 -5033 -4160 2115 -4446
930 -4446 -3117 3775 -1891 -688 5790 -1462 -2734 3776 -1862 -2503 3753 -618 -1593 2436 -1631 -1586
946 -1586 2005 -2315 -1027 3653 -1971 975 6156 511 1370 4833 -3540 -3539 2217 -3508 -1841 5130
962 5130 -1232 -390 6858 995 -249 4841 -778 -2668 2092 -2480 -1951 3620 -319 -754 3101 -2109
978 -2109 -2022 3516 -1408 -335 4422 -1720 -1056 4278 -2330 -2876 3169 -3985 -5026 2581 -1600 -2514
994 -2514 5315 1921 -1368 2635 -1019 -2814 1020 -3115 -4379 648 -1581 -1343 2690 -207 -484 2192
1010 2192 -2356 -2152 1757 -2264 -1151 2943 -2743 -2563 2839 -2522 -3058 2029 -2113 -1853 3270 -441
$$ packed form
898c989O971n734J585N440p281N68N448o903K412O431p027L85O405o841r66N652
914B556n692j059L461m524L101N757m424K467L980p913O53M927q323Q73O275o561
930d446J329O892n666J203O478p252j272O510n638o41O256m371r75M029m067M5
946a586L591m320J288M680n624K946N181n645Q59L463q373JN756n725J667O971
962E130o362Q42P248n863j244N090n619j890M760m572N29N571l939m35L855n210
978b109Q7N538m924J073M757o142O64N334o608n46O045p154j041P607m181r14
994b514P829l394l289M003l654j795L834m135j264N027k229K38M033k897k77K676
1010B192m548K04L909m021J113M094n686J80N402n361n36N087m142K60N123l711
$$ plain form
1026 -441 514 5174 -1081 -1994 2991 -3245 -4514 2293 -1225 -2098 4192 972 -489 5197 1628 -1538
1042 -1538 2116 -946 -2505 2121 -278 -1040 3176 430 -854 2227 -950 -172 3868 -1092 -236 4779
1058 4779 -610 -1599 4163 -1064 -4092 1879 -1196 -3351 3053 1942 -726 3633 1868 -1203 1249
1073 1249 -1076 -2854 251 -1915 -2393 1383 -437 -39 3193 -1389 -1429 3032 -2113 -3117 2439 -1303
1089 -1303 -2747 2880 -828 -4033 1414 -602 -3523 385 -8 -1031 2297 780 -593 2054 -1916
1104 -1916 -2661 208 -3010 -2800 1869 -1261 -1039 4224 93 -1561 3673 -346 -3474 1673 -956 -3023
1120 -3023 2169 643 -2081 1964 1040 -1374 1562 -50 -775 2816 520 -558 3000 211 -1596
1135 -1596 2029 -989 -2992 1949 353 -1455 3645 2377 2 2681 1383 -1581 720 -1211 -1924
$$ packed form
1026d41R55M660o255r13M985o236j269O807l518q73O290l220j461N686l569l166
1042a538L654l062j559M626k399p62M216k746j284L081l177P78M040m960Q56N015
1058D779n389r89N762n227l028N971l075k155O404j111k668M359j765l071K452
1073A249k325j778L105k166m78L776j820L98L232m582m0M461n145j004N556l742
1089a303j444N627l708l205N447k016k921L908l93j023L328j517j373K647l970
1104a916p45K869l218K10M669l130K22N263m131j654N234m019l128N147k629k067
1120c023N192j526k724M045r24k414K936j612p25L591k296j078L558k789j807
1135a596L625l018k003M941j596j808N100j268k375K679j298k964K301j931p13
$$ plain form
1150 -1924 1580 -262 -1167 2998 433 -572 2836 -187 -2163 2187 95 -2490 1899 437 -1832
1165 -1832 1229 -116 -2625 696 -364 -1758 939 533 -490 1909 87 -1319 723 -2185 -3125
1180 -3125 545 -1635 -2693 1751 319 -975 2432 124 -2128 1295 -1170 -3507 691 -653 -2415
1195 -2415 1939 521 -2374 1488 451 -2430 891 466 -1328 1427 1034 -1134 896 -143 -1966
1210 -1966 553 -1025 -2076 1556 982 -512 3224 1467 -1108 2422 409 -2922 572 605 -2323 916
1226 916 2209 -465 1527 1805 350 1108 -73 -201 1428 -591 -769 2189 -235 -1779 2516 -287
1242 -287 -2722 1652 1056 -1830 2226 2225 -1228 1368 1005 -2410 -501 -352 -1837 100 -310 -478 2014
1259 2014 167 -549 2169 -620 -2676 1229 -580 -3463 601 765 -2522 634 1299 -2368 -274 276
$$ packed form
1150a924L504j842r05M165k565j005L408l023j976M350k092k585M389j462k269
1165a832L061j345k509L321j060j394K697m06j023K399j822j406K042k908r40
1180c125L670k180j058M444j432j294L407k308k252L423k465k337M198j344j762
1195b415M354j418k895L862j037k881L321m25j794K755l93k168K030j039j823
1210a966K519j578j051L632n74j494L736j757k575L530k013l331L494L3k928L239
1226I16J293k674J992K78j455P58j181j28J629k019j78K958k424j544M295k803
1242b87k435M374n96k886M056jl453K596l63l415J909J49j485J937m10j68K492
1259B014j847p16K718k789k056L905j809k883M064J64l287L156O65l667K094N50
$$ plain form
1275 276 -1697 -377 123 -878 1110 31 -1679 111 -908 -2187 535 -327 -2091 1962 1462 -1738
1291 -1738 1812 1176 -2138 -12 456 -2335 -773 878 -583 1221 973 -98 1200 967 -1014 1035
1307 1035 509 -1416 1661 1174 -1145 1455 833 -1401 728 753 -1051 1385 1721 -343 2033 1726 -644
1324 -644 1015 320 -1848 507 -156 -1408 1728 1247 -995 2137 1724 -1091 593 739 -1782 -43
1340 -43 676 -1241 415 955 -565 579 647 -373 3 538 -833 616 93 -653 821 -539 -2225
1357 -2225 -127 -793 -1725 280 870 -1478 972 985 -1076 745 325 -2197 -808 -184 -2170 -212 616
1374 616 -627 509 998 -611 364 154 -755 138 79 -1773 1184 1617 -1754 -489 1029 -1588 428
1391 428 1410 -1203 643 1447 -185 674 853 -1233 -15 454 -1293 25 904 534 889 1321 374 1652
$$ packed form
1275B76j973J320N00j001J988j079j710J790j019j279K722q62j764M053n00l200
1291a738L550o36l314K126M68k791J562J651j461J804k48j071J298k33j981K049
1307A035n26j925L077m87k319K600o22k234K129K5j804K436L36k064K376l07k370
1324f44J659o95k168K355o63j252L136m81k242L132m13k815J684J46k521J739
1340d3P19j917J656N40j520J144O8j020L76N35j371J449n23p46J474j360j686
1357b225K098o66r32K005N90k348K450J3k061J821m20k522J389O24j986J958Q28
1374F16j243J136M89j609R75k10r09Q93n9j852K957M33l371J265J518k617K016
1391D28R82k613J846Q04j632Q59J79k086J218M69j747J318Q79l70L55M32r47J278
$$ plain form
1409 1652 1140 -586 367 903 -1384 726 1501 -897 614 1429 -437 592 949 -1029 637 534 -922
1426 -922 1059 1559 -1072 251 870 -1606 -493 849 -894 123 923 -554 655 1101 -1109 -780
1442 -780 267 -1420 -884 159 -991 90 320 -893 136 75 -1612 68 118 -1888 118 595 -1707
1459 -1707 301 879 -1524 -657 467 -1797 -77 1036 -1081 197 1385 -831 -623 798 -829 -521
1475 -521 35 -922 8 821 -258 1291 1010 -797 432 799 -1192 61 997 -1004 507 1270 -521
1492 -521 342 1542 -472 63 867 -235 44 1179 223 420 580 -256 143 545 -1008 305 730 -767
1510 -767 620 1421 -452 384 1042 -1207 -410 423 -1568 137 1285 -797 22 1287 -475 -196 610
1527 610 -954 -330 30 -734 -229 607 -643 254 665 -1451 -1075 714 -593 -37 636 -660 -141 298
$$ packed form
1409A652n12j726R53N36k287K110P75k398J511Q15j866J029L57j978J666j03j456
1426i22J981N00k631J323O19k476J113J342j743J017Q00j477J209M46k210L29
1442g80J047j687N36J043j150J081K30j213J029o1j687J680N0k006K006M77k302
1459a707K008N78k403Q67J124k264J720J113k117J278J188k216K08J421j627L08
1475e21N56r57R30Q13j079J549k81j807J229L67j991J253R36k001J511P63j791
1492e21Q63J200k014N35Q04j102K79J135r56J97J60q36L99M02j553J313M25j497
1510g67J387Q01j873Q36O58k249P97Q33j991J705J148k082Q19J265j762K79Q06
1527F10j564O24L60p64N05Q36j250Q97M11k116L76J789j307N56O73j296N19M39
$$ plain form
1545 298 -880 -272 145 -1671 -653 404 -1095 -384 1232 -84 -208 561 -545 -613 340 -667 -204
1562 -204 244 -945 77 948 -238 11 717 -447 -226 356 -187 289 792 -259 72 793 -781 76
1580 76 1088 -359 -19 958 298 540 1100 115 689 459 -1062 154 844 -593 375 1693 -159 -52
1598 -52 1236 -88 297 576 -792 -169 416 -295 194 1003 -397 -138 709 -308 -409 945 -398 -332
1616 -332 710 -623 -405 1039 -629 -837 180 -1027 -1296 425 -53 -341 547 -86 -498 -454 -749 -64
1634 -64 322 -1050 -453 173 -746 -40 863 -168 -663 85 -877 -465 488 -607 -344 501 -611 -495 731
1653 731 -564 -106 595 -579 -575 426 -55 66 1102 -319 -91 16 -517 -278 968 -177 -253 1139
1671 1139 -790 -120 1225 670 761 621 -807 -281 1252 425 -98 1236 119 257 817 81 168 1073
$$ packed form
1545B98j178O08M17j816J018J057j499P11J616j316j24P69j106o8R53j007M63
1562b04M48j189J022Q71j186K49P06j164K21N82n43M76N03j051L31P21j574Q57
1580G6J012j447L40R77o60K42N60r85N74k30j521J216O90j437R68J318j852J07
1598e2J288j324L85K79j368O23N85p11M89Q09j400K59Q47j017j01J354j343O6
1616c32J042j333K18J444j668k08J017j207k69J721m78k88Q88o33m12M4k95O85
1634f4L86j372N97O26r19P06R03j031m95P48r62M12R53j095K63Q45j112J16J226
1653G31j295M58P01j174MJ001m81J21J036j421K28J07n33K39J246j145p6J392
1671A139j929O70J345n55R1j40j428N26J533q27n23J334j117J38N60p36Q7R05
$$ plain form
1689 1073 -255 406 587 -400 -100 701 -200 -324 461 -192 -200 1218 450 -998 517 480 709 521 -224
1708 -224 -49 690 -480 -229 676 -116 559 452 -819 -1418 242 484 367 -371 131 -71 -226 -1454 -233
1727 -233 979 -1075 -74 -16 -747 -537 1009 -305 -70 952 -1205 -1002 1026 -171 -824 312 352
1744 352 -911 331 75 222 412 -4 483 -704 -977 694 662 276 346 1357 -659 -192 1565 -72
1762 -72 -459 1217 321 -487 722 1094 -50 167 612 -399 236 219 285 80 -226 -418 272 100 220 841
1782 841 314 7 427 22 -770 806 371 -168 508 -739 -476 430 65 149 202 -185 -259 -201 -177 133 266
1803 266 -659 -651 328 54 -655 899 199 133 -723 324 163 -287 -884 -275 -839 -582 -102 292 258 -1617
1823 -1617 329 50 -398 256 -64 -355 779 -282 -1561 -225 106 4 -520 218 -415 -396 1640 559
$$ packed form
1689A073j328O61J81r87L00Q01r01j24P85o53qJ418p68j448J515l7K29j88p45
1708b24J75P39j170K51R05p92O75j07j271n99J660K42j17p38N02k02j55j228J221
1727b33J212k054J001N8p31K10J546j314K35J022k157K03K028j197o53J136M0
1744C52j263J242k56J47J90m16M87j187k73J671l2l86P0J011k016M67J757j637
1762g2l87J676q96q08J209L72j144K17M45j011O35j7O6k05l06j92O90j72J20O21
1782H41n27l07M20m05p92J576m35n39O76j247K63R06l65Q4N3l87p4N8K4L10J33
1803B66r25QR79k74p09J554p00o6q56J047j61m50n97O09n64K57M80L94l4j875
1823a617J946k79m48O54l20k91J134j061j279J336L31j02n24P38o33J9K036j081
$$ plain form
1841 559 322 -398 50 488 -516 25 878 243 -830 682 243 -46 791 301 -103 516 255 -92 904
1860 904 278 221 918 402 -439 326 562 -727 293 826 -169 39 8 -146 106 384 -24 176 -132 -297
1880 -297 376 138 -439 131 -29 -177 16 -328 173 688 -61 -438 209 -468 -639 375 306 -511 -184 222
1900 222 -97 -310 -106 -81 273 -534 -293 466 -232 -836 409 -28 -652 67 61 -115 448 -108 -397 305 -27
1921 -27 -677 145 357 -418 -130 49 -377 -139 302 231 -72 -156 -128 535 400 -229 394 -178 -302 310 423
1942 423 266 515 -103 253 366 37 174 760 -67 -24 377 69 -68 -3 601 121 290 -1 -516 400 906
1963 906 768 491 -425 145 203 274 -728 1304 630 41 -1 -64 -630 320 579 -212 -397 191 -306 43 127
1984 127 26 93 175 -538 104 878 -232 -826 -403 -61 -739 -12 -1325 -344 272 -961 727 197 -92
$$ packed form
1841E59k37p20M48M38j004N41Q53o35j073J512m39k89Q37m90m04O19k61l47R96
1860I04o26n7O97n16q41P65K36j289J020N33r95K08l1j54K52K78m08K00l08j65
1880b97O73k38n77N70j60j48J93l44N01N15p49l77O47o77j71J014o9q17L27M06
1900B22l19k13K04K5L54q07K41P59o98o04J245m37o24P19oj76N63n56k89P02l32
1921b7o50Q22K12p75K88J79m26K38M41p1l03q4K8O63j35o29O23n72j24O12J13
1942D23j57K49o18L56J13l29J37N86q27M3M01l08j37O5O04m80J69k91n15R16N06
1963I06j38k77r16N70N8P1j002K032o74n89m2o3n66R50K59p91j85N88m97L49Q4
1984A27j01O7Q2p13O42P74j110n94M23L42o78P27j313R81O16j233J688n30k89
$$ plain form
2003 -92 -196 19 -312 53 39 -362 125 -105 -662 -429 9 47 93 551 -183 -151 230 153 132 309 149 5
2025 5 -245 45 163 -7 310 544 301 -95 373 385 144 583 531 -125 -18 188 -282 -180 331 214 57
2046 57 483 285 218 265 257 -191 233 23 -63 -149 -161 -109 -260 18 411 202 -138 -37 -138 -64 174 173 -398 -381
2070 -381 -334 -566 41 0 -357 431 199 -296 -73 253 37 -19 -217 -409 -608 -525 -70 291 210 -181 -74 -122
2092 -122 -222 -543 607 24 -336 -305 -276 -217 -469 -228 -131 84 -570 164 359 156 -182 84 -64 132 253
2113 253 224 55 81 -378 -346 -182 236 624 269 206 -188 283 -175 496 -21 279 -143 -422 141 491 660
2134 660 173 -316 693 303 116 932 905 -289 501 -520 -6 38 -201 542 586 -144 27 629 215 -778
2154 -778 105 74 -1279 -71 -448 444 877 -713 -351 1086 -442 421 -810 -781 1059 -99 -495 -372
$$ packed form
2003i2j04K15l31L65j4m01M87k30n57K33M38L8M6M58p34L2L81p7k1J77j60j44
2025Ek50K90J18j70L17K34k43l96M68J2k41M39n2o56J07K06m70J02N11j17j57
2046E7M26j98o7M7qm48M24k10q6q6j2N2j51K78L93k09l40J01j01P4K38jn71J7
2070c81M7k32O07m1l57P88k32m95K23L26k16n6j98j92j99Q3M55L61q1l91J07m8
2092a22j00l21J150n83l60L1K9N9k52K41R7K15o54P34J95k03l38K66j48J96J21
2113B53k9j69K6m59L2J64M18L88l55o3l94M71m58O71n17L00m22k79N63L50J69
2134F60m87m89J009l90j87Q16k7j194P90j021N14M4k39P43M4p30J71O02m14r93
2154g78Q83l1j353J208l77Q92M33j590L62J437j528Q63j231K9J840j158l96J23
$$ plain form
2172 -372 534 44 18 500 412 -130 1018 51 -908 -14 -120 482 -425 -111 215 -422 -739 -35 -312 -668
2192 -668 -9 -10 512 -257 519 91 88 104 317 -436 -179 44 262 315 -91 130 -36 255 -224 60 285 236
2214 236 1040 474 -139 -744 153 363 3 -134 701 188 159 -5 324 -138 76 1050 -316 -156 146 -537
2234 -537 -382 296 -13 657 343 96 -1 -829 -72 -163 184 -49 -194 -41 -688 -65 60 42 316 437 225
2255 225 -231 7 68 -362 103 -360 -565 -710 170 -25 28 118 282 -365 -272 199 418 -183 -270 -517 -158 -602
2277 -602 -283 -333 -123 24 -186 39 164 427 22 381 132 -246 325 -100 -237 -343 105 -3 348 605
2297 605 490 184 -160 -98 144 -120 195 321 45 -440 438 72 217 579 301 456 -423 384 294 194 561
2318 561 -80 -184 -76 43 -570 202 876 348 -50 481 116 -94 453 163 267 -221 -802 -239 -97 -288
$$ packed form
2172c72R06m90k6M82q8n42J148r67r59Q94j06O02r07L14L26o37l17P04k77l56
2192f68O59jN22p69P76m28lJ6K13p53K57K23K18N3m06K21j66K91m79K84K25m9
2214B36Q04n66o13o05Q97K10l60j37Q35n13k9j64L29m62K14R74j366J60L02o83
2234e37J55O78l09O70l14k47r7q28P57r1L47k33j45J53o47O23J25j8K74J21k12
2255B25m56K38O1m30M65m63k05j45Q80j95N3R0J64o47R3M71K19o01q7k47L59m44
2277f02L19n0K10J47k10K25J25K63m05L59k49l78N71m25j37j06M48j08L51K57
2297F05j15l06l44O2K42k64L15J26k76m85Q78l66J45L62k78J55q79Q07r0j00L67
2318E61o41j04J08J19o13P72O74n28l98N31l65k10N47k90J04m88n81N63J42j91
$$ plain form
2338 -288 569 347 655 -57 -355 93 -399 -34 -456 -318 -339 16 -508 -412 -393 -614 -363 2 28 229 -186
2359 -186 -229 -158 -365 -57 -841 -581 -594 -37 -1187 373 957 488 4 -137 -247 -73 164 95 -229 30 -122
2380 -122 -580 -17 234 243 276 77 -50 -337 -420 742 -504 598 580 -837 -97 -324 -58 -7 -160 42 -267
2401 -267 289 801 42 -263 103 227 120 -269 -95 543 -49 -479 273 454 -43 -107 29 93 360 -768
2421 -768 18 -236 -526 -72 80 -254 -17 -571 -386 85 -142 298 81 35 -47 18 -86 -614 -816 -157 549
2442 549 226 -374 -179 92 177 -627 -684 -262 -287 -223 -479 69 -61 -87 337 116 -33 -197 -261 -142 -272 103
2464 103 124 82 -164 -285 -379 -615 74 -66 77 207 81 230 269 218 178 -153 460 -67 -290 -321 63 138 383
2487 383 315 374 83 -288 9 112 301 465 509 -431 -593 -250 228 353 11 2 -118 -11 -789 -249 891
$$ packed form
2338b88Q57k22L08p12k98M48m92L65m22J38k1L55n24R6J9k21K51L65K6K01m15
2359a86m3P1k07L08p84K60j3N57j150J560N84m69m84j41j10J74K37o9l24K59j52
2380a22m58N63K51RL3j99j27k87q3J162j246J102j8j417P40k27K66N1j53K02l09
2401b67N56N12p59l05L66J24j07l89J74O38n92m30P52J81m97o4J36O4K67j128
2421g68P86k54k90M54J52l34K37n54J85M71k27M40k17m6q2O5j04n28k02O59P06
2442E49l23o00J95K71Q5q04n7M22k5O4k56N48j30k6M24k21j49j64o4J19j30L75
2464A03K1m2k46j21r4k36O89j40J43J30j26J49L9n1m0l31O13n27k23l1L84P5K45
2487C83o8N9k91l71K97J03J89J64M4r40j62L43M78J25l42rj20J07p78N40J140
$$ plain form
2508 891 -211 -361 148 -14 -636 -401 -484 250 459 148 373 490 -200 174 -455 -384 -468 152 -349 -105 -665
2529 -665 -198 -753 375 -166 -509 -351 157 -908 -57 -249 1217 -863 -813 -576 -939 -56 -11 7 -171 630
2549 630 593 -186 306 357 -467 -156 -63 -620 -102 -25 126 618 301 -99 -259 -142 453 245 -52 -98 -176 -125
2571 -125 -11 447 287 164 -16 69 -30 133 63 354 38 442 70 -516 169 319 -239 -147 -26 -7 -24 625
2593 625 311 -170 573 -239 -297 -182 53 -426 -409 -25 151 277 371 504 630 -352 365 160 -484 64 33
2614 33 -461 -553 -321 -317 425 -45 464 201 146 223 -244 199 -168 32 -188 194 -562 -423 -525 1585 201
2635 201 1226 376 -936 417 -305 235 -129 311 -170 608 -633 -109 -861 1349 -600 -88 -448 464
2653 464 893 947 -374 548 -27 -206 93 290 -398 479 709 -700 1122 416 211 388 154 421 567
$$ packed form
2508H91j102j50N09j62o22K35q3P34K09l11K25J17o90L74o29P1q4O20n01K44n60
2529f65M67n55J128n41l43J58N08j065Q51j92J466k080N0K37l63Q83M5J8j78Q01
2549F30l7p79M92N1q24L11R3n57N18P7J51M92l17m00j60J17N95k08k97m6p8N1
2571a25J14M58j60j23j80Q5r9J63p0K91l16M04l72n86O85J50n58R2J21J9j7O49
2593F25l14m81P43q12n8J15K35m79J7L84J76J26R4J33J26r82P17k05o44N48l1
2614C3m94r2K32MP42m70N09k63n5P7m67M43l67K00k20L82p56J39j02K110j384
2635B01J025q50j312J353p22N40l64M40m81P78j241N24p52K210j949N12l60R12
2653D64M29N4j321R22n75j79K99J97o88Q77K30j409J822p06k05J77k34K67J46
$$ plain form
2672 567 -473 -61 -76 173 426 -391 -210 -570 27 -175 555 559 -216 554 -146 -644 -140 -248 87 -556 -91
2693 -91 228 573 233 -341 189 155 -62 168 140 -623 -764 -293 292 -116 72 -442 405 -298 -461 -126 -148
2714 -148 -259 -216 103 -119 44 -91 -221 -387 9 715 9 -561 676 442 712 -196 -48 -401 -74 -155
2734 -155 187 -89 -311 911 189 286 529 342 590 314 -194 375 -24 -459 109 515 -276 -17 -27 -9 -400
2755 -400 -304 107 611 -24 -23 27 -143 72 -14 236 240 58 -356 584 -145 72 590 160 -99 -185 203 -263 -266
$$ packed form
2672E67j040M12j5K49K53q17J81l60N97k02P30Mp75P70p00m98N04j08L35o43M65
2693i1L19L45l40n74N30l4k17K30k8p63j41M71N85m08J88n14Q47p03j63L35k2
2714a48j11M3L19k22J63j35j30j66L96P06p06n70J237k34K70r08J48l53L27q1
2734a55L42k76k22J222p22R7K43j87K48k76n08N69l99m35N68M06p91K59j0J8l91
2755d00R6M11N04o35JN0j70K15q6K50Mj82m14R40p29K17N18m30k59q6L88m66l
$$ [...]
8191b96
##END NTUPLES=NMR FID
##END=
