##TITLE=1H_LO4-8026m
 CDCl3,8 sc, 
 30.03.2021
##JCAMPDX= 6.0         $$ Bruker NMR JCAMP-DX V2.0
##DATA TYPE= NMR FID
##DATA CLASS= NTUPLES
##ORIGIN= UXNMR, Bruker Analytische Messtechnik GmbH
##OWNER= root
$$ XWIN-NMR		Version 3.5
$$ Tue Mar 30 12:47:54 2021 Russian Standard Time (UT+4h)  she@DPX200
##.OBSERVE FREQUENCY= 200.131506
##.OBSERVE NUCLEUS= ^1H
##.DELAY= (6, 6)
##.ACQUISITION MODE= SIMULTANEOUS
##.ACQUISITION SCHEME= undefined
##.AVERAGES= 8
##.DIGITISER RES= 18
##SPECTROMETER/DATA SYSTEM= spect
##.PULSE SEQUENCE= zg30
##.SOLVENT NAME= CDCl3
##.SHIFT REFERENCE= (INTERNAL, CDCl3, 0, 15.7039)
##AUDIT TRAIL= $$ (NUMBER, WHEN, WHO, WHERE, WHAT)
$$ ##TITLE= Audit trail, XWIN-NMR		Version 3.5
$$ ##JCAMPDX= 5.01
$$ ##ORIGIN= Bruker BioSpin GmbH
$$ ##OWNER= she
$$ F:/spectra/data/she/nmr/H-F/1/audita.txt
$$ ##AUDIT TRAIL=  $$ (NUMBER, WHEN, WHO, WHERE, WHAT)
(   1,<2021-03-30 12:46:55.12 +0400>,<she>,<DPX200>,
      <created by zg, POWCHK disabled, PULCHK disabled
       configuration hash MD5:
       00 E9 B6 7A A2 85 ED C7 34 08 36 98 17 FE 4E 26
       data hash MD5: 16K
       6B 9F A3 FE 53 49 B4 45 EE 78 67 73 E7 CD B9 FC>)
$$ ##END=
$$ 
$$ hash MD5
$$ FB 17 FF 8F 66 0F 91 5E EB 0E 26 7C ED 5D CD 13
##$RELAX= 
##$RELAX= 
##$RELAX= 
##$RELAX= 
##$RELAX= 
##$RELAX= 
$$ Bruker specific parameters
$$ --------------------------
##$DU= <F:/spectra>
##$EXPNO= 1
##$NAME= <H-F>
##$PROCNO= 1
##$TYPE= <nmr>
##$USER= <she>
##$AMP= (0..31)
100 100 100 100 100 100 100 100 100 100 100 100 100 100 100 100 100 100 
100 100 100 100 100 100 100 100 100 100 100 100 100 100 
##$AQSEQ= 0
##$AQ_mod= 1
##$AUNM= <au_zg>
##$AUTOPOS= <>
##$BF1= 200.13
##$BF2= 200.13
##$BF3= 200.13
##$BF4= 200.13
##$BF5= 200.13
##$BF6= 200.13
##$BF7= 200.13
##$BF8= 200.13
##$BYTORDA= 1
##$CFDGTYP= 0
##$CFRGTYP= 5
##$CHEMSTR= <none>
##$CNST= (0..31)
1 1 145 1 1 1 1 1 1 1 1 1 1 1 1 1 1 1 1 1 1 1 1 1 1 1 1 1 1 1 1 1 
##$CPDPRG= <>
##$CPDPRG1= <>
##$CPDPRG2= <>
##$CPDPRG3= <>
##$CPDPRG4= <mlev>
##$CPDPRG5= <mlev>
##$CPDPRG6= <mlev>
##$CPDPRG7= <mlev>
##$CPDPRG8= <mlev>
##$CPDPRGB= <>
##$CPDPRGT= <>
##$D= (0..31)
0 1.2 0 0 0 0 0 0 0 0.06 0 0.03 0 0 0 0 0.0002 0 0 0 0 0 0 0 0 0 0 0 0 
0 0 0 
##$DATE= 1617094014
##$DBL= (0..7)
120 120 120 120 120 120 120 120 
##$DBP= (0..7)
150 150 150 150 150 150 150 150 
##$DBP07= 0
##$DBPNAM0= <>
##$DBPNAM1= <>
##$DBPNAM2= <>
##$DBPNAM3= <>
##$DBPNAM4= <>
##$DBPNAM5= <>
##$DBPNAM6= <>
##$DBPNAM7= <>
##$DBPOAL= (0..7)
0.5 0.5 0.5 0.5 0.5 0.5 0.5 0.5 
##$DBPOFFS= (0..7)
0 0 0 0 0 0 0 0 
##$DE= 6
##$DECBNUC= <off>
##$DECIM= 32
##$DECNUC= <off>
##$DECSTAT= 4
##$DIGMOD= 1
##$DIGTYP= 9
##$DL= (0..7)
0 120 120 120 120 120 120 120 
##$DP= (0..7)
150 150 150 150 150 150 150 150 
##$DP07= 0
##$DPNAME0= <>
##$DPNAME1= <>
##$DPNAME2= <>
##$DPNAME3= <>
##$DPNAME4= <>
##$DPNAME5= <>
##$DPNAME6= <>
##$DPNAME7= <>
##$DPOAL= (0..7)
0.5 0.5 0.5 0.5 0.5 0.5 0.5 0.5 
##$DPOFFS= (0..7)
0 0 0 0 0 0 0 0 
##$DQDMODE= 0
##$DR= 18
##$DS= 0
##$DSLIST= <SSSSSSSSSSSSSSS>
$$ [...]
##$SUBNAM2= <"">
##$SUBNAM3= <"">
##$SUBNAM4= <"">
##$SUBNAM5= <"">
##$SUBNAM6= <"">
##$SUBNAM7= <"">
##$SUBNAM8= <"">
##$SUBNAM9= <"">
##$SW= 16.9725357007746
##$SWIBOX= (0..15)
0 0 2 0 0 0 0 0 0 0 0 0 0 0 0 0 
##$SW_h= 3396.73913043478
##$TD= 16384
##$TD0= 1
##$TE= 0
##$TE2= 300
##$TE3= 300
##$TEG= 300
##$TL= (0..7)
0 120 120 120 120 120 120 120 
##$TP= (0..7)
150 150 150 150 150 150 150 150 
##$TP07= 0
##$TPNAME0= <>
##$TPNAME1= <>
##$TPNAME2= <>
##$TPNAME3= <>
##$TPNAME4= <>
##$TPNAME5= <>
##$TPNAME6= <>
##$TPNAME7= <>
##$TPOAL= (0..7)
0.5 0.5 0.5 0.5 0.5 0.5 0.5 0.5 
##$TPOFFS= (0..7)
0 0 0 0 0 0 0 0 
##$TUNHIN= 0
##$TUNHOUT= 0
##$TUNXOUT= 0
##$USERA1= <user>
##$USERA2= <user>
##$USERA3= <user>
##$USERA4= <user>
##$USERA5= <user>
##$V9= 5
##$VALIST= <valist>
##$VCLIST= <CCCCCCCCCCCCCCC>
##$VD= 0
##$VDLIST= <DDDDDDDDDDDDDDD>
##$VPLIST= <PPPPPPPPPPPPPPP>
##$VTLIST= <TTTTTTTTTTTTTTT>
##$WBST= 1024
##$WBSW= 4
##$XGAIN= (0..3)
0 0 0 0 
##$XL= 0
##$YL= 0
##$YMAX_a= 36053
##$YMIN_a= -26276
##$ZGOPTNS= <>
##$ZL1= 120
##$ZL2= 120
##$ZL3= 120
##$ZL4= 120
##$ABSF1= 10
##$ABSF2= 0
##$ABSG= 5
##$ABSL= 3
##$ALPHA= 0
##$AQORDER= 0
##$ASSFAC= 0
##$ASSFACI= 0
##$ASSFACX= 0
##$ASSWID= 0
##$AUNMP= <proc_1d>
##$AZFE= 0.1
##$AZFW= 0.1
##$BCFW= 1
##$BC_mod= 2
##$BYTORDP= 1
##$COROFFS= 0
##$CY= 11.3945322036743
##$DATMOD= 1
##$DC= 2
##$DFILT= <>
##$DTYPP= 0
##$F1P= 15.9154993809931
##$F2P= -4.1035820241983
##$FCOR= 0.5
##$FTSIZE= 0
##$FT_mod= 4
##$GAMMA= 1
##$GB= 0.15
##$INTBC= 1
##$INTSCL= 1
##$ISEN= 128
##$LB= 0.24
##$LEV0= 0
##$LPBIN= 0
##$MAXI= 10000
##$MC2= 0
##$MEAN= 0
##$ME_mod= 0
##$MI= 1.114404
##$NCOEF= 0
##$NC_proc= 0
##$NLEV= 6
##$NOISF1= 3.799351
##$NOISF2= 2.8
##$NSP= 1
##$NTH_PI= 0
##$NZP= 0
##$OFFSET= 15.70392
##$PC= 1
##$PHC0= -11114.97
##$PHC1= 8.200933
##$PH_mod= 1
##$PKNL= yes
##$PPARMOD= 0
##$PSCAL= 0
##$PSIGN= 0
##$REVERSE= no
##$SF= 200.130013532006
##$SI= 16384
##$SIGF1= 3
##$SIGF2= 2
##$SINO= 400
##$SIOLD= 16384
##$SREGLST= <1H.CDCl3>
##$SSB= 0
##$STSI= 0
##$STSR= 0
##$SW_p= 3612.71676300578
##$SYMM= 0
##$S_DEV= 0
##$TDeff= 0
##$TDoff= 0
##$TI= <>
##$TILT= no
##$TM1= 0
##$TM2= 0
##$TOPLEV= 0
##$USERP1= <user>
##$USERP2= <user>
##$USERP3= <user>
##$USERP4= <user>
##$USERP5= <user>
##$WDW= 1
##$XDIM= 8192
##$YMAX_p= 0
##$YMIN_p= 0
$$ End of Bruker specific parameters
$$ ---------------------------------
##NTUPLES= NMR FID
##VAR_NAME=  TIME,          FID/REAL,        FID/IMAG
##SYMBOL=    X,             R,               I
##VAR_TYPE=  INDEPENDENT,   DEPENDENT,       DEPENDENT
##VAR_FORM=  AFFN,          ASDF,            ASDF
##VAR_DIM=   8192,          8192,            8192
##UNITS=     SECONDS,       ARBITRARY UNITS, ARBITRARY UNITS
##FACTOR=    0.0002944,     1,               1
##FIRST=     0,             0,               0
##LAST=      2.4114304,     0,               0
##MIN=       0,             -26276,          0
##MAX=       2.4114304,     36053,           0
$$ Real data points
##PAGE= N=1
##DATA TABLE= (X++(R..R)), XYDATA
$$ [...]
1786b04n7RJ7Q2l3k93K97j29j34J74J49%K63n41K54qp0m3M14k36k32K90q0O7J64
1811A20M4l65K55n5j15J28J29j26Q8j21M8P6J21j48L80l31n2J45O3k53K46j07
1833A70L1L65k10k86J78l0j81J02J14k97L24m1j57K76j22k22j40K95l32K67j37
1854c3P9j89n8j45L06l11J17J54j77r0mK89k37J26J98k74N1j82j51L28Q3j60J25
1877a55O7j73K8N9k33L85M5k48q4L80k90K73K81k65K50j08K8J15j1l68L02J63
1899D41l51J91jJ2j75L84m01K52K08j75j62J7j96R5J64K6k64Q2j78K16J26k60
1921E1J04j98p5p0K75j59N6lk27j39L99r8J79j3k69r5n7Q0P8J68Jl56L97k49L5
1946a85j10K04J52o9k73r2L69m6o6K4q4l8J66k12M49j25o4j89K42k26L23K24k54
$$ y = [-204, -261, -252, -235, -153, -186, -479, -182, -311, -445, -271, -122, -122, 141, -400, -146, -154, -224, -267, 147, -89, -321, -31, -111, -44, 120, 164, -201, 54, -1, -116, 12, 141, 15, 103, -18, 30, 106, 227, 79, 459, 128, 76, 221, 284, 31, 277, 170, 201, 566, 356, 70, 248, 218, 37, 139, 253, -44, 280, 239, 82, 358, 236, 14, -126, 169, -163, 104, -33, 46, -143, -201, -346, -40, -351, -234, -80, -257, -347, -351, -62, -299, -173, 25, -249, -198, -380, -531, -203, -120, -280, -155, -88, -261, -233, -174, -407, -22, 23, -225, -309, 71, -219, 54, 335, 70, 320, 212, 240, 355, 344, -24, 278, 441, 90, 281, 280, 292, 117, 501, 100, 352, 560, 385, 223, 240, 44, 139, 303, 329, 65, 147, -31, 185, 311, 51, 155, -43, -118, -188, 87, -72, -16, -19, -246, -385, 14, -84, 95, 82, -187, -282, -339, -259, -181, -13, -12, -368, 29, -220, -185, -295, -91, 61, -8, -281, -373, -4, -50, -116, -92, -176, -214, -48, -260, 189, 64, 0, -189, 53, -173, 150, 374, 120]
1969A20Q1l20K80k73K36R1k23J49r7l3J80j04J1nj10j33N93m78K45L4l8j98J11
1992A19k3j96J17P9R5k2k58KN6p2J23m1k34J23l2J70k51O7J07o0j3N0r3J74o7
2017h0q6J71l76J33J33k39M3j31rJ30L50o7j4J56k72NP9J60j51J36j01J03J51
2040B24J15j64J01o8p2K04n6j72Q3J15l7k9J7l00k7K15p6K03J86l24j71K56k30
2063gP8J32j37J50j57o1L47k50j32M06l11l9l87K64q9J50k65j80K31J04J9l09
2085d43N09k05OM4K32l36J27p2J60j37k06P6J42j99K05m5n3m2J06k09K42Q8j96
2108b06N7n1J81oL10l67K56%j95Q2L3o7k4L08k57J30J0k02P3J20j64j17L32k80
2132d4J86RK23l2j82r2N1r8m3M8J46o5j92Q6J99j06j48J00p2J20j4k43M43k98
$$ y = [120, 201, -119, 161, -112, 124, 215, -8, 141, 44, 11, 191, 87, 98, 93, -17, -150, 443, -35, 210, 244, 206, 8, 119, 96, -100, 17, 96, 191, 169, -89, -87, -31, -103, 20, -21, -255, -132, -164, 6, -245, -178, -71, -131, -144, -94, -187, -13, -80, -166, 5, -371, -238, -105, -344, -301, -432, -441, -311, 39, -28, -42, 114, -158, -153, -74, 86, -65, 71, -30, 73, 224, 339, 175, 276, 208, 136, 340, 284, 112, 195, 310, 273, 244, 261, -39, -66, 149, 73, 276, 462, 138, -33, 223, -7, 71, 203, 66, 216, 59, -2, 345, 95, -37, 369, 58, 19, -368, -104, -193, -43, -308, -488, -257, -153, -134, -443, 66, -139, -133, -89, 143, -193, -66, -138, 22, -115, -321, -245, -103, -302, -97, -142, -195, -237, -131, -340, -98, -10, -206, -149, -200, -19, -25, 285, -82, 174, 174, -21, 61, 94, 27, 3, 311, 54, 184, 194, -8, 65, 185, 21, -96, 236, -44, 142, 151, 374, 342, 160, 68, 119, 21, -22, 26, 172, 107, -85, 1, 200, 94, -54, 46, -26, 94, 80, -163, 280, -18]
2156a8J4j49Q0L4k56N2N6K2j47J23j36L04j86m9K26j98K94k02q5L02k35P3k05
2179b86K28j12oJ28J39L6l36J19J23R0j51Q1j56q3L71M4j78j07M22l27K09j13
2201A35n0K40j66k24L45j47rM4j16M1N5j12r1L33j21MK55j64k78Q5J74m19J09
2224g7K46l13o9Q3P3m9J89l61L01l4l53K78J32j98J13j02J31k79M47k93mJ96j73
2247a16j83K89j03K9ORk97J81j01oJ53j78K85J10r7K87k31j8K15r7k12q2M19o9
2271A93J3j02P9k27L22k35J48j92J29n4J26k74M07n2l57K50j68R3K39J6j49k15
2293a0K71j70M5J12k82J93q2Ok22J16J0P9j02m6j89J65K8k60M7K67j31K70j78
2316f3o4K12j46p9j61L40l10K55k33Q0N2%kk43J00L12p7r5q5K13n6k36M71j02
$$ y = [-18, -4, -153, -73, -39, -295, -243, -187, -165, -312, -189, -325, -21, -207, -256, -30, -228, 66, -136, -221, 81, -154, -81, -286, -58, -170, -176, -48, 91, 127, -209, -90, 33, 123, -28, 53, -103, -186, 185, 229, 51, -56, 366, 39, 248, 135, 85, 325, 159, -65, 280, 133, 124, 168, 52, 93, 148, 36, -55, 278, 157, 161, 416, 252, -26, 59, 233, -186, -77, 169, -144, -213, -130, -57, -106, 83, -278, 23, -11, -364, -86, 46, -152, -39, -141, -10, -289, 158, -135, -139, 57, -116, -299, -10, -113, -84, -78, -69, -366, -185, -286, -292, -139, -317, -32, 78, -19, 268, 37, 19, 234, 137, -75, -157, 262, 193, 206, 104, 183, -44, 278, 43, 191, -1, 128, 74, 200, -74, 333, 281, -76, 174, 6, 99, 338, 354, 205, -10, 261, 91, 136, 248, -34, 159, 77, 83, -139, -23, -13, 66, -36, -82, -271, -106, -78, -338, -291, -24, -155, 115, -63, -127, 85, -61, -140, -301, 39, -271, -16, -249, -169, -117, -117, -119, -362, -262, 50, -27, -122, -207, 6, -50, -286, 185, 83]
2340H3k09L85k13K7J66K3k66k6J10pM41m50K10k93L3k2L43k11OL0K12k16o1N9
2364A54j78K54L4j41j1J81l45R8o4J05n7j46O6N7Qk5L7k4j3Q5j65NR0N1l68J2
2390c00J50P4K43j41l82L4L03k70M21m10O8l3J25j04J08J8O9p3nr8J77J77k30
2413g9O4n9R4O5j6J28j47J9o8J58j42L6J3Q0p3j22J23j5J20m3j56L71j37k37L79
2438C56k98J3N3M8Q4J4j2j44j56K19j94q7J61N5k39K67k65q1L47KJ69p0m54K27
2462A5J99m43O4K71l70L42j03l2J24J21m06J01N4l54J53J88j79J22p7J52P2j84
2484a70K48j16P0q9n2L9l4K30J83k09l3R9J25l64J25L2nK11k42J29K64k89q0Q4
2508A56p8L4l8L9knJ3J83j66o7j20K58k43O8K26j64j90K68l97L89K5m27K55L45
$$ y = [83, -126, 259, 46, 73, 239, 262, -4, -30, 80, 73, 514, 64, 274, -19, 14, -8, 335, 124, 130, 160, 372, 156, 95, 154, -24, 230, 264, 123, 112, 293, -52, 46, -18, 87, 30, -116, -50, 7, 15, -10, 27, 3, -10, 75, -90, -85, 5, 56, -312, -300, -150, -76, 167, 26, -356, -322, -19, -289, 132, -278, -210, -243, -118, -222, -114, -96, -27, -100, -105, -203, -26, 151, -79, -15, -74, 20, 85, 69, 197, 50, 69, 1, 159, 17, 53, 66, 146, 73, -49, 74, 59, 179, 136, -20, 351, 214, -23, 356, 58, 71, 124, 172, 256, 270, 258, 114, -42, 177, -17, -104, 57, 112, -127, 140, -125, -206, 141, 143, 312, 242, -212, 15, 214, -229, -165, 106, -264, 78, -25, -57, 67, 188, -218, -117, -63, -417, -264, -76, -255, -133, -210, -58, 14, -170, 78, -38, 32, -57, -109, -70, -104, 126, 309, 100, 67, 166, 291, -73, 52, 84, 79, 290, 48, 177, 441, 152, 72, 156, 78, 112, 74, 113, 111, 106, 119, 302, 136, 69, -51, 207, -36, 32, 258, 94, -96, 172, -225, 164, 189, -238, 17, 362]
2532C62l51j55J49j73O7j49R3%j3K41n4j07k1j54J24Q1r2K66k67P9M6j42k64K92
2556a42J60k54L05m03J51r7J72L43Kqj60q3r7K46k54J81j40K09k64J40O4J30N1
2579B52k01Q5rO5j80k5J45L4j17N5k1K67k47k3Q5J8m23M7L40q2K03q7rj65K25
2604B32j25p9j78K34j39K94r4j26O7j88J63o9r0M8L1O1j59n6L11k14R7j94J5K88
2628A30j40J27m03K29Q9q6J49o9nN0o6k0p5J23k2On1L58k18k90P9K55j0n4m1l1
2654A4R6J12j24K3k1M9J49j61J22LK2k33P7l9K53k70L22n14J28K58k61j19L57
2677B43Q1p0j91r9J60r5Nnk0r5O6l4OJ68m5J5j57O7j20j3M5J83o0j46L4q2J2j23
2705b70J53J82j6m52K93j24j11J80K00l20L47j7k24J38J54r3Q2j79O0K96m87L12
$$ y = [362, 11, -144, 5, -168, -101, -250, -157, -157, -170, 71, 17, -90, -111, -265, -141, -60, -152, 114, -153, -74, -28, -170, -434, -142, 18, -236, 69, -334, -183, -280, -108, 235, 237, 229, 69, -14, -111, 135, -119, 62, -78, 131, -133, 7, 71, 201, 252, 51, 136, 127, 192, 12, -13, 132, 166, 49, 104, 83, 350, 103, 80, 165, 183, -240, -193, 147, 65, 268, 181, 172, 7, 232, 107, 28, -150, 84, -55, 239, 145, 19, 86, -102, 61, -8, -98, -50, -19, 42, -117, -173, 138, -76, 21, -173, -158, 130, -10, 117, -286, -57, 32, -54, 95, 26, 21, 71, 5, -15, -90, 33, 11, 17, -34, 324, 106, -184, -105, 150, 140, 86, 45, 14, 110, 222, 98, 121, 100, 149, 298, 137, 259, 262, 284, 51, 128, 89, 342, 72, 394, -120, 8, 266, 5, -114, 243, 324, 254, 63, -36, 124, 29, 34, 29, 9, -86, -20, -54, -48, 120, 75, 90, -67, 0, -120, -133, -88, 95, 35, -111, -77, -159, -147, -270, -117, 65, 49, -403, -110, -234, -345, -165, 35, -285, 62, 45, -179, -41, 113, 20, 102, -77, -17, 279, -208, 104]
2727A04j58J1J47J98j92J62m3k87o7L69Nk23L11m17q2O39l55k11K76l25N6K67
2749A85r8j28K93n3l67K69l44J26Q5K4j91K17p7P1j16j36J15Q5j21Q9J22o3m5
2772e8k0l14K54j09J44MO9J86l59J96m3K88j84l07J26o2K30r9n4K09k37Q8L3K49
2796B30o7l0j50J05r1l3J86q1J80k48J05J23P6k03Nj62K41Mj15l8J24j98m6k15
2820b98L53j6K49r7J6k84R7J53k39M31m19L8o3J78O5m6j13J31j23Mj35j13J78
2843e3J2R8k13J55n7j32J95k91K56m9J67j27p3J24L03m65J05l25M32j91J28O4
2865F3J02j38l09J83Q2R6J30k71qJ55J30l57J69q5J21M4k27K02J16k36n8k8J98
2888G4R4k9L8l02M47n5n6j40q2J08ll7m7j02K27j79K70l17p5K24j19l1nR6%j71
$$ y = [104, -54, -43, 104, 302, 110, 272, 229, -58, -125, 244, 249, 26, 337, -80, -162, 477, 122, -89, 187, -138, -82, 185, 87, -41, 252, 199, -168, 101, -243, -117, -32, -8, -199, 18, -59, 12, -104, -240, -125, -40, -161, -72, 50, -13, -58, -78, -392, -138, -247, -103, -99, -30, 156, -203, -7, -50, 238, 54, -253, -127, -189, 41, -58, -112, 97, -140, -52, -19, 230, 163, 133, -17, 88, -3, -36, 150, 69, 249, 1, 106, 229, 305, 102, 107, -55, 186, 190, 75, 37, 161, -37, -83, -298, 55, 39, 288, 191, 207, -77, 20, 173, -66, 365, -54, -16, -79, 99, 164, 118, 5, 136, 13, 17, -118, -231, -53, -41, 57, -156, -1, -58, -190, 5, -286, -30, -79, 88, -39, -112, 12, 315, -150, -45, -370, 62, -129, -1, 63, 165, 27, -282, -99, -17, 79, 209, -62, -70, 85, 215, -142, 27, -58, 63, 107, -120, 82, 198, -38, -96, -124, 74, 168, 139, 177, -125, 322, 267, 211, 71, -11, 97, 94, 57, 10, -92, 135, -44, 226, -91, -166, 58, -61, -92, -97, -1, -1, -172]
2914a72J27J14k57J49J18jn4K00m57L87j15pk70J1J95k14L01R5l41K66r4M9j14
2937h4l8J10j85K62j07N2j30L56j97K0m5j24K27L2Qo2J24j35j41M0OQ2M34m19
2961H6J48j25k22N3J33j10Q1J82j89L9J66k23J74p4j46n2Q3J15K09k93N5N3n0
2984I3j07j91Q3r4L2J14k6p1K10o9O2j33o2N9Q2k31JJ68Q7j13k65M02j76j01O0
3009a86J05j41K90k41K0R2K51j47k58O4J16r9OL25m3j61p1j13M7N8M01j81j48
3032a4lp7K09q7J72k03K45l90M31l6j57J52R3l76J66J53k02P8r8O6O7j36P0o0
3056F3j05k2j56K85M6j41n2J6L5K13m8p4l5m2M3j67J32k3n9J94oJ4o0k25K35j46
3082h5q0Q8M8k4r8o3J75k49K35k5Pn7N6J1J27LJ6P3k41K57j37J33N4l28l11M39
$$ y = [-172, -45, 69, -188, -39, 79, 78, 24, 224, -233, 154, 39, 32, -238, -227, -32, -246, 55, 150, -191, 75, -19, 30, -84, -122, -12, -197, 65, -42, 10, -120, 236, 39, 59, 14, -110, 117, 149, 157, 95, 219, 84, -57, -17, -11, 71, 505, 86, 234, 109, -113, -60, 73, -37, 44, 226, 37, 76, 242, 19, 193, 119, -27, -79, 4, 119, 328, 35, 90, 143, 93, -14, -205, -122, -216, -184, -70, -96, -167, 43, -26, 36, -97, -159, -100, -18, -249, -248, -80, 7, -106, -371, 31, -145, -246, -186, -81, -222, 68, -173, -153, -61, 190, 43, -215, -151, -35, -134, -128, 197, 154, -7, -78, -191, -144, -86, 315, 134, -14, -17, -94, 115, 28, 200, -3, 242, -148, 283, 247, 90, 242, 335, -41, 125, 278, 76, 154, 56, 122, 189, 53, 123, 63, -42, -64, -220, 65, 111, -30, -82, -66, -31, 182, 134, 60, 25, -17, 26, -141, -9, -32, -91, 103, 97, 111, 51, -174, 61, -85, -165, -77, -29, -53, -151, -214, -39, -288, -53, -78, -71, -128, -72, -61, 66, 69, 85, 158, -83, 174, 37, 170, 224, -104, -415, 24]
3108B4j3J76n7Kk28K03Jj05J65j71R7P8m7j1M9n1R3k51K86m31J74j71M91l51O2
3133A4O3p5k48J80L29l33J03j05l27J48L39l29L41l51K97j44k3q3J22K51k94o5
3155a90j54J26J73K1j3r4j91J57J38p2j27PJ68j2j08J09j57o0J73J77k54J96J00
3178A13j07kL7k30M45j83J08j94n5o9L04o9J00j87O6K02l67K53M0k4j70K22l24
3201i1J03J9K21j20k27O6N9r9j90L30N4l91N52l41J8J56o4j80J79k4M2rk37J40
3225c4Q9k74R0J35j56J49M3J55l46J98k26J09K57k16j72J32O2k02J57K03o5j27
3247c9j88N09k22j82J01k1K34o4j5o7m1J29k02J47j2O3N0q9j05j19K40K02l45
3270c6R5K5N9j97J3n2l3K59j53k3K81l56J85k7K1j44N1K35k18J27j01J22j78k09
$$ y = [24, 11, 187, 130, 132, -96, 107, 108, 3, 168, -3, 94, 172, 125, 114, 163, 112, 205, -46, 240, -191, -17, -188, 303, -48, 14, 77, 2, -246, -66, 263, -70, 33, -72, -399, -251, 88, -241, 100, -251, 46, -98, -121, -204, -82, 169, -125, -190, -344, -218, -45, -24, -37, -131, -322, -165, -27, -99, -226, -219, -51, -63, -171, -62, -219, -279, -106, 71, -183, 13, 113, 6, 4, 41, -189, 256, 73, 181, -13, -68, -137, 167, 98, 198, 11, 77, 279, -88, 165, 205, 181, 11, 233, -91, 12, 31, 252, 132, -95, -29, 30, -69, -259, 71, 125, -266, 286, -55, -37, 119, 55, -125, 54, 30, 72, 63, -174, -34, 55, -219, -129, 6, -150, -1, 42, 197, -149, 49, -177, -68, 189, -27, -199, -67, -5, -207, -50, 153, 88, -39, -227, 282, 60, -122, -21, -42, 192, 128, 113, 46, 5, 134, -68, 79, 67, 130, 180, 91, -14, -133, 107, 309, -36, 59, 84, 143, -54, -41, -93, -126, 133, -20, -43, 238, -118, 67, 40, 61, -83, -32, 203, -15, 112, 11, 133, -45, -254]
3294b54M49k26j94J79l18J59J51o7j39J01Q3o9Q4J67n0l60P1J37l6J53O4K5p9
3317C1j40L40j38j75M4J28j15K94j28p0j64J80kn5P7M8k97L5J74m3M2rN9J16k66
3342c4PJ7N1J91m28J20M15l15q7RJ69j7j12j24K14L0j33J6j40K5NK74k90J38k0
3367a9j84N5J48j48J74r5j2R3j2l32J56m5L12j90J10P2j7q7L7j12p0M11l4k60
3391d9j51O3J11j37J42j55J67l64J83%J08N9J00Qj59P3k4K47l10Q9M3k18K80P0
3415A76k67J05M7o9N9j06J6K71j06k33J23J77p1n2N2J13m25L71N4j75j03J55j47
3438c5p3P4P3j27P0J39l23J40j65K56L0j48n8Q5J94n4j23k75L39j37K0oJk4J68
3463D1k17j17J2L82j79M2j62K04J35q6j45kJ51j68M1QJ22O7j63J60r2J01q4k3
$$ y = [-254, 195, -31, -225, -46, -364, -205, -54, -121, -260, -159, -76, -145, -61, 106, 56, -304, -233, -96, -132, 21, 85, 110, 31, -109, 231, 93, -82, -38, 90, -25, 269, 141, 71, -93, 87, 85, 30, 107, 155, -142, -107, 67, 24, 66, 57, 116, 232, -34, -27, -10, 41, 232, -196, -76, 339, 24, -63, -54, 115, 98, -14, -138, 76, 106, -27, -11, -151, -126, -121, 153, -137, 1, -19, -203, -148, 0, -148, 26, -69, -81, 12, 0, -332, -176, -221, 91, -99, 11, 83, 66, -21, 16, -96, -166, 245, 211, -49, -200, -137, -26, -163, -21, -176, -9, -373, -190, -190, -82, -23, 77, 85, -74, -1, -25, 222, -88, 1, 44, -174, 106, 176, -91, 14, 61, -8, 51, -55, -39, 232, 126, -107, 16, 193, 122, 70, 122, 235, -190, 181, 235, 60, -43, 112, -35, -108, -34, 39, -88, -18, 121, -202, -62, -227, 29, 59, -89, -147, -62, 132, 78, -45, -320, 19, -118, -98, -104, -103, -127, 41, -176, -293, -281, 101, -78, -36, -198, 6, 141, 55, -90, -92, 59, -109, -68, -60, 62, 129, -34, 126, 34, 135, 51, 28]
3487B8j50L03O1k13K47j65j7K28k90J63N7k05K4J9j1j84M7PK42k91J23J36q1j25
3511d7N1j46K20j46J23R8j38k07K97l85L77j96nl5M3k2P0N5M1O1j81L25l62l7
3535a46K15r6L7J53k96m1K65J16m96L10m8j7M6M7j16k18N12m17M42j59j17j43
3557a67N91l43j85K81k18j99J08K35j07J68j04P4j05mj8L46m04K0n2L86k08J06
3579B01J1l42Q8M8O1j59K0J79K6k19k17N56k94J1n2K49j01j1j76J74j39J46K73
3602C33m62J34l9j1p1K92j21j13R5k24J46k5j14K61J4k11J9J09Q1k27K83k0k30
3625a01J05j10J19j14J14N2l25M41k21q1J69K15j91L9O8M7k66K1J22L4k26q1N6
3648a14O7JM9M8K83m95J17K98q7j60J77j04k05K96k03j36K00K5l3K54k24l19J40
$$ y = [28, -122, 181, 242, 29, 276, 111, 94, 322, 32, 195, 252, 47, 71, 90, 79, -105, -58, -51, 191, -100, 23, 159, 78, -47, 4, -142, 78, -68, 55, 153, 15, -192, 105, -280, 97, -99, -104, -139, -96, -118, -48, 7, 48, 109, -72, 253, -109, -146, 69, -27, 10, 163, -133, -174, 91, 207, -289, 21, -27, -44, 2, 49, -67, -285, 227, -190, 252, 93, -24, -167, 424, 81, -104, 177, -41, -240, -132, 103, -4, 164, 60, 134, 29, 25, 7, 353, -51, -31, -83, 303, 95, 201, 212, -130, -42, 6, 67, -92, -72, 107, 133, -86, -303, 253, -41, -30, -82, 167, 66, 55, -121, 53, -86, 60, 333, -129, 5, -34, -45, -116, 176, 55, -58, 37, -187, -41, -66, -180, 81, 95, -116, -97, 12, 93, -134, 149, 129, -101, 4, -106, 13, -101, 13, 65, -260, 181, -40, -121, 48, 263, 72, 111, 179, 226, -40, -19, 103, 137, -89, -170, -114, -47, -46, 3, 51, 334, -161, -44, 254, 167, 7, 184, 80, -125, 171, -32, -168, 32, 57, 24, 278, 54, -265, -125]
3671a25J83L7j31o5k38J51K04j63J04m1K6J63j28J29k05m1J3K23l86K97J5j49
3693a27K15k04%K70l18Q7m5j18L36k38K16J06k95L22m13K74K3J21j94j71l4K83
3715I6n4K2J0J69l87PJ72J36q1K26j71m39M43P3k27N6J55m0N1m87L78R1j14k44
3739a59k19N17j25j34L35o0k85p6K60j26j5K0L6J3k22J55J72j34O2j25nl8J33
3762b0Jn6M2j50J67J57r3o1K8k0J8J8j34K18r5L1j51J12j39K63p0J11j09m5o5
3787d2n1J67o2K7M1J4k8j13R3q2P5J89k98K08j18Q3j13j13K01J36o9k9r6J19m04
3812b65J91j9J0L05j31Q1r4j52P4r2l7J95l96K90l15K77J12M20m85N9k25o7K84
3835B0j04N6k01P2j47N04k52R4j32J28L9O2j45j67K34J80o1l7k3l3j89L58k89
$$ y = [-125, 58, 95, -36, -101, -339, -188, 16, -147, -43, -84, -58, 105, -23, 106, -99, -140, -127, 96, -290, 7, 22, -127, 88, -116, -116, 154, -164, -77, -122, -240, 96, -142, 74, 180, -115, 207, -206, 68, 91, 212, 18, -153, -187, 96, 42, 64, 74, 243, -144, -137, 35, 171, 90, 316, 145, -294, 149, 222, -5, 51, 206, 166, 217, -270, 108, 199, 85, -159, -378, 139, 14, -120, 215, 155, -130, -206, 54, -72, -87, -67, -31, -18, -240, -85, 87, -47, 15, -110, -115, -153, -20, -19, -75, -33, -183, -16, 141, 48, -13, 15, -5, 13, 31, -103, 115, 20, 51, -100, 12, -127, 136, 66, 177, 68, 23, -42, -93, 74, 12, 39, 80, 94, 66, -47, 46, -36, 39, 228, -70, 138, 20, 103, -10, -123, 78, 214, 145, 116, 20, 139, -265, -74, -93, -83, 222, 91, 172, 78, -74, 0, -92, -129, 66, -330, -40, -355, -78, 34, 454, -31, 28, -197, -264, 20, -84, -28, -229, -157, -304, 200, -52, 42, -90, 38, 77, 139, -6, -173, 61, 241, 180, 143, 120, 87, -102, 256, -33]
3858c3N5j64K21M2q1k6Qm0m13O46j33o4O4L6K1j64O3J28j93N4j15K09o8K88l36
3883Ek0l6J32l2p8J87j10J62l76J05K21P2j69j18l5N0o4R2o8nJ24j26m4P6j6p8
3909a49L35j68j31p3N7J7R3l8kq3K30n3k7j65J6M6L3J08m9l8J43o8k38R5J55M8
3935I4K3j78m9K39k27J51p9J37j5q9j9J7J5Q8P8k10m3P9L3J26j48rK64k88J04
3960I4j56M1J30j96q6L68j63L2k41J36k3J61J0q6K03M6k44j74R2K76l82K05k64
3983b21m6J36K74k28p1J07R9j10m4j01K11l3J94q4k25k5M29j42k6j67J71J73o0
4006B11l59J14K94j68j59K24j80K40l91R7K52l74K48j53K5l9J98k10J2K76l96
4027b38J1L76J1k91K98k43J14k22RqJ20Q2J95l01r2J84r9k25L99j06k4o1J35L9
$$ y = [-33, 22, -142, 79, 121, 40, 14, 22, -18, -431, 215, 82, 18, 82, 118, 139, -25, 38, 166, -27, 27, -88, 121, 53, 341, 5, -15, -51, 81, 49, -29, 158, 48, 210, -166, -61, 160, 232, 63, -55, -90, -40, -104, -12, -80, -85, 39, -87, -131, -55, -71, -149, 186, 18, -113, -186, -129, -112, -19, -57, -59, -142, 88, 35, 8, -157, -141, -95, -62, 46, -3, -41, 102, 34, -204, -109, 46, 94, 117, -61, -110, 129, -98, 53, -26, 111, 96, 7, -12, 5, 20, 108, 186, -24, -67, 12, 45, 171, 23, 14, 278, -10, 94, -62, -21, 109, -87, -173, 195, 32, 64, -177, -41, -64, 97, 107, 21, 224, 270, 26, -148, -56, 220, -162, 43, -221, -267, -131, 143, -85, -156, -49, 50, -60, -104, -205, 6, -27, 167, 83, -142, -167, 262, 120, 94, -73, 98, 271, 211, -148, -34, 260, 92, -67, 157, -23, 217, -174, -77, 175, -199, 49, -104, -79, -118, 80, -130, -118, 158, -238, -227, 149, 160, -131, 167, -76, 38, -184, -175, -183, -63, 19, 214, -87, -179, 5, -94, -319, 80, -26, -50, -111, 24, 63]
4051F3k74J43R9J27m72N72k40L0l48K61k34M42J2k67P1j55Q6n7j33J00N2K59k05
4074f8O5J14k28J42J04j94k2N3l4J86k22M6L89j89M6j63m4k55K54L69m05O8N1
4097F3q3P6O5j22j27K43j76J27q6L1KN2K8J39l99J74j43r6L08m6j3M1j39J03O5
4122H7k20K07l1j67nK82m3L0l19J66K12k30J17q0o9Q5k4QQk06K35m7n6K08l79
4147b31N35j62j19n4P2k5rj2J02m6m8K4L4q5L1j48K55j12j56L48l45K67j18K18
4171B16o6j0j30J91j98J47p3Pn6J91l66L49k82J17j40J25N6j5j32j51L75k26N6
4194a5r5L07m23J13J22j7k1Ol31K74k42J07KP2J81Q7l68K53K7O2l30J83J44L3
4218A31j67J10j73J33m8o8K30k94L36l5p9j18L99m30J67k17m5L42j21j38J69j62
$$ y = [63, -211, -68, 31, 158, -314, 258, 18, 48, -300, -39, -273, 169, 181, -86, -15, -170, -84, -141, -274, -174, -122, 137, -68, -3, 111, -117, 25, 129, -65, -87, -34, -68, 118, -104, -58, 331, 142, 188, 25, -19, -274, -20, 349, -56, 12, 63, -20, 56, 121, -1, -128, 115, -61, 66, -20, 11, 13, 65, 93, 232, -167, 7, -136, -232, 76, 30, 17, 58, -81, 22, 87, -133, 74, 43, -124, -129, 153, 110, 140, -179, -13, 199, -31, 86, 6, -63, 22, -2, 6, 14, -192, 43, -4, -60, 148, -231, 304, 142, 23, -31, 41, 16, 7, -5, 97, 51, 3, 27, 61, -24, 7, -141, 114, 2, -154, 194, -151, 116, -2, 216, 150, 140, 10, 201, 3, 150, 77, 84, 28, 219, -147, 202, -80, 37, -103, 22, 78, 63, -69, -220, 155, -71, -15, -110, 197, -226, -113, 9, -8, -29, -23, -354, -80, -322, -215, -213, -141, 40, 127, -241, 12, 39, 101, -229, -46, 98, 131, -36, 74, -99, 34, -14, -82, 148, -146, 190, 155, 76, -42, 357, -73, 94, -123, -168, 174, 53, -85, 84, -78]
4240g8l43K03L25P4k92K35r1M4j07R2j50K10q7J64k36M21k29j39k7j91L35j19
4262A4J57j46K04k2J4k67J30Q1k27J22j38J98k34J73j65J96l5O1r4rK4q3J06k15
4286a55j18M10Q7j48M3k12L37m72L4J62L5o9L08j52j24j27K67j39p1J96k65L35
4308A62j07m2P3j62j39K41j50J3j13L23m8r9L17k69J9K78m41J28J40K52k34J2
4330A54j91K1J09J21k87J87j24q3K65m72K53K08k3p3j82L91q9j18J84m3p3m09
4352b74L90j63oR6lk14J45q0o8P2r1o6K54N5M7j26j61K38m5j38J95K3PL7P2m8
4378A48l72K49K15l55J79p1J09j49N1l00K53L0j8M6jR8j34j01J87k71K02m30L64
4401g1O3J35r2M4J42l48R4J02r1L4q9Q5K04K0l32J24J49k62o7m8J18l0k3J77p0
$$ y = [-78, -421, -218, 107, 181, -111, 124, 33, 77, -30, 62, -88, 122, 35, 199, -37, 384, 155, 16, -11, -202, 133, 14, 171, 25, 229, 207, 221, -46, 84, 165, -62, 60, -78, 120, -114, 59, -106, 90, 55, 116, 22, 13, 37, -46, 60, -155, -273, 137, 224, 76, 119, -93, 244, -228, -194, -32, 3, -66, 242, 90, -34, -161, 106, -33, -104, 92, -173, 162, 55, 13, 86, -76, -215, 26, -124, -111, -224, 99, 51, -48, 269, 0, 19, 297, -144, -16, 124, 376, 142, 154, -37, -16, 93, 214, -73, 114, -10, -93, 172, -300, -47, 161, 138, 65, -117, 274, 185, 67, 251, 208, 135, -274, 116, -47, -53, 43, 40, -174, -29, -109, -177, -105, -196, -262, -8, 47, 94, -32, -193, 45, 0, -138, 57, 80, 87, 124, 196, 148, -224, 25, 240, -115, 64, -7, 102, -47, 4, -296, -43, -13, -31, 15, 14, 112, -22, -123, 64, -207, -5, -435, -71, -8, 127, 35, 79, 221, -127, -33, 69, -22, 12, -77, 8, 212, 232, -100, 24, 173, -89, -156, -204, -86, -116, -139, 38, -32]
4426c2J33%K2J5m89K90J53j43R8p8j18M12k47O2l9k2J96m36K57k98K58l5k31M13
4450A41r3j61K81j58j93P9q4K07j94K54L2j12o5J03L3J90j04j94M1K2N5J34j59
4473E5J12Q4kn01L77k62K18J17k12K39j76J49j66N9l73K08K10l33P9J73k2l7N8
4496E4n4k07J34r8J48K2j07J28o0j08l5J36k30R9J21j27L20o8M7m44L79j61J30
4519A9k85K19J0j96R5P3R8J76j73j2R0k79L65k47j18K83K9k24j69L62k28n2K20
4542E6j39K4L58k92J30j97M1j39J21r3L04j44j24L1R0j78K19K5q5O3J98l32P1
4565HJ18M8l09Pj17O1J59J49l0j3o2k67Q0J80p0P7o0M6j88J69J0j3j85N3K56l68
4591b61K77kl3OJ2r7m1L05l11k7L24j82J38j98J75J5k6k4p5Pl3m4J43L23k20P0
$$ y = [-32, 101, 101, 123, 138, -351, -61, 92, -51, 47, -31, -149, 263, 16, 78, 39, 17, 213, -223, 34, -264, -6, -41, -272, 141, 48, -113, 168, 10, -183, -104, -188, 19, -175, 79, 111, -1, -66, 37, 70, 260, 156, -38, 3, 25, 80, 214, 55, 167, 251, 249, -252, 125, -137, 81, 198, -14, 225, 49, 198, 32, 91, -282, -74, 136, -197, -118, 55, 33, -4, 54, 0, -207, -73, -171, -23, -1, -108, 20, -40, -148, -183, -47, -277, -178, -57, -184, 136, 68, 115, -329, 50, -111, 19, -266, -47, -37, -233, -138, -65, 33, 209, 36, 24, 114, -165, 200, -47, -165, 118, 147, -77, -246, 116, -112, -164, 56, -83, -59, 299, 7, 137, -60, -19, -158, -37, -130, 174, 30, -94, -63, 27, -151, 68, 93, 8, 71, 269, -63, 8, 126, 174, -135, -128, -245, -184, -25, 124, 94, 81, 19, -248, -168, 12, -58, 19, -41, 5, -183, -14, -4, -17, -202, -149, 107, -261, 16, 14, -19, -13, -1, -98, -139, 166, -145, -172, 152, -30, 108, -90, 85, 100, 74, 50, -25, -18, -51, -95, 48, 371, 151, 221]
4617B21k63n7M08m11J60Nr7K00j39j04Q8K98l33P0j17J00r5J44j62J9R5Q6m0j48
4641g2N2J17k10J90L68l96l8K08k62J57q3j02mL3J71j15q5j56K48J85k58k8k2
4664a02J90k4j55j40J30p0J29R0kk06J5R0L3j32M8o1K12m4l18O3L96j74J53k2
4688I9n1J8p2j47J93k12J83P7J65l89K57J37j33j02n8j6p2k4J58j12j50K61J48
4711A58j24n4j29k1L27k68L46j06k76P8Q4J00l1k58p4K32J69o8k45O3l2K28Ll6
4735F6J6m1r7N7r0J66J31k36L0P6p7J2l36K50J0k8M6J56j10jK45m19J04kj5J8
4761f9K13n3K7j00L7q9P5m21K31J81m7m8m1K26p0K99n87L76pj75j80L75r4o5N9
4786E3k01L29k66K07j62J59k06Pj32J70j10NJ33N9k66K67j79K96r7k00J85j65
$$ y = [221, -42, -99, 309, -102, 58, 63, -34, 166, 27, -77, 11, 309, -24, 46, -71, 29, -66, 78, -84, -65, 30, 116, 76, -72, -20, 97, -113, 77, 445, 49, 11, 219, -43, 114, 31, -71, -75, -42, 129, 14, -71, -227, 21, 206, -52, -80, -102, 88, 64, -91, -231, -101, -171, -42, 48, 46, -160, -145, -55, -22, -154, -106, -167, 45, 1, -317, -254, 142, -32, 121, 99, 48, 66, -6, -153, 40, -172, 11, 88, 253, -136, 121, 258, 125, 23, -35, -51, -123, -147, 11, -101, -251, 10, 158, 34, -20, -149, -170, 157, -111, 235, 129, -147, -69, 15, 115, 84, -174, -248, -16, 153, 85, -160, -97, -129, 99, 102, 66, 82, 41, -56, 1, -89, 77, 208, -28, 2, 78, 1, 13, -323, -73, -63, -91, -45, 111, 1, 0, 245, -174, -70, -72, -87, -69, 144, 91, 118, 18, 55, -34, 41, -380, -149, 32, -15, -63, -104, 122, 52, 351, -236, 140, 133, -42, -222, 153, 59, -6, 53, -148, 181, -85, 122, -40, 119, -87, -80, -212, -42, -152, -147, -14, 45, -221, 46, -133, 163, 66, -134, 51, -114]
4808a14O2j14J43j41K22r3k83K07J07K0j64J97J76k24k39N8M1R7J23r3J86j02
4830G2k06J80j25K17q0j32Q8J71k11r9K94J16l88l0K09m1k79k0J91L8K24m83N01
4853B07j46m2r8M2J64n6J02j77o2KQ9J21k74M3J18o7J86j66j01J59k05J17J71
4876A27j50kk7N0q9j00K16Mj15N4O5j38K40j90J29j79J03k27K27K66l33R1j68
4899a46Q8k8J29J05k45J25l9j3J50k5j15J50j39q8%R8n3J2M7l62M92J1r6k38L05
4924A25p9L50j27k59J48k31Q5rj07L4O2O5p7R3Qj28j9J86j87J6j8j4k2p5j23L68
4950F5p7Q4k11L57l56J71q6k01L3M45l04K54j16l29J03K49k31N7J1m8J31J37q3
4973E5j16R5jK13q9j5l83J15J16J07r3N8j12K99k03k81L38ro8P5j97K47o6k31
$$ y = [-114, -52, -166, -23, -164, 58, -35, -318, -111, -4, 16, -148, 49, 225, 1, -238, -180, -139, -42, 81, -12, 174, 72, -134, 46, -79, 138, 58, -74, 14, 185, -26, -125, 169, 285, -103, -133, 76, 35, -244, -264, -73, -35, 189, -294, 207, 61, 19, -79, -37, 127, 71, 173, -4, -66, -64, 25, 146, -128, -85, 33, -34, 152, -14, -115, 44, -161, -44, 127, -23, -25, -52, -2, -91, -191, 25, 29, -86, -32, 33, -105, 135, -55, 74, -105, -2, -229, -2, 264, -69, 22, -146, -58, -86, 43, 148, -97, 28, -11, -24, 126, 101, -14, 136, -3, -91, -91, 7, -46, -34, 13, -349, 143, 154, 58, -180, 125, 46, 396, 269, 10, 158, -73, 12, 3, -104, -70, -8, 57, -20, 73, 81, -47, -66, 120, -67, -51, -69, -83, -105, -180, -303, 65, -12, 72, -139, 218, -138, 33, -53, -254, -221, 224, -80, 174, 58, -271, -168, 81, -150, -93, -82, -130, 1, 138, 55, -61, 34, 33, 246, 157, 142, -241, -126, -10, 97, 4, 62, -50, 249, 46, -235, 103, 94, 26, 101, -96, 151, 85, -146]
4997a46n4L38K02m52J71m3K5j38J73m0j32n0L7j15M83k16j60J96J77j09r5j9o0
5020b7R6k0n7M0J24l38J61k32M6L01k59P6L6m9k8J38J01k04K01j09p9J52J42l28
5044a16L2M7Lj47J57k18L97j21k70j24L75L8k68K86j35j75K61j7J09J4O7k09m5
5067e9k31L63J10l58L74k05J00j29j73R4ON4K31j78O2K7n6J19K7j26J02j94J25
5090H5M1j84j36J93j04P5j40N7K66j39l9N7P3Jq7l35K71K2m0K64k64j15J71k2
5114b9R1j22m5j13L98j53p3J21j29j33O7R7J41k52M9L1pP5j80L70n4k37M8J34
5138I5J1n2j24mN7r2L19j39q9K02k03j3j43J49J88j26q7m9P3j57L47p5k38J67
5162A7Q7l04J55K70m41L29q1j64R1P7J34l37M4N0R4j43K58Q6k07q6j30K10k24
$$ y = [-146, -200, 138, 340, -112, 59, 16, 41, -97, 76, 36, -96, -146, -109, -224, 259, 43, -117, 79, 256, 147, 52, 33, -27, 69, 49, -8, 32, 156, -182, -21, -253, -207, 94, -165, -89, -53, -102, -130, 8, 109, -95, 106, -3, -82, 70, 212, -116, -84, -37, -34, -181, -24, -242, 155, 34, -236, -360, 15, 53, -215, 71, -64, -239, 22, 5, 114, 128, 195, -14, -59, -290, 73, 183, -175, 199, -6, 94, -35, -208, -114, -108, -54, 177, -1, 61, 88, 32, 151, 178, 52, 154, -40, 85, 126, -58, -194, -1, -105, -30, -170, -113, 153, 14, -25, 32, 105, 106, 19, -316, -45, -23, -63, 201, -63, -178, -7, -29, 62, -60, -105, -218, 180, 27, -46, 75, -54, -187, -120, -23, 118, -134, -85, -54, -61, 14, -166, 204, 150, -87, -39, 95, 106, 54, -70, -74, -17, -109, 210, 71, -18, 184, -19, -32, -175, -26, 162, 36, -51, -100, -27, -184, 163, 88, -150, 17, 104, -200, -45, 225, -216, 113, 32, -132, -41, 36, 170, -167, -123, -73, 21, -122, 136, 222, 15, -71, -201, 9, -215]
5185b15J47M5Q5J11j92j32O4K20j48k5o4j6M4J0l7J21j90N1r3q5M17m5q7m0j04
5210a58J30P1j40J04L2R7j12pJ42J53l70J81l51J65R8l35M98k68K52k2j34j96
5232a70P9L46k31m6K06j28QM0k49J52n4j3Nk15Q3J20N0K58l67m0j15J51J9L10
5256A99j16N3k83r5j6K14j60M64q8j91L5K52m7m94L2L14mk30J32K4k11P0K14j22
5280e4J6j07J71j03n7J02K45k44J38l20M1L3J30Q9r6j26K66ll59J34L6J10p8r0
5304a26P4n6L18J01k50K3k43J32J60k86m4J15M0K93k87k9O0l9J71k44K99k50p8
5327a46L19j54ON1n1R3j42J21l26L21o0K4j34mQ5J06j74K95l47J30r3p8J41J59
5351A42j47J41k35r6J30j15J26Q5Q4mo8n1M9q7K66n1j0k35J90M4m2j12J5J33l73
$$ y = [-215, -68, -23, 62, 173, -19, -151, -87, 133, -15, -40, -104, -120, -76, -66, -103, 18, -172, -121, -214, -299, 118, 73, -14, -54, -158, -28, 43, -97, 7, 39, 136, 24, 17, 159, 312, -58, 123, -228, -63, 35, -300, 198, -70, 182, 160, 26, -170, -91, 255, 24, -22, 184, 56, 64, 104, -145, 7, -47, -60, -55, -270, -187, -67, -17, 241, -126, -166, -281, -130, -111, 199, 83, 136, -147, -242, -258, -44, -204, 260, 172, -19, 16, 268, 221, -273, -241, 73, 69, -161, -29, -5, -216, -146, 68, -54, -38, -145, 26, -77, -134, -32, 213, -31, 107, -213, -172, -139, -9, 80, -16, -142, 124, 121, -238, -104, -68, 42, -36, -126, -52, -108, 210, 311, 61, 84, -159, -27, 133, -153, -197, -82, -42, 251, -36, -65, -5, -44, 127, -117, 182, -68, -146, 173, 19, 25, 76, 25, 118, -24, 97, -229, 92, 32, 56, -78, -82, 3, 109, -65, 230, -117, 13, -80, -158, -17, 142, -5, 136, -99, -195, -65, -180, -54, 31, 115, 111, 43, -8, 41, -46, 220, 169, 159, -76, 114, 158, 116, 4, 19, 152, -221]
5376b21J14J90k38J85m8P9j07R5K30k40j91q7J12J12j43K78j47N3m20K71J20l08
5398c11K09j09K24k81L53l28L13j22K71l47nk4K72j37j68J04J24O0l10K03L8J47
5420A76k30QJ04n9L2r0J83j86L1j24J9J77j95K03k48L56k08k31K60J16k0j12%
5443c8N1q5J80j72J96l3q9J26q1q2J81j41K12l29Q9l9R2j66K61p2j31o4q9L51
5467A28k5j29Q0m9o1K07l92L07j63L0L1j03L7J56j40K90L1k15j26p3J01P8o2l3
5491i5k5j21n9M91k25j69K11k40K57j08J33k13J83j17J95k09J14k30K57mj31J2
5513i3J23J5l5L3j1K43j69J1r4R7O4j38j56K50r7Q1J51l00r5M6J55O0M2J6j32
5538F7j73J82j79Q4o7J77m3l1O2j5k85M89j87k57J25j98M03j46j66J67k84q0M18
$$ y = [-221, -107, 83, -155, 30, -18, 61, -46, 49, 279, 39, -152, -239, -127, -15, -158, 120, -27, 26, -394, -123, -3, -311, -102, -211, 13, -268, 85, -243, 70, -52, 219, -128, -133, -157, 115, -22, -190, -86, 38, 98, -212, -9, 29, 176, -54, -46, 58, -1, 31, -59, 124, -62, -31, -155, -136, 41, -154, 49, -199, 157, -51, -282, -22, 94, 74, -38, -38, 13, -72, 108, -64, 132, 99, 10, 136, 55, -27, 154, 13, 225, -104, -15, -54, 38, -128, 133, 61, -70, -134, -223, 128, 103, -26, 54, 5, -56, 151, -241, 66, -97, -67, -36, -139, -102, 54, -86, 204, 235, 20, -106, -179, -78, 0, -62, -95, -120, -241, -300, 191, -34, -203, 8, -232, 25, -83, 50, -163, 20, -97, 98, -111, 3, -227, 30, 26, -105, -93, 30, 45, 10, 43, 32, 275, 106, 117, 23, 120, 184, 46, -110, 140, 43, 124, 275, -25, -120, -74, 81, 141, 183, 199, 67, -106, 76, -103, -19, -86, 91, 48, 17, 79, 64, -221, 268, 81, -176, -51, -249, 154, 8, -158, 9, -275, -355, 63]
5561F3r1J19J55l15n4j14J98J35p3J08j92L1o6k4N3M4j17j23K92qj64J6K60k13
5585h0n8k2J21J14J6r5J08j49m6J52MK16l15J18l2m1Rm1LQ7l6j05J43J00l48K02
5611B5o9J71j47rN4p5N2k79K18J20lj49J3RN9J87j49J8q7j78K87Kr4K32k16R0
5637H2j1k09K07p9k08J07o9o0L61j49J3K30l10J63p0%L7j44J31k30L5L49k65K19
5661A30j82j27J07J67r1j05N0J98Lj41N2j16j1J67j3R3k83J21k26L53lJ3j25J72
5685B03l81L65k1k49J00l5J92m9J50l90K03K6P4J1k83K2L09l94J87l8K04k13k
5708ik42L1L50j54J75k68K50m35L02r1N4oP1M2J19j07m0j97r6K17Q1k4J2n0n6
5733g1J05M2j38o5M2M1N6l0pk01J59j5J06j00J74N7j25j2q6J21o4R8j57m2J64
$$ y = [63, -28, 91, 246, -69, -123, -237, -39, 96, 23, 131, -61, -30, -96, -120, -67, -23, -140, -263, 29, 21, -143, -127, 133, -80, -138, -160, -39, 75, 91, -4, 104, -45, -91, 61, 65, 281, -34, 84, 52, 11, 20, -21, -18, 69, 33, -72, 71, 171, -177, 25, -44, 127, -20, -29, 25, -50, 2, -277, -59, 61, 58, -91, -78, -69, -10, 177, 28, 46, -41, -219, 68, 70, -24, 208, -8, 82, 71, -138, 69, -10, -218, -111, -180, -240, 121, -28, -15, 215, -95, 68, -2, -2, 35, -109, 22, -208, -173, 176, -89, 130, -52, -179, -72, 95, 4, -101, -51, 147, 150, 9, 61, -55, -66, 101, 88, 181, -102, 19, -207, 146, 143, 156, 31, 203, -178, 187, 166, -83, 17, -18, 174, 125, 275, -115, 88, 114, 188, 199, -84, -62, 247, -147, 40, 2, 206, -7, -9, -251, -220, 130, -24, 151, -117, 133, -302, 0, -91, -37, -43, 28, 70, 189, 82, 42, -155, -251, -34, 47, 23, 35, -15, -71, 34, 76, -62, -127, -85, -44, 12, -18, -25, -226, -67, -82, 24, -76, 98, 155, 30, 18, -68, 53, -11, 87, -70, -112, 52]
5758E2k5M5j69J78j09j99N47l28J71k23K21j46L6K85p6l29l3L61k65m1R5O9mj74
5782f1pP7j6J18j92J24j65L39l10q9Q7P4M0k1n9n5j1j27J71J99l50N95m14o3J35
5807A9J91k63J58j32R0k84L82j98j85M00j65J0Q4M3k35R6K22j85l07M39k51Q1
5829A0N7n1J66k42j15M7K94J9k43j31K6J57J59j84O4P3j13J71k33L71l00J47K15
5852C64l47rj58j27L37k42kK86j39j56J16J96j2j84K34l16J79n3L9q5q4L4K54
5875A25nj19n0J36o5K0p6k2j06K05j70M5P5m7n4M9p6J87k45L65O4j43k75J19J58
5900I5r9kO8j6L4k48J42K11k00l7L4p4n9J75R6k18K1QR9l3k13K84o0k15J91K5
5926IJ29p2Q3j31J51J10k11j52J09r2K03K55l21J67n3k78j93K12J12O9k85k9J69
$$ y = [52, 27, 72, -97, 81, -28, -227, 320, -8, 163, -60, 161, 15, 51, 336, 260, -69, -102, 259, -6, -47, 48, 117, 113, -61, -68, 9, -7, 111, -81, 43, -122, 217, -93, -182, -95, -21, 19, -2, -61, -116, -127, -254, -83, 116, -234, 361, -53, -116, 19, 210, -53, 105, -27, 63, -221, 161, -37, -222, 178, 13, 23, 107, 150, -85, 11, 233, 48, -259, 180, -71, 10, 67, 16, 182, -60, -175, -128, 166, 185, -58, -189, -163, -6, 153, -31, 33, 106, -7, 164, -69, 302, 2, 149, 364, 17, 8, -150, -277, 60, -182, -184, 102, -37, -193, -77, 119, 107, -77, 157, -159, 20, -33, 6, -79, -163, -129, 125, 120, 1, -49, 87, 22, 42, -34, -56, -162, 43, -127, -82, -7, -54, -108, -59, -135, 52, -193, 172, 236, 93, -182, -63, 95, -4, -6, 62, 46, 80, -168, -26, 185, -15, -52, -18, -92, -151, 24, 120, -98, -77, -69, 30, -3, -216, 68, 8, -207, -16, 9, 138, 66, 149, 18, 169, 279, 68, -84, 25, -67, 136, 391, 70, 237, 184, -94, -287, -75, 37, 106, -179, -208, -39]
5949c9J05k1r3K31q9l22J22m9J75M6J7K10n06K56J5j51Q8J19J8j10j79L86j30
5972I9j81n2L3J24J12k8k18K32r8P1q6J17k18q5K66o3j69K39j8m4j12p1K45j10
5996a5o6J90k87J14%j09L68k38J0O6M8r7k33J33L68N0l31K2j01J41q9K17l09R8
6020e0p7M2K56j56m5m3Q7k41N10k73j60K69j27R4K0J10j00j81K37Q5j39J38j96
6043F0J32r8j24K63l55K21k87K19R5j70P0J35K25k88j56J57k27K94%j93m9m1P4
6066d3j34j4K52Q5j64P2l12J83K01l39L62p8l6N9j14o9Q6q0m9J29j78L58l14K25
6090H8l96L80l7k71K72j38O7k44L71r2j84K38j39j89M02k13j33LN40m97j29K36
6112f5J08j38J41j14J8K75k60J11M5q8o2j03K06m3K6j3j44J84J23m1k26K91j80
$$ y = [-39, 66, 45, -48, 183, 94, -228, -106, -155, 20, 66, 83, 293, -213, 43, 58, -93, -5, 114, 132, 22, -157, 229, 99, -82, -134, -101, 23, 135, 107, -111, 121, 23, 94, 8, 125, -93, -178, 88, 25, -144, 95, 77, 33, -79, -150, 95, -15, -81, 109, -178, -64, -64, -173, 195, -43, -33, 33, 81, -16, -249, -116, 252, 302, -29, -7, -108, 33, -56, 161, -148, -50, -127, -85, 171, 15, -30, -73, 14, -227, 283, 10, -150, 119, -8, 86, 106, 216, 116, -65, 172, 257, 118, 256, 60, 192, 94, -30, 233, -122, 99, -188, 31, 126, -44, 26, 161, 386, 98, -58, 99, -128, 166, 166, -27, -76, -117, -43, -177, -191, 61, 146, -18, 54, -258, -75, 126, -213, 149, 71, 35, 94, -20, -89, -3, -83, -132, -3, -181, 177, -137, 88, -308, 72, 35, -236, 36, -102, -35, -279, 92, 0, -184, 54, -85, -274, 128, -85, -218, -215, 325, -172, -301, -65, 43, -95, 46, -68, -50, 225, -35, 76, 121, 33, -29, -132, 74, 31, 57, 44, -100, 84, 207, 166, -60, 231, 51]
6135E1K75l50Q4j74L3rJ89j17M0k47J2K04Pn5j16N0J2J36K13j66M6K2m5k27L0
6160a02K88j40j16j36P8PJ49J7j13Pk9L0K76k39J71j42j75J41l4K43j78O2N9o5
6184E9L3k90J37L5Rl6Nj15K65j79K17j53j68j55K34m8L27k26j18K87k17R9J75
6207A77j79l1MJ04k38jM33l61J01K7or9L6J29l22L67j00J7o1J71k8k62O9m6J80
6232H1l8j9m5R5N3J99n04K76k18n4J5K11o9N0o0J76k23J04M8j94N4K33j40j09
6256g8l0J07j39J00O6q8m4nJ94j12n5o8K09J2j89K04l7J20j04o9q8L8J77j40k04
6281b23K74J52k10j58R8M52m59R2M7j98K84j76J80j95oN5L6k63K01K3Q0m0l6j2
6305bn0R5Qj08R8N7R1l46j02K59j6km21L21J20o6j50K12j57K04P3r4p1O5k5k7
$$ y = [51, 326, -24, 60, -114, -81, -90, 99, -18, 22, -225, -213, -9, -2, -57, -173, -123, -111, 25, 238, 72, 118, 140, 95, -132, -102, 186, 46, -70, -206, -128, -121, 28, 45, -68, -61, -90, -60, 216, -23, 148, 6, -169, -28, -62, 181, 3, 65, 124, 59, 92, -198, -61, -26, -17, -53, -48, -163, 102, -77, 140, -13, -181, -336, -102, -150, 177, -49, -167, 120, -97, 2, 177, -2, -33, -29, 75, -163, -164, 269, -92, 9, 36, 30, -69, -33, 96, -226, 141, 41, 58, -3, 168, 140, -122, -53, -99, 81, 43, 24, -21, 74, 127, 326, -178, 98, -120, -174, -159, 52, -17, 33, -27, 149, -74, 30, 78, -116, -62, 171, 31, -78, -108, -1, -140, -40, 26, -62, -106, -111, 83, -29, -84, -152, 57, 69, -120, 84, 47, 167, 63, -6, -94, -56, 121, -19, -223, 51, 203, -7, -165, -67, 385, -74, 18, 65, -133, 151, -25, 155, -40, -46, 9, 45, -218, -17, 6, 86, 46, 10, -2, -52, 43, 51, -57, 41, 98, 189, -157, -259, 0, -16, -18, -439, -118, 2, -64, -214, -2, -159, 45, 118, 24, -47, 18, -7, -34]
6331c4k3JK30j12j48Q6j21K41j50J62p8j32K8R0l65K60q7K22L2k69K25M0l9p1
6355a2J2J12j37J03O5j12J31k85L3j32L47k68J9K2J36j37Q1J7%p3l5J37K06k42
6379a2J81l15K94j93kJ36j77K61j41m2K45k35K66m52M27m28O9K87k30k7JLo3K64
6403A17q5j70K18j14n5m10K73O17p07K09J76j78K9k26L15o30J185p35J38J149
6423A116j277L12J82R1n41R3k06R4j57N21L4l16K48k04p2j49j4L71k99J81m7k01
6445b40L45k1M58o08%K80K9k85k22O47k41K4j31O1R4j10j13J41j41j99L22j11
6467b1K0O8n9j31j74K63K8k91K88L4j81Q7l1L9L25k12K26j40j52M7k2J31j84J49
6491A07k98K47k10J05R5j67n2N8pJ19K2k41J35J21j95j81L50r5J09k9k20K86J70
$$ y = [-34, -57, -56, 174, 62, -86, 0, -121, 120, -30, 132, 54, -78, -50, 40, -325, -65, -152, 70, 102, -167, 58, 98, 59, -12, 0, 112, -25, 78, 143, 31, 162, -123, -90, -222, 125, -143, -124, -102, 34, -103, -22, -5, -5, -78, -113, 24, 230, -12, 169, -146, 148, -45, -47, 89, -88, 173, 32, -10, 235, 0, 266, -186, 241, -187, -118, 169, -61, -88, -87, -84, -147, 117, 32, -138, 80, -34, -89, -499, -226, 391, -316, -107, 69, -109, -80, -306, 9, -621, 564, -171, -33, 1116, -161, 151, 333, 424, -117, -24, -230, -136, -293, 228, 262, -54, 194, -10, -82, -231, -245, 126, -173, 8, -39, -240, 105, 84, 542, -66, -66, 214, 243, -42, -264, 383, 142, 166, 35, 96, 190, 80, -33, 108, -33, -232, 90, -21, -1, 67, 8, -123, -297, -34, -6, -297, -9, 25, -156, -69, -100, -61, 264, 52, 278, 138, -14, 33, 11, 142, -42, 107, -191, 56, -154, -49, 46, -121, -173, -115, -122, -3, 19, -222, -87, 34, -161, -342, 8, -87, 22, -7, -227, 59, 229]
6514B29l03l1K55j42j9J8J70rk77J10j11L48k36l55K68L6l10M69O1l77K36J23
6536A53j69J0j13P7QJ89L8N2p4j99L85l66L15l21J49k44K69K2r1rj46J23o7L5
6560B6N6k21J65j60K39l4r3n7j3J44j98J13J4L6k87N9K26J10j9j07j36J88k31
6583a80L56J0r3p0j34K17l2n5j03j1n6L28k75J17j26R6J05j11J47J16j08l9R5
6606A94k10K07nl2j20J07l99r2L58N2q5J31M3n2j8k15Q7K8O3k59L06R0j92o7R6
6631A6o5k19J17L42j52p2ljj27J36o2J42j94P0J51k07K75p2j64Lo3J26O5p4k4
6656e6j4K4K9R6Lm53K18J19L1N3j8j41L20k6k19R7N7j36O4k4k3j6j09K79j10l59
6682c14M44r1j72M42m58P7k2J86n6j69l1L54j37k18L13k1j1k33Q9K84m10M31k36
$$ y = [229, -74, -105, 150, 8, -11, 7, 177, 168, -109, 1, -110, 238, 2, -353, -85, -49, -359, 110, 171, -206, 30, 153, -16, -6, -119, -42, -34, 155, 193, 245, 171, -28, 357, -9, 306, -15, 134, -110, 159, 181, 90, 81, -65, 58, -9, 26, 82, -139, 26, -134, 105, 71, -22, -79, -92, 52, -146, -33, -19, 17, -270, -211, 15, 125, 106, -1, -137, 51, -180, 176, 186, 93, 23, -111, 106, 74, 19, -84, -95, -151, 177, -98, 19, -107, -11, 94, -17, 130, 246, 138, 99, 194, -16, 191, 186, 154, 34, 141, -258, -350, 8, 60, -25, 106, 149, 97, 79, -136, -49, -21, 42, -217, 89, 179, -13, -80, 16, -49, -268, -151, 191, 39, -33, -36, -37, -164, -28, -90, 52, -142, -72, 79, -128, 147, 75, -89, -86, -149, -23, 42, -32, -56, -70, -46, -17, 79, 82, -371, -153, -34, -3, 50, 32, -109, 211, 185, -34, 63, 120, -16, 48, 24, 1, -15, -124, 155, 45, -314, 130, 39, -133, 309, -149, -72, -94, 92, 36, -133, -164, 190, 53, -165, 148, 127, 116, -117, -28, 256, -154, 277, 41]
6705D1j25O6p5K9l0L9K31k67m2K42r1J38j97n1k14J55L65j69l0j23K90m45J85
6728g8O3J09Pq0n8J53q2l8k09L84l12J53k06M6J11J52k95K58q0j08M8K39j30o4
6752a7J34J2k47j61L53j91J40q8j68K6L3M1p1J85p6l5J67o5J75j30l3K58k79Q2
6776D5j0Ok49K05j04L6O5J27k47j2r8J25J97k41j39J94Q3K79j60K5j81N0j08L8
6800g4k7K58j71J79k29o6L42j89R6j77q2O2K57k62K25l30L82m6o2l2l30J43J26
6823gj4N3k88K85P3J4j5l43M13j62K96k32J11j76O8j17j32J82J39k28K36m36J45
6846a35jK46n1P7r6o2J91m60L69r6mL5J0j35L67l26J56o2l1j31J38J20no4r4p5
6872a19jj2J7Q2QL2M6j32kJ03J28k83K34o4j83J70J7j40j04l3M97o45K91J80j05
$$ y = [41, -84, -18, -93, -64, -94, -55, 176, -91, -133, 109, 18, 156, -41, -92, -306, -151, 214, 45, 15, -108, 182, -263, -78, -15, 94, 101, 21, -37, 116, 34, -4, -213, 171, -141, 12, -194, -148, -37, 115, -180, 78, -2, -110, -62, 177, 47, -17, 117, 129, -118, -279, 74, -117, 23, -65, -233, -207, -174, -133, -204, -19, -95, -130, 37, -28, 147, 17, -16, 242, -37, 45, 35, 41, -208, -3, -107, -71, -6, 121, -126, -138, -236, -111, 86, -155, -294, -100, -17, 262, 102, 127, -54, -4, -112, -74, -101, 157, -14, 165, -64, -130, 212, 23, 119, -58, -140, -78, 179, -83, 142, -188, 194, 148, 86, 54, -276, -133, -7, -21, 32, -256, 29, 102, 116, 101, -242, 171, 9, 305, 73, 184, 8, 76, -41, -173, 9, 148, -80, 156, -280, -135, -136, 110, 59, 136, 40, -22, 169, -291, 78, -18, -22, 13, 23, -112, 255, -71, 85, 23, -8, -139, -1, 119, 114, 50, -44, -119, -120, -132, -115, -33, -25, 7, 53, -79, -81, 22, 150, -133, 101, 37, -146, 24, 41, -99, -203, -236, 261, -384, -93, 87, -18]
6897a8j01K32r6p2lJ40Q7k35J81q0j20L7J42n8N0rk16K73L1L3l32L4R3r4R2J31
6923A22q9k30L49r6J41l65K88k93K24l52K26q0J57O2j99J34J86M3k17J48K6m84
6945b99K41Q6pj63K57K5o7k16L16k05J34l5k34L27m59M56j37J48k79K1K45J16
6967B71k85J52j40j72J51J03j60K25k74J44J19j60P0k10M17k11j3n8j7J99k56
6988a05J14p0L03l23J48k27K31j02k91M31M5k58P8K1k23J55J39Q6o3J1k57J98
7010D1n5j1l0L5l1L08k61j67N8l3J67j50K26k25q7J26P7O0o6o8J3j13l1K14jL5
7036C1j3k53L47j33j7M82k55k03K8k64K67J09r2Q4n3J43j85K72l34O1K3Ro3R9
7060I0q9n6j1J07j4J63k92k77K47J03j63M5K47k19K21o6J08o6j12j24K05j75L59
$$ y = [-18, -119, 113, 17, -55, -58, 82, 169, -66, 115, 35, -85, -48, 94, 36, 86, 77, -139, 134, 165, 198, -134, -100, -7, -101, -9, 122, 33, -197, 152, 56, 197, -168, 120, -173, 51, -301, -75, -155, 2, 64, -135, -1, 185, 228, 11, 159, 185, -299, -58, 28, 21, -142, 115, 140, 73, -143, 173, -32, 102, 67, -167, 160, -299, 157, 20, 168, -111, -90, 155, 271, -14, 138, -2, -174, -23, 80, -80, 145, -129, 15, 134, -26, 44, -166, 251, 40, 27, -31, -48, 151, -105, 9, -61, 242, -81, 67, -160, 71, -31, -322, 109, 154, -104, -26, -5, -228, -73, 66, 152, 89, 100, -157, 41, -14, -25, -55, -20, -51, 257, -4, -171, -113, -146, 21, -129, 97, -128, -215, -89, -12, 48, -18, -86, -73, -186, -217, -3, -4, 31, 18, -235, 112, -21, -38, 444, 189, -14, 14, -250, 17, 126, 34, 118, 65, 208, 23, 295, -39, 22, 45, 54, -9, 90, 1, -55, -66, 41, 27, 190, -102, -379, -132, -29, -192, -147, 100, -119, 102, 36, 144, 78, -34, -158, 47, -128, 231]
7083B31m12J87K38m59J34J8K79m04K32n5J23r0m0J42m8J0k08N4r3J89j73K07r3
7106c1r5J91j14j97L66k63K27q2j00j07N1K43r7K21q0k86L66M4n3k83J25j06J36
7129G6l18K26j4n8R9l58K98Q6j99J00L6L2j5k22K21J27j21p6J44j74J29K0O5r1
7153A3j49L68k43p8n0L2P9j63J70M9j5J3J61k49k13J96J02j75K27LK9k08K00p7
7177B2m6K1L28n31K65m3j62L80m91J28j29K33J79nk29m7J53J74k67J40k0q6J15
7200H2j49p1p8N1J77j14P0Q2l2q2L83n02J09q4K43j05R5K17j29k08J4P4j02L6
7224b3J96l1k74J34k72L51j4k0n2K58m64K23j3J0J48j9J54k23m1j79J35j90L75
7247A69j67Q1j23O1k14L89l12o5J31n9L11k22j17Q7K16m5k89K32p7n5K58j14J5
$$ y = [231, -181, 6, 244, -215, -81, -63, 216, -188, 44, -11, 112, 22, -18, 124, 76, 86, -122, -68, -161, 28, -145, 62, -31, -126, 65, -49, -246, 120, -143, 84, 2, -98, -205, -154, 89, -8, 213, 133, -153, 213, 257, 204, -79, 46, -60, 76, -242, -16, -30, -88, 11, -347, -49, 37, -162, -62, -26, 6, -9, -231, -10, 117, -4, -80, 64, -110, 19, 39, 104, 13, -136, 232, -11, -89, -139, -107, -28, -191, -21, 28, 13, 26, 187, -62, -275, -79, 23, -152, 75, 78, 107, -101, 99, 22, -24, -3, 325, -206, 59, 16, -146, 234, -257, -129, -258, -25, 154, 149, -80, -127, 26, 200, -67, 73, 53, -33, 82, -67, -138, -216, -165, 12, -102, -32, 50, 18, -64, 319, -183, -74, -158, 85, -20, 75, 292, 163, -45, -31, 43, -59, -23, 173, 142, -132, 2, -270, 81, 67, 47, -5, 253, -211, 12, -1, 9, 157, 138, 292, 69, 28, -151, -16, -206, 169, 2, 83, -40, 21, -193, 196, -116, -181, -50, -109, 202, -20, -137, -50, 166, 121, -168, 64, -13, -68, 190, 76, 91]
7270I1k81j39K81K8p6n8K72r3n3K20m50L46j14K45k41JJ43p3k65L01j28K2N5P0
7294A04P2j76J13j46P7k24K00K5j59p7K21J35j58J09j1l59L70M5n5r2p2J33m8
7317B7r6o3K94j88J9L03k35j1k32M2q5M56k70J19q1J29K9q3J01k74K1j31K26J56
7341A73k17J04%m2q6j04J91k07M70l24P3n5K09k12p8J27J72j84J27j80k1j1J64
7364H9k2l57M75q0J35k02j70J29J35n2n8k48J83R1k1K60j53l00K1O2L0n8J69m1
7388A7K22k18M0J21m14K94J7k42L80k09j16J81j37Q7J98j01m0o8l17J44K04l5
7410Hk04K29O0k93L49j41m9K04M4j34N0k31K2L3J36j73k0m5L25j72O1k1J30j54
7434A4m4J18k29P8M3o2Q4O3N1j2j73O1k6L1j74J0Q5N8k3J63k71J7N2J23j08P5
$$ y = [91, -190, -329, -48, -20, -96, -154, 118, 25, -28, 192, -258, 88, -26, 219, -22, -21, 122, 49, -216, 85, -43, -21, 34, 104, 176, 0, 113, -33, 44, -180, 20, 45, -114, -191, 30, 165, 7, 116, 105, -254, 116, 161, 106, 14, -58, 75, 27, -69, -132, 162, -26, -7, 296, 61, 50, -182, -140, -225, 231, -39, 80, -1, 128, 157, 74, 175, -99, -78, -209, 17, 173, -44, 60, 60, 18, -68, -172, 19, -188, 282, -42, 31, -24, 185, -27, -105, 22, 194, 10, 137, -43, -64, -75, 89, 67, -290, 185, 105, 240, 38, -132, -3, 132, 80, 22, -226, -43, 48, 27, 287, 134, -166, -145, -83, -53, -111, 58, 17, 239, 21, 61, 182, -232, 62, 79, -163, 217, 8, -108, 73, -64, 23, 221, 120, 80, 12, -305, -161, 43, 8, -196, 33, 93, -200, 149, 8, -41, 163, 207, 73, 123, -108, -86, -53, 83, -90, -110, -155, 170, -2, 59, 38, 168, 14, -30, 88, -141, -63, -20, -82, 2, 65, 116, 104, -69, -8, -34, -3, -177, -167, -82, -24, -47, 116, -155, -138, -86, 37, -71, 4]
7460DJ19k1j16j10M92k56j67J0Q1l24L58k11J34K47k70J08k39J47r6K79j37K5
7482E7J07pmk04K09j93J46j38j18K54k04N3N3m9j08j23K32J01k48L8L06j44J91
7505B07l96j04M10j69J23j49J41k5m0mK33l32J89l23L03j5L1q8L8J49k14k41N0
7528b26J24K87k04J06l8O5j55R6k50K05J86l08R7q8m5J73oj0j28k17M82k66q4
7551b04J88J57j55j36j44L44m8L2J8L4p4J03J99k09l10L95j57J6l08K66Q9q1P0
7574H5O2Q4j75K93l08k32K88k9j56o0K63j67M5k36L25Pn6J9j30K10j17j3j46L84
7598B40k61r1M14l47J43m6o7J11J8k22PK77k12j27J6L17k28K9k59L57o1j20j00
7621b12j58J88K23j84L76j64k05O2o3J19j65O6K5J25q8l7K06k63O3n5K58k02J75
$$ y = [4, 123, 102, -14, -124, 368, 112, -55, -45, 36, -288, 70, -141, -7, 240, -30, 78, -161, -14, -110, 169, 32, 57, 164, 157, 153, -51, 158, -35, 111, -27, -145, 109, -95, -42, 11, -38, -146, -269, -37, 64, -184, -146, 160, 16, 207, -189, -293, 117, -52, 71, -78, 63, 38, -2, -6, 227, -105, 84, -239, 64, 49, 80, -8, 30, 179, -35, -276, -226, -102, 185, -19, 87, 49, 114, -41, 55, -195, 10, 196, -112, -15, -103, -148, 25, 19, 9, -119, -336, 146, -120, -204, -16, 141, -14, -150, -294, 50, 2, 34, 52, 86, 12, 115, 314, 105, -205, 190, 33, 49, -259, 7, 96, 15, 85, 147, 231, 56, 349, 41, -191, 97, 68, -88, -148, 115, -52, -7, -243, 82, 89, 33, 52, -78, 132, 15, 2, -144, 240, -21, -112, 302, -45, 98, 52, -15, 96, 114, -108, -101, 176, -36, -163, -147, 170, -58, -29, -288, 69, 8, -112, -212, -370, -182, 41, -143, 233, 69, -136, -74, -137, -18, -183, -117, -92, 33, -55, -92, 114, -149, -86, -141, 117, -85, 90]
7644I0j54J53J27l81k5Q9L13l25J28j75o4K21o0K86j79l8K16m14J62n2O8p0n9
7667a43L4O8lR5r0j39J47j06K36j12J31J74j95K1k02j14N08m02j3O7NR3J55l16
7691a01P3J72J34l60J16J87l06J80j52K24j84O4n6j86q2Q0K16R5J51k66J13j97
7713h5q7J35N3j8J13j44K20j90K87J7k62K00l30J09j66J49K39m6j49k14J01L52
7735B84l07J43j68j11J54n1k05J01K31k50L29l44K31R7j18l4J45p4l9O1j6k28
7757a69R0O3m6J88k90Q8J64O5m1l07L53l22JJ80K88l81J25k43L98j64m6j21J44
7780A7K19q8j29j73p8K34J41ok93J84N1P2m3l6R3k79K51p5j51J61k42R1K62l16
7804a33K02J06r0l9J35j76J45n2k69J21K5L8j31K52k37J20k2J18j78M0j03mJ55
$$ y = [90, -64, 89, 216, -165, -190, -101, 212, -113, 15, -160, -224, -3, -63, 223, 44, 6, 222, -192, -30, -82, -14, -84, -143, -109, -41, -44, 51, -39, -178, -31, -137, 99, -13, 118, 292, 97, 118, -84, -198, 310, -92, -105, -38, -33, 60, 215, -101, -28, 144, 278, -82, 34, 221, -85, 95, -57, 167, -17, 47, -9, -195, -277, -197, 19, 114, 265, -1, 112, -85, -172, -37, 16, -2, 111, -33, 187, -3, 284, 301, 39, 239, -91, 18, -148, 1, 240, 194, 45, -169, -68, 284, -23, 120, -48, -159, -5, -56, -261, -160, 71, -179, 150, -194, 37, 134, 16, -18, 127, 53, 14, 75, 59, -169, -79, -16, -62, 126, -164, -76, 88, 153, 112, -195, 158, -164, -163, 17, 305, -76, 49, -194, 204, 40, -6, -127, 17, 236, 148, 19, -154, -232, 2, 143, 137, -156, 28, 79, 151, 108, 72, 165, -114, 137, 62, -89, 72, -170, -79, 183, -133, 69, 175, 85, 46, 181, 5, 150, 98, -171, -50, -25, 13, -118, 134, -103, 17, -5, 113, -65, -25, -128, -132, 23]
7827B3n2J21q1j6k50K43m6K26k21j0j6J4K75k87L18m82J64J85j07j88J56q1N7
7850e5P7l7Q0l18K56j02J06n4j33J73l0j22K72R6r5L4o4j08N3j39J9J37K02j22
7874A26j95m1J07j63K85l06J78P4j91l4L4J91j39o8L40Nl08J44k33J57p2J46j49
7897a12m5K44p3L7r9K7K5J51l64J29n2K09L3O9R3k04M6Q2o17M80%j22k26L48j22
7922f3J11Ok06J47j45k3J59k53K37j60K42J6P2j94r0J54J39k02J07k63K21j78
7944a66J15K19n17K64J24j53j11J01j03K87j5OJ59k89J96j11N3L1O3j00k2j33
7966a02k9j6J72l33L77K15k74O6l06M69l19N4M9j52J77k21K95J05q2j45m4l5K08
7989A29l1mj98J6N6J57k16K09q8J32k07J05K8n9j61L6Q6k7m0K34j71l9J40J61
$$ y = [23, -29, 92, 11, -5, -255, -12, -58, 168, -53, -63, -79, -65, 210, -77, 241, -241, -77, 108, 1, -187, -31, -112, -55, 22, -15, 65, -253, 3, -99, 7, -47, -180, -7, -37, -159, 113, 209, 114, 148, 84, -24, 29, -110, -91, 46, 248, 126, -69, -110, -3, -166, 119, -187, -9, 65, -126, -160, -126, 65, -74, -142, 198, 203, -105, 39, -194, -37, -109, 37, -112, -157, 87, 14, 51, -48, -21, 4, 155, -209, -80, -132, 77, 110, 179, 272, 68, 114, 196, -421, 59, 59, -63, -289, 59, -63, 48, 54, -152, -5, -150, -173, -14, -267, -30, -190, 52, 68, 140, -54, -144, 10, 149, -53, 54, -209, 12, -166, -51, 168, -349, -85, 39, -114, -225, -124, -227, 60, 45, 51, 210, -79, 117, 6, 59, 90, 153, 53, 31, -102, -131, -147, 25, -308, 69, 284, 10, 76, -230, 239, -80, -26, 23, -129, 48, -173, 122, 227, 145, 0, -44, -79, 129, 98, 94, -104, -88, -32, 125, -91, 118, 30, 162, -45, 60, 88, 29, -132, -96, -10, -37, -77, 157, -14, -53, 87, 248]
8013B48k44j7P6j4q8K4J10M5k32J43J05j68J21l3K1P4l19K62l24J15k10J03p6
8036b78J41j83P2K17l5J11Q7O2j77pJ54J03J8m65J08M1M8K5l64L51J37j41K02
8059B27j07m1K0j70J42J27l54M8K19m24K44K36k46k75O39j53k40p5P5l3J23kK54
8082B34m09NJ34K8p8J81K52m26J29m5j3K36j51k72K95l36J40n5J13qm5o7K8M13
8106B83l88J12N7O7k14J12j7j43K35k93K72k41R2m1R9j22K16p4P2j62J65j11J11
8129H7J45k46j89J67J25j66k68M66p0j74J66J61k70j67RM6J68K0j78J26j01P8
8151f5L4j16J79M6r9L25k65l08M00k02J9K03l43R4kJ23n5J39j04q6P8m7q7J7K31
8176A09l7j27O2n2j09j39M44j78R1P0j63mm7K45j55
$$ y = [248, 4, -13, 63, 49, -39, -15, 95, 140, -92, 51, 156, -12, 109, 76, 97, 171, -148, 114, -210, -95, -305, -202, -278, -137, -320, -248, -31, -66, 45, 132, 194, 17, 10, 164, 267, 285, -180, -72, -31, 17, 42, -322, 29, 166, 25, 227, 120, 79, 99, -71, 71, 198, -156, -108, 111, -313, -69, 167, -79, -354, 285, 132, -108, -183, -108, -141, -18, -20, 234, -175, -170, -36, -8, -86, 95, 347, -79, 50, 5, -8, 228, 77, -195, 100, -236, -96, -151, -38, -46, -91, -158, -130, 283, -105, 7, 64, 131, -83, 29, 12, -131, 104, -189, 83, -158, -66, -107, -8, -130, 86, 12, 84, -78, 87, -24, 87, 232, -14, -203, -36, 89, -77, -345, 121, 51, -123, 43, 204, -66, -233, -224, -178, -10, 10, -168, -42, -143, -65, -31, -147, 32, 78, -21, 304, 39, -269, 131, -71, -52, 151, -192, -98, -100, 23, -32, 107, 3, -83, -5, -52, -139, -122, 109, 72, -55, 7, -45, -154, -293, 151, -27, 64, 134, -29, -33, -80, 165, 10]
8191A0
$$ Imaginary data points
##PAGE= N=2
##DATA TABLE= (X++(I..I)), XYDATA
0@%%%%%%%%%%%%%%%%%JrJ6j6J6j6J7k5L2l2M0m8N5o3P1q0Q9j04J19j34J50j67
39h8J86k05K28k55K82l12L45l81M20m63N11n63O21o84P53q31R17j016J128j257
59f64J408j583J795k055K381k806L389m244N648q524K9154m1066J6783L3198m1571
74h757K2851r235r008J5249q550p566J0501p376n084O851M58j2132J0628j5q176
89i361O594n090J22J2031j2344l531J2022J349l717p271N905Q447j0742R37P452
104B803n307j923K160M001k129q511J1119k388m563N439k510J138l577K554N207
119C513p522O251k382n582J5063q885m142J2221q996J151N919n161J552J084k092
134A992j927O226j047r536Q916k627o535J3252j0136n379J2640p296k83L123n545
$$ y = [0, 0, 0, 0, 0, 0, 0, 0, 0, 0, 0, 0, 0, 0, 0, 0, 0, 0, 1, -8, 8, -8, 8, -8, 9, -16, 16, -16, 24, -24, 31, -32, 39, -41, 48, -56, 63, -71, 79, -88, 98, -107, 121, -134, 148, -164, 181, -200, 220, -243, 268, -295, 326, -358, 395, -436, 481, -535, 593, -664, 744, -839, 956, -1099, 1282, -1524, 1865, -2379, 3269, -5255, 23899, -17167, -384, 32814, -8757, 14094, 4859, -4149, 11100, 2550, -5016, 5485, -1891, -6975, -124, 334, -11798, -1170, -1185, -9361, -2767, -7857, -7735, 4296, -8048, -11579, 443, 1792, -1925, -9196, -3291, 5156, -5586, -4649, 2803, -2504, -4427, -2267, 1734, -395, -8906, 2213, -175, -4738, 701, -1809, -671, -4248, -1694, 3513, -4009, 2242, -140, -5722, 9341, 456, -3686, 8535, -461, 690, 6609, 1448, 3000, 4084, 1992, 65, 6291, 5244, -4292, 4624, 1997, -4538, 8714, -1422, -6801, 5839, -1457, -1740, 1383, -4162]
149d162L689p85n04K437m098K173p33J054J580n925O137p65p067Q063p99m267
165c972K919l070K487K216l835l43J514J666m253K957K490p107N095K029o433
180e640O639l913k188P846o138n33O125l903j889K220K552j640j973K832k455
195b058L098J843o238N419L02m732O309j502k538K971k037K692P81l411K082P46
211C727q58j254K963L61n962M807J186n284N245k994l355N743k785j222J974j901
227C91M03k99J721j488j757L261l583J954K792p554M977K208o603M316J015m465
243b711J574R56q90j563J755j76l632M363j507k683L819l404Q72J927l049L335
259a014k008j409M389j474n45J39J137J199l156L741R9l106M120k374J279J869
$$ y = [-4162, -473, -1258, -1762, 675, -3423, -1250, -1983, -929, 651, -5274, 863, 98, -6969, 1094, 295, -3972, -1053, -4123, -1636, 580, -3255, -3598, -2084, -418, -4671, -1714, 776, -6331, -1236, 793, -5640, 999, -2914, -5102, 2744, -3394, -3927, 2198, -1705, -3594, -1374, 1178, -462, -2435, 397, -2058, 1040, 2883, -3355, 2064, 2366, -2366, 3943, 2441, -97, 2874, 837, 3529, 4310, 899, 2981, 3727, 2869, 1615, 4578, 4939, -1023, 3784, 4970, -314, 4931, 1937, -1418, 4325, 1540, 318, 2292, 391, 794, 495, 2216, 728, -1029, 2232, -1351, 603, 3395, -4159, 818, 3026, -3577, 739, 1754, -2711, -1137, -181, -1071, -2634, -879, -1055, -4687, -324, -1831, -4514, -695, -4099, -3227, -1300, -4349, -1014, -3022, -4431, -42, -1516, -2061, -1922, -785, 414, -2742, 999, 1098, -2008, 2112, -262, 1017, 2886]
275B886m439M308K09l939L516j24l203L105M72k244J332J614l852j4N659m875
291D11j771N815m373j19L488l717K523o50j792L304k358J178j195N39J785n220
307b152N456j108o249O868k569k139M446l796l81K039j378r46j35J970k013R9
323a988Q36j799K080k112l42M293m572L96M789n122R73K148j344J091j131K55
339a549N19j59J162j545J450J669l841L762l31l063M898l014j378N733m750J66
355b71K046k7j515K53L289m309R23K979m512K087J824l780M868k126k619M234
371C344k781n27Q71M50L32j561J359k168J557J816n306L338J012m146L938j544
387a6k061L448l085L99J623j837j30Q69j27j639N87J670l003J099J847k797K500
$$ y = [2886, -1553, 2755, 2964, -975, 2541, 2417, -786, 2319, 2791, 547, 1879, 3493, -359, -373, 5286, 411, -1360, 4455, 82, -37, 3451, -266, 2257, 1607, -185, 3119, 761, 1939, 744, 1283, 3068, -2152, 3304, 2196, -4053, 2815, 246, -1893, 2553, -1243, -1624, 415, -963, -1909, -2044, -74, -2087, -1988, -1152, -2951, -871, -2983, -3325, 968, -3604, -3208, 1581, -3541, -2568, -420, -1764, -673, -1804, -1549, -1030, -1189, -27, -1572, -122, 1547, -2294, 1468, 1137, -1926, 2972, -42, -1420, 4313, -437, -271, 1775, 1748, 233, 486, 3775, -534, 389, 3368, -1144, 943, 2767, -1013, 3855, 1729, -890, 3344, 563, 36, 907, 1357, 1689, 128, 1487, -681, 876, 2692, -2614, 724, 1736, -2410, 1528, -16, -2077, 1371, -1714, -1315, 308, -1529, -1659, -790, -917, -2556, -1969, -299, -3302, -2203, -356, -3153, -653]
404f53j47l138L396%k925K061L40M58j569J587K99k006J877p07k35K421l388J599
422g30K516m146K332J070j685O06l63P88K41k38k82M9J879j620o95L463k888J20
440D17K666l046K221K53k293J911M55k044J677P13k017MK369j809j979L369j443
457A424j364K862l747J495J928l998J005K425k576J9Q19M61r22j014J338j654
473a499J393o34j405K931k410m11K295k060J00P15k07L32k40k01J215o90m19K36
491i59J107r52m77K088k304O23K511k491O58J517j869J301M98j017R9J832p30
508A435j068J707k3k143K923j022j763L271k012l33K106k538N57J649j743l26
524F77K52R84j442j28J062k167J069J183l268J778J64j564J837j992l46J832j080
$$ y = [-653, -800, -3938, -542, -542, -3467, -1406, -1066, -608, -2177, -590, -291, -2297, -420, -1127, -1362, 1059, -2329, -730, 1786, -2360, -28, 1042, -643, -37, -400, 388, 629, 391, 109, 158, 2037, 417, -278, 3185, 297, 417, 3083, 37, 2258, 2511, 218, 2129, 2584, 540, 2217, 2930, 913, 917, 3286, 1477, -502, 2867, 1424, 60, 2922, -825, 670, 2598, -1400, -395, 2030, -546, -527, 292, 753, -169, -1183, 155, -1499, -106, -740, -2145, 786, -1624, -2035, 260, -1800, -1700, -985, -1192, -860, -1100, -1301, -86, -776, -1195, -959, 148, -804, -1281, 807, -1497, -874, 1637, -854, -196, 1321, -548, 753, 1251, 234, 333, 2165, 1435, 367, 2074, 2051, -92, 2831, 1809, 46, 3317, 1305, 972, 3078, 540, 1097, 2746, 1003, 677, 929, 1913, 471, 343, 1405, -762, 307, 1490, -1778, 0, 164, -1400, 437, -1555, -1901, -69, -1149]
541a149l74k36O04J94n96M98j359J184R82k915K332o9k001L180j948p59K153j191
559a470M03K23r41P82L60j74j355J576R33k835K080Q31k358K554l97j434J738
576E16q03l4N74J40k1o42J405m56o90J859j465J18J523k451J742P67k424K232
594A890r65r26J498P6m5j499J478k93j409K212j828j40J905k701J413O18j945
611f61K054q42j203J190q4p38o7R28p38r87K183j730q41K754k247J42J475k001
629a413O76K35p94O47l26J10K03n63L78m10J098p05j077K613j607l93K054j556
647h30J51P59o32Q89p97O59L50q42R22o02Q37q7p48J189l07n62J481k130J70K463
667B333k222J067J025j063r22P44L91j038L35J305k250J828j030p88K253k002
$$ y = [-1149, -1523, -1759, -1155, -961, -1557, -1059, -2418, -1234, -252, -3167, -835, -904, -2905, 275, -1673, -2432, -279, -1470, -1067, -844, -1785, -1003, -643, -817, -2172, -596, 337, -2498, -418, 413, -1945, 609, 212, -1222, 516, -287, -321, 253, 393, 372, -270, 1135, 679, -11, 1848, 383, 501, 2024, -427, 1315, 2082, -342, 1890, 925, -1, 1497, 1573, 1528, 29, 1507, 1214, -195, 2017, 189, 49, 1954, -747, 666, 1284, -661, 1393, 551, -652, 538, 454, -284, -351, 577, -161, -1148, 1035, -695, -1536, 1218, -1029, -887, 588, -1413, -737, -502, -1296, -649, -975, -865, -662, -1225, -847, -1257, -159, -864, -1941, 672, -935, -1328, 726, -830, -679, 80, -552, 337, -460, 199, 549, -293, 629, 27, 864, 777, 29, 1218, 911, 349, 1830, -300, -130, 2333, 111, 1178, 2203, 1140, 218, 962, 1353, 315, 650, 1955, -295, 1533, 503, -285, 1968, -34]
683c4m30K850k618l67J746r06p85Q28o73J23M0N44j340N72M83j268J203n61n02
702a095O20q72M35K95j049P17K48j97m59L69M90j118R01Q60j807J326K6j080J482
721I2m30o02J187o72J20M75jn40N24L18r11R13K16j469K030M9k005K119J03j830
741c14J398K37r74O81J18m36k6O00q82K84O85j084L80R84j755J077J47j149R58
760I29l30r30J173l91o11Q14j000N90k90M26l5l67k57m76J91l57o82R34p6l57
780a102J85L72p33K61M94q42R9J186j287l28J961j415l2J559j316L09M47q63Q90
799a55M8o57N07M12m50Q9O74r14J8J511j038j10J387j209J82P63j420Q38J71q2
819E65r0k24J518j381P05j85l63K12J2l39J126j466K61R34j492M38J043j211M86
$$ y = [-34, -464, 2386, -232, -599, 1147, 241, -544, 284, -389, -266, -226, 318, -1022, -450, 33, -1235, -32, -593, -1095, -475, -1347, -912, -617, -1666, -949, -701, -898, -1357, -988, -498, -1616, -715, 145, -1662, -336, -310, -1390, 92, -338, -940, 247, -425, -305, 170, 169, -371, 153, 471, -440, 473, 689, -780, 1250, 1299, -706, 1413, 1516, -314, 1084, 1321, 347, 1028, 1146, 710, 684, 1284, 402, 686, 1371, 287, 667, 1651, -104, 973, 1120, -29, 929, 599, -331, 842, 451, -160, 654, -346, 244, -46, 380, 345, -22, -279, -755, -564, -921, -1603, -669, -745, -1102, -917, -545, -1278, -1017, -523, -1365, -1266, -80, -1367, -1695, 266, -1149, -1181, 378, -938, -629, -182, -1045, -155, -107, -764, -257, 155, -295, -206, 468, -446, -428, 1083, 45, -65, 1322, 113, 295, 1058, -362, 476, 647, 565, 475, 251, 1769, 388, 1093, 908, 545, 757, 769, 430, 1556, 90, 351, 1285, -207, 231, 1274, 63, 549]
838E49q5Q9o86J63M40j410J341k94j269J628o71n12J332j466J13R17j133J9N39
857c96j58n01Q01j24j094Q97N98j432J048J5q69J081p73J55P62l46j81M06m91
876f02N81o9j41j5L83L88j331J472N4j287J746l59r87J597p13l98L61j8r3K04
896G73p0l94P16N0q21Q59P2j069J145l27q24J283p26q03Q29O8k09o43P17n67q
917E1M54o44n3K49n38N04J17r68O26o4p77O40j69m37K56M1k69P5N57r42J20R72
939a99j006O05J91r57J036k35m62Q46n50k27O84n3m56M51P85q28k64J132o33R
959a31O98j110P68O26p51M81P53q22M22j143M84r5N59k76J62M06o85P9R29j318
979C6N10P21j258M89K46n02L54K5l96J59K50n44j96P81r72K19K70l47j7M10r87
$$ y = [549, 464, 553, -133, 30, 470, -940, 401, 107, -1162, 466, -205, -717, 615, -851, -738, 179, -954, -935, -396, -554, -1055, -254, -378, -1472, -575, 23, -1409, -361, -346, -1215, -134, -907, -752, 10, -336, -517, -111, -602, -21, -90, -231, -246, 137, 525, -806, 666, 720, -567, 1179, 820, -167, 1430, 717, 319, 680, 662, 569, 773, 703, 309, 1025, 1075, 254, 1113, 1185, 116, 1261, 934, 110, 1393, 667, -136, 693, 761, 552, -91, 626, 59, 51, 505, -139, -192, 57, -481, 23, 140, -828, -202, -266, -1043, -403, -572, -1009, -753, -712, -981, -906, -349, -1291, -1171, -199, -1205, -600, -409, -1366, -330, -565, -1027, -181, -731, -958, -274, -327, -783, -332, 453, -375, -639, 493, -140, -131, 567, -543, 225, 851, 100, 581, 1334, 512, 934, -209, 275, 180, 739, 463, 625, 1031, 346, 425, 1354, 36, 546, 1267, 9, 498, 744, 242, 596, 621, 225, 384, 634, 90, -106, 675, -297, -78, 192, -155, -172, 238, -749]
1000g49P34L73r57o6L94l25L6L56m50l15R96m72p06Q42l70j79P51n46l06O30k59
1021e88J84K34n01L84K07m0o77Q34N23j112R17r7m03N26r4m96O38k91k78Q87n62
1042A95N5L38j3r4K62l03r9N72m89m21J120m82n87R59m53k80P27o58J67j37j31
1063B48q9M37l12m56M32l3p92R77j47q07Q83n98m27Q21l39o74N88o5n14J67K97
1084d03k36qL48o82L43L60o75Q17l84m46Q42j85k69K41o7j84J34K4k51L67M21
1105A07p47N84M86p18M34Q7k26K25k28k02Q83n08k56N24O5l27J47O07l56j62L86
1126H05p38P52L5q04O38L85o72K17j3k03j03J92k37l67N94l90L08K79j180L73
1146a29Q99j225M57Q0o01L85o1j73R8L38k89l90L96l57j80P65n17j97N98o28M28
$$ y = [-749, -15, 358, -599, -665, -271, -596, -560, -204, -654, -969, 27, -445, -1151, -309, -679, -858, -107, -653, -959, -329, -588, -404, -170, -671, -287, -80, -120, -797, 37, 560, -552, 365, 268, -135, 391, 297, -199, 439, 148, -130, 757, 195, 250, 588, 575, 481, 743, 440, 341, 913, 424, 3, 1123, 641, 54, 1013, 560, 280, 1007, 349, 516, 379, 248, 159, 596, 284, -172, 260, 227, -565, 412, 265, -542, 341, -257, -684, 137, -202, -876, -288, -353, -867, -700, -403, -639, -647, -299, -981, -638, -278, -953, -136, -520, -966, -124, -309, -578, -337, -404, -588, -454, -430, -681, -314, 107, -640, -56, 430, -288, 146, 233, 7, 232, 4, -198, 685, 177, -79, 445, 510, 183, 330, 937, 581, 419, 805, 67, 819, 854, 50, 688, 1073, 401, 618, 605, 402, 299, 491, 254, -113, 481, 91, 399, 678, -502, -129, 770, -455, 2, 82, -519, -134, -195, -368, -270, 68, -221, -611, -215, -572, -752, 13, -504, -701, -103, -731, -303]
1167c03j8l65L09J23o07L10M18k47l91P30m93M9N05n47j26P37n13J01N95m72J71
1188c4K79k57K77K32k62j8N22j01o16O98j17k65L15l38J34K68m08J83K34n13K75
1209D88L0N9m98K04Ll37L71l07Q0M42n61k96Q87p39Q4N98q17o8M85k56k06j2K44
1232a22m53O38o72j87O74n9p89P28k96j81K88o0k06K46J17l78N8M78m24J87L91
1253b2n05L06J35k76L38l3OK35o5l35K87M55l14o0M39n13L15M15n28M19j08m64
1275A27M77K6l14M50j0m35K25L0m21M43J26o66M91j44m53K82L60o28K27K20q50
1296d37P70j47l45j2K63mjj85j82P1q5k16K00L56m69J31O7j98j21M71o49O6K52
1319d04j19k53M07q8k27K81n4J71J92m44J12L63l94L85L30p44M80K07l44K28K06
$$ y = [-303, -321, -686, -377, -254, -861, -551, -133, -380, -771, -41, -534, -485, 20, -527, -653, 84, -429, -328, 267, -205, -34, 245, -12, 265, 497, 235, 217, 739, 638, 22, 720, 603, 338, 653, 315, 449, 717, 309, 492, 726, 213, 488, 518, 577, 79, 283, 286, -51, 320, 13, 93, 535, -26, -322, 565, -174, -90, 508, -309, -377, 108, -148, -354, -366, -122, -575, 63, -609, -796, -122, -181, -970, -242, -538, -719, -431, -491, -697, -451, -334, -712, -654, -176, -600, -413, -22, -527, -221, -86, -362, -24, -57, -51, 184, 119, -216, 71, 526, 212, 152, 591, 78, 393, 808, 280, 699, 591, 127, 604, 630, 316, 766, 756, 321, 546, 576, 155, 598, 724, 58, 549, 405, -48, 234, 594, -34, 193, 413, -437, 333, 186, -159, -171, 92, 88, 87, -98, -280, -209, -294, -510, -310, 46, -423, -292, -225, -423, -544, -73, -722, -656, -404, -523, -776, -369, -457, -684, -403, -457, -286, -94, -538, -426, -63, -457, -72, 258, -486, -6, 201, -143, 85, 291]
1340B91j04l9M26l49j30L04q7n3M27o00jO66o06m1P05p25L54J03m58m6k35M32
1362B34j57K87o2m14M73k90j4L47n96L75p4q4O0Q3j91J17p1K24n53K75k09j11
1384c51L10l07k66P00n16k85N55m01k4J66m3j08K81L4k28L25k27o5M06k81l42
1405f67P57j84k12L94k31K23j62Q1OJ9L7k35L63K23k49J90j2k50L00M8m01N35
1427E73k96j02L04m62K96K77k31j0L56p7n50M96j35j94M07k42m28O38m35p9K65
1448C71j07l83Q9K3l55J8K44o26J009o18m24M04J62k42J2M97m84M2R0j6j30j7
1470d41k35K48K55k43k23M36l45L15J62k41l3L31l82L44p1jj05L21M8q7M3r9J90
1493A87r9N3Q0J94m15J83J94k18J57J91m29J90J80j53J20N3n17K25N65m33K38
$$ y = [291, 187, 148, 574, 225, 95, 399, 312, 259, 686, 86, 85, 751, 145, 104, 809, 84, 438, 541, 83, 37, -198, 234, 77, 364, 302, -112, 361, 71, 57, 404, -192, 183, 109, 25, 85, 168, -23, 94, 23, 247, -306, -31, -240, -351, -41, -348, -614, 86, -430, -715, -160, -561, -585, -419, -462, -570, -289, -255, -483, -158, -385, -450, -44, -325, -667, 90, -94, -306, 88, -143, 80, -82, -1, 5, 24, 61, -174, 189, 412, 163, 353, 341, 91, 391, 439, 38, 573, 277, 175, 479, 17, 313, 590, 359, 349, 705, 628, 78, 574, 439, 245, 652, 410, -18, 620, 185, 106, 371, 264, -119, -30, -7, -362, -344, -100, -726, 283, -335, -759, -355, -193, -435, -423, 74, -410, -368, -278, -294, -424, -441, -676, -428, -173, -416, -639, -203, -548, -233, -71, -312, -345, -14, -396, -52, -123, -124, -229, 92, 140, 53, 96, -3, 187, 88, 141, 221, 415, 0, 183, 377, 159, 316, 507, 78, 268, 448, 295, 415, 468, -49, 176, 741, 308, 546]
1514E46K60n59k8L1j91J47k2l44J28K66k77j36J21K0j79M00l92j20M50p94L87
1535b86J45j16l49K43p7MJ52O0J0n3p7o2M82l87j60K83l09j3L96k14K01O1j52
1558b18J26K35l53R5P9L1m15L49J50j1L21l23J18L13n13R5O05m95K8K12k60j05
1580F4L46q8k89J01P5j3L30k91k53O64m82j40M73k89j23K46j48l61L01N1j13J94
1602B55k83j0O0r0j73L23q9j50P1j78j46K3J4K0L06j50j89K02j21j93J80J18l16
1625e16J07M16o01N03n7l02Q2J38l36L27K08k11K60j37n5N02p2l31J02j4j00L83
1647B96P7m63L39R8k40J81p4J3l3J03j26L28J1l69L60Pm09K44R6l73J43K26l20
1670A15J87J57n79J69L06k95M4K18l75j00L35o06J27M39m76J03J84k97K8J30p4
$$ y = [546, 806, 247, 219, 250, 59, 206, 184, -160, -32, 234, -43, -179, -58, -38, -217, 183, -209, -329, 121, -673, -286, -141, -257, -606, -363, -440, -436, -284, -224, -214, -267, -344, -406, 76, -311, -471, -188, -497, -510, -114, -328, -127, -66, -218, -92, 143, -210, -115, -36, -5, -420, -71, 79, 68, 389, 66, 184, 497, -16, 79, 684, 189, 217, 429, 169, 64, 410, 322, 33, 134, 209, 196, 526, 235, -18, 646, 164, 24, 497, 208, 85, 331, 183, -178, 123, 174, 61, 255, -28, -38, 22, -68, -241, 82, -7, -157, -86, -264, -410, -387, -373, -353, -47, -197, -386, -184, -305, -498, -318, -200, -516, -409, 7, -594, -91, -148, -450, -368, -230, -566, -239, -31, -242, 18, -119, -174, 328, 256, -75, 27, 13, -87, 296, 373, -90, 249, 347, 107, 288, 214, 227, 194, 297, 171, 499, 510, 141, 501, 508, 99, 343, 439, 66, 209, 435, 115, 302, 459, -120, 49, 355, 60, 104, 322, -53, -153, 182, -424, -297, 142, -334, -231, -47, -344, -316, -186, -260]
1691b60o1J86j69q8om6J65J67p5n8J17j12k89L79l47L53J89k66J20j7k92M55J65
1714B10k48J55j63o2J33J66r8K3K12j82J72L6k81J69j8j19J38R7k4k11m1J87j7
1737B34O7j05M6Pk03J25L3k23L63j14j12k27L63q1k47K93k56k00L45j70k47O15
1759C06m89N8J88j96m7K5O9l10K40Mk72K82j30p4N4o3j8K58k35k46L07j7J22L5
1783a49P2l22L66L2l53M91j04j1L35l21j18K96J25j39l4k25P7K9K37k60K0J36
1805A80r9RK15j51J03k5l3j10J78m68N06r6j14K04k16K30J0j05j42j3J58j00N7
1828A78J9k71K08Q1k74m8j26K14J0J13k48k30M86m39J71M4j58J24j81k39M12o
1850a60j79KJ92k07q9L38j75K87l17j46K09K8K05j89J53j19L13j63J86q6r0P6
$$ y = [-260, -321, -135, -304, -392, -398, -444, -279, -112, -187, -245, -128, -240, -529, -150, -497, -144, 45, -221, -101, -118, -410, 45, 210, -38, 117, -46, -108, 25, 191, 93, 116, 328, 146, 318, 354, 73, 242, 224, 105, 243, 340, 316, 105, 64, 251, 234, 301, 196, 242, 249, 46, 171, 204, -19, 344, 230, 118, -109, 254, 173, -74, 219, -37, -237, 108, -62, -309, 306, -183, -125, 63, -133, -180, -155, -86, -396, -156, -152, -424, -142, -272, -346, -292, -355, -373, -115, -350, -596, -289, -306, -184, -149, -77, -399, -33, -1, -354, 137, 33, 22, 357, 36, -82, 214, 339, 200, 166, -59, 18, 47, 284, 24, 44, 180, 81, 90, 305, 154, 257, 232, 199, 89, 267, -201, 305, 209, 95, 299, 83, 313, 323, 218, 76, 63, 221, 121, 178, 197, -74, 134, 215, -59, -107, -233, -19, -9, 104, -144, -374, 112, -327, -156, -112, -270, -146, -327, -566, -154, -160, -339, -337, -145, -352, -441, -103, -278, 9, -308, -454, -245, -217, -12, -201, -48, -167, 146, -17, 169, 83, -7, 69]
1872F9j11No9M01M9k95K36J92J1k52P5k31J1J87j62R0J47k01NK83k34j66K67k02
1896A05M6J90j72M5n6Ll6ml8j39j05j80L39k35j92K32j65K24P8o9j61J23q7p6
1920c30L1J2J58p7M2j05j0J75r9n0J90j03J30j89j01J48M80l96J61K25l82j76
1942b66M03j03j00L31j17n0Q9j84J48N3o1k04L06K3j80J17J1m1J79k53j96M12
1964C17m0q5n4J0J6J1j58j3K52m13K16J42O9l31JJ73k33jJ04p3o7K17l08K75k39
1989b12R2P0r9M8R4j55j52K31j37J18J41k15j31L10k25k2K25j77L3j34M18l06
2011a85J83Q3k54K27O9k41L1K35k22J90j84J53L8j41j42M24Ro3j52RK5L05j46
2034B51k03L14o5j45K28j02RnK30o06L09J20k97R8n9L26k65k64N4j27N33l39J59
$$ y = [69, -42, -37, -106, 295, 344, 49, 285, 477, 488, 236, 311, 80, 91, 278, 116, 206, 353, 152, 157, 440, 206, 40, 307, 105, 151, 341, 169, 214, 158, 161, 125, 121, 83, -56, -161, -341, -2, -237, -429, -197, -362, -138, -60, -129, -290, -167, -254, -330, -299, -287, -129, -206, -164, -269, -279, -104, -203, -253, -63, -166, -36, -225, -326, -178, 302, -94, 67, 292, -90, -266, 137, 34, -66, 265, 148, 98, 187, 3, 151, 204, 143, -61, 245, 268, 88, 205, 216, 175, 354, 101, -95, 317, 277, 192, 138, 148, 164, 175, 17, 4, 256, -157, 59, 201, 270, -61, -60, 113, -120, -121, -17, -90, -157, 60, -248, 27, -212, -120, -50, -149, -101, -7, -162, -314, -83, -220, -102, 39, -176, -307, 3, -222, -244, -19, -196, -163, -297, 121, -185, -2, 81, -173, 54, 123, -118, -87, 148, -74, 116, -68, 85, 123, -18, -160, 264, 273, 210, 58, 67, 92, 397, 251, 48, 362, 297, 152, 380, 278, 287, 282, 512, -94, 215, 335, 38, 136, 77, 403, 138, -126, -72, -199, 334, -5, 154]
2057A54K0j62k39J1J90r6P3l7J03K9l27j0J41k21L48n8j83J51K0j5k16L00r9j95
2081c18L65j12k67K60n6p8K50j32j65K42m4L93j94k65K43k21M5R7K5J61j07J87
2103C09k74j29M47k84k9K45m41M66l1k54J48q9j03J54J14j6lQ0j63k01J94j77
2125c7L1Q3o6o8K66j06k70J29R8j39j61L19j76J09m6n4j69J39r1K33K3m6j28j11
2149b38rj3J26m7J41J3k56J20LJ40j39J32k14J01M5o5L65j1k39J48n8r6J51j56
2173e6J0K31J94o35O23j89j48P1L59l15J27O9k20j3L1R8j38K02J4j1k06J12r6
2196A14L6j52K68k43L6K5kj11L22j07k91J44j50J57j4o3QN0k06k69L74J32j69
2219a11J28r6m04M06K31m02J25j99L01M6q2P8j82J67k05Q5P6k19K86O7m5k55J56
$$ y = [154, 174, 12, -227, -216, -26, -122, -49, -86, 17, 46, -281, -291, -150, -371, -23, -81, -264, -113, -93, -108, -324, -24, -123, -318, 47, -65, -332, -72, -128, -206, 44, -88, -253, -11, -55, 338, 144, -121, 122, -99, -54, 43, 68, 229, 122, 309, 35, -94, 353, 69, 40, 285, -156, 310, 279, 25, 173, 84, -19, 135, 249, 233, 230, 310, 147, -54, 140, -37, -6, 77, 11, -57, 209, 103, -167, -38, 60, -79, -240, 79, -97, 12, -34, -88, -257, -118, -209, 24, 47, 1, -127, -238, -247, -260, -134, -181, -40, -27, -283, -163, -160, -20, -159, -27, -241, -140, -95, -160, 205, 194, -45, 103, 45, -51, 100, -56, -46, 185, 379, -256, 367, 178, 30, 101, 460, 145, 272, 341, 121, 108, 139, 237, 99, 301, 315, 304, 98, 210, 114, 150, -2, 266, 23, 59, 84, 82, -29, 293, 186, -105, 39, -111, 46, 32, -31, -23, 27, -179, -448, -74, 58, -111, 17, -79, -483, -77, 154, -248, -123, -322, -21, 25, -57, 21, -161, 6, -199, -114, -38, -257, 29, 96, 51, -204, -48]
2242d8k71M43l05J85L3N5M5O3j69r6j04J41J35N5M9L2k41L47j97l6Q3j70K53j50
2266A32J04Q0l1M2J2k06K9RJk12nJ36k08M2K22k8qk40M1Q2oo3J19J96k89k9r5
2293a73k52L99j66j46J43J28o1k48L28l0J9j33j29J80j40J27n2Q2R1j51J32K9
2315b3q7J36j68J91n1m20M04M2n4P5J84k08J13K67k75L4l6J22O8k56L4q3L00j87
2339A22q6J90Q5r4l33K56L7O5j94R1m9p9l4J68p4j27J61j01N1J35j84k44L38j81
2363h1mr1J23l0Pr6J70j98K26l12P6K6R6q9N2Q0J47l78o2J53l7l7J85O3j5r5N3
2390f8N4j04K88j29O6o5p3j57J84j70K73j10J28M6o7J0R5j30j66J31j01K49j2
2413A72k86P2K42K5k39K99k25J51k84N52o25L79j18j10kJ34o1l2K18l71J38O7
$$ y = [-48, -319, 124, -181, 4, 37, 92, 137, 200, 31, -65, -169, -28, 107, 162, 211, 243, 2, 349, 152, 116, 199, 29, 282, 132, 236, 316, 285, 327, 339, 133, 162, 171, 172, -40, -45, 91, -117, -75, 147, 119, 111, -129, -88, -6, -12, -75, 44, 240, -49, -78, -173, -425, -26, -192, -338, -195, -67, -128, -376, -48, -78, -59, -192, -321, -141, -281, -154, -206, -124, -33, -184, -52, -23, -110, 26, -142, 49, -2, -422, -18, 24, -30, 45, 229, 21, 134, 401, 126, 160, 124, 246, 314, 58, 92, 9, 309, 122, 36, 226, 311, 217, -116, 140, 177, 242, 48, 139, 90, 11, -23, 145, 71, -56, 105, 4, 55, 190, 6, -238, 100, -81, -85, -176, -53, -83, -76, -172, -2, -200, 26, -286, -210, -184, -88, -177, -125, -45, 102, -276, -338, -185, -222, -259, -74, -11, -26, -121, -68, -14, -118, 170, 41, 107, 42, -31, -188, -4, -174, 99, -11, 117, 163, 96, 106, 201, 71, -95, 36, -65, 184, 172, -114, -42, 200, 225, -14, 285, 60, 211, -73, 479, -146, 233, 115, 5, 3, 137, 76, 44, 262, -109, 29, 96]
2435I6q9N3o1O7Lk75K61j05K57m11K36k4k17J52N6j63J77k5k38o0K71j10J41k26
2459b34R0K10p1m8j67J42j54r8M64m0k37p0mJ99K18rk30M7R0J05j90K1j42J1L96
2484B99j27RqK46m41M5L51m5l92L1J12K36j23j02j57Q6K24j96J54j57q6O5P7R2
2508A93k52N2k76J99J59j34R6k41K35m14K26N3M4Q4l64J54L20k95j58L01o7j39
2530b24K16K10l02n7O3j27R6J24l7Pm2j55J28Q1L7j37K84m5l03M27o6k10N7o7
2554d2j02J96K7P7L8j59O3j91J49l7M26m26J92k19K75j28j07p4J80J10J16l21
2576D3J07m3qJ52j60K1J24l23J77P5j86p5K4L29l4p7j91l2J51k71j21N7Q5M2J62
2601B8p5p8J68Q0j35l0j08n9R8K54j40k4n9k1J26q9j14J06J05J01j50J61j54O7
$$ y = [96, 7, 60, -1, 66, 69, -206, 55, -50, 207, -204, 32, 8, -209, -57, -1, -164, 13, -12, -250, -310, -39, -149, -8, -234, -144, 66, -5, -53, -220, -78, -232, -330, 134, 94, -143, -213, -217, -18, 200, 191, -39, 8, 98, 203, 13, 34, -108, -97, 299, 172, 181, 173, 419, -22, 23, 374, 329, -63, -32, 80, 316, 193, 91, -66, 20, 244, 48, 202, 45, -41, 24, 101, 193, -59, -7, -283, -84, 75, -59, 37, -204, 31, -383, -157, -104, -60, 24, -340, -186, 134, -161, -319, -18, -85, -224, -8, 202, -100, -157, -94, -221, -125, -1, -38, -31, -73, -228, -100, -19, 18, -119, 165, 120, -183, 244, 178, -32, 25, -42, -144, 52, 79, 156, 194, 35, 98, -93, 56, 19, 445, 19, 211, -8, 267, 139, 32, -42, 138, 248, 364, 43, 150, 107, 99, 251, 91, 112, 236, -87, 90, 165, -21, -96, -72, 257, 223, 146, -45, -77, 74, -197, -318, -261, -176, -134, 28, -47, -125, 43, 123, -12, -42, -150, -209, -111, 143, 3, -21, -80, -101, 25, -64, -178, -72, 33, 134, -16, 145, -9, 58]
2625E8j02m2L4K00J53m3k00L0J11j81J47J39j45M9k59j13L89L6n6j81M8m9M43
2648D66l56p7J2L17k99j23J84j44j7j41J44k0m1P8k1n2J40l6O9j49L9K4k74L30
2672E3m9R2j29j25k1j40%J67P3P1j33j56K07J5Qj4K19j88m4p6M8m9L26j21qKk2
2699Fo7j1N1j35K11o7K89rj25O0q7O0o9k0P2k21M2K54J48k80O4p0R4N2m1j06k2
2726G3K7j8k15J45J25l47L13k04J61p4J12j45J18J50k25j3K02l64M3Q5R5R2k14
2749g8j39L35r5k40j04L50n9O9j35r1m1R0k9o1K40p7k34L73j78k2J08j73J89m
2773fKj46Q0J69m7N6k02J1L1J83j64O3P0J7O6K25m17K80q5k12O9j34J04N7J54
2798B24j85K03r4m1R6l98J13J78j22j06J60l4j82L13j72k32K12%K98j67j03j45
$$ y = [58, -44, -86, -52, 148, 301, 258, 58, 88, 199, 18, 165, 304, 159, 208, -51, -164, 225, 261, 205, 24, 72, 23, 466, 110, 33, 45, 362, 63, -60, 124, -20, -37, -178, -34, -54, -95, -17, -38, -90, 50, 14, 83, -66, -27, -3, -277, 53, 4, 96, -33, -158, -179, -319, -319, -152, -79, -8, -141, -297, -90, -75, -67, -81, 138, -50, -94, -170, -122, -171, 155, 34, 26, 28, 6, -61, -72, -21, -156, 55, -12, 277, 268, 143, 203, 116, 176, 107, 87, 159, -62, -20, 234, 382, 102, 166, 96, 190, 242, 201, 95, 73, 100, 82, -133, 12, 137, -210, 103, -101, 60, -14, 98, -47, 71, 221, -4, -17, 185, -179, -136, -51, 44, 136, -78, -217, 118, 23, -217, -321, 29, -30, 39, -96, -187, -228, -138, -167, -228, 12, -65, -299, 74, -104, -126, -18, -191, -2, -6, -4, -150, -70, 99, 52, 108, -94, -83, -52, 131, -33, 30, 100, 117, 183, 408, -9, 271, 186, -26, 43, -91, 13, 70, 224, 39, 242, 148, 107, 203, -195, -82, 96, -26, -132, 28, -6, -188, 125, -47, -279, -67, -67, 231, 64, -39, -184]
2820a84M6k15L88M6j48j78K96l21J33J66J7N1l25R4J07K9j70n9K61l08L36qr7
2843d3k63K32l1O5o7J53k69P3M3O0p8J38K7j08L38k45m1L1mJ03p7j04J44L06k74
2868A09n5K34l28J01R9%j7M7j52r1K33l42J06K30j31K8o2o6j8J83Mk2j69r4J63
2893a0j70L06m44L07M6o7p1j18J75J08K7k08R1j04J33k29o6J20k7J88j67k9J95
2916a4j23R2j28R2p6K68j59K13j24k0K5k04j46K4M06J11j60lK89l87O6r1m7L26
2940B30n5j06K18l87K5J42j33q0L35j2k70L53j50J08j42q0l7j12M8o5K26j08P9
2963B7j11L56j27k08K49j60o8k32L03m9K2j00Q0l1J5m2J49J30n37K26J71j84J05
2986a6R7Kk41kN4r4J44k2q7R0m9Q4K46l08K12k16o2K58Q7l01K2J21L52l16j21
$$ y = [-184, -138, -353, 35, 81, -67, -245, 51, -270, -137, 29, 46, 97, -228, -134, -27, 2, -168, -227, 34, -274, 62, 54, -43, -306, -74, -105, -40, -107, 46, -223, -150, -107, -47, -125, 13, 40, -68, 270, 25, -16, 15, 11, 114, 37, -67, 77, 383, 109, 54, 288, -40, 61, 160, 160, 143, 190, 38, -53, 180, -162, -56, 174, 43, 71, 9, -57, -75, 108, 112, 90, -79, -173, -10, -180, 126, -318, -11, 35, -32, -103, -221, -46, 62, 89, -119, -28, -132, 1, -228, -294, -174, -201, -13, -180, -209, -14, -137, -45, -173, -81, -157, 111, -48, 165, 41, 21, 46, -158, -304, -280, 126, 237, 77, 74, 363, -24, 42, -49, -96, 230, 175, 69, 287, -100, -75, 67, -66, -146, 189, 177, -93, 260, 110, 218, 76, -4, -41, -153, -105, -170, 56, -52, 27, -84, 272, 145, -63, 186, 26, -42, -274, 29, -20, 2, -98, -18, -49, -34, -76, 73, 203, -334, -108, 63, -121, -16, 81, 83, -158, -160, -106, -200, -56, -78, -165, -75, -124, -40, 206, -102, 110, -106, -168, 90, 177, -124, -102, 19, 371, 55, -66]
3011f6J24J65m1k62J39L4j6n0J22k96K80k6j02O6P6k52j8L50o5N6r2N5k31k40
3035b90J37M63m44M5O6Q6l80j8N35l96JQ9j1J88j35Kj88K05J83j04o7j25R7j77
3059b38N99m04J2K07m26K62J13j72j13K50k31J2N9J51k7j00j9M8o1L8N8k12M98
3082C04k85l3k10K97j16K57l00J45k6M8n8r7R3J24Q8r7l27N35m84M68l12k8j3
3105b7k14L58Q8j18m8k20k8M26m55L28k03K15k49O3K59r1Qj38N5j48R4M4Jm4r5
3130a39j7j61K49j44K50l9L8K2m0j45k71L20p3K04k2l5P4l24L32o7p3J33K7O0
3154A59j65o7J71j5j18L08l82K66j46j8r1J32O1K09j38j78J89j92N2j95J28K12
3176A82r3j28P9K74l12m8K10k31J77Mj58K0J96pj26k96K53jM9q3J11j36M6k3M1
$$ y = [-66, 58, 223, 182, -80, 59, 93, 77, 27, 149, -147, 133, 107, 5, 71, 147, -105, -123, 227, 162, 218, 126, 181, -50, -290, -153, 310, -134, -89, -23, 63, -317, -335, 200, -196, -195, -106, -117, 71, -64, -62, -250, -45, 138, 34, -33, -158, -61, -238, 361, -43, -31, 176, -250, 12, 125, -47, -160, 90, -141, -129, -70, 81, 54, -46, -65, -17, -78, -40, 18, -194, 304, 19, -14, -224, 73, -43, 214, -86, 59, 33, 81, 23, -74, 19, 143, 231, 134, -193, 342, -142, 326, 14, -14, -27, -241, 117, 205, 87, 39, -181, -209, 217, -238, 90, -113, 102, -147, -84, 175, 84, 92, -46, 9, -139, -45, -1, 0, -44, -139, -156, -317, -68, -212, 38, -1, 37, 59, 19, -126, -397, -77, -150, 54, 32, -3, 71, -253, 79, 12, -61, 72, 99, 159, -6, -73, 98, 83, -35, 273, -109, 157, 11, -7, -98, 34, 95, 304, 166, -12, 177, -15, 37, -158, -30, 182, 89, -39, 40, 314, 2, -46, 164, -67, 110, 114, -44, -24, 172, 165, 39, -257, -4, -5, 44, -39, 72, -64, -18, -41, 0]
3201@JP8Q3k43J76r3k73K59k19K39j84j0J59L1j23Kl8K65j32j11J13q2N6q7j96
3226c29N53l64N6J99J18r3j30j45P8J91P6r8l16L11m8j49K72j90J59j18J02M8
3248A83l93M28O9q5k18q5L15j42J02j80Q7k08L60j55j06J84r8J05j89L50m10N7
3270b9m4Q2p5K11k90K14j43K51l56M9j21J82k4J00r1K0j08L22k64R8l3m4N4Jl4
3295g2m3j46K19K74k71j10j36J35Q1k10L65l8p7J39j61J91k66O7K18J05p2Q0N6
3318C28k80O0L4L4j76Q0p8R5O9j79K08p0k27k8R0L02m95J29n5rK06J64q6n1j38
3343g3N2j02M52o00L96j23OJ57j24k8k11J89l5L14k24k22j4J89K7j91J83j20O7
3366c5K44l37l2J46k36M09j43K19k79O2n1LJ02k31N81l22o1j44L7K07j57K04j81
$$ y = [0, 1, 79, 162, -81, 95, 2, -271, -12, -231, 8, -176, -186, -27, 4, -119, -117, -155, 110, -22, -133, -20, -102, -46, -133, -329, 224, -140, -84, 115, 233, 140, 10, -135, -57, 134, 210, 112, -204, 107, 59, -90, 182, -8, 151, 33, 135, 183, -210, 218, 287, 202, -16, -101, 214, 72, 174, -6, 81, -127, 233, 78, -28, 156, 58, 163, -26, 324, -86, -29, -73, 9, -66, 145, -145, 69, -74, 177, -179, -130, -251, -69, -93, 7, -84, -64, -172, 150, -114, -16, -49, -93, -39, -38, -72, -115, -261, -42, 232, -39, -149, -285, -150, -69, -279, 86, 48, -29, 110, -51, 140, -126, -59, 159, 264, 192, 272, 328, 48, 108, 142, 176, 0, 80, 2, 97, 166, -13, 195, 125, -102, -130, -40, 262, -233, -104, -159, -168, 38, 202, 116, 65, -73, -21, -123, 329, -271, 125, 2, 8, 165, 41, 13, -198, -9, -44, 270, 46, -176, -190, -1, 26, -165, 18, -102, -35, 209, -128, -160, -14, -250, 159, 16, 235, -44, 18, -33, -30, 72, -159, 422, 100, 39, -105, -68, 139, -18, 186, 5]
3389Eq1K89p1%k27j3J85L2%k73K11J52j98J10O0o8j26J35j47K69k43O7J31l62
3413a63K51j05K04Pj74j66K52k15P6J98j22J25J3l37J94j08J48l38j16M58k32
3434a50L49k55Q5n5Lr2J98j31j37O3J31k10m8N05n95K13M51o04J93r0J44j4M9
3457CO5k14J54k07J80K24L9l35P4K18m27L19j08J14m8j06K12j05k4m7R0rN1l10
3481a97K22Q9q5J36k27j84J35K27k0M9n3k8P5r7J27k3l11r8K08K67l37O8k20K38
3505c9J11k4m39L75j15J88m21K59R7J16j46O7Qr8l69K07R0L4J48j38p1O9J66r4
3529a9J63l66K83J03j82l06N26j84J08j02L8m9j12M6r7K25p6R0p0j84R0J26o1
3552a0Q9p6m0R5J06k65L49j95j71L14r1r3p4O2N3n6P3j36R1J1k3j18K15j00n7
$$ y = [5, -76, 213, 142, 142, -85, -98, 87, 119, 119, -154, 57, 209, 11, 121, 181, 113, -13, 122, -25, 244, 1, 68, 199, -163, 88, -17, 187, 194, 20, -146, 106, -109, -33, 165, 43, 168, 181, -156, 38, -70, 78, -260, -376, 82, -150, 199, -56, 29, -26, -23, -115, 83, -48, -185, -122, 9, -201, -249, 256, -339, -126, 325, -279, -86, -176, -32, -46, 3, 68, -146, 8, -199, -19, 205, 244, -91, -17, 201, -226, 93, -15, 99, 51, -55, 157, 52, 28, -19, 71, 62, 113, -197, 25, 114, 29, 165, -62, -246, -111, 116, 96, 145, 92, 64, 139, 42, 169, 146, -165, -263, -55, 212, -125, -57, -277, -39, 72, 48, -391, -16, -131, 57, -364, -105, -8, 108, -38, 29, 37, -61, -430, -223, -133, -99, 49, -89, -160, -91, 75, -19, 144, -222, 61, 164, -18, -324, 202, 18, 126, 24, 62, 13, -99, -53, -150, 75, -1, 89, 19, -165, -75, 51, -10, 79, 3, -37, 58, 164, -101, 248, 53, -118, 196, 105, 12, -62, 0, 53, -3, 70, -66, 25, 36, 13, -105, 110, 10, -47]
3577d7R8n9j40L17j00n0p9J66k15L3m2K80m23K19Ln1J7j49K33R1o5J17j85j03
3601a34J20m4l7K68l05J68J30j01J31P5j76j60K30j16j14J08j18K75k42R5KJ16
3623A71J64k77o7J04m0J51r4J47k09K0R0j69J49K4M0j62l65L28o1L9n6N2j16m0
3647a77K15P7l72K85m9o9K9J6K05j5k26J27k57L11l95M1M02j92J89k19J3K9m0
3670g2j42L4P8J37k47K70N3k52J39O5m5J31k19P0lJ59j17j33K95j74JQ9PM5J0
3695A79j37k67K67l9lj79J82R3o6O4J5J48j20L0R4n01K95k7R5P0k38K50j49k33
3719a77n1J17N8l8o1Q1L17l87j64K46r5J33J6m7P8j88p7K99j06K06jj31o5K09
3743A72l24l6L75k31J41j89qOK63q5j80J80O1qj57Q9o4j02l4J34N1r5K00K13k32
$$ y = [-47, 51, -8, -148, 169, 69, 19, -60, 106, -109, -76, -118, 162, -261, -42, -39, -90, -73, -222, 11, 102, 37, 154, -31, -134, -14, -58, -95, 173, -132, 36, 166, 65, 196, 271, 95, -65, 165, 49, -65, 43, -75, 200, -42, 53, 55, 171, 335, 58, -9, 95, 55, 206, 112, 259, 50, 70, 160, -9, 140, 164, 204, 42, -323, 5, -56, -17, -73, -21, -137, -177, 38, 115, -257, 28, -21, -90, -61, -45, 160, 145, -81, 46, -211, 100, -295, -254, 148, -44, 145, -74, -61, -32, -72, -214, -180, -102, 35, -212, 58, 111, -141, -2, 63, 18, 149, -70, 0, -3, 156, 39, -94, 201, 27, 28, 117, 124, 169, 179, 42, -225, 42, 3, 0, -179, 3, 96, 30, 94, 109, 257, 137, 167, 261, -240, 55, 28, 123, 193, -45, 205, 56, -177, -228, -111, -53, -91, -152, -71, 246, -141, -305, -59, -154, -21, -5, -52, 26, -162, -239, 60, -46, 160, 159, 28, -37, 172, -152, -188, 187, -44, 97, -92, -100, -94, 169, 84, -96, 84, 145, 137, -20, 69, 5, -97, -131, 3, 54, -41, 159, 372, 140]
3768A40j55q2J59j13K92k20J62j8l31J6J87J0nOl3M1q4%J42r2Rp2q3J38Q3l13
3794b16K86r5j08J17K7j26m9P9J94j39J40j72J09q7nL55m15J02J32j52j20O1J78
3817I6J4l04J46J41j21j18J16r7J5k3L33l09K33J22j35l92J27L32j86j68K25O2
3839A09k03M5o9J22K4q7N1k55L24J78k29K4j37J56o0j88K13Qm4j07L6N6L4J02
3863A03oj90R9L50l29J22Q4n3j84j20J57m9k22N26m30L59l62K1R1M5j8k08M18
3886B04k23j24K7L4j09K35J40j81Rm2j8O7j28K58k47l0P0J17p7L61m98k64N45
3909A26r5j32K1N4JK7J07k57J27L4J64l13J58j56L12J71l76jJ23m8o5q3R1K63
3933B53j50k02J19k3j22K38j02R5N2k56J54M0j71R3J00k06m7J05RJ61j88n2j16
$$ y = [140, -15, -97, 62, -51, 241, 21, 183, 165, -166, -150, 37, 47, 42, 48, 15, 56, -28, -28, 114, 22, 31, -41, -124, 14, 97, -216, 70, -25, -133, -16, 11, -115, -164, -85, 109, -30, 110, -62, 47, -40, -45, 310, -105, -3, 129, -23, -143, -82, 96, 110, -194, -48, 93, -28, -146, -30, -127, -112, -135, 198, -111, 122, 244, 109, -283, -156, 176, -10, -178, 47, 109, -94, -49, -118, 4, 28, -59, -8, -263, 61, 239, 10, 34, -103, 53, -7, -195, 18, 26, -18, -125, -89, -33, 1, 103, 97, -93, 6, 356, 27, 149, 233, 180, -4, -124, 33, -16, -238, 288, -142, 217, -145, -124, -33, 12, -6, -214, 204, -19, -143, -116, -82, -191, 44, 184, 3, 12, -30, -48, 19, -109, 149, -98, -128, -58, 59, -18, 343, -155, -419, 126, 31, -101, -80, -26, -25, 2, 109, -148, -21, 13, 177, -136, 22, -134, 178, 349, -27, -28, 95, 47, -18, -101, -10, 253, 103, -99, 20, -3, -125, 113, 11, 106, 158, -98, 56, 96, -75, 18, 118, -88, -135, -30, -21, 140, -48, -100, -216]
3956b16J47J33j72J69K25k96L6o6o0n6m3K46r1J36k62o1K61k51K1K14l6J94j48
3979B4J7j64L8J74k27J58L0k54L29m4k81J69R1K4pn8j12k9J19J80oO8k97J53j83
4004h8Q4M9J56j15k59j09K98K1k08J18j51K19kJ07K6q8r1J7J47J23M0j64p5ln3
4029aj12J00r3L8K01k58J13N1q7J51j45p3J09p0J14j92j35K14N3j9j60J68k92
4052c25J65J92k15r7L74j00j05P3J67j86J76k04j2K55n7k79L22j19j9o5J50j86
4074i5J2L5O3J4L4K16j76o6J5K46k51l57L09J80K8k32J55l23K94o5l38M41m5j69
4098g5J52l91K42Q9J6r9J61j04j82L06o9l2q8L99m42J46j57L83l28L11l58j02
4120b22M5K64k9j7r4P7j98K6J03o1j18K26J57l46K44J88j52l7L2L4Jk61J35K24
$$ y = [-216, -69, 64, -108, 61, 286, -10, 26, -40, -100, -156, -199, 47, -44, 92, -170, -231, 30, -221, -200, 14, -22, 172, 24, 41, -123, -85, 89, -138, 20, 50, -204, 125, 81, -200, -31, 60, 84, 77, 19, -93, -122, -3, 177, 171, 239, -58, 95, -88, -4, 45, 201, 86, -173, -282, 16, 37, -171, -53, -204, 15, 13, 120, 146, 58, -33, -16, 131, 254, 294, 130, 55, 52, -1, -113, -13, -106, -68, 133, -125, -12, 39, -48, 103, -42, -115, -6, -76, 38, -154, -289, -75, -22, -41, -201, -33, -325, -160, 32, -183, -280, 94, -6, -111, -38, 129, -57, 119, -85, -97, 158, 101, -178, 144, 25, 6, -59, 91, -95, -83, -48, 15, 29, 63, 279, 103, 37, 52, 298, 47, -310, -1, 179, 207, -25, 130, -193, 101, 36, -302, 139, 94, -75, 77, -314, -72, 17, 33, -66, 95, -9, -191, 115, 46, 14, -74, 325, -117, 29, -128, 255, -73, 238, -120, -222, -177, 87, 58, 41, -53, 24, -174, -148, -45, -106, -224, 2, 159, -187, 57, 245, 93, 56, 88, 122, 123, -138, -3, 221]
4144B21k93m5m0K42J4op6j08m2J12l7qK0p4L58k86mQ1J82l42K27k56n6K46j2M5
4170F3K18l46J0K21k19P1l2j36P1J54j65K17q3n1J13j09O6j13R8j28r7K08J2j31
4194h8j5K11m26L41j59N1K71k52J8j5j93L16j19j8O7J08J82k12k17K12l51L75
4216H7Kj08k30O6R3j21M6L07q3Q2o2j90K15k9J20j83N8Kk15K2K14j10J41P9p0
4241A33l35J65j5R4j03P2j9r2q0j30M00k16l5Q3o7J17K16p4k91M5L28o6o1j76
4265a07P1j71J97n4J05k75O4K68k15J97k94J4L15l01J7l4J73J80j46j61J89m3
4287a1J29k88K16j88R3R9K04j45p5R3pj29K16k11J45J84m14J84j66Q1p1K39k3
4310A55j77J2J46j92rj1J16L0K15l54Lj1K9K62k33kJ38k50J31J15J53m17j69J24
$$ y = [221, -72, -117, -157, 85, 99, 93, 17, -91, -133, -21, -58, -66, -46, -120, 238, -48, -52, 29, 211, -131, 96, -160, -216, 30, 18, 63, 281, -65, -55, 166, -53, 18, -14, -150, -79, 75, -90, 127, 44, -7, 106, -3, 63, -50, 48, -80, -177, 31, 43, -88, -103, 108, -318, 23, -136, -85, 186, -66, -48, -63, -256, 60, -59, -77, -10, 98, 280, 68, -149, 63, -288, 87, 89, -19, -249, -183, -90, -211, -165, 142, 59, 141, 79, -111, 104, 75, 195, 12, 70, 72, -143, -121, 93, -17, 124, 203, 133, -202, -37, -52, 42, -61, 11, -8, -100, -180, -310, 90, -126, -161, -78, -145, -28, 188, 114, -177, -132, 196, 130, 69, -107, -36, -207, -10, -64, 41, -234, -170, 98, -117, 80, -214, -200, 115, -186, -169, -203, -30, 150, 4, -157, 32, -11, 118, -170, 46, -142, -49, 50, 254, 109, 34, 127, 120, -9, 207, -4, 141, 325, -89, 95, -71, 10, -61, 178, 155, -22, -10, 136, -56, -65, -76, 40, 70, 285, -69, -66, -77, -48, 214, -19, -21, 117, -133, -2, 113, 266, -151, -320, -196]
4334a96J90k1j71J45k0M9J97j85K12l12J78k4j98K52m7l2nr2J58M6j92rk24L82
4358H1J6n2N0j70J24o3l5K47k37j0J34j0m5P2j81K29j92L11j79k64N46k93Nr9
4382a5o0J70pP3j64k24J10j33J56J2K86j26j09r1NP6K20o4k19M1J95r4J73j45
4406F6P9Nl8j88J17o1j9r8J55L36k84j13j4J69j62J17N1j99K75J39n4l67P0q1
4430i9jK79j42k17K33k6l9J44l91K99K10m09K03Q7k61J77J3j00l7O8pj98L21r1
4454A6o3J93l04J39J02J19l14K30n9j42k05O42j41r1k31J35P4n9O7r8O8m11K58
4477g5J8L19o8j86J86l05M4k04K72k0Om8q8J06l35K35Q9J49n3j82J8J40K9n6l
4502a2L5k28K18r6l1J33Q1j5k94M8K0M0OMJ41Rj33L4J15j79N4n2J53j27M2M4o1
$$ y = [-196, -6, -27, -198, -53, -73, -24, 173, -12, 200, -112, 66, 42, -156, 96, 49, 17, 12, -80, 78, 124, -68, -77, -301, 81, 97, 45, 95, -75, 49, -14, -49, 198, -39, -49, 85, 75, 30, 102, -79, 150, -42, 269, 90, -174, 372, 79, 84, -15, -75, 95, 88, 161, -3, -227, -117, -250, -94, -82, 204, 78, -31, -122, -117, -41, 179, 115, -104, -63, 132, 38, 211, 66, 145, 150, 112, -76, 41, -20, -39, -137, 18, 354, 70, -43, -57, 112, -50, 67, 118, -81, 194, 333, 279, -88, -18, -99, -100, 179, 37, -180, 53, 27, -12, 132, -259, 40, 250, -159, 44, 131, -130, 47, 60, -40, -77, -9, -16, -214, 107, 16, -47, 146, -158, -19, 83, 202, -112, 118, 59, -83, -288, 354, 213, 122, -109, 26, 100, 41, 108, 10, 78, -333, -75, -57, 262, 194, 8, 194, -111, -67, -271, 1, -19, -13, -61, -149, -43, -378, -143, -54, 95, 42, -140, -122, 18, 47, -9, -12, 23, -205, 13, -83, -114, 19, 100, 85, -209, -161, -141, -101, -95, -91, 50, 59, -74, -40, 75, -104, -50, -102, 51, -76, -34, 10, -51]
4529e1p6J51j41K24j66L15n6k44Q5n7R7j49J58j11J39r4J03ok06l4M8J99k11J22
4553C9j81p9L95l47O2q3P8q4L92k10K8q6j11J91K13m39j3N21l24m2Q1J41j22j37
4577a17K37q1r9J35k06L42l44K54J96n53L31o1M4K7n6j66K21M6l18O1J76J3J4
4600I6L8q4N2m61K09J89O6l23K29Lj14K6J93j49k5r1K06pm6j2Q9J87j67l54K04
4625d6j12Q0O3m7P8J06j51J1M9p0J1j07O1K03k3l02M19j43J50j21j90q7J31MJ05
4650G2k65Lj1J62M0O1j08J6K91o01L98k83J39Lp6J17O3K9J24j13j25J23N2j67
4674e6o7K36j44L1M6o9R3p6N4j67l5L8P2K85j53o2pj03R0k53L94R0k26l5j19J00
4700d3O5J19j31r2O6L63n35K00R9k21K3J46J47j33J21l9k76J44M3q3K6j13K30
$$ y = [-51, -127, 24, -117, 107, -59, 256, 200, -44, 41, -16, 81, -68, 90, -21, 118, 24, 127, 121, -85, -119, -71, 128, -83, 39, -142, -221, 174, -173, -111, -194, -116, -200, 192, -18, 10, -76, -187, 4, 217, -222, -235, 286, -38, -80, 1, 142, 20, -117, 120, 39, -60, 75, -131, 211, -133, 121, 317, -236, 95, 34, 78, 105, 49, -117, 104, 150, -168, -107, 69, 82, 96, 134, 50, 102, -359, -150, 39, 105, -218, 11, 14, -100, -74, 119, -30, -55, -146, 60, 53, 7, -5, 84, 271, 104, -250, -46, -158, -78, -15, -62, 16, 122, -29, -18, 31, -39, -28, -135, -74, 129, 106, -196, 223, 80, 230, 109, -81, -168, -37, -33, 72, -193, -190, -201, -39, 1, 62, -46, -30, 261, -340, 58, -225, -86, -83, -159, -42, 21, 50, 174, 61, -64, 59, 111, -56, -123, 113, -31, 0, 46, -23, 70, -6, 48, -119, -154, -116, -44, 241, 88, 26, 19, -84, 6, -247, 147, 237, 11, -24, -143, -43, 22, 141, 10, -82, -16, 347, -188, 12, 111, -110, -87, 59, 206, 73, 194, 155, -121, 23, 66, -17, 9, -104, 126]
4723A26K0j76r6N5J58l7j30J30j28K50n7k12k28K37L32j05J01k35o8K83j32o5
4745B3l5Q5j71J14J28j06k7JL01l22J5J90k24q0L02k36K53k10m7L3L6J61l83K61
4769F2j67R9K52j45O6N5k86j69L59p4n1p9Rj86L2M28l29J76r7K7q3P1j86L33k79
4794a62J50j73P9K75j85k4P4q0K28l25Or0J59j29L42l1j3m9Lk9j66K63l63K49
4818IL50m38L35j82j46m7L36j08k92L7K26k51J53J74k01J08j6k7j56K98r3j68
4840i9n8l0K23q2n3J72k14J61j04lO2J81j40q4J01J32j09j96O1K81k81J05j42
4863a16p1L47l34J65j27J98k94J65J9N9L06l91K13k3Q2l46L45k14m2J29j01n3
4885h4K13q1P6k70J03J51r9j86L14j13K04n3j04j52J08J57j94J18k92L39k48J49
$$ y = [126, 146, -30, -126, -71, 87, 50, -80, 50, -78, 172, 115, -97, -325, -88, 244, 139, 240, 5, -63, 220, 88, 23, -12, 73, -98, 16, 144, 38, 11, 12, 313, -9, 6, 196, -28, -108, 194, -42, 211, 1, -46, -13, 23, 184, -199, 62, -105, -6, 246, 101, 167, 222, -64, -233, 126, 52, 1, -78, -69, -255, -223, 205, -124, 52, -45, -18, -101, -30, -216, 117, -162, -12, -185, -106, 169, -16, -40, 34, -46, 182, -143, -137, -227, -68, -197, 145, 114, 101, 52, 55, 26, -140, 123, -240, 9, 359, -79, 256, 74, -72, -119, 217, 109, -183, -146, 80, -171, -18, 156, -45, 63, 47, 20, -136, 162, 69, -99, -157, -187, 36, -46, -99, 73, -141, 20, -84, -87, -25, 156, 16, -68, 33, 165, 56, -140, -79, 202, -79, 26, -116, -187, 160, -174, -9, -136, 62, -232, -67, -48, 11, 317, -74, 139, 116, 198, -148, 197, -17, -59, 70, -31, -84, 129, 48, 124, -146, -43, 108, 9, -177, 137, 24, 228, 175, 71, -81, 27, 184, -10, 108, -184, 155, -93, 56]
4907E6J47j59j7l1j1K33k34n9K41K0l40K32L0l6j56j51M9J05q8K00n5M8l5J50
4931A39O1k05J82k35j8K42K9j25l68L27P4k37j94L36k30L43l90J76p3k14N65l39
4953a54L04k01j08J46m0r5O8K06k05L1J23P1N9j70J12j85j30J86q6j16J74l0K04
4976A64l0P4j55K39j81R5l30J7J9J10J18k01j03O3K91m34K88M1j70J95j41j43
4998a74J44J96lN0j02k54nj6K75o0j58J43j7m6O8k86K18l5j01J46K3J21l1J4j97
5023h7k85K78p9J86j73j4J09MLN3j0j80P1l5J99J36j49q2J95j45J32o7k6K5O9
5048A28j6p3j71J24k6R5r4j7j47J46J99k09N3j12R5oK83k26P8j05n2j26N01l7
5072B85k88J16q0j43J52j34J87j60L03k17ro5p3K13Ro6j50K55j00j11K1O2j50
$$ y = [56, 203, 44, 27, -4, -15, 218, -16, -75, 166, 186, -154, 78, 108, 72, -84, -235, -186, -81, -169, 31, -24, 24, -11, 139, 200, -5, 177, -58, -76, 166, 195, 70, -298, 29, 103, -134, -328, 8, -222, 121, -269, -93, -166, -380, 185, -154, 150, -51, -159, -13, -53, -148, -80, 126, -79, -48, 75, 146, 205, 35, 147, -38, -168, 18, -68, -184, -10, -40, 164, 134, 208, 53, 292, 111, 206, -124, -107, -88, 22, 140, -61, -164, -101, 190, -244, 44, 85, -85, 110, -31, -174, -30, 166, 163, 213, 111, -143, -148, -164, 111, 51, -107, 36, 19, -27, 41, -245, -27, -62, -163, -17, 6, 127, 96, 110, -87, -372, -94, -173, 13, -160, -174, -65, -61, -58, -5, -15, -195, -124, -159, 40, 176, 27, -55, 140, -5, 127, 60, 34, 59, 128, 112, 39, -132, -8, -34, 61, -33, -50, -197, -51, 148, -61, -8, -120, -25, -31, 252, 26, 104, -1, -53, -179, 322, 285, -3, 113, 33, -110, 42, -92, 95, -65, 238, 21, 12, -53, -126, 87, 96, 30, -120, 135, 35, -76, -55, 7, -143]
5095a43L07k63o6M31k46j77J19L80l95Q8o7k01K49NJ45j82J07j05j22J36j57r
5117a66J9Q5m1J02K64j82j33K36k91J27J48M1j59j25O6l1j50L08Oj23J86n6J03
5140B34k48J52j85K79j07L4k96L0L99l90L31N2m48L31l82J57o4J18k46K32J9J09
5162A11l0q9K55m15J70j05n5K3L18n48N48r5j11J6j66R9K26Kk96N17l64J02o3
5185E0O6j83J31K68j74j71j62l5K92j5o6m0L1J79qO0j21j91O1J41m7j02q6nJ26
5210aK12j0k50J53j03n6j19L58l28M5J65k01K8K9OJ87j07K31r6j88M4l4J26j36
5234d5p7J15j7k11M43R0m76N8o0R9K9l6k90R3K39LJ27n5k16K14m8J21j91J22n5
5259b4k60L19j1j62lJ21N6J48j38k9p6m1n4J84P8N5k33P2pJ43j37P5q0l1R2J32
$$ y = [-143, 164, -99, -165, 266, 20, -157, -38, 342, -53, 35, -32, -233, 16, 21, 166, -16, 91, -14, -136, 0, -157, -166, -147, -62, -103, -1, 263, 81, -52, 184, -107, 20, 168, 209, 50, -75, -9, -40, -190, 118, 124, 1, 187, 131, 234, -14, 138, -47, 232, 125, 159, -137, -107, 292, -98, 233, 285, -163, 168, -214, -57, -121, -3, -249, -17, 2, 111, 81, -8, 247, -168, 2, -103, -158, -135, 183, -365, 183, 88, -23, -7, -173, -74, 152, 154, -142, 375, 11, 113, 50, 116, -67, 64, 332, 158, -13, -175, -210, 82, 67, 1, -39, -8, 171, 163, 223, 102, -89, -28, 113, 66, -36, -122, -127, -1, 211, 201, -49, 104, 1, -55, -174, 184, -144, -99, 66, -135, -107, -78, -72, 115, 8, 239, 143, -45, -1, -35, 91, -45, -122, -7, -24, -235, 208, 298, -178, -120, -180, -81, -52, -88, -378, -285, -46, -43, 84, 29, -187, 27, -21, 100, -91, 31, -24, -284, 35, 24, -138, -141, -20, 36, 184, 46, 17, -59, -100, -154, 30, 108, 163, -70, 2, -5, 138, 1, 76, -4, -35, 57, 189]
5285A89l82L06j70m0L02jk06N3M6j16J72r6k8mo5J35k31J34L91k91n2j14J49Q3
5309A64l89K47q2Oj05J46k41K68k2j49M68n32J59j84N64k90p3J25J2L0m25L14
5331A1J40k09MK0J27K8r5Q7n78N11j28L4Q6k1l1j30K05J80k78J37j74K2K36k76
5355i2j15J98K82o26L40j32J67J16k25J35L0Mj69K90j79l9KJ65k26J63j10K45
5377B24k97J7J65N3l7J38l31Q1J36m4j50j83M56k30J46j84k03J92j29Q0k5P1J18
5400F4k18Q6j7K08k15l7K09j90O4j26N4J35k8n8r3K13P0o4M7k02L0J19j38J49
5424F2Q1k78M06m05O1o4J53o2J96p2Jq8Q8r2O6j32K23k56J28J06n8K43j67l9q9
5449A2m2R1ON9k39J84k63O7l8J51L4r5J37j65K51k50J9J07j57J60o6N1O2K20j81
$$ y = [189, -193, 113, -57, -97, 205, 204, -2, 51, 97, -19, 153, 57, 29, 25, -40, 95, -136, -2, 389, 98, 46, -68, 81, 164, -225, 22, -60, -54, -159, -13, -254, 14, -8, -157, 311, -221, -62, -246, 318, 28, -45, 80, 92, 122, -303, 11, 151, -58, -54, -34, 93, 121, 26, 113, -465, 46, -82, -48, 38, 17, -14, -144, 61, 241, -37, 100, -74, -52, 184, -92, -207, -9, 273, -353, -13, -145, 22, 138, -87, 48, 78, 82, -87, 203, 24, -15, -13, 152, -74, 89, -21, 224, -73, -56, 109, 162, 125, 263, -68, 13, 149, 105, -45, -228, 228, -2, 144, -40, -243, -51, -180, -100, -125, -54, 64, -154, -68, -85, 123, -92, -129, 80, -110, -46, -172, -118, 17, -11, -69, -162, 51, 121, 57, 104, -98, -68, 51, -87, 62, 143, -135, 271, -134, -73, -137, 16, -46, 150, 78, 79, -9, 79, -13, 53, -79, 144, -112, 16, 122, 64, 307, 140, 101, 12, -30, 61, 67, 126, -113, 71, -192, -125, -163, -12, 22, -73, 64, -101, 150, -100, -81, 26, -131, 29, -37, 14, 76, 296, 115]
5474A15l02J94k33P2R2O2j43J50p7J11k01K31k1j68OJ53L9j89R4q5M3L06l97K3
5498a25J23J64Lk69L24k82J94L7l0n2k72Q2K38j77mQ5p0m3K23j98J46l98K64k18
5522b55N20k00L8l19L63m8n6q9J94j97M21m71n3K42J37k29J55l70L82O1n7k87
5544a18j17K74j90K51j77L8r0K25r6Q9o7J64k51J97j71J34l20L52k31J7k3J00
5566a0j1p3j52K43j28J35R6j20j78M0L27j84m15L56J43j20J29J83j61m6%J41j51
5589D4l04J64J26J8j53N0K28q0kk16R2J04k03K42j32J46l5m5l22L15q8J30K30
5612C09n77r8M81j83K6J47p1m2K2K9r3m2J55K0k16K25nk92K10K40l61K85k02J21
5636H8Q8j35k74K40n4L1O4j19j49K47q8J05K27j12l06J78J31j11l9j99J86M18
$$ y = [115, -187, 7, -226, -154, -62, 0, -143, 7, -70, 41, -160, 71, 50, -118, -112, 41, 80, -109, -15, -100, -57, 249, -148, -125, -2, 162, 165, -104, 220, -62, 132, 169, 139, 87, -185, -103, 135, -42, -46, 39, -31, -74, 149, -49, 97, -301, -37, -255, 265, 65, 103, -216, 147, 99, 43, -46, 148, -49, 372, -99, -152, 90, 227, -2, 153, -217, 165, 226, 169, -118, -235, 39, -151, 100, -77, -39, -129, 96, 0, 89, 22, 186, -65, 132, -39, 95, -225, 127, -104, -87, -110, -10, -21, -94, -246, -3, -131, 4, 100, -20, -198, -158, 169, -15, -430, -74, 69, -51, 78, 261, 100, 54, 54, 195, 44, -260, -96, 30, 48, -105, -55, 173, 93, 91, -125, -33, 71, -132, 110, -22, 124, 89, 44, -278, 37, -51, 79, 309, -268, -366, 115, -68, -42, 105, 34, -8, 14, 43, -50, -92, 63, 83, -133, 92, 87, -205, 5, 245, -116, 169, -33, 88, 176, 41, -233, 7, -47, -16, 48, -71, -220, 27, -61, 44, 271, 159, -147, 31, 162, 51, 12, -187, -1, 417]
5658D17l11j33K30R9k78N3P2P8j18r3J42O8k80K03Q4l05L04k75J33l6K5j88J10
5681Aj97J00K60j32J07j61Kk37L33k29N4L28m0k14O7K90j56k8k28N6o3K02j06
5704Ik7j29L9j58J3M07j88K68k11K36k48J19j15n8m6or4K12J03j22O0J5j11p5
5728a07J41r2K17r6J69l71k4K59o4J6J25j20j4J39q5o8q1O9k6P4N5p7o9l6j32
5753a98J62m6K85l37K53k43j30K00J14l03J03q2K03N8p8J26l0%J75j61M6m49J40
5776a92K11J11k12J61k37K15K48n26J47N1k5K11l70J77J73l53J55K28k98L6N3
5797c6nJ47o4L7k49Q4N8r3J69j32j15K03P4J5n1j59J82k52K06k3J09l5K90l43
5821A7J99r2m6J02k7K4j69J91j08k49J35J74j18j81j01K51j56R7j75N1O0J69J07
$$ y = [417, 106, -27, 203, 302, 24, 77, 149, 227, 109, 16, 158, 226, -54, 149, 233, -72, 232, -43, 90, 54, 79, -109, 1, -196, -96, 164, 32, 139, -22, -20, -257, 76, -153, -99, 229, 189, -25, 42, 332, 176, 148, -80, -24, -87, 115, 9, -18, -147, -108, -266, -253, 154, -34, 234, 23, 259, 11, 130, 15, -43, -89, -95, -189, 23, 126, 4, 64, 79, -32, -107, 34, -58, 159, 63, 232, -139, -163, 96, 32, 48, 173, 53, 39, 178, 93, 25, -56, 13, -13, 61, 116, 39, -30, -66, -198, -36, -82, 203, -134, 119, -124, -254, -54, 60, -243, -140, -222, -19, 39, -39, 87, 57, 57, 232, 71, 117, -332, -192, 19, 130, -82, 79, -158, 57, 305, -221, -74, -23, -48, 163, -207, -30, 143, -210, -55, 173, -125, -89, -36, -41, 106, 42, 79, -170, -86, -28, -121, 48, -84, -199, 4, 78, 93, 42, -117, 65, -187, 19, -4, 105, 70, 360, 17, 216, 124, 78, 180, 153, 177, 8, 199, 91, -158, -23, 151, 33, -148, -249, 2, -154, -57, -232, -181, -121, 48, 155]
5844A55k93J18P7K7j60J93j44j38n1K4J20m1J74j50K4q1K31K01m75j06J63K32
5866A00k2j76J47o9K21k9m24K21n1K51n02L84j68l2N7j9K18q3l8j62J59J19j2
5889I0j7kK9N5J65k75J2J10l17K33k33J93j5J3q3K10j50k31K82j01j38L26m4L1
5913A43l03J42M3k1j41K50k14L1K92r9j06p9j34K7K37j0k55J09J52j73K8J54k1
5936E2k61K42q0K81k22K0j11J4J11L6l9l6J20K3J0j37J92k05J37R2n2l99R0J83
5960F1k12K7N6q1L14k57m0J53N7k04P0J46k5O0j17M4M5k69N35l61j55K83r0k42
5984b02L46j73J78j14j9j5l6k3j9R0j10J67j3j94Q7k2J23j9j65j95P1K48o4M00
6008C27m38R0Q7k5k8k51J24mJ29P6m1m1J63j58k35K26K16k60J05n5J33k39P7K86
$$ y = [155, -138, -20, 57, 84, -76, 117, -27, -165, -216, -192, -72, -113, 61, -89, -65, -146, 85, 286, -189, -295, -132, 100, 78, -98, 49, -20, 201, 172, -252, -31, -82, 169, -333, 51, -117, -149, -92, -111, 107, 24, -14, -176, -17, 102, 90, 73, 71, 100, 155, 320, 45, 57, 167, -150, 83, -150, 43, 28, 41, -42, 168, 18, -213, 69, -32, -170, 156, 112, 143, -160, -18, 25, 4, -137, 113, -101, -70, 222, 123, 17, -62, -196, -169, 68, 58, -197, -88, 64, -109, -81, 73, 52, -209, 33, -47, 234, 12, 32, -79, -65, 46, 82, 43, 7, 127, 150, 160, 23, 215, 10, 147, 239, 187, -212, -122, 61, -151, -124, -68, -149, 165, -92, -132, 21, 78, -126, -56, 90, 65, 125, 8, 52, 97, -172, 363, 2, -153, 130, 40, -202, 144, -29, 149, 35, 16, 1, -35, -58, -77, 13, -97, 70, 57, -137, -50, -72, 51, 32, -133, -328, -257, -9, -73, 327, -111, -21, 66, 41, 13, -238, -114, -118, 11, 87, 46, 5, 168, 10, -225, 1, 217, -43, 62, 7, 140, -99, -22, 264]
6032B64j21l9K8n5k2K30j77j46K31r4k47j0mP4K63k66J50j74Q2m8J8PJ43n3K5
6057E9q3M3J04j01L14l05J16l63K32j98J62k20J35J03j03p3L70r8M6m52M45k62
6079a29P9kJ63J02l66L57k66J4K23o5N1q9K68n43J35J92j69j02J38K1j6l5J21
6102H2j07j62L22k04J35p9j03K38j69J94k61K67m4Q4j26J44k45J5J21k89M74k48
6124C9P3k02N7n0J84oO1j95k3j54K88l28J94o5Q5K54m07J29Q0q5M7m5K01m84R1
6149b61K57J00q0OP6k66J15R3k43K96j6M4j66n8K06k52N94l37L6j86l4J81r2j59
6173a46P6lJ16k28N3J78k92K20J39J6k11j41K66nj14J2K61j82J40r1l11K24j01
6196a24K37M5j77N2RJ83j78K50k86k5o0Q0J03p2K80m29K3L81l01j41J03K13p3
$$ y = [264, 143, 104, 132, 77, 55, 285, 108, -38, 193, 99, -148, -158, -162, -88, 175, -91, 59, -115, -33, -81, -63, -56, 87, 34, 59, -24, 19, 123, 22, 336, 31, 147, -216, 16, -182, -20, -240, -105, -2, -105, -178, 192, 94, 140, -312, 133, -129, -50, -52, 111, 213, -153, 204, -62, -48, 175, 110, 161, 72, 340, -203, -68, 124, -45, -147, -9, 12, -4, -39, 82, -25, -187, 135, -69, 66, -13, -116, 122, -47, 147, -114, 153, 109, 193, 67, 211, -34, -19, 102, -187, 287, 39, 112, -90, -33, -83, 101, 95, 156, -39, -62, -216, 72, -256, -62, -127, -42, 212, -195, -66, 14, -71, -24, -69, 132, -352, -261, -4, 96, 16, 22, 98, -168, -53, 40, -203, 93, 77, 121, -45, -103, 103, -149, 445, 108, 144, -42, -76, 105, 13, -146, -70, -73, 43, -185, -132, 46, -246, -26, 113, 129, -82, -223, 43, 38, -76, -64, 197, 15, 155, 64, -247, -23, -124, 113, 158, -19, 33, 42, 225, 47, 297, 11, -14, -74, 6, 109, 37, 317, -112, -89, 292, -9, -150, -47, 166, 93]
6219I3j36J14o0P6p6M1j05O0k96L53l8M0l9j63L38m14J90n0R2l1P0k14L15j99
6243c9J11p9j08J87Nj51K66j0j79k2k85OJ71K46l57J99J65j04L5P4j62J38k5j54
6267g2K38j52j9j78J02R7P6j8l5o3n2J12j32J32j17p8K15m62M77L9p8n5M0j67
6291a50L86l01Oq6M6m5K46j79K79k00L3J32n44L87j37J27p5l0J36P7l84K53O6
6314D3k47K00J44l03K57j24J07L8j82m7j35J15J49R8l18J12J50k6J47k63K26k80
$$ y = [93, -43, 71, 11, 87, 11, 52, -53, 7, -289, 64, 26, 66, 27, -136, 202, -212, -22, -72, 20, -11, 59, -155, 160, -39, 72, -7, -115, 72, 77, -74, 192, 182, 3, -19, -304, -298, -127, 119, -238, -39, 126, 22, 57, 131, -31, 107, 82, -72, 166, 14, -5, -183, -81, 16, 92, 74, 39, -24, -76, 36, -96, 36, -81, -159, 56, -406, 71, 110, 32, -23, 17, -150, 236, -65, -59, -145, -99, -144, 102, -77, 202, 2, 35, 167, -377, 10, -127, 0, -75, -105, 31, 108, -276, -23, 43, -204, -4, 140, -163, 94, -30, 77, 115, -67, -114, -249, -134, 15, 113, -205, -93, 57, 31, 178, -85, 141, -139]
$$ [...]
8191A31
##END NTUPLES=NMR FID
##END=
