##TITLE=1H_LO4-5488
 CDCl3,8 sc, 
 30.03.2021
##JCAMPDX= 6.0         $$ Bruker NMR JCAMP-DX V2.0
##DATA TYPE= NMR FID
##DATA CLASS= NTUPLES
##ORIGIN= UXNMR, Bruker Analytische Messtechnik GmbH
##OWNER= root
$$ XWIN-NMR		Version 3.5
$$ Tue Mar 30 12:54:53 2021 Russian Standard Time (UT+4h)  she@DPX200
##.OBSERVE FREQUENCY= 200.131506
##.OBSERVE NUCLEUS= ^1H
##.DELAY= (6, 6)
##.ACQUISITION MODE= SIMULTANEOUS
##.ACQUISITION SCHEME= undefined
##.AVERAGES= 8
##.DIGITISER RES= 18
##SPECTROMETER/DATA SYSTEM= spect
##.PULSE SEQUENCE= zg30
##.SOLVENT NAME= CDCl3
##.SHIFT REFERENCE= (INTERNAL, CDCl3, 0, 15.7039)
##AUDIT TRAIL= $$ (NUMBER, WHEN, WHO, WHERE, WHAT)
$$ ##TITLE= Audit trail, XWIN-NMR		Version 3.5
$$ ##JCAMPDX= 5.01
$$ ##ORIGIN= Bruker BioSpin GmbH
$$ ##OWNER= she
$$ F:/spectra/data/she/nmr/H-F/1/audita.txt
$$ ##AUDIT TRAIL=  $$ (NUMBER, WHEN, WHO, WHERE, WHAT)
(   1,<2021-03-30 12:53:32.37 +0400>,<she>,<DPX200>,
      <created by zg, POWCHK disabled, PULCHK disabled
       configuration hash MD5:
       00 E9 B6 7A A2 85 ED C7 34 08 36 98 17 FE 4E 26
       data hash MD5: 16K
       BD 55 86 F4 C0 25 50 32 D3 6E C9 BF D7 10 14 5A>)
$$ ##END=
$$ 
$$ hash MD5
$$ 75 B3 33 63 2C 25 0E CE 91 7D B2 93 89 E1 D8 2A
##$RELAX= 
##$RELAX= 
##$RELAX= 
##$RELAX= 
##$RELAX= 
##$RELAX= 
$$ Bruker specific parameters
$$ --------------------------
##$DU= <F:/spectra>
##$EXPNO= 1
##$NAME= <H-F>
##$PROCNO= 1
##$TYPE= <nmr>
##$USER= <she>
##$AMP= (0..31)
100 100 100 100 100 100 100 100 100 100 100 100 100 100 100 100 100 100 
100 100 100 100 100 100 100 100 100 100 100 100 100 100 
##$AQSEQ= 0
##$AQ_mod= 1
##$AUNM= <au_zg>
##$AUTOPOS= <>
##$BF1= 200.13
##$BF2= 200.13
##$BF3= 200.13
##$BF4= 200.13
##$BF5= 200.13
##$BF6= 200.13
##$BF7= 200.13
##$BF8= 200.13
##$BYTORDA= 1
##$CFDGTYP= 0
##$CFRGTYP= 5
##$CHEMSTR= <none>
##$CNST= (0..31)
1 1 145 1 1 1 1 1 1 1 1 1 1 1 1 1 1 1 1 1 1 1 1 1 1 1 1 1 1 1 1 1 
##$CPDPRG= <>
##$CPDPRG1= <>
##$CPDPRG2= <>
##$CPDPRG3= <>
##$CPDPRG4= <mlev>
##$CPDPRG5= <mlev>
##$CPDPRG6= <mlev>
##$CPDPRG7= <mlev>
##$CPDPRG8= <mlev>
##$CPDPRGB= <>
##$CPDPRGT= <>
##$D= (0..31)
0 1.2 0 0 0 0 0 0 0 0.06 0 0.03 0 0 0 0 0.0002 0 0 0 0 0 0 0 0 0 0 0 0 
0 0 0 
##$DATE= 1617094411
##$DBL= (0..7)
120 120 120 120 120 120 120 120 
##$DBP= (0..7)
150 150 150 150 150 150 150 150 
##$DBP07= 0
##$DBPNAM0= <>
##$DBPNAM1= <>
##$DBPNAM2= <>
##$DBPNAM3= <>
##$DBPNAM4= <>
##$DBPNAM5= <>
##$DBPNAM6= <>
##$DBPNAM7= <>
##$DBPOAL= (0..7)
0.5 0.5 0.5 0.5 0.5 0.5 0.5 0.5 
##$DBPOFFS= (0..7)
0 0 0 0 0 0 0 0 
##$DE= 6
##$DECBNUC= <off>
##$DECIM= 32
##$DECNUC= <off>
##$DECSTAT= 4
##$DIGMOD= 1
##$DIGTYP= 9
##$DL= (0..7)
0 120 120 120 120 120 120 120 
##$DP= (0..7)
150 150 150 150 150 150 150 150 
##$DP07= 0
##$DPNAME0= <>
##$DPNAME1= <>
##$DPNAME2= <>
##$DPNAME3= <>
##$DPNAME4= <>
##$DPNAME5= <>
##$DPNAME6= <>
##$DPNAME7= <>
##$DPOAL= (0..7)
0.5 0.5 0.5 0.5 0.5 0.5 0.5 0.5 
##$DPOFFS= (0..7)
0 0 0 0 0 0 0 0 
##$DQDMODE= 0
##$DR= 18
##$DS= 0
##$DSLIST= <SSSSSSSSSSSSSSS>
$$ [...]
##$SUBNAM2= <"">
##$SUBNAM3= <"">
##$SUBNAM4= <"">
##$SUBNAM5= <"">
##$SUBNAM6= <"">
##$SUBNAM7= <"">
##$SUBNAM8= <"">
##$SUBNAM9= <"">
##$SW= 16.9725357007746
##$SWIBOX= (0..15)
0 0 2 0 0 0 0 0 0 0 0 0 0 0 0 0 
##$SW_h= 3396.73913043478
##$TD= 16384
##$TD0= 1
##$TE= 0
##$TE2= 300
##$TE3= 300
##$TEG= 300
##$TL= (0..7)
0 120 120 120 120 120 120 120 
##$TP= (0..7)
150 150 150 150 150 150 150 150 
##$TP07= 0
##$TPNAME0= <>
##$TPNAME1= <>
##$TPNAME2= <>
##$TPNAME3= <>
##$TPNAME4= <>
##$TPNAME5= <>
##$TPNAME6= <>
##$TPNAME7= <>
##$TPOAL= (0..7)
0.5 0.5 0.5 0.5 0.5 0.5 0.5 0.5 
##$TPOFFS= (0..7)
0 0 0 0 0 0 0 0 
##$TUNHIN= 0
##$TUNHOUT= 0
##$TUNXOUT= 0
##$USERA1= <user>
##$USERA2= <user>
##$USERA3= <user>
##$USERA4= <user>
##$USERA5= <user>
##$V9= 5
##$VALIST= <valist>
##$VCLIST= <CCCCCCCCCCCCCCC>
##$VD= 0
##$VDLIST= <DDDDDDDDDDDDDDD>
##$VPLIST= <PPPPPPPPPPPPPPP>
##$VTLIST= <TTTTTTTTTTTTTTT>
##$WBST= 1024
##$WBSW= 4
##$XGAIN= (0..3)
0 0 0 0 
##$XL= 0
##$YL= 0
##$YMAX_a= 57755
##$YMIN_a= -41279
##$ZGOPTNS= <>
##$ZL1= 120
##$ZL2= 120
##$ZL3= 120
##$ZL4= 120
##$ABSF1= 10
##$ABSF2= 0
##$ABSG= 5
##$ABSL= 3
##$ALPHA= 0
##$AQORDER= 0
##$ASSFAC= 0
##$ASSFACI= 0
##$ASSFACX= 0
##$ASSWID= 0
##$AUNMP= <proc_1d>
##$AZFE= 0.1
##$AZFW= 0.1
##$BCFW= 1
##$BC_mod= 2
##$BYTORDP= 1
##$COROFFS= 0
##$CY= 11.3945322036743
##$DATMOD= 1
##$DC= 2
##$DFILT= <>
##$DTYPP= 0
##$F1P= 15.9154993809931
##$F2P= -4.1035820241983
##$FCOR= 0.5
##$FTSIZE= 0
##$FT_mod= 4
##$GAMMA= 1
##$GB= 0.15
##$INTBC= 1
##$INTSCL= 1
##$ISEN= 128
##$LB= 0.24
##$LEV0= 0
##$LPBIN= 0
##$MAXI= 10000
##$MC2= 0
##$MEAN= 0
##$ME_mod= 0
##$MI= 1.114404
##$NCOEF= 0
##$NC_proc= 0
##$NLEV= 6
##$NOISF1= 3.799351
##$NOISF2= 2.8
##$NSP= 1
##$NTH_PI= 0
##$NZP= 0
##$OFFSET= 15.70392
##$PC= 1
##$PHC0= -11128.75
##$PHC1= 24.60093
##$PH_mod= 1
##$PKNL= yes
##$PPARMOD= 0
##$PSCAL= 0
##$PSIGN= 0
##$REVERSE= no
##$SF= 200.130013532006
##$SI= 16384
##$SIGF1= 3
##$SIGF2= 2
##$SINO= 400
##$SIOLD= 16384
##$SREGLST= <1H.CDCl3>
##$SSB= 0
##$STSI= 0
##$STSR= 0
##$SW_p= 3612.71676300578
##$SYMM= 0
##$S_DEV= 0
##$TDeff= 0
##$TDoff= 0
##$TI= <>
##$TILT= no
##$TM1= 0
##$TM2= 0
##$TOPLEV= 0
##$USERP1= <user>
##$USERP2= <user>
##$USERP3= <user>
##$USERP4= <user>
##$USERP5= <user>
##$WDW= 1
##$XDIM= 8192
##$YMAX_p= 0
##$YMIN_p= 0
$$ End of Bruker specific parameters
$$ ---------------------------------
##NTUPLES= NMR FID
##VAR_NAME=  TIME,          FID/REAL,        FID/IMAG
##SYMBOL=    X,             R,               I
##VAR_TYPE=  INDEPENDENT,   DEPENDENT,       DEPENDENT
##VAR_FORM=  AFFN,          ASDF,            ASDF
##VAR_DIM=   8192,          8192,            8192
##UNITS=     SECONDS,       ARBITRARY UNITS, ARBITRARY UNITS
##FACTOR=    0.0002944,     1,               1
##FIRST=     0,             0,               0
##LAST=      2.4114304,     0,               0
##MIN=       0,             -41279,          0
##MAX=       2.4114304,     57755,           0
$$ Real data points
##PAGE= N=1
##DATA TABLE= (X++(R..R)), XYDATA
$$ plain form
0 0 0 0 0 0 0 0 0 0 0 0 0 0 0 0 0 0 -8 8 -8 8 -8 8 -16 16 -16 24 -24 26 -32 40 -40 48 -56 64 -70 80 -88 97
38 97 -107 121 -135 148 -165 183 -201 222 -245 270 -298 327 -360 397 -439 482 -536 593 -658 736
58 736 -825 932 -1061 1222 -1424 1695 -2070 2625 -3529 5240 -9566 43311 57755 -41279 24088
73 24088 22529 6936 23275 2488 12453 13853 -1686 21012 8914 -7346 2770 16994 4573
86 4573 -12602 2838 12042 3001 -4833 -8756 13066 7853 -8244 4544 181 373 11493 855
100 855 -1866 -2468 2542 12547 -298 -9239 -2108 6279 6334 -12466 -8052 7849 -4299 -6764 -3058
115 -3058 -4665 -1475 -5508 -2376 -4106 -11572 2701 2622 -10748 -9578 -1117 7248 -6333 -13774 -25
130 -25 147 -1286 -5373 -6988 -402 -5496 1686 1450 -12010 541 3538 166 1398 -7616 5474
$$ packed form
0@%%%%%%%%%%%%%%%%qJ6j6J6j6J6k4L2l2M0m8N0n8P2q0Q8j04J20j34J50j68J85
38I7k04K28k56K83l13L48l84M23m67N15n68O25o87P57q36R21j018J129j251J394
58G36j561J757j993K283k646L119l765M695o154Q769j4806N2877J4444r9034O5367
73B4088j559j5593J6339k0787R965J400j5539K2698j2098j6260J0116J4224j2421
86D573j7175J5440R204r041p834l923K1822n213j6097J2788m363J92J1120j0638
100H55k721o02N010J0005j2845q941P131Q387N5j8800M414J5901j2148k465L706
115c058j607L190m033L132j730p466J4273p9j3370J170Q461Q365j3581p441J3749
130b5J72j433m087j615O586n094P182k36j3460J2551K997l372J232r014J3090
$$ plain form
145 5474 10841 -4652 1481 5934 7620 6186 -883 8209 5168 3053 11844 -629 -1154 7596 5615
160 5615 4793 -5151 -3746 8607 537 -4536 -3811 -2298 1378 -2849 -2695 -4109 -4205 1972 -2614 -3287
176 -3287 -2740 -2671 5002 -3055 -6653 3059 944 1901 -2685 -6061 5675 980 -3586 -1384 -4141 -195
192 -195 -604 -2971 -4544 -8581 402 1161 -8188 -6758 -3990 880 -2958 -9301 -218 -1635 -3667 273
208 273 -3825 -1830 743 1954 899 -4732 2731 6554 382 1536 -383 5281 8246 174 2476
223 2476 2858 4683 8762 306 2342 5376 3120 7343 1809 449 4925 3926 5165 -10 -946 6855
239 6855 3094 -235 -314 1861 5423 -1192 -50 2858 -1924 3962 3327 -3229 -1014 1895 5320 -1011
255 -1011 -4486 2564 1734 1071 -541 -2965 1830 -21 -456 61 -5238 490 1186 -3153 -2311 -4362 600
$$ packed form
145E474N367j5493O133M453J686j434p069R092l041k115Q791j2473n25Q750j981
160E615q22r944J405J2353q070n073P25J513L676m227J54j414r6O177m586o73
176c287N47O9P673q057l598R712k115R57m586l376J1736m695m566K202k757L946
192a95m09k367j573m037Q983P59r349J430K768M870l838o343R083j417k032L940
208B73m098J995K573J211j055n631P463L823o172J154j919N664K965q072K302
223B476L82J825M079q456K036L034k256M223n534j360M476r99J239n175r36P801
239F855l761l329p9K175L562o615J142K908m782N886o35o556K215K909L425o331
255a011l475P050q30o63j612k424M795j851m35N17n299N728O96m339Q42k051M962
$$ plain form
272 600 673 -6714 -2784 -1784 -2024 -918 -5653 -3924 -727 -962 -3123 -4834 -1730 -1356 -663 -295 -5344
289 -5344 -1408 2255 -354 -975 -3054 906 4341 -2041 424 1667 51 4454 401 -887 3333
304 3333 757 2990 1509 -2929 2502 3710 -2 -958 -693 2242 1443 -843 -1584 -885 2091 59
320 59 -1597 -1002 -1741 2236 543 -2623 240 -982 2378 1421 -4465 1647 2085 -392 561 -2659 888
337 888 1348 -1580 -94 -3241 -55 1595 -2887 -1363 -3174 -454 1793 -4233 -2487 -872 -589 183
353 183 -4119 -1830 -272 -548 390 -2984 -1747 1204 -163 194 -1843 -925 2839 792 -460 -763 1806
370 1806 3859 22 317 1645 1892 3805 1056 624 2617 2040 4607 1873 -976 4082 3543 1926
386 1926 1457 -363 3738 2791 65 940 552 1856 2228 -343 -135 75 2215 1697 -1290 770 1176
$$ packed form
272F00P3p387L930J000k40J106m735J729L197k35k161j711L104L74O93L68n049
289e344L936L663k609o21k079L960L435o382K465J243j616M403m053j288M220
304C333k576K233j481m438N431J208l712r56K65K935p99k286p41O99K976k032
320E9j656N95p39L977j693l166K863j222L360r57n886O112M38k477R53l220L547
337H88M60k928J486l147L186J650m482J524j811K720K247o026J746J615K83P72
353A83m302K289J558k76R38l374J237K951j367L57k037R18L764k047j252l03K569
370A806K053l837K95J328K47J913k749m32J993n77K567k734k849N058n39j617
386A926m69j820M101r47k726Q75l88J304L72k571K08K10K140n18k987K060M06
$$ plain form
403 1176 2095 1514 -2312 1120 1775 629 669 -2119 847 1872 -1068 -438 -1733 -647 1175 -1735 -2040
420 -2040 -2507 -1471 353 -3456 -3731 -1660 -1508 -848 -4213 -2860 -697 -2016 -762 -3061 -3182 145
436 145 -1211 -1412 -1891 -2282 1245 -64 -2100 -1271 -556 1604 -569 -1628 83 -298 1658 -288 -2021
453 -2021 922 472 1312 662 -1806 1165 1929 811 1 -852 2313 2238 -284 499 101 1668 1719 -551
471 -551 81 13 1274 1615 -1584 -402 840 1016 998 -2009 -366 1749 269 72 -1118 -113 1509
488 1509 393 -246 -1664 294 1700 -1101 -860 -603 -545 961 -1352 -2097 -1021 -537 662 -2051 -2790
505 -2790 545 -284 -172 -1816 -1855 1100 -249 -443 -549 -1275 1444 947 -132 -236 61 2603 1421 -1269
523 -1269 1374 1256 1920 1692 -408 1262 1911 2003 1312 -808 1457 2833 1289 942 27 1670 2948
$$ packed form
403A176R19n81l826L432O55j146M0k788K966J025k940O30j295J086J822k910l05
420b040m67J036J824l809k75K071J52O60l365J353K163j319J254k299j21L327
436A45j356k01m79l91L527j309k036Q29P15K160k173j059J711l81J956j946j733
453b021K943m50Q40o50k468K971P64j118q10q53L165p5k522P83l98J567N1k270
471e51O32o8J261L41l199J182J242J76j8l007J643K115j480j97j190J005J622
488A509j116o39j418J958J406k801K41K57N8J506k313p45J076M84J199k713p39
505b790L335q29J12j644l9K955j349j94j06p26K719m97j079j04K97K542j182k690
523a269K643j18O64k28k100J670O49R2o91k120K265J376j544l47r15J643J278
$$ plain form
540 2948 959 604 702 2174 2491 53 303 982 2314 1289 -701 277 1048 1305 1144 -1082 -699 1129
558 1129 921 -474 -1715 -541 1123 -542 -1295 -1208 -806 -344 -748 -1894 -2051 -1092 15 -1662 -2927
575 -2927 -1531 -789 -401 -2397 -2753 -919 -1218 -1424 -1987 -2903 -673 -549 -1509 -1943 -2306 47 33 -1858
593 -1858 -1198 -1091 869 537 -2338 -352 625 894 498 -1318 734 898 839 1376 -988 404 2111 796
611 796 132 -789 1679 2525 -59 581 866 1142 1917 292 522 491 1360 2085 -46 -189 966 1773 1004
630 1004 -1028 -91 1921 713 301 -641 77 866 411 -396 -921 -487 791 -84 -1522 -1058 -262 1203
648 1203 -1319 -2086 -436 216 -266 -1287 -1134 -455 -380 -150 -751 -2019 218 683 -117 -1258 -1162 1710
666 1710 528 -1091 -79 176 770 1229 -214 -32 619 1472 1145 -716 518 2024 1631 601 -19
$$ packed form
540B948j989l55R8J472L17k438K50O79J332j025j990R78P71K57j61k226L83J828
558A129k08j395j241J174J664j665p53Q7M02M62m04j146j57R59J107j677j265
575b927J396P42L88j996l56J834k99k06n63r16K230J24r60m34l63K353j4j891
593a858O60J07J960l32k875J986R77K69l96j816K052J64n9N37k364J392J707j315
611G96o64r21K468Q46k584O40K85K76P75j625K30l1Q69P25k131j43J155Q07p69
630A004k032R37K012j208m12r42P18P89m55q07n25M34J278q75j438M64P96J465
648A203k522p67J650O52m82j021J53O79P5K30o01j268K237M65q00j141R6K872
666A710j182j619J012K55N94M59j443J82O51Q53l27j861J234J506l93j030o20
$$ plain form
683 -19 1323 2015 1479 844 -54 1457 2521 904 197 422 1853 2142 304 382 770 1017 1968 25 -424
702 -424 1142 1268 593 -1011 -697 1242 272 -480 -681 -852 118 -173 -1195 -1491 -1221 241 -958 -2175
720 -2175 -1610 -1158 -615 -1817 -2302 -1690 -1155 -583 -1737 -3065 -1099 -967 -1776 -1834 -2198 -808 -711 -1133 -1168
739 -1168 -2002 -342 45 -1952 -1490 -458 479 195 -1206 -195 426 285 558 -655 255 842 1013 576
757 576 -338 899 1805 914 603 282 1170 2098 559 571 819 1476 2437 529 -54 1687 1438 1313 700
776 700 264 1206 873 1490 -22 -534 1525 892 104 -207 -131 1172 93 -456 -524 -434 654 -80 -1014 -730
796 -730 -743 353 -563 -1848 -265 -189 -553 -697 -1590 -241 -248 -796 -698 -1444 -102 324 -1029 -492 -537 270
816 270 370 -782 -558 -98 761 679 -971 -235 884 614 515 -354 559 937 890 976 206 644 1779 845
$$ packed form
683a9J342O92n36o35q98J511J064j617p07K25J431K89j838P8L88K47R51j943m49
702d24J566J26o75j604L14J939r70p52k01j71R70k91j022k96K70J462j199j217
720b175N65M52N43j202m85O12N35N72j154j328J966J32q09n8l64J390R7m22l5
739a168q34J660L87j997M62J032R37k84j401J011O21j41K73j213R10N87J71m37
757E76r14J237R06q91l11l21Q88R28j539J2K48O57R61j908n83J741k49j25o13
776G00m36R42l33O17j512n12K059o33p88l11P6J303j079n49o8R0J088p34r34K84
796g30j3J096r16j285J583P6l64j44q93J349pn48R8p46J342M26j353N37m5Q07
816B70J00j152K24M60Q59q2j650P36J119k70r9q69R13L78m7Q6p70M38J135r34
$$ plain form
836 845 446 40 1010 1775 741 540 662 1309 1890 558 -71 770 1191 853 30 -164 544 707 387 -284
856 -284 -668 494 422 -537 -1073 -948 326 -311 -1602 -554 -1165 -295 -617 -1446 -1515 -1210 -286 -629 -2544
875 -2544 -1003 -202 -1269 -1425 -2236 -1088 -657 -1165 -1130 -1858 -1257 -186 -1174 -1223 -897 -632 184 -1111 -971
894 -971 -365 -242 580 -747 -439 409 695 320 -188 29 1151 567 456 166 68 1312 831 380 215 788
914 788 1781 701 366 1000 1282 1599 917 523 1070 1084 1606 754 67 1265 1396 1111 201 202 1190 1038 311
935 311 128 -194 910 774 -435 -252 -286 726 309 -882 -555 -126 97 -128 -1185 -605 498 -262 -563
954 -563 -1191 -335 -179 -784 -270 -1125 -418 118 -279 -805 -997 -120 583 -733 -897 200 -35 190 -70 -371
974 -371 389 375 607 -305 -433 535 666 94 -269 52 971 452 -99 15 113 1197 517 -52 423 687 1003
$$ packed form
836H45l99m06R70P65j034k01J22O47N81j332o29Q41M21l38q23j94P08J63l20o71
856b84l84J162p2r59n36J25J274o37j291J048o11Q70l22q29o9L05R24l43j915
875b544J541Q01j067j56q11J148M31n08L5p28O01J071r88m9L26K65Q16j295J40
894i71O06J23Q22j327L08Q48K86l75n08K17J122n84j11k90r8J244m81m51j65N73
914G88R93j080l35O34K82L17o82l94N47J4N22q52o87J198J31k85r10JR88j52p27
935C11j83l22J104j36j209J83l4J012m17j191L27M29K23k25j057N80J103p60l01
954e63o28Q56J56o05N14q55P07N36l97n26j92Q77P03j316j64J097k35K25k60l01
974c71P60j4K32r12j28R68J31n72l63L21R19n19n51J14R8J084o80n69M75K64L16
$$ plain form
995 1003 550 -145 626 630 907 108 -445 242 933 338 -307 -666 686 386 -476 -344 -339 140 292 -439 -679
1016 -679 -582 21 115 -1491 -1091 -306 -316 -612 -1719 -900 -327 -707 -961 -1564 -1037 -120 -994 -872 -1250 -1074
1036 -1074 235 -744 -1207 -524 -496 180 -571 -1119 0 187 187 -592 -458 190 363 210 29 -212 536 935
1056 935 398 -131 -242 994 697 259 291 526 1268 896 93 681 956 1282 948 79 811 1020 1276 1145
1076 1145 354 995 1740 1242 423 315 1363 1185 312 228 523 836 846 65 245 79 297 737 -478 -326
1096 -326 277 715 236 -1224 -446 372 -498 -505 -868 -581 -105 -105 -667 -1037 -483 4 -531 -901 -1018 37 481
1117 481 -726 -852 -31 77 -48 -556 -723 149 -153 -223 -293 -816 -42 574 149 -608 -476 901 425 -592
1137 -592 -493 -74 528 243 -382 23 127 192 478 -585 -78 801 671 289 -234 353 1215 348 111 -230
$$ packed form
995A003m53o95P71MK77p99n53O87O91n95o45l59J352l00q62J32NM79J52p31k40
1016f79R7O03R4j606M00P85j0k96j107Q19N73l80k54o03N27R17q74J22l78J76
1036a074J309r79m63O83K8O76p51n48J119J87%p79J34O48J73j53j81k41P48L99
1056I35n37n29j11J236k97m38L2K35P42l72q03N88K75L26l34q69P32K09K56j31
1076A145p91O41P45m98q19j08J048j78q73q4K95L13J0p81J80j66K18M40j215J52
1096c26O03M38m79j460P78Q18q70pl63K87M76%n62l70N54M87n35l70j17J055M44
1117D81j207j26Q21J08j25n08j67Q72l02p0p0n23P74O16m25p57J32J377m76j017
1137e92R9M19O02k85o25M05J04O5K86j063N07Q79j30l82n23N87Q62q67k37l41
$$ plain form
1157 -230 667 605 68 108 74 301 378 -320 -401 -222 32 350 -843 -1014 93 9 -277 -985 -800 15 -283
1178 -283 -699 -943 -288 -311 -625 -471 -744 -564 249 -111 -1013 -827 -327 184 -854 -1007 -90 -236 -27 -312
1198 -312 -864 -239 263 -1 -56 -417 351 588 58 46 -13 950 965 -160 344 614 726 663 -1 179 643
1219 643 836 907 170 296 1143 1089 857 499 576 1411 786 554 651 726 1109 475 500 673 561 940 554 2
1241 2 128 415 738 87 -330 480 282 -89 -508 -420 -44 -494 -448 -586 -660 -43 -499 -577 -794 -800 486 -37
1263 -37 -1088 -739 -196 98 -421 -897 -600 -33 -483 -543 -1016 -378 -53 -224 -489 -932 -136 349 -134 -729
1283 -729 -515 391 118 -409 -291 127 516 465 -283 -68 423 514 365 -56 -94 535 608 387 -218 256 966
1304 966 431 -201 79 230 819 455 81 126 524 845 214 -123 64 346 572 -99 -513 67 118 59 -274
$$ packed form
1157b30Q97o2n37M0l4K27P7o98q1J79K54L18j193j71J107q4k86p08J85Q15k98
1178b83m16k44O55k3l14J54k73J80Q13l60r02J86N00N11j038j53R17j46K09k85
1198c12n52O25N02k64n5l61P68K37n30j2n9R63J5j125N04K70J12o3o64J80M64
1219F43J93P1p37J26Q47n4k32l58P7Q35o25k32R7P5L83o34K5J73j12L79l86n52
1241BJ26K87L23o51m17Q10j98l71m19Q8L76m50M6j38p4O17m56p8k17oJ286n23
1263c7j051L49N43K94n19m76K97N67m50o0m73O38L25j71k65m43P96M85m83n95
1283g29K14R06k73n27J18M18L89n1p48K15M91R1j49m21l8O29P3k21o05M74P10
1304I66n35o32K80J51N89l64l74M5L98L21o31l37J87K82K26o71m14N80N1n9l33
$$ plain form
1325 -274 -819 84 -323 -499 -524 -625 -127 -306 -610 -854 -717 -201 -406 -716 -587 -58 225 -331 -821 -262
1345 -262 13 -151 -32 -239 -147 209 -135 -397 -153 -16 452 -157 -414 11 372 357 24 -67 189 724 761
1366 761 470 224 506 801 761 274 491 818 883 595 479 530 1352 601 340 406 601 808 288 330 474 430
1388 430 732 337 -233 83 410 230 -260 -333 28 284 19 -411 -817 42 23 -120 -554 -549 -338 -210 -595
1409 -595 -732 -503 -211 -509 -909 -817 -304 -153 -361 -945 -438 -87 -432 -484 -522 -412 -183 -204 -506 -443 -82 155
1431 155 -410 -497 -387 -28 96 -296 -313 -31 179 358 -90 -159 253 289 311 -2 -41 387 515 191 116 181 637
1454 637 628 144 167 316 580 432 -175 227 150 576 331 -84 13 292 174 -404 -486 -186 84 -41 -432 -443
1476 -443 -170 -84 -554 -262 -533 142 64 -281 -446 -220 86 124 -233 -512 -74 131 -99 -329 -590 140 -20
$$ packed form
1325b74n45R03m07j76k5j01M98j79l04k44J37N16k05l10J29N29K83n56m90N59
1345b62K75j64J19k07R2L56l44k62K44J37M68o09k57M25L61j5l33r1K56N35L7
1366G61k91k46K82K95m0m87K17L27O5k88j16N1Q22p51k61O6J95K07n20M2J44m4
1388D30L02l95n70L16L27j80m90p3L61K56k65m30m06Q59j9j43m34NK11J28l85
1409e95j37K29K92k98m00R2N13J51k08n84N07L51l45n2l8J10K29k1l02O3L61K37
1431A55n65q7J10L59J24l92j7K82K10J79m48o9M12L6K2l13l9M28J28l24p5O5M56
1454F37rm84K3J49K64j48o07M02p7M26k45m15R7K79j18n78q2L00K70j25l91j1
1476d43K73Q6m70K92k71O75p8l45j65K26L06L8l57k79M38K05k30k30k61P30j60
$$ plain form
1497 -20 -19 -349 180 447 93 -22 -136 56 595 84 -293 211 311 474 -28 -13 158 397 523 182 51
1518 51 653 924 663 112 321 532 904 400 322 417 681 589 303 345 310 669 364 50 262 117 402 -15
1540 -15 -169 -141 165 443 -102 -437 74 131 -134 -315 -557 -184 -246 -590 -798 -375 -73 -241 -899 -745 -505
1561 -505 -34 -38 -817 -625 -467 -279 -257 -813 -680 -291 -33 -338 -667 -422 95 -164 -361 -463 -202 -41 -66
1582 -66 -488 -175 -94 50 -189 -467 -135 251 -54 -2 114 69 414 271 153 178 752 426 277 -36 452 542
1604 542 445 225 104 311 431 454 -116 -24 348 295 -42 -142 119 223 93 -54 -46 67 91 -108 -179 -173 -67
1627 -67 246 -105 -337 -334 -44 133 -451 -631 -301 82 -152 -379 -448 10 -162 -178 -167 -269 74 -96 -297 -411
1649 -411 -125 434 53 -36 -117 73 514 -77 -237 -86 229 258 97 67 100 421 490 122 -55 136 392 255
$$ packed form
1497b0Jl30N29K67l54j15j14J92N39n11l77N04J00J63n02J5J71K39J26l41j31
1518E1O02K71k61n51K09K11L72n04p8R5K64r2k86M2l5L59l05l14K12j45K85m17
1540a5j54K8L06K78n45l35N11N7k65j81k42L73o2l44k08M23L02j68o58J54K40
1561e05M71mp79J92J58J88K2n56J33L89K58l05l29K45N17k59j97j02K61J61k5
1582f6m22L13Q1J44k39k78L32L86l05N2J16m5L45j43j18K5N74l26j49l13M88R0
1604E42r7k20j21K07J20K3n70R2L72n3l37j00K61J04j30j47QJ13K4j99p1OJ06
1627f7L13l51k32LK90J77n84j80L30L83k34k27o9M58j72j6J1j02L43j70k01j14
1649d11K86N59l81q9q1J90M41n91j60J51L15K9j61l0L3L21O9l68j77J91K56j37
$$ plain form
1671 255 233 -9 632 477 264 -52 269 559 609 213 189 680 504 340 -24 105 314 517 158 -262 -94
1692 -94 318 241 -156 -153 -256 -52 3 -322 -150 -332 -102 -303 -361 -457 -29 -43 -359 -556 -92 -206 -19 -429 -417
1715 -417 -240 -184 -254 -597 -509 -288 -197 -382 -655 -619 -159 -187 -555 -484 -240 -35 56 -394 -448 -135 179 -71 26
1738 26 -27 165 133 169 -71 134 262 -100 251 -132 201 379 39 -33 209 304 285 277 64 425 696 636 131
1761 131 93 416 584 334 -33 160 357 447 -7 -172 35 -40 127 -120 -42 90 343 -1 -387 -197 30
1782 30 105 -4 -271 130 193 -124 -251 -364 -34 12 -269 -317 -402 -43 263 -173 -27 -161 -117 7 0 -187 -55
1805 -55 47 -120 -248 -16 -54 339 -45 -11 61 341 251 272 36 -19 429 224 188 105 341 464 93 251 188
1828 188 325 450 49 -148 357 276 73 268 58 158 369 128 -62 83 286 63 2 120 -162 366 -259
$$ packed form
1671B55k2k42O41j55k13l16L21K90N0l96k4M91j76j64l64J29K09K03l59m20J68
1692i4M12p7l97Lj03K04N5l25J72j82K30k01n8r6M28j4l16j97M64j14J87m10J2
1715d17J77N6p0l43Q8K21R1j85k73L6M60k8l68P1K44K05R1m50n4L13L14k50R7
1738B6n3J92l2L6k40K05J28l62L51l83L33J78l40p2K42R5j9qk13L61K71o0n05
1761A31l8L23J68k50l67J93J97R0m54j65K07p5J67k47P8J32K53l44l86J90K27
1782C0P5j09k67M01O3l17j27j13L30M6k81m8q5L59L06m36J46j34M4J24pj87J32
1805e5J02j67j28K32l8L93l84L4P2K80r0K1k36n5M48k05l6q3K36J23l71J58o3
1828A88J37J25m01j97N05q1k03J95k10J00K11k41j90J45K03k23o1J18k82N28o25
$$ plain form
1849 -259 -169 -463 15 285 -326 -303 -155 -85 -205 -156 -447 -128 -154 -155 -606 -585 -344 -168 -473 -516 -571 -253 -108
1872 -108 -704 -316 -442 -269 -97 -359 -517 -195 46 -286 -236 -16 323 9 -97 -177 -6 187 157 -127 92
1893 92 157 -111 331 124 28 30 496 111 127 118 357 452 474 642 315 444 294 376 319 314 518 272 351 211 262
1918 262 467 166 12 155 228 152 97 170 240 287 140 -219 76 82 177 -55 -455 -142 3 -232 -299 -201 -147 -185
1942 -185 -315 -232 -305 24 180 -325 -202 -447 -207 7 -7 -125 -20 -29 -70 -261 -13 -110 -39 -218 -438 200 0
1965 0 -255 143 -210 251 23 32 -167 85 331 99 53 126 195 476 356 6 -24 226 122 259 -80 4 221
1988 221 180 277 -176 -266 150 349 148 94 135 123 156 -142 -294 -112 127 125 -492 -283 -207 -18 -116 -204 -340 66
2012 66 -178 -432 -168 -125 -345 -378 -231 -358 -299 -292 -550 -243 -122 -167 -6 -219 -276 -429 21 -125 -129 -192 141 81
$$ packed form
1849b59R0k94M78K70o11K3J48P0j20M9k91L19k6jm51K1K41J76l05m3n5L18J45
1872a08n96L88j26J73J72k62j58L22K41l32N0K20L39l14j06q0J71J93l0k84K19
1893I2O5k68M42k07r6KM66l85J6rK39R5K2J68l27J29j50Q2n7nK04k46P9j40N1
1918B62K05l01j54J43P3p6n5P3P0M7j47l59K95OR5k32m00L13J45k35o7R8N4l8
1942a85j30Q3p3L29J56n05J23k45K40K14j4j18J05rm1j91K48r7P1j79k20O38k00
1965@k55L98l53M61k28Rj99K52K46k32m6P3O9K81j20l50l0K50j04J37l39Q4K17
1988B21m1R7m53r0M16J99k01n4M1j2L3k98j52J82K39ko17K09P6J89r8q8j36M06
2012F6k44k54K64M3k20l3J47j27N9Pk58L07J21m5J61k13n7j53M50j46mo3L33o0
$$ plain form
2036 81 -115 -55 -13 238 268 32 -56 60 357 327 227 244 472 487 297 261 234 423 355 173 472 231 378 431
2060 431 18 185 354 205 323 118 271 70 260 162 -34 106 219 100 160 -316 -101 134 168 111 -157
2081 -157 77 -17 141 -265 -304 58 -138 -176 -241 -225 58 -493 -281 -364 -156 -15 90 -60 -255 48 -154 -406
2103 -406 -264 101 -40 -10 -183 -253 -43 -229 -69 -276 -103 155 -97 -91 -125 46 122 245 17 -39 366 370 -14
2126 -14 105 1 -187 147 80 37 91 -45 137 -215 -107 204 -36 149 -143 -103 194 106 -191 -97 -51 118 159
2149 159 -20 -147 -132 -40 153 -32 73 -58 97 -125 -309 -182 -131 -233 -162 -205 55 -75 -159 -207 -352 -45
2171 -45 18 -502 -285 -456 -150 -111 -186 -269 -72 15 -111 -86 -209 121 160 61 -54 18 118 71 64 -116 266 275 249
2196 249 235 145 331 349 305 100 151 443 127 191 -54 191 362 49 219 359 306 382 52 83 0 41 146 -80
$$ packed form
2036H1j96O0M2K51L0k36q8J16K97l0j00J7K28J5j90l6k7J89o8j82K99k41J47N3
2060D31m13J67J69j49J18k05J53k01J90r8j96J40J13j19O0m76K15K35L4n7k68
2081a57K34r4J58m06l9L62j96l8o5J6K83n51K12q3K08J41J05j50j95L03k02k52
2103d06J42L65j41L0j73p0K10j86J60k07J73K58k52Ol4J71P6J23k28n6M05Ml84
2126a4J19j04j88L34o7m3N4j36J82l52J08L11k40J85k92M0K97q8k97R4M6J69M1
2149A59j79j27J5R2J93j85J05j31J55k22j84J27N1j02P1m3K60j30q4m8j45L07
2171d5O3n20K17j71L06L9p5q3J97Q7j26K5j23L30L9r9j15P2J00m7pj80L82Rk6
2196B49j4r0J86J8m4k05N1K92l16O4k45K45J71l13J70J40n3P6l30L1q3M1J05k26
$$ plain form
2220 -80 184 366 375 -71 97 33 69 169 147 -117 -267 -121 -41 -166 -145 -116 -81 31 -53 -32 -95 55 -64 -253
2244 -253 110 131 172 -207 -503 -314 -170 48 -227 -357 -152 -257 -113 -244 -518 -113 -220 -268 -239 25 -22 0
2266 0 35 -195 -155 -209 -274 -308 -150 80 134 65 -62 130 148 161 202 -26 78 199 -7 65 59 94 306 52 -80
2291 -80 -10 102 203 66 -187 177 -34 78 -80 -130 72 11 36 -95 101 -160 -194 -215 -204 -102 -115 54 -59
2314 -59 -282 -124 284 4 58 -180 -131 99 -176 -36 -64 -55 -206 -100 -11 -31 100 -6 -176 15 -18 -17 305 -42
2338 -42 -205 -38 20 230 -33 228 42 157 -92 170 375 165 400 165 -58 39 357 45 -163 233 247
2359 247 311 114 251 262 213 213 9 241 258 233 126 261 116 492 184 -27 -127 -166 131 -110 76 -52 66
2382 66 -55 -22 65 73 -76 -285 -334 -486 -147 -28 -292 -266 -124 -85 83 -208 -168 -273 -65 -31 58 -224 -49 147
$$ packed form
2220h0K64J82Rm46J68o4L6J00k2k64j50J46Q0j25K1K9L5J12q4K1o3J50j19j89
2244b53L63K1M1l79k96J89J44K18k75j30K05j05J44j31k74M05j07m8K9K64m7K2
2266@L5k30M0n4o5l4J58K30N4o9j27J92J8J3M1k28J04J21k06P2oL5K12k54j32
2291h0P0J12J01j37k53L64k11J12j58n0K02o1K5j31J96k61l4k1J1J02j3J69j13
2314e9k23J58M08k80N4k38M9K30k75J40k8Rj51J06Q9k0J31j06j70J91l3JL22l47
2338d2j63J67N8K10k63K61j86J15k49K62K05k10K35k35k23R7L18l12k08L96J4
2359B47O4j97J37J1m9%k04K32J7k5j07J35j45L76l08k11j00l9K97k41J86j28J18
2382F6j21L3Q7Qj49k09m9j52L39J19k64K6J42L9J68k91M0j05K08L4Q9k82J75J96
$$ plain form
2406 147 -331 -367 -214 -154 -107 -137 -200 -65 73 57 34 -112 -36 137 51 -173 7 51 18 63 -56 49 98 119 1
2431 1 134 125 157 28 154 199 55 111 130 23 60 285 273 126 59 92 261 69 48 15 237 69 266 -31 -72
2456 -72 190 -143 118 89 -9 -23 -96 -259 -138 55 -41 -227 -96 134 81 22 45 -247 43 83 197 18 -271
2479 -271 -16 57 -142 -52 -163 6 -7 -143 -72 23 52 208 -177 -64 202 218 284 -160 425 346 272 2 88 204
2503 204 131 183 107 263 -13 277 213 -14 133 433 265 87 -39 83 121 22 39 -32 106 113 -5 -255 28
2526 28 -216 406 -10 -45 70 77 -134 -266 -153 -396 95 -8 -145 -558 -123 -178 -161 -256 -109 -184 -453 20 -166
2549 -166 -154 -125 -250 -189 -407 -174 93 -232 -229 3 133 147 -2 -2 -81 -101 -128 -252 93 184 0 90 -154 -198 78
2574 78 93 -41 10 -78 128 201 230 -65 106 225 192 -117 79 329 -60 226 149 89 220 374 -43 161 245
$$ packed form
2406A47m78l6J53O0M7l0o3J35J38j6k3j46P6J73q6k24J80M4l3M5j19J05M9K1j18
2431AJ33rL2j29J26M5j44N6J9j07L7K25j2j47o7L3J69j92k1l3K22j68J97k97m1
2456g2K62l33K61k9r8j4p3j63J21J93r6j86J31K30n3n9K3k92K90M0J14j79k89
2479b71K55P3j99R0j11J69j3j36P1R5K9J56l85J13K66J6O6m44N85p9p4k70Q6J16
2503B04p3N2p6J56k76K90o4k27J47L00j68j78j26J22L8r9J7p1J38Pj18k50K83
2526B8k44O22m16l5J15Pk11j32J13k43M91j03j37m13M35n5J7r5J47p5k69M73j86
2549a66J2K9j25O1k18K33K67l25LK32J30J4j49%p9k0k7j24L45R1j84R0k44m4K76
2574G8J5j34N1q8K06P3K9k95J71J19l3l09J96K50l89K86p7o0J31J54m17K04Q4
$$ plain form
2597 245 271 44 -127 81 -31 36 83 -185 -23 195 116 257 -126 -29 20 -97 22 -103 -252 -14 111 52
2619 52 -35 -51 49 -163 -76 196 -82 -3 -165 -205 126 43 -6 -72 -130 -34 86 -107 -189 98 48 -5 -208 70 107
2644 107 110 239 49 -102 225 22 154 200 104 346 145 79 -16 219 51 21 26 -1 -169 386 151 -164 121
2667 121 -109 186 56 25 -30 154 49 -32 -32 23 -45 -101 -112 -6 157 -33 22 -228 -198 35 108 -142 -127 -133 -164
2692 -164 -162 -73 -87 -137 68 -131 -156 -44 21 -199 -438 -180 -148 -122 -85 -146 44 -136 -271 -291 -91 36 -43 -130 -47
2717 -47 55 103 -231 54 -20 -81 173 5 22 -62 74 28 205 -52 250 0 272 -57 -96 43 233 61 218
2740 218 191 -53 157 -59 112 140 38 119 275 19 -79 211 127 73 113 -117 -91 37 53 41 -253 156 33
2763 33 23 -208 29 -120 194 106 6 -156 -157 -89 -188 -387 -150 123 -29 -106 -128 26 51 -147 -89 -172 -119 56
$$ packed form
2597B45K6k27j71K08j12O7M7k68J62K18p9J41l83R7M9j17J19j25j49K38J25n9
2619E2q7j6J00k12Q7K72k78P9j62m0L31q3m9o6n8R6J20j93q2K87n0n3k03K78L7
2644A07LJ29j90j51L27k03J32M6r6K42k01o6r5K35j68l0Nk7j68N55k35l15K85
2667A21k30K95j30l1n5J84j05q1%N5o8n6j1J06J63j90N5k50L0K33P3k50J5ol1
2692a64KQ9j4n0K05j99k5J12O5k20k39K58L2K6L7o1J90j80j35k0K00J27p9q7Q3
2717d7J02M8l34K85p4o1K54j68J7q4J36m6J77k57L02k50K72l29l9J39J90j72J57
2740B18k7k44K10k16J71K8j02Q1J56k56r8K90q4n4M0k30K6J28J6j2k94M09j23
2763C3j0k31K37j49L14q8j00j62jO8r9j99K37K73j52p7k2J54K5j98N8q3N3J75
$$ plain form
2787 56 208 32 -151 17 -119 -119 36 -37 15 -146 -81 70 324 -70 99 -106 -6 188 362 -139 -31 219
2809 219 17 2 109 168 186 -4 -166 -8 -116 96 -177 -303 110 75 232 -51 -148 213 140 -5 -103 -113 -219
2832 -219 92 -98 -155 -102 123 -261 -225 62 -38 127 -174 -2 70 -190 257 57 -118 -475 28 -59 -72 -57
2854 -57 -173 -86 -298 141 90 16 -199 -64 -127 -145 -135 211 -29 -213 168 -55 75 -130 -75 -18 343 115 -156
2877 -156 23 175 56 -34 263 208 357 108 -10 201 220 23 233 146 118 37 266 -183 210 103 53 243
2899 243 112 316 217 108 -109 85 69 129 226 62 -203 114 237 -47 178 -4 83 73 122 -91 -328 38
2921 38 9 -32 -147 106 63 -15 -164 -32 -134 -247 -115 -20 -8 -319 -36 52 -189 -256 -152 -167 -228 63 -23 44
2945 44 2 -188 -32 237 37 -208 -181 -59 261 226 287 194 77 158 179 196 -33 64 194 247 -41 -102 59 34
$$ packed form
2787E6J52j76j83J68j36%J55p3N2j61O5J51K54l94J69k05J00J94J74n01J08K50
2809B19k02j5J07N9J8j90j62J58j08K12k73j26M13l5J57k83r7L61p3j45r8j0j06
2832b19L11j90n7N3K25l84L6K87j00J65l01J72P2k60M47k00j75l57N03q7j3J5
2854e7j16Q7k12M39n1p4k15J35o3j8J0L46k40j84L81k23J30k05N5N7L61k28k71
2877a56J79J52j19r0K97n5J49k49j18K11J9j97K10q7k8q1K29m49L93j07n0J90
2899B43j31K04r9j09k17J94j6O0R7j64k65L17J23k84K25j82Q7j0M9k13k37L66
2921C8k9m1j15K53m3p8j49J32j02j13J32R5J2l11K83Q8k41o7J04j5o1K91q6O7
2945D4m2j90J56K69k00k45K7J22L20l5O1r3j17Q1K1J7k29R7J30N3k88o1J61k5
$$ plain form
2969 34 -57 -288 -136 54 100 128 -224 -66 38 -219 34 -144 -35 -24 -137 -85 -55 185 134 -46 -74 -123 -77 -88
2993 -88 -217 -15 -121 102 -155 -181 -84 74 -43 -65 -49 -160 21 232 39 37 -179 -93 -266 -29 -260 -204 241
3016 241 -39 -102 -12 241 21 -65 133 112 98 30 193 -38 46 20 163 -227 -41 2 123 240 83 262 223
3039 223 208 88 8 56 -6 228 159 272 279 173 -26 291 81 194 216 -78 190 81 46 148 127 7 55 98
3063 98 -94 111 -18 39 -92 -106 145 -69 208 2 -46 -51 -65 -123 -228 -304 -164 -251 85 -140 -257 208 -29
3086 -29 -128 -141 -124 -176 82 328 -180 -76 -133 32 -4 -132 71 85 -331 -126 -101 -19 -80 100 -5 -147 -174 67
3110 67 -26 224 70 111 85 3 241 1 84 -228 93 66 150 -39 189 -84 50 260 -20 257 -56 92 -36
3133 -36 -149 -9 156 125 190 67 -68 -61 -113 72 -304 -161 216 -283 5 -209 146 86 116 -17 -215 -117 -218
$$ packed form
2969C4r1k31J52J90M6K8l52J58J04k57K53j78J09J1j13N2L0K40n1j80k8m9M6j1
2993h8j29K02j06K23k57k6R7J58j17k2J6j11J81K11j93kk16Q6j73K37k31N6M45
3016B41k80o3R0K53k20q6J98k1j4o8J63k31Q4k6J43l90J86M3J21J17j57J79l9
3039B23j5j20q0M8o2K34o9J13Pj06j99L17k10J13K2k94K68j09l5J02k1j20M8M3
3063I8j92K05j29N7j31j4K51k14K77k06m8nj4n8j05p6J40q7L36k25j17M65k37
3086b9r9j3J7n2K58K46n08J04n7J65l6j28K03J4m16K05K5Q2o1J80j05j42k7K41
3110F7r3K50j54M1k6q2K38k40Q3l12L21k7Q4j89K28k73J34K10k80K77l13J48j28
3133c6j13J40J65l1O5j23j35Pn2J85l76J43L77m99K88k14L55o0L0j33j98R8j01
$$ plain form
3156 -218 -45 -137 19 -291 -209 -21 -95 114 -302 -72 155 94 -34 39 -358 48 -65 -82 111 204 107 -39 103
3179 103 185 16 -40 169 -117 -32 205 -66 7 264 8 6 296 224 400 45 -1 159 98 224 66 216 137
3202 137 37 165 119 198 79 129 84 -282 91 182 43 -113 -252 -332 185 -116 -40 19 -40 -106 16 -167 -24
3225 -24 30 -96 -155 -119 -67 10 20 -193 163 -166 -90 -94 -260 -175 8 -3 -185 -25 140 -53 49 -72 94 53
3249 53 -105 150 99 108 -4 -125 -130 -376 -134 43 -65 -46 267 -145 53 -90 -6 78 229 59 48 -51 202 -6
3273 -6 255 95 379 206 191 8 -128 125 -7 -156 -314 258 113 88 256 77 -13 157 -112 -138 -125 14
3295 14 14 232 -10 -91 29 -145 -279 -143 -112 2 -169 12 24 35 191 27 105 -112 -60 -137 238 -113 233
3318 233 -20 -130 87 -235 58 -46 -161 105 203 31 -330 239 -62 39 196 -66 -167 -195 207 65 -4
$$ packed form
3156b18J73r2J56l10Q2J88p4K09m16K30K27o1j28P3l97M06j13j7J93R3r7j46J42
3179A03Q2j69n6K09k86Q5K37k71P3K57k56kK90p2J76l55m6J60o1J26j58J50p9
3202A37j00J28m6P9j19N0m5l66L73R1j39j56j39q0N17l01P6N9n9o6J22j83J43
3225b4N4j26n9L6N2P7J0k13L56l29P6mj66Q5J83j1j82J60J65j93J02j21J66m1
3249E3j58K55n1Rj12j21nk46K42J77j08J9L13m12J98j43Q4Q4J51j70j1r9K53k08
3273fK61j60K84j73j5j83j36K53j32j49j58N72j45k5J68j79r0J70k69k6J3J39
3295A4%K18k42q1J20j74j34J36L1J14j71J81J2J1J56j64P8k17N2p7L75l51L46
3318B33k53j10K17l22K93j04j15K66R8j72l61N69l01J01J57k62j01k8M02j42o9
$$ plain form
3339 -4 118 80 -26 161 230 16 70 -5 214 83 143 139 119 16 157 -65 -3 -314 -76 -56 32 201 37 148
3363 148 -18 80 -187 45 60 -25 -24 -112 -203 -12 -32 35 -78 138 -127 110 -109 -127 -371 -233 -1 155 12
3386 12 -183 -84 -28 75 -165 -63 -23 -149 13 -18 -33 -66 -91 -65 25 -45 52 -215 -96 169 -284 -199 156 13
3410 13 -53 -27 34 84 283 -6 232 205 176 20 305 147 136 -292 44 13 -124 231 215 -134 -57 -172 -27 -184
3434 -184 69 -55 48 153 -113 19 74 -135 109 -98 17 0 132 -254 5 -106 126 -70 9 -5 -193
3455 -193 45 -51 -165 44 67 90 83 -207 106 57 17 -220 49 -157 -97 147 12 73 343 250 5 -81 -206 -43
3479 -43 131 -63 -120 24 28 90 108 -115 -37 32 145 36 44 210 101 118 -161 35 -75 13 53 -33 -16 69 -1 -167
3505 -167 -124 6 -130 -44 -40 -51 -201 95 115 137 -145 -173 -150 -82 -64 -83 106 -150 -195 -145 152 -156 50 -332 -242
$$ packed form
3339dJ22l8j06J87O9k14N4p5K19j31O0mk0j03J41k22O2l11K38K0Q8J69j64J11
3363A48j66R8k67K32J5q5Jq8r1J91k0O7j13K16k65K37k19j8k44J38K32J56j43
3386A2j95R9N6J03k40J02M0j26J62l1j5l3k5K6R0p0R7k67J19K65m53Q5L55j43
3410A3o6K6O1N0J99k89K38k7k9j56K85j58j1m28L36l1j37L55j6l49P7j15J45j57
3434a84K53j24J03J05k66J32N5k09K44k07J15j7J32l86K59j11K32j96P9j4j88
3455a93K38r6j14K09K3K3pk90L13m9m0k37K69k06O0K44j35O1K70r3k45q6j25J63
3479d3J74j94n7J44MO2J8k23P8O9J13j09QJ66j09J7k79J96j10Q8M0q6J7Q5p0j66
3505a67M3J30j36Q6Mj1j50K96K0K2k82k8K3O8J8j9J89k56m5N0K97l08K06l82R0
$$ plain form
3530 -242 -189 -93 99 -66 -12 -274 -435 -4 -4 -75 -199 -94 -92 85 103 -30 185 -88 200 -41 -46 -177 0 -214
3554 -214 196 26 -216 16 106 -35 164 132 -159 286 2 -108 11 -141 258 -69 46 -78 145 89 35
3575 35 202 -97 116 -170 -42 40 -58 142 -146 205 111 -183 -71 -46 -60 -24 -23 -62 -103 101 -123 98 -51 -62
3599 -62 199 -58 23 47 99 99 -220 -51 120 -158 76 120 -63 -216 -75 121 -189 101 34 -173 109 -187 -96
3622 -96 -110 49 45 295 91 240 144 -96 -42 156 151 -126 61 256 -60 -328 31 -93 -23 -127 47 -92 -18
3645 -18 -50 -28 -118 127 -127 -124 72 54 -204 -281 -134 23 143 81 -87 178 -330 95 -40 -39 180 -125 139 44
3669 44 159 202 116 61 195 68 21 -27 -193 56 -199 -270 157 -284 -205 -3 118 -99 -101 -173 148 -63 -194 3
3693 3 -57 -366 34 4 -33 -88 -51 -111 -53 -128 82 -245 -134 19 61 90 38 26 183 -45 56 72 -214 152 46
$$ packed form
3530b42N3R6J92j65N4k62j61M31%p1j24J05KJ77J8j33K15k73K88k41nj31J77k14
3554b14M10j70k42K32R0j41J99l2k91M45k84j10J19j52L99l27J15j24K23n6n4
3575C5J67k99K13k86J28Q2r8K00k88L51r4k94J12K5j4L6Jl9m1K04k24K21j49j1
3599f2K61k57Q1K4N2%l19J69J71k78K34M4j83j53J41J96l10K90o7k07K82k96R1
3622i6j4J59mK50k04J49r6k40N4J98nk77J87J95l16k68L59j24P0j04J74j39P4
3645a8l2K2r0K45k54LJ96j8k58p7J47J57J20o2j68K65n08M25j35JK19l05K64r5
3669D4J15M3q6n5J34j27m7m8j66K49k55p1M27m41P9K02J21k17kp2L21k11j31J97
3693Co0l09M00l0l7n5L7o0N8p5K10l27J11J53M2K9n2j2J57k28J01J6k86L66j06
$$ plain form
3718 46 -57 -30 -29 233 49 -3 -25 61 33 -34 224 32 76 101 -63 -8 46 227 -277 96 37 154 85 -47 8
3743 8 -109 27 23 -217 81 244 -91 101 -78 -77 279 79 -58 -41 69 -134 6 141 -96 70 -61 169
3765 169 -122 -104 21 -246 -22 -10 -29 -4 -24 -33 -82 -26 -228 -21 22 -53 -94 -23 -97 52 166 307 -114 45 237
3790 237 -17 238 22 218 220 110 -43 67 -100 -109 -8 19 102 144 -50 14 -97 228 -191 46 -121 53 88
3813 88 209 -146 44 -23 -68 113 209 -5 -124 99 -48 67 -57 211 132 -20 25 34 -97 73 157 79 -119
3836 -119 -22 -159 -35 -58 -96 -164 -46 -39 -145 4 -206 -126 -10 -153 -37 178 -79 303 -20 -129 -245 155
3858 155 2 206 127 -172 -96 382 187 -43 -21 -115 -61 97 107 76 197 -5 -51 -44 71 105 164 88 -142 133
3882 133 123 32 -25 90 8 -35 137 -233 45 218 3 -61 -64 21 76 298 -199 -146 78 -88 -35 64 182 3
$$ packed form
3718D6j03K7JK62j84n2k2Q6k8o7K58j92M4K5j64N5N4J81n04L73n9J17o9j32N5
3743Hj17J36mk40K98J63l35J92j79JL56k00j37J7J10k03J40J35k37J66j31K30
3765A69k91J8J25k67K24J2j9K5k0rm9N6k02K07M3p5m1P1p4J49J14J41m21J59J92
3790B37k54K55k16J96Kj10j53J10j67rJ01K7Q3M2j94O4j11L25m19K37j67J74L5
3813H8J21l55J90o7m5J81R6k14j19K23j47J15j24K68p9j52M5Rj31J70Q4p8j98
3836a19R7j37J24k3l8o8J18Pj06J49k10Q0J16j43J16K15k57L82l23j09j16M00
3858A55j53K04p9k99P6M78j95k30K2r4N4J58J0l1J21k02m6PJ15L4N9p6k30K75
3882A33j0r1n7J15q2m3J72l70K78J73k15o4lQ5N5K22m97N3K24j66N3R9J18j79
$$ plain form
3906 3 -27 130 -16 -207 95 34 -71 -36 -166 -69 -107 154 121 -201 -232 32 -36 -130 -270 84 -35 -165 49 3
3930 3 -40 10 -411 -12 185 -165 -136 62 -73 -116 105 110 23 79 -46 -247 -57 -26 -61 -52 134 339 -124 55 62
3955 62 -230 97 -130 -170 -89 153 -120 219 -153 0 -69 -108 114 69 -45 -405 -17 -67 -57 35 -106 119 66
3978 66 -68 102 205 22 -63 56 -232 -24 133 191 -63 -67 255 -212 -43 78 51 99 -61 69 7 -144 95
4001 95 -61 -80 37 263 -175 79 68 53 224 -154 104 87 84 80 4 280 21 56 197 -90 128 98 332 98
4025 98 -80 37 197 -71 38 132 278 80 215 110 59 85 -19 42 149 235 270 -86 -68 197 32 143 165
4048 165 -46 66 77 -24 -153 -263 79 -55 -25 -37 151 12 -15 79 -14 16 -87 -19 37 29 148 71 232 -35
4072 -35 -123 43 -79 -19 159 -176 12 201 -181 -29 -15 -209 67 -279 -65 -100 63 -166 -215 71 -124 -22
$$ packed form
3906Cl0J57j46j91L02o1j05L5j30R7l8K61l3l22l1K64o8r4j40L54j19j30K14m6
3930Cm3N0m21L99J97l50K9J98j35m3K21Nq7N6j25k01J90L1l5RJ86K05m63J79P
3955F2k92L27k27m0Q1K42k73L39l72J53o9l9K22m5j14l60L88n0J0R2j41K25n3
3978F6j34J70J03j83q5J19k88K08J57N8k54mL22m67J69J21k7M8j60J30o2j51K39
4001I5j56j9J17K26m38K54j1j5J71l78K58j7lmp6K76k59L5J41k87K18l0K34k34
4025I8j78J17J60k68J09R4J46j98J35j05n1K6j04O1J07Q6L5l56J8K65j65J11K2
4048A65k11J12J1j01j29j10L42j34L0j2J88j39k7R4r3L0j03O8N6qJ19p7J61k67
4072c5q8J66j22O0J78l35J88J89l82J52J4j94K76l46K14l5J63k29m9K86j95J02
$$ plain form
4094 -22 165 64 -160 -193 -174 131 -243 35 -187 -21 -77 -167 22 274 131 -9 63 -168 -33 325 -151 19
4116 19 39 93 190 17 18 -177 -117 22 52 56 -118 -157 35 317 -46 -31 -176 -53 218 13 -78 -19 -28 -174 46
4141 46 -55 -180 -137 55 213 261 -122 -108 115 220 138 87 228 -129 -189 5 312 188 -151 -176 185 183 28
4164 28 81 31 143 375 18 213 87 -64 207 227 -44 -9 151 -43 116 -159 -123 10 73 -58 64 -77
4186 -77 -128 257 131 -113 168 -153 -72 -197 -143 -12 -1 -112 -38 14 -59 157 -72 127 -121 102 -82 -248 6
4209 6 18 208 32 23 -40 27 -276 42 -72 -249 47 -128 123 53 -22 -32 134 120 130 -66 59 0 50 126 222
4234 222 33 -94 -87 122 166 -14 83 -35 128 166 104 89 48 27 137 45 -107 -406 -33 28 3 -26 -106 77 -131
4259 -131 11 -55 -164 -44 -201 -172 26 20 150 11 45 -97 154 -139 17 148 -180 -136 -174 -53 -39 -54 -151
$$ packed form
4094b2J87j01k24l3J9L05l74K78k22J66n6r0J89K52j43j40P2k31J35L58m76J70
4116A9K0N4R7j73Jj95O0J39L0Mj74l9J92K82l63J5j45J23K71k05r1N9rj46K20
4141D6j01j25M3J92J58M8l83J4K23J05q2n1J41l57o0J94L07j24l39k5L61kj55
4164B8N3n0J12K32l57J95j26j51K71K0k71L5J60j94J59k75L6J33O3j31J22j41
4186g7n1L85j26k44K81l21Q1j25N4J31J1j11P4N2p3K16k29J99k48K23j84j66K54
4209FJ2J90j76ro3O7l03L18j14j77K96j75K51p0p5j0J66j4J0j96J25n9N0P6R6
4234B22j89j27PK09M4j80R7j18J63L8o2j5m1k1J10r2j52k99L73O1k5k9q0J83k08
4259a31J42o6j09J20j57K9J98oJ30j39L4j42K51k93J56J31l28M4l8J21J4j5r7
$$ plain form
4282 -151 46 135 -4 -32 -52 93 -61 235 218 -151 167 81 86 256 244 -63 -140 -133 -192 -304 118 -117 99 -111
4306 -111 29 -27 -32 -21 -90 82 218 122 214 9 302 -156 -137 -4 -26 -57 -44 106 -51 111 -152 -23 95 127
4330 127 111 140 62 -41 70 97 -199 56 -68 110 -132 -19 -281 -67 -57 13 17 -25 17 -92 -21 -186 -128 10
4354 10 123 -51 44 -78 249 205 -49 -174 47 136 81 -84 44 3 -74 -26 -212 -14 84 -29 -71 -216 18
4377 18 205 157 66 80 240 -13 -33 -58 -6 100 -84 -12 -13 -99 -40 -135 159 -26 -112 -244 -42 53 -204 107 -168
4402 -168 -203 -45 135 42 91 -95 -92 -64 81 -23 145 90 -129 9 -74 355 61 -103 -105 -67 215 -238 -226 167
4426 167 -61 -102 -20 -99 161 23 -90 66 4 6 -268 -119 102 42 68 27 91 -39 -397 -241 -26 -98 -96 101
4450 101 -272 -307 199 60 -110 -89 175 36 -23 46 -24 196 35 149 -54 -247 -40 -43 26 -185 -91 -233 -47
$$ packed form
4282a51J97Q9j39k8k0J45j54K96j7l69L18q6NJ70j2l07p7Pn9j12M22k35K16k10
4306a11J40n6nJ1o9J72J36r6R2k05K93m58J9J33k2l1J3J50j57J62k63J29J18L2
4330A27j6K9p8j03J11K7k96K55j24J78k42J13k62K14J0P0Mm2M2j09P1j65N8J38
4354A0J13j74R5j22L27m4k54j25K21Q9n5j65J28m1p7M8j86J98R8j13m2j45K34
4377A8J87m8r1J4J60k53k0k5N2J06j84P2jq6N9r5K94j85q6j32K02R5k57L11k75
4402a68l5J58J80r3M9j86LK8J45j04J68n5k19J38q3M29k94j64kL8K82m53J2L93
4426A67k28m1Q2p9K60j38j13J56o2Kk74J49K21o0K6m1O4j30l58J56K15p2KJ97
4450A01l73l5N06j39j70K1K64j39n9O9p0K20j61J14k03j93K07lO9k11R4j42J86
$$ plain form
4473 -47 84 189 248 145 125 148 182 47 168 -299 119 -67 -93 -53 15 -156 -77 -94 149 171 -48 117 -208 6
4497 6 -44 -312 -140 -375 -271 -129 -114 88 15 182 21 -239 -142 -66 -73 149 -56 -26 -47 -19 -160 21 -192 -142
4521 -142 91 38 -220 34 -264 -2 105 -197 -112 77 164 -293 147 85 -37 48 225 -14 -81 58 272 35
4543 35 244 -31 139 179 -92 97 53 -12 -127 180 149 50 66 15 110 51 211 -15 -1 -89 -130 -3 147 102 7
4568 7 55 113 54 11 232 -215 146 -49 39 -117 -53 197 11 47 -57 -151 14 24 64 -10 -246 -136 57 175
4592 175 -148 -214 129 103 85 -142 -64 200 0 -221 -237 130 -20 40 -204 -67 148 142 173 -262 -67 -125 -9
4615 -9 21 152 140 138 242 -67 -200 -3 77 -98 261 72 -197 196 81 25 -124 -1 -128 -131 232 -79 -75 -26
4639 -26 -107 -61 -186 236 90 14 -146 -56 -184 -40 103 -255 -117 -70 -138 82 -81 -31 -126 159 106 -102 -138 -83
$$ packed form
4473d7J31J05N9j03k0K3L4j35J21m67M18j86k6M0O8j71P9j7K43K2k19J65l25K14
4497Fn0k68J72k35J04J42J5K02p3J67j61k60R7P6pK22k05L0k1K8j41J81k13N0
4521a42K33n3k58K54k98K62J07l02Q5J89Q7m57M40o2j22Q5J77k39o7J39K14k37
4543C5K09k75J70M0k71J89m4o5j15L07l1r9J6n1R5n9J60k26J4q8m1J27J50m5r5
4568GM8N8n9m3K21m47L61j95Q8j56O4K50j86L6j04r4J65J0M0p4k36J10J93J18
4592A75l23o6L43k6j8k27P8K64k00k21j6L67j50O0k44J37K15oL1m35J95n8J16
4615iL0J31j2kJ04l09j33J97Q0j75L59j89k69L93j15n6j49J23j27lL63l11MM9
4639b6q1M6j25M22j46p6j60R0j28J44J43l58J38M7o8K20j63N0r5K85n3k08l6N5
$$ plain form
4663 -83 140 -68 44 48 -129 90 54 -39 144 56 -191 193 96 170 67 -130 90 240 56 -72 -19 159 114
4686 114 118 131 201 101 294 -141 -199 343 263 -103 167 85 48 -101 259 85 98 197 -149 -11 -48 -2 50 103 322
4711 322 260 52 91 46 -3 -100 10 -151 61 -112 -34 -183 12 64 -22 -27 79 -44 -91 83 44 51 -118 227 -26
4736 -26 198 -60 -50 26 -38 -85 38 15 -43 37 -16 252 -153 141 -75 -22 17 123 -145 -177 -89 44 65 145 -229
4761 -229 -22 -96 272 -228 31 4 32 -42 -31 35 18 17 -17 -137 111 111 168 12 -79 -71 -60 151 -81 19 -65 255
4787 255 -106 -20 -59 -157 -165 -167 73 -89 -4 214 -102 14 -44 -117 -183 -327 -127 47 210 -24 -143 -41 -5 -188
4811 -188 242 -175 -142 -183 -222 282 57 -95 -104 -150 -78 -85 172 -159 112 -269 -177 224 -177 75 118 -49 -181 -57
4835 -57 -17 23 -94 -72 180 -22 86 -219 170 75 -114 -14 21 -41 58 -177 -30 -113 145 -18 -148 171 129
$$ packed form
4663h3K23k08J12Mj77K19l6r3J83q8k47L84r7P4j03j97K20J50j84j28N3J78m5
4686A14MJ3P0j00J93m35n8N42q0l66K70q2l7j49L60j74J3R9l46J38l7M6N2N3K19
4711C22o2k08L9m5m9r7J10j61K12j73P8j49J95N2q6nJ06j23m7J74l9Pj69L45k53
4736b6K24k58J0P6o4m7J23k3n8Q0n3K68m05K94k16N3L9J06k68l2Q8J33K1Q0l74
4761b29K07p4L68n00K59k7K8p4J1O6j7jl4j20K48%N7j56r1QJ1K11k32J00q4L20
4787B55l61Q6l9r8qkK40j62Q5K18l16J16n8p3o6j44K00J74J63k34j19J02L6j83
4811a88M30m17L3m1l9N04k25j52rm6P2pK57l31K71l81R2M01m01K52M3j67j32J24
4835e7M0M0j17K2K52k02J08l05L89r5j89J00L5o2R9k35J47q3K58j63j30L19m2
$$ plain form
4858 129 18 218 31 -220 -46 152 -36 -24 162 17 -233 192 256 -59 86 -171 -6 -220 -108 281 -75
4879 -75 117 14 -54 -43 25 177 -37 10 78 -89 -284 -80 -11 -87 189 63 -83 -208 -103 -71 -185 -5 23
4902 23 179 12 12 31 179 -59 241 200 174 -49 -220 -225 -304 1 8 -50 -63 -13 51 -200 50 -9 47 -84 -100 162
4928 162 -102 74 -3 112 89 -50 -277 -39 -169 -84 -39 10 44 -64 -45 -84 151 303 9 24 -82 -61 8 56
4952 56 5 -282 -207 48 -116 35 229 8 14 -157 -277 35 201 30 104 134 216 -195 -82 -85 266 126 108 -115
4976 -115 -25 -69 -83 -24 0 -58 -147 87 230 206 -41 452 64 80 -124 65 220 -88 134 216 -150 50 -26 -197
5000 -197 100 -195 409 -66 -39 -126 -53 228 9 148 3 9 -111 -5 -105 149 -21 250 -67 -108 -283 35
5022 35 90 74 114 -244 97 51 -94 -265 2 -279 79 151 -110 69 -54 -138 -171 61 63 -140 114 32 64 -13
$$ packed form
4858A29j11K00j87k51J74J98j88J2J86j45k50M25O4l15J45k57J65k14J12L89l56
4879g5J92j03o8J1O8J52k14M7O8j67j95K04O9p6K76j26j46j25J05L2j14J80K8
4902B3J56j67%J9J48k38L00m1k6k23j71np9L05Pn8j3N0O4k51K50n9N6j31j6K62
4928A62k64J76p7J15k3j39k27K38j30Q5M5M9L4j08J9l9K35J52k94J5j06K1O9M8
4952E6n1k87P5K55j64J51J94k21Oj71j20L12J66j71P4L0Q2m11J13lL51j40j8k23
4976a15R0m4j4N9K4n8q9K34J43k4k47M93l88J6k04J89J55l08K22Q2l66K00p6j71
5000a97K97k95O04m75K7q7P3K81k19J39j45Oj20J06j00K54j70K71l17m1j75L18
5022C5N5j6M0l58L41m6j45j71K67k81L58P2k61J79j23q4l3K32Kk03K54q2L2p7
$$ plain form
5046 -13 -10 49 -146 -197 173 94 -53 66 -247 -384 127 147 -68 13 -36 172 34 20 203 142 20 53 55 -119 120
5071 120 119 -207 -97 185 -89 -151 75 -104 66 -85 185 32 -209 -37 70 151 -131 212 -48 -101 57 -35
5093 -35 85 39 -34 16 -215 88 220 98 -268 45 -181 13 226 -129 215 -223 -108 311 -88 -71 -58 104
5115 104 37 133 -213 -105 148 -62 50 -120 22 104 -404 -64 28 167 110 22 86 168 -55 49 26 -203 -85
5138 -85 14 -34 -127 -30 95 -31 -109 -24 -24 -71 -8 -81 253 87 211 126 -11 -89 52 105 -117 -174 -335 305 325 -1
5164 -1 112 -12 -131 -182 -45 -19 135 201 171 -36 -17 -103 104 -190 13 -37 13 64 -78 50 103 112 -49 -67 -113
5189 -113 -200 -61 -40 -24 243 127 -7 -40 -163 -157 256 -27 -66 -142 84 -228 -137 3 -26 231 16 214 -130
5212 -130 146 -25 141 -124 237 -23 13 -128 -50 401 -42 -40 188 266 55 28 -47 56 -36 -75 95 -9 -33
$$ packed form
5046a3LN9j95n1L70p9j47J19l13j37N11K0k15Q1m9K08j38j4J83o1j22L3Kj74K39
5071A20jl26J10K82k74o2K26j79J70j51K70j53k41J72J07Q1k82L43k60n3J58r2
5093c5J20m6p3N0k31L03J32j22l66L13k26J94K13l55L44m38J15M19l99J7J3J62
5115A04o7R6l46J08K53k10J12j70J42Q2n08L40R2J39n7q8O4Q2k23J04k3k29J18
5138h5R9m8r3R7J25j26p8Q5%m7O3p3L34j66J24q5j37p8J41N3k22n7j61O40K0l26
5164aJ13j24j19n1J37K6J54O6l0k07J9q6K07k94K03n0N0N1j42J28N3Rj61j8m6
5189a13q7J39K1J6K67j16j34l3j23OM13k83l9p6K26l12R1J40k9K57k15J98l44
5212a30K76j71J66k65L61k60L6j41P8M51m43KK28P8k11k7p5J03r2l9J70j04k4
$$ plain form
5235 -33 86 -101 66 -156 11 19 -134 187 28 24 23 5 43 -5 97 195 -150 4 -299 -39 -31 90 138 -190 -63
5260 -63 -71 57 37 -28 144 -32 -74 26 -30 88 263 -37 -31 195 -16 -91 -9 -28 -33 166 0 44 -119 102 -62
5285 -62 -108 -15 -42 92 210 13 73 142 -263 -133 -46 -110 -35 -144 -5 48 189 -19 -118 43 38 -130 -118 -42 124
5310 124 183 -97 178 227 34 -105 -1 252 -105 86 -140 162 -54 135 94 -92 8 -19 -281 -68 53
5331 53 245 -4 181 -303 93 -89 -182 28 37 -17 109 -50 -247 -112 42 13 -240 -44 13 -71 151 153 46
5354 46 -127 49 -108 159 12 -146 -44 47 -148 -65 -83 188 -68 -108 134 -161 -218 219 -6 -10 -197 -22 194
5377 194 -12 103 -7 138 27 169 178 -70 -99 13 227 -25 -128 113 -146 -5 -178 -184 105 136 110 22 -38
5400 -38 137 -153 41 -54 -33 -153 -96 60 -73 12 8 -32 50 81 -8 -34 -104 -204 -45 -183 152 44 323 -9
$$ packed form
5235c3J19j87J67k22J67Qj53L21j59mjj8L8m8J02R8l45J54l03K60QJ21M8l28J27
5260f3qJ28k0o5J72j76m2J00n6J18J75l00OK26k11p5Q2j9nJ99j66M4j63K21j64
5285f2m6R3k7J34J18j97O0O9m05J30Q7o4P5j09J39N3J41k08r9J61nj68J2P6J66
5310A24N9k80K75M9j93j39J04K53l57J91k26L02k16J89m1j86J00k7k62K13J21
5331E3J92k49J85m84L96j82r3K10Rn4J26j59j97J35J54k9k53J96N7q4K22Kj07
5354D6j73J76j57K67j47j58J02R1j95Q3j8K71k56m0K42k95n7M37k25mj87J75K16
5377A94k06J15j10J45j11J42Rk48k9J12K14k52j03K41k59J41j73oK89L1k6q8o0
5400c8J75k90J94r5K1j20N7J56j33Q5mm0Q2L1q9k6p0j00J59j38L35j08K79l32
$$ plain form
5424 -9 66 32 69 -15 30 -90 -122 -3 341 -286 -81 367 -34 -177 -54 64 -23 -35 45 -13 -58 -143 79 -282 149
5449 149 124 -75 -127 307 -41 -76 -148 248 -14 79 -53 -28 112 -9 27 -231 55 204 -226 -57 104 -12
5471 -12 -160 -62 -38 94 102 6 151 62 132 41 39 -106 -117 -52 4 20 -31 82 44 -157 -102 30 -61 34 -79 24 30
5498 30 36 -4 -72 -52 -181 185 53 -143 110 -168 213 -179 12 -225 186 182 -105 -50 -225 43 7 -104 -85 216
5522 216 40 -201 161 -81 -128 174 -77 238 -45 298 -73 13 144 67 58 225 191 -21 112 -72 -77 -91 26
5545 26 -16 50 -87 -143 87 -174 -154 -55 -150 85 -18 189 37 -103 -38 -36 -12 86 -44 80 -77 68 -88 102
5569 102 -168 -180 260 31 -45 -100 -118 -174 -12 -15 48 -11 22 -34 -5 -40 89 -159 -116 44 158 -86 -184 -48 94
5594 94 -211 132 -158 -117 75 13 -10 -48 -102 119 120 -172 214 112 209 -23 169 156 -157 -42 -127 4 101 28
$$ packed form
5424iP5l4L7q4M5j20l2J19L44o27K05M48m01j43J23J18q7j2Q0n8m5q5K22l61M31
5449A49k5j99n2M34l48l5p2L96k62R3j32K5J40j21L6k58K86J49m30J69J61j16
5471a2j48R8K4J32Qr6J45q9P0r1kj45j1O5N6J6n1J13l8k01N5J32r1R5j13J03O
5498C0Om0o8K0j29L66j32j96K53k78L81l92J91k37M11mk87N5j75K68l6j11J9L01
5522B16j76k41L62k42m7L02k51L15k83L43l71Q6J31p7rJ67l4k12J33j84nj4J17
5545B6m2O6j37n6K30k61K0R9r5K35j03K07j52j40O5KK4R8j30J24j57J45j56J90
5569A02k70j2M40k29p6n5j8n6J62lO3n9L3n6K9l5J29k48M3J60J14k44r8J36J42
5594I4l05L43k90M1J92o2k3l8n4K21Jk92L86j02R7k32J92j3l13J15q5J31R7p3
$$ plain form
5618 28 60 151 -124 51 -57 -97 52 -47 162 199 -19 82 -83 -91 98 185 172 90 -144 77 145 53 -77 -52 -91
5643 -91 -75 -2 -209 -62 -305 -99 27 -151 16 -211 44 111 -128 110 -28 132 -57 -296 -224 9 31 -384
5665 -384 -124 4 77 -140 262 264 -101 256 -260 -51 66 -84 169 94 -19 67 79 1 264 -320 -22 -125
5687 -125 44 -161 -65 -188 -201 -160 -78 23 3 39 -4 -130 27 -18 -81 -7 -138 231 26 -37 -31 10 120 191 100
5712 100 -154 90 52 52 -123 263 -21 95 -246 -175 -83 -114 24 161 -7 -103 -263 -22 -185 95 139 89 106
5735 106 -53 53 17 -282 145 -206 -38 187 11 19 -78 -152 102 -4 112 96 18 96 -67 -175 42 -69 -23
5758 -23 -94 -79 -184 -102 -122 -92 -8 -127 -91 -91 -71 -121 28 173 55 106 64 49 60 -3 -33 78 -88 -113 150 21
5784 21 84 -134 59 -33 -40 8 -25 -18 -184 -2 -244 218 130 -140 -49 -119 59 -85 -8 99 -52 11 29 169 9
$$ packed form
5618B8L2R1k75J75j08m0J49r9K09L7k18J01j65qJ89Q7j3q2k34K21O8r2j30K5l9
5643i1J6P3k07J47k43K06J26j78J67k27K55O7k39K38j38J60j89k39P2K33K2m15
5665c84K60J28P3k17M02Kl65L57n16K09J17j50K53p5j13Q6J2p8K63n84K98j03
5687a25J69k05R6j23j3M1Q2J01k0L6m3j26J57m5o3P4j31L69k05o3OM1J10P1r1
5712A00k54K44l8%j75L86k84J16l41P1R2l1J38J37j68r6j60K41j63K80M4n0J7
5735A06j59J06l6k99M27l51J68K25j76Qr7p4K54j06J16j6p8P8j63j08K17j11M6
5758b3p1J5j05Q2k0L0Q4j19L6%K0n0J49J45j18N1m2j5J1o3l0J11j66k5K63j29
5784B1O3k18J93r2pM8l3Pj66J82k42M62q8k70R1p0J78j44P7J07j51O3J8J40j60
$$ plain form
5809 9 -49 88 -11 29 10 7 -23 -106 66 -89 -175 -30 -87 -3 -201 5 -33 266 -43 -91 -26 201 28 75 135 -79
5835 -79 -42 9 180 -239 -92 171 -113 -91 200 104 155 96 10 71 212 66 27 -17 -158 -13 -43 27 -40 209 172
5860 172 187 114 135 159 379 -68 -59 83 83 -67 -22 103 2 46 -34 64 -48 56 85 -67 -116 58 12 -50 22 -103
5886 -103 -51 117 -7 -22 -193 161 133 -82 -128 119 -148 -441 -21 136 -70 90 -22 144 88 -35 -70 74
5908 74 184 -11 -171 211 218 -74 92 61 123 179 -42 5 -121 -63 -110 -115 115 -59 -9 -132 347 69 54 -83
5932 -83 38 11 -210 146 130 122 -133 -111 60 96 -161 337 74 54 131 -106 227 -11 -110 80 -106 134 -140
5955 -140 -145 -121 162 -4 131 157 -291 108 208 27 198 -209 141 -8 -119 86 -242 -142 281 -122 -70 178
5977 178 126 -67 -130 112 61 -47 47 58 -132 -169 143 224 -121 323 -104 -37 136 346 -97 -3 92 -44 49 -24
$$ packed form
5809In8J37r9M0j9ll0q3J72j55q6J45n7Q4j98K06l8K99l09m8O5K27j73M7O0k14
5835g9L7N1J71m19J47K63k84K2K91r6N1n9q6O1J41j46l9m4j41J45l0P0o7K49l7
5860A72J5p3K1K4K20m47RJ42%j50M5J25j01M4q0R8j12J04K9j52m9J74m6o2P2j25
5886a03N2J68j24j5j71L54k8k15m6K47k67k93M20J57k06J60j12J66n6j23l5J44
5908G4J10j95j60L82Pk92J66l1O2N6k21M7j26N8m7nK30j74N0j23M79k78j5j37
5932h3J21k7k21L56j6qk55K2J71L6k57M98k63k0P7k37L33k38r9J90j86K40k74
5955a40nK4K83j66J35K6m48L99J00j81J71m07L50j49j11K05l28J00M23m03N2K48
5977A78n2j93o3K42n1j08R4J1j90l7L12Q1l45M44m27O7J73K10m43R4R5j36R3p3
$$ plain form
6001 -24 -280 -20 -66 -98 -15 182 -297 -26 -140 -15 -15 -52 8 -167 -140 101 -102 -199 17 -44 13 94 -31 -108 -101
6026 -101 -86 138 -14 89 9 39 23 14 -102 -53 -288 113 -83 -111 250 -130 -133 -35 18 -91 -229 -291 4 131
6050 131 -71 -52 172 28 -87 40 -96 -49 -36 1 91 -101 5 -67 -169 96 -6 227 2 37 83 36 -208
6073 -208 -221 99 -175 100 -68 275 50 -153 -33 -180 17 -116 -123 140 -161 -40 115 210 -92 16 -213
6094 -213 -56 132 -7 -67 60 119 61 43 67 -17 17 58 -64 -34 5 154 126 -197 -186 -116 2 127 -145 -232 -86
6119 -86 -147 258 -310 147 137 -168 -98 -44 51 165 -260 67 -44 -72 -26 -48 2 -197 -12 -330 55 82 126 237
6143 237 -68 21 123 -11 -44 -111 -71 -83 52 -70 -129 85 -59 218 46 -129 10 0 -27 21 205 44 -197
6166 -197 42 107 29 -11 -200 -108 173 185 48 46 -284 -74 -1 -221 -154 -154 33 40 -144 -240 -17 -94 -7 68 123 -231
$$ packed form
6001b4k56K60m6l2Q3J97m79K71j14J25%l7O0j75K7K41k03r7K16o1N7Q1j25p7P
6026a01J5K24j52J03q0L0j6rj16M9k35M01j96k8L61l80lR8N3j09j38o2K95J27
6050A31k02J9K24j44j15J27j36M7J3L7R0j92J06p2j02K65j02K33k25L5M6m7k44
6073b08j3L20k74K75j68L43k25k03J20j47J97j33pK63l01J21J55R5l02J08k29
6094b13J57J88j39o0J27N9n8j8K4q4L4M1j22L0L9J49k8l23J1P0J18J25k72q7J46
6119h6o1M05n68M57j0l05P0N4R5J14m25L27j11k8M6k2N0j99J85l18L85K7M4J11
6143B37l05Q9J02j34l3o7M0j2J35j22n9K14j44K77j72j75J39j0k7M8J84j61k41
6166a97K39O5p8m0j89R2K81J2j37kl30K10P3k20O7%J87Pj84r6K23p7Q7P5N5l54
$$ plain form
6192 -231 84 -66 -217 -55 -332 48 -118 56 -194 -163 -8 191 58 -257 -133 225 141 16 89 35 -9 -105
6214 -105 -157 -126 -215 -7 -29 -73 131 -60 61 -154 -1 227 24 121 240 109 -67 4 216 -235 172 -5
6236 -5 -193 231 175 -9 275 129 2 -144 -93 126 18 27 -110 -51 -126 -100 -23 -79 38 57 -3 -32 -5 -163 8
6261 8 127 68 -256 -16 89 107 -60 -37 55 -31 57 189 187 4 120 29 -81 -12 181 -26 32 151 51 157
6285 157 132 21 9 -49 123 -198 -119 -51 178 -22 82 145 92 -173 -72 138 -96 -17 -13 -41 57 132 -41 -6 -82
6310 -82 -117 -69 -98 80 34 -207 71 -156 -221 77 1 -90 22 41 49 242 -29 -168 11 -205 -120 -28 95 -44
6334 -44 -97 325 26 -135 -210 -268 125 37 -53 -66 76 97 15 -56 -151 88 -276 -141 -203 -82 376 140 64 -80
6358 -80 227 79 -136 72 213 116 -69 6 -112 -164 21 -126 202 170 -5 254 57 -45 -128 147 -163 178
$$ packed form
6192b31L15j50j51J62k77L80j66J74k50L1J55J99j33l15J24L58q4j25P3n4m4r6
6214a05n2L1q9K08k2m4K04j91J21k15J53K28k03R7J19j31j76P1K12m51M07j77
6236ej88M24n6j84K84j46j27j46N1K19j08Rj37N9p5K6P7n6J17J9o0k9K7j58J71
6261HJ19n9l24K40J05J8j67K3R2q6Q8J32kj83J16r1j10O9J93k07N8J19j00J06
6285A57k5j11j2n8J72l21P9O8K29k00J04O3n3k65J01K10k34P9Mk8R8P5j73L5p6
6310h2l5M8k9J78m6k41K78k27o5K98p6r1J12J9QJ93k71j39J79k16Q5R2J23j39
6334d4n3M22k99j61p5n8L93q8r0j3J42K1q2p1r5K39l64J35o2J21M58k36p6j44
6358h0L07j48k15K08J41r7j85P5j18n2J85j47L28l2j75K59j97j02q3K75l10L41
$$ plain form
6380 178 -202 -98 75 48 134 -45 -165 265 41 27 145 -103 -133 123 434 123 272 77 -80 128 87 -61
6402 -61 -27 -58 -190 -174 -168 -169 -46 44 -279 87 142 -39 -34 65 101 -34 -113 -130 -139 -72 -108 51 -199 -115 -63 -24 272 80
6430 80 -38 2 -56 35 103 -196 139 138 62 59 -66 182 -43 184 -66 8 30 -80 62 29 -102 10 183 -132
6454 -132 -22 18 -348 -65 101 -123 -59 54 -66 181 -106 -87 217 -147 -100 -117 -16 -249 -30 285 49 -82
6476 -82 -12 -17 -60 -35 57 164 -17 -23 -62 -178 -89 22 126 -149 35 -93 103 22 -24 -17 -143 -20 108 -68 50
6501 50 137 64 16 104 131 167 -134 -15 145 98 -4 145 44 40 77 86 -56 -135 -129 -15 38 87 -112 6 147 -172
6527 -172 -46 40 28 117 296 24 44 -51 107 -51 134 127 32 85 45 -105 -28 62 286 11 -58 101 120 62 -13
6552 -13 -85 -275 -14 -131 93 185 -133 -185 93 -112 -226 32 83 238 213 176 -112 -14 114 -245 -364 -226 -48
$$ packed form
6380A78l80J04J73k7Q6j79j20M30k24j4J18k48l0K56L11l11J49j95j57K08m1j48
6402f1L4l1j32J6OjJ23R0l23L66N5j81NR9L6j35p9j7rO7l6J59k50Q4N2L9K96j92
6430H0j18M0n8R1O8k99L35jp6lj25K48k25K27k50P4K2j10J42l3j31J12J73l15
6454a32J10M0l66K83J66k24O4J13j20K47k87J9L04l64M7j7J01k33K19L15k36j31
6476h2P0nm3K5R2J07j81ol9j16Q9J11J04k75J84j28J96q1m6Pj26J23J28j76J18
6501E0Q7p3m8Q8K7L6l01J19J60m7j02J49j01mL7Rj42p9OJ14N3M9j99J18J41l19
6527a72J26Q6j2Q9J79k72K0r5J58j58J85pr5N3m0j50P7R0K24k75o9J59J9n8p5
6552a3p2j90K61j17K24R2l18n2K78k05j14K58N1J55k5l7k88R8J28l59j19J38J78
$$ plain form
6575 -48 -11 -264 117 -210 -8 -31 -12 -132 -215 0 -67 181 -360 88 127 -277 -42 25 122 47 159 -46 -210
6598 -210 127 15 98 67 10 -93 131 130 -84 -54 -94 250 -202 -32 30 136 -67 -83 -267 163 -2 -1 19 -132
6622 -132 -245 17 190 -121 -125 97 19 -233 130 -228 25 49 28 -23 72 -27 9 -21 223 6 -7 -62 1 -249
6646 -249 -98 145 -144 -123 -7 -58 121 -278 -102 163 -215 -157 29 -72 -136 79 -69 20 156 -87 -147 -47
6668 -47 198 74 131 134 -250 214 -197 -150 -83 -75 309 -56 169 -118 -31 -57 -50 87 2 203 -96 -184 -107 -23 51 157
6694 157 197 -43 -206 -2 28 52 109 87 301 211 269 25 59 -21 -91 134 118 74 80 -175 -30 59 -38 -125 32 95
6720 95 -269 -116 -29 66 153 -50 -130 -49 -157 40 -194 -3 72 -271 -104 30 -46 46 25 145 -135 -118 82 -81
6744 -81 104 -22 126 -60 105 -12 -25 -13 57 21 99 -116 2 -122 60 243 141 -76 59 -113 -4 98
$$ packed form
6575d8L7k53L81l27K02k3J9j20q3K15o7K48n41M48L9m04K35O7R7p5J12k05j64
6598b10L37j12Q3l1n7j03K24jk14L0m0L44m52J70O2J06k03j6j84M30j65JK0j51
6622a32j13K62J73l11mK22p8k52L63l58K53K4k1n1R5r9L6l0K44k17j3n5O3k50
6646b49J51K43k89K1J16n1J79l99J76K65l78N8J86j01o4K15j48Q9J36k43o0J00
6668d7K45j24N7Ll84M64m11M7O7QL84l65K25k87Q7k6PJ37q5K01k99q8P7Q4P4J06
6694A57M0k40j63K04L0K4N7k2K14r0N8k44L4q0p0K25j6m4Ok55J45Q9r7q7J57O3
6720I5l64J53Q7R5Q7k03q0Q1j08J97k34J91P5l43J67J34p6R2k1J20k80J7K00j63
6744h1J85j26J48j86J65j17j3J2P0l6P8k15J18j24J82J83j02k17J35j72J09J02
$$ plain form
6766 98 -34 14 95 38 -125 80 -162 4 -134 -11 56 -89 -23 64 -76 125 215 93 70 -92 65 -171 -118
6789 -118 130 17 -72 -264 -162 91 -259 -69 -72 -1 28 189 103 -36 -105 48 57 252 -190 -95 150 -5 -94 36
6813 36 -160 -178 103 83 -13 155 141 127 -47 103 -216 -266 117 143 157 105 3 -125 129 -5 196 55 262
6836 262 257 127 -195 -183 -57 -30 -147 160 92 -267 -166 119 -17 -208 -232 110 -146 -141 -98 174 -139 38 -77
6859 -77 -153 320 -93 54 -167 -76 -357 107 311 -76 4 -30 11 83 -22 57 -49 88 -87 18 -15 24 -281
6882 -281 19 -21 -19 -331 50 -13 163 -182 -56 97 -61 -202 -15 45 -70 -22 -75 390 -113 -45 -18 119 -71
6905 -71 244 190 287 13 -12 103 -212 -10 -49 143 -9 149 11 -168 -39 -113 82 -106 -193 261 -27 22 -64
6928 -64 -123 32 16 50 -165 -105 -177 14 -142 -43 29 -167 -188 -13 -11 8 -19 -125 -87 -30 -90 113 144 65 63 -169 67
$$ packed form
6766I8j32M8Q1n7j63K05k42J66j38J23O7j45O6Q7j40K01R0j22k3j62J57k36N3
6789a18K48j13q9j92J02K53l50J90lP1K9J61q6j39o9J53RJ95m42R5K45j55q9J30
6813C6j96j8K81k0r6J68j4j4j74J50l19n0L83K6J4n2j02j28K54j34K01j41K07
6836B62nj30l22J2J26K7j17L07o8l59J01K85j36j91k4L42k56NM3K72l13J77j15
6859g7p6M73m13J47k21R1k81M64K04l87Q0l4M1P2j05P9j06J37j75J05l3L9l05
6882b81L00m0Kl12L81o3J76l45J26J53j58j41J87O0j15M8n3M65n03O8K7J37j90
6905g1L15n4R7k74k5J15l15K02l9J92j52J58j38j79J29p4J95j88q7M54k88M9q6
6928f4n9J55j6L4k15O0p2J91j56R9P2j96k1J75KJ9k7j06L8N7o0K03L1p9kk32K36
$$ plain form
6955 67 -41 -113 -63 -30 -46 -253 -121 94 90 206 95 7 156 80 -1 -100 51 120 128 28 86 27 -111 -40 -141 -52
6981 -52 157 137 187 42 -73 153 -149 -16 234 95 103 76 66 112 13 -98 -35 25 175 -222 -117 -171 -6 -49
7005 -49 161 -17 -46 -66 94 -122 -121 112 52 0 28 -163 -62 91 -315 10 130 10 0 -27 -193 -62 175
7028 175 -172 194 -101 -92 -97 -18 81 96 -92 123 -110 82 11 -124 -10 -164 15 -38 -254 171 -68 -31 29 93
7052 93 125 -77 159 19 81 53 92 -102 -77 38 108 197 -61 74 39 138 22 -217 -146 67 229 -17 -171 -168
7076 -168 -31 90 83 217 126 167 42 -241 -122 226 24 183 -71 -102 34 102 -31 0 48 -95 -20 -88 -53 126
7100 126 107 127 116 55 -68 -11 227 51 -14 -106 -53 -107 -100 8 126 -119 -242 -47 27 -157 -147 -114 -213 68 -80
7125 -80 -76 36 126 18 154 25 -175 -53 -173 -22 244 -128 6 -51 -83 283 -116 140 55 354 -177 201
$$ packed form
6955F7j08p2N0L3j6k07J32K15mJ16j11q8J49p6q1r9J51O9Qj00N8n9j38P1j01Q9
6981e2K09k0N0j45j15K26l02J33K50j39Qk7j0M6r9j11O3O0J50l97J05n4J65m3
7005d9K10j78k9k0J60k16JK33o0n2K8j91J01J53m06L25J20j20j0k7j66J31K37
7028A75l47L66k95RnP9R9J5j88K15k33J92p1j35J14j54J79n3k16M25k39L7O0O4
7052I3L2k02K36j40O2k8L9j94K5J15P0Q9k58J35l5R9j16k39P1K13J62k46j54L
7076a68J37J21pJ34r1M1j25k83J19L48k02J59k54l1J36O8j33L1M8j43P5o8L5J79
7100A26j9K0j1o1j23N7K38j76o5r2N3n4PJ08J18k45j23J95P4j84J0L3r9K81j48
7125h0MJ12R0j08J36j29k00J22j20J51K66l72J34n7l2L66l99K56q5K99n31L78
$$ plain form
7147 201 -191 -40 245 -182 -29 -75 -162 -41 -257 9 -35 -19 -177 -55 127 30 -142 42 -143 69 -114 -182
7169 -182 -8 203 -319 29 -95 -14 364 -74 76 -62 55 -1 17 -61 -108 -38 275 -217 -150 -294 159 129 -58
7192 -58 118 -247 96 72 -188 74 71 253 -101 -285 -128 131 89 -248 -44 -85 -2 41 -48 22 -293 106 -50
7215 -50 -45 -118 -79 68 61 103 -178 -2 41 -118 -63 -313 54 132 -202 -32 7 -73 160 -122 7 207 1 89 -79
7240 -79 158 -136 -21 -110 301 -135 190 -17 79 -30 -56 63 189 240 127 52 -68 52 55 92 -11 39 192
7263 192 -18 -168 -38 115 186 -18 -6 -23 -79 43 334 -90 82 -65 89 -82 190 -119 142 99 -55 -3
7285 -3 232 14 -91 -140 -89 105 -163 -107 -208 -124 3 145 3 8 -62 131 36 57 -92 206 186 -115 96 70
7309 70 -195 -157 -41 -30 94 195 -192 -29 17 161 -48 -238 95 205 -117 55 -246 -158 57 -57 -105 -116
$$ packed form
7147B01l92J51K85m27J53m6q7J21k16K66m4J6j58J22J82r7j72J84j85K12j83o8
7169a82J74K11n22L48j24Q1L78m38J50j38J17n6J8p8m7P0L13m92O7j44M53l0j87
7192e8J76l65L43k4k60K62lJ82l54j84J57K59m2l37K04m1Q3M3q9P0l15L99j56
7215e0Np3L9J47pM2k81J76M3j59N5k50L67P8l34J70L9q0K33k82J29K00k06Q8j68
7240g9K37k94J15q9M11m36L25k07R6j09k6J19J26N1j13p5j20J20LL7j03N0J53
7263A92k10j50J30J53P1k04J2j7n6J22K91m24J72j47J54j71K72l09K61m3j54N2
7285cK35k18j05m9N1J94k68N6j01Q4J27J42j42Np0J93r5K1j49K98k0l01K11k6
7309G0k65L8J16J1J24J01l87J63M6J44k09j90L33J10l22J72l01Q8K15j14m8j1
$$ plain form
7331 -116 -82 27 131 4 114 2 -276 -51 -102 27 -34 -217 -24 -37 17 -66 10 -42 -89 96 54 25 73 -130
7355 -130 206 -96 29 -52 91 -31 -112 12 -10 6 111 82 239 -92 48 185 -70 -2 179 -89 47 26
7377 26 100 172 -5 -120 -236 188 -15 -197 -393 -201 22 95 95 129 4 31 175 -155 -215 7 6 -23 -59 -63 -171
7402 -171 112 -189 253 37 -106 -11 86 -73 -4 -25 -42 -216 53 -45 32 17 -152 11 -40 -236 40 165 -26
7425 -26 107 -35 123 -9 89 -17 45 -86 29 141 74 34 -76 100 63 -9 46 167 -48 184 168 -61 79
7448 79 13 46 -121 -6 126 -24 117 -163 182 167 -11 52 55 30 -495 14 -89 82 124 212 68 -14 -89 -242
7472 -242 68 -59 132 -151 128 222 -209 -7 33 -340 -290 26 -56 -105 -69 -229 72 267 139 35 -87 153
7494 153 -44 29 147 254 68 -64 -18 236 12 203 -86 -70 10 -179 -132 -29 152 -164 273 -206 91 128
$$ packed form
7331a16L4J09J04j27J10j12k78K25n1J29o1j83J93j3N4q3P6n2m7J85m2k9M8k03
7355a30L36l02J25q1J43j22q1J24k2J6J05k9J57l31J40J37k55O8J81k68J36k1
7377B6P4P2j77j15j16M24k03j82j96J92K23P3%L4j25K7J44l30o0K22jk9l6mj08
7402a71K83l01M42k16j43R5R7j59O9k1j7j74K69r8P7j5j69J63n1j96K76J25j91
7425b6J33j42J58j32R8j06O2j31J15J12o7m0j10J76l7p2N5J21k15K32j6k29J40
7448G9o6L3j67J15J32j50J41k80L45j5j78O3Lk5n25N09j03J71M2Q8j44q2p5j53
7472b42L10j27J91k83K79R4m31K02M0l73N0L16q2m9L6j60L01J95j28j04j22K40
7494A53j97P3J18J07j86j32M6K54k24J91k89J6Q0j89M7J03J81l16M37m79K97L7
$$ plain form
7516 128 19 114 108 -26 -64 -182 324 36 78 13 -181 103 -33 119 -153 44 -119 -16 -10 100 -60 -59 27 116
7540 116 254 -18 161 -56 -130 51 158 -127 -78 39 61 74 -1 -52 -189 127 -110 -90 -26 384 6 161 14
7563 14 -95 -90 -90 50 -34 -85 122 -59 69 -52 79 70 -71 105 -20 31 -113 127 -169 36 206 61 -211
7586 -211 70 21 2 144 47 35 105 22 79 -218 -75 -69 166 46 -15 157 0 -58 148 -124 -111 72 182 -205
7610 -205 107 211 -74 39 -83 -101 4 -35 -134 44 -81 198 11 412 161 309 -53 -112 -237 62 -103
7631 -103 160 -48 -181 -77 -205 110 31 -281 100 98 -257 86 -16 -41 -182 120 -113 9 -122 -26 19 -28
7653 -28 87 87 -69 145 99 -35 4 -30 -18 -113 -17 61 123 27 -106 18 -127 263 114 7 238 130 188 38
7677 38 -174 -167 -162 -60 -7 -218 47 -155 -261 -15 -57 11 129 21 -156 -167 112 1 -137 68 102 -80 -73 -37
$$ packed form
7516A28j09R5oj34l8j18N06k88M2o5j94K84j36J52k72J97j63J03OJ10j60JQ6Q9
7540A16J38k72J79k17p4J81J07k85M9J17K2J3p5n1j37L16k37K0O4M10l78J55j47
7563A4j09N%J40q4n1K07j81J28j21J31rj41J76j25N1j44K40k96K05J70j45k72
7586b11K81m9j9J42r7j2P0q3N7k97J43OK35j20o1J72j57n8K06k72J3J83J10l87
7610b05L12J04k85J13j22j8J05l9r9J78j25K79j87M01k51J48l62n9j25K99j65
7631a03K63k08j33J04j28L15p9l12L81kl55L43j02k5j41L02k33J22j31R6M5m7
7653b8J15%j56K14m6j34L9l4J2r5R6P8O2r6j33J24j45L90j49j07K31j08N8j50
7677C8k12PNJ02N3k11K65k02j06K46m2O8J18j08j77j1K79j11j38K05L4j82PL6
$$ plain form
7701 -37 -245 -131 332 -93 129 -60 -199 -413 -145 47 30 -53 75 167 -12 45 73 60 -163 -49 -112 60 -149
7724 -149 86 32 -281 -26 -166 -115 -36 -165 28 78 185 10 -85 -13 99 -144 -22 -174 -155 -62 126 53 121
7747 121 44 75 -25 353 -44 11 114 78 84 -6 252 -91 -166 68 -247 -49 -155 202 -96 -119 324 183 -140
7770 -140 16 -10 172 59 -63 187 -70 198 162 12 -101 85 -65 -31 99 9 -93 23 17 -88 -162 70
7792 70 1 150 74 86 11 -226 -77 23 -101 48 69 -216 181 20 -35 -5 -12 84 -73 -32 102 -221 194 -65
7816 -65 -217 93 35 130 56 -74 -16 -20 7 459 -44 -176 99 186 -186 7 36 3 243 147 -31 270 164 92
7840 92 -89 -37 -59 -59 161 70 173 -156 161 -60 -282 303 20 -173 72 -25 -141 -41 63 201 -127 -21
7862 -21 166 157 128 -69 157 -2 -38 21 -132 49 -205 74 0 -149 -139 135 -156 -143 -46 89 198 -20 -92 -25
$$ packed form
7701c7k08J14M63m25K22j89j39k14K68J92j7q3J28R2j79N7K8j3k23J14o3J72k09
7724a49K35n4l13K55j40N1P9j29J93N0J07j75r5P2J12k43J22j52J9R3J88p3O8
7747A21p7L1j00L78l97N5J03l6Or0K58l43p5K34l15J98j06L57k98k3M43j41l23
7770a40J56k6J82j13j22K50k57K68l6j50j13J86j50L4J30r0j02J16oj05p4K32
7792G0o9J49p6J2p5k37J49J00j24J49K1k85L97j61n5L0pR6j57M1J34l23M15k59
7816f5j52L10n8R5p4j30N8mK7M52n03j32K75Q7l72J93K9l3K40r6j78L01j06p2
7840I2j81N2k2%K20r1J03l29L17k21k22N85k83j93K45r7j16J00J04J38l28J06
7862b1J87rk9j97K26j59l6N9j53J81k54K79p4j49J0K74k91J3R7J35J09k18p2O7
$$ plain form
7886 -25 33 -238 5 -76 -225 -35 -94 47 -7 1 -104 84 155 -13 47 -133 8 -67 53 184 158 -249 -329 -103
7910 -103 -195 365 -56 210 -63 43 -147 -246 -48 -15 -279 51 -26 -37 162 -195 44 -298 60 106 -97 12
7932 12 39 47 24 122 -129 -21 103 -53 159 -69 18 -8 365 -54 129 232 -238 62 142 -118 -16 101 -209
7955 -209 24 -65 -77 -38 -48 192 98 32 49 -64 73 -232 -123 -9 -62 42 -135 -28 212 142 111 15 -7 48
7979 48 -152 5 -92 138 178 55 -209 -134 -49 -248 -196 -83 -86 -28 83 -294 10 -52 50 -219 -43 -147 45
8002 45 -3 -45 -80 62 207 25 118 -230 -228 0 66 108 -99 56 -243 -26 -53 -61 98 -117 -45 -110 58 -219 -101
8027 -101 97 41 -202 -17 137 153 76 -133 12 97 -139 -149 120 83 -28 73 197 -315 -12 -82 -71 -2 103
8050 103 -3 196 94 -139 20 117 -119 53 -84 -276 8 -168 -11 -293 -36 -211 -278 -156 117 -13 -104
$$ packed form
7886b5N8k71K43q1j49J90n9J41n4Qj05J88P1j68O0j80J41p5J20J31k6m07q0K26
7910a03r2N60m21K66k73J06j90r9J98L3k64L30p7j1J99l57K39l42L58M6k03J09
7932A2K7Qk3R8k51J08J24j56K12k28Q7k6L73m19J83J03m70L00Q0k60J02J17l10
7955b09K33q9j2L9j0K40r4o6J7j13J37l05J09J14n3J04j77J07K40p0l1r6k2N5
7979D8k00J57r7K30M0j23k64P5Q5j99N2J13lN8J11l77L04o2J02k69J76j04J92
8002D5m8m2l5J42J45j82R3l48KK28O6M2k07J55k99K17k7qJ59k15P2o5J68k77J18
8027a01J98n6k43J85J54J6p7k09J45Q5k36j0K69l7j11J01J24n12L03p0J1O9J05
8050A03j06J99j02k33J59R7k36J72j37j92K84j76J57k82K57j75o7J22K73j30r1
$$ plain form
8071 -104 -226 -106 -63 -24 -132 0 -4 -94 -62 -307 81 -133 76 171 -14 -19 117 96 67 -386 150 232 70 -17
8095 -17 212 -106 129 -166 -330 -4 8 173 3 -163 156 -70 -222 41 93 -4 -163 90 41 67 90 67 -108
8118 -108 -111 -186 29 -154 160 14 -45 -29 -135 -138 -155 -145 148 109 148 -179 113 5 156 -52 65 113 -268 -80
8142 -80 66 43 -107 232 47 177 -91 -11 44 -14 11 -126 7 110 216 -134 -61 -14 -27 -152 3 -275 -63
8165 -63 119 280 196 32 157 -19 -23 121 199 -213 -73 103 72 29 119 57 -32 -190 9 199 -56 110 -35
8188 -35 -63 28 120
$$ packed form
8071a04j22J20M3L9j08J32mr0L2k45L88k14K09R5j85nJ36k1k9m53N36Q2j62q7
8095a7K29l18K35k95j64L26J2J65j70j66L19k26j52K63N2r7j59K53m9K6K3k3j75
8118a08lp5K15j83L14j46n9J6j06lj7J0K93l9L9l27K92j08J51k08J17M8l81J88
8142h0J46k3j50L39j85J30k68Q0N5n8K5j37J33J03J06l50P3M7j3j25J55k78K12
8165f3J82J61q4j64J25j76mJ44P8m12J40J76l1m3R0o2q9j58J99J90k55J66j45
8188c5k8R1R2
8191A20
$$ Imaginary data points
##PAGE= N=2
##DATA TABLE= (X++(I..I)), XYDATA
$$ plain form
0 0 0 0 0 0 0 0 0 0 0 0 0 0 0 0 0 0 -8 8 -8 8 -8 16 -16 16 -21 24 -24 32 -40 40 -48 56 -64 72 -80 90 -104 114
38 114 -128 144 -160 178 -199 219 -242 267 -297 326 -360 395 -435 482 -531 585 -645 713 -791
57 -791 879 -979 1098 -1239 1408 -1620 1889 -2246 2744 -3494 4783 -7628 31943 -29715 -6836
72 -6836 47671 -9643 14535 -2131 -4072 7467 -10102 718 2569 -21608 -7188 3845 -4857
85 -4857 -22972 -7290 5832 -7558 -13737 -11885 3140 6067 -17424 -4610 1641 -5853 4857
98 4857 -2137 -9959 -2682 -875 5905 -4166 -14392 -3107 3557 1172 -12882 -12543 7154 -3023
112 -3023 -11861 -2819 -4315 -2795 -3920 -5196 -1286 -8027 943 5728 -9620 -6407 4470 7911 -1747
127 -1747 -10841 5394 8562 1449 974 -964 6518 4902 4530 9038 -3650 4227 13632 2793 4422
$$ packed form
0@%%%%%%%%%%%%%%%%qJ6j6J6j6K4l2L2l7M5m8N6p2Q0q8J04j20J36j52J70j94K18
38A14k42K72l04L38l77M18m61N09n64O23o86P55q30R17j013J116j230J358j504
57g91J670j858K077k337K647l028L509m135M990o238Q277j2411L9571o1658K2879
72f836N4507n7314K4178j6666j941J1539j7569J0820J851k4177J4420J1033q702
85d857j8115J5682J3122j3390o179J852J5025K927k3491J2814O251p494J0710
98D857o994p822P277J807O780j0071j0226J1285O664k385j4054L39J9697j0177
112c023q838R042j496J520j125j276L910o741Q970M785j5348L213J0877L441r658
127a747r094J6235L168p113m75j938P482j616l72M508j2688P877R405j0839J629
$$ plain form
142 4422 270 5087 14360 -3268 -1289 8079 3410 2371 -4690 1061 3436 -5021 2811 -4010 -10079
157 -10079 2937 -210 -4512 -7878 -8201 5180 -858 -9607 -4079 -2051 1199 -2304 -3950 -1173 -2444
172 -2444 2854 -319 -4435 332 -939 3355 -325 -7822 2619 2423 -2501 -2145 -6168 3156 2998 -7080
188 -7080 -1373 -1740 -82 1989 -2714 -1563 -3054 2792 6458 -3896 -2310 3940 5425 3500 -3106
203 -3106 4196 7473 509 4912 3089 2080 6482 4810 4328 427 4326 10220 1985 1238 3361 4650
219 4650 8483 24 -299 4637 2719 5779 -542 -2565 4342 510 1682 -357 -4535 1504 228
234 228 -1231 -2926 -5327 2132 -196 -6131 -3500 -1769 1132 -3880 -5563 684 -3443 -1383 1221
249 1221 -5811 -3287 669 1241 -2588 -7250 826 1509 -3016 -2850 -4431 -465 -341 -4248 -1467 -4989
$$ packed form
142D422m152M817R273j7628J979R368m669j039p061N751K375q457P832o821o069
157a0079J3016l147m302l366l23J3381o038q749N528K028L250l503j646K777j271
172b444N298l173m116M767j271M294l680p497J0441j96m924L56m023R324j58j0078
188g080N707l67J658K071m703J151j491N846L666j0354J586O250J485j925o606
203c106P302L277o964M403j823j009M402j672m82l901L899N894q235p47K123J289
219D650L833q459l23M936j918L060o321k023O907l832J172k039m178O039j276
234B28j459j695k401P459k328n935K631J731K901n012j683O247m127K060K604
249A221p032K524L956N72l829m662Q076O83m525J66j581L966J24l907K781l522
$$ plain form
265 -4989 -2402 1635 -4837 -3347 -2832 -1237 1396 -6019 -2825 1386 -1534 102 -2544 -2343 2937 1703
281 1703 -547 -1189 1661 3492 1804 2815 -165 1354 6337 2262 1116 998 2671 6152 -393 -809
297 -809 4237 558 2833 1049 -2863 2614 712 -452 612 -3704 48 3181 -2452 -2876 -968 1100
313 1100 586 -2188 -1795 -421 1436 638 -2349 -225 -381 1209 1525 -3162 -174 974 436 1500 -4230
330 -4230 -267 3114 -2121 -891 -2078 -841 1858 -2737 -1168 -1673 -1333 2581 -2209 -1841 105 -157
346 -157 3177 -1905 -2007 2879 1383 2238 -812 -192 3536 1456 2027 296 268 4226 2200 1195 1231
363 1231 754 4729 2525 -111 1282 2586 4368 585 -194 2463 2027 2458 585 -784 1991 1132
379 1132 1519 477 -3135 1156 1933 -2008 -1202 -2122 405 791 -3063 -1843 -734 -1071 88 -2687 -2160
$$ packed form
265d989K587M037o472J490N15J595K633p415L194M211k920J636k646K01N280j234
281A703k250o42K850J831j688J011k980J519M983m075j146j18J673L481o545m16
297h09N046l679K275j784l912N477j902j164J064m316L752L133n633m24J908K068
313A100n14k774L93J374J857p98k987K124j56J590L16m687K988J148n38J064n730
330d230L963L381n235J230j187J237K699m595J569n05L40L914m790L68J946k62
346a57L334n082j02M886j496Q55l050O20L728k080N71j731k8L958k026j005L6
363A231m77L975k204k636J393J304J782l783p79K657m36M31j873j369K775q59
379A132L87j042l612M291P77l941Q06r20K527L86l854J220J109l37J159k775N27
$$ plain form
396 -2160 -977 -390 -430 -3474 -1639 302 -330 -718 -3464 -1438 1178 -1730 -1694 -3199 -1768 623 -2853
413 -2853 -2944 -2230 -2355 -263 -2688 -3550 -1747 -1380 209 -2595 -3451 615 -110 -194 -1932 -1364 1981 281
431 281 377 246 -755 2434 1611 158 1010 66 2776 2497 -1070 762 1712 2548 905 -484 1588 1633
449 1633 1623 1222 -1085 1747 2210 519 1675 -1001 1229 3079 131 -169 -722 1546 2214 -1151 -466
466 -466 311 460 887 -1283 -845 149 190 920 -1521 -1315 1102 604 195 -1678 -930 1604 -2 -1032
484 -1032 -1221 -566 1187 -126 -1192 -1496 -209 1403 -1374 -2188 -166 -360 698 -839 -1848 313
500 313 180 960 -690 -1643 1808 1654 316 42 -134 2651 1961 93 1440 551 2460 2453 67 662
518 662 1157 2840 2047 -1338 901 2009 811 1280 -979 718 1866 312 477 -1104 418 1835
$$ packed form
396b160J183N87m0l044J835J941o32l88k746K026K616k908L6j505J431K391l476
413b853r1P14j25K092k425q62J803L67J589k804q56M066p25q4j738N68L345j700
431B81R6j31j001L189q23j453Q52r44K710k79l567J832R50Q36j643j389K072M5
449A633j0m01k307K832M63j691J156k676K230J850k948l00n53K268O68l365O85
466d66P77J49M27k170M38R94M1P30k441K06K417m98m09j873P48K534j606j030
484a032j89O55J753j313j066l04J287J612k777q14K022j94J058j537j009K161
500C13j33P80j650r53L451j54j338k74j76K785o90j868J347q89J909pk386N95
518F62M95J683p93l385K239J108j198M69k259J697J148j554J65j581J522J417
$$ plain form
534 1835 -314 -602 -745 234 1222 -1188 -1578 -509 134 810 -1828 -1894 -429 -427 -571 -2615 -2018 -232 -1049
553 -1049 -1226 -2594 -2308 -404 -637 -2037 -2721 -1660 143 -1772 -2800 -1737 -1235 -652 -1270 -2222 -1836
570 -1836 -560 -80 -1059 -2560 -622 343 -33 -1292 -1479 880 605 -142 -48 -474 1275 1711 -42 375
588 375 565 1908 2209 -167 675 1858 1970 2541 -129 911 2589 1729 1819 33 935 2375 1122 1427
606 1427 270 454 2580 866 -46 -145 1052 2339 -529 -486 713 398 1017 -322 -460 336 252 783
624 783 -716 -1756 404 716 -208 -1607 -1249 1172 -420 -1217 -1223 -601 227 -772 -1319 -1101 -951 414 -319
643 -319 -1850 -1014 -44 779 -710 -1696 250 887 76 -721 -650 890 664 443 538 -393 807 1906 542
662 542 -448 94 2256 1954 -527 457 1541 1048 1502 -29 112 1495 1214 1090 -440 362 1836 702
$$ packed form
534A835k149k88j43R79R88k410l90J069O43O76k638o6J465Kj44k044N97J786q17
553a049j77j368K86J904k33j400o84J061J803j915j028J063N02N83o18r52L86
570a836J276M80r79j501J938R65l76j259j87K359k75p47R4m26J749M36j753M17
588C75J90J343L01k376Q42J183J12N71k670J040J678q60R0j786R02J440j253L05
606A427j157J84K126j714r12r9J197J287k868M3J199l15O19j339j38P96q4N31
624G83j499j040K160L12r24j399L58K421j592p97oO22Q28r99n47K18J50J365p33
643c19j531Q36R70Q23j489r86J946O37q11p97P1J540k26k21R5r31J200J099j364
662E42r90N42K162l02k481R84J084m93M54j531J41J383k81j24j530Q02J474j134
$$ plain form
680 702 115 -422 274 1279 103 -552 -667 261 1293 -890 -1518 -495 -141 128 -1310 -1751 -533 -824
698 -824 -613 -1466 -2719 -437 -595 -1528 -2352 -2366 -78 -1238 -2525 -1699 -1601 -709 -787 -2472 -1776 -1107 -239
717 -239 -900 -2124 -1054 -491 -190 -857 -1831 -416 122 97 -235 -1187 464 1200 -282 167 269 993 1269
736 1269 395 750 850 1348 2413 401 261 1928 1923 1738 481 969 2104 1611 1546 712 739 2246 1514
755 1514 884 457 770 2124 880 506 407 952 1484 525 -354 289 336 1177 -327 -1204 682 242 -80
774 -80 -653 -1207 20 28 -352 -865 -1637 390 118 -1812 -1419 -1030 -283 -531 -1563 -767 -565 -353 -342 -1392
794 -1392 -830 -414 -126 -403 -1512 -44 628 -262 -347 -760 107 1035 106 37 -296 626 1653 -381 -38
813 -38 582 611 1402 29 257 714 1384 1201 -80 309 1539 982 356 -50 346 1299 528 279 -518 -69
$$ packed form
680G02n87n37O96J005j176o55j15R28J032k183o28J023L54K69j438m41J218k91
698h24K11q53j253K282j58r33q24j4K288j160j287Q26R8Q92p8j685O96O69Q68
717b39o61j224J070N63L01o67r74J415N38k5l32r52J651P36j482M49J02P24K76
736A269q74L55J00M98J065k012j40J667nj85j257M88J135m93o5q34K7J507p32
755A514o30m27L13J354j244l74r9N45N32r59q79O43M7Q41j504q77J886m40l22
774h0n73n54J227Ql80n13p72K027k72j930L93L89P47k48j032P96K02K12J1j050
794a392N62M16K88k77j109J468O72q90q5m13Q67R28r29o9l33R22J027k034L43
813c8O20K9P91j373K28M57O70j83j281L89J230n57o26m06L96R53p71k49p97M49
$$ plain form
833 -69 1435 421 -711 -384 32 851 -364 -1037 -412 -255 316 -751 -1273 -478 -1 -491 -1384 -1239 -750
852 -750 -538 -1007 -1514 -1799 -687 -201 -1696 -1678 -810 -550 -931 -1819 -901 -629 -807 -486 -1173 -1060 -344 -259
872 -259 133 -1639 -906 697 168 -465 -405 253 864 -144 89 330 399 1771 367 -57 1161 1247 1631
891 1631 335 449 1588 1214 1492 620 321 1734 1680 1066 628 694 1797 1392 805 970 576 1289 1188
910 1188 283 312 736 1546 471 -361 760 856 548 137 -403 456 314 22 -297 -1108 -221 506 -458 -717
930 -717 -1015 -327 98 -1113 -1135 -898 -497 -115 -1375 -1282 -609 -556 -345 -1692 -933 -91 -561 -339 -1343 -854
950 -854 135 -179 -402 -1146 -37 637 -383 -289 -328 -130 888 -112 -483 262 147 898 -150 -640 1058
969 1058 684 417 320 -38 1169 883 407 70 193 945 1136 -22 -220 8 710 402 -384 -354 60 585
$$ packed form
833f9J504j014j132L27M16Q19j215o73O25J57N71j067n22P95M77m90q93J45M89
852g50K12m69n07k85J112M86j495J8Q68K60l81q88R18K72j78L21o87J13P16Q5
872b59L92j772P33J603n29o33O0O58O11j008K33K41O9J372j404m24J218Q6L84
891A631j296J14J139l74K78q72k99J413n4o14m38O6J103m05n87J65l94P13j01
910A188r05K9M24Q10j075q32J121R6l08m11n40Q59j42k92l19q11Q87P27r64k59
930g17k98O88M25j211k2K37M01L82j260R3O73N3K11j347P59Q42m70K22j004M89
950h54R89l14k23p44J109O74j020R4l9J98J018j000l71P45j15P51j048m90J698
969A058l74k67r7l58J207k86m76l37J23P52J91j158j98K28P02l08p86L0M14N25
$$ plain form
989 585 127 -754 -172 445 115 -174 -608 -173 177 -209 -445 -1133 -577 198 -395 -1174 -1012 -57 -9 -1368
1009 -1368 -894 -440 -518 -353 -1294 -1246 -630 -223 -156 -1299 -1179 -41 -98 -503 -1068 -384 457 -242 -149 -481 28
1030 28 797 104 -221 131 358 1087 415 -270 683 1064 1225 584 -30 993 1344 930 374 177 1370 1365
1050 1365 957 564 415 1309 1201 580 144 708 1132 1197 -24 430 1005 1004 594 90 398 938 496 174
1070 174 -125 123 535 48 -134 -474 -125 546 16 -918 -898 -7 305 -911 -1171 -688 -578 -556 -1060 -938
1090 -938 -683 -639 -376 -1174 -1153 -410 -642 -811 -1569 -1238 239 -472 -886 -689 -769 19 -403 -644 -453 -90 712
1111 712 -114 -736 -88 -21 749 -80 -648 428 631 71 68 -402 532 688 -165 245 119 505 624 20 -121
1132 -121 -152 552 703 -452 -140 516 622 168 -258 250 644 313 489 -233 -383 823 540 3 -460 -338
$$ packed form
989E85m58q81N82O17l30k89m34M35L50l86k36o88N56P75n93p79J62R55M8j359
1009a368M74M54p8J65r41M8O16M07O7j143J20J138n7m05n65O84Q41o99R3l32N09
1030B8P69o93l25L52K27P29o72o85R53L81J61o41o14J023L51m14n56j97J193n
1050A365m08l93j49Q94j08o21m36N64M24O5j221M54N75jm10n04L08N40m42l22
1070A74k99K48M12m87j82l40L49O71n30r34K0Q91L12j216k60M83J10K2n04J22
1090i38K55M4K63p98K1P43k32j69p58L31J477p11m14J97q0P88m22k41J91L63Q02
1111G12q26o22O48O7P70q29n68J076K03n60lm70R34J56q53M10j26L86J19o04j41
1132a21l1P04J51j155L12O56J06m54m26N08L94l31J76p22j50J206k83n37m63J22
$$ plain form
1152 -338 723 9 -731 -365 -43 272 -744 -901 -320 -435 -138 -779 -834 -610 -234 -246 -1087 -1383 72 149
1172 149 -303 -782 -514 133 -189 -273 -443 -209 495 346 169 -193 -62 812 734 -388 80 908 841 155 -372
1193 -372 618 870 419 410 37 728 1078 708 464 166 942 1485 625 200 481 1002 1029 -177 273 818 655
1214 655 725 149 76 642 549 171 63 -47 642 315 101 -283 141 451 -12 -496 -414 -271 160 -485 -757
1235 -757 -306 -400 -373 -826 -1407 -986 -325 -475 -993 -1483 -479 -287 -876 -1117 -1092 -97 -490 -702 -832 -506 -144
1256 -144 -98 -858 -467 -337 -85 222 -658 -391 10 274 -41 -534 -12 420 -83 -304 -344 355 571 -68 -84
1277 -84 -94 338 755 283 -132 331 745 758 154 68 746 621 380 194 105 703 697 247 -77 53 723 511
1299 511 -83 -186 105 839 329 -365 -35 87 399 -170 -415 -296 85 -108 -419 -745 -240 -67 36 -589
$$ packed form
1152c38J061p14p40L66L22L15j016j57N81j15K97o41n5K24L76j2q41k96J455P7
1172A49m52m79K68O47l22q4j70K34P04j49j77l62J31Q74p8j122M68Q28o7o86n27
1193c72R90K52m51rl73O91L50l70k44k98P76N43q60m25K81N21K7j206M50N45j63
1214F55P0n76p3N66r3l78j08j10O89l27k14l84M24L10m63m84Q2J43M31o45k72
1235g57M51r4K7m53n81M21O61j50n18m90J004J92n89k41K5R95l93k12j30L26L62
1256a44M6p60L91J30K52L07q80K67M01K64l15m93N22M32n03k21m0O99K16o39j6
1277h4j0M32M17m72m15M63M14J3o04q6O78j25k41j86q9N98om50l24J30O70k12
1299E11n94j03K91P34n10o94L30J22L12n69k45J19L81j93l11l26N05J73J03o25
$$ plain form
1319 -589 -836 -164 -116 -471 -793 -529 209 -114 -554 -346 -231 194 469 -21 -99 245 326 521 -37 249 806
1340 806 437 196 35 222 850 455 300 384 225 800 343 -28 254 721 786 591 23 221 886 918 171
1361 171 74 343 749 728 122 129 357 566 316 89 74 519 502 -208 -417 -351 518 -23 -606 -340 -271 -59 -581
1384 -581 -626 -569 -569 -185 -661 -999 -679 -276 -467 -1023 -1108 -626 -282 -583 -959 -611 -207 -330 -773 -639 -319 -340
1406 -340 127 -527 -573 -408 49 25 -809 -323 217 273 -37 -495 34 591 -20 -46 -43 -21 775 444 39 36 418
1429 418 742 87 166 158 601 674 145 -33 324 750 459 243 284 585 539 368 351 145 324 532 272 175 148
1452 148 533 18 -106 -295 129 284 -19 -188 -16 -94 -137 -242 -595 -411 -131 -323 -472 -815 185 -162
1472 -162 -219 -554 -430 11 238 -289 -354 -225 0 396 -159 -170 108 417 202 -141 112 695 346 243 24
$$ packed form
1319e89k47O72M8l55l22K64P38l23m40K08J15M25K75m90p8L44Q1J95n58K86N57
1340H06l69k41j61J87O28l95j55Q4j59N75m57l71K82M67O5j95n68J98O65L2p47
1361A71r7K69M06k1o06PK28K09k50k27j5M45j7p10k09O6Q69n41n83K66O9K12n22
1384e81m5N7%L84m76l38L20M03j91n56q5M82L44l01l76L48M04j23m43J34L20k1
1406c40M67o54m6J65M57k4q34M86N40N6l10m58N29N57o11k6LK2P96l31m05lL82
1429D18L24o55P9qM43P3n29j78L57M26k91k16M1L01m6j71j7k06J79K08k60r7k7
1452A48L85n15j24j89M24J55l03j69J72p8m3j05l53J84K80j92j49l43J000l47
1472a62n7l35J24M41K27n27o5J29K25L96n55j1K78L09k15l43K53N83l49j03k19
$$ plain form
1493 24 161 729 258 -158 -68 255 814 185 11 306 418 634 383 -37 220 537 534 128 -33 242 460
1514 460 370 -113 109 224 411 36 -165 -155 189 258 -52 -410 -258 119 -199 -336 -256 -344 -314 -322 -671 -586 -143
1537 -143 -371 -600 -790 -575 -28 -246 -841 -833 -519 -204 -625 -675 -676 -454 -350 -544 -484 -484 -157 -1 -461 -496 -267
1560 -267 53 20 -178 -199 460 414 266 73 19 413 389 29 269 228 439 549 -55 -48 224 392 342 -18 279
1583 279 300 517 408 70 530 717 604 181 71 634 871 392 27 190 530 428 61 7 241 326 155
1604 155 -91 -200 117 285 -32 -54 -382 101 105 -245 -264 -134 71 -238 -348 -363 -140 -117 -256 -136 -132 -173 253
1627 253 -196 -346 -121 164 106 -205 -166 -327 -118 -14 -189 -376 52 491 167 -184 108 438 332 71 55
1648 55 -52 564 135 108 -40 293 321 616 -17 -63 486 411 -61 -329 120 422 169 -116 115 253 492 -144
$$ packed form
1493B4J37N68m71m16R0L23N59o29j74K95J12K16k51m20K57L17lm06j61K75K18
1514D60r0m83K22J15J87l75k01J0L44O9l10l58J52L77l18j37Q0q8L0ql49Q5M43
1537a43k28k29j90K15N47k18n95QL14L15m21n0jK22J04j94O0%L27J56m60l5K29
1560b67L20l3j98k1O59m6j48j93n4L94k4l60K40m1K11J10o04PK72J68n0l60K97
1583B79K1K17j09l38M60J87j13m23j10N63K37m79l65J63L40j02l67n4K34Q5j71
1604A55k46j09L17J68l17k2l28M83Ml50j9J30K05l09j10j5K23K3j39J20Mm1M26
1627B53m49j50K25K85n8l11L9j61K09J04j75j87M28M39l24l51K92L30j06k61j6
1648E5j07O16m29k7j48L33K8K95o33m6N49p5m72k68M49L02k53k85K31J38K39o36
$$ plain form
1670 -144 2 230 220 187 133 -263 33 111 40 -460 -291 65 -134 -674 -511 -434 -253 -73 -461 -718 -532 -221
1692 -221 -495 -460 -751 -314 -50 -408 -516 -362 -301 149 -247 -268 -145 -228 98 -713 -391 -329 -70 -222 -342 -216
1714 -216 48 -82 -5 -161 60 378 237 24 -26 201 413 447 17 201 450 704 207 169 367 564 376
1735 376 350 147 380 344 598 490 14 322 544 157 -61 221 304 546 264 80 156 653 25 -183 -322
1756 -322 84 266 56 -277 -591 168 136 -74 -343 -310 35 -16 -250 -240 -6 114 -222 -261 -334 -205 45 -454
1778 -454 -396 -338 -283 -100 -260 -94 -221 78 114 -268 -61 -75 89 -239 106 77 21 5 -25 -261 19 292 104
1801 104 -125 76 -20 497 99 25 345 197 324 114 47 80 148 106 29 -96 84 498 181 -1 -65 55 9
1824 9 -111 -181 -62 298 5 12 -258 -117 -131 -181 -24 -298 -26 -67 -95 -359 -208 -79 -213 -511 -597 -33 -178
$$ packed form
1670a44J46K28j0l3n4l96K96P8p1n00J69L56j99n40J63P7J81J80l88k57J86L11
1692b21k74L5k91M37K64l58j08J54O1M50l96k1J23q3L26q11L22O2K59j52j20J26
1714b16K64j30P7j56K21L18j41k13n0K27K12L4m30J84K49K54m97l8J98J97j88
1735C76k6k03K33l6K54j08m76L08K22l87k18K82Q3K42k82j84P6M97o28k08j39
1756c22M06J82k10l33l14P59l2k10k69L3L45n1k34J0K34J20l36l9p3J29K50m99
1778d54N8N8N5J83j60J66j27K99L6l82K07j4J64l28L45k9n6j6l0k36K80K73j88
1801A04k29K01r6N17l98p4L20j48J27k10o7L3O8m2p7j25J80M14l17j82o4J20m6
1824Ij20p0J19L60k93Pk70J41j4n0J57k74K72m1k8k64J51J29j34k98q6N64j45
$$ plain form
1847 -178 -507 -328 -360 -119 -35 -242 -331 -243 -273 -75 -44 -596 -339 117 -171 -440 -329 11 115 -64 -167 45
1869 45 125 105 91 -110 135 513 247 289 38 292 631 261 323 196 402 336 353 405 543 545 418 543 134 134
1893 134 466 384 267 179 352 640 296 12 26 258 97 76 82 229 353 154 26 -188 -20 -141 -337 -168
1915 -168 -50 82 -173 -279 -469 -11 -13 -133 -450 -268 -75 -24 -229 -212 -266 22 -115 -330 -414 -157 33 -380
1937 -380 -220 -204 -31 84 -82 -438 -189 -29 -351 -96 -263 -129 106 6 144 15 358 231 95 336
1957 336 163 431 318 92 -85 63 210 175 11 262 185 344 109 -64 -98 171 199 -155 75 -11 -96 -172
1979 -172 -44 -239 -110 52 1 -262 -303 120 -47 -108 -192 -347 8 -50 -20 -360 -190 -86 -169 -415 -474 -227 -30
2002 -30 -148 -239 -278 -174 -188 -202 -134 3 142 -91 84 -114 69 215 -8 280 97 148 207 -8 -20 -45 428
$$ packed form
1847a78l29J79l2K41Q4k07q9Q8l0J98L1n52K57M56k88k69J11L40J04j79j03K12
1869D5Q0k0j4k01K45L78k66M2k51K54L39l70O2j27K06o6J7N2J38Kj27J25m09%
1893A34L32q2j17q8J73K88l44k84J4K32j61k1OJ47J24j99j28k14J68j21j96J69
1915a68J18J32k55j06j90M58kj20l17J82J93N1k05J7n4K88j37k15q4K57J90m13
1937c80J60J6J73J15j66l56K49J60l22K55j67J34K35j00J38j29L43j27j36K41
1957C36j73K68j13k26j77J48J47l5j64K51p7J59k35j73l4K69K8l54K30q6q5p6
1979a72J28j95J29J62n1k63m1M23j67o1q4j55L55n8L0l40J70J04q3k46n9K47J97
2002c0j18r1l9J04j4j4O8J37J39k33J75j98J83J46k23K88j83N1N9k15j2k5M73
$$ plain form
2025 428 242 30 68 232 356 275 190 60 240 500 235 126 498 257 419 296 178 380 425 276 216 61
2047 61 439 168 59 86 155 120 209 313 28 -23 22 400 61 -283 -2 169 52 -162 -16 270 -185 -221 -298
2070 -298 -28 -123 -97 -349 -174 -156 -60 -219 -371 -583 -302 -43 -235 -85 -264 -235 -385 97 -179 -293 -220 -100
2092 -100 -315 -246 -120 156 -81 -318 86 -22 -75 82 -39 -213 -2 73 65 157 188 33 133 178 52 162 303
2115 303 -33 -14 416 241 71 -260 284 108 -126 23 -173 2 193 172 -248 -210 -165 163 183 -149 47 -82
2137 -82 -61 -69 -186 -137 165 65 -255 -212 -330 -6 -245 -171 -274 -257 31 139 -168 -87 163 40 -89 -234 91
2160 91 -92 -8 -203 -133 -42 0 100 -159 18 114 116 -4 -52 263 326 243 -128 260 360 128 357 105 303 544
2184 544 304 316 175 224 131 243 254 126 -31 317 142 175 92 162 -89 285 -57 -4 171 83 49 -21 106 198
$$ packed form
2025D28j86k12L8J64J24q1q5j30J80K60k65j09L72k41J62j23j18K02M5j49o0j55
2047F1L78k71j09K7O9l5Q9J04k85n1M5L78l39l44K81J71j17k14J46K86m55l6p7
2070b98K70r5K6k52J75J8R6j59j52k12K81K59j92J50j79K9j50M82k76j14P3J20
2092a00k15O9J26K76k37k37M04j08n3J57j21j74K11P5qR2L1j55J00M5j26J10J41
2115C03l36J9M30j75j70l31N44j76k34J49j96J75J91k1m20L8M5L28K0l32J96j29
2137h2K1qj17M9L02j00l20M3j18L24k39P4j03J7K88J08l07Q1K50j23j29j45L25
2160I1j83Q4j95P0R1M2J00k59J77R6Kj20m8L15O3q3l71L88J00k32K29k52J98K41
2184E44k40J2j41M9r3J12J1j28j57L48j75L3q3P0k51L74l42N3J75q8l4p0J27R2
$$ plain form
2208 198 112 112 -94 20 -1 -147 -19 -155 76 -203 -68 -453 -87 -143 -324 -158 -91 -297 -241 -270 -403 -261 -64
2231 -64 -102 -108 -421 -339 -249 -132 -393 -74 -69 -15 -53 -289 -217 -23 2 -137 -153 -70 20 127 70 -43 121 156 184 49
2257 49 136 146 -12 231 102 -41 207 298 189 -69 298 203 252 -1 -40 330 243 336 130 -139 22 -79 35
2280 35 -209 135 87 54 189 -240 239 143 -71 49 -51 -6 25 -357 -191 -24 -2 -134 -270 -236 -8 -178 32
2303 32 14 -256 18 92 -289 -323 -159 131 20 -183 -68 -214 131 -73 -8 16 168 11 66 -261 -8 286
2325 286 -46 24 28 89 354 273 -95 324 149 222 188 -63 255 366 180 211 194 261 105 285 183 78 -49
2348 -49 239 -78 -4 264 233 118 40 -77 7 230 -62 -262 -83 37 -71 52 -106 -220 -44 92 -284 -411
2370 -411 -63 69 -338 -390 -187 -240 -182 -414 -311 -204 61 -139 -207 -67 -182 -278 -155 -252 -352 12 -250 -25
$$ packed form
2208A98q6%k06J14k1j46J28j36K31k79J35l85L66n6j81J66O7k06N6k9j33J42J97
2231f4l8ol13Q2R0J17k61L19NN4l8k36P2J94K5j39j6Q3R0J07n7j13J64L5K8j35
2257D9Q7J0j58K43j29j43K48R1j09k58L67r5M9k53l9L70q7R3k06k69J61j01J14
2280C5k44L44m8l3J35m29M79r6k14J20j00M5L1l82J66J67K2j32j36L4K28j70K10
2303C2j8k70K74P4l81l4J64K90j11k03J15j46L45k04O5K4J52j57N5l27K53K94
2325B86l32P0MO1K65q1l68M19j75P3l4k51L18J11j86L1j7O7j56J80j02j05j27
2348d9K88l17P4K68l1j15p8j17Q4K23k92k00J79J20j08J23j58j14J76J36l76j27
2370d11L48J32m07n2K03n3N8k32J03J07K65k00o8J40j15r6J23r7j00L64k62K25
$$ plain form
2392 -25 -244 23 37 -341 -71 -6 139 -43 53 80 -39 119 237 106 -79 -56 329 159 -55 -143 163 107 201
2415 201 -141 -153 105 353 109 -34 277 148 299 70 -104 155 328 329 40 -54 -93 176 90 -173 -182 49 -55
2438 -55 91 12 -51 -18 67 55 -29 -151 -46 -19 -155 -195 146 161 -130 -289 8 -320 74 -270 -91 -143 -81 296
2462 296 -63 5 -200 -28 0 111 -40 220 87 58 -79 -144 233 311 64 -106 129 309 162 -158 211 35
2484 35 188 175 -96 -17 321 453 360 -143 -2 -177 -141 -101 -104 354 111 54 -119 -290 291 111 -123 -154 43
2507 43 107 -165 -14 -131 73 15 -38 -220 -44 -113 -181 -205 -375 -336 -290 -94 -202 -374 -180 22 -289 -342 -146
2530 -146 -78 -402 -159 -107 -286 30 14 -236 -119 -95 -130 -162 -165 -143 -76 -152 29 1 -137 11 46 47 -32 108 91 -47
2556 -47 81 281 123 174 177 -6 51 224 -150 97 151 17 301 -51 46 39 158 86 125 128 33 407 88 162 24
$$ packed form
2392b5k19K67J4l78K70O5J45j82R6K7j19J58J18j31j85K3L85j70k14q8L06n6R4
2415B01l42j2K58K48k44j43L11j29J51k29j74K59J73Jk89r4l9K69q6k63rK31j04
2438e5J46p9o3L3Q5j2q4j22J05K7j36m0L41J5k91j59K97l28L94l44J79n2O2L77
2462B96l59O8k05J72K8J11j51K60j33k9j37o5L77P8k47j70K35J80j47l20L69j76
2484C5J53j3k71P9L38J32r3n03J41j75L6M0lM58k43n7j73j71N81j80k34l1J97
2507D3O4k72J51j17K04n8n3j82J76o9o8k4j70L9M6J96j08j72J94K02l11n3J96
2530a46O8l24K43N2j79L16j6k50J17K4l5l2lK2O7p6J81k8j38J48L5Jp9J40j7j38
2556d7J28K00j58N1Lj83N7J73l74K47N4j34K84l52R7pJ19p2L9Lr5L74l19P4j38
$$ plain form
2581 24 276 312 190 75 1 199 -98 -60 1 38 27 95 -180 -130 -159 -140 51 -200 -55 -158 133 -94 -214 -310
2605 -310 49 -330 -23 -144 -47 158 -12 -22 -207 -266 131 -96 -105 -172 34 312 -348 -71 -193 49 141 -25
2627 -25 -131 111 278 96 -160 269 69 98 79 -65 -25 250 209 -56 70 29 127 7 -142 -24 7 280 75
2650 75 -44 118 278 -98 -175 -175 174 108 -76 15 -18 -178 -112 -117 -34 203 104 37 -2 -292 -292 -77 -112 -358 -372 -227
2676 -227 66 -152 -47 -272 -10 -229 -179 -310 -53 -180 44 60 -134 -15 145 -205 -353 -122 41 -5 -119
2697 -119 -182 148 20 162 173 -294 66 339 71 46 -61 248 118 35 102 189 111 -67 -103 279 219 286 93
2720 93 207 309 40 172 61 73 177 325 290 37 235 118 275 108 2 31 168 142 28 -160 -113 -164
2742 -164 -112 -84 -9 -87 -12 -104 -221 34 207 -70 -5 -124 -118 -18 -66 106 -276 -58 -410 -131 -478 -60 -95 -248
$$ packed form
2581B4K52L6j22j15p4J98k97L8O1L7j1O8k75N0k9J9J91k51J45j03K91k27j20r6
2605c10L59l79L07j21R7K05j70j0j85n9L97k27ro7K06K78o60K77j22K42R2j66
2627b5j06K42J67j82k56M29k00K9j9j44M0K75m1k65J26m1R8j20j49J18L1K73k05
2650G5j19J62J60l76p7%L49o6j84R1l3j60O6nQ3K37r9o7l9k90%K15l5k46j4J45
2676b27K93k18J05k25K62k19N0j31K57j27K24J6j94J19J60l50j48K31J63m6j14
2697a19o3L30j28J42J1m67L60K73k68k5j07L09j30q3O7Q7p8j78l6L82o0O7j93
2720I3J14J02k69J32j11J2J04J48l5k53J98j17J57j67j06K9J37k6j14j88M7n1
2742a64N2K8P5p8P5r2j17K55J73k77O5j19OJ00m8J72l82K18l52K79l47M18l5j53
$$ plain form
2766 -248 -88 -113 -213 -90 -45 153 -142 65 336 79 -69 -164 -77 -22 180 -172 94 50 224 -103 144 -57
2788 -57 75 33 -60 79 43 173 33 77 -3 124 -86 -22 -196 157 311 -19 -340 -24 -335 -98 8 93 -204
2811 -204 6 38 -75 -31 -105 -119 66 10 -121 31 -181 157 -148 -166 -17 41 103 -240 -88 -134 104 116 -12
2834 -12 -84 34 67 -255 -239 -32 72 31 -160 -21 207 303 232 -141 -96 39 -72 57 50 91 129 124 41 7 38 303
2860 303 282 -183 204 141 309 29 -167 252 356 219 -171 176 131 127 101 230 0 154 248 95 114 76 5
2883 5 -40 68 377 -94 217 -149 -104 -78 87 -145 -183 101 -40 39 104 -165 -209 140 36 57 -69 -75 -291 17
2907 17 -230 -420 -214 -341 -87 -148 -270 -196 -177 -86 -9 -268 -26 -127 -157 -34 28 114 145 134 -174 -106 14 -202
2931 -202 -294 130 0 24 296 36 -172 193 -74 100 71 -89 -122 198 11 -40 398 -48 159 39 -58 200
$$ packed form
2766b48J60k5j00J23M5J98k95K07K71k57j48r5Q7N5K02l52K66m4J74l27K47k01
2788e7J32m2r3J39l6J30j40M4q0J27k10O4j74L53J54l30l21L16l11K37J06Q5k97
2811b04K10L2j13M4p4j4J85n6j31J52k12L38l05j8J49N8O2l43J52m6K38J2j28
2834a2p2J18L3l22J6K07J04m1j91J39K28R6p1l73M5J35j11J29pM1L8nq3l4L1K65
2860C03k1m65L87o3J68k80j96M19J04j37l90L47m5mk6J29k30J54R4j53J9l8p1
2883Em5J08L09m71L11l66M5K6J65k32l8K84j41P9O5k69m4L49j04K1j26ok16L08
2907A7k47j90K06j27K54o1j22P4J9R1P7k59K42j01l0J23O2Q6L1j1l08O8J20k16
2931b02r2M24j30K4K72k60k08L65k67J74k9j60l3L20j87n1M38m46K07j20r7K58
$$ plain form
2953 200 126 61 -242 240 46 -107 -106 -121 -63 -132 41 54 197 102 -85 -204 -156 50 131 -90 -157 -149 55 -5 -186
2978 -186 5 -104 17 91 -51 -304 -65 127 -122 -169 -216 -129 326 -32 25 111 18 229 -184 -137 5 77 14
3001 14 10 -235 -141 11 214 45 -73 222 137 235 -14 211 96 218 272 205 349 -20 309 -6 170 8 117
3024 117 -39 43 189 44 145 71 236 -40 229 77 165 -212 -17 79 -10 76 57 221 -88 -17 -141 41 -4
3047 -4 129 -191 -29 -96 -148 -183 105 111 -46 -159 52 -186 116 182 -272 -27 -361 -48 -61 -167 -108 -91 -38 132
3071 132 40 -193 -151 -29 -135 307 -86 -384 216 236 -192 110 -49 12 85 -33 19 105 -21 19 160 108 112 73
3095 73 152 110 203 -64 149 -43 199 297 149 95 320 180 93 -17 108 81 52 12 127 161 -146 -244 -72 219
3119 219 -261 -16 -145 -132 -121 -68 -296 -34 187 -97 56 -169 -70 43 -100 -58 182 -59 -53 -259 -206 10 -23
$$ packed form
2953B00p4o5l03M82j94j53Jj5N8o9J73J3J43r5j87j19M8K06Q1k21o7QK04o0j81
2978a86J91j09J21P4j42k53K39J92k49m7m7Q7M55l58N7Q6r3K11m13M7J42P2o3
3001A4mk45R4J52K03j69j18K95q5R8k49K25j15J22N4o7J44l69L29l15J76j62J09
3024A17j56Q2J46j45J01p4J65k76K69j52Q8l77J95R6q9Q6j9J64l09P1j24J82m5
3047dJ33l20J62o7n2l5K88Oj57j13K11k38L02O6m54K45l34L13j3j06N9J7N3J70
3071A32r2k33M2J22j06M42l93k98O00K0m28L02j59O1P3j18N2Q6j26M0J41n2Ml9
3095G3P9m2R3k67K13j92K42R8j48n4K25j40q7j10J25k7k9m0J15L4l07r8J72K91
3119B19m80K45j29J3J1N3k28K62K21k84J53k25R9J13j43M2K40k41Ok06N3K16l3
$$ plain form
3142 -23 23 13 55 105 -35 18 -108 122 60 4 -92 -80 -14 113 -27 1 331 428 198 49 -49 213 121 11 -26
3167 -26 203 -67 26 64 98 148 -31 -43 -21 15 -112 102 108 36 77 108 -56 137 -140 52 140 195 -179 -175 -86 12
3193 12 -106 -71 120 137 86 -117 35 -261 -127 34 -133 6 -8 -75 -254 -150 -36 -215 -56 -136 -129 -128 -255 -42
3217 -42 -485 -158 147 68 -135 -1 -209 290 -84 -74 80 -49 -121 93 124 260 100 -139 140 41 25 135
3239 135 183 42 -125 -78 298 174 -78 -216 157 -244 -78 54 -119 130 172 -248 170 -20 -72 143 -56
3260 -56 -44 247 -138 -177 64 -185 -209 100 93 -95 -21 134 -89 -41 38 -45 -37 158 -173 -92 -5 -282 -80 110 75
3285 75 153 52 -32 -381 -189 192 -73 66 -286 82 111 15 -163 -119 -56 112 -107 -41 -35 8 104 0 243 118
3309 118 -189 -32 269 220 193 188 54 65 102 16 168 36 -140 47 225 94 62 44 -7 100 35 118 -34 142
$$ packed form
3142b3M6j0M2N0j40N3j26K30o2n6r6J2O6J27j40K8L30R7k30j49r8K62r2j10l7
3167b6K29k70R3L8L4N0j79j2K2L6j27K14Op2M1L1j64J93k77J92Q8N5l74MQ9R8
3193A2j18L5J91J7n1k03J52k96J34J61j67J39j4o7j79J04J14j79J59q0PJj27K13
3217d2m43L27L05p9k03J34k08M99l74J0J54j29p2K14L1J36j60k39K79r9j6J10
3239A35M8j41j67M7L76j24k52j38L73m01J66J32j73K49M2m20M18j90n2K15j99
3260e6J2K91l85l9K41k49k4L09pj88P4J55k23M8P9q3QJ95l31Q1Q7k77K02J90l5
3285G5P8j01q4l49J92L81k65J39l52L68K9r6j78M4O3J68k19O6OM3R6j04K43j25
3309A18l07J57L01m9k7nj34J1L7q6J52j32j76J87J78j31l2j8n1J07o5Q3j52J76
$$ plain form
3333 142 86 -308 -249 -8 264 -190 -24 -35 -138 -304 -62 -165 -159 -44 -30 -111 -15 -11 75 185 114 -127 -5 -55
3357 -55 -97 -19 -105 -33 116 -358 -171 78 -39 -15 -189 -84 -144 60 38 -195 1 -40 -149 36 4 2 -57 147
3381 147 -113 37 -31 123 100 142 62 30 -20 -55 -179 142 214 -54 228 57 24 220 252 70 -13 97 220 15
3405 15 150 297 88 228 50 -85 240 263 20 0 121 155 291 -205 -45 -125 -102 101 28 -149 48 266
3427 266 -32 -102 261 -166 3 70 -58 154 160 -278 -42 -45 93 9 -15 -109 -162 80 57 -89 -102 19 330 141
3451 141 -186 113 -201 106 55 101 81 -1 133 -20 32 205 62 1 -45 -46 210 -182 18 143 -109 37 128
3474 128 60 -57 41 -62 -116 218 58 -215 -20 -30 213 -67 -76 30 -209 256 -165 10 -134 -83 -93 43 -244
3497 -244 69 -252 4 100 85 255 -121 145 26 9 50 -31 -69 -102 -238 -180 -17 -205 -1 27 233 -30 -50
$$ packed form
3333A42n6l94N9K41K72m54J66j1j03j66K42j03OJ15J4q1R6MQ6J10p1k41J22n0
3357e5m2P8q6P2J49m74J87K49j17K4j74J05o0K04k2k33J96m1j09J85l2kn9K04
3381A47k60J50o8J54k3M2q0l2n0l5j24L21P2k68K82j71l3J96L2j82q3J10J23k05
3405A5J35J47k09J40j78j35L25K3k43k0J21L4J36m96J60q0K3K03p3j77J97K18
3427B66k98p0L63m27J69O7j28K12Om38K36lJ38q4k4r4n3K42k3j46j3J21L11j89
3451A41l27K99l14L07n1M6k0q2J34j53N2J73j43o1m6jK56l92K00J25k52J46R1
3474A28o8j17R8j03n4L34j60k73J95j0K43k80rJ06k39M65m21J75j44N1j0J36k87
3497b44L13l21K56R6j5J70l76K66j19j7M1q1l8l3j36N8J63j88K04K8K06k63k0
$$ plain form
3520 -50 220 -120 33 149 -42 52 31 138 58 39 52 119 15 -34 196 -160 266 264 301 -263 31 -89 -83 324
3544 324 282 205 62 233 33 -125 424 182 107 65 35 -10 21 102 86 159 -37 -31 -126 50 52 -19 391 -18 76 165
3570 165 -150 -65 208 -103 218 -159 -11 28 206 49 -44 -102 -334 -135 -253 -160 37 168 42 -174 -161 92
3592 92 -45 -230 -157 -23 6 -23 95 71 144 -65 -61 -272 48 -111 -147 -187 -31 -65 -124 16 117 96 109 -94 -21
3617 -21 -123 -133 -203 -27 55 66 92 136 21 -176 -85 -346 208 -216 -83 -11 87 204 -34 -104 -44 84 -59 194
3641 194 -122 -142 -111 89 -74 -144 193 -68 0 138 181 53 -60 -66 -99 -28 -33 -123 -131 42 -83 -81 -61 32 -54 -186
3667 -186 -211 -277 -33 49 42 -40 -144 -173 73 99 -226 -3 122 113 -97 -106 -115 -52 114 124 -34 226 233 152 -120 -154 61
3694 61 -88 153 -210 318 89 -267 -94 251 88 -1 -97 131 272 143 284 -48 135 84 -37 153 16
$$ packed form
3520e0K70l40J53J16j91R4k1J07q0j9J3O7j04m9K30l56M26kL7n64K94j20OM07
3544C24m2p7j43J71k00j58N49k42p5m2l0m5L1Q1j6P3j96Or5J76Kp1M10m09R4Q9
3570A65l15Q5K73l11L21l77J48L9J78j57r3n8k32J99j18R3J97J31j26k16J3K53
3592I2j37j85P3J34K9k9J18k4P3k09Mk11L20j59l6m0J56l4n9J40J01k1J3k03P3
3617b1j02j0p0J76Q2J1K6M4j15j97R1k61N54m24J33P2R8J17k38p0O0J28j43K53
3641A94l16k0L1K00j63p0L37k61O8J38M3j28j13ol3P1nr0qJ73j25KK0R3q6j32
3667a86k5o6K44Q2pq2j04k9K46K6l25K23J25rk10rrO3J66J0j58K60Pq1k72l4K15
3694F1j49K41l63N28k29l56J73L45j63q9r6K28J41j29J41l32J83n1j21J90j37
$$ plain form
3715 16 256 -4 182 118 -45 29 187 -189 -46 -90 9 33 23 -18 -184 -181 -257 -14 -112 -80 -146 -140 -78 200 36 -260
3741 -260 -115 -133 -86 -92 -255 51 -33 -245 -143 25 19 -126 81 147 -68 110 250 -35 127 -69 -176 -373 -108
3764 -108 5 -66 -246 297 122 24 45 168 -102 154 239 58 281 202 103 161 -169 -29 89 110 -42 23 -138
3787 -138 -77 -54 -179 -21 186 -182 29 -18 -49 -20 -193 -181 -119 -19 -142 63 55 134 61 -205 -87 -212 -38 -103
3811 -103 -175 25 -66 -33 -145 -115 -126 -190 9 -57 126 -151 29 -36 -99 325 -88 14 92 77 112 -90 -179 278
3835 278 -48 131 91 -89 -15 66 162 38 297 -45 172 75 -159 -44 226 184 76 12 164 -68 145 189 226
3858 226 42 157 -30 172 -196 261 46 -49 207 -2 -143 140 -239 196 42 -181 103 152 248 -206 -153
3879 -153 69 -51 -55 -282 -233 -77 -107 -1 48 -56 -113 -70 -64 267 -15 -59 -81 -103 22 -83 -107 19 -33 29 152
$$ packed form
3715A6K40k60J86o4j63P4J58l76J43m4R9K4j0m1j66Lp6K43r8L2o6OO2K78j64k96
3741b60J45j8M7oj63L06q4k12J02J68oj45K07O6k15J78J40k85J62j96j07j97K65
3764a08J13p1j80N43j75r8K1J23k70K56Q5j81K23p9r9N8l30J40J18K1j52O5j61
3787a38O1K3j25J58K07l68K11m7l1K9j73J2O2J00j23K05qP9p3k66J18j25J74o5
3811a03p2K00r1L3j12L0j1o4J99o6J83k77J80o5o3M24m13J02P8j5L5k02q9M57
3835B78l26J79m0j80P4Q1R6j24K59l42K17r7k34J15K70m2j08o4J52k32K13M4L7
3858B26j84J15j87K02l68M57k15r5K56k09j41K83l79M35j54k23K84M9R6m54N3
3879a53K22j20mk27M9J56l0J06M9j04n7M3OL31k82m4k2k2J25j05k4J26n2O2J23
$$ plain form
3904 152 0 154 15 31 -78 -113 124 -51 13 144 54 -73 81 -10 -29 -169 -160 -45 -189 141 105 -78 120
3927 120 168 79 1 -28 171 122 -23 -54 -49 -176 -22 218 -175 122 136 148 -113 78 93 -36 -144 -237 -34 93
3951 93 144 -71 235 379 255 140 251 89 42 43 -93 -264 -80 -132 97 -179 -159 11 -37 -61 101 -192 -165
3974 -165 -230 -48 69 69 -32 -170 168 -172 -93 -172 195 135 27 84 -99 38 353 -82 -127 -60 -63 50 -13 208
3998 208 179 192 -74 379 -156 -97 95 -65 -69 63 -35 79 190 20 -20 116 -126 46 251 85 87 233 -36
4021 -36 -35 221 -214 -104 -11 -70 56 -186 -105 -59 -71 48 -118 -59 229 -17 -57 -70 104 126 -206 -30 -391 71
4045 71 55 -7 -18 94 68 -28 -190 81 67 19 27 60 -234 -27 -7 49 79 -96 -133 -90 -72 -203 -187 -277 134 47 -41
4072 -41 130 -41 251 21 -118 -261 104 -131 16 1 115 238 -65 -7 -64 -19 -96 49 45 58 -32 17 38 124
$$ packed form
3904A52j52J54j39J6j09l5K37j75O4J31r0j27J54r1j9j40RJ15j44L30l6j83J98
3927A20M8q9p8k9J99m9j45l1Nj27J54K40l93K97J4J2k61J91J5j29j08r3K03J27
3951I3N1k15L06J44j24j15J11j62m7Jj36j71J84n2K29k76K0J70m8k4J62k93K7
3974a65o5J82J17%j01j38L38l40P9p9L67o0j08N7j83J37L15m35m5O7lJ13o3K21
3998B08k9J3k66M53n35N9J92j60mJ32r8J14J11j70m0J36k42J72K05j66KJ46k69
4021c6JK56m35J10R3n9J26k42Q1M6j2J19j66N9K88k46m0j3J74K2l32J76l61M62
4045G1j6o2j1J12k6r6j62K71j4m8QL3k94K07K0N6L0j75l7M3J8j31J6r0M11q7q8
4072d1J71j71K92k30j39j43L65k35J47j5J14J23l03N8n7M5p7J45mJ3r0M9K1Q6
$$ [...]
8191F7
##END NTUPLES=NMR FID
##END=
