##TITLE=1H_INula-aceton-old
 200.13MHz, D2O,
 8 sc
 
 23.1.2025
##JCAMPDX= 6.0         $$ Bruker NMR JCAMP-DX V2.0
##DATA TYPE= NMR FID
##DATA CLASS= NTUPLES
##ORIGIN= UXNMR, Bruker Analytische Messtechnik GmbH
##OWNER= pz
$$ XWIN-NMR		Version 3.5
$$ Thu Jan 23 13:57:04 2025 Russian Standard Time (UT+4h)  she@DPX200
##.OBSERVE FREQUENCY= 200.1313
##.OBSERVE NUCLEUS= ^1H
##.DELAY= (6, 6)
##.ACQUISITION MODE= SIMULTANEOUS
##.ACQUISITION SCHEME= undefined
##.AVERAGES= 8
##.DIGITISER RES= 18
##SPECTROMETER/DATA SYSTEM= spect
##.PULSE SEQUENCE= zg30
##.SOLVENT NAME= D2O
##.SHIFT REFERENCE= (INTERNAL, D2O, 0, 14.3821)
##AUDIT TRAIL= $$ (NUMBER, WHEN, WHO, WHERE, WHAT)
$$ ##TITLE= Audit trail, XWIN-NMR		Version 3.5
$$ ##JCAMPDX= 5.01
$$ ##ORIGIN= Bruker BioSpin GmbH
$$ ##OWNER= she
$$ F:/spectra/data/she/nmr/H-C/1/audita.txt
$$ ##AUDIT TRAIL=  $$ (NUMBER, WHEN, WHO, WHERE, WHAT)
(   1,<2025-01-23 13:55:46.40 +0400>,<she>,<DPX200>,
      <created by zg, POWCHK disabled, PULCHK disabled
       configuration hash MD5:
       00 E9 B6 7A A2 85 ED C7 34 08 36 98 17 FE 4E 26
       data hash MD5: 16K
       CC B6 A4 06 71 A2 B0 6D 0A AC FA C4 EB 7A 56 99>)
$$ ##END=
$$ 
$$ hash MD5
$$ 29 38 A7 B0 3E AD 95 D1 E1 B2 E6 CF 53 75 3C 6F
##$RELAX= 
##$RELAX= 
##$RELAX= 
##$RELAX= 
##$RELAX= 
##$RELAX= 
$$ Bruker specific parameters
$$ --------------------------
##$DU= <F:/spectra>
##$EXPNO= 1
##$NAME= <H-C>
##$PROCNO= 1
##$TYPE= <nmr>
##$USER= <she>
##$AMP= (0..31)
100 100 100 100 100 100 100 100 100 100 100 100 100 100 100 100 100 100 
100 100 100 100 100 100 100 100 100 100 100 100 100 100 
##$AQSEQ= 0
##$AQ_mod= 1
##$AUNM= <au_zg>
##$AUTOPOS= <>
##$BF1= 200.13
##$BF2= 200.13
##$BF3= 200.13
##$BF4= 200.13
##$BF5= 200.13
##$BF6= 200.13
##$BF7= 200.13
##$BF8= 200.13
##$BYTORDA= 1
##$CFDGTYP= 0
##$CFRGTYP= 5
##$CHEMSTR= <none>
##$CNST= (0..31)
1 1 145 1 1 1 1 1 1 1 1 1 1 1 1 1 1 1 1 1 1 1 1 1 1 1 1 1 1 1 1 1 
##$CPDPRG= <>
##$CPDPRG1= <>
##$CPDPRG2= <>
##$CPDPRG3= <>
##$CPDPRG4= <mlev>
##$CPDPRG5= <mlev>
##$CPDPRG6= <mlev>
##$CPDPRG7= <mlev>
##$CPDPRG8= <mlev>
##$CPDPRGB= <>
##$CPDPRGT= <>
##$D= (0..31)
0 0.7 0 0 0 0 0 0 0 0 0 0.03 0 0 0 0 0 0 0 0 0 0 0 0 0 0 0 0 0 0 0 0 
##$DATE= 1737626145
##$DBL= (0..7)
120 120 120 120 120 120 120 120 
##$DBP= (0..7)
150 150 150 150 150 150 150 150 
##$DBP07= 0
##$DBPNAM0= <>
##$DBPNAM1= <>
##$DBPNAM2= <>
##$DBPNAM3= <>
##$DBPNAM4= <>
##$DBPNAM5= <>
##$DBPNAM6= <>
##$DBPNAM7= <>
##$DBPOAL= (0..7)
0.5 0.5 0.5 0.5 0.5 0.5 0.5 0.5 
##$DBPOFFS= (0..7)
0 0 0 0 0 0 0 0 
##$DE= 6
##$DECBNUC= <off>
##$DECIM= 32
##$DECNUC= <off>
##$DECSTAT= 4
##$DIGMOD= 1
##$DIGTYP= 9
##$DL= (0..7)
0 120 120 120 120 120 120 120 
##$DP= (0..7)
150 150 150 150 150 150 150 150 
##$DP07= 0
##$DPNAME0= <>
##$DPNAME1= <>
##$DPNAME2= <>
##$DPNAME3= <>
##$DPNAME4= <>
##$DPNAME5= <>
##$DPNAME6= <>
##$DPNAME7= <>
##$DPOAL= (0..7)
0.5 0.5 0.5 0.5 0.5 0.5 0.5 0.5 
##$DPOFFS= (0..7)
0 0 0 0 0 0 0 0 
##$DQDMODE= 0
##$DR= 18
##$DS= 0
##$DSLIST= <SSSSSSSSSSSSSSS>
$$ [...]
##$SUBNAM0= <"">
##$SUBNAM1= <"">
##$SUBNAM2= <"">
##$SUBNAM3= <"">
##$SUBNAM4= <"">
##$SUBNAM5= <"">
##$SUBNAM6= <"">
##$SUBNAM7= <"">
##$SUBNAM8= <"">
##$SUBNAM9= <"">
##$SW= 18.0517328524113
##$SWIBOX= (0..15)
0 0 2 0 0 0 0 0 0 0 0 0 0 0 0 0 
##$SW_h= 3612.71676300578
##$TD= 16384
##$TD0= 1
##$TE= 0
##$TE2= 300
##$TE3= 300
##$TEG= 300
##$TL= (0..7)
0 120 120 120 120 120 120 120 
##$TP= (0..7)
150 150 150 150 150 150 150 150 
##$TP07= 0
##$TPNAME0= <>
##$TPNAME1= <>
##$TPNAME2= <>
##$TPNAME3= <>
##$TPNAME4= <>
##$TPNAME5= <>
##$TPNAME6= <>
##$TPNAME7= <>
##$TPOAL= (0..7)
0.5 0.5 0.5 0.5 0.5 0.5 0.5 0.5 
##$TPOFFS= (0..7)
0 0 0 0 0 0 0 0 
##$TUNHIN= 0
##$TUNHOUT= 0
##$TUNXOUT= 0
##$USERA1= <user>
##$USERA2= <user>
##$USERA3= <user>
##$USERA4= <user>
##$USERA5= <user>
##$V9= 5
##$VALIST= <valist>
##$VCLIST= <CCCCCCCCCCCCCCC>
##$VD= 0
##$VDLIST= <DDDDDDDDDDDDDDD>
##$VPLIST= <PPPPPPPPPPPPPPP>
##$VTLIST= <TTTTTTTTTTTTTTT>
##$WBST= 1024
##$WBSW= 4
##$XGAIN= (0..3)
0 0 0 0 
##$XL= 0
##$YL= 0
##$YMAX_a= 368352
##$YMIN_a= -497955
##$ZGOPTNS= <>
##$ZL1= 120
##$ZL2= 120
##$ZL3= 120
##$ZL4= 120
##$ABSF1= 10
##$ABSF2= 0
##$ABSG= 5
##$ABSL= 3
##$ALPHA= 0
##$AQORDER= 0
##$ASSFAC= 0
##$ASSFACI= 0
##$ASSFACX= 0
##$ASSWID= 0
##$AUNMP= <proc_1d>
##$AZFE= 0.1
##$AZFW= 0.1
##$BCFW= 1
##$BC_mod= 2
##$BYTORDP= 1
##$COROFFS= 0
##$CY= -3
##$DATMOD= 1
##$DC= 2
##$DFILT= <>
##$DTYPP= 0
##$F1P= 0
##$F2P= 0
##$FCOR= 0.5
##$FTSIZE= 0
##$FT_mod= 4
##$GAMMA= 1
##$GB= 0.15
##$INTBC= 1
##$INTSCL= 1
##$ISEN= 128
##$LB= 0.25
##$LEV0= 0
##$LPBIN= 0
##$MAXI= 10000
##$MC2= 0
##$MEAN= 0
##$ME_mod= 0
##$MI= 1.114404
##$NCOEF= 0
##$NC_proc= 0
##$NLEV= 6
##$NOISF1= 3.799351
##$NOISF2= 2.8
##$NSP= 1
##$NTH_PI= 0
##$NZP= 0
##$OFFSET= 14.38212
##$PC= 1
##$PHC0= 247.9634
##$PHC1= 15.9922
##$PH_mod= 1
##$PKNL= yes
##$PPARMOD= 0
##$PSCAL= 0
##$PSIGN= 0
##$REVERSE= no
##$SF= 200.129724274929
##$SI= 16384
##$SIGF1= 3
##$SIGF2= 2
##$SINO= 400
##$SIOLD= 16384
##$SREGLST= <1H.CDCl3>
##$SSB= 0
##$STSI= 0
##$STSR= 0
##$SW_p= 3205.1282051282
##$SYMM= 0
##$S_DEV= 0
##$TDeff= 0
##$TDoff= 0
##$TI= <>
##$TILT= no
##$TM1= 0
##$TM2= 0
##$TOPLEV= 0
##$USERP1= <user>
##$USERP2= <user>
##$USERP3= <user>
##$USERP4= <user>
##$USERP5= <user>
##$WDW= 1
##$XDIM= 8192
##$YMAX_p= 0
##$YMIN_p= 0
$$ End of Bruker specific parameters
$$ ---------------------------------
##NTUPLES= NMR FID
##VAR_NAME=  TIME,          FID/REAL,        FID/IMAG
##SYMBOL=    X,             R,               I
##VAR_TYPE=  INDEPENDENT,   DEPENDENT,       DEPENDENT
##VAR_FORM=  AFFN,          ASDF,            ASDF
##VAR_DIM=   8192,          8192,            8192
##UNITS=     SECONDS,       ARBITRARY UNITS, ARBITRARY UNITS
##FACTOR=    0.0002768,     1,               1
##FIRST=     0,             0,               0
##LAST=      2.2672688,     0,               0
##MIN=       0,             -497955,         0
##MAX=       2.2672688,     368352,          0
$$ Real data points
##PAGE= N=1
##DATA TABLE= (X++(R..R)), XYDATA
$$ [...]
2262e10J394k59n28M50J062j37r15l00N13l0j466k70P47J07p97p34P64R90n17
$$ -510 884 625 97 547 1609 1472 557 257 770 740 -726 -996 -249 -142 -939 -1673 -909 81 -436
2281d36o78R46J498l65j244M31J590l73j196m85O60L00j732n84J128L94q30o21
$$ -436 -1114 -168 1330 965 -279 152 1742 1369 173 -312 348 648 -1084 -1668 -540 -146 -976 -1597
2299a597J004J199o40q67J222J235m12j029L95R49j98j605k37R43o0j705k01J420
$$ -1597 -593 606 -34 -901 321 1556 1144 115 510 1459 1261 -344 -581 362 302 -1403 -1604 -184
2317a84J59j075m98J846P64r13n41R98Q79l25j380O35J098n29j760o9J089j84
$$ -184 -25 -1100 -1598 248 1012 99 -442 556 1435 1110 -270 365 1463 934 -826 -895 194 10
2335A0j295m43J187O99r06m30J493R74q53p69J226Q75p99j087N21Q78r01j450
$$ 10 -1285 -1728 -541 158 -748 -1178 315 1289 436 -333 893 1768 969 -118 403 1281 380 -1070
2353a070j41J024j1j059k60R77M82p45p1J379J042o91p94Q41J072r44p85k70P75
$$ -1070 -1211 -187 -198 -1257 -1517 -540 -58 -803 -874 505 1547 856 62 903 1975 1031 246 -24 751
2372G51n93j423J84M99R0j364L51Q39J030j178L80J512M20o34q77J126R51j044
$$ 751 158 -1265 -1081 -582 -492 -1856 -1505 -666 364 -814 -434 1078 1498 864 -13 1113 2064 1020
2390A020j194o4P41o14j060l15P16J54q51J79J000O85l50j2Q05P39m60m54N50
$$ 1020 -174 -238 503 -111 -1171 -1486 -770 -616 -1467 -1288 -288 397 47 35 840 1579 1119 665 1215
2409A215r9m30q99k61M71l57j242K96L91J30l34j59J074N02J47k02N06O47n38
$$ 1215 1116 686 -213 -474 -3 -360 -1602 -1306 -915 -785 -1119 -1278 -204 298 445 243 749 1396 858
2428H58j42R4L13k19q74n75M05m66p03K3M02L59j59k87Q93M95J03k00L21J006
$$ 858 716 810 1123 904 30 -545 -140 -606 -1309 -1286 -884 -525 -684 -971 -78 417 520 320 641 1647
2448A647l54q93l5M45k37q50o21N86m4p22l20M83P01l43o5N54J177k98m19QQ52
$$ 1647 1293 400 365 810 573 -277 -898 -312 -356 -1078 -1398 -915 -214 -557 -622 -68 1109 811 392 400 1252
2469A252K9j158j19N89Rj186n60K19N25l88q62J109P70m33l74O01J282j50j016
$$ 1252 1281 123 4 593 602 -584 -1144 -925 -400 -788 -1650 -541 229 -204 -578 23 1305 1155 139
2488A39n8P35J62j071m88R20j91p25p01N12O43o12m52O21J318l40q69Q28J122
$$ 139 81 816 978 -93 -581 339 148 -577 -1278 -766 -123 -735 -1187 -566 752 412 -457 371 1493
2507A493m32j207L30J031o48q95l91P07Q7j088n69Q14P85o65q68J193J016j42
$$ 1493 1061 -146 184 1215 567 -328 -719 -12 75 -1013 -1582 -768 17 -648 -1516 -323 693 551
2525E51o11O30J231p52q64l42J408o42j258n22J165j26j061m26J343N75p10n12
$$ 551 -60 570 1801 1049 185 -157 1251 609 -649 -1171 -6 -132 -1193 -1619 -276 299 -411 -923
2543i23J016J233o27n85N69R15l29j499L74O53n17j378m30J439l93q51p6J250
$$ -923 93 1326 699 114 683 1598 1269 -230 144 797 280 -1098 -1528 -89 -482 -1333 -1409 -159
2561a59O44o65n10J395N70n65p32P95R48p43q20k74P48p63j218K0N37K81p49m
$$ -159 485 -180 -690 705 1275 710 -22 773 1721 978 158 -116 632 -131 -1349 -1329 -792 -511 -1260 -1264
2581a264J103O85l24m83J159P41n61o94L86O86n24q79j50N09p95j015K76L21K62
$$ -1264 -161 524 200 -283 876 1617 1056 362 748 1434 910 31 -119 390 -405 -1420 -1144 -823 -561
2600e61o62o2J433O35q07k15J153K49j8p38L61O12q44p82k67L79pj251k89J196
$$ -561 -1223 -1285 148 783 -24 -239 914 1163 1145 407 768 1380 536 -246 -513 -134 -141 -1392 -1681 -485
2620d85J9o97K04J120N77l79M6K11Q63j47n72r8K01m35j020m4L77l06n65L4k3
$$ -485 -466 -1163 -959 161 738 359 405 616 1479 1332 760 662 863 428 -592 -636 -259 -565 -1130 -1096 -1119
2641a119J094k64m54Q04O49N5k91nP99j41j110J08L62k09q62j96J13O46j161k20
$$ -1119 -25 -289 -743 61 710 765 474 469 1268 1127 17 125 487 278 -584 -780 -667 -21 -1182 -1402
2661a402Q14N15Qn3K45N79K00m67J03P20k00j121l1O09l7j125o92O21M46m97l53
$$ -1402 -588 -73 -65 -118 127 706 906 439 542 1262 1062 -59 -90 519 482 -643 -1335 -714 -268 -765 -1118
2682a118Q22P65k40o05M61R96L9r72J5P33R6j086o17P91j13p52l99L40P35q33
$$ -1118 -296 469 229 -376 85 1081 1120 148 163 896 992 -94 -711 80 -33 -785 -1184 -844 -109 -942
2702i42KK68J192K9p90O13J095l46r69k23P74K33j361o00R31P6j049l26R06Q21
$$ -942 -940 -672 520 549 -241 372 1467 1121 152 -71 703 936 -425 -1025 -94 -18 -1067 -1393 -487 334
2722C34n73l54O07Q22j81m47p1J218j06j242o1O57j96j160o68R00L47j103k46
$$ 334 -239 -593 14 836 655 208 137 1355 1249 7 -54 603 407 -753 -1421 -521 -174 -1277 -1523
2741a523J046R95q39j24R73R14l90p59J45J166o50j403O0Q10j60j343o44J270
$$ -1523 -477 518 -321 -445 528 1442 1052 293 438 1604 954 -449 -389 421 261 -1082 -1726 -456
2759d56K64p15n02J020R22n22k17P87J057r75m47L56Q25m56j244j41N01j89j055
$$ -456 -192 -907 -1409 -389 533 11 -206 581 1638 663 216 572 1397 941 -303 -444 57 -132 -1187
2778a187k36Q24M49q66l25J358M60l83k46J042O40l02r75L45P42q55q85N4J98
$$ -1187 -1423 -599 -150 -1016 -1341 17 477 94 -152 890 1530 1228 253 598 1340 485 -400 -346 -148
2797a48k17j060lP40L77n18k42J257O97l96j74N32O41k64r33L46N13p46q74k42
$$ -148 -365 -1425 -1428 -688 -311 -829 -1071 186 883 487 313 845 1486 1222 289 635 1148 402 -472 -714
2817g14M71L1j067j74O74M07l47j51J073O19j68m37L59R32o42p93J18L38l31o69
$$ -714 -243 -212 -1279 -1453 -779 -372 -719 -870 203 822 654 217 576 1508 866 73 191 529 198 -471
2837d71l16J60L22o40k20N35L94J7R7J13R21o4o83M61J17K36q90J8J45l76l21
$$ -471 -787 -627 -305 -945 -1165 -630 -236 -219 -122 -9 912 848 165 626 743 979 89 107 252 -124 -445
2858d45m28K71M7k10l07O66M29j71k00O17P71k18o63L77J92Ro20n41L94j04m22
$$ -445 -873 -602 -555 -765 -1072 -406 23 -148 -348 269 1040 822 159 536 728 737 117 -424 -30 -134 -556
2879e56r30J110k0j89k75N61Q99l20k56K72J021k35r24K58K89l27o96k66M07L31
$$ -556 -1486 -376 -396 -585 -860 -299 600 280 24 296 1317 1082 158 416 705 378 -318 -584 -177 154
2899A54p88o65O68P20n01n13P27R64k5o47J50J054l92p58j70O31k58r95k09K76
$$ 154 -634 -1299 -631 89 -412 -925 -198 766 741 94 244 1298 906 148 -22 609 351 -644 -853 -577
2919e77N53o37q13R37R80n34n23O16R68qo81p5J100k86r70m51O44O4j048n79P70
$$ -577 -24 -661 -1474 -537 443 -91 -614 2 970 962 281 206 1306 1020 50 -401 243 307 -741 -1320 -550
2940e50Q99j185l13O22J020m86m64Q82P26k65j007N18P91l12j362M8O24jj089
$$ -550 349 -836 -1149 -527 493 7 -457 425 1151 886 -121 397 1188 876 -486 -438 186 185 -904
2959i04n73O97O25n85j56N43R53k57p77Q23J130l62q78J71P00l27j276j23N74
$$ -904 -1477 -780 -155 -740 -896 -353 600 343 -434 389 1519 1157 279 450 1150 823 -453 -576 -2
2978bK15j255r7M88M93n24p9O36P69n4n79O73R54m88r44J59M30n32o73j41J43
$$ -2 213 -1042 -1139 -651 -158 -682 -761 -125 644 590 11 684 1638 1150 206 365 795 263 -410 -551 -408
2999d08J97q16m02J000J10j45l78J137M36q3l33L26M23J36r78k03M46n6r22m30
$$ -408 -211 -1027 -1429 -429 -319 -464 -842 295 731 648 315 641 1064 1200 222 19 465 409 -513 -943
3019i43N97On63l21P95L66j29k37Q05N51j89p94L52P62o6q24l62O42k58r44k50
$$ -943 -346 -340 -903 -1224 -429 -63 -192 -429 376 927 738 -56 296 1058 992 168 -194 448 190 -754 -1004
3040a004N46K16l28l47N86P41n08K5J71Q80j67n07m7O92m40l86k90L38n4o56n04
$$ -1004 -458 -242 -570 -917 -331 410 -98 -73 98 978 811 304 257 949 509 123 -167 171 117 -539 -1043
3061a043L07L36l4m36R27J18K37k56K70N51qm84l93Q87n78k67q24O07N9n42n12
$$ -1043 -736 -400 -434 -870 57 175 412 156 426 977 969 485 92 979 401 134 -690 -83 -24 -566 -1078
3082a078L93N00q1n13O03O01M97n95m7N44J30q17n4K65L33j024m74J73L08j38
$$ -1078 -685 -185 -266 -779 -176 425 922 327 280 824 954 137 83 348 681 -343 -817 -644 -336 -474
3102d74l23K37P34k10m45N79P17J06r72K55Q21k23q95k63N92m8p53n72M27M34
$$ -474 -797 -560 174 -36 -481 98 815 921 -51 204 1025 802 -93 -356 236 188 -565 -1137 -710 -276
3122b76k3q58P63P18m49j64L82P23J50p40n4O33k5r67l21L76J42q47l07L88N19
$$ -276 -299 -1157 -394 324 -125 -289 93 816 966 226 172 805 780 -187 -508 -132 10 -837 -1144 -756 -237
3143b37n48j85Q60O90j49m17J92Q02J59j196Q2Q21j52j309l20O44J55o30n64L95
$$ -237 -785 -970 -110 580 431 14 206 1008 1167 -29 53 874 722 -587 -907 -263 -108 -738 -1302 -907
3163i07R64n82m00Q35Q84k99m82M37M86K18j171M5P80p6j204n62O71L54q15l50
$$ -907 57 -525 -925 -90 794 495 13 450 936 1154 -17 28 808 732 -472 -1034 -363 -9 -824 -1174
3183a174N82O46m27n00Q91R10k27m60K13R31l44r98K3O22m65q17k82J48M72n56
$$ -1174 -592 54 -373 -873 18 928 701 241 454 1385 1041 43 66 688 223 -594 -876 -728 -256 -812
3203h12m40R73J38l9m38O63J144n43l53L66M48j88o57k57M29n86m41j62J24K83
$$ -812 -1252 -279 -141 -180 -618 45 1189 646 293 659 1107 919 262 5 434 -152 -593 -755 -631 -348
3223c48n06k87M37Q00j14nL40Q95n69l51L0N42k19o82k03K67k6q13j09L19J88
$$ -348 -854 -1141 -704 96 -18 -23 317 1212 643 292 322 864 645 -37 -240 27 1 -812 -921 -602 -414
3244d14l77j38N29P27o1n39N74Q24k73m97j31P6K25o53n21L69Q9n00k80L03L80
$$ -414 -791 -929 -400 327 266 -273 301 1125 852 355 224 300 525 -128 -649 -280 -191 -691 -971 -668 -288
3265b88J6k30J88N74N14n19r4M40J51l82l46K84k14k83n97M85J45k49n47L30P27
$$ -288 -272 -502 -314 260 774 255 161 601 752 370 24 308 94 -189 -786 -301 -156 -405 -952 -622 105
3286A05j88o16M78Q36M93o96j24M50r1k54q74N67M6m18o28J35M95j19k74J92P02
$$ 105 -83 -699 -221 615 1108 412 288 738 647 393 -481 86 132 -286 -914 -779 -284 -403 -677 -485 217
3307B17l15m13N01Q87J24n33m04M87J95n90n48N50lm29o89M42N53k84o91M37R26
$$ 217 -98 -511 -10 877 1001 468 64 551 746 156 -392 158 155 -274 -963 -521 32 -252 -943 -506 420
3328D20L52p13J76P85k80k93j55K57m4o62l48LN29p59q62R59O23l24k75L92P32
$$ 420 772 59 235 1020 740 447 292 549 505 -157 -505 -502 27 -732 -1594 -635 -12 -336 -611 -219 513
3349E13o6j93j9P52J91p94j32M27j54p75p52K89K59k76m70O49O13j93m60O53Q45
$$ 513 447 254 235 987 1178 384 252 679 525 -250 -1002 -713 -454 -730 -1200 -551 62 -131 -591 62 907
3370I07J3q17J58P35k04p92j07K57L23j048m87M33M32q25n2M83Q41j38m48M12
$$ 907 920 103 261 996 792 0 -107 150 473 -575 -1062 -629 -197 -1022 -1074 -591 250 112 -336 76
3390G6O84J60n06j9N89N0j076k58P0N57j026k95O64O8n07k64P26O46k71q3L24
$$ 76 760 920 414 395 984 1034 -42 -300 -230 327 -699 -994 -330 -262 -769 -1033 -307 339 68 -15 309
3411C09N99k64k41k49O14j18n98l22M32q9m81p54L42N73j51p31J045L83Nk28J60
$$ 309 908 644 403 154 768 650 52 -270 162 73 -408 -1162 -820 -247 -398 -1129 -84 299 304 76 236
3432B36P78m65m34J56L11j45n71j21J37J7p27O3M09K96k26k14N31M97M5l92J05
$$ 236 1014 549 115 271 582 437 -134 -255 -118 -101 -828 -765 -356 -60 -286 -500 31 528 573 181 286
3453B86M34o4k85m33N56k03n37l56N1N91q7j061O54M51q6N9j90N79M54n25k00
$$ 286 720 656 371 -62 494 291 -246 -602 -551 40 -47 -1108 -454 -3 -89 -30 -220 359 813 288 88
3474H8M67K64j115K21L40m23j30o40J61P22k07k50L99%K21k01J36O08k06j1j72
$$ 88 555 819 -296 -75 265 -158 -288 -928 -767 -45 -252 -502 -103 -103 118 -83 53 661 455 444 272
3495B72K68pk60o00J05M80o62n48J45P61l84K2k61Q04M29n90K80L34M02o60j42
$$ 272 540 533 273 -327 -222 258 -404 -952 -807 -46 -430 -408 -669 135 564 -26 254 588 990 330 188
3516A88L57L25q41o86K98L97n69l65L02O61j15l88L36O69l91r1J04N05J92m96
$$ 188 545 870 29 -657 -359 38 -531 -896 -594 67 -48 -436 -100 569 178 87 191 696 888 392
3536C92l65L87L01q27o21L08J65k27m54P6Q83J11p54N18P31J82l80k78O21J27
$$ 392 27 414 715 -112 -733 -425 -260 -487 -941 -865 18 129 -625 -107 624 806 426 148 769 896
3556H96q07o35P67p9l53p99M87O24p50N4m9O32O3o05M86J058j62m96k22O09K63
$$ 896 89 -546 221 142 -211 -1010 -523 101 -649 -595 -644 -12 51 -554 -68 990 828 332 110 719 982
3577I82q89m96O27m6o47n12L42J46N9l56K60P29l3r2J40P53j03o99K1N03l5n33
$$ 982 93 -403 224 178 -469 -981 -639 -493 -434 -790 -530 199 166 74 214 967 864 165 186 689 654 121
3599A21p32P29O6j207K69K19M10np51P68M08k88q8L19L68Q7l77l36O99k4n97o94
$$ 121 -611 118 184 -1023 -754 -535 -125 -130 -881 -113 295 7 -81 238 606 693 316 -20 679 655 58 -636
3621f36M27Km70Jr3O30p2j25K47M71J10o91P07K57j93l61j86L53k71k34m59L36
$$ -636 -209 -207 -677 -676 -769 -139 -211 -336 -89 382 492 -199 508 765 572 211 25 378 107 -127 -586 -250
3643b50Rj52k70M65N27n21n0K04N28J45k79r0L01m6q6n15J48J05k42o31N97L6
$$ -250 -241 -393 -663 -198 329 -192 -242 -38 490 635 356 266 567 521 435 -80 68 173 -69 -700 -103 -67
3665f7l43j28L18L41J99n58K60M61Q1j66l18M35J85q72M0J38J94l90o36Q7Q71
$$ -67 -410 -538 -220 121 320 -238 22 483 564 398 80 515 700 -172 -132 6 200 -190 -826 -739 132
3686A32m70j79J4N95M22k73P8K09J31l25l62K56M21q19k54j5K46j81l00K92O10
$$ 132 -338 -517 -503 92 514 241 319 528 659 334 -28 228 649 -170 -424 -439 -193 -374 -674 -382 228
3707B28l97j2J1M74K26m95k5P10Qo67j97J57M16o22m87j9K99K0k37k74R43J67
$$ 228 -169 -181 -170 304 530 35 10 720 728 61 -136 21 437 -185 -672 -691 -392 -372 -609 -883 60 227
3729B27m64R6P55P2n01QL16K90o71l59L64K47o85n58M21L10k13l21L8P30Q9k70
$$ 227 -237 -141 614 686 185 193 509 799 128 -231 133 380 -305 -863 -442 -132 -345 -666 -628 102 191 -79
3751g9K0O27L36o11l8N46k75o11j0R7N9n82n38O43N14l35n56L38P68j07k98J35
$$ -79 -59 568 904 293 255 801 526 -85 -95 2 61 -521 -1059 -416 98 -237 -793 -455 313 206 -92 43
3773D3M57L04m24L9J14J92q10n80P92o4n64l25K12O10l75l33M02N31K43l18J44
$$ 43 500 804 380 419 533 725 -85 -665 127 63 -501 -826 -614 -4 -379 -712 -310 221 464 146 290
3794B90O48J8o37k62M81o0n47m96J13K71k83l01K38M27q3l42L46L40L5k07J36
$$ 290 938 956 319 57 538 478 -69 -565 -452 -181 -464 -765 -527 -100 -183 -525 -179 161 196 -11 125
3815A25L49K03l14l85L10l2m29P5k89K92l13n71M48O55k74k22J8O19K37k74j7
$$ 125 474 677 363 -22 288 256 -173 -98 -387 -95 -408 -979 -531 124 -150 -372 -354 265 502 228 211
3836B11M56m2m91q0K20Mn37r1J27K36n29n6N23j21J61l86M19M75l48J97l96N74
$$ 211 667 625 134 54 274 278 -259 -350 -223 13 -516 -572 -49 -170 -9 -395 24 499 151 348 -48 526
3858E26j89l65j14R0k4j49l96K87L95j79l05K00M13N8j72J44M91j51l20M0L7K79
$$ 526 337 -28 -142 -52 -76 -225 -621 -334 61 -118 -423 -223 190 248 76 220 711 560 240 280 317 596
3880E96n34m52J86K16j20m14K90k9J71l60J15O91M6j84l14O28K26m27k72K41m
$$ 596 62 -390 -204 12 -108 -522 -232 -261 -90 -450 -335 356 402 218 -96 532 758 331 59 300 296
3901B96j95o70J61qK2j87J97K72j00P9P5L58K78j83j95L45K23l74o17P6N87q29
$$ 296 101 -569 -408 -416 -394 -581 -384 -112 -212 -133 -58 300 578 395 200 545 768 394 -223 -147 440 -389
3923c89k47K79J45k13l35J4Q72k64m2l6R75p2l17j87J20K75l96l32k23N41j57
$$ -389 -636 -357 -212 -425 -760 -746 126 -138 -180 -216 759 687 370 183 303 578 182 -150 -373 168 11
3944A1n75R0M88j73m54L87L84L56l54k15N41M42k69l29J59J59n02m43R0K17k25
$$ 11 -564 -474 14 -159 -613 -226 158 514 160 -55 486 928 659 330 489 648 146 -297 -207 10 -215
3965b15l87J58L90j61k73P3Q09L18o76j1P13P7n90j80N27N9p26n29L94K23m91
$$ -215 -602 -444 -54 -215 -488 -415 394 712 36 25 738 815 225 45 572 631 -95 -624 -230 -7 -498
3986d98k75L00M60q7l72K15N28R6p5k45N38k9%l97K41J5m11m74J54J71m05j79
$$ -498 -773 -473 -13 -100 -472 -257 271 367 292 47 585 556 556 159 400 415 4 -470 -316 -145 -550 -729
4008g29J26P11j76m67M63L95K42m02p9P06l23j43m42M95L4n71m10L24L70m08m75
$$ -729 -603 108 -68 -535 -72 323 565 163 84 790 467 324 -118 377 411 -160 -570 -246 124 -284 -759
4029g59K93P38l32j87K52P40k11l26J9K80J21n04l7k50K14k87l41L19N8p5k04
$$ -759 -466 272 -60 -247 5 745 534 208 227 507 628 124 87 -163 51 -236 -577 -258 -200 -275 -479
4050d79J64L39J18L3L1N83j25m96m6K74L31n10o62K88J94j34m27j16Q02l98k67
$$ -479 -315 24 142 175 206 789 664 168 122 396 727 217 -445 -157 37 -97 -524 -640 162 -236 -503
4071e03K13N35J29l49j06P00nk62n33K52nj79k42N6L63j72m72J86M29j51K78j48
$$ -503 -290 245 374 25 -81 619 614 352 -181 71 66 -113 -355 -299 64 -108 -580 -394 35 -116 162 14
4093A4K66J27j91J9j44L68k42m14n2N25n61k32K93J89j36r9l06L05L97o5l72O23
$$ 14 280 407 216 235 91 459 217 -197 -249 276 -285 -517 -224 -35 -171 -270 -576 -271 126 61 -311 312
4115C12O9o2J96j67K11j13o71J08L18m46n80R9N70m3m65K48M51QJ9k57M50L70
$$ 312 381 319 515 348 559 446 -225 -117 201 -245 -825 -726 -156 -199 -664 -416 35 43 62 -195 255 625
4137F25m92j09K01M81m27o65J32L00n89j1j2L07K35m49KN63L33l44k23P79K96
$$ 625 133 24 225 706 279 -386 -254 46 -543 -554 -566 -259 -24 -473 -471 92 425 81 -142 637 933
4158I33n62m82K54M35n79m10R6M45o08j69R4N52j72p7K7K27L74j97j94P99k46
$$ 933 371 -111 143 578 -1 -411 -315 130 -478 -647 -553 -1 -173 -250 -223 4 378 181 -13 786 540
4179E40k14m24K94K11m00k61k96M43j82n17M66K99o8j13k48P05N47n39j00J84
$$ 540 326 -98 196 407 7 -254 -550 -107 -289 -806 -340 -41 -109 -222 -470 235 782 243 143 327
4199C27J52m99NJ70J20j81k60l97L19p5l51K68L51L70p94K76O61M8j43l41K76
$$ 327 479 -20 -15 155 275 94 -166 -563 -244 -319 -670 -402 -51 319 -475 -199 462 510 367 26 302
4220C02K40m29l29K78k1j98o68K57M04k11q2R3L77L59o63L63N50l2o23R6M54K
$$ 302 542 113 -216 62 41 -157 -825 -568 -164 -375 -457 -364 13 372 -291 72 622 590 -33 63 517 519
4242E19r9m41M2J45n88j91J49M27O5m88K02P49l9k22JK27J33j42n51L46N6j36
$$ 519 420 -21 21 166 -422 -613 -464 -37 28 -460 -258 491 452 230 231 458 591 449 -102 244 300 164
4264A64m40q4L74m17o9J18R7J53j41L5N62J73m76J43L86k24k71J08l59K17j50
$$ 164 -276 -360 14 -403 -472 -354 -257 -104 -245 -210 352 525 49 192 578 354 83 191 -168 49 -101
4285a01l07P7N10m41k92P9M02K15k35K14K27K17j54j95J02K60m56k37j06J94M
$$ -101 -408 -331 179 -262 -554 -475 -73 142 -93 121 348 565 411 216 318 578 122 -115 -221 -27 -23
4306b3n90L12J09j91j62J31L56J85J84L0J68J99n18l78N03K71n73n71M04M9Qo76
$$ -23 -613 -301 -192 -383 -545 -414 -58 127 311 341 509 708 190 -188 315 586 13 -558 -154 -105 -97 -773
4328g73K58K18K96m02jP77j02P0l36N30j60p8m55N18J74j33q55K90K01m07k15
$$ -773 -515 -297 -1 -403 -404 373 271 341 5 535 375 297 -158 360 534 401 -454 -164 37 -370 -585
4349e85l0M13K40k98R0L17N25l02m09O73K02o85o9J0L78o83l61K82K15j74m23
$$ -585 -615 -202 38 -260 -170 147 672 370 -39 634 836 151 82 92 470 -213 -574 -292 -77 -251 -674
4370f74n2O56J89l72L59K62K15l53k3J10O10m92o10K56K95l65o38N50N3m86j17
$$ -674 -726 -70 119 -253 106 368 583 230 207 317 927 435 -175 81 376 11 -627 -77 -24 -510 -627
4391f27K54L77J78k59j06O48K2Nl09K01M14n84k13k8K46j75n27J06M80l87j19
$$ -627 -373 4 182 -77 -183 465 487 492 183 384 798 214 1 -27 219 44 -483 -377 103 -284 -403
4412d03n9M45N31k56r7L13K36n15j19M11J38m85l53p7K69j6m97J8M73k25N0m0
$$ -403 -462 -17 514 258 161 474 710 195 76 487 625 140 -213 -290 -21 -37 -534 -516 -43 -268 -218 -258
4434b58L65n2J6m6M23L37p28j38L21J60n22k75P8K79k2l17j47N36J31l73R8J81
$$ -258 107 55 71 25 448 785 57 -81 240 400 -122 -397 -319 -40 -62 -379 -526 10 141 -232 -134 47
4456D7M94m03j05O89j93l09m26N4N36j91o62K20J62j33n47N04L27J95m02J18L14
$$ 47 541 138 33 722 529 220 -206 -152 384 193 -469 -249 -87 -220 -767 -263 64 259 -143 -25 289
4477B89N13o84K4L14L6j68o31J74K00J65q32L86O8J12m12K55qL06r8K11M6K20
$$ 289 802 118 142 456 492 324 -307 -133 67 232 -600 -214 -146 -34 -446 -191 -199 107 9 220 266 486
4499D86j20k19J39N4R3q05L73k31L7k18K9qK15l2p6M88L16l05q9L52j04Lk28K89
$$ 486 366 147 286 340 433 -372 1 -230 -193 -411 -382 -390 -175 -207 -283 205 521 216 127 479 375 378 150 439
4523D39j83j4o94J73P2J69n22r0L43J67k91L53J63K68J20m24M7O55l08l86n6J18
$$ 439 256 242 -452 -279 -207 -38 -560 -650 -307 -140 -431 -78 85 353 473 49 96 751 443 57 1 119
4545A19j87m12K49j6q1l4j5J55K95k60k17P62K13j7m51M27L10m90m40J57L90o38
$$ 119 -68 -480 -231 -247 -328 -362 -377 -222 73 -187 -404 358 571 554 103 530 840 350 -90 67 457 -181
4567a81l15m5J89M57r37M32K26M02k7j54N00K19l74n20N45K3k50n36J57L41l58
$$ -181 -496 -541 -352 105 -832 -400 -174 228 201 47 547 766 392 -128 417 440 190 -346 -189 152 -206
4588b06m81L00K77j59l95Q1O10L07k88j79P03K23n36n3J3r5l5l77m5K39J43p30
$$ -206 -687 -387 -110 -269 -664 -583 27 334 46 -133 570 793 257 204 217 122 87 -290 -335 -96 47 -683
4610f83J78N65k47k40J14N73O7l11K8L07N55n14m71K01M01m30l43k25L38j28l47
$$ -683 -505 60 -187 -427 -313 260 327 16 44 351 906 392 -79 122 523 93 -250 -475 -137 -265 -612
4631f12L49J17J94l53j13O98J52q9k04n3L05l2m29J6L17k82l84l7L56o7l09l8
$$ -612 -263 -146 48 -305 -418 280 432 343 139 86 391 359 -70 -54 263 -19 -403 -440 -84 -151 -460 -498
4653d98K42L17m88K56L62K99j24r9q3K16n21L15m27K09j93l08J64K15J30l61J54
$$ -498 -256 61 -427 -171 191 490 366 267 184 400 -121 194 -233 -24 -217 -525 -361 -146 -16 -377 -223
4674b23M81o2M0J09L17O8m06k62J84M30n76k92k23L47j86o10L56K63L11k97q5
$$ -223 258 196 236 345 662 730 324 62 246 676 100 -192 -415 -68 -254 -864 -508 -245 66 -231 -316
4695c16M99J9L6l90P37J87k48k71plj64n47j69L45L70o57K49K82J46j42j84J27
$$ -316 183 202 238 -152 585 772 524 253 246 243 79 -468 -637 -292 78 -579 -330 -48 98 -44 -228 -101
4717a01P01k86J9K02J95m57m16L34o7j33m68J14J47j46r0j26L03L99p2k95L62
$$ -101 600 314 333 535 730 273 -143 191 124 -9 -477 -363 -216 -362 -452 -578 -275 124 52 -243 119
4738A19P38n03M4R4j6k15k61j17J51jp76K73K18l0k54n5M84N79k52k10L86J68
$$ 119 857 354 398 492 476 261 0 -117 34 33 -743 -470 -252 -282 -536 -591 -107 472 220 10 396 564
4760E64n5n65M32k1j21l37k8K85n44j96K55j14L46k01m4K68L64j95P8J26L47l62
$$ 564 509 -56 376 355 234 -103 -131 154 -390 -586 -331 -445 -99 -300 -344 -76 288 93 171 297 644 282
4782B82oJ6n7k37m83K5J83L41n24j32N92N4m03K89M4P56l46k53L40J79j58m93
$$ 282 276 292 235 -2 -485 -460 -277 64 -460 -592 0 54 -349 -60 -16 740 394 141 481 660 502 9
4804Ir0M24l12n71J2K73K7n53J86M87K08l33K2N59M05o69L07q1J13n04j39J98
$$ 9 -81 343 31 -540 -528 -255 -228 -781 -595 -108 100 -233 -211 348 753 84 391 310 423 -81 -220 -22
4826b2Q5P6n21j32K69K37j69m58O49K00j98N5J85R6J14m61L81J15k6p63J25K94
$$ -22 63 139 -382 -514 -245 -8 -177 -635 14 214 16 71 256 352 466 5 386 501 475 -288 -163 131
4848A31l70l01p7P95k30k19J35j85N81k64K24L5M64l08n99K95P1K0p42L19j35
$$ 131 -239 -540 -617 178 -52 -271 -136 -321 260 -4 220 255 719 411 -188 107 178 198 -544 -225 -360
4869c60L27m11j21L56O2j26J43J78L62j28k27L46Q5j18k27J44l5Km29R2j21q3
$$ -360 -33 -444 -565 -209 -147 -273 -130 48 410 282 55 401 486 368 141 285 250 252 -177 -85 -206 -289
4891b89l17L01J44L57l33J60L78N4Ml51K96Rq0l74k56J57J72k48n26N61l3p3j44
$$ -289 -606 -305 -161 196 -137 23 401 455 459 108 404 413 333 -41 -297 -140 32 -216 -742 -181 -214 -287 -431
4914d31L13M8K71J34n8K02O5m18q6M56k27j99k89K79k88k6j29p1L41j6l95J44
$$ -431 -118 -70 201 335 277 479 544 126 40 496 269 70 -219 60 -228 -254 -383 -454 -113 -129 -524 -380
4936c80K66M88j38L04K20j82p55K89L95l67m19P9J6k00J47l42M85kj81J0J32R93
$$ -380 -114 374 236 540 760 578 -177 112 507 140 -279 -200 -184 -384 -237 -579 -94 -96 -277 -267 -135 858
4958H58n97l64L41K52O2m86J86J31Op04q3K35K8l85j60O92R7l32l4M04L75l35
$$ 858 261 -103 238 490 552 66 252 383 389 -315 -398 -163 -135 -520 -680 12 109 -223 -257 147 522 187
4980A87o2K87R4m7m06N6M7l5l88j52J69L37o69N0N48p6Mk1K82L31k80Q4N8m2p4
$$ 187 125 412 506 459 53 109 156 121 -267 -419 -250 87 -582 -532 16 -60 -56 -77 205 536 256 340 398 356 282
5005B82m53L54k12L8m61l68M96M60n94J75L29J57j1m08L62J55J34j17l67P42m16
$$ 282 -171 183 -29 9 -452 -820 -324 136 -458 -283 46 203 192 -216 146 301 435 318 -49 693 277
5026B77l22j18K27k14n33J60L88Lk93L4N66K96k07k88L77K80m08j64M4Q7k6o39
$$ 277 -45 -163 64 -150 -683 -523 -135 -132 -425 -391 175 471 264 -24 353 633 225 61 105 192 166 -473
5048d73j5M46q3k09l39L19L19k00J4P33j6j75j09j07N18j76m96k7L63k77j29k85
$$ -473 -488 -42 -125 -334 -673 -354 -35 -235 -221 512 496 321 212 105 623 447 -49 -76 287 10 -119 -404
5070d04K80R7k73m58P66J54k51K13j04L75o5o9p1L28k39n89J43J22j51k32N7j25
$$ -404 -124 -27 -300 -758 8 162 -89 124 20 395 330 261 190 518 279 -310 -167 -45 -196 -428 -371 -496
5092d96N03k50k95L33M30N4m55M37M29j08m46l6L03k23j86k96J40J79j66m63M12
$$ -496 7 -243 -538 -205 225 279 -176 261 690 582 136 100 403 180 -6 -302 -162 17 -149 -612 -200
5113b00J77o8l03L77M50l76J21O1J65J73l93K4N5r6m13p0O6j15r5k4J20K53JN8
$$ -200 -23 -91 -394 -17 433 57 178 239 404 577 184 208 263 167 -246 -316 -250 -365 -460 -484 -364 -111 -110 -52
5137e2p8M56k41L7q9O13l75k80j04L71k00n33P7N25n15k0rk15Q38j37o6R2M76
$$ -52 -130 326 85 122 33 646 271 -9 -113 258 58 -475 -398 127 -388 -408 -417 -632 206 69 3 95 571
5160E71n06P6L2L74m05k06k65M75j55o7k95N2J54j98l25M82L03j78l69N39K36
$$ 571 65 141 173 547 142 -64 -329 146 -9 -76 -371 -319 -165 -363 -688 -206 97 -81 -450 89 325
5181C25l4k84K56K39j02k33l02K53k0k85o13P22O8j39n71N35O54l98j84K79K30
$$ 325 291 7 263 502 400 167 -135 118 98 -187 -800 -78 -10 -149 -720 -185 469 71 -113 166 396
5202C96J14l60j2K34k72jl63K28J47m05l47L69K39p5k74M17J12J40j73J18J38
$$ 396 510 150 138 372 100 99 -264 -36 111 -294 -641 -272 -33 -108 -382 35 147 287 114 232 370
5223C70j83j44k58O30j19m42j25L41j53m19m0L70L54m24J38J16K52o2m63M04L76
$$ 370 187 43 -215 415 296 -146 -271 70 -83 -502 -542 -172 182 -242 -104 12 264 202 -261 143 519
5244E19k55l02k78K76J84l95j30M1M44n77l0N73n4j53qM06M22l50l11n8O25l64
$$ 519 264 -38 -316 -40 144 -251 -381 -340 104 -473 -503 70 16 -137 -145 261 683 333 22 -36 589 225
5266B25l44p4M22m14P3l91M10J31m86L02j21M77j8J33r3K77k53k54L94M0j21l59
$$ 225 -119 -193 229 -185 -112 -503 -93 38 -448 -146 -267 210 192 325 232 509 256 2 396 436 315 -44
5288d4j66K02n15Q6p1l5M07k14o8L36K26M6j08j9M59l2j92O1k43l1k01p9r9J74
$$ -44 -210 -8 -523 -437 -508 -543 -136 -350 -418 -82 144 190 82 63 522 490 298 359 116 85 -116 -195 -294 -120
5312a20q7l96J98K58P4p6J65M00r6j64j54L28p1J09m94L6L08m95J5j18K2M2k47
$$ -120 -207 -603 -405 -147 -73 -149 16 416 320 156 2 330 259 368 -126 -90 218 -277 -262 -380 -358 -316 -563
5335e63M18P8K5J01j59M82l31P4j3N00j96m9n50j53J66j96J0j39L18o2l66L75
$$ -563 -145 -67 -42 59 -100 382 51 125 112 612 416 367 -183 -336 -170 -366 -356 -495 -177 -239 -605 -230
5357b30L78J5k35L35L4K15l68Q6K19r2l76n4j36K92l62j70R1N00k97j71K62LP1
$$ -230 148 163 -72 263 297 512 144 230 449 357 -19 -73 -209 83 -279 -449 -358 142 -155 -326 -64 -61 10
5380A0J64pL71Km46Q7k8J54m00L9rNm8l72K67N8Q2r8j3M92o1j00O2K63m46J03
$$ 10 174 167 538 540 94 181 153 307 -93 -54 -63 -58 -106 -478 -211 -153 -71 -169 -182 310 249 149 211 474 28 131
5406A31j61J9J87l84j01L62m4k43k16L32J90r2l13K43K29j7r1k74O49J0n44k18
$$ 131 -30 -11 176 -208 -309 53 9 -234 -450 -118 72 -20 -333 -90 139 122 31 -243 406 416 -128 -346
5428c46M89k3l98j38M66q7r0n9M5K33k9k05L75J38K7k36m3N06j92n23p6o7J72
$$ -346 143 120 -278 -416 50 -37 -127 -186 -141 92 63 -142 233 371 398 162 119 625 433 -90 -166 -233 -61
5451f1J06l21n8M82n29L79p6k21M60l62L10L20K13q22J49J57L7J1n45L61r0o6
$$ -61 45 -276 -334 148 -381 -2 -78 -299 161 -201 109 429 642 -180 -31 126 163 174 -371 -10 -100 -166
5473a66j63K76J74M2k01K58k1L02m78J28L44j50j79j71P8J52n15k53K88R0%n10
$$ -166 -329 -53 121 163 -38 220 199 501 23 151 495 345 166 -5 73 225 -290 -543 -255 -165 -165 -675
5495f75M36J08k15M23oJ17j22Q0j16M67k70l33l6O7j4l25j52L40J66k27n1K01
$$ -675 -239 -131 -346 77 71 188 66 146 30 497 227 -106 -142 -75 -89 -414 -566 -226 -60 -287 -338 -137
5517a37L30m6k44J85K41R4J0n18M99j5k29m24M65n6j28l36q6L19k03l5m5N93l94
$$ -137 193 147 -97 88 329 423 433 -85 414 399 170 -254 211 155 27 -309 -395 -76 -279 -314 -359 234 -160
5540a60J03K95L0J3j60mK02j61j10k88K16k01Pl36J51K29j05j38M77N9K73j54
$$ -160 -57 238 268 281 121 117 319 158 48 -240 -24 -225 -218 -554 -403 -174 -279 -417 60 119 392 238
5562B38j60J38J15k82L8J51k95n5j44n2L34k51j1r6P2K45J39j90M48J58n99L1
$$ 238 78 216 331 49 87 238 -57 -112 -256 -308 26 -225 -236 -332 -260 -15 124 -66 382 540 -59 -28
5584b8N64j82m58J63K49O1k90n29K73L97k90n58K79K92M9n4N3N20j59k95J11L9
$$ -28 536 354 -104 59 308 369 79 -450 -177 220 -70 -628 -349 -57 -8 -62 -9 511 352 57 168 207
5606B07j9J54o82K77k0k21N2P8N4j00k91L64J58j42K44J70N08m18j87l04L57L12
$$ 207 188 342 -340 -63 -83 -304 -252 -174 -120 -220 -511 -147 11 -131 113 283 791 373 186 -118 239 551
5628E51n89m9J30m5k55m28L74M58k02j61J91L84k47K03r0J69r9k47J88j82L08
$$ 551 -38 -87 43 -2 -257 -685 -311 147 -55 -216 -25 359 112 315 225 394 295 48 236 54 362
5649C62m32o5k82M60j72j48j4K24M2j85P7L35J1k72N40r8L5l93r9M88k72j59j21
$$ 362 -70 -135 -417 43 -129 -277 -291 -67 -25 -210 -133 202 213 -59 481 383 418 25 -74 414 142 -17 -138
5672a38j40K89O5n81K90K41J33j02PP5j43P6R3O4K03k75l91L44j59r6p0l11L54
$$ -138 -278 11 76 -505 -215 26 159 57 64 139 -4 72 165 229 432 157 -234 110 -49 -145 -215 -526 -172
5695a72k9j62O6L86PrL1Q1jK33n29M37j24P3l93mK1k02k88K39K04r9j12P6K30
$$ -172 -201 -363 -297 89 96 87 118 199 198 431 -98 339 215 288 -105 -109 -88 -290 -578 -339 -135 -234 -346 -270 -40
5720d0J17J51J47J84p4k92q8J61R0j16p71K05K35l6l72M29j63K26k02K16K88k20
$$ -40 77 228 375 559 485 193 105 266 356 240 -531 -326 -91 -127 -499 -70 -233 -7 -209 7 295 75
5742G5j79K89K00Q2m23ML10m24J00l93K03j9O6o0o5K85l14J26L1R3K27j62N2K15
$$ 75 -104 185 385 467 44 48 358 -66 34 -359 -156 -175 -109 -169 -234 51 -263 -137 -106 -13 214 52 104 319
5766C19Q3m16j65J74n7m30K1M12k1p0j21k9O55m71Q5m6J50M73j16m45J00K56l10
$$ 319 402 -14 -179 -5 -62 -492 -471 -59 -80 -150 -271 -300 355 -116 -31 -77 73 546 430 -15 85 341 31
5789C1o0k51L16k00o8lJ17k1m59N22P7K03j37L1K6J44k59K10j86K31p4m59K76
$$ 31 -29 -280 36 -164 -232 -235 -118 -139 -598 -76 1 204 67 98 124 268 9 219 33 264 190 -269 7
5812G%j75o3j75M78j29k24L25P7k05J22J99N7L4M8m75L10L53p40J04L9K76m60
$$ 7 7 -168 -231 -406 72 -57 -281 44 121 -84 38 237 294 328 376 -99 211 564 -176 -72 -33 243 -217
5835b17l90K62J77J11j75K34K14Q8k60j94M66J32m30j46O0J1l6j30J87k6j65k06
$$ -217 -607 -345 -168 -57 -232 2 216 304 44 -150 316 448 18 -128 -68 -57 -93 -223 -36 -62 -227 -433
5857d33L86L10j86k14J71j36L66p2j64L24J43m63l07J05J71l9l57M10m98L97j86
$$ -433 -47 263 77 -137 34 -102 264 192 28 352 495 32 -275 -170 1 -38 -395 15 -483 -86 -272
5878b72L60k08L07n1j01M06j61j75j36K97k36N6j82j67M11l88j35J03K73M0k98
$$ -272 88 -120 187 136 35 441 280 105 -31 266 30 86 -96 -263 148 -240 -375 -272 1 41 -257
5899b57q7K63J05O4J76p3K50j73m84N36m1n86K31J21p6m3l55J92L3j99K81L32
$$ -257 -344 -81 24 88 264 191 441 268 -216 320 279 -307 -76 45 -31 -74 -429 -237 -204 -403 -122 210
5921B10j71L86k03k12M05O5k79j96j33M40n69j4J79l13r4O0K34K07j18j50L87
$$ 210 39 425 222 10 415 480 201 5 -128 312 -257 -271 -92 -405 -499 -439 -205 2 -116 -266 121
5942A21J32Q3k16j43M85l65k4l42K20l0O7k73k5L11j52L5K99l1j40J95k76M73
$$ 121 253 336 120 -23 462 97 73 -269 -49 -79 -12 -285 -310 1 -151 -116 183 152 12 207 -69 404
5964D04k99nJ91r2k11P5k41J94j08J91l33q7K74m2j68J16L54n7k67j42M45J22
$$ 404 105 100 291 199 -12 63 -178 16 -92 99 -234 -321 -47 -89 -257 -141 213 156 -111 -253 192 314
5986C14k9j13J56k2l04k44J59l73J95k67N49k3N5M9n53N30o6j80q8O44k25r5K1
$$ 314 285 172 328 306 2 -242 -83 -456 -261 -528 21 -2 53 102 -451 79 13 -167 -255 389 164 69 90
6009I0r8J79j58j80j31M4J86k22J16K69j25k40J55L70l4k42m9L69J31l36j2k64
$$ 90 -8 171 13 -167 -298 -254 -68 -290 -174 95 -30 -270 -115 255 221 -21 -70 299 430 94 82 -182
6031a82M02m25J11Q5j21j51M5M3K82L6l62K59K98L4j13n83L44K35m66L02l74M29
$$ -182 220 -205 -94 -9 -130 -281 -236 -193 89 125 -237 22 320 354 241 -342 2 237 -229 73 -301 128
6053A28l99n3m7L0J95j50K38K38O4k41P8J65O2l28K19Q1L9k71j8o13O39k19M1
$$ 128 -271 -324 -371 -341 -146 -296 -58 180 244 3 81 246 308 -20 199 280 319 48 30 -583 56 -163 -122
6076a22Ok0J04m08N04k01K03J0j5J37p0J75k90M12j20j36m83j6N16n61j1J19R2
$$ -122 -116 -136 -32 -440 64 -137 66 76 61 198 128 303 13 425 305 169 -314 -330 186 -375 -386 -267 -175
6099a75L04n99L7M62J39J76k97K24m7k2l05J28P0n0n45M6K91l05n7K26J84K42
$$ -175 129 -470 -433 29 168 344 47 271 224 202 -103 25 95 45 -500 -454 -163 -468 -525 -299 -115 127
6121A27k47k6M47l0j19j6j12L36j85k76M36l18R0m21N9m3J44j1q8K01R9j45K09
$$ 127 -120 -146 301 271 152 136 24 360 175 -101 335 17 107 -314 -255 -298 -154 -165 -253 -52 47 -98 111
6144A11p5L23k4n69N18O1l11k83K02J54j98m5j70J50K10k54Q2k95M39O1q3K23
$$ 111 36 359 335 -234 284 345 34 -249 -47 107 -91 -136 -306 -156 54 -200 -118 -413 26 87 4 227
6166B27J27k86l1K46J48m12k67J61K48l64r2J33L93r4l42K65q8K36o3j97K16J29
$$ 227 354 68 37 283 431 19 -248 -87 161 -203 -295 -162 231 137 -205 60 -28 208 145 -52 164 293
6188B93p6k02K27L9k74m05J64K38n8j74j73L15J97j52j08K94J57k55j50L35Q5
$$ 293 217 15 242 281 7 -398 -234 4 -54 -228 -401 -86 111 -41 -149 145 302 47 -103 232 317
6209C17k58j96J9Q8N6k87J37o5K87j7l15K91j73J72k3K23N3j70L50l20J03q5k14
$$ 317 59 -137 -118 -30 26 -261 -124 -189 98 81 -234 57 -116 56 33 256 309 139 489 169 272 187 -27
6232b7O0k5Q3m89M60k7j45l4J07j20l8L2J86M17r3m82J63Q1r1k25K25N5n7J25
$$ -27 33 8 91 -398 62 35 -110 -144 -37 -157 -195 -163 23 440 347 -135 28 109 18 -207 18 73 16 141
6256A41l67p9J94O5J63k71J55M68l11k73K62K07l24r4kM28l83k85O0L01r5k18
$$ 141 -226 -305 -111 -46 117 -154 1 469 158 -115 147 354 30 -64 -66 362 -21 -306 -246 55 -40 -258
6278b58K8Q0J1j11j3J88M31k84K83k08O5j70k16L18j33L6k53J00Q2k09j60K23
$$ -258 -230 -150 -139 -250 -263 -75 356 72 355 147 212 42 -174 144 11 47 -206 -106 -24 -233 -393 -170
6300a70P0lj03J95L73j39j55J88K97k08l17k41J34K80j66j64qL4k39K2L19n7J71
$$ -170 -100 -103 -206 -11 362 223 68 256 553 345 28 -213 -79 201 35 -129 -137 -103 -342 -320 -1 -58 113
6323A13m8L5L51j03q5l08l4L64J4k92j37J17l1j76j00j17K73j4J21J96l9j43J76
$$ 113 65 100 451 348 263 -45 -79 285 299 7 -130 -13 -44 -220 -320 -437 -164 -178 -57 139 100 -43 133
6346A33p4K91j28K32n85J46J28j87j3j46J97l86J36K97k35j36K0L17Q6p4j04M61
$$ 133 59 350 222 454 -131 15 143 -44 -57 -203 -6 -392 -256 41 -194 -330 -310 7 93 19 -85 376
6368C76j18k52nj13M64l17j75K17j60K32j88j20L63k08k1j91L28J42j8l49J18
$$ 376 258 6 1 -112 352 35 -140 77 -83 149 -39 -159 204 -4 -25 -216 112 254 236 -113 5
6389EJ91l04J04k00K95J83l15n8p2L18l01j87L68r0K00k61L05J71l76M1K11J62
$$ 5 196 -108 -4 -204 91 274 -41 -99 -171 147 -154 -341 27 -63 137 -124 181 352 -24 17 228 390
6411C90n21j30J41j08K24k22J79n7J26j18j29K98J7l58J90K05l2k19OM28R0k93
$$ 390 -131 -261 -120 -228 -4 -226 -47 -104 22 -96 -225 73 90 -268 -78 127 95 -124 -118 310 400 107
6433A07k62J32J68k13k76Q7K61P8k85J68M48l84q9J91m8L54l57R1j43K68l95k69
$$ 107 -155 -23 145 -68 -344 -257 4 82 -203 -35 413 29 -60 131 83 437 80 171 28 296 -99 -368
6455c68J9N6J93j09K40N6k20J23j54L22mk41J57J77O4p9l96P0J36q5j71q3K41
$$ -368 -349 -293 -100 -209 31 87 -133 -10 -164 158 154 -87 70 247 311 232 -164 -94 42 -43 -214 -297 -56
6478e6j54Q2J99j78L62k06n4J75L03j91K8k39P5R7o41O09q4l49J94Ql04j37L78
$$ -56 -210 -128 71 -107 255 49 -5 170 473 282 310 71 146 243 -398 211 127 -222 -28 -20 -324 -461 -83
6501h3j20QK57qo5K17K62m38jK27j86L8k57j76K85K1J87l83L32l48k41K29J87
$$ -83 -203 -195 62 54 -11 206 468 30 29 256 70 108 -149 -325 -40 -19 168 -215 117 -231 -472 -243 -56
6524e6L07l8m52L14K83k19j85J85k6J56k33k39K66k62q1l8K58j98Q7O4K16mo3
$$ -56 251 213 -239 75 358 139 -46 139 113 269 36 -203 63 -199 -280 -318 -60 -258 -171 -107 109 105 42
6547D2P3J4J80J06l79K93m50L02j88J20o3k97k77L2O33j62M3pN5K59Q6m15o5L18
$$ 42 115 129 309 415 36 329 -121 181 -7 113 50 -247 -524 -492 141 -21 22 15 70 329 415 0 -65 253
6571B53K61n44K14P7n09J97k07P2L03l22K06J12O5k36p2J58L25j26k22J54J77
$$ 253 514 -30 184 261 -248 -51 -258 -186 117 -205 1 113 178 -58 -130 28 353 227 5 159 336
6592C36j14n46J72OP2Q7O5j24L68q79L97J21j38J10J2Q9L73l22Q4j84J25M3m39
$$ 336 222 -324 -152 -146 -74 13 78 -46 322 -557 -160 -39 -177 -67 -55 34 407 85 169 -15 110 153 -286
6615b86J69lL22m28j66L61K21m53J93q6N84l10K13j77L8j62J00J03K3j56k04M2
$$ -286 -117 -120 202 -226 -392 -31 190 -263 -70 -156 428 118 331 154 192 30 130 233 256 100 -104 -62
6637f2J18j04k11J51J32J78n58L69m9N48m85j79K37R1J3k93K01k0m9l24M6j16
$$ -62 56 -48 -259 -108 24 202 -356 13 -36 512 27 -152 85 176 189 -104 97 77 28 -296 -250 -366
6659c66K42k50K78K25p2J21j38l6K35l08n3L90J4j93J2J6k90J49n6l04L05O0m24
$$ -366 -124 -374 -96 129 57 178 40 4 239 -69 -122 268 282 89 101 117 -173 -24 -80 -384 -79 -19 -443
6682d43L16J76J23j77j43M39N3M0j84J17j00j95J89l74L00o31L17M0K46q9j74
$$ -443 -127 49 172 -5 -148 291 344 384 200 317 217 22 211 -163 137 -494 -177 -137 109 20 -154
6703a54P8J40J21R1q4j6L6j78J68l27L40O9l74J20n2l4j8m48M30p5n3L52l5n4
$$ -154 -76 64 185 276 192 176 212 34 202 -125 215 284 -90 30 -22 -56 -74 -522 -92 -167 -220 132 97 43
6727D3m6JJ64L25k97O2J57l96L22n32J28m5l4O8J86J0k00N5l43P77k13l87K56
$$ 43 -3 -2 162 487 190 252 409 13 335 -197 -69 -114 -148 -80 106 116 -84 -29 -372 405 192 -195 61
6750F1L13J12k31l31N2J30m3k16j04L00l73J50K43m0k8p6J15K76k04j67P8K12
$$ 61 374 486 255 -76 -24 106 63 -153 -257 43 -330 -180 63 23 -5 -81 34 310 106 -61 17 229
6772B29j0O5k40J74j87J9k51m1K72j4l49J28K01P40p77K1K93l03J62j0j48J33
$$ 229 219 284 44 218 31 50 -201 -242 30 16 -333 -205 -4 736 -41 -20 273 -30 132 122 -26 107
6794A07k57k8p1K4L75k64L5k29K70j35J50O8L64k87l57K54L26n9p3k96L11k32
$$ 107 -150 -178 -249 -225 150 -114 -79 -308 -38 -173 -23 45 409 122 -235 19 345 286 213 -83 228 -4
6816dj88R7op1o0O0N0K45j82L3J56L3j80k27N81q8j31j57K21m31K03J27j83L05
$$ -4 -192 -95 -101 -172 -232 -172 -122 123 -59 -26 130 163 -17 -244 337 249 118 -39 182 -249 -46 81 -102 203
6840B03o0m28K27j66K40J30M7l74K81K08j22J16j5k10l61K63q5j06j41L8O1J63
$$ 203 143 -285 -58 -224 16 146 193 -181 100 308 186 302 287 77 -284 -21 -106 -212 -353 -315 -254 -91
6862i1j63M4M65k27J32l0K0j41L20m10M96m37L3r1L91o80K48o9j51L34j54j43
$$ -91 -254 -210 255 28 160 130 150 9 329 -81 415 -22 11 -80 311 -369 -121 -190 -341 -7 -161 -304
6884c04K65lQ1N2j5J52K17k58k09O2K09j77k96K46p6k68J12M9K23P8k68j1l5L3
$$ -304 -39 -42 39 91 76 228 445 187 -22 40 249 72 -224 22 -54 -322 -210 -161 62 140 -128 -139 -174 -141
6908a41K52k20L44j12p1J88r9K27k26q9m03M37j51j24J6J80M3j78K1K02j4j91
$$ -141 111 -109 235 123 52 240 141 368 142 53 -350 87 -64 -188 -172 8 51 -127 -106 96 82 -109
6930a09K55o9M0Q5j10k00K60K7p6l66L00k93o3J84J90p8j92J82K37j50j2J03j71
$$ -109 146 77 117 202 92 -108 152 179 103 -263 37 -256 -319 -135 55 -23 -215 -33 204 54 42 145 -26
6953b6N41n68P8o5L3K02L3p6k41J09k15n9K55J28j97K41j04J73k50k90L70J91
$$ -26 515 -53 25 -40 -7 195 228 152 -89 20 -195 -254 1 129 -68 173 69 242 -8 -298 72 263
6975B63k01j47J7p6L9K9l9j40N02o22K27kK05J05j1j92J26M02n61K06j6j91K23
$$ 263 62 -85 -68 -144 -105 -76 -115 -255 247 -375 -148 -150 55 160 149 -43 83 485 -76 130 114 -77 146
6998A46m18J86J48k12k44O39l03j26J89r4J18K47m72N72m62M63o23M42j06m15
$$ 146 -272 -86 62 -150 -394 245 -58 -184 5 -89 29 276 -196 376 -86 377 -246 196 90 -325
7018c25K90p0L41k90j28j62J00L66k21p5J21J26J91o1Q2L0j81Qk13M7L56l52j62
$$ -325 -35 -105 236 -54 -182 -344 -244 122 -99 -174 -53 73 264 203 285 315 134 142 -71 -24 332 -20 -182
7041a82J50j65L1Q4p9K35l51O2N83k30r1j04J81l2k2N8k32J57M4r1r1K51j57m00
$$ -182 -32 -197 -166 -82 -161 74 -277 -215 368 138 47 -57 124 92 70 128 -104 53 97 6 -85 166 9 -391
7065c91J99J60J76k12J42R6O0k58K4K84l20r5K33r2J38l04p5l0L27k55N4J18J76
$$ -391 -192 -32 144 -68 74 170 230 -28 -4 280 -40 -135 98 6 144 -160 -235 -265 62 -193 -139 -21 155
7088A55j69o0K91Nk27J66j25r6L99j20l90q5K54J15l38o9J74J22j24L68k3k2l62
$$ 155 -14 -74 217 222 -5 161 36 -60 339 219 -171 -256 -2 113 -225 -294 -120 2 -122 246 223 201 -161
7111a61J65J93K21k64m07J80M88n40J25j09P2J8j80R1N1Q3j32P7J23J94k04j32
$$ -161 4 197 418 154 -253 -73 415 -125 0 -109 -37 -19 -199 -108 -57 26 -106 -29 94 288 84 -48
7133d8L59r0J28k85K0j43J33k0K6r1mk38K22nL0m8k47K59K44L7k40O0K9J8k74
$$ -48 311 221 349 64 84 -59 74 54 80 -11 -15 -253 -31 -36 -6 -54 -301 -42 202 239 -1 59 88 106 -168
7158a68K04J4Q2l19j19K39J16k06j93M26o3n2J38Q1j01L33k15m75M24j05j34j6
$$ -168 36 50 132 -187 -306 -67 49 -157 -350 76 13 -39 99 180 79 412 197 -278 146 41 -93 -109
7180a09J75J75m16K6J04r4R7J9K6KJ3L2j13K38j12r7j74J78J6l8k03J42K1k33
$$ -109 66 241 -175 -149 -45 -139 -42 -23 3 5 18 50 -63 175 63 -34 -208 -30 -14 -52 -255 -113 -92 -325
7204c25K24j09J57l08L58N5n4N7J50k66K72k26N4k6r2K74o06L09j70L98J3l79
$$ -325 -101 -210 -53 -361 -3 52 -2 55 205 -61 211 -15 39 13 -79 195 -411 -102 -272 126 139 -240
7226b40L41j83M0J61j16J19k27J62L0j57j9k7p5Rk64L22o3P7J65k29O4K56P3k02
$$ -240 101 -82 -42 119 3 122 -105 57 87 -70 -89 -116 -191 -182 -446 -124 -187 -110 55 -174 -110 146 219 17
7250A7Q6L3J49r1p9j59R3R3j67Q8Q4l60k01J25L09j16k21K77N2M0j11NM47k02
$$ 17 103 136 285 194 115 -44 49 142 -25 63 147 -213 -414 -289 20 -96 -317 -40 12 52 -59 -54 393 191
7274A91J20j52J00k39K2k91J75J07j56m5j09J74j6J60j17P9K03j50j57M11k1k28
$$ 191 311 159 259 20 42 -249 -74 33 -123 -168 -277 -103 -119 41 -76 3 206 56 -101 310 289 61
7296F1K83k09Q1j95o3J4J97l39lr4J73m69L57R5L47j10K54k11J85J14l23j26o5
$$ 61 344 135 216 21 -42 -28 169 -170 -173 -267 -94 -563 -206 -111 236 126 380 169 354 468 145 19 -46
7319d6J00J4J2l73L19p5R4j38J51j05O4j6j43K71M0j88J22K50n45P4j8ON1j45
$$ -46 54 68 80 -293 26 -49 45 -93 58 -47 17 1 -142 129 169 -19 103 353 -192 -118 -136 -130 -79 -224
7343b24l0L81j80R1j12K12Oo7j08M07o86L42oj40K20K1j97J68j41Rj22l2K78j3
$$ -224 -254 127 -53 38 -74 138 144 77 -31 376 -310 32 26 -114 106 127 -70 98 -43 -34 -156 -188 90 77
7367G7k10n6J6J60K12Qj23Q9Lj84J43m7j09j23j07J54J14j97K2J46j09J76j77
$$ 77 -133 -189 -173 -13 199 207 84 173 176 -8 135 88 -21 -144 -251 -97 17 -180 -158 -12 -121 55 -122
7390a22K87l83j61J59O86k47j67j5m0Q2j41O9l16Q2K32n15L71Q4p0J89l15nM38
$$ -122 165 -218 -379 -220 466 219 52 37 -3 79 -62 7 -309 -227 5 -510 -139 -55 -125 64 -251 -256 182
7413A82qk78K79Rl8l48J49Q6l0j61M0J95L0j86M61l69j89K66k87L00K4M8J9QM4
$$ 182 174 -104 175 184 146 -202 -53 33 3 -158 -118 77 107 -79 382 13 -176 90 -197 103 127 175 194 202 246
7438B46k09p0r4K92k91j93K44o4N7r0O1K92j3l08m3J86J67k54O2M00k26n0l50
$$ 246 37 -33 -127 165 -126 -319 -75 -139 -82 -172 -111 181 168 -140 -183 3 170 -84 -22 378 152 102 -248
7461b48J10j73J86K07n14N89j08k17K20j04M47k03l2j2kK27n86K52L24j87l87
$$ -248 -138 -311 -125 82 -432 157 49 -168 52 -52 395 192 160 148 146 373 -213 39 363 176 -211
7482b11P2J9J97Pk48J22l23L08K9N5Q8k2nn5P2j52L1Q1k77K70k09j35ML01o4J61
$$ -211 -139 -120 77 84 -164 -42 -365 -57 -28 27 115 93 88 33 105 -47 -16 65 -212 58 -151 -286 -282 19 -45 116
7508A16n80L93J40k88J29J54N0j88N2K73k31k01J99L11j65l37q3J37o4J71J18
$$ 116 -464 -71 69 -219 -90 64 114 -74 -22 251 20 -181 18 329 164 -173 -256 -119 -183 -12 106
7529A06j94J23K99j78J44k38L74m96J29K17j93ql00L2Q4j01j40J31J96p5k76N71
$$ 106 -88 35 334 156 300 62 436 -60 69 286 93 85 -215 -183 -99 -200 -340 -209 -13 -88 -364 207
7551B07j58p5q5K56K04n06k7L16R6R7m88r5J23j0J36j54J67Q2J13k50K86o2r6
$$ 207 49 -26 -111 145 349 -157 -184 132 228 325 -163 -258 -135 -145 -9 -163 4 86 199 -51 235 173 77
7574G7l57J91N27l84j6N5n1j91J91l6n7j12K66l48M45k24P9k07J82L04n03J82
$$ 77 -280 -89 438 54 38 93 42 -149 42 6 -51 -163 103 -245 200 -24 55 -152 30 334 -169 13
7596A3M02j02k27J3m66L46K3j7L1j09p1m8J75l8k32K89mJ8L32o2j56k66J57Q8
$$ 13 415 313 86 99 -367 -21 2 -15 16 -93 -164 -212 -37 -75 -307 -18 -22 -4 328 266 110 -156 1 89
7620H9ko4q5k80k2J06K37l28K90l04M56M0k32L16j01O5r6j80n6M28j12m65K65
$$ 89 87 23 -62 -342 -364 -258 -21 -349 -59 -363 93 133 -99 217 116 181 85 -95 -151 277 165 -300 -35
7643c5r4K76j27l28L41J8k22nM14K3j14K10j61k4J90l28L38l86J84l79K89j5Q0
$$ -35 -129 147 20 -308 33 51 -171 -176 238 261 147 357 196 172 362 34 372 -14 170 -209 80 65 145
7666A45m74J50L22l93R4J47J04K11k53m9Q5j76K36m37L02J2j94k11L14l2j09L27
$$ 145 -329 -179 143 -250 -156 -9 95 306 53 4 89 -87 149 -288 14 26 -168 -379 -65 -97 -206 121
7688A21l88K84K65o59L98L61m27k2K35OLL3l15K4J86j75j59K9L7l3J63j53L32
$$ 121 -267 17 282 -377 21 382 -45 -67 168 174 177 210 -105 -81 105 -70 -229 -200 -163 -196 -33 -186 146
7711A46j7Q3m69M55j06O4l20n0K44M8P6k86J80k33N2j21L83l3l67O2K33K7J05
$$ 146 129 212 -257 198 92 156 -164 -214 30 78 154 -132 48 -185 -133 -254 129 96 -271 -209 24 51 156
7734A56j89N66k50K1l19mJ24j62j28j23J16K60l05j03J69L34j19k32L74O3j97
$$ 156 -33 533 283 304 -15 -19 105 -57 -185 -308 -192 68 -237 -340 -171 163 44 -188 186 249 52
7755E2q0L4K35j10k12%M02l47N0j23j1Jm03N23k17K71k79M68k26r6MK39l53L43
$$ 52 -28 6 241 131 -81 -81 321 -26 24 -99 -110 -109 -512 11 -206 65 -214 254 28 -68 -64 175 -178 165
7779A65J65m45k13K28K62k39j6m4J98l27J02M36j39l87K70mj07J25q2M1J51M7
$$ 165 330 -115 -328 -100 162 -77 -93 -137 61 -266 -164 272 133 -254 16 12 -95 30 -52 -11 140 187
7801A87k27m97M13p2nMlK68o8q7K93k34K81l23L38k57K72q8k47K68n50K56k47
$$ 187 -40 -537 -124 -196 -201 -197 -200 68 0 -87 206 -28 253 -70 268 11 283 195 -52 216 -334 -78 -325
7824c25J44K53k75J43j27K65k35K89q8L16l21R3j3r3M4j9j49J90J19k46k17J32
$$ -325 -181 72 -203 -60 -187 78 -157 132 44 360 39 132 119 26 70 51 -98 92 211 -35 -252 -120
7846a20j66L10j92k8L40j2n22K30N39j99k7K97j63j05j51K9J79Qn04J4L2J47J72
$$ -120 -286 24 -168 -196 144 132 -390 -160 379 180 153 450 287 182 31 60 239 247 -257 -243 -211 -64 108
7869A08l35N4J30J12j47k07O43n12O18l18J30k26rR3l7k04k64L08K57l75P8j47
$$ 108 -227 -173 -43 69 -78 -285 358 -154 464 146 276 50 41 134 97 -107 -371 -63 194 -181 -103 -250
7891b50K01M3oP0r1M67k42j42J40J39P6m14j93J44r2J04r2J37k30k2L76Kj93p3
$$ -250 -49 -6 -12 58 -33 434 192 50 190 329 405 -9 -202 -58 -150 -46 -138 -1 -231 -253 123 125 -68 -141
7915a41n7L52j09P0j48n0M85j29q22N32Q8k32j04J42N5k74M03k72J11M13k29n5
$$ -141 -198 154 45 115 -33 -83 402 273 -549 -17 71 -161 -265 -123 -68 -342 61 -211 -100 313 84 29
7937B9q5j15L09l23M96j46k42L1k77K91o3J60j15k4n5J27J26j31L8l94K76N1M0
$$ 29 -56 -171 138 -185 311 165 -77 -46 -323 -32 -95 65 -50 -74 -129 -2 124 -7 31 -363 -87 -36 4
7960Dl7o7j76K35l5O4m5J60k31L7k50N84j00J20n00J69K78J2k04L5p0J49j84k31
$$ 4 -33 -100 -276 -41 -76 -12 -57 103 -128 -91 -341 243 143 263 -237 -68 210 222 18 53 -17 132 -52 -283
7984b83M10k21p9r4L7J70r5k44R7K76K44k84J12j31K68j34K2J83j85j99K52j03
$$ -283 127 -94 -173 -267 -230 -60 -155 -399 -302 -26 218 -66 46 -85 183 49 71 254 69 -130 122 19
8006A9j12o2j01L01n3l6m2o6L99l8k87Q1O6J37j11m7n3K5j02J02l26K19M5j80
$$ 19 -93 -155 -256 45 -8 -44 -86 -152 247 209 -78 3 69 206 95 48 -5 20 -82 20 -306 -87 -42 -222
8030b22R8L72l05N0L74j2k27l30K13j0K00k70j58L11r0l25j7L54q6J11k12J31
$$ -222 -124 248 -57 -7 367 355 128 -202 11 1 201 -69 -227 84 -6 -331 -348 6 -80 31 -181 -50
8052e0p3J26j64K95J47l57J63J52N1n00L29k5l19L89o59L80J53J61j19n74K97
$$ -50 -123 3 -161 134 281 -76 87 239 290 -210 119 94 -225 164 -495 -115 38 199 80 -494 -197
8073a97L22j09J8R4n9J03j51J66j56L80n71M19k65l4j20j88K17M9KM5LO8j61j19
$$ -197 125 16 34 128 69 172 21 187 31 411 -160 259 -6 -40 -160 -348 -131 -82 -80 -35 -32 36 -125 -244
8097b44N05j80N9J17l22J32P9j54M8j56Oj56L25o6K9l6J57%M6k7l37L81K08l81
$$ -244 261 81 140 257 -65 67 146 -8 40 -116 -110 -266 59 -7 22 -14 143 143 189 162 -175 206 414 33
8121C3j11J41j57j46j60M06l09J18J63j97J71k06J44K19k24L1L9M9j30L30P1n60
$$ 33 -78 63 -94 -240 -400 6 -303 -185 -22 -219 -48 -254 -110 109 -115 -84 -45 4 -126 204 275 -285
8143b85j5J97K8j67J88k45N40m71k0J48J25K19L9l24o8L24k28MK48J04n08L54
$$ -285 -300 -103 -75 -242 -54 -299 241 -230 -250 -102 23 242 281 -43 -111 213 -15 -11 237 341 -167 187
8165A87M1k52j22j13K54J08k50L51k24L5N8k38J0L98p5j94L5J73j32k87L28l11
$$ 187 228 -24 -146 -259 -5 103 -147 204 -20 15 73 -165 -155 243 168 -26 9 182 50 -237 91 -220
8187b20J24K41k76K13
$$ -220 -96 145 -131 82
8191H2
$$ Imaginary data points
##PAGE= N=2
##DATA TABLE= (X++(I..I)), XYDATA
0@%%%%%%%%%qJ6j6K4l2L4m2N6p2Q8j04J27j52J77k10K50k95L43l97M58n26O03
$$ 0 0 0 0 0 0 0 0 0 0 -8 8 -8 16 -16 18 -24 32 -40 48 -56 71 -81 96 -114 136 -159 184 -213 245 -281 322
31C22o88P82q87J005j134J273j427J598j786J989k212K456k722L014l332L678
$$ 322 -366 416 -471 534 -600 673 -754 844 -942 1047 -1165 1291 -1431 1583 -1749 1929
47A929m057M472m926N425n977O589p267Q024q875R837j0938J2210j3698J5470
$$ 1929 -2128 2344 -2582 2843 -3134 3455 -3812 4212 -4663 5174 -5764 6446 -7252 8218
61H218j7622K0297k3726K8309l4783M4678o1843R9896l35458J51414M88972n40193
$$ 8218 -9404 10893 -12833 15476 -19307 25371 -36472 63424 -272034 -120620 368352 -171841
73a71841p2430M15909J8130l18754J29130J19713j03889j4393Q5033j04636r755
$$ -171841 -244271 171638 189768 -128986 144 119857 15968 1575 86608 -18028 -27783
84b7783R9753m4979j19723P5176N8504q7548n5078Q7549L9308n1928k8096O0725
$$ -27783 71970 26991 -92732 -17556 40948 -46600 -101678 -14129 25179 -26749 -54845 5880
96E880L8503k0693j9635K5288J9444k687k8981k5101K2624K7127n9781m8849O2506
$$ 5880 44383 23690 4055 29343 48787 46100 17119 -7982 14642 41769 -18012 -66861 -4355
109d355L0094q4434j2673Q7399k133o4439L3053N3733j9922q244K5372q999p620
$$ -4355 25739 -58695 -71368 16031 13898 -50541 -17488 36245 16323 8079 33451 24452 16832
122A6832J8784k2305l2719L0893J5979n7240k0632N2283L441n6024M603N6591
$$ 16832 35616 13311 -19408 11485 27464 -29776 -50408 1875 5316 -50708 -46105 10486
134A0486J14l5698J8391M1070p222k0746J2490J0080j1596l965l511j6562j36
$$ 10486 10600 -25098 -6707 34363 27141 6395 18885 28965 17369 13404 9893 -6669 -6805
147f805Q021k3041j6838K8545J2495l0803K84L7473K140j7869J5421J8020p316
$$ -6805 1216 -21825 -38663 -10118 2377 -28426 -28142 9331 11471 -6398 9023 27043 19727
160A9727j310K528j3127m36R809j8662k2103J4125Q556k4105m894K4368K552j4684
$$ 19727 18417 20945 7818 7382 17191 -1471 -23574 -9449 -893 -24998 -29892 -5524 -2972 -17656
174a7656Q943J7064o47K073J0113m414m387J2298l279k4543k49J8037j5512k7714
$$ -17656 -8713 8351 7704 9777 19890 15476 11089 23387 20108 -4435 -4684 13353 -2159 -29873
188b9873J0567J9069j3666j2808J3012J2278J29J819L156P039J3859j219j8310
$$ -29873 -19306 -237 -13903 -26711 -13699 -1421 -1292 527 3683 10722 24581 23362 5052
201E052J917J9429r678k9496L088J8353j5211k4763Q187J7251n667r496O830J4062
$$ 5052 6969 26398 16720 -12776 -9688 8665 -6546 -31309 -23122 -5871 -11538 -21034 -14204 -142
215a42J0870j767q048J1016K1184j0951k5496J2402K2132k2515l1923J1488J7004
$$ -142 10728 8961 913 11929 33113 22162 -3334 9068 31200 8685 -23238 -11750 5254
228E254j7758k1241Q427J8712J102j2752J458K4502J4475j4476r105K2360J5818
$$ 5254 -12504 -33745 -25318 -6606 -5504 -18256 -16798 7704 22179 7703 -1402 20958 36776
241C6776k1318j9836J5772J4817k6279k7328J3816J8546k0531k1269J4513K2030
$$ 36776 15458 -4378 11394 26211 -68 -27396 -13580 4966 -15565 -36834 -22321 -291
253b91m647j2860P206K4585J1029j7707r298K6617J4505l0414k0187K4924J0125
$$ -291 -4938 -17798 -10592 13993 25022 7315 -1983 24634 39139 8725 -11462 13462 23587
266B3587l2879j9611K0143J1377j9571j6416J2660K1932j097j4939O273K8417
$$ 23587 -9292 -28903 -8760 2617 -16954 -33370 -20710 1222 125 -14814 -8541 19876
278A9876O939k3488l957K8109O916l2386j3162K4859M419l2949j3580K1574P508
$$ 19876 26815 3327 -630 27479 34395 2009 -11153 13706 18125 -14824 -28404 -6830 678
291F78k0589j0024J6694J7426l179j2084P917K4362L554k1789q65K5798L53l1833
$$ 678 -19911 -29935 -13241 4185 1006 -11078 -3161 21201 24755 2966 2101 27899 28252 -3581
305c581p386K2211j340k7893o674J8431L722j5308m518J4231J3296j816r683P121
$$ -3581 -10967 11244 9904 -17989 -24663 -6232 -2510 -17818 -22336 -8105 5191 3375 -6308 813
319H13K1246K76k0336J658K0503o768k6330J76J7675q241k0720J794J3155k76
$$ 813 22059 22335 1999 3657 24160 17392 -8938 -8762 8913 672 -20048 -18254 -5099 -5375
333e375q364P7R202J1546n5q349N481J6939k341j8220J752J4998q237j9369K812
$$ -5375 -13739 -13662 -4460 7086 7031 -1318 4163 21102 18761 541 2293 17291 9054 -10315 -7503
348g503J0191q741j1346L615O556Q83L70R75K918R523L673p194J050J3017k172
$$ -7503 2688 -6053 -17399 -13784 -7228 -6345 -5975 -5000 -2082 7441 11114 3920 4970 17987 15815
363A5815j4625o11Q710p093j2626J999L300n850j873L266Q42M367O813k002k313
$$ 15815 1190 579 9289 2196 -10430 -8431 -5131 -10981 -12854 -9588 -8746 -4379 2434 432 -1881
378a881J1555O726r019k339R036j277j1226k466P49m240l288k399m082J883P523
$$ -1881 9674 16400 7381 5042 14078 12801 1575 -891 -142 -4382 -7670 -10069 -14151 -12268 -4745
393d745k485m601J0168J1578n644m754J2181R001j0415p580O217K154r317q083
$$ -4745 -7230 -11831 -1663 9915 4271 -483 11698 20699 10284 2704 8921 11075 1758 -6325
407f325q00J158m71p005n718Q717J1262p279p024J6149J5240j0917q337J5095
$$ -6325 -7125 -5967 -6438 -13443 -19161 -10444 818 -6461 -13485 2664 17904 6987 -1350 13745
421A3745R181j2768j0836N371N529q346j3068k730P823J255j2275m537J6449J0269
$$ 13745 22926 10158 -678 4693 10222 1876 -11192 -13922 -6099 -4844 -17119 -21656 -5207 5062
435E062j1659m949J9994J2748j3462p991J5354Q501j5045j2117O760O436j0471
$$ 5062 -6597 -11546 8448 21196 7734 -257 15097 23598 8553 -3564 3196 9632 -839
448h39j5057m95J1235J531j5006k523K0834Q923j6650k434K4999R520j8893n595
$$ -839 -15896 -16391 -5156 -3625 -18631 -21154 -320 8603 -8047 -10481 14518 24038 5145 -450
462d50J7797N267j7810j0880P227O118j0969j5452J918J5129q77j7336J841K2883
$$ -450 17347 22614 4804 -6076 1151 7269 -3700 -19152 -17234 -2105 -2982 -20318 -18477 4406
476D406M794j6895K122K3340M339j8588l188J6327K650j7907r929Q650N826j2579
$$ 4406 9200 -7695 -5573 17767 22106 3518 330 16657 19307 1400 -8529 121 5947 -6632
490f632j3786N749J4585l758j5459N544K2703J244j7082M331K2397o19j8455j55
$$ -6632 -20418 -14669 -84 -3842 -19301 -13757 8946 10190 -6892 -2561 19836 19217 762 607
504F07J4808q68j5945p146O338N124r646j2546O255J5014m602j4159R432J9548
$$ 607 15415 14547 -1398 -8544 -2206 2918 -6728 -19274 -13019 1995 -2607 -16766 -7334 12214
518A2214l930j3517P547J5387l568j2676L08Q709j896j2672o858O597N464q782
$$ 12214 8284 -5233 2314 17701 14133 1457 1765 10474 8578 -4094 -10952 -4355 1109 -7673
532g673r119P550J1587m492q555Q783J3425l213q972N504R198l948r116j02M261
$$ -7673 -16792 -9242 2345 -2147 -10702 -1919 11506 8293 -679 4825 14023 10075 959 857 5118
547E118k934p818l150L234L034m601n049N490Q866j784m856O608R053l547n326
$$ 5118 2184 -5634 -8784 -5550 -2516 -7117 -12166 -6676 2190 406 -4450 2158 11211 7664 2338
562B338M164L953m362n443j213n34j048l186l872M45M925j714l720N056P710J10
$$ 2338 6502 10455 6093 650 -563 -1097 -2145 -5331 -9203 -8758 -3833 -5547 -9267 -4211 3499 3609
578C609l160L932M842q50k435m86L0j163l365m225k866J761p73m989o50O337K402
$$ 3609 449 4381 9223 8373 5938 5452 5482 4319 954 -3271 -6137 -4376 -5149 -10138 -10788 -4451 -2049
595b049l450K042P687K713k679P03L624K205k190n328k791K086o98r250l600O321
$$ -2049 -5499 -3457 4230 6943 4264 4967 8591 10796 8606 3278 487 2573 1875 -7375 -10975 -4654
611d654J496q781j034J0124M506m497m78Q288O218l291l945L022N644l508r620
$$ -4654 -3158 -11939 -12973 -2849 1657 -2840 -3318 4970 11188 7897 3952 6974 12618 9110 -510
626e10k464N418p63j1335l932Q634K669r342j958J2408O208o573j291J0016O351
$$ -510 -2974 2444 1681 -9654 -13586 -4952 -2283 -11625 -13583 -1175 5033 -1540 -2831 7185 13536
641A3536n125n495L340O320m327j2103j842R338k663j4815j610J2958J126j1186
$$ 13536 8411 2916 6256 12576 8249 -3854 -5696 3642 979 -13836 -15446 -2488 -1362 -12548
655a2548R19J3792M417p183j081R652P049n820q164M001Q105p061j3615J473R609
$$ -12548 -11629 2163 6580 -603 -1684 7968 15017 9197 1033 5034 13139 6078 -7537 -6064 3545
670C545n172j3635J208J2772O32j0280Q36J4475M116r086q96J2086N414r215p298
$$ 3545 -1627 -15262 -14054 -1282 -650 -10930 -10094 4381 8497 -589 -1485 10601 16015 6800 -498
685d98N367O366q111j2479K645R895n586j4109M453J3445j929j0209M438J2864
$$ -498 4869 11235 3124 -9355 -6710 3185 -2401 -16510 -12057 1388 -541 -10750 -6312 6552
699F552J660p109l92R372L764r102p270O397N858j0133j0640N362P768p263r083
$$ 6552 8212 1103 711 10083 13847 4745 -2525 3872 9730 -403 -11043 -5681 2087 -5176 -14259
714a4259N827J0435j953p464M219J0952R16p299q6P795K015q610n467N513L401
$$ -14259 -8432 2003 50 -7414 -3195 7757 8673 1374 1288 9083 11098 2488 -2979 2534 5935
729E935q736q274M927O935n887o520O518Q388k735n313N138P738l88n085n60N073
$$ 5935 -2801 -11075 -6148 787 -5100 -11620 -5102 3286 551 -4762 376 8114 7726 2641 2081 7154
745G154P54p349m641M369K339p729n301N374M512m379k983N069N544p73j962K791
$$ 7154 7908 559 -4082 287 2626 -5103 -10404 -5030 -518 -4897 -7880 -2811 2733 1960 -2 2789
761B789M800mm157j376K568K99n415m095J820J585m223l343L129L622j079j596
$$ 2789 7589 7585 3428 2052 4620 4919 -496 -4591 -2771 -1186 -5409 -8752 -5623 -2001 -3080 -4676
777d676L550M208J381n00K64J780J257k153m173L72J214l507m897L82J761j470
$$ -4676 -1126 3082 4463 3963 4227 6007 7264 5111 938 1310 2524 -983 -5880 -5498 -3737 -5207
793e207k228J403L345K056K61L51L530L795o04k963Q11L323k260o027j162K196
$$ -5207 -7435 -6032 -2687 -631 -370 -19 3511 7306 6702 3739 4550 7873 5613 -414 -1576 620
809F20k069n764j413L381J451k259o27L817N319o9k225L436N890r48n822M47N000
$$ 620 -1449 -7213 -8626 -5245 -3794 -6053 -6680 -2863 2456 2387 162 3598 9488 8540 2718 3165 8165
826H165k285q066j958L295j008o092k094M712L232l134k432N864P476j450m283
$$ 8165 5880 -2186 -4144 -849 -1857 -7949 -10043 -5331 -2099 -5233 -7665 -1801 5675 4225 -58
841e8M064P553k698p658R07O139l204r647j738N464p25o950k526O719L957m233
$$ -58 4006 11559 8861 1203 2110 8249 5045 -4602 -6340 -876 -1601 -8551 -11077 -4358 -401 -4634
857d634l087Q135P813l747n179N867O916l779q781J744O402m304j0334q49P239
$$ -4634 -7721 414 8227 4480 -699 5168 12084 8305 -476 1268 7670 3366 -6968 -7817 -578
872e78p63q444j194Q653L708n814j495Q615O703n350n331O861O952o304q400K785
$$ -578 -1341 -9785 -10979 -2326 1382 -4432 -5927 2688 9391 4041 -1290 5571 12523 6219 -2181 604
888F04N809m942r859R97P250j524p819O9Q845L374o094j271Q986N066o080m161
$$ 604 6413 1471 -8388 -7391 -141 -1665 -9484 -9415 -570 2804 -3290 -4561 4425 9491 3411 -750
904g50O773N004p223p640L550N410o059p723K388O094j586o732J231Q620K183
$$ -750 6023 11027 3804 -3836 -286 5124 -935 -8658 -6270 -176 -1762 -8494 -7263 1357 3540
919C540n570p77Q327L924o706l408O179L160p484o120L880L711n137n628J870
$$ 3540 -2030 -2807 5520 9444 2738 -670 5509 8669 1185 -4935 -1055 2656 -2481 -8109 -6239
934f239N757j388m667K143P189J473m753j29P058J263n534k631M482J418o393
$$ -6239 -482 -1870 -6537 -4394 2795 4268 -485 -614 6444 7707 2173 -458 4024 5442 -951
949i51m238L214K119l876l984K968M285o16k660J867N546J262l444J57M258P69
$$ -951 -5189 -1975 144 -3732 -7716 -4748 -463 -1079 -3739 -1872 3674 4936 1492 1649 5907 6676
965F676m192k577J979L57m311l247J809J420k111j698J574L531J291j221P38L631
$$ 6676 2484 -93 1886 2243 -2068 -5315 -3506 -2086 -4197 -5895 -4321 -790 501 -720 18 3649
981C649K026j909j052K152O26l530k702L92J51k492k485k59J308R33j435K94L411
$$ 3649 5675 3766 2714 4866 5492 1962 -740 -348 -197 -2689 -5174 -5433 -4125 -3192 -4627 -4333 -922
998i22K825l29p01K740L113j067k796L99J031j941l256j952N32p4k428k483K416
$$ -922 1903 1574 873 3613 6726 5659 2863 3262 4293 2352 -904 -2856 -2324 -2398 -4826 -7309 -4893
1015d893L129r56j488L425M318j04j811K099L381o00l995p57J735p18n053l098
$$ -4893 -1764 -2720 -4208 -783 3535 3431 1620 3719 7100 6500 2505 1748 3483 2765 -2288 -5386
1031e386K159J157l650k473M036M186j986k120M409N353j025l533K329M624j525
$$ -5386 -3227 -2070 -5720 -8193 -4157 29 -1957 -4077 332 5685 4660 1127 3456 8080 6555
1046F555n231j815L770o22o227l327M034J514m531k529N321M302k565k688N121
$$ 6555 1324 -491 3279 2657 -3570 -6897 -2863 -1349 -5880 -8409 -3088 1214 -1351 -4039 1082
1061A082O105j929m278J923N181j936o639o55M165j356p078k032N229J438m885
$$ 1082 7187 5258 980 2903 8084 6148 -491 -1146 3019 1663 -5415 -7447 -2218 -780 -5665
1076e665k261O178M410l256k899N757N541l098n040L331M426k804o668L0M270
$$ -5665 -7926 -1748 2662 -594 -3493 2264 7805 4707 -333 2998 7424 4620 -2048 -2018 2252
1091B252j501o854j323N780J688n426j565O948M031m037k093N542M189l420m505
$$ 2252 751 -6103 -7426 -1646 42 -5384 -6949 -1 4030 -7 -2100 3442 7631 4211 -294
1106b94K631M163l688o311J46M928j776o206L7N967O60m890l63O402K862l561
$$ -294 2337 6500 2812 -3499 -3353 1575 -201 -6407 -6370 -403 257 -4633 -4996 1406 4268 707
1122G07j681M735L642m485l664K424K884l541n488J182L801j712n032J278M962
$$ 707 -974 3761 7403 2918 -746 1678 4562 1021 -4467 -3285 516 -1196 -6228 -4950 12
1137A2K88l388M29N557J821l468r98L666J711l305l366J697K296l575m080J312
$$ 12 300 -3088 -2659 2898 4719 1251 253 3919 5630 2325 -1041 656 2952 -623 -4703 -3391
1153c391L197j895l177J159M410O43k418O31L974J876k860j339K694R19l018k738
$$ -3391 -194 -2089 -5266 -4107 303 946 -1472 -841 3133 5009 2149 810 3504 4423 1405 -1333
1169a333J070J038k516l019Q43K145l15j828J128L244J276j075J51K774J378j824
$$ -1333 -263 775 -1741 -4760 -3917 -1772 -2087 -3915 -2787 457 1733 658 809 3583 4961 3137
1185C137j195P63Q70k437k740l04R66j099k391Q9J870O77m54J30K506K118j55
$$ 3137 1942 2705 3575 1138 -1602 -1906 -940 -2039 -4430 -4341 -2471 -1794 -2248 -2118 388 2506 2351
1202B351n98J563J820j192j907l41M47j242k857j258R30K73j818j369K344J980
$$ 2351 1753 3316 5136 3944 2037 1696 2143 901 -1956 -3214 -2284 -2011 -3829 -5198 -2854 -874
1218h74k53o08K268K868K41j396M92J830J01l138j472J206k60l290k396J740J057
$$ -874 -1127 -1735 533 3401 3642 2246 2738 4568 4669 1531 59 1265 1005 -2285 -4681 -2941 -1884
1235a884j691j998K493L631m22j605J865M008m5k353K1K817K0m305j871J958M86
$$ -1884 -3575 -5573 -3080 551 129 -1476 389 4397 4352 1999 2020 4837 4857 552 -1319 639 1125
1252A125l898k560K503J837k448k125L140M227j064k505K974L963l90l742L96
$$ 1125 -2773 -5333 -2830 -993 -3441 -5566 -2426 1801 737 -1768 1206 5169 4779 1037 1433
1267A433L374q24m532j645K686M51m219k591L334K348k955j830L647M206j852
$$ 1433 4807 3983 -549 -2194 492 943 -3276 -5867 -2533 -185 -3140 -4970 -1323 2883 1031
1282A031k400K735M337j381m061N41L593j296n098r93L494K23n009j806M544K170
$$ 1031 -1369 1366 5703 4322 261 802 4395 3099 -1999 -2992 502 725 -4284 -6090 -1546 624
1298F24l377j292M047L490k466k137L175L694k287m283J245L373j430n565l8L597
$$ 624 -2753 -4045 2 3492 1026 -1111 2064 5758 3471 -812 433 3806 2376 -3189 -3227 370
1314C70m15m390m66M061J843l118j013M403K595k301k210K884K709k449l849J319
$$ 370 -45 -4435 -4901 -840 1003 -2115 -3128 1275 3870 1569 -641 2243 4952 2503 -1346 -27
1330b7K682j955m560M19L249o85l059n8M089J329k475n10L846K162l022j458K376
$$ -27 2655 700 -3860 -3441 -192 -877 -3936 -3994 95 1424 -1051 -1561 2285 4447 1425 -33 2343
1347B343J757k511l166R62K072j837l542M81K695J00k853N69L353J139j486k74
$$ 2343 4100 1589 -1577 -615 1457 -380 -3922 -3441 -746 -646 -3499 -2930 423 1562 76 -198
1363a98K907J415j885j599J497J004k286k652O27J687k090k349O93K229K26j436
$$ -198 2709 4124 2239 640 2137 3141 855 -1797 -1170 517 -1573 -3922 -3229 -1000 -774 -2210
1379b210N11K626R84q79n1J888J139j457j898N35J105j959k072k40P64p62j298
$$ -2210 -1699 927 1911 1032 981 2869 4008 2551 653 1188 2293 334 -1738 -1978 -1214 -1976 -3274
1396c274j58K011P75m93k0J600K028j67r74J159J196j107j524o21N26j034j858
$$ -3274 -3432 -1421 -646 -1139 -1159 441 2469 2302 1328 2487 3683 2576 1052 431 957 -77 -1935
1413a935j103Q22L41j016k68J207J786J84m85J473K041J86j310L1J319o52k071
$$ -1935 -3038 -2216 -1875 -2891 -3159 -1952 -166 18 -467 1006 3047 3233 1923 1954 3273 2621 550
1430E50j040O86l25j913j659J052J541j199j233J421K800N8j204J114K851J14
$$ 550 -490 196 -129 -2042 -3701 -2649 -1108 -2307 -3540 -2119 681 739 -465 649 3500 3614
1446C614k055k92J899k95k745j456R94M68k070j786J033J934j004j837K166L072
$$ 3614 1559 1267 3166 2871 126 -1330 -336 132 -1938 -3724 -2691 -757 -1761 -3598 -1432 1640
1462A640k42j812R81L265j71k872k49K447n59k961j688J541O77k331j923K145
$$ 1640 1398 -414 567 3832 3661 789 540 2987 2428 -533 -2221 -680 -3 -2334 -4257 -2112
1478b112K159j231j644J922L319o81k357J494L167r76k725k93K593p82l404j065
$$ -2112 47 -1184 -2828 -906 2413 1732 -625 869 4036 3060 335 42 2635 1853 -1551 -2616
1494b616K043P97k898j190K325J970j460j618K700L083j564j945J212L276j328
$$ -2616 -573 224 -2674 -3864 -1539 431 -1029 -2647 53 3136 1572 -373 839 4115 2787
1509B787l380L97K339j203l223n59K543L69k553j013K762K129j996j563L227K348
$$ 2787 -593 -196 2143 940 -2283 -2842 -299 70 -2483 -3496 -734 1395 -601 -2164 1063 3411
1525C411j746k124J887J892j748k793M69K038q39l054m13K436K58k363k78L038
$$ 3411 1665 -459 1428 3320 1572 -1221 -752 1286 447 -2607 -3020 -584 -326 -2689 -2967 71
1541G1J499j663p89K185K026j523k000J444J459j784k581N36J423p71k395N9K152
$$ 71 1570 -93 -882 1303 3329 1806 -194 1250 2709 925 -1656 -1120 303 -468 -2863 -2804 -652
1558f52Q4j106l21K660J380j571n94K384J140j793j141O60Q89j709k073j42J593
$$ -652 -568 -1674 -1995 665 2045 474 -120 2264 3404 1611 470 1130 2019 310 -1763 -1905 -312
1575c12q37j660O0K152K99j145N71J813R21q43l78J458Q13j485j081K02L81q82
$$ -312 -1149 -2809 -2749 -597 -298 -1443 -872 941 1862 1019 641 2099 2912 1427 346 548 929 47
1593D7j751l4N50K8j286j21J619J075m72K1J395J058m66m51R30M32q15j574k93
$$ 47 -1704 -1738 -1188 -1160 -2446 -2567 -948 127 -345 -324 1071 2129 1663 1212 2142 2574 1759 185 -108
1612a08K72m59j543n75N83K19m35m44J360J373J0k75J034J495k95o07k03Q46m29
$$ -108 164 -295 -1838 -2413 -1830 -1611 -2046 -2490 -1130 243 253 -22 1012 2507 2212 1605 1402 2248 1819
1631A819j372j249M48J07j761r55J126R23n85o91J095J839L26r80O48K123k19
$$ 1819 447 -802 -354 -247 -2008 -2963 -1837 -914 -1499 -2190 -1095 744 1070 90 738 2861 2642
1648B642j510j84O98j30j625j470P68O01j557j489J382J285l63j351J529K296
$$ 2642 1132 948 1646 1516 -109 -1579 -811 -210 -1767 -3256 -1874 -589 -952 -2303 -774 1522
1664A522Rj470R47J690p6j562o98J256R4k654j074J344N56j642j384J505K154
$$ 1522 1531 61 1008 2698 2622 1060 362 1618 1712 -942 -2016 -672 -116 -1758 -3142 -1637 517
1681E17j141j407J489K584l18j642N15K153j16k256o90J416L46k644j314J726
$$ 517 -624 -2031 -542 2042 1724 82 597 2750 2634 378 -312 1104 1450 -1194 -2508 -782
1697g82R91j936j400K304J637j291j044J883J928m91j810O67K085n99k554o04
$$ -782 209 -1727 -3127 -823 814 -477 -1521 362 2290 1799 -11 656 2741 2142 -412 -1016
1713a016K046l15k541p69J999Q57k219q31K446J533q92j534K022J947r15j790
$$ -1016 1030 715 -1826 -2595 -596 261 -1958 -2789 -343 1190 298 -1236 786 2733 1818 28
1729B8M41J692o84k456m14J812j80k416n53K299N83j800k55K041J656j257r97
$$ 28 469 2161 1477 -979 -1393 419 239 -2177 -2730 -431 152 -1648 -1903 138 1794 537 -460
1746d60J544J649r78k009O26J156p42k012m07J659j22k173q4K131L91j346NJ845
$$ -460 1084 2733 1755 -254 372 1528 786 -1226 -1633 26 -96 -2269 -2353 -222 169 -1177 -1172 673
1764F73J271j035o35J256J455j694j370K78Q10p59j884l14J446l60j450N6J495
$$ 673 1944 909 274 1530 2985 1291 -79 199 1009 250 -1634 -1948 -502 -862 -2312 -2256 -761
1781g61J015j226K92J535J277n43j057P58J192r95j571N9P42j146j589O3J008
$$ -761 254 -972 -680 855 2132 1589 532 1290 2482 1487 -84 -25 717 -429 -2018 -1955 -947
1798i47n57n72K70J202P20R1l89J267J026m51p63L79N69o43j260l74L25k47j288
$$ -947 -1504 -2076 -1806 -604 116 207 -182 1085 2111 1660 897 1276 1845 1202 -58 -432 -107 -354 -1642
1817a642o17J016L28n86k87J203J158N5K2K84J188J01r37n2K11J1j565p86P32
$$ -1642 -2259 -1243 -915 -1501 -1788 -585 573 628 650 934 2122 2223 1286 1234 1445 1456 -109 -895 -163
1836a63k83r81p45L64J033n42k06P78J765R0o08oJ647K14j507l55Q33r9j671q38
$$ -163 -446 -1427 -2172 -1808 -775 -1317 -1523 -745 1020 1110 502 496 2143 2357 850 495 1328 1229 -442 -1280
1856a280L99N46j080q90Q47J170l33q27Q22K018J98j100J67J248O52j866p37P07
$$ -1280 -881 -335 -1415 -2305 -1458 -288 -621 -1448 -626 1392 1590 490 657 1905 2557 691 -46 661
1874F61L91j522j571J098O99j166j176R84K235m23j390R01J905J63j743L87J381
$$ 661 1052 -470 -2041 -943 -244 -1410 -2586 -1602 633 210 -1180 -279 1626 1789 46 433 1814
1891A814R5k085n35J297K63j905j076J120J037j139j080J548J725o85j194R40
$$ 1814 1909 -176 -711 586 849 -1056 -2132 -1012 25 -1114 -2194 -646 1079 394 -800 140
1907A40J794k16j684L26J293l45j605p59J414K15k051q60J923O65j132p82J438
$$ 140 1934 1718 34 360 1653 1308 -297 -1056 358 573 -1478 -2338 -415 250 -882 -1664 -226
1924b26J444o59j049J168J751p95j426J57J299n93k195l33J557k04j463m32J211
$$ -226 1218 559 -490 678 2429 1634 208 365 1664 1071 -1124 -1457 100 -104 -1567 -1999 -788
1941g88J168j149n90J667J313p08j022J133J275p20k007M01J233n69k164rJ382
$$ -788 380 -769 -1359 308 1621 913 -109 1024 2299 1579 -428 -27 1206 637 -1527 -1536 -154
1958a54j54j450k78J680R16j028k03J184J246o08r36R21J020j035j302o7R05o59
$$ -154 -308 -1758 -2036 -356 560 -468 -671 513 1759 1151 215 1136 2156 1121 -181 -248 657 -2
1976bj442k82J266k21q56L0J098Q05n80j31J110J126o50p44M07N06k33j257L8
$$ -2 -1444 -1726 -460 -681 -1537 -1507 -409 396 -184 -315 795 1921 1271 527 934 1440 1207 -50 -12
1995a2P8l97j044l96R62J49r16J17R94R80p1k17O59Q59j71p11J83L73m35j277
$$ -12 66 -331 -1375 -1771 -809 -660 -1576 -1459 -465 515 444 227 886 1745 1574 863 1046 1419 984 -293
2015b93k68M62o31q28j40N12L93j14k83Q65Q58K11k50K03J087k33n34j73m8n9
$$ -293 -561 -99 -730 -1558 -1698 -1186 -793 -907 -1190 -325 533 744 494 697 1784 1551 1017 844 796 737
2035G37j190m89K82J56n11q39L19Q57N7k29M47J155K01m54R7J288k61j203pM57
$$ 737 -453 -942 -660 -504 -1015 -1854 -1535 -678 -621 -850 -403 752 953 499 596 1884 1623 420 413 870
2055H70l89r55p30J48N70n77p60M82J205K96r34L39J960k2o50k75J300j13j471
$$ 870 481 -474 -1204 -1056 -486 -1063 -1823 -1341 -136 160 -774 -435 1525 1503 853 578 1878 1765 294
2074B94o89P83J94j136j378J065Q17p92j159Q98J412j20r08O66J449L05j478K09
$$ 294 -395 388 582 -554 -1932 -867 -50 -842 -2001 -1103 309 189 -719 -53 1396 1701 223 432
2092D32J180o4j390r70P40M64j170j160J014R86p49j289J064J833l03j069P33
$$ 432 1612 1548 158 -812 -72 392 -778 -1938 -924 62 -687 -1976 -912 921 618 -451 282
2109B82J785m16j587NJ236l96j460l77O59L72j513p66R12J630j086p26J059J616
$$ 282 2067 1651 64 69 1305 909 -551 -928 -269 103 -1410 -2176 -1264 366 -720 -1446 -387 1229
2127A229l77j290J047J306l58j918K33J230l94j720o31J234L01j232q50J379J294
$$ 1229 852 -438 609 1915 1557 -361 -128 1102 708 -1012 -1643 -409 -108 -1340 -2190 -811 483
2144D83q90q10J404J542o51j060O87J375r09j338PQ81n36j471k76R84J32r16l30
$$ 483 -407 -1217 187 1729 1078 18 705 2080 1171 -167 -160 721 185 -1286 -1562 -578 -446 -1362 -1692
2163a692J278J122j059o93J811J090n44j012N01J156r53j414P3N05l17j312k83
$$ -1692 -414 708 -351 -1044 767 1857 1313 301 802 1958 1005 -409 -336 169 -148 -1460 -1743
2180a743R23N04j294k00J681O23l14n39J264J053q89n70N41N29o46j332k02O56
$$ -1743 -820 -316 -1610 -1810 -129 494 180 -359 905 1958 1069 499 1040 1569 923 -409 -611 45
2198D5p01q75l54J021N43p32J1P43J085k19k95R59N64m19p10p2M80l26o57q95
$$ 45 -656 -1531 -1885 -864 -321 -1053 -1042 -299 786 567 272 1231 1795 1376 666 594 1074 748 91 -804
2218h04M32l14p38J2L30O58l33k18Q23J014J44p96P70R32l31q29l36J39r5j045
$$ -804 -372 -686 -1424 -1412 -1082 -424 -757 -975 -152 862 1006 210 980 1912 1581 752 416 555 460 -585
2238e85p26J51M83l09q49Q45Q33k13m10R35Q53N4o86M11N75j1p58m98K31J82r37
$$ -585 -1311 -1160 -677 -986 -1835 -990 -157 -370 -780 155 1008 1062 376 787 1362 1351 593 95 326 508 -429
2259d29r15K30P99m20q40L70J449n6o84P41P85L53r13q6Q43p7p89r02K75N11r10
$$ -429 -1344 -1114 -315 -735 -1575 -1205 244 188 -496 245 1030 1383 470 384 1227 1150 361 -541 -266 245 -665
2280f65j159M54J134l38j020P25J540j62p70J96J392R5j036k97R65L67j562r16
$$ -665 -1824 -1370 -236 -574 -1594 -869 671 509 -261 -65 1327 1422 386 89 1054 1421 -141 -1057
2298a057O70J012j259j271P93J188m87j085J199J398r6j078K13J265J0j256o89
$$ -1057 -387 625 -634 -1905 -1112 76 -411 -1496 -297 1101 1005 -73 140 1405 1415 159 -530
2315e30J368k0j577n25P77O98j135j269J499J111m56o97P02J376k06j017L44J140
$$ -530 838 818 -759 -1284 -507 191 -944 -2213 -714 397 -59 -756 -54 1322 1116 99 443 1583
2333A583K00j556p58J083J2j471o83J235L17j034o36J059J227o14n55Q23J593
$$ 1583 1783 227 -531 552 564 -907 -1590 -355 -38 -1072 -1708 -649 578 -36 -591 232 1825
2350A825q20j048L81J140k45j377k50O84M3j856l63J081P92j122n62J374J040
$$ 1825 1005 -43 338 1478 1233 -144 -394 290 333 -1523 -1886 -805 -13 -1135 -1697 -323 717
2367G17o01n28R93J010l70j081N74Q12p63j168o28P47K46j459k59J005K91q71
$$ 717 116 -412 581 1591 1221 140 714 1526 763 -405 -1033 -286 -40 -1499 -1758 -753 -462 -1333
2385a333r6J481N69J57o90Q85P47n36o88k7R38q89j302o8M74O0j259k0Q00M02
$$ -1333 -1429 52 621 778 88 973 1720 1184 496 469 1407 518 -784 -852 -378 -318 -1577 -1597 -797 -395
2405c95m47J46Q82O72J32m34N42O97m38r87L7O45n28j067o90P47l08j86p41J042
$$ -395 -842 -696 186 858 990 556 1098 1795 1357 370 407 1052 524 -543 -1233 -486 -794 -980 -1721 -679
2425f79M03m2k11O19J021j59l34M34N15k07r54k64J99K51j218p00O25m9k57l19
$$ -679 -276 -318 -529 90 1111 952 618 1052 1567 1360 406 142 341 592 -626 -1326 -701 -750 -1007 -1326
2445a326N28O23M21p44N91J023L48r07L37K85Kj271m45M58L67q12j095L08O34
$$ -1326 -798 -175 246 -498 93 1116 1464 557 894 1179 1181 -90 -535 -77 290 -522 -1617 -1309 -675
2464f75j98j23J63J034J20l46K20J332k03r07p5N34K73j345l06L1O79p17j168
$$ -675 -873 -996 -833 201 321 -25 195 1527 1324 417 342 876 1149 -196 -502 -471 208 -509 -1677
2483a677P53N34K07p25M09J274J84j030M61Q16M45j183o16J169K1j527p55M84
$$ -1677 -924 -390 -183 -908 -499 775 959 -71 390 1206 1651 468 -148 1021 1042 -485 -1240 -756
2501g56Q30o25r84N83J118j15r58M18J454L94j032m6J041j30j184o13Q60L00j063
$$ -756 74 -551 -1535 -952 166 51 -907 -489 965 1359 327 281 1322 1192 8 -605 255 555 -508
2520e08j069R04Q49q66q99Q74J142l50o71O26J110J75r45k31J007J89j442m40
$$ -508 -1577 -673 176 -690 -1589 -715 427 77 -594 32 1142 1317 372 141 1148 1337 -105 -545
2538e45P06J07j358m65Q60P18o07o20J067N95L2p16L81J256o3j077J15P78Oj394
$$ -545 161 268 -1090 -1555 -695 23 -584 -1204 -137 458 490 -226 155 1411 1348 271 386 1164 1170 -224
2558b24q48Q81K40j167m93Q33P04o59o72J081J320j18q86O59J037k59j245o7J093
$$ -224 -1072 -191 49 -1118 -1611 -778 -74 -733 -1405 -324 996 878 -8 651 1688 1429 184 117 1210
2577A210n45j046p12O17L36q54q43J216M77l89k43J020R21m42q01P53Q90k7j072
$$ 1210 665 -381 -1093 -476 -140 -994 -1837 -621 -144 -533 -776 244 1165 723 -78 675 1565 1538 466
2596D66n80J068m20j341m35O03K37o24q0J25Q00k59k34P28J032k38m84K77J012
$$ 466 -114 954 534 -807 -1242 -639 -402 -1026 -1106 -981 -181 -440 -674 54 1086 848 364 641 1653
2615A653k87r44m10K42J4j229J0J11K34m53m10R46M89P8j40O51N38J53p46J15
$$ 1653 1366 422 12 254 268 -961 -951 -840 -606 -1059 -1469 -523 -34 44 -96 555 1093 1246 500 615
2635F15N01O4q58k59nJ98r60p59M97O47n58k84M19Q70L82m01l4N98K41m92j81
$$ 615 1116 1180 322 63 58 256 -704 -1463 -966 -319 -877 -1161 -742 128 510 109 75 673 914 422 241
2656B41M28L84j050n31K69L2l83o94K99P02r6j39K13R22K3o60J76Q84M94p88m85
$$ 241 669 1053 3 -528 -259 -227 -610 -1304 -1005 -303 -399 -538 -325 597 620 -40 136 1020 1514 726 241
2677B41L63R3q96o37L36M80q68o00N32Q45K98q50K95J013M61q66Q7Q05K34q44
$$ 241 604 697 -199 -836 -500 -20 -888 -1488 -956 -111 187 -663 -368 645 1106 240 327 1132 1366 522
2697E22p21M63K73q73r28L46Q22m60o29M63J048k8o00J20J211J92p76n15Q76Q11
$$ 522 -199 264 537 -336 -1264 -918 -96 -556 -1185 -722 326 298 -302 -182 1029 1221 445 -70 806 1617
2717A617j703o04O04N86j065q12J79J115m49o22M21J227oj119O76J225K73j114
$$ 1617 -86 -690 -86 500 -565 -1377 -1198 -83 -532 -1154 -733 494 488 -631 45 1270 1543 429
2735D29m99P84K74j298p17R06M9n19j093Q62J032o82o10N31J045N6m71M33R13
$$ 429 -70 714 988 -310 -1027 -121 -72 -591 -1684 -822 210 -472 -1082 -551 494 550 79 512 1425
2754A425J37j153l87O54P7r49q39L10O80j067m59O90Q55k80o24Q10J137l66n14
$$ 1425 1562 409 22 676 753 -196 -1035 -725 -45 -1112 -1571 -881 -26 -306 -930 -120 1017 651 137
2773A37L96J110l49j279R4N96j17j265j62J57M22p13p31J173M19j2p29Q94J277
$$ 137 533 1643 1294 15 109 705 588 -677 -839 -682 -260 -973 -1704 -531 -112 -124 -853 41 1318
2792A318l19n33M42P45o84q08l90P40j59j088l73L14L44n55l00L32J205l05j96
$$ 1318 999 466 908 1653 969 161 -229 511 352 -736 -1109 -795 -451 -1006 -1306 -974 231 -74 -270
2811b70L72J104n9o55J49P30j61r03o82O25l58p71l06J64M38k42m88N88Q47k2
$$ -270 102 1206 1147 492 641 1371 1210 307 -375 250 -108 -879 -1185 -1021 -583 -825 -1313 -725 122 100
2831A00k96M93P69Q8n75k09N91k76p19m65K68R4n46m82M60J5K96m79K14J005n3
$$ 100 -196 297 1066 1154 579 370 961 685 -34 -499 -231 -137 -683 -1165 -705 -690 -394 -873 -659 346 293
2852B93p7J45Q02P8q11l42L11J65q99l80J1M47k15q41K24O76j05l87Q78N16L92
$$ 293 216 361 1163 1241 430 88 399 564 -335 -715 -704 -257 -472 -1313 -1089 -413 -518 -905 -27 489 881
2873H81p02k2O97p2j10o54L16l3n08q94M15O77m39m98K65N53K93o00M93O94L39
$$ 881 179 157 854 782 672 18 334 301 -207 -1101 -686 -9 -448 -946 -681 -128 165 -435 58 752 1091
2894A091q75l8N00L07q58m10K50K89l52p77K3Q66m82n71L72J022Q0p77M34R86
$$ 1091 216 178 678 985 127 -283 -33 256 -96 -873 -850 16 -466 -1037 -665 357 437 -340 94 1080
2914A080L13j098K1L01K47o43r31K60O91o02p90P0J112j53q61M04J269L46j111
$$ 1080 1393 295 316 617 864 221 -710 -450 241 -361 -1151 -1081 31 -122 -983 -579 690 1036 -75
2933g5M31N83L91p88o10N09M67j177n97K96O27p63r81J016N94k0q75P68Q37J84
$$ -75 356 939 1330 542 -68 441 908 -269 -866 -570 57 -706 -1687 -671 -77 -97 -972 -204 633 817
2953H17o05J86O84O5q93m25P80L56j528p14P27K56n58p60O61J003O1o74O56Q05
$$ 817 212 398 1082 1147 254 -171 609 965 -563 -1277 -550 -294 -852 -1612 -951 52 113 -561 95 900
2973I00K38o45rM14K75r42k77N13l74o57o93M90L75m74n80Q55Q85k98l52M50P80
$$ 900 1138 493 484 898 1173 231 -46 467 93 -564 -1257 -767 -392 -866 -1446 -591 294 -4 -356 94 874
2994H74N03r23K10M98k16q45n20N87j40p78l53L28N38m05n52O91P75K77n68P5
$$ 874 1377 454 664 1162 946 101 -419 168 28 -750 -1103 -775 -237 -642 -1194 -503 272 549 -19 56
3014E6R18j04n50LN31k22o88l80M49j30o18l43M46K62k1n90M02J072r3k99J72
$$ 56 974 870 320 323 854 632 -56 -436 13 -117 -735 -1078 -632 -370 -391 -981 -579 493 400 101 273
3035B73R66m56m41l74P16Q1j091k25K36P7m58l55J84M71K30n48M61N56N57n70
$$ 273 1239 783 342 -32 684 765 -326 -551 -315 -238 -696 -1051 -867 -396 -166 -714 -253 303 860 290
3055B90J13L97J1m69k61M44k56j26q76J25K96m17j02J69M89J87m41K84P15K03
$$ 290 403 800 811 342 81 525 269 143 -733 -608 -312 -729 -831 -662 -173 14 -427 -143 572 775
3075G75l92l76Q71J71q00l29l03N31m17n75J69K59K33n43K30O18O4j26O2M81O54
$$ 775 383 7 878 1049 249 -80 -383 148 -269 -844 -675 -416 -183 -726 -496 122 186 60 122 603 1257
3096A257q56m54O37K30m58j001L38J97j16p31J81P19j34n05K9R79K17l81j91P65
$$ 1257 401 -53 584 814 356 -645 -307 -110 -226 -957 -776 -57 -191 -696 -667 312 529 148 -43 722
3116G22L89p86n14Q08K29j118m00J77L62l67o88K09J150J81j021M28J075j40n33
$$ 722 1111 325 -189 619 848 -270 -670 -493 -131 -498 -1186 -977 173 354 -667 -239 836 696 163
3135A63J15N18M16q17n08M06J82m40j032O00J21m45n62K47J100J74o53K70J153
$$ 163 278 796 1212 395 -113 293 475 35 -997 -397 -276 -721 -1283 -1036 64 238 -415 -145 1008
3154A008K2m99l11Q02Rp49r21P62L50p56j015O30O17o10n61M75Q78o3m21N45J073
$$ 1008 1030 531 220 1022 1031 282 -639 123 473 -283 -1298 -668 -51 -661 -1222 -747 131 68 -353 192 1265
3175A265m08m14j23P14l7p00n81J68J81r68m76M95M77j43o09P02P49J03m13L03
$$ 1265 857 443 320 1034 997 297 -284 -116 65 -903 -1379 -884 -407 -550 -1159 -457 292 395 -18 285
3195B85P99P7q46j02O66P6q93m83L79K71p99o99M89O92o17JO39N17j33j89N04
$$ 285 1084 1161 315 213 879 955 62 -421 -42 229 -570 -1269 -780 -88 -705 -704 -65 452 319 130 634
3216F34L78J08o22k5R6k0m75p85M60J87r42M9Q8O87j54k60M76O75J17o75N81L82
$$ 634 1012 1120 498 473 569 549 74 -711 -251 -64 -1006 -957 -869 -182 -336 -596 -120 555 672 -3 578 960
3238I60J07o84l76M60j75l19m62j29L02l51n30O14O10j03j16J98M96J37q6k14
$$ 960 1067 383 7 467 292 -27 -489 -618 -316 -667 -1197 -583 27 -76 -192 6 502 639 553 339
3258C39L53K99o40m92qQ6l45l44L10L15L1r53J16J186P3l82qO03M68o09k36M35
$$ 339 692 991 351 -141 -149 -63 -408 -752 -442 -127 -96 -1049 -933 253 326 -56 -64 539 1007 398 162 597
3280E97J03m70o49J73K52j02r16K75O64m05qK58N47J06k81J3L89M84l33m60k4
$$ 597 700 230 -419 -246 6 -96 -1012 -737 -73 -478 -486 -228 319 425 144 157 546 1030 697 237 213
3301B13K22k00q77J66N07l27o47K02O13J62m03j01Q34K26p5k33L95M06q02p55
$$ 213 435 235 -642 -476 31 -296 -943 -741 -128 34 -369 -470 364 590 515 282 677 1083 281 -474
3321d74O12J75o94m36j12O11j33o02K2R59J3k51mQ46M54p52j54N98M06q09o92
$$ -474 138 313 -381 -817 -929 -318 -451 -1053 -1031 -72 -59 -310 -314 532 986 234 80 678 1084 275 -417
3342d17O47O8m87o77o7P50k59k05n3P46L79o94J87J261op74k62N15J10n97p97
$$ -417 230 298 -189 -866 -933 -183 -442 -647 -700 46 425 -269 -82 1179 1173 399 137 652 762 165 -632
3363f32L57K93m46o88J16Q61l33n04L95R67K51o89j75J075J47m82k06J03O94j114
$$ -632 -275 18 -428 -1116 -1000 -139 -472 -976 -581 386 637 -52 -227 848 995 513 307 410 1104 -10
3383a0o08K93M57p73o47N30O92k68k68L08P95L46m84M9N65J61r14k33M59L33j021
$$ -10 -618 -325 132 -641 -1288 -758 -66 -334 -602 -294 501 847 363 412 977 1138 224 -9 450 783 -238
3404b38k21K21L62q62l63K12Q66j8n55M5R58L53o16M5O43k06j97l23Q0J40o10
$$ -238 -459 -238 124 -738 -1101 -889 -23 -41 -596 -551 407 760 144 189 832 626 429 106 186 326 -284
3425b84l85L6N05j11o64K10N39j2k21O7O12M26m75N0J95K91p93PJ50J00m00o63
$$ -284 -669 -633 -128 -239 -903 -693 -154 -166 -387 -320 292 718 243 293 488 779 -14 -7 143 243 -157 -820
3447h20K31L61L7n31J06M75L91l78K6O81K88m76j30J24L62o93l65K00J48l38n06
$$ -820 -589 -228 -191 -722 -616 -141 250 -128 -102 579 867 391 261 385 747 54 -311 -111 37 -301 -807
3468h07J07N90J57m89k6P44J5o8K8J5Q06n78j31J6K26o19m30j67N34j68o47L36
$$ -807 -700 -110 47 -442 -468 276 291 223 251 266 1072 494 363 379 605 -14 -444 -611 -77 -245 -892 -556
3490e56J62M92o36K89Q18j9j67l95L61N80m37o98J01K98k91m76k81O79m8m26j75
$$ -556 -394 98 -538 -249 569 550 383 -12 349 929 492 -206 -105 193 -98 -574 -855 -176 -224 -650 -825
3511h25Q73K08m80J02L23M95l14k96N39J58l04p03n6M98o57n38N06K78o8l46k48
$$ -825 48 256 -224 -122 201 696 382 86 625 783 479 -224 -280 218 -439 -977 -471 -193 -261 -607 -855
3532h55J187j26k40L01N80J69p95j63K49Q1j59r49K61K93p0o46K75M34L2m08J27
$$ -855 332 206 -34 267 847 1016 221 58 307 388 229 -720 -459 -166 -236 -882 -607 -173 -141 -549 -422
3553d22Q22K34m44m67Q06O11o37q15O60K92p56m73R2L41n5r79J40Q95L2q21L92
$$ -422 400 634 190 -277 529 1140 503 -312 348 640 -116 -589 -497 -156 -211 -1190 -1050 -155 -123 -944 -552
3574e52R60K84q09J90O60K25m83m27L11N21o68r82K04N16m05m48L12N40R9l44
$$ -552 408 692 -117 73 733 958 475 48 359 880 212 -770 -566 -50 -455 -903 -591 -51 48 -296
3594b96k9Q25K93m86k1M45L39q95l03N7N93p75n26L25K71l02k82P9L93N89j85
$$ -296 -325 500 793 307 286 731 1070 175 -128 -71 522 -253 -779 -454 -183 -485 -767 -688 -295 294 109
3615A09j01M29J36J1m06N97o7n51l19J92L91q23m61L18N04l83j27K07L17J01k14
$$ 109 8 437 573 584 178 775 708 157 -162 30 421 -402 -863 -545 -41 -424 -551 -344 -27 74 -140
3636a40L40L41M48p05j90L55rl30l92J52K21k04o24K84L90J60n89J45N10j56J15
$$ -140 200 541 989 284 94 449 440 110 -282 -130 91 -113 -737 -453 -63 97 -492 -347 163 7 122
3657A22l8M52q5k58j78L66Q9k28o27r8N31o00j22M7M70o1J43j27L10L28k92N9
$$ 122 84 536 451 193 15 381 470 242 -385 -483 48 -552 -674 -627 -157 -218 -75 -202 108 436 144 203
3679B03K44L35n49j22J16n3O1o63j84P79o72L1p9O19J10k19O9K20L24m36j65N51
$$ 203 447 782 233 111 227 174 235 -428 -612 167 -505 -474 -553 66 176 -43 26 246 570 134 -31 520
3701E20L66n67n72P5K66j89m46l35Q86J6n54R0K83M56k94j19N28K22l84m43N39
$$ 520 886 319 -253 -178 88 -101 -547 -882 4 20 -534 -444 -161 295 1 -118 410 632 248 -195 344
3722C44M17n27l91J80p4m08l14j1N75p0j63l4N46K57p8o3O89j86l30l40J42L17
$$ 344 761 234 -157 23 -51 -459 -773 -784 -209 -279 -442 -476 70 327 249 186 875 689 359 19 161 478
3744D78l57m76k53P75l03q19o2M54N12m91J3Q64J65l00j81L82M38l45p80M67L74
$$ 478 121 -355 -608 167 -136 -955 -1017 -563 -51 -542 -529 335 500 200 19 401 839 494 -286 181 555
3765E55p65n18L00L24k29n26l0Q96O4l14j41Q47M61n66k21N16J73n60j36o3J79
$$ 555 -210 -728 -428 -104 -333 -859 -889 7 71 -243 -384 463 924 358 137 653 826 266 130 67 246
3786B46j67r40N29J30k43l70N5Q77j01k87J0R97j39j35k82K74M74o16l67Q7J98
$$ 246 79 -861 -332 -202 -445 -815 -760 117 16 -271 -261 736 597 462 180 454 928 312 -55 32 230
3807B30l06n35Q4K30O9j90o8N46j4k33L07J01N48n29l8J92K92l34p94K24L41m03
$$ 230 -76 -611 -527 -297 -228 -418 -486 60 46 -187 120 221 769 240 202 394 686 352 -442 -218 123 -280
3829b80n31K65K97j96j59L55L35rPJ4K55L47l81K0j9j01j43l74Q2M28k99l73j30
$$ -280 -811 -546 -249 -445 -604 -249 86 77 84 98 353 700 319 339 320 219 76 -298 -216 212 -87 -460 -590
3852e90M33p2n8K92J20K13j01m70P00p0K93n02o0L84o60k95K65J59k61m83L27
$$ -590 -157 -229 -287 5 125 338 237 -233 467 397 690 188 128 512 -148 -443 -178 -19 -280 -763 -436
3873d36N17l5j10K94%K03Q9k37k2N97n07k71j5J65n71o2j11L28J59p00L08M16
$$ -436 81 46 -64 230 230 433 522 285 263 860 353 82 67 232 -339 -401 -512 -184 -25 -725 -417 -1
3895aM69l33n5L62J53k5n77M58J62l98l17L3L69n99k77k75P20j26l04J92N61L70
$$ -1 468 135 80 442 595 570 -7 451 613 215 -102 -69 300 -299 -576 -851 -131 -257 -561 -369 192 562
3917E62n39Q2j4N80l9l07k1J43k79o36L56o6l8m22P1M65O9j90j48P18K97o18K7
$$ 562 23 105 91 671 632 325 304 447 168 -468 -112 -178 -216 -638 -567 -102 -33 -223 -371 347 644 26 53
3940E3L88M58n94l12L31j40m63l09K50J19N9k92j66M56K40n00j78Q81L83n32k99
$$ 53 441 899 305 -7 324 184 -279 -588 -338 -219 -160 -452 -618 -162 78 -422 -600 281 664 132 -167
3961a67Q22J29k60l39k40K69l33l71k49K27L36n51k01P37L73l91j39P43J82j14
$$ -167 655 784 524 185 -55 214 -119 -490 -739 -512 -176 -727 -928 -191 182 -209 -348 395 577 463
3981D63l07K02N17n06p63M59L19k38n11l10M42K25q59K35P92J45m06lP48o5l7
$$ 463 156 358 875 369 -394 65 384 146 -365 -675 -233 -8 -867 -632 160 305 -101 -104 644 579 542
4002E42m85M92K38n20o47L28N26o20n18K5M80r7k91k6P31K57k43Q0MO90o80l49
$$ 542 57 549 787 267 -380 -52 474 -146 -664 -639 -159 -256 -547 -573 158 415 172 252 256 946 266 -83
4024h3K63L0l43k43J29J92j4o28j03P52P5l13J24N17J55n02J47M64O1k86l81J70
$$ -83 180 210 -133 -376 -247 -55 -69 -697 -800 -48 27 -286 -162 355 510 8 155 619 680 394 13 183
4046A83J24n57p4O7L75l77k55nN59K3l74K10L12L90l65M2J76p2j04l58K46k73
$$ 183 307 -250 -324 -257 118 -259 -514 -519 40 63 -311 -101 211 601 236 278 454 382 278 -80 166 -107
4068a07p2j93N8J59Pl41J41O39ml18r3N04L65n01Q8J56l1k41m36P4J83l2m30m42
$$ -107 -179 -372 -314 -155 -148 -489 -348 291 287 -31 -124 380 745 244 332 488 457 216 -220 -146 37 5 -425 -867
4092h67N77L2k22K77J40P50m70j89L92L08l67l42J45M27m67n10K76K34l25n41
$$ -867 -290 -258 -480 -203 -63 687 217 28 420 728 361 19 164 591 124 -386 -110 124 -201 -742
4112g42J47K77L85l52p7P44n0O0m12N45K12m03k31j39L23%p91O4J77Q8m69L1L10
$$ -742 -595 -318 67 -285 -362 382 332 392 -20 525 737 334 103 -36 287 287 -504 -440 -263 -175 -644 -613 -303
4135c03O06l43j64M03K75k49m8MO46q6q25n6J66Jm50r7N63j64o61L3J98P40j37
$$ -303 303 -40 -204 199 474 225 177 181 827 741 -84 -140 26 27 -423 -520 43 -121 -782 -749 -551 189 52
4158E2k89N66M67o73J40J61N87n54l29J12l5M1o30m03L32L20l72O0M83L19m15
$$ 52 -237 329 796 123 263 424 1011 457 128 240 205 246 -384 -787 -455 -135 -507 -447 36 355 -60
4179f0q2O30J99o7l89NL84k57m58J9L65l77l55j45L26j92r6K44O39J36k47j24
$$ -60 -142 488 687 620 231 236 620 363 -95 -76 289 -88 -443 -588 -262 -454 -550 -306 333 469 222 98
4201I8J7N67n09j42O9O00m48o91L44RL17o24l76Q28K0q38L51L29K47j38j10O84
$$ 98 115 682 173 31 100 700 252 -439 -95 -86 231 -393 -769 59 79 -759 -408 -79 168 30 -80 604
4223F04M2m87J06j83M43l21l09l36M79j71p61N61K71J90n12J4N48L88k35k04K09
$$ 604 646 159 265 82 525 204 -105 -441 38 -133 -894 -333 -62 128 -384 -370 178 566 331 127 336
4244C36J09n67M11j42j33J50l74j93J21J49m43L35K25K78J17m65M14L15l87m9
$$ 336 445 -122 289 147 14 164 -210 -403 -282 -133 -576 -241 -16 262 379 -86 328 643 256 207
4264B07K09J64j73o65J25J56O4n47K28K59j88m13M97K42K1k36K73J71mm0m94L99
$$ 207 416 580 407 -258 -133 23 87 -460 -232 27 -161 -574 -77 165 186 -50 223 394 390 350 -144 255
4286B55K43q8p62J31K72j45l37M7O6L32k73j09N80M08j96k74q6M99q4l70k7J12
$$ 255 498 410 -352 -221 51 -94 -431 -384 -318 14 -259 -368 212 620 424 150 64 563 479 109 82 194
4308A94k0m82j49L80L59q10L7K02J42n5n7M31N30m05j76J18M80n11p2l4O7j61
$$ 194 174 -308 -457 -77 282 -528 -491 -289 -147 -202 -259 172 702 297 121 239 719 208 136 102 169 8
4330Hl06k26L94k83N7n32O05N44j83j31K87L07k74K07k29L14k40p49J44M97k30
$$ 8 -298 -524 -130 -413 -356 -888 -283 261 78 -53 234 541 267 474 245 559 319 -430 -286 211 -19
4351a9m64L7l6M21o08O1L24M15k30k39O10N85k75l62n2O67k58p97K10L26k98m30
$$ -19 -483 -446 -482 -61 -669 -608 -284 131 -99 -338 272 857 582 220 168 835 577 -220 -10 316 18 -412
4373d12l08M03J02n81L08L84M09o4j91K67M98l57o60K91K20J11o80n9K10ok90
$$ -412 -720 -317 -215 -796 -488 -104 305 241 50 317 815 458 -202 89 309 420 -260 -319 -109 -115 -405
4394d05OK37K13o9m96O27L49l87MK77L33j94n53J10L01k45n37l9L73k24j16l03
$$ -405 -399 -162 51 -18 -514 113 462 75 79 356 689 495 -58 52 353 108 -429 -468 -95 -319 -435 -738
4416g38O00J51l78j48Q15K31l75j64M41Jj43l77J96M7j12n18j40J46M84m81j73
$$ -738 -138 13 -365 -513 302 533 158 -6 435 436 293 -84 112 159 47 -471 -611 -465 19 -462 -635
4437f35N53J42j54j66N56N06m59j82j62M63l4n80p0R5N5m46J14M3P3K5O9J42J44
$$ -635 -82 60 -94 -260 296 802 343 161 -1 462 428 -152 -222 -127 -72 -518 -404 -361 -288 -263 -194 -52 92
4460I2j90J87K02L28k59k80J16K96l80l14p0l6J01k55j95M00O7J05l68O69K39
$$ 92 -98 89 291 619 360 80 196 492 112 -202 -272 -308 -207 -462 -657 -257 -190 -85 -453 216 455
4481D55m53J91j00N27k19n48J29K26k65j14l37K87J32l10k46L76L33l80L7L52
$$ 455 2 193 93 620 401 -147 -18 208 -57 -171 -508 -221 -89 -399 -645 -269 64 -316 -279 73
4501G3M69nl00J60L8L1l67m1K08l47m45q2N45m10j0k20M70L43Rk96J94O38k62
$$ 73 542 537 237 397 435 466 99 58 266 -81 -526 -608 -63 -473 -483 -703 -233 110 119 -177 17 655 393
4524C93o4n1K73l31m84r0N25m06j54k63K46M48l46k34K17N43p3r8L12j1M56n39
$$ 393 329 278 551 220 -264 -354 171 -235 -389 -652 -406 42 -304 -538 -321 222 149 51 363 352 808 269
4546B69M4O8J48q56m7L71k21k77l44K52O72k64q5M48K92r6j66J88J78Q5m17q7
$$ 269 313 381 529 -327 -374 -3 -224 -501 -845 -593 79 -185 -270 178 470 374 208 396 574 659 242 155
4568A55oK13n06k27J35J49n19j36N85N8m13j16P50K95j80l03M19L25k72k74k15
$$ 155 149 362 -144 -371 -236 -87 -606 -742 -157 -99 -512 -628 122 417 237 -66 353 678 406 132 -83
4589h3K33q0m88k74R09m06l82p8O79J12q0k57M55M82k43l05j02N50k09m65l3L28
$$ -83 150 70 -418 -692 217 -189 -571 -649 30 142 62 -195 260 742 499 194 92 642 433 -32 -65 263
4611B63k81l09j00K61J03m15j33Q36L9n61K85N4L50L3l28K61K90k94m62J30j9
$$ 263 -18 -327 -427 -166 -63 -478 -611 225 264 -297 -12 42 392 425 97 358 648 354 -108 22 3
4632Clm03j63K34J09n1p4K73J60k96K86Q6N88k26o52L33l4K33o82M7l4j98n9j31
$$ 3 0 -403 -566 -332 -223 -274 -348 -75 85 -211 75 161 749 523 -129 204 170 403 -279 -232 -266 -464 -523 -654
4656f54M67J79k98Q5K41N74n51J04M30r8j90m18J74K87n33j02j52Q3M17j84l24
$$ -654 -187 -8 -306 -221 20 594 43 147 577 479 289 -129 45 332 -201 -303 -455 -372 45 -139 -463
4677d63M14J71j13j22J5N22k07j63M18M1j75l53j74M75l47j47k52K48J05j78l97
$$ -463 -49 122 9 -113 -98 424 217 54 472 513 338 -15 -189 286 -61 -208 -460 -212 -107 -285 -682
4698f82M26K80j56j59N53J95j3j19l1L07j35n16l19L80j9n77J37j7K78O4j19l2
$$ -682 -256 24 -132 -291 262 457 444 325 294 601 466 -50 -369 11 -8 -585 -448 -465 -187 -123 -242 -274
4720b74M46k17N0J63N61q0n33J6K10k75k43n8L3J19l23k89J46N34j40J68j17L80
$$ -274 172 -45 5 168 729 649 116 132 342 67 -176 -234 -201 -82 -405 -694 -548 -14 -154 14 -103 277
4742B77j33m2N1O39m19Q5m63K89k41k19k96R3L83j93k81L6O92m59M7K48L10k54
$$ 277 144 102 153 792 373 458 -5 284 43 -176 -472 -379 4 -189 -470 -434 258 -201 -154 94 404 150
4764A50M3N0L91j23j42m72L30R9o18l71M91J03k59k34J22M42J63k96P8M87M9m71
$$ 150 193 243 634 511 369 -103 227 326 -292 -663 -172 -69 -328 -562 -440 2 165 -131 -53 434 483 12
4786A2K56O9P7m66j11M99j08o49l53M16K48K9k49K06L26l33k99N72K69J58n92
$$ 12 268 337 414 -52 -163 336 228 -421 -774 -358 -110 -81 -330 -124 202 -131 -430 142 411 569 -23
4807b3J47J94Nk40j70K77m70L0m74L37M71k18l55M93J18j51O1Q7L92L72j051N0
$$ -23 124 318 323 83 -87 190 -280 -250 -724 -387 84 -134 -489 4 122 -29 32 119 511 883 -168 -118
4829a18M15l12j85j83J80L3n35J85M56J28n3k71K44P38m36j79l8M74K01o83q8
$$ -118 297 -15 -200 -383 -203 -170 -705 -520 -64 64 11 -260 -16 722 286 107 69 543 744 61 -27
4850b7L72l1o87m20M77K80l01j51J06Q89j96m82M60J36j24k55o0O21l69j54j70
$$ -27 345 314 -373 -793 -316 -36 -337 -488 -382 507 311 -171 289 425 301 46 -14 607 238 84 -86
4871h6l6M2m97J04P10l58k78J18K83J02K27k54p2Q27n72l9Kn7P01r34o1j28J63
$$ -86 -122 -80 -577 -473 237 -121 -399 -281 2 104 331 77 5 832 260 221 223 166 867 -67 -128 -256 -93
4894i3k97J2r0j2J38l57O18N01l05j34K18K11M9k72j30K61n1m99l17J86K86m74
$$ -93 -390 -378 -468 -480 -342 -699 -81 420 115 -19 199 410 459 187 57 318 267 -232 -549 -363 -77 -551
4916e51J50K54j82K94J17p0L94k85J84l0K56N2o07j45M73N9p00n2N7N43o36p0
$$ -551 -401 -147 -329 -35 82 12 406 121 305 275 531 583 -24 -169 304 363 -337 -389 -332 211 -425 -495
4938d95q3O19j74k76R5P20Q8l79K6K80K52o06k29J05M49q09m8J16M43l08k37J85
$$ -495 -578 41 -133 -409 -314 406 494 115 141 421 673 67 -162 -57 392 -417 -465 -349 94 -214 -451 -266
4960b66N56m35P3K09L80K1k1l21L11k29k42k83K73R3l46l88K31L82j52j47p0O88
$$ -266 290 -145 -72 137 517 538 517 196 507 278 36 -247 26 119 -227 -615 -384 -2 -154 -301 -371 317
4982C17P8m28K9O01j66o7m20K84J75n14j6J10O2m54k56N58J60j65n53J42Q38K63
$$ 317 395 -33 -4 597 431 364 -56 228 403 -111 -127 -17 45 -409 -665 -107 53 -112 -665 -523 315 578
5004E78n77n7O66j2l96j32K43J14n73p8j43N37l29l91K52M34k59k64M88L23j51
$$ 578 1 -56 610 598 202 70 313 427 -146 -224 -367 170 -159 -550 -298 136 -123 -387 101 424 273
5025B73j78J57Q4J09n73J14L87p4o26l25M51K17n53k99K90N24J98n04L70N55k36
$$ 273 95 252 336 445 -128 -14 373 299 -327 -652 -201 16 -537 -836 -546 -22 176 -328 42 597 361
5046C61m51K51L62J88o89k13J90P8n41J84J77L31m35j17P5N70k21r7J82L6J64
$$ 361 -90 161 523 711 22 -191 -1 77 -464 -280 -103 228 -207 -324 -249 321 100 3 185 221 385
5067C85m35K03K44m51p2Q4N9k14O3n71J27L53J3r2R3L58J89l12O6L97o6l45r3
$$ 385 -50 153 397 -54 -126 -42 17 -197 -134 -705 -578 -225 -212 -304 -211 147 336 24 90 487 421 76 -17
5090a7J67j51k57j13J63k52m3n8J16N16K7l40J83P17m3k63r2J00Q6j22m53M11
$$ -17 150 -1 -258 -371 -208 -460 -503 -561 -445 71 98 -242 -59 658 615 352 260 360 446 324 -129 282
5112B82p2o48rR4mK62j17K09o8R2l09L12N35j97Jj14J51m9K1m92K16r1l17l45
$$ 282 210 -438 -447 -353 -357 -95 -212 -3 -71 21 -288 24 559 362 363 249 400 351 372 -120 96 5 -312 -657
5136f57K42K38n8l70L82K59K55m28L20J73J72m7l32K52K78o18l35J6J05k39n40
$$ -657 -415 -177 -235 -605 -223 36 291 -137 183 356 528 481 149 401 679 61 -274 -258 -153 -392 -932
5157i32K72N91j08k25N18QL69p55K51K33K72n8k80L36J0q03k29L71J93j98n22
$$ -932 -660 -69 -177 -402 116 124 493 -262 -11 222 494 436 156 492 502 -301 -530 -159 34 -164 -686
5178f86J70K36K99m94K03M42k5j73R0M10O0m75J87L5J35m98j74J0N09o27j56M19
$$ -686 -516 -280 19 -475 -272 170 145 -28 62 472 532 57 244 279 414 -84 -258 -248 261 -366 -522 -103
5200a03j02J04j23N62J24Jm2k61K53J30n16r4J57l0m49l09J56L16j77k19K54N64
$$ -103 -205 -101 -224 338 462 463 421 160 413 543 27 -67 90 60 -389 -698 -542 -226 -403 -622 -368 196
5222A96k33j22M05K72J66m54J6p6K98k57m69M47N6m84m76M03l2q0K16Q1L35k16
$$ 196 -37 -159 246 518 684 230 246 170 468 211 -258 189 245 -239 -715 -312 -344 -424 -208 -127 208 -8
5244ho6J89Q1J95j46j28L85l51l4l74K67Ok03l2jL27l23K52k53M92k9j70K83K03
$$ -8 -74 115 196 391 245 117 502 151 117 -257 10 16 -187 -219 -220 107 -216 36 -217 275 246 76 359 562
5268E62m04q2k16J41K70k50p17M64K27j58j16n0K74J37j01r6M25K9k23j62N26
$$ 562 158 76 -140 1 271 21 -696 -232 -5 -163 -279 -329 -55 82 -19 -115 310 339 116 -46 480
5289D80j32j38m42K51N2L2n24J87O8k63k54L18M26J19k39P9L78L19m81j41L00
$$ 480 348 210 -232 19 71 103 -421 -234 -166 -429 -683 -365 61 180 -59 20 398 717 236 95 395
$$ [...]
8191C57
##END NTUPLES=NMR FID
##END=
