##TITLE=1H_INula-aceton-2Kg
 200.13MHz, D2O,
 8 sc
 
 23.1.2025
##JCAMPDX= 6.0         $$ Bruker NMR JCAMP-DX V2.0
##DATA TYPE= NMR SPECTRUM
##DATA CLASS= XYDATA
##ORIGIN= UXNMR, Bruker Analytische Messtechnik GmbH
##OWNER= pz
$$ XWIN-NMR		Version 3.5
$$ Thu Jan 23 13:50:31 2025 Russian Standard Time (UT+4h)  she@DPX200
##.OBSERVE FREQUENCY= 200.1313
##.OBSERVE NUCLEUS= ^1H
##.ACQUISITION MODE= SIMULTANEOUS
##.ACQUISITION SCHEME= undefined
##.AVERAGES= 8
##.DIGITISER RES= 18
##SPECTROMETER/DATA SYSTEM= spect
##.PULSE SEQUENCE= zg30
##.SOLVENT NAME= D2O
##.SHIFT REFERENCE= (INTERNAL, D2O, 0, 15.5023)
##AUDIT TRAIL= $$ (NUMBER, WHEN, WHO, WHERE, WHAT)
$$ ##TITLE= Audit trail, XWIN-NMR		Version 3.5
$$ ##JCAMPDX= 5.01
$$ ##ORIGIN= Bruker BioSpin GmbH
$$ ##OWNER= she
$$ F:/spectra/data/she/nmr/H-C/1/pdata/1/auditp.txt
$$ ##AUDIT TRAIL=  $$ (NUMBER, WHEN, WHO, WHERE, WHAT)
(   1,<2025-01-23 13:48:53.06 +0400>,<she>,<DPX200>,
      <created by zg, POWCHK disabled, PULCHK disabled
       configuration hash MD5:
       00 E9 B6 7A A2 85 ED C7 34 08 36 98 17 FE 4E 26
       data hash MD5: 16K
       E5 42 FA E4 98 1F A6 F6 31 4B F2 3F 44 60 10 56>)
(   2,<2025-01-23 13:48:55.98 +0400>,<she>,<DPX200>,
      <Start of raw data processing
       efp BC_mod = 2 LB = 0.25 FT_mod = 6 PKNL = 1 PHC0 = 239.8508 PHC1 = 25.7922 SI = 16K 
       data hash MD5: 16K
       8C 34 F4 4D 4A BF F3 C4 AA 45 D9 88 90 43 54 47>)
(   3,<2025-01-23 13:49:17.03 +0400>,<she>,<DPX200>,
      <pk PHC0 = 8.369822 PHC1 = -7.400001 
       data hash MD5: 16K
       E5 09 0F CD 07 A9 71 CE 87 BB C4 A2 02 D6 9E BC>)
(   4,<2025-01-23 13:49:20.64 +0400>,<she>,<DPX200>,
      <abs ABSG = 5 
       data hash MD5: 16K
       AF A0 B5 6E 08 BF D1 3C 0A 24 FA 8F 6E 6B 5F D5>)
$$ ##END=
$$ 
$$ hash MD5
$$ 52 74 C9 FB 12 DF 10 41 63 A5 C9 F3 69 29 90 D2
##$RELAX= 
##$RELAX= 
##$RELAX= 
##$RELAX= 
##$RELAX= 
##$RELAX= 
$$ Bruker specific parameters
$$ --------------------------
##$DU= <F:/spectra>
##$EXPNO= 1
##$NAME= <H-C>
##$PROCNO= 1
##$TYPE= <nmr>
##$USER= <she>
##$AMP= (0..31)
100 100 100 100 100 100 100 100 100 100 100 100 100 100 100 100 100 100 
100 100 100 100 100 100 100 100 100 100 100 100 100 100 
##$AQSEQ= 0
##$AQ_mod= 1
##$AUNM= <au_zg>
##$AUTOPOS= <>
##$BF1= 200.13
##$BF2= 200.13
##$BF3= 200.13
##$BF4= 200.13
##$BF5= 200.13
##$BF6= 200.13
##$BF7= 200.13
##$BF8= 200.13
##$BYTORDA= 1
##$CFDGTYP= 0
##$CFRGTYP= 5
##$CHEMSTR= <none>
##$CNST= (0..31)
1 1 145 1 1 1 1 1 1 1 1 1 1 1 1 1 1 1 1 1 1 1 1 1 1 1 1 1 1 1 1 1 
##$CPDPRG= <>
##$CPDPRG1= <>
##$CPDPRG2= <>
##$CPDPRG3= <>
##$CPDPRG4= <mlev>
##$CPDPRG5= <mlev>
##$CPDPRG6= <mlev>
##$CPDPRG7= <mlev>
##$CPDPRG8= <mlev>
##$CPDPRGB= <>
##$CPDPRGT= <>
##$D= (0..31)
0 0.7 0 0 0 0 0 0 0 0 0 0.03 0 0 0 0 0 0 0 0 0 0 0 0 0 0 0 0 0 0 0 0 
##$DATE= 1737625732
##$DBL= (0..7)
120 120 120 120 120 120 120 120 
##$DBP= (0..7)
150 150 150 150 150 150 150 150 
##$DBP07= 0
##$DBPNAM0= <>
##$DBPNAM1= <>
##$DBPNAM2= <>
##$DBPNAM3= <>
##$DBPNAM4= <>
$$ [...]
##$SPNAM4= <gauss>
##$SPNAM5= <gauss>
##$SPNAM6= <gauss>
##$SPNAM7= <gauss>
##$SPNAM8= <gauss>
##$SPNAM9= <gauss>
##$SPOAL= (0..31)
0.5 0.5 0.5 0.5 0.5 0.5 0.5 0.5 0.5 0.5 0.5 0.5 0.5 0.5 0.5 0.5 0.5 0.5 
0.5 0.5 0.5 0.5 0.5 0.5 0.5 0.5 0.5 0.5 0.5 0.5 0.5 0.5 
##$SPOFFS= (0..31)
0 0 0 0 0 0 0 0 0 0 0 0 0 0 0 0 0 0 0 0 0 0 0 0 0 0 0 0 0 0 0 0 
##$SUBNAM0= <"">
##$SUBNAM1= <"">
##$SUBNAM2= <"">
##$SUBNAM3= <"">
##$SUBNAM4= <"">
##$SUBNAM5= <"">
##$SUBNAM6= <"">
##$SUBNAM7= <"">
##$SUBNAM8= <"">
##$SUBNAM9= <"">
##$SW= 18.0517328524113
##$SWIBOX= (0..15)
0 0 2 0 0 0 0 0 0 0 0 0 0 0 0 0 
##$SW_h= 3612.71676300578
##$TD= 16384
##$TD0= 1
##$TE= 0
##$TE2= 300
##$TE3= 300
##$TEG= 300
##$TL= (0..7)
0 120 120 120 120 120 120 120 
##$TP= (0..7)
150 150 150 150 150 150 150 150 
##$TP07= 0
##$TPNAME0= <>
##$TPNAME1= <>
##$TPNAME2= <>
##$TPNAME3= <>
##$TPNAME4= <>
##$TPNAME5= <>
##$TPNAME6= <>
##$TPNAME7= <>
##$TPOAL= (0..7)
0.5 0.5 0.5 0.5 0.5 0.5 0.5 0.5 
##$TPOFFS= (0..7)
0 0 0 0 0 0 0 0 
##$TUNHIN= 0
##$TUNHOUT= 0
##$TUNXOUT= 0
##$USERA1= <user>
##$USERA2= <user>
##$USERA3= <user>
##$USERA4= <user>
##$USERA5= <user>
##$V9= 5
##$VALIST= <valist>
##$VCLIST= <CCCCCCCCCCCCCCC>
##$VD= 0
##$VDLIST= <DDDDDDDDDDDDDDD>
##$VPLIST= <PPPPPPPPPPPPPPP>
##$VTLIST= <TTTTTTTTTTTTTTT>
##$WBST= 1024
##$WBSW= 4
##$XGAIN= (0..3)
0 0 0 0 
##$XL= 0
##$YL= 0
##$YMAX_a= 472753
##$YMIN_a= -649710
##$ZGOPTNS= <>
##$ZL1= 120
##$ZL2= 120
##$ZL3= 120
##$ZL4= 120
##$ABSF1= 15.50229
##$ABSF2= -2.54956
##$ABSG= 5
##$ABSL= 3
##$ALPHA= 0
##$AQORDER= 0
##$ASSFAC= 0
##$ASSFACI= 0
##$ASSFACX= 0
##$ASSWID= 0
##$AUNMP= <proc_1d>
##$AZFE= 0.1
##$AZFW= 0.1
##$BCFW= 0
##$BC_mod= 2
##$BYTORDP= 0
##$COROFFS= 0
##$CY= -3
##$DATMOD= 1
##$DC= 0
##$DFILT= <>
##$DTYPP= 0
##$F1P= 0
##$F2P= 0
##$FCOR= 1
##$FTSIZE= 16384
##$FT_mod= 6
##$GAMMA= 0
##$GB= 0
##$INTBC= 1
##$INTSCL= 3.241238e-09
##$ISEN= 128
##$LB= 0.25
##$LEV0= 0
##$LPBIN= 0
##$MAXI= 10000
##$MC2= 0
##$MEAN= 0
##$ME_mod= 0
##$MI= 1.114404
##$NCOEF= 0
##$NC_proc= -5
##$NLEV= 6
##$NOISF1= 3.799351
##$NOISF2= 2.8
##$NSP= 0
##$NTH_PI= 0
##$NZP= 0
##$OFFSET= 15.50229
##$PC= 1
##$PHC0= 248.2206
##$PHC1= 18.3922
##$PH_mod= 1
##$PKNL= yes
##$PPARMOD= 0
##$PSCAL= 0
##$PSIGN= 0
##$REVERSE= no
##$SF= 200.130003884578
##$SI= 16384
##$SIGF1= 3
##$SIGF2= 2
##$SINO= 0.751879
##$SIOLD= 32768
##$SREGLST= <19F.Aceton>
##$SSB= 0
##$STSI= 16384
##$STSR= 0
##$SW_p= 3612.71676300578
##$SYMM= 0
##$S_DEV= 0
##$TDeff= 16384
##$TDoff= 0
##$TI= <>
##$TILT= no
##$TM1= 0
##$TM2= 0
##$TOPLEV= 0
##$USERP1= <user>
##$USERP2= <user>
##$USERP3= <user>
##$USERP4= <user>
##$USERP5= <user>
##$WDW= 1
##$XDIM= 16384
##$YMAX_p= 402647169
##$YMIN_p= -743273
$$ End of Bruker specific parameters
$$ ---------------------------------
##XUNITS= HZ
##YUNITS= ARBITRARY UNITS
##XFACTOR= 0.220516191357247
##YFACTOR= 1
##DELTAX= -0.220516191357247
##NPOINTS= 16384
##FIRSTX= 3102.47331229696
##FIRSTY= 0
##LASTX= -510.243450708824
##MAXY= 402647169
##MINY= -743273
##XYDATA= (X++(Y..Y))
$$ [...]
12327C5795o8949j4328n439P1903M6851k7303J6767n8086l3060N5892N7507K1912
$$ 35795 -33154 -47482 -52921 18982 65833 38530 55297 -2789 -35849 20043 77550 99462
12315I9462l0985L0842n8235k8799J8310n3808p5448N2651J04559j4221q421k9751
$$ 99462 68477 99319 41084 12285 30595 -23213 -98661 -46010 58549 44328 35907 6156
12303F156n4199J6930M2120k4561o117l9925P892l9169J08098m2355m4651M9066
$$ 6156 -48043 -31113 11007 -13554 -19671 -59596 -51704 -90873 17225 -25130 -69781 -20715
12291b0715P3498Q4321Q205k3882j00305m1967J6081M515l2647m2638L5869J960
$$ -20715 52783 137104 145309 121427 21122 -20845 -4764 -249 -32896 -75534 -39665 -37705
12279c7705o5842L9830Q7425K1876m8236K9108j8948j4251J2858k7927L1172O0219
$$ -37705 -103547 -63717 23708 45584 -2652 26456 7508 -6743 6115 -21812 9360 69579
12267F9579p7976J1387K1291r3722P0698J3724J7469j8677j13479M9920Q0075
$$ 69579 -8397 2990 24281 -69441 1257 14981 32450 13773 -99706 -49786 30289
12256C0289J0378j8182m6828l0588N0806O8905k5379j23102J8777L762m9852L9062
$$ 30289 40667 22485 -24343 -54931 -4125 64780 39401 -83701 -64924 -61162 -111014 -71952
12244g1952Q5744l2921q5826K1176J06151J07081K7324n3443p4534n9710K5243
$$ -71952 13792 -19129 -104955 -83779 22372 129453 156777 103334 28800 -30910 -5667
12233e667q0089k1669o034M8952J1502K6081P3208n7138M573J4394k3454k7493
$$ -5667 -85756 -107425 -113459 -64507 -53005 -26924 46284 -10854 -6281 8113 -15341 -42834
12221d2834J816J0418m5822K6908M2901N7439p9967N1860O4782q7933K96k6285
$$ -42834 -41018 -30600 -76422 -49514 -6613 50826 -29141 22719 87501 -432 -136 -26421
12209b6421J5459P9526m0209k4671J7840o8374L1851K0729j3712q7346Q739K7999
$$ -26421 -10962 68564 28355 3684 21524 -46850 -14999 5730 -7982 -95328 -86589 -58590
12197e8590Q891j1203Q4123j7395m0997m4238J0094J3165J34749p5644M7959L1596
$$ -58590 -49699 -60902 23221 5826 -35171 -79409 -69315 -56150 78599 2955 50914 82510
12185H2510k0927m8224q8386R2342m3932k6709J3097J5033O0018k6122K4564p2173
$$ 82510 61583 13359 -75027 17315 -26617 -53326 -40229 -25196 34822 8700 33264 -38909
12173c8909Q863q969M6767J1521J1660m8282o75R0145K3141R9187j48759m9056
$$ -38909 -30046 -39015 7752 19273 30933 -17349 -18024 72121 95262 194449 45690 -3366
12161c366N9598J04284O370n9682r017m6853p5824O284k3581M9685m5054L1798
$$ -3366 56232 160516 166886 107204 98187 51334 -24490 -18206 -41787 7898 -37156 -5358
12149e358J81j0606N853o1405j2634M4185K2661N7425j4144L5872N8618n2528
$$ -5358 -5177 -15783 -9930 -71335 -83969 -39784 -17123 40302 26158 62030 120648 68120
12137F8120m2936L3268K4427J034O1131k5572k8572j0045N087o9855p5191K301
$$ 68120 25184 58452 82879 83913 145044 119472 90900 80855 85942 16087 -59104 -56803
12125e6803N209j7415K4839o6018M9277J1599M2167p349n6887Q6687j4253K1160
$$ -56803 -51594 -69009 -44170 -110188 -60911 -49312 -7145 -14494 -71381 15306 1053 22213
12113B2213k7580k6630M9281L3542j3736P1462k0901m3276P282O5896l1543o8002
$$ 22213 -5367 -31997 17284 50826 37090 108552 87651 44375 51657 117553 86010 18008
12101A8008j0498J563j0681L2921L7734p3966M7529K3347r5789J540m491J8214
$$ 18008 7510 9073 -1608 31313 69047 -4919 42610 65957 -29832 -28292 -32783 -14569
12089a4569n0415P6790J3927J2436R484j02805m9778Q0200j6221M8746N3255r4009
$$ -14569 -64984 11806 25733 38169 47653 -55152 -104930 -24730 -40951 7795 61050 -32959
12077c2959k0732M8105k8444K8941n455K6635R077p0940o221k4851J9666O7940
$$ -32959 -53691 -5586 -34030 -5089 -10544 16091 25168 -45772 -51993 -76844 -57178 10762
12065A0762R560N0771m5722o0929L3773N3345Q3981q0256k5768j6994J201o8957
$$ 10762 20322 71093 25371 -35558 -1785 51560 135541 55285 29517 12523 13724 -55233
12053e5233N4742n8835o4157J7709J28839J1389q7522j3200Q4813p497K2823R5530
$$ -55233 -491 -59326 -123483 -105774 23065 34454 -53068 -66268 18545 11048 33871 129401
12041A29401l9345J850j6651j4914J2262k923K5540n123m6874j05934P0663L2318
$$ 129401 90056 91906 75255 60341 72603 69680 95220 90097 43223 -62711 7952 40270
12029D0270K1761j6943l1623l0963K1872l4881q443P1260K479j5167o4948K636
$$ 40270 62031 45088 13465 -17498 4374 -30507 -38950 32310 34789 19622 -45326 -42690
12017d2690m8254L5416O2462N5161k4566l7385n2742P8792J95l308P6341q3623
$$ -42690 -90944 -55528 6934 62095 37529 144 -52598 26194 26389 23081 99422 15799
12005A5799n7509n577K1715n0083L2591R5158j6174K3692m3052L8845K6165p0661
$$ 15799 -41710 -47287 -25572 -75655 -43064 52094 35920 59612 16560 55405 81570 10909
11993A0909m3351j5083q769J9517P8703j02750M728l956M7438r70l7832J2118
$$ 10909 -32442 -47525 -56294 -36777 41926 -60824 -56096 -60052 -12614 -13584 -51416 -39298
11981c9298l4154J311M6462J1161j4307o1474j8688P1067J4040N1036m1010l5042
$$ -39298 -73452 -72141 -25679 -14518 -28825 -90299 -108987 -37920 -23880 27156 -13854 -48896
11969d8896J3892J6156L2398J0844k9293L7745k7798m1477L3497N4240l1431P017
$$ -48896 -35004 -18848 13550 24394 -4899 32846 5048 -36429 -2932 51308 19877 26894
11957B6894o1983k3788P4195J9319n9445P9786m0094R536J9246n2635K9524J6561
$$ 26894 -35089 -58877 15318 34637 -24808 54978 14884 24420 43666 -8969 20555 37116
11945C7116m156j2541O3395K6754K5410q8490K9498m0561k3227n712M8316l8957
$$ 37116 32960 20419 83814 110568 135978 47488 76986 36425 13198 7486 55802 16845
11933A6845r4260N1402P5447k3117J5643o42P493m036k8148j2461o974P7343P1058
$$ 16845 -77415 -26013 49434 26317 41960 41318 48811 44775 16627 4166 -2808 74535 145593
11920A45593n0916k9349l3800K644J2978L8005L094m7605p7540j606M519m2029
$$ 145593 94677 65328 31528 34172 47150 85155 88249 40644 -36896 -38502 -33983 -76012
11908g6012J04690K4833n0746Q937K4760l46j142k4336L8547P0703M261q7988
$$ -76012 28678 53511 2765 11702 36462 36116 34974 10638 49185 119888 124149 36161
11896C6161J3599o3579l1876r614M6062j0485O3877L501n9784n2248O7091P1350
$$ 36161 49760 -13819 -45695 -55309 -9247 -19732 44145 47646 -12138 -64386 2705 74055
11884G4055p4721p3199M43P3815K0157q1806J9367J1808K4527R905K2664j8612
$$ 74055 -666 -73865 -73422 393 20550 -61256 -41889 -30081 -5554 4351 27015 8403
11872H403J4236J3009l0470q320n1578p460N8698p783l8975m4342L0752K0095
$$ 8403 22639 35648 5178 -3142 -54720 -62180 -3482 -11265 -50240 -94582 -63830 -43735
11860d3735k2536J3521J3586L8675j8324L8959N028m2089j11697M283O456N6227
$$ -43735 -66271 -52750 -39164 -489 -18813 20146 25174 -16915 -128612 -124329 -117873 -61646
11848f1646q788r2377K4336P8983P782L607k5943k892P600n990P0933o132j1059
$$ -61646 -70434 -162811 -138475 -59492 -51710 -48103 -74046 -76938 -69338 -75328 -4395 -10527 -21586
11835b1586K9355J3263j2207n1724k0531J9931o1573J20076j2342r1132M0857
$$ -21586 7769 21032 8825 -42899 -63430 -43499 -105072 15004 2662 -88470 -47613
11824d7613k2768M4834P0330o2102L4279N0837N1630l5278j4496n1577l1035k4089
$$ -47613 -70381 -25547 44783 -17319 16960 67797 119427 84149 69653 18076 -12959 -37048
11812c7048l9582r320k0224J08974Q226P9044J5794N6855p5737k429o068r0400
$$ -37048 -76630 -85950 -106174 2800 11026 90070 105864 162719 86982 84553 78485 -11915
11800a1915p3695o085L5955O2505j2213k9048J9692J4234Q719M203M9859N4349
$$ -11915 -85610 -91695 -55740 6765 -5448 -34496 -14804 -570 8149 12352 62211 116560
11788A16560j22993o8339k7601O8649j1735M3781L000k1295l7326M2656L7772
$$ 116560 -6433 -74772 -102373 -33724 -45459 -1678 1322 -19973 -57299 -14643 23129
11777B3129q60J8579J3988m9359l9840M932J5610P0429k1218j8371m8994J8117
$$ 23129 22269 40848 54836 5477 -34363 -29431 -13821 56608 35390 17019 -31975 -13858
11765a3858O3955o7049R404o9756m7010M2232Q667L4067n6377p99P699J16608
$$ -13858 50097 -16952 -7548 -77304 -124314 -82082 -73415 -39348 -95725 -96524 -88825 27783
11753B7783n4532n3246O6458j7412k1701l3134N520J7009j1516M6535j06291N6006
$$ 27783 -26749 -79995 -13537 -30949 -52650 -85784 -80264 -63255 -74771 -28236 -134527 -78521
11741g8521M4632J5346Q8457k4733k1981j0651L0043p324n4151M5316n5517o5013
$$ -78521 -33889 -18543 69914 45181 23200 12549 42592 35268 -18883 26433 -29084 -94097
11729i4097K133L4155P7228N1222o0223l7680J0220J5460K3276k6630j33017l9541
$$ -94097 -91964 -57809 19419 70641 10418 -27262 -17042 -1582 21694 -4936 -137953 -177494
11717a77494R4610j8807q45M1503R4266J27801j14915p2399o4551m3403M8806
$$ -177494 -82884 -101691 -102536 -61033 33233 161034 46119 -26280 -90831 -134234 -85428
11706h5428Q9362k2891l4584j4387J1733L4262o8977r409J2482J3863N6840K9320
$$ -85428 3934 -18957 -53541 -67928 -56195 -21933 -90910 -100319 -87837 -73974 -17134 12186
11694A2186J9525j3003n6111j4061R249p5406M6096n403o6695K4339J4573P6233
$$ 12186 31711 18708 -37403 -51464 -42215 -117621 -71525 -76928 -143623 -119284 -104711 -28478
11682b8478o4608K5759J06623m7997O551L221m0717K8717M3735J4519j2927p1725
$$ -28478 -93086 -67327 39296 -8701 -2150 1071 -39646 -10929 32806 47325 34398 -37327
11670c7327l4068R892l1727J6088J4699K5059k1604j0903O7037l8270l0667L9937
$$ -37327 -71395 -61503 -93230 -77142 -62443 -37384 -58988 -69891 -2854 -41124 -71791 -31854
11658c1854M8986L4553p59J2957o3426j8972L8373Q5781m4308r0367N5307n8911
$$ -31854 17132 51685 50926 63883 457 -18515 19858 105639 61331 -29036 26271 -32640
11646c2640o71N1638R470K3581J3635j5834m4985l4845P2589Q080L9752o4712
$$ -32640 -33311 18327 27797 51378 65013 49179 4194 -30651 41938 50018 89770 25058
11634B5058k1452Q6635o8902j15669j0611L6796q436Q6848O1170j96l1698M272
$$ 25058 3606 90241 21339 -94330 -104941 -68145 -76581 10267 71437 71241 39543 43815
11622D3815l4136k33j6617O9205j2556j1367n3044N526N7756l9701j0997n9911
$$ 43815 9679 9446 -7171 62034 49478 38111 -14933 -9407 48349 8648 -2349 -62260
11610f2260r60J4840R0533l669n4996O500L1208l2368k3228M0740M561L368m0356
$$ -62260 -63220 -48380 42153 38484 -16512 -10012 21196 -11172 -34400 6340 10901 14269 -26087
11597b6087k7613l7732P2358O6077O9917q410j00288k6832R8054k2214r1650L1691
$$ -26087 -53700 -91432 -19074 47003 116920 108510 8222 -18610 79444 57230 -34420 -2729
11585b729K7202J28110q975J451m8550j47338O5434M9986l5398l7576M9981l17
$$ -2729 24473 152583 143608 145059 96509 -50829 14605 64591 29193 -8383 41598 41281
11573D1281L7429l1380l0303R1462j4243p2737o7791M1858J18005m3409K9957
$$ 41281 78710 47330 17027 108489 94246 21509 -46282 -4424 113581 70172 100129
11562A00129O2990J027m9300k5944K7402r866n2315l6691O054J13710l0302L3999
$$ 100129 163119 164146 114846 88902 116304 106438 54123 17432 23486 137196 106894 140893
11550A40893m9325J5982M8603k4388m5048m9456M0298K2969L3087q5801k1615
$$ 140893 91568 107550 156153 131765 86717 37261 77559 100528 133615 47814 26199
11539B6199l5236R7386j9229K718K0770m0768L1563O8532l1238k4649M7371M5204
$$ 26199 -9037 88349 69120 71838 92608 51840 83403 151935 120697 96048 143419 188623
11527A88623q1668j04456J4432O0954J2078o2282k5106M5624R0079l8379l9118
$$ 188623 106955 2499 16931 77885 89963 27681 2575 48199 138278 99899 60781
11516F0781K0154L0274J1929l697l8196k6977J2999J0304o4013N579k1486M7499
$$ 60781 80935 111209 123138 119441 81245 54268 67267 77571 13558 19137 -2349 45150
11504D5150J6564j6048L9054j09575j349K8296Q6143J7697q4584o0994k220P119
$$ 45150 61714 45666 84720 -24855 -26204 2092 88235 105932 21348 -39646 -41866 -34747
11492c4747Q334j4706M2801J7661p8390Q7413J3727J3373J5279j09863O2338J0045
$$ -34747 -26413 -41119 1682 19343 -59047 28366 42093 55466 70745 -39118 23220 33265
11480C3265q5813L7849R2112k5043O953K5848m9790J3853m3615o182N288M4957
$$ 33265 -52548 -14699 77413 52370 59323 85171 35381 49234 5619 -563 4725 49682
11468D9682O0515K5192m1431j01574N9345q2437L7099o3657N6011N7698p984K7231
$$ 49682 110197 135389 93958 -7616 51729 -30708 6391 -57266 -1255 56443 48459 75690
11456G5690r4592p7283R713Q6280O375l9864J481J7784n5050k1204M8448j9590
$$ 75690 -18902 -96185 -86472 -192 6183 -33681 -32200 -14416 -69466 -90670 -42222 -61812
11444f1812M1884J5812K9655k5613p604k8783k198P5219m7770k7898L801M694
$$ -61812 -19928 -4116 25539 -74 -7678 -36461 -38659 36560 -11210 -39108 -35307 -30613
11432c0613J10118l1313j1554n5265m1410J281j0387l3277M8441J13247j1946
$$ -30613 79505 48192 36638 -18627 -60037 -58756 -69143 -102420 -53979 59268 47322
11421D7322M760n5510m0910K4603M7416K0120P9239k626m0433K2955n7819j085
$$ 47322 52082 -3428 -44338 -19735 27681 47801 127040 124414 83981 106936 49117 48032
11409D8032j00876o7276J22643M5836k9076J9818o320o5262N5945M0478M2332
$$ 48032 -52844 -120120 2523 48359 19283 39101 32781 -32481 23464 63942 106274
11398A06274r0682j2061K3800P4014m745j18898J1939Q0731M8965P0802j16077
$$ 106274 15592 3531 27331 101345 96600 -22298 -10359 70372 119337 190139 74062
11387G4062k5025j3595N9361P88n1571K4974l5340j9285R1241M3166p138r1702
$$ 74062 49037 35442 94803 95591 44020 68994 33654 14369 105610 148776 141638 49936
11375D9936L264N950O7502n3301j01825j267J13720l6042k4606M2161o0379k3037
$$ 49936 53200 59150 126652 73351 -28474 -29741 83979 47937 23331 65492 5113 -17924
11363a7924O3371q9201j4577J20676p556k9828K3130J674M2151p3961o4749n7325
$$ -17924 45447 -43754 -58331 62345 54789 24961 48091 49765 91916 17955 -46794 -104119
11351a04119O5759J70670r3175p092m1133L336k8770O1248L8944l2379m9765K4402
$$ -104119 -38360 132310 39135 32043 -9090 -5754 -34524 26724 65668 33289 -16476 7926
11339G926P8206P632j22301l921K5957R548N4761q6541Q004M5071M6383O0625
$$ 7926 86132 93764 -28537 -32458 -6501 3047 57808 -28733 -20729 24342 70725 131350
11327A31350j20595Q9645L177p5964P580k2175o1905J06156J6552m3259N3923
$$ 131350 10755 100400 103577 27613 35193 13018 -48887 57269 73821 30562 84485
11316H4485N8691o0832m0106K1835p4882K3980J8786N3775N809q523o353P589
$$ 84485 143176 82344 42238 64073 -10809 13171 31957 85732 91541 83018 76665 84254
11304H4254o1962L0136k4225p0904K08j4616P4906Q1282L5454n2264N1961o519
$$ 84254 22292 52428 28203 -42701 -42493 -57109 17797 99079 134533 82269 134230 127711
11292A27711m8861K1141m9863m480L298j3436n5099L4918k5555P8272r05o1191
$$ 127711 78850 99991 50128 45648 48946 35510 -19589 15329 -10226 68046 67141 5950
11280E950P548o070L9916L7078m9400n7455O4112m2807K0857L3056j0409M0298
$$ 5950 13498 7428 47344 84422 35022 -22433 41679 -1128 19729 52785 42376 82674
11268H2674L3069l0203k0999l2383j472k7783L0777j4474P0134M1440l5104p5781
$$ 82674 115743 85540 64541 32158 30686 2903 33680 19206 89340 130780 95676 19895
11256A9895m7247P7009K2632j54593K6787P4130n362j13662J32970L6237L6526
$$ 19895 -27352 49657 72289 -82304 -55517 18613 13251 -100411 32559 68796 105322
11245A05322p4085n2921o067J29423J7171l0488j7915k4750j8939l2234Q0027
$$ 105322 31237 -21684 -27751 101672 118843 88355 70440 45690 26751 -5483 74544
11234G4544L7454o3211j647M1843J3649N9338j03377r6817k2807Q6710J109j9564
$$ 74544 111998 48787 47140 88983 102632 161970 58593 -38224 -61031 25679 26788 7224
11222G224N0481j2207j9301J00139j3391o5737J2097L8153j56162r536j876N5364
$$ 7224 57705 45498 26197 126336 112945 47208 59305 97458 -58704 -68240 -70116 -14752
11210a4752j4626O6265J8213k1984m5654K0430L6618P692N6207m259k0556O5666
$$ -14752 -29378 36887 55100 33116 -12538 7892 44510 52202 108409 104150 83594 149260
11198A49260l0723j9579q8802m1733M8545J1902j8506O041K957P3886q8130L3845
$$ 149260 118537 98958 10156 -31577 16968 28870 10364 16405 19362 93248 5118 38963
11186C8963K351M0880M0408o2386m2406Q4930J9297m0129P1214r2826l2687n5033
$$ 38963 41314 82194 122602 60216 17810 102740 122037 81908 153122 60296 27609 -27424
11174b7424R1430K8518p0682L1012J4018O1823j2493p9415N5946Q7876l9614j06463
$$ -27424 64006 92524 21842 52854 66872 128695 116202 36787 92733 180609 140995 34532
11162C4532L150Q750q8800M0660N7825l5934j9098M9478l3853r3499P7242Q8236
$$ 34532 37682 46432 -42368 -1708 56117 20183 1085 50563 16710 -76789 453 88689
11150H8689r1982l7719O8579M0382o1859J1035N120R9598j3255j04636O7842q063
$$ 88689 -3293 -41012 27567 67949 6090 17125 22245 121843 108588 3952 71794 63731
11138F3731K751j4137N3349j01916L6398L6797K336m934j3886n0478L2249J6810
$$ 63731 66482 52345 105694 3778 40176 76973 79309 74375 60489 10011 42260 59070
11126E9070o2335J4760M5161n2699j9893J5364l16L2313J58486r285k2739q9144
$$ 59070 -3265 11495 56656 3957 -15936 -572 -888 31425 189911 180626 157887 68743
11114F8743j0045Q3763j14322l6052J0112m9085M0475j8571j8054n6976L9574
$$ 68743 58698 142461 28139 -7913 2199 -46886 -6411 -24982 -43036 -100012 -60438
11103f0438J69269O597j5245r8416P613k726j3283j7397l2119o93J98N0757j3024
$$ -60438 108831 115428 100183 1767 9380 6654 -6629 -24026 -56145 -56838 -56640 -5883 -18907
11090a8907p773K2322O5981q566l5033l8431J1533L0526J4280O741o797k5435
$$ -18907 -26680 -4358 61623 53057 18024 -20407 -8874 21652 35932 42673 35876 10441
11078A0441K2639J4192j0961M232L3018j3237m0503R1930j05756K3101J50L2033
$$ 10441 33080 47272 36311 40543 73561 60324 19821 111751 5995 29096 29246 61279
11066F1279Q886j8330l2406L8108O602p4139P2908o2297O535J6237M4881K8753
$$ 61279 70165 51835 19429 57537 64139 -10000 62908 611 7146 23383 68264 97017
11054I7017j19545L0358M2748k3659P422J1904M5947l0520k6617n902q7382M4567
$$ 97017 -22528 7830 50578 26919 34341 46245 92192 61672 35055 29153 -58229 -13662
11042a3662m3020l0727R559J5633J6224M7361O017M0179J647l3736J15603J9207
$$ -13662 -56682 -87409 -77850 -62217 -45993 1368 7385 47564 49211 15475 131078 150285
11030A50285j18043j0147L5984J8473N933N1230j3564n9683J00953K0885q6865
$$ 150285 32242 22095 58079 76552 82485 133715 120151 60468 161421 182306 95441
11019I5441p7024K3391N3314k3091J8419L8665m7428j6626J5197j0996L647o135
$$ 95441 18417 41808 95122 72031 90450 129115 81687 65061 80258 69262 72909 66774
11007F6774m0635Q2196L3822n3664m3458l196n6083J05316k6166j3820O192p683
$$ 66774 26139 108335 142157 88493 45035 41839 -14244 91072 64906 51086 57278 49595
10995D9595k9595K1759j2236N1294j9685k4556M5145O5594j9107n2126J6281r0708
$$ 49595 20000 41759 29523 80817 61132 36576 81721 147315 128208 76082 92363 1655
10983A655P849k0914l6552N6387N4817j2599j3936R3504k4363m4681K5386M7990
$$ 1655 9504 -11410 -47962 8425 63242 50643 36707 130211 105848 61167 86553 134543
10971A34543l891r1875o8003k3040N6015K9474O4094j1444k0467k7278j6703m3831
$$ 134543 130652 38777 -29226 -52266 3749 33223 97317 85873 65406 38128 21425 -22406
10959b2406L8926l872L07J9193J9628p154K6229k7835M1698k2692J905l255J0841
$$ -22406 16520 12648 12955 32148 51776 44622 70851 43016 84714 62022 63927 60672 71513
10946G1513L8940o0586k6000j1625n0083M0163O1491R372p0069j1055J0266K6473
$$ 71513 110453 49867 23867 12242 -37841 2322 63813 73185 3116 -7939 2327 28800
10934B8800o981O761K1437j7668O7551k9515L69J7959j12352j901J26295j2431
$$ 28800 21819 28580 50017 32349 99900 70385 70754 88713 -23639 -25540 100755 88324
10922H8324j00565M2028l0899o6784O5545k1160p4818L1390Q0687J3048K6216
$$ 88324 -12241 29787 -1112 -67896 -2351 -23511 -98329 -66939 13748 26796 53012
10911E3012k6626k3262K444P494l6115k2628N3496M8633q111L4364p2188k5595
$$ 53012 26386 3124 5568 13062 -23053 -45681 7815 56448 48337 82701 10513 -15082
10899a5082M7071M9255k4255o3381n283q35O158l17j6850Q509L147p4681n086
$$ -15082 31989 81244 56989 -6392 -11675 -12510 -6352 -6669 -23519 -15010 -11863 -86544 -91630
10886i1630M847Q4098J03177o4084q4780o5625J9191Q1765J6864j25121K8041
$$ -91630 -86783 -2685 100492 36408 -48372 -113997 -94806 -13041 3823 -121298 -93257
10875i3257N5695M5888K5059p580o2739K3929L2024j17930N5428R219k21J793
$$ -93257 -37562 8326 33385 25805 -36934 -13005 19019 -98911 -43483 -34264 -34485 -32692
10863c2692J21154K6548j02299n5738M7766O8095k5714j6754r3851K664Q2006
$$ -32692 88462 115010 12711 -43027 4739 72834 47120 30366 -63485 -60821 21185
10852B1185p826n3169L515L6804L6395j0481L247R776n7516k0690j1258j758K5264
$$ 21185 13359 -39810 -36295 509 36904 26423 29670 39446 -18070 -38760 -50018 -51776 -26512
10839b6512n1137L5577L1966k3471R849M9737J2837J875m1052r1938J7866O573
$$ -26512 -77649 -42072 -10106 -33577 -23728 26009 38846 40721 -331 -92269 -74403 -67830
10827f7830l2661Q0671M2159r7480O2639K0181m1020L138K5342K4426L2923j31051
$$ -67830 -100491 -19820 22339 -75141 -12502 7679 -33341 -30203 -4861 19565 52488 -78563
10815g8563o3065P966P7338O991R9380l0601r6352P7514l114n8814K68K7927L7632
$$ -78563 -141628 -133662 -56324 -49333 50047 19446 -76906 608 -2506 -61320 -61052 -33125 4507
10802D507k6937J0417K8315p552M3721n3929n2992m4674M1021M2062j4242q7038
$$ 4507 -22430 -12013 16302 8750 52471 -1458 -54450 -99124 -58103 -16041 -30283 -117321
10790a17321J9640l5464O0440J4181k8343j7102M6057r869l4633N4767j4658j11907
$$ -117321 -97681 -133145 -72705 -58524 -86867 -103969 -57912 -67781 -102414 -47647 -62305 -174212
10778a74212l383J3483Q2045N6850m1378n339k2248q9635O4297O5824j3215L0584
$$ -174212 -177595 -164112 -82067 -25217 -66595 -71934 -94182 -183817 -119520 -53696 -66911 -36327
10766c6327j5132l5982K3129K2536j370N6861Q2569o3053n7634K9879r339p0334
$$ -36327 -51459 -87441 -64312 -41776 -43146 13715 96284 33231 -24403 5476 -3863 -74197
10754g4197q0451L3253j1843p394j2287J31405o7119L1988K3057r727Q1893m8067
$$ -74197 -154648 -121395 -133238 -140632 -152919 -21514 -88633 -56645 -33588 -43315 38578 -9489
10742i489K6328j09104k1454k6430K8260m8085Q9637N1883o6371P3573L717l0954
$$ -9489 16839 -92265 -113719 -140149 -111889 -159974 -70337 -18454 -84825 -11252 -7535 -38489
10730c8489n9979N1658j0395r75L9412M3736j4805j52463m1847J2497M2505O9433
$$ -38489 -98468 -46810 -57205 -58180 -18768 24968 10163 -142300 -184147 -171650 -129145 -59712
10718e9712M7913n3977k079K9235n7067M1513k6808n0080m614O5645J111l7857
$$ -59712 -11799 -65776 -67855 -38620 -95687 -54174 -80982 -131062 -135676 -70031 -68920 -106777
10706a06777L5792N491O0556P0197q4373m8656q6962N3313R6255k8142m1353l9144
$$ -106777 -70985 -65494 -4938 65259 -19114 -67770 -154732 -101419 -5164 -33306 -74659 -113803
10694a13803j8946Q3342O6293k7817m0779j12975r407Q8498K633j5942L7896l3800
$$ -113803 -132749 -49407 16886 -10931 -51710 -164685 -174092 -85594 -82961 -98903 -61007 -94807
10682i4807k5352M5640J796K7330j4243J9438r9240N0091P1173j7424L8403j9141
$$ -94807 -120159 -74519 -72723 -45393 -59636 -40198 -139438 -89347 -18174 -35598 2805 -16336
10670a6336k9285q568o7990o6411Q5996K3094l4758J6243l371L9857p1608J6553
$$ -16336 -45621 -54189 -122179 -188590 -102594 -79500 -114258 -98015 -101386 -61529 -133137 -116584
10658a16584Q1919o864p778j0397J378L2622m7727J3871O1600n6635q2422p3334
$$ -116584 -34665 -41529 -49307 -59704 -58326 -25704 -73431 -59560 2040 -54595 -137017 -210351
10646b10351L9178N064K9093l8696j8432N7172j740O5782J09607j962m3940m8424
$$ -210351 -171173 -166109 -137016 -175712 -194144 -136972 -138712 -72930 36677 34715 -9225 -57649
10634e7649m1754k5219j7403N0196o301l100K5873k6354M633M273l5296j6211
$$ -57649 -99403 -124622 -142025 -91829 -98130 -101230 -75357 -101711 -97078 -92805 -128101 -144312
10622a44312M6881N2691j3243L9542L1267m9750q0773J6831Q164J78l3895p5657
$$ -144312 -97431 -44740 -57983 -18441 12826 -36924 -117697 -100866 -92702 -92524 -126419 -202076
10610b02076L8834J6406J02364k4895M4851p725l2082K2494r92j0009Q4562n4020
$$ -202076 -163242 -146836 -44472 -69367 -24516 -32241 -64323 -41829 -42821 -52830 31732 -22288
10598b2288n7862p8348L6807J21618j5564r3952j7970P9958n1027Q291R0486k7895
$$ -22288 -80150 -158498 -121691 -73 -15637 -109589 -127559 -47601 -98628 -90337 149 -27746
10586b7746n6720L8386M5937j11277k7021L7131O6516n3303m2466P9369P5179
$$ -27746 -84466 -46080 -143 -111420 -138441 -101310 -34794 -88097 -130563 -51194 23985
10575B3985q5663j03776M0316K2855l8106M6343M7304r1266R5919l907O9395k2060
$$ 23985 -61678 -165454 -125138 -102283 -140389 -94046 -46742 -138008 -42089 -45996 23399 1339
10563A339n2954j08916k4996N8415R2825K4927Q287n5257l4459J4116L8713N017
$$ 1339 -51615 -160531 -185527 -127112 -34287 -9360 -1073 -56330 -90789 -76673 -37960 -32943
10551c2943m5183k9369k0474J6706J7497K6721o3090J3328Q1109L1829M8094O046
$$ -32943 -78126 -107495 -127969 -111263 -93766 -67045 -130135 -116807 -35698 -3869 44225 50271
10539E0271k2910r557k2430j3760m3516j08017O6027K6217l3989M6068n8268r594
$$ 50271 27361 17804 -4626 -18386 -61902 -169919 -103892 -77675 -111664 -65596 -123864 -133458
10527a33458n5661K9728L2164o222L6641J9173J6375q26o9274l3499r039K7169
$$ -133458 -189119 -159391 -127227 -133449 -96808 -77635 -61260 -62086 -131360 -164859 -173898 -146729
10515a46729j9032l7027M3059O8443M8829Q377M5128N88l5046n7280j7073N9181
$$ -146729 -165761 -202788 -159729 -91286 -42457 -34080 11048 11636 -23410 -80690 -97763 -38582
10503c8582j8747N4272n0509n9427m052L8927o4993J0032P11n0980j2877N3856
$$ -38582 -57329 -3057 -53566 -112993 -117045 -78118 -143111 -133079 -132368 -183348 -196225 -142369
10491a42369O6268j7615K0242m035l5448M2704N0731p8195J9661L3346k5528r6802
$$ -142369 -76101 -93716 -73474 -77509 -112957 -70253 -19522 -97717 -78056 -44710 -70238 -167040
10479a67040L569P6226j9708j0118m4328j2244l1686L3413K1422J2448M7509M3752
$$ -167040 -163471 -87245 -106953 -117071 -161399 -173643 -205329 -171916 -150494 -138046 -90537 -46785
10467d6785k5673r2818Q0657L5942j7431m7187l1579O5830L6361K2890m3018O632
$$ -46785 -72458 -165276 -84619 -48677 -66108 -113295 -144874 -79044 -42683 -19793 -62811 -56179
10455e6179N9319J1104O2749o4643L3606l1295l2678L6259k6850j13667k4522
$$ -56179 3140 14244 76993 12350 45956 14661 -18017 18242 -8608 -122275 -146797
10444a46797J19225K87q7308r080M2635l7584L8427q71K074L6156p6542n2005
$$ -146797 -27572 -27285 -114593 -123673 -81038 -118622 -80195 -81066 -78992 -42836 -119378 -171383
10432a71383O355J16097j1479n8469k3086O7348q667O867j6857j4796J5412P569
$$ -171383 -165028 -48931 -60410 -118879 -141965 -74617 -83284 -76417 -93274 -108070 -92658 -85089
10420h5089j5869J5103K0725k6147l932j13161P276J09947J3020m250m7993K1
$$ -85089 -100958 -85855 -65130 -91277 -95209 -208370 -201094 -91147 -78127 -82377 -130370 -130349
10408a30349M6190K8067N0356j20178n8506R6731K5278j6300k0718L6244q773
$$ -130349 -84159 -56092 -5736 -125914 -184420 -87689 -62411 -78711 -99429 -63185 -71958
10397g1958m3685j6769M7649k4552o5516L8907M6007j0844N4980l8040j00451
$$ -71958 -115643 -132412 -84763 -109315 -174831 -135924 -89917 -100761 -45781 -83821 -184272
10386a84272j7172L7283P1437N5293p7126j4377R8726N135m8090q925m56l7126
$$ -184272 -201444 -164161 -92724 -37431 -114557 -128934 -30208 -25073 -73163 -82088 -82544 -119670
10374a19670p5002J7760Q8022M3375R143k9550k3291J5364K2117j29078J9607
$$ -119670 -194672 -176912 -88890 -45515 -36372 -65922 -89213 -73849 -51732 -180810 -161203
10363a61203Q5634K0196N4609J6238r8511l1994n641M8535K9015N3300k2876m9679
$$ -161203 -75569 -55373 -764 15474 -83037 -115031 -120672 -72137 -43122 10178 -12698 -62377
10351f2377r7912O6071l3760K8626j9815j2645O9501k6909k5009O1660j3948l5273
$$ -62377 -160289 -94218 -127978 -99352 -119167 -131812 -62311 -89220 -114229 -52569 -66517 -101790
10339a01790N3778J986j2370K4092n4934o6963K3115M9512P5627p7541n1946m496
$$ -101790 -48012 -46026 -58396 -34304 -89238 -156201 -133086 -83574 -7947 -85488 -137434 -141930
10327a41930M4692l6944L2702P3818j0859p9679q2932k3180R7731l1658R776m4344
$$ -141930 -97238 -134182 -101480 -27662 -38521 -118200 -201132 -224312 -126581 -158239 -148463 -192807
10315a92807M4251Q9760n3693N880O4422o116l1656m7949k6324J04087Q6777j1307
$$ -192807 -148556 -58796 -112489 -106609 -42187 -48303 -79959 -127908 -154232 -50145 36632 25325
10303B5325r3277J3470J5677L4449r1172M1022j1808l7271n8796m3681P8136Q3970
$$ 25325 -67952 -54482 -38805 -4356 -95528 -54506 -66314 -103585 -162381 -206062 -127926 -43956
10291d3956l9762J8332p1697N5556o1687L7705N5389p9245O3784r915k8011O8382
$$ -43956 -83718 -65386 -137083 -81527 -143214 -105509 -50120 -129365 -65581 -75496 -103507 -35125
10279c5125o5207l165N4832k5840n0029J4015J8406J3824O3376n97n8128m0527
$$ -35125 -100332 -103497 -48665 -74505 -124534 -110519 -92113 -78289 -14913 -15510 -73638 -114165
10267a14165M9127p7880K8034j9910J7095j14369Q0456J5481j0759K7875K1754
$$ -114165 -65038 -142918 -114884 -134794 -117699 -232068 -151612 -136131 -146890 -119015 -97261
10256i7261K8957p1646J8566M5487l2935J2114l5861m7829L1597N6630M5980m751
$$ -97261 -68304 -139950 -121384 -75897 -108832 -96718 -132579 -180408 -148811 -92181 -46201 -50952
10244e0952m8539n3899k2905R9101K3344j5190l9895N0924L8060l7061p7969L3547
$$ -50952 -99491 -153390 -176295 -77194 -53850 -69040 -108935 -58011 -19951 -57012 -134981 -101434
10232a01434k2742J14056n7014p1596N0295P0370P47o8158k4827K5176j9845N6415
$$ -101434 -124176 -10120 -67134 -138730 -88435 -18065 -17318 -85476 -110303 -85127 -104972 -48557
10220d8557J5500l5711q6102q4912q317J5328J13387p418Q9264k6889j17003O3611
$$ -48557 -33057 -68768 -154870 -239782 -248099 -232771 -119384 -126802 -37538 -64427 -181430 -117819
10208a17819R0364n043l7730r7975K3750N3275L1868l2413m5721J7739n2901J0313
$$ -117819 -27455 -32498 -70228 -168203 -144453 -91178 -59310 -91723 -137444 -119705 -172606 -162293
10196a62293L5942k7939n210Q9324Q7916m8421n6470K050o6886J0834N676k3990
$$ -162293 -126351 -154290 -159500 -70176 17740 -30681 -87151 -85101 -151987 -141153 -135477 -159467
10184a59467O0962j9038r4394J8393O81K8681N3409J5255J35052m1932k9682o9330
$$ -159467 -98505 -117543 -211937 -193544 -192863 -164182 -110773 -95518 39534 -2398 -32080 -101410
10172a01410n539K0974M7579m4697O2204l8623j3922m2462J0549K7312n6519M693
$$ -101410 -106949 -85975 -38396 -83093 -20889 -59512 -73434 -115896 -105347 -78035 -134554 -129861
10160a29861J6935k6714k7081N3891n5589l3421J1088R4800L7910p4757J9672
$$ -129861 -112926 -139640 -166721 -112830 -168419 -201840 -190752 -95952 -58042 -132799 -113127
10149a13127m0401M8766J3318M6693K8278n9379p9947Q086K4577p6713L2901L9289
$$ -113127 -153528 -104762 -91444 -44751 -16473 -75852 -155799 -147713 -123136 -199849 -166948 -127659
10137a27659P5690o3786q0670N3834J8501n294l8785j3871k5190M6757j4017J972
$$ -127659 -51969 -115755 -196425 -142591 -124090 -129384 -168169 -182040 -207230 -160473 -174490 -172518
10125a72518O3638Q4675L1795r3125n2444J6416n7576P1368L0947M1080k5062
$$ -172518 -108880 -24205 7590 -85535 -137979 -121563 -179139 -107771 -76824 -35744 -60806
10114f0806m5280P8296K1869M3480p7570j40727j5751N4932m727P8160l6012k0219
$$ -60806 -106086 -27790 -5921 37559 -40011 -180738 -196489 -141557 -146284 -68124 -104136 -124355
10102a24355J0614K7194N26k2639K4121J2043p0718p1711M104J28236k7512m0056
$$ -124355 -113741 -86547 -86021 -108660 -84539 -72496 -143214 -214925 -210821 -82585 -110097 -150153
10090a50153l8614O854p00j3713K8299J10035j8398q771m251P9150m3023q3292
$$ -150153 -188767 -181913 -182613 -196326 -168027 -57992 -76390 -85161 -89412 -10262 -53285 -136577
10078a36577L4560p6357M548J03147R613k4701L745m215J08325o8092m5028q3519
$$ -136577 -102017 -178374 -173826 -70679 -61066 -85767 -82022 -86237 22088 -46004 -91032 -174551
10066a74551l2769M871N8077q055k9781j2391J4702R5089p0643k5789k6710K4234
$$ -174551 -207320 -202449 -144372 -152427 -182208 -194599 -179897 -84808 -155451 -181240 -207950 -183716
10054a83716R0281r634L6395q8380N9104Q2157m8404J8583q8360L6167l9988M8588
$$ -183716 -93435 -103069 -66674 -155054 -95950 -13793 -62197 -43614 -131974 -95807 -135795 -87207
10042h7207k2962m6655J7133p34J0755M5952N482p0489R402m7848n068J0124M7288
$$ -87207 -110169 -156824 -139691 -140425 -129670 -83718 -78236 -148725 -139323 -187171 -192239 -182115 -134827
10029a34827m8054M5520N3407K7504j8026n249o435k3698J21982n927j9107j2273
$$ -134827 -182881 -137361 -83954 -56450 -74476 -79725 -86160 -109858 12124 6197 -12910 -25183
10017b5183n5133m2585L1513J7238m3020m833L2428j3909o4416L2029L2201o3295
$$ -25183 -80316 -122901 -91388 -74150 -117170 -122003 -89575 -103484 -167900 -135871 -103670 -166965
10005a66965R0063L4029k5988K0059m1306L4352l8981j1161K402M8729O2796l4416
$$ -166965 -76902 -42873 -68861 -48802 -90108 -55756 -94737 -105898 -103496 -54767 8029 -26387
9993b6387J6314m6259j6917R283j17114j84N9347K6194o3001j217O4371J2419
$$ -26387 -10073 -56332 -73249 -63966 -181080 -181264 -121917 -95723 -158724 -159941 -95570 -83151
9981h3151k9060j752J8067m8216l4592J1416N5263j6016M1718K408N7813j7127
$$ -83151 -112211 -113963 -95896 -144112 -178704 -167288 -112025 -128041 -86323 -83915 -26102 -43229
9969d3229p629k4773n2935R9314l529j5123j7372j02332j5833j2509L1446Q1573
$$ -43229 -50858 -75631 -128566 -29252 -32781 -47904 -65276 -167608 -183441 -195950 -164504 -82931
9957h2931M572n6846k0388M1815M940L7326j8802N7671l7480K7704J6864j9023
$$ -82931 -78359 -135205 -155593 -113778 -108838 -71512 -90314 -32643 -70123 -42419 -25555 -44578
9945d4578j5514p9103n265M2266N6409k6398m6057j6073N0849P7723j22613j5255
$$ -44578 -60092 -139195 -144460 -102194 -45785 -72183 -118240 -134313 -83464 -5741 -128354 -143609
9933a43609K1265k5511J01040L39p401m0205K6282M9036L9795k5896q7006P497
$$ -143609 -122344 -147855 -46815 -46476 -53877 -94082 -67800 -18764 21031 -4865 -91871 -84374
9921h4374L4645m2432p4m5012J3944l4397M403O590J5533R1604n8416k403j26383
$$ -84374 -49729 -92161 -92235 -137247 -123303 -157700 -153297 -146707 -131174 -39570 -97986 -100389 -226772
9908b26772Q7930M8504o3904k8100J3247L3268P0120N2179q6651o3265L2703L5527
$$ -226772 -138842 -90338 -154242 -182342 -169095 -135827 -65707 -13528 -100179 -163444 -130741 -95214
9896i5214Q102J1470m7258K2311o0305J3417M936O6684n872r5034M2266M5020
$$ -95214 -87112 -75642 -122900 -100589 -160894 -147477 -142541 -75857 -81729 -176763 -134497 -89477
9884h9477l0254r97o7908J6686N8832M127N3742J402j36340L8361R7355q3129
$$ -89477 -119731 -120728 -188636 -171950 -113118 -108991 -55249 -53847 -190187 -151826 -54471 -137600
9872a37600m4540K2498j6415L8860K8024m7233j620k8300K8541L2574M1524l409
$$ -137600 -182140 -159642 -176057 -137197 -109173 -156406 -158026 -186326 -157785 -125211 -83687 -87096
9860h7096m4674Q0948K6315j22834p6536J1850M2408P2639l2789q669m4081J08735
$$ -87096 -131770 -50822 -24507 -147341 -223877 -212027 -169619 -96980 -129769 -138438 -182519 -73784
9848g3784N3431L7057l5198j11901K0838J18001L4726j02171m2794K200l8776
$$ -73784 -20353 16704 -18494 -130395 -109557 8444 43170 -59001 -101795 -99595 -138371
9837a38371J0165l3520l394P7464Q0717M1786r1799l374r9308L1603M8464O9837
$$ -138371 -128206 -161726 -165120 -87656 -6939 34847 -56952 -60326 -159634 -128031 -79567 -9730
9825i730n7648n6936j6857P3607N132l4915J070N0674k5170p0087K3547Q6037
$$ -9730 -67378 -124314 -141171 -67564 -62432 -97347 -96277 -45603 -70773 -140860 -117313 -31276
9813c1276l27P7490n7945k3363n7693K0093j2860l3379N1704L4975p977m7192
$$ -31276 -31603 45887 -12058 -35421 -93114 -73021 -85881 -119260 -67556 -32581 -40558 -87750
9801h7750o8281n8575O3374Q4839K0590N2466L6083o1723l2200j15579K9623Q8655
$$ -87750 -156031 -214606 -151232 -66393 -45803 6663 42746 -18977 -51177 -166756 -137133 -48478
9789d8478j4499n4955M9017O4830n9728m2538o1625l1561J14752q265m998O8569
$$ -48478 -62977 -117932 -68915 -4085 -63813 -106351 -167976 -199537 -84785 -93050 -98048 -29479
9777b9479o0546J105m3104o0807q315Q2568M4108L9372j9523L4096j227q1589
$$ -29479 -90025 -88920 -132024 -192831 -201146 -118578 -74470 -35098 -54621 -20525 -21752 -103341
9765a03341J8413K8018K4351o4213L1353M1496l1733J7544K9530k9963m0380k6046
$$ -103341 -84928 -56910 -32559 -96772 -65419 -23923 -55656 -38112 -8582 -38545 -78925 -104971
9753a04971l213n3904K917o41J03529r2299N3624Q2432m7761J4603j9106l7008
$$ -104971 -108184 -162088 -159171 -159812 -56283 -148582 -94958 -12526 -60287 -45684 -64790 -101798
9741a01798J14222m3887o9603N0753J7868j3468N7129l454R8715j8703p9291l8895
$$ -101798 12424 -31463 -101066 -50313 -32445 -45913 11216 7762 106477 87774 8483 -30412
9729c0412K2605j6308l1055j2590J7838N889K5216r4398j13054J34001L9331K7626
$$ -30412 -7807 -24115 -55170 -67760 -49922 -44033 -18817 -113215 -226269 -92268 -52937 -25311
9717b5311J5015j38335P757O1807Q4771J3628j07872n6286N2773N6281M1094k8321
$$ -25311 -10296 -148631 -140874 -79067 5704 19332 -88540 -144826 -92053 -35772 5322 -22999
9705b2999M5708P0074l7601j09873L3502M5315m8207J360K1397Q8271n1943l2319
$$ -22999 22709 92783 55182 -54691 -21189 24126 -24081 -22721 -1324 86947 35004 2685
9693B685K1695l7545r16j2639k5685L0418Q1763K0122j0291L496K3687l994o2228
$$ 2685 24380 -13165 -14081 -26720 -52405 -21987 59776 79898 69607 73103 96790 92796 30568
9680C0568m2244O0914j0514k9582n8182j02519J30590J6573N9223j0208p1818
$$ 30568 -11676 49238 38724 9142 -49040 -151559 -20969 -4396 54827 44619 -27199
9669b7199J3629M2408J6797K9367k4621n7412L4043L6240l2536r2287J9227Q9736
$$ -27199 -13570 28838 45635 75002 50381 -7031 27012 63252 30716 -61571 -42344 47392
9657D7392m2303L30o5869N1211k0347N6271O872j0891P0656J7276j5452j3390
$$ 47392 5089 5419 -60450 -9239 -29586 26685 33557 22666 93322 110598 95146 81756
9645H1756O1465n2718l2121K504J423O1265j6689P4463r6866j55114k2688J11216
$$ 81756 143221 90503 58382 60886 62309 123574 106885 181348 84482 -70632 -93320 17896
9633A7896j9461K7534l3303k0134J05976n8022J4158n8678k8075j3112J8929L6403
$$ 17896 -1565 25969 -7334 -27468 78508 20486 34644 -24034 -52109 -65221 -46292 -9889
9621i889K7885J2684O904k7553n3489N0767n5036N989m8486M4628k4823K8195
$$ -9889 17996 30680 37584 10031 -43458 7309 -47727 -41738 -90224 -45596 -70419 -42224
9609d2224L58O2761N7394K5290M423j08738J8825J0684J5013j3802n7915q8581
$$ -42224 -41866 20895 78289 103579 108002 -736 18089 28773 43786 29984 -27931 -116512
9597a16512L4963Q4255N789l8534L332K7567M023k4418r140M0166O3441l8150
$$ -116512 -81549 2706 8495 -30039 -26707 860 4883 -19535 -28675 11491 74932 36782
9585C6782j10905l1763J1233j3721P4070L4708j9208r062Q700J2856j8967j8351
$$ 36782 -74123 -105886 -94653 -108374 -34304 404 -18804 -27866 -19166 -6310 -25277 -43628
9573d3628j8592k935k5464J9596n7958M5601K2189J2352M3812k618l1848p464
$$ -43628 -62220 -65155 -90619 -71023 -128981 -83380 -61191 -48839 -5027 -7645 -39493 -46957
9561d6957K6396j5237k4496M3009l2003l0553K4051L3023l6009l5803O8388q5855
$$ -46957 -20561 -35798 -60294 -17285 -49288 -79841 -55790 -22767 -58776 -94579 -26191 -112046
9549a12046J8153R8252k7232k0951p3958o760Q1624m6231J4577L8404J6959l3671
$$ -112046 -93893 4359 -22873 -43824 -117782 -124542 -42918 -89149 -74572 -36168 -19209 -52880
9537e2880M847L4978m0736O0857m6040o8217Q2071p9091M1851n8051m737P923
$$ -52880 -48033 -13055 -53791 7066 -38974 -107191 -25120 -104211 -62360 -120411 -125148 -117225
9525a17225Q1625l2332m5477O4578K5536p5275L5720M6236N2513l244j5379n8294
$$ -117225 -35600 -67932 -113409 -48831 -23295 -98570 -62850 -16614 35899 32655 17276 -41018
9513d1018L8644M0269K1219r277o839p7757l0568m822O5341k5886P6092k8615
$$ -41018 -2374 37895 59114 49837 42998 -34759 -65327 -70149 -4808 -30694 45398 16783
9501A6783N4m2672J1128L4709k5122p9538M5579P0968K8489j872p6531m77Q0693
$$ 16783 16837 -25835 -14707 20002 -5120 -84658 -39079 31889 60378 58506 -18025 -18502 62191
9488F2191m4900j1432k8121p8496l2892K8736Q0678q45J7088M4939J01404P227
$$ 62191 17291 5859 -22262 -100758 -133650 -104914 -24236 -25081 -7993 36946 138350 145577
9476A45577q5600m4073N1060M082k6399M0393J06346k0978L429o1601o7932n7874
$$ 145577 59977 15904 66964 71046 44647 85040 191386 170408 173837 112236 44304 -13570
9464a3570J08456p5207O446K3083Q91q400J2936j6770K8248p0893l5184K6278
$$ -13570 94886 19679 26125 49208 50099 41699 54635 37865 66113 -4780 -39964 -13686
9452a3686q31Q0253J3808q6480K3934P2371J3255J3406P940j17649L2144K2711
$$ -13686 -14517 65736 79544 -6936 16998 89369 102624 116030 123970 6321 38465 61176
9440F1176k1891Q4561P8379n0485j11534m3078J1004O8051Q6482q3321N6700J05738
$$ 61176 39285 123846 202225 151740 40206 -2872 8132 76183 162665 79344 136044 241782
9428B41782j12885p4517P7703R1469N7116k1572K0461k3806k3583p540R4982M217
$$ 241782 128897 54380 132083 223552 280668 259096 279557 255751 232168 224628 319610 323827
9416C23827r0457j1702N4380k9562k6521N1511N1434l0963O1563k5472k7752P2776
$$ 323827 233370 221668 276048 246486 219965 271476 322910 291947 353510 328038 300286 373062
9404C73062N8122o280L4734Q8789p7768M9647j1337r9423M9744J00511K1380o1952
$$ 373062 431184 424904 459638 548427 470659 520306 508969 409546 459290 559801 581181 519229
9392E19229n9977r716K2452M3131L2140n927o0262l3687N8560k2357l8308Q7318
$$ 519229 459252 449536 471988 515119 547259 541332 481070 447383 505943 483586 445278 532596
9380E32596J4637o8601O4547P8870N5262n8004m8515m8021j8138L7791l476J4776
$$ 532596 547233 478632 543179 622049 677311 619307 570792 522771 504633 542424 538948 553724
9368E53724O5671j10923Q2559j9062O3087k0479o6045j4318Q7556K01p3464J8605
$$ 553724 619395 508472 591031 571969 635056 614577 548532 534214 621770 621971 548507 567112
9356E67112m6637n0716J316q0718k9015O0903n4890J03410O3533R1529r3511k1147
$$ 567112 520475 469759 471075 390357 361342 422245 367355 470765 534298 625827 532316 511169
9344E11169O2754o5037j29853j1152l9167j2469N7630K9052l9012M2545M0716
$$ 511169 573923 508886 379033 367881 328714 316245 373875 402927 363915 406460 447176
9333D47176K4077l4139K4623n8277J5081j6397l5693O4986o2609o0627J246n410
$$ 447176 471253 437114 461737 403460 418541 402144 366451 431437 368828 308201 309447 304037
9321C04037m3405j9734K8664l234O2323m9980k0841R9192R0401j46030j6772k9899
$$ 304037 260632 240898 269562 266328 328651 278671 257830 357022 447423 301393 284621 254722
9309B54722r298P72J2441k6086j77m8974j1569L2366n565l7066K9791L0200p0011
$$ 254722 245424 246196 258637 232551 232374 183400 171831 204197 198632 161566 191357 221557 151546
9296A51546M050L5083m8077O7902n9687k8561M6344k366j3719R8307n6105m1494
$$ 151546 155596 190679 142602 210504 150817 122256 168600 166234 152515 250822 194717 153223
9284A53223Q7783J12963j19025m7342l901O8151P9396p8230k2402J9638k3070
$$ 153223 241006 353969 234944 187602 183701 251852 331248 253018 230616 250254 227184
9273B27184M7313K8521L6168L5952m4865r724R2268J0794P2581m2237l0782O4372
$$ 227184 274497 303018 339186 375138 330273 320549 412817 423611 496192 453955 423173 487545
9261D87545K5255K8522q563q2080k1173J0109L9641N5811j38302Q0033J4480j5245
$$ 487545 512800 541322 532759 450679 429506 439615 479256 535067 396765 476798 491278 476033
9249D76033O9087M0918m2609J7775N6351K7909r6973N3531O940O192k6497o9450
$$ 476033 545120 586038 543429 561204 617555 645464 548491 602022 608962 615154 588657 519207
9237E19207P3315O5977J8342p0537j1436R1420M3647o7886J0696M5470M2286l111
$$ 519207 592522 658499 676841 606304 594868 686288 729935 662049 672745 718215 760501 757390
9225G57390q2743K3430O4508K0063K1462J7023M8256R486o795N6168j2753M5519
$$ 757390 674647 698077 762585 782648 804110 821133 869389 878875 872080 928248 915495 961014
9213I61014O3084N0091m8834j03839k3691P7884P541j105L2936M7966L87L9374
$$ 961014 1024098 1074189 1025355 921516 897825 975709 983250 982145 1015081 1063047 1063434 1102808
9201A102808n0894K4797j1905P68p927P1360l5982k2383J3387M7526j13407J1059
$$ 1102808 1051914 1076711 1064806 1065574 1057647 1129007 1093025 1070642 1084029 1131555 1018148 1029207
9189A029207L1509M382j32686J6915j4456R5867J15608J830L0569l8343O1465
$$ 1029207 1060716 1065098 932412 949327 934871 1030738 1146346 1148176 1178745 1140402 1201867
9178A201867J44334J05726P1963J5948n4516m9454O9517q3370k2764p2053Q7036
$$ 1201867 1346201 1451927 1523890 1539838 1485322 1435868 1505385 1422015 1399251 1327198 1414234
9167A414234L5277r939P2313P3657j1381J1581p2156P1516Q3638K3834L8723J4344
$$ 1414234 1449511 1439572 1511885 1585542 1574161 1585742 1513586 1585102 1668740 1692574 1731297 1745641
9155A745641n9040L6179N4963R78L4277L1920q798J2476N3834M3081j5583m061
$$ 1745641 1686601 1722780 1777743 1778721 1812998 1844918 1836120 1848596 1902430 1945511 1929928 1925867
9143A925867p317R9169L5602J9256L3443L3939K4018J64095P1979O3545K9227
$$ 1925867 1918550 2017719 2053321 2072577 2106020 2139959 2163977 2328072 2400051 2463596 2492823
9132B492823R2462O5832P1206J39347L9091N7336n610O0215l2869M9338J05049
$$ 2492823 2585285 2651117 2722323 2861670 2900761 2958097 2952487 3012702 2979833 3029171 3134220
9121C134220O1344K9440m7610J62593Q7344j3454L2031K9402O0239J13684P5136
$$ 3134220 3195564 3225004 3177394 3339987 3427331 3413877 3445908 3475310 3535549 3649233 3724369
9110C724369L3825J21649P2751J44679p6843J02269Q7256J27145J73245J74626
$$ 3724369 3758194 3879843 3952594 4097273 4020430 4122699 4209955 4337100 4510345 4684971
9100D684971O2694J99616K01687J92543J83252K02518J31711K64137K85648L02828
$$ 4684971 4747665 4947281 5148968 5341511 5524763 5727281 5858992 6123129 6408777 6711605
9090F711605K79235K77519K42535K79443J70018K94225K14222K42357J13637K20786
$$ 6711605 6990840 7268359 7510894 7790337 7960355 8254580 8468802 8711159 8824796 9045582
9080I045582J13936K20658J06475M79512L34648L80117L71902M00368K37888K97954
$$ 9045582 9159518 9380176 9486651 9966163 10300811 10680928 11052830 11453198 11691086 11989040
9070A1989040K37516M70837L62500O15993N13287M43662L70194N19484M05500
$$ 11989040 12226556 12697393 13059893 13675886 14189173 14632835 15003029 15522513 15928013
9061A5928013N67794N35865O57196O02474P65291N76781O83228N84213R04635
$$ 15928013 16495807 17031672 17688868 18291342 19056633 19633414 20316642 20900855 21805490
9052B1805490Q25418Q62723Q30453R72492R72988J018064P89420J037763J019271
$$ 21805490 22630908 23493631 24324084 25296576 26269564 27287628 28077048 29114811 30134082
9043C0134082J076607R93423J187115Q90728R66464R75067J349259J350620J553557
$$ 30134082 31210689 32204112 33391227 34281955 35248419 36223486 37572745 38923365 40476922
9034D0476922J744887K237421K278013K441385K685697L253430L392032L718120
$$ 40476922 42221809 44459230 46737243 49178628 51864325 55117755 58509787 62227907
9026F2227907L923595M331544M513353M863871N395268O973164Q860347J1638959
$$ 62227907 66151502 70483046 74996399 79860270 85255538 92228702 101089049 112728008
9018A12728008J4392891J8056839K2748719K7962612L3589909M1079943M5986909
$$ 112728008 127120899 145177738 167926457 195889069 229478978 270558921 316545830
9011C16545830N1524346L4576993l7731670p2852726o9656746n2852948l5138855
$$ 316545830 368070176 402647169 364915499 292062773 222406027 169553079 134414224
9004A34414224k4472835j7215754j2939584r098022o927453n610669n381746m706141
$$ 134414224 109941389 92725635 79786051 70688029 63760576 58149907 52768161 48062020
8996D8062020m664375l687892l236505k595055k704943k091484j904565j572654
$$ 48062020 43397645 39709753 36473248 33878193 31173250 29081766 27177201 25604547
8988B5604547j572212j236888j021210p83741r75399j018134r90065q94047r01749
$$ 25604547 24032335 22795447 21774237 20990496 20015097 18996963 18006898 17112851 16211102
8979A6211102n85946m82226k45480l85181k58981m80264m86329o71852m67271
$$ 16211102 15625156 15142930 14897450 14512269 14253288 13773024 13286695 12614843 12147572
8970A2147572n26577k13907l36923j11114k28241k92138m43279l01869m36802
$$ 12147572 11620995 11407088 11070165 10959051 10730810 10438672 9995393 9693524 9256722
8961I256722k21038k38438j97234l60767j31162k53218k13634m4559R8871n7703
$$ 9256722 9035684 8797246 8600012 8239245 8108083 7854865 7641231 7596672 7695543 7637840
8951G637840l9546k17627l0043j83136j1037m0689O3933k917J64599j8439J10025
$$ 7637840 7598294 7380667 7350624 7167488 7156451 7115762 7179695 7176778 7341377 7322938 7432963
8940G432963O446J32659K1396J40493P2089K65655L03028M91440N61366O73947
$$ 7432963 7439409 7572068 7593464 7733957 7806046 8071701 8374729 8866169 9427535 10101482
8930A0101482Q38785J170499J444740J807008K065570K147826K164076O49458
$$ 10101482 10940267 12110766 13555506 15362514 17428084 19575910 21739986 22389444
8922B2389444k157033l154516l021334k345662j699109j077679q53458o34621
$$ 22389444 20232411 17077895 14056561 11710899 10011790 8934111 8080653 7446032
8914G446032n21997m72509m86882l81867k99703m31519l44674k28637k38683j49647
$$ 7446032 6924035 6451526 5964644 5582777 5283074 4851555 4506881 4278244 4039561 3889914
8904C889914j57620k6161j21425m4681j38334r6670p6161q3824M0804J7848o3666
$$ 3889914 3732294 3706133 3584708 3540027 3401693 3305023 3228862 3145038 3185842 3203690 3140024
8893C140024K587J30240N5197K2192J70087J18325R202j02216j3251r7362j81962
$$ 3140024 3142611 3272851 3328048 3350240 3520327 3638652 3647854 3545638 3532387 3435025 3253063
8882C253063n9923j32296q7418j74487j69396j27779m0225j9886Q134l6830j9281
$$ 3253063 3193140 3060844 2973426 2798939 2629543 2501764 2461539 2441653 2449787 2412957 2393676
8871B393676o3598n1301O272L1623R6925J03508l776J08064J04728Q5258J77188
$$ 2393676 2330078 2278777 2285049 2316672 2413597 2517105 2513329 2621393 2726121 2811379 2988567
8860B988567K04914J62957J58293J9489Q4462K5872P674j97488j14922q5694j68105
$$ 2988567 3193481 3356438 3514731 3534220 3618682 3644554 3652228 3454740 3339818 3254124 3086019
8849C086019k66873l24631k59879q5820k78170m9830j25108O1396J36633O41j2226
$$ 3086019 2819146 2494515 2234636 2148816 1870646 1820816 1695708 1757104 1893737 1894378 1882152
8838A882152P5415n8339J12107j34302k6265l0115M001Q755M2283l1911K3341
$$ 1882152 1957567 1899228 2011335 1877033 1850768 1820653 1824654 1833409 1875692 1843781 1867122
8827A867122l4936j7523j6398J7255k6441m2883p0206J8690m5480j05049r4989
$$ 1867122 1832186 1814663 1798265 1815520 1789079 1746196 1675990 1694680 1649200 1544151 1449162
8816A449162o6697j49231n0566q8306p3512o4518o622j52562m2630N9363k6833
$$ 1449162 1382465 1233234 1182668 1094362 1020850 956332 949710 797148 754518 813881 787048
8805G87048m154N9628l0554j8004K7444J1390O9462k6243j01673N178K4957O1304
$$ 787048 782894 842522 811968 793964 821408 832798 902260 876017 774344 779522 804479 865783
8793H65783n8821K1220p0301M626N8262L2097M1255r1977o7576k2512L6554L7726
$$ 865783 806962 828182 757881 762507 820769 852866 894121 802144 734568 712056 748610 786336
8781G86336M2921m1952k5337r7260Q5827l9977k6115o4683p4564K0660r457N4637
$$ 786336 829257 787305 761968 664708 750535 710558 684443 619760 545196 565856 556399 611036
8769F11036N9261o4298l2112r347k1867p684R488K9450N9051p6023o7662k4870
$$ 611036 670297 605999 573887 564540 542673 534989 544477 573927 632978 556955 489293 464423
8757D64423Q1713J8716j1792M3617k9145l9960M3948N2504N373n0234L0451m9004
$$ 464423 546136 564852 553060 596677 567532 527572 571520 624024 629397 579163 609614 560610
8745E60610R964N852l1576k3677L7445j0053m3818K7939o251l3668M1202K0249
$$ 560610 570574 576426 544850 521173 558618 548565 504747 532686 526435 492767 533969 554218
8733E54218J08J6540j1858q2559N670j5017n618j8496M9143j33779M8942P9236
$$ 554218 554326 570866 559008 476449 482119 467102 461484 442988 492131 358352 407294 486530
8721D86530K2543o2882o3377P0213L8845m4864m6586P83j6187l9413O5616j7289
$$ 486530 509073 446191 382814 453027 491872 447008 400422 401205 385018 345605 411221 393932
8709C93932k6361l0619k2083K464N0971Q2171p381o5668K0355k1981K0847O5113
$$ 393932 367571 336952 314869 317333 368304 450475 443094 377426 397781 375800 396647 461760
8697D61760l5790O6993j4621l5059J07319j15528K7549N8025l4208J8092k0480
$$ 461760 425970 492963 478342 443283 550602 435074 462623 520648 486440 504532 484052
8686D84052o8809K6342L7300P7457Q063o1544p7435O4989Q1636l0890M7826L8943
$$ 484052 415243 441585 478885 556342 564405 502861 425426 490415 572051 541161 588987 627930
8674F27930Q155R2333P718j1215K1508j1279n0738R2898j21491m4634O4351j079
$$ 627930 636085 728418 736136 724921 746429 735150 684412 777310 655819 611185 675536 674457
8662F74457j4312l9641l086j1012o0937R783O0240M0131Q0716J1973k1564j15216
$$ 674457 660145 620504 617418 606406 545469 555252 615492 655623 736339 748312 726748 611532
8650F11532k9539p1357O8791L5946k4530L2743R3767M7019j11207p8000P4554
$$ 611532 581993 510636 579427 615373 590843 623586 717353 764372 653165 575165 649719
8639F49719o1756k3676l298P3905k7705o8202L9200n831k8650m2871k6812M1870
$$ 649719 587963 564287 560989 634894 607189 538987 578187 572356 543706 500835 474023 515893
8627E15893k2960n6137K4877Q3800k4471r6697k7270R618k357l470r9739L8672
$$ 515893 492933 436796 461673 545473 521002 424305 397035 406653 404296 400826 301087 339759
8615C39759J00979P471q3231J6052r8499L4303K0186r5389M2975m1091P903L6765
$$ 339759 440738 448209 364978 381030 282531 316834 337020 241631 284606 243515 251418 288183
8603B88183n3973l7445l789O1557L2781m7897M180L4458j2497k3455m0159L1812
$$ 288183 234210 196765 192976 254533 287314 239417 243597 278055 265558 242103 201944 233756
8591B33756R807k7829M860O534j3654R7553m0889o5239M0705K1367Q718R554j7980
$$ 233756 243563 215734 220594 227128 213474 311027 270138 204899 245604 266971 275689 285243 267263
8578B67263L5154o1811K0326l566l0549k58R249J9719q496j12838Q9353j3684
$$ 267263 302417 240606 260932 257366 226817 226559 235808 255527 247031 134193 223546 209862
8566B09862R768j6401L2458j8188r5447M1608L6229K9549q577Q086o5984k0445
$$ 209862 219630 203229 235687 217499 122052 163660 199889 229438 220861 228947 162963 142518
8554A42518J9150m1257n481M5071j320p3363K8503J6296o3755J07822n347m5676
$$ 142518 161668 120411 114930 160001 158681 85318 113821 130117 66362 174184 168837 123161
8542A23161l490l2340P3012K8600l5058L5373J3023P3501k5714n4873L737M373
$$ 123161 119671 87331 160343 188943 153885 189258 202281 275782 250068 195195 198932 203305
8530B03305l663j5279r989m1685k4483K187p114K2747N7287n2952J1149Q2415
$$ 203305 199642 184363 174374 132689 108206 110393 103279 126026 183313 130361 141510 223925
8518B23925L203N3422p8883n1086n6688L4719o533K1483j5597K0283K1526k7137
$$ 223925 227128 280550 201667 150581 93893 128612 122079 143562 127965 148248 169774 142637
8506A42637J1391J3000J883r1922K8345P5957O5767o9441r1504N1137N6641q4614
$$ 142637 154028 167028 168911 76989 105334 181291 247058 177617 86113 137250 193891 109277
8494A09277Q3081r75n2657K1804k2386J43277j07258j41813N287M4266P619M4416
$$ 109277 192358 191383 138726 160530 138144 281421 174163 32350 37637 81903 89522 133938
8482A33938k1790M3787R7872o9518j3489o100j18666M4041r8634n879P1546N5226
$$ 133938 112148 155935 253807 184289 170800 164700 46034 90075 -8559 -14438 57108 112334
8470A12334l5486K3376M3561m1705q0273M2390l0379p0947J6534Q2767j8245k5453
$$ 112334 76848 100224 143785 102080 21807 64197 33818 -37129 -20595 62172 43927 18474
8458A8474M667l0522P8769O0751l1260J0262p673k0294O8984J4240j9253n688
$$ 18474 23141 -7381 71388 132139 100879 111141 103468 83174 152158 166398 147145 141457
8446A41457j8040k2588j0700J3412o1632L7622J3563l2081k6060K1116J1520k0821
$$ 141457 123417 100829 90129 103541 41909 79531 93094 61013 34953 56069 67589 46768
8434D6768N446J87j2732L1142m8304J3526n5256j6071Q3963O326j42452q993Q7797
$$ 46768 52214 52401 39669 70811 22507 36033 -19223 -35294 48669 54995 -87457 -96450 -8653
8421h653M2628L7235j4560j45882O5878O3930n7228O5417j5168j9579M496P836
$$ -8653 33975 71210 56650 -89232 -23354 40576 -16652 48765 33597 14018 18514 26350
8409B6350l3448N341K1207LR393O3543m7684N0806J0511o229j6411K0481p056
$$ 26350 -7098 -1757 19450 19453 28846 92389 44705 95511 106022 99793 83382 103863 96807
8396I6807m9995m7856p2170M5596M6384n4466P7581j7608L8604J2209k689k2137
$$ 96807 46812 -1044 -73214 -27618 18766 -35700 41881 24273 62877 75086 72397 50260
8384E0260P608j18729j212j5241j2522J04241j3215j13129N2789R578L2923J231
$$ 50260 57868 -60861 -62073 -77314 -89836 14405 1190 -111939 -59150 -49572 -16649 -15418
8372a5418K6729j2561M0456O2004J7924r6658K4828l0028n3123L523M0482l5771
$$ -15418 11311 -1250 39206 101210 119134 22476 47304 17276 -35847 -32324 8158 -27613
8360b7613J973O2718k4392O723j8705K5280l1070M9672l7365k1884M1134L9649
$$ -27613 -25640 37078 12686 19409 704 25984 -5086 44586 7221 -14663 26471 66120
8348F6120j8097k9595o7649J2691R8741m7742L3227K3398r963J304k7755R252
$$ 66120 48023 18428 -49221 -36530 62211 14469 47696 71094 61131 62435 34680 43932
8336D3932O5387k7870l0747j7995R3994q2615l845J764m486K6509n6432L1891
$$ 43932 109319 81449 50702 32707 126701 44086 40241 42005 37519 64028 7596 39487
8324C9487M1680k8116q1765M9028O7563R879p1202M6902J210n5836O8152j6617
$$ 39487 81167 53051 -28714 20314 87877 97756 26554 73456 74666 18830 86982 70365
8312G0365m5368K0863K8324J1465l7170O5051O0858m2878M6400J2343O760O7501
$$ 70365 24997 45860 74184 85649 48479 113530 174388 131510 177910 190253 197013 264514
8300B64514p3174K8907j16267q595O1753m5743l7786n650O2969p177l3410K2907
$$ 264514 191340 220247 103980 95385 157138 111395 73609 67959 130928 123751 90341 113248
8288A13248k934L9825M5539j02207N209N878o9317N669m4185m4126k3573J3980
$$ 113248 110314 150139 195678 93471 98680 104558 35241 40910 -3275 -47401 -70974 -56994
8276e6994N5463M7877K0748k687k4457K9499l4178J6925j8546K8125j3506M5337
$$ -56994 -1531 46346 67094 64407 39950 69449 35271 52196 33650 61775 48269 93606
8264I3606k5320m2344j229o0474K8870j6284p1286R1103j1439Q2223M301o0694
$$ 93606 68286 25942 24713 -35761 -6891 -23175 -94461 -3358 -14797 67426 71727 11033
8252A1033M1588J05805k8935m8403j3792N09p1302Q1858j3250r1759k2860J27352
$$ 11033 52621 158426 129491 81088 67296 67805 -3497 78361 65111 -26648 -49508 77844
8240G7844L6287N9163m967m959M8817j12627l78J6976j6273k3427m993J4060l4827
$$ 77844 114131 173294 168327 163368 212185 99558 99180 116156 99883 76456 71463 85523 50696
8227E0696O8459m848o2714R5100L6659P3696K553Q634m2282n4561q092k7818k6943
$$ 50696 119155 114307 51593 146693 183352 257048 259601 268235 225953 171392 163300 135482 108539
8214A08539L6973J1212J8240k724J2279p6923J2895k773J135P3815J6561J5209
$$ 108539 145512 156724 174964 172240 184519 107596 120491 117718 118853 192668 209229 224438
8202B24438J1150J1848n702n4815l6352P6647N9485P8582o4847J10654Q06330
$$ 224438 235588 247436 241734 186919 150567 227214 286699 365281 300434 411088 1217418
8191A217418l97010l62502o448K6767l7415n3176M3796j01081O1862n314L955
$$ 1217418 820408 457906 451458 478225 440810 387634 431430 330349 392211 386897 390852
8180C90852O3464k345j9564N5779m2354Q520o412J02082j4025k1042K4695J28659
$$ 390852 454316 451971 432407 488186 445832 454352 447940 550022 535997 514955 539650 668309
8168F68309K6246L669K7475J11079P5907o81m4202N5011o5697l1452n9356Q330
$$ 668309 694555 698224 725699 836778 912685 912004 867802 922813 857116 825664 766308 774638
8156G74638j8069R7211J1833k2360O4957O186L6758o6595N0465m2931j80361j2524
$$ 774638 756569 853780 865613 843253 908210 914396 951154 884559 935024 892093 711732 699208
8144F99208o055l5680k6507o0252O0919j0117m7168j3782M9161O3831L932j2431
$$ 699208 693153 657473 630966 570714 631633 621516 574348 560566 609727 673558 677490 665059
8132F65059j3394K8175L2704k0546K3613J4509K9258k7648P5644J06968m4142
$$ 665059 651665 679840 712544 691998 715611 730120 759378 731730 807374 914342 870200
8121H70200n3437O6201j1787n6138O4763J7219j498Q4459O4448J27181M3727J30594
$$ 870200 816763 882964 871177 815039 879802 897021 895523 979982 1044430 1171611 1215338 1345932
8109A345932O9418R7628R0765J06750Q4645P8471M7159j19091q2749l2921j72630
$$ 1345932 1415350 1512978 1603743 1710493 1795138 1873609 1920768 1801677 1718928 1686007 1513377
8098A513377l2864r7743r8130n7891k6669j29942j11635r1657N6080M7485L8041
$$ 1513377 1480513 1382770 1284640 1226749 1200080 1070138 958503 866846 922926 970411 1008452
8087A008452l6168J4596n4004j20471p949q0239j3708j4802p187J6838N4411q8886
$$ 1008452 972284 986880 932876 812405 804456 724217 710509 695707 688520 705358 759769 670883
8075F70883J7063K6811j01453k5783m7310m0514L0909N2138L3307j7260K7206
$$ 670883 687946 714757 613304 587521 540211 499697 530606 582744 616051 598791 625997
8064F25997n2841N049p6181L4764M125P2338J0013j17313k1983J04560K1525J4377
$$ 625997 573156 578205 502024 536788 540913 613251 623264 505951 483968 588528 610053 624430
8052F24430N4096l1249l299O9417k3542j4754J1551R105q187M0093r8833k4846
$$ 624430 678526 647277 643978 713395 689853 675099 686650 695755 687568 727661 628828 603982
8040F03982o060K4846J8334n1196N375k2989m521K1564Q584k8935K9677Q525K5440
$$ 603982 597922 622768 641102 589906 595281 572292 567771 589335 597919 568984 598661 607186 632626
8027F32626K8691l4844k5977O3398K7591q6328M2017J347J5831N328o8359K3386
$$ 632626 661317 626473 600496 663894 691485 605157 647174 648521 664352 669680 601321 624707
8015F24707L2379m0988J9021J47085P0537l449J4209O83J5690j7415n9199k5046
$$ 624707 657086 616098 635119 782204 852741 849292 863501 864184 879874 862459 803260 778214
8003G78214N5793K4562p928O1197p54j9382j2324K0451L4605j4128j3316j5793
$$ 778214 834007 858569 850641 911838 911084 891702 879378 899829 934434 920306 906990 891197
7991H91197p059K1593k930R491K945q2964j0227r458K2618n0672K1029p3976j04379
$$ 891197 884138 905731 902801 912292 915237 832273 822046 812588 835206 784534 805563 731587 627208
7978F27208J06097O8217r3122J08171J06622n6748q0767N4861M20o3550j6238
$$ 627208 733305 801522 708400 816571 923193 866445 785678 840539 840959 777409 761171
7967G61171K4997j1091m6652N5863K7199L6751O4596l2560j6671J4958k1487N5778
$$ 761171 786168 775077 728425 784288 811487 848238 912834 880274 863603 878561 857074 912852
7955I12852k0290j319n2037J1127L8441J2966L2323j3696j6830J6024K9475k5827
$$ 912852 892562 891243 839206 850333 888774 901740 934063 920367 903537 919561 949036 923209
7943I23209q3593J5929J0934L5677L062P131J7307K3803p2208q101r760M9035
$$ 923209 839616 855545 866479 902156 905218 912349 929656 953459 881251 873150 863390 912425
7931I12425O2171m8957J7998l7835M7230K7304n0795L4144l5259M5535O6679J7117
$$ 912425 974596 925639 943637 905802 953032 980336 929541 963685 928426 973961 1040640 1057757
7919A057757L0445L9423k7419Q136j5170k0053K0309M8444N1384Q0937m6648J826
$$ 1057757 1088202 1127625 1100206 1108342 1093172 1073119 1093428 1141872 1193256 1274193 1227545 1229371
7907A229371j2790Q099J4969K0232P368j9936K0873p8773L8869j1193k4099P5264
$$ 1229371 1216581 1224680 1239649 1259881 1267249 1247313 1268186 1189413 1228282 1217089 1192990 1268254
7895A268254q9446q2115o5509R920l621R343O6628R3569p0778j09249k5367J05077
$$ 1268254 1178808 1096693 1031184 1041104 1037483 1046826 1113454 1207023 1136245 1026996 1001629 1106706
7883A106706K7802l671J5928m9492K3052J0321R869q9930K0464J24083J3527j165
$$ 1106706 1134508 1130837 1146765 1097273 1120325 1130646 1140515 1050585 1071049 1195132 1208659 1207494
7871A207494L7309j4586n4328n1280n6825j3464m9048n3813j373k5524m7807o3068
$$ 1207494 1244803 1230217 1175889 1124609 1067784 1054320 1005272 951459 950086 924562 876755 813687
7859H13687k6797J3802m4484n8876J0226m8394k1099Q159K8943m6212l1082K6905
$$ 813687 786890 800692 756208 697332 707558 659164 638065 646224 675167 628955 597873 624778
7847F24778N6781j11779m8918O4998m129K215l7414k4461k7531K7729O1025p6979
$$ 624778 681559 569780 520862 585860 581731 583946 546532 522071 494540 522269 583294 506315
7835E06315m4320p1614K0278Q5724J2896j9758p9121M348P894m0277R559Q0422
$$ 506315 461995 390381 410659 496383 509279 489521 410400 414748 422642 382365 391924 472346
7823D72346K2249m3413M7360r983m060k1959l7403o389n7430o4591J246P5900
$$ 472346 494595 451182 498542 488559 484499 462540 425137 418748 361318 296727 297973 373873
7811C73873j6953Q882N8429Q182P9930m2016O4899J2899r4008j17629N0054J05118
$$ 373873 356920 365802 424231 432413 512343 470327 535226 548125 454117 336488 386542 491660
7799D91660M0952o550j18628J2132J7571j43159L4914N3196k9684N1767j8771
$$ 491660 532612 526062 407434 419566 437137 293978 328892 382088 352404 404171 385400
7788C85400J4894l3822k5882Q8451J0891J6722p829o9093K9557N6172l7603K1338
$$ 385400 400294 366472 340590 429041 439932 456654 448825 379732 409289 465461 427858 449196
7776D49196q102J8167L6830q1687p801K387l5028M2663Q7699R564J3116M273l7741
$$ 449196 441094 459261 496091 414404 406603 408990 373962 416625 504324 513888 527004 531277 493536
7763D93536N0061o8818r0752R106N1966P0585j6804n0674N7911K4198p6533m7543
$$ 493536 543597 474779 384027 393133 445099 515684 498880 448206 506117 530315 453782 406239
7751D06239L2714K4283L3082J7559J542k8914j1424N3584l5405J5161P315M3006
$$ 406239 438953 463236 496318 513877 515419 486505 475081 528665 493260 508421 515736 558742
7739E58742q823k6460J8583j3726J8831L9128l7834k383O574k4390l7254J1265
$$ 558742 549919 523459 542042 528316 547147 586275 548441 546058 552632 528242 490988 502253
7727E02253l6263k9494K1492P8416o658M9463L6351j2524k6390L5135o9658N2593
$$ 502253 465990 436496 457988 536404 529746 579209 615560 603036 576646 611781 542123 594716
7715E94716k4531n940K4257o7735M3133l9606M1986L0647n2919L253j2625r5068
$$ 594716 570185 564245 588502 520767 563900 524294 566280 596927 544008 547261 534636 439568
7703D39568P2690N9133M0075l6953q905q526J05325P541J1688j740p7628N7693
$$ 439568 512258 571391 611466 574513 565608 557082 662407 669948 681636 679896 602268 659961
7691F59961k119J7685O4763n3101k595Q539j8227L35m7249m0856Q0055N5740k4002
$$ 659961 657842 675527 740290 687189 684594 693133 674906 675241 627992 587136 667191 722931 698929
7678F98929n61O5554K2246m4007m3344J7329L5755j1621j6838K3476O8979q2097
$$ 698929 698368 763922 786168 742161 698817 716146 751901 740280 723442 746918 815897 733800
7666G33800n6218Q8840K8515J3191j8005p5542K7534K9394L626m2836K5611P2183
$$ 733800 677582 766422 794937 808128 790123 714581 742115 771509 775135 732299 757910 830093
7654H30093L1383j18375o0247q4020O5046N4644R6754p8451l0647L1947J7621
$$ 830093 861476 743101 682854 598834 663880 718524 815278 736827 706180 738127 755748
7643G55748K4924J0845q5789R5135l4112j15091L9757O1378L9972l7836p2779
$$ 755748 780672 791517 705728 800863 766751 651660 691417 752795 792767 754931 682152
7632F82152M353M0418L6125J29341m3724m237l0274j120k2762L9801l23L7049
$$ 682152 686505 726923 763048 892389 848665 844428 814154 813034 790272 830073 829750 866799
7620H66799J684M923P436j6989J8798l0827N6555N854k568J6771M7254L6542j31381
$$ 866799 868483 873406 880842 863853 882651 851824 908379 914233 911665 928436 975690 1012232 880851
7607H80851j0328L7087R8621L2453q332o6332K7635L2012K2525K9626K9515K3546
$$ 880851 870523 907610 1006231 1038684 1030352 964020 991655 1023667 1046192 1075818 1105333 1128879
7595A128879l8497K4260J09486M2785j032p214R3447l9142k0965k7197m014k7939
$$ 1128879 1090382 1114642 1224128 1266913 1265881 1258667 1352114 1312972 1292007 1264810 1260796 1232857
7583A232857n1351k3505P7693J40364l279L1834r8459p3550j5877j09773k8644
$$ 1232857 1181506 1158001 1235694 1376058 1372779 1404613 1306154 1232604 1216727 1106954 1078310
7572A078310k7250o7969n5180J1145P2104k5473j9223K3223k6827P058M4236k0213
$$ 1078310 1051060 983091 927911 939056 1011160 985687 966464 989687 962860 969918 1014154 993941
7560I93941O0475L313r5989p6246N1788M3107J7357l0243j072K9467r087M009
$$ 993941 1054416 1057729 961740 885494 937282 980389 997746 967503 966431 995898 986811 990820
7548I90820J18k3775P3148L8058M0077k1367l7756R2912N5328J1207M6488J7990
$$ 990820 990938 967163 1040311 1078369 1118446 1097079 1059323 1152235 1207563 1218770 1265258 1283248
7536A283248k02l0583q7998J9556P0885M0145n0007j4675j7603P6784J7627p3537
$$ 1283248 1283046 1252463 1164465 1184021 1254906 1295051 1245044 1230369 1212766 1289550 1307177 1233640
7524A233640K4529L5204J40727L2079j22526r0412k0069K0314O2866k9810K240
$$ 1233640 1258169 1293373 1434100 1466179 1343653 1253241 1233172 1253486 1316352 1286542 1288782
7513A288782M3403o4277J2521O9791K9666K1725K5530J808j8510O3386L1209m1196
$$ 1288782 1332185 1267908 1280429 1350220 1379886 1401611 1427141 1428949 1410439 1473825 1505034 1463838
7501A463838L7234r9163K0782J4326k2971N8514R017j2821l8773m3923O9797J2301
$$ 1463838 1501072 1401909 1422691 1437017 1414046 1472560 1481577 1468756 1429983 1386060 1455857 1468158
7489A468158K8242P6041p8906o3252j0839K1581K3797J766J5759p5806O8445Q6785
$$ 1468158 1496400 1572441 1493535 1430283 1419444 1441025 1464822 1466588 1482347 1406541 1474986 1561771
7477A561771l0842o6070R3388j2920j9460K248Q177Q5702p8445j5882K4562M4252
$$ 1561771 1530929 1464859 1558247 1545327 1525867 1528115 1536292 1621994 1543549 1527667 1552229 1596481
7465A596481r611r1547J2537J4469J4126J6786r3142J29998O827N9164M9639l7531
$$ 1596481 1586870 1495323 1507860 1522329 1536455 1553241 1460099 1590097 1596924 1656088 1705727 1668196
7453A668196j16748J4461R9519Q763L8041n4249M3577n809k7267Q4361j6286O7349
$$ 1668196 1551448 1565909 1665428 1674191 1712232 1657983 1701560 1695751 1668484 1752845 1736559 1803908
7441A803908O9313K2500j10448m181J10501l5131O3963K1117j2185L5384j0363
$$ 1803908 1873221 1895721 1785273 1781092 1891593 1856462 1920425 1941542 1929357 1964741 1954378
7430A954378j5754L4333L8167j4967k7576k2080n1797p279J5329N1156m1450j9346
$$ 1954378 1938624 1972957 2011124 1996157 1968581 1946501 1894704 1887425 1902754 1953910 1912460 1893114
7418A893114K5237J628L8664r4153O3639K0348o3255m2719j48680k4882N505n1411
$$ 1893114 1918351 1919979 1958643 1864490 1928129 1948477 1885222 1842503 1693823 1668941 1674446 1623035
7406A623035o4361P6130M1355o8571j6744k0739Q3918O7187o5204j51720k4603
$$ 1623035 1558674 1634804 1676159 1607588 1590844 1570105 1654023 1721210 1656006 1504286 1479683
7395A479683J01879O521p1539k8681l654j7570j3063K7094k588m5788m9456j3750
$$ 1479683 1581562 1588083 1516544 1487863 1484209 1466639 1453576 1480670 1478082 1432294 1382838 1369088
7383A369088j439J2673l8121R6307K6616P9704j0224j3092L5402J10340M7066
$$ 1369088 1367649 1380322 1342201 1438508 1465124 1544828 1534604 1521512 1556914 1667254 1714320
7372A714320q1068L6339K8765m0647l0766J7309j13600j16585O219P6246r3846
$$ 1714320 1633252 1669591 1698356 1657709 1626943 1644252 1530652 1414067 1420286 1496532 1402686
7361A402686n3962O566o3236O9135j9974o6513K7734p7213J3537j7067K2159J00586
$$ 1402686 1348724 1355290 1292054 1361189 1341215 1274702 1302436 1225223 1238760 1221693 1243852 1344438
7349A344438L0201k364p2995k377J2737n6015J062l5441M0866Q635j0072R727
$$ 1344438 1374639 1372275 1299280 1296903 1309640 1253625 1254687 1219246 1260112 1268747 1258675 1268402
7337A268402m0621K9741L312m0275R2149O7935k0534m8128L6805p4589m7474M9578
$$ 1268402 1227781 1257522 1260834 1220559 1312708 1380643 1360109 1311981 1348786 1274197 1226723 1276301
7325A276301R657j11821k7192M3218O2322P670J6533o1072N3409J34514n2043
$$ 1276301 1285958 1174137 1146945 1190163 1252485 1260155 1276688 1215616 1269025 1403539 1351496
7314A351496r3308K1125l711R171Q6999n725O071k2930m2045k2574l0594K8037
$$ 1351496 1258188 1279313 1275602 1284773 1371772 1366047 1372118 1349188 1307143 1284569 1253975 1282012
7302A282012q3925n3509L4743J07020P886m4524po8322J31869j5574k6922J18527
$$ 1282012 1198087 1144578 1179321 1286341 1294227 1249703 1249696 1181374 1313243 1297669 1270747 1389274
7290A389274N7429l999o046P6850p3057R547o443n7850O323j6674Q025m559J04114
$$ 1389274 1446703 1442704 1436658 1513508 1440451 1449998 1443555 1385705 1392028 1375354 1383379 1378820 1482934
7277A482934L3670L0128p536q040R5591n6065l9828N708J6061o417m428L43l8850
$$ 1482934 1516604 1546732 1539196 1531156 1626747 1570682 1530854 1536562 1552623 1546206 1541778 1542121 1503271
7264A503271k3316K9878N5987j47q8827j0457K7086o5258o5731K8828J31775q142
$$ 1503271 1479955 1509833 1565820 1565673 1476846 1466389 1493475 1428217 1362486 1391314 1523089 1514947
7252A514947J723K1776J8259n671n6938J10695j7703P175l2820M4493K2061J8859
$$ 1514947 1516670 1538446 1556705 1551034 1494096 1604791 1587088 1594263 1561443 1605936 1627997 1646856
7240A646856J6153p4990N3863m5441O0255R4787o5517M5067M2055r8781J9283
$$ 1646856 1663009 1588019 1641882 1596441 1656696 1751483 1685966 1731033 1773088 1674307 1693590
7229A693590O6318J41076m0070K3296j0251k2337N2607M3056k4132N878M3452
$$ 1693590 1759908 1900984 1860914 1884210 1873959 1851622 1904229 1947285 1923153 1929031 1972483
7218A972483O030P807M9258o058L999L0386N4309N7678q418R553P1938N9216N0927
$$ 1972483 1978513 1986320 2035578 2029520 2033519 2063905 2118214 2175892 2167474 2177027 2248965 2308181 2359108
7205B359108K2121O9453O7021Q9684R3287O8571j9221l1656Q620O901j2185l891
$$ 2359108 2381229 2450682 2517703 2607387 2700674 2769245 2750024 2718368 2726988 2733889 2721704 2717813
7193B717813l2174k69q9569J8345k750n0552J2081M0610J6714L4071K0030J1570
$$ 2717813 2685639 2685370 2595801 2614146 2611396 2560844 2572925 2613535 2630249 2664320 2684350 2695920
7181B695920N4798N562l922q633o8467P16n1291p7152N2264P983j19408j03473
$$ 2695920 2750718 2756280 2752358 2743725 2675258 2675974 2624683 2547531 2599795 2607778 2488370 2384897
7169B384897j56349p0651j6529o713p38j1296k9736k8325n4046l8801J9906n0631
$$ 2384897 2228548 2157897 2141368 2134655 2133917 2122621 2092885 2064560 2010514 1971713 1991619 1940988
7157A940988J4233L5941k5090k0750j1792j06055N647m7734N4612Q6673n5121
$$ 1940988 1955221 1991162 1966072 1945322 1933530 1827475 1833122 1785388 1840000 1926673 1871552
7146A871552r087n2456o5146O6177l808n042l1573o9433r084K1879K7866k5759
$$ 1871552 1862465 1810009 1744863 1811040 1807232 1802190 1770617 1701184 1692100 1713979 1741845 1716086
7134A716086j13182R0956l5526P8657R3304q3826K4466o4306q0174L534j0227
$$ 1716086 1602904 1693860 1658334 1736991 1830295 1746469 1770935 1706629 1626455 1629989 1619762
7123A619762O2114Q3551k399l9317j11795l9989p3m8072N0487l7428J15942l4455
$$ 1619762 1681876 1765427 1763028 1723711 1611916 1571927 1571854 1523782 1574269 1536841 1652783 1618328
7111A618328p411n1318N793O6843k7521p7369Q5815O3091p699P519j9332O1020
$$ 1618328 1610917 1559599 1565392 1632235 1604714 1527345 1613160 1676251 1668552 1676071 1656739 1717759
7099A717759Q2484j72116n0323L9894P589P6719J0647J1359n0283L897m264K7271
$$ 1717759 1800243 1628127 1577804 1617698 1625287 1702006 1712653 1724012 1673729 1677626 1673362 1700633
7087A700633K3894n0622M185Q4526p6046J3521j9618j1925j4908l0491k899M0476
$$ 1700633 1724527 1673905 1678090 1762616 1686570 1700091 1680473 1668548 1653640 1623149 1620250 1660726
7075A660726k1117N0596J0274o0241M7759o3134J1558p904k1770p6369j5301J37650
$$ 1660726 1639609 1690205 1700479 1640238 1687997 1624863 1636421 1628517 1606747 1530378 1515077 1652727
7063A652727k440r675N3244m0964K3273M5346K0833j1188q570l1265o192J6994
$$ 1652727 1650287 1640612 1693856 1652892 1676165 1721511 1742344 1731156 1722586 1691321 1685129 1702123
7051A702123R1357m2847j7060N1562R43N1791q170R477r672p2402J8642Q4344
$$ 1702123 1793480 1750633 1733573 1785135 1786078 1837869 1829699 1839176 1829504 1757102 1775744 1860088
7039A860088o2774K5168j8328J1251K1583J671Q2357N5553L6444r166r0492P9831
$$ 1860088 1797314 1822482 1804154 1815405 1836988 1838659 1921016 1976569 2013013 2003847 1913355 1993186
7027A993186M9098O8464L9251q3463p7426O8496r100O4809N7004r776J0270J5507
$$ 1993186 2042284 2110748 2149999 2066536 1989110 2057606 2048506 2113315 2170319 2160543 2170813 2186320
7015B186320l8676k4783O3751j763J8923O291j8435P4124J4820P0969R375M2288
$$ 2186320 2147644 2122861 2186612 2184849 2203772 2210063 2191628 2265752 2280572 2351541 2360916 2403204
7003B403204o2671o852M6432k2328k0356Q0839N3447L3155n583k4645J20228Q4565
$$ 2403204 2340533 2333681 2380113 2357785 2337429 2418268 2471715 2504870 2499287 2474642 2594870 2679435
6991B679435R093l1250L7138P8269K1657J8577n4857j4716n2301M5211M6816j3166
$$ 2679435 2688528 2657278 2694416 2772685 2794342 2812919 2758062 2743346 2691045 2736256 2783072 2769906
6979B769906n3089o564m1517P7798O9441n4918N9912M3625K6337m3733L8511K53
$$ 2769906 2716817 2710253 2668736 2746534 2815975 2761057 2820969 2864594 2890931 2847198 2885709 2885962
6967B885962J9778M8151k6048L0394j9472L8920J28053l8477J7020q7403L1942
$$ 2885962 2905740 2953891 2927843 2958237 2938765 2977685 3105738 3067261 3084281 2996878 3028820
6956C028820N885J8719q3213M9924R6091n8286L3717j4866k9808k8224M3249l8120
$$ 3028820 3034705 3053424 2970211 3020135 3116226 3057940 3091657 3076791 3046983 3018759 3062008 3023888
6944C023888l2810P7142N5853P031q7084K1039M692J1152J847L4984m7697Q242
$$ 3023888 2991078 3068220 3124073 3131104 3044020 3065059 3069751 3080903 3082750 3117734 3070037 3078279
6932C078279M4666J216n256O3875j14723n3193K782L4358K2142J6552Q1992j2400
$$ 3078279 3122945 3124161 3118905 3182780 3068057 3014864 3017646 3052004 3074146 3090698 3172690 3160290
6920C160290j6661J1361q379J7364o2042L4822P2774o7954K5621L0760j4768j5792
$$ 3160290 3143629 3154990 3146611 3163975 3101933 3136755 3209529 3141575 3167196 3197956 3183188 3167396
6908C167396K0508J3919m5395L8881n7809L7860J01681K5330O728n2290o5819
$$ 3167396 3187904 3201823 3156428 3195309 3137500 3175360 3277041 3302371 3309099 3256809 3190990
6897C190990K583P8725K1135R6m188O1903k9472L3773K845K7392j4047L896L2735
$$ 3190990 3193573 3272298 3293433 3293529 3289341 3351244 3321772 3355545 3358390 3385782 3371735 3375631 3408366
6884C408366J6367L6290p3460q3849R1819M0832n3592k441m5768N169P7332K4003
$$ 3408366 3424733 3461023 3387563 3303714 3395533 3436365 3382773 3380332 3334564 3339733 3417065 3441068
6872C441068M2171P023m6275K484R5416N936m6439l8489m6519M6896l5567K9307
$$ 3441068 3483239 3490262 3443987 3446471 3541887 3547823 3501384 3462895 3416376 3463272 3427705 3457012
6860C457012M3641J323Q4358l4790l4122j09243o0876J2638K7711j14524j94J01842
$$ 3457012 3500653 3501976 3586334 3551544 3517422 3408179 3347303 3359941 3387652 3273128 3272934 3374776
6848C374776n1133O8094m8869q9309R6499N6708m2434o6347M9152K6231n5627
$$ 3374776 3323643 3391737 3342868 3253559 3350058 3406766 3364332 3297985 3347137 3373368 3317741
6837C317741R3785R1755l6592j21277l7260M1431J4753n4541M0944j6226l9972
$$ 3317741 3411526 3503281 3466689 3345412 3308152 3349583 3364336 3309795 3350739 3334513 3294541
6826C294541R1912R895k3017O8603r71m6495K8296l9055J3375o1914J3422M6142
$$ 3294541 3386453 3396348 3373331 3441934 3440963 3394468 3422764 3383709 3397084 3335170 3348592 3394734
6814C394734o9884j3628O6248O0845q5974j10349P2584k9662l8521J87082p9950
$$ 3394734 3324850 3311222 3377470 3438315 3352341 3241992 3314576 3284914 3246393 3433475 3353525
6803C353525l6300j0141N954N4764p5770N328q9214p438K6997O0440N7054l1435
$$ 3353525 3317225 3307084 3313038 3367802 3292032 3297360 3208146 3200708 3227705 3288145 3345199 3313764
6791C313764p240N4653J2684l0413O3930J3208l5842P2287o9347n3327K2774L017
$$ 3313764 3306524 3361177 3373861 3343448 3407378 3420586 3384744 3457031 3387684 3334357 3357131 3360148
6779C360148M1718r6400o2256l3425Q289M1823O3997J6715k5105M0062k3788n7133
$$ 3360148 3401866 3305466 3243210 3209785 3218074 3259897 3323894 3340609 3315504 3355566 3331778 3274645
6767C274645l0614O4128J19547q62r6539P3349K9498L7452j1346L734M0464J2667
$$ 3274645 3244031 3308159 3427706 3426844 3330305 3403654 3433152 3470604 3459258 3462992 3503456 3516123
6755C516123J2438Q3865N1939L3217p9061j8440L6681l7807L8896o2848O7532
$$ 3516123 3528561 3612426 3664365 3697582 3618521 3600081 3636762 3598955 3637851 3575003 3642535
6744C642535l6030J28029J32895j27096l8019R1081M9790j8852Q7518N0263K3317
$$ 3642535 3606505 3734534 3867429 3740333 3702314 3793395 3843185 3824333 3911851 3962114 3985431
6733C985431L7634n5714L7954m4994j7462o8379K7228K7358P7909O885q7592L0434
$$ 3985431 4023065 3967351 4005305 3960311 3942849 3874470 3901698 3929056 4006965 4013850 3926258 3956692
6721C956692n3737j06145L3179R1054O8618M9350j9381K9483J0716N4088j379
$$ 3956692 3902955 3796810 3829989 3921043 3989661 4039011 4019630 4049113 4059829 4113917 4112538
6710D112538P2417k094J9927J4347n4347R3197k1993m9132P2380L6909p510m0972
$$ 4112538 4184955 4182861 4202788 4217135 4162788 4255985 4233992 4184860 4257240 4294149 4286639 4245667
6698D245667j8880L7584k2581M3471p0964M8446O8090N7621p6725m442R5744M7700
$$ 4245667 4226787 4264371 4241790 4285261 4214297 4262743 4330833 4388454 4311729 4307287 4403031 4450731
6686D450731K1366K7108o746P2226J06673k0262J00522P2104P0244L6514M5582
$$ 4450731 4472097 4499205 4492459 4564685 4671358 4651096 4751618 4823722 4893966 4930480 4976062
6675D976062M9110O8281K2019j0083Q7087K8170l2948L4570r7389M296l6617K6334
$$ 4976062 5025172 5093453 5115472 5105389 5192476 5220646 5187698 5222268 5124879 5129175 5092558 5118892
6663E118892J7350k2424K995r9842K0197l6892q6429m8702n8419J5395j3229o6146
$$ 5118892 5136242 5113818 5116813 5016971 5037168 5000276 4913847 4865145 4806726 4822121 4808892 4742746
6651D742746m4909J31822j2560n0880M7953j2775k7777m2745j45797m4408k4580
$$ 4742746 4697837 4829659 4817099 4766219 4814172 4801397 4773620 4730875 4585078 4540670 4516090
6640D516090o1550J8564J9k8834k9154r1685o144Q368o8433r0152N350L0458q090
$$ 4516090 4454540 4473104 4473123 4444289 4415135 4323450 4317306 4325674 4257241 4167089 4172439 4202897 4194807
6627D194807Q7535J200P1744m4193n0544K8728l8952N4144J1416n7642N9201j04361
$$ 4194807 4282342 4283542 4355286 4311093 4260549 4289277 4250325 4304469 4315885 4258243 4317444 4213083
6615D213083q500L5329K0707K8012m3061l2405L2514J6601j01428j0780J0091
$$ 4213083 4204583 4239912 4260619 4288631 4245570 4213165 4245679 4262280 4160852 4150072 4160163
6604D160163P6439M056n5281p1680q363O9917J4750K9341P5955k4463m4138P432
$$ 4160163 4236602 4240658 4185377 4113697 4105334 4175251 4190001 4219342 4295297 4270834 4226696 4234128
6592D234128L7321n4298k385p6029J1444l0834q9908N4736M5290p5005l5491k1153
$$ 4234128 4271449 4217151 4214766 4138737 4150181 4119347 4029439 4084175 4129465 4054460 4018969 3997816
6580C997816L1972J03478Q17n1294j16449L6459L2024J0900N4000M662j39617
$$ 3997816 4029788 4133266 4134083 4082789 3966340 4002799 4034823 4045723 4099723 4104385 3964768
6569C964768n3498p856M3209k8670j9130N631O5489J8585N940N9346K6010P353
$$ 3964768 3911270 3903414 3946623 3917953 3898823 3904454 3969943 3988528 3994468 4053814 4079824 4087177
6557D087177m0369l1016o4822O806o0254k1671P9530k9131l7312l1199J2328Q3013
$$ 4087177 4046808 4015792 3950970 3957776 3897522 3875851 3955381 3926250 3888938 3857739 3870067 3953080
6545C953080l5455q7602l9831l6602O1660J9991N1620K4634K600M4215p745q0816
$$ 3953080 3917625 3830023 3790192 3753590 3815250 3835241 3886861 3911495 3914095 3958310 3950565 3869749
6533C869749j5956O6055J7714n6730q1N9562N3012P8157k9680k7631k8906k8845
$$ 3869749 3853793 3919848 3937562 3880832 3880751 3940313 3993325 4071482 4041802 4014171 3985265 3956420
6521C956420N6718N3417j8235j0013k3854p8294R7084R1K8652p3230Q0587O3596
$$ 3956420 4013138 4066555 4048320 4038307 4014453 3936159 4033243 4033334 4061986 3988756 4069343 4132939
6509D132939L4416N718k8046P2785m0104O6272J9516p136J1487J289K2173n5370
$$ 4132939 4167355 4173073 4145027 4217812 4177708 4243980 4263496 4256360 4267847 4269136 4291309 4235939
6497D235939l0976J62875k0809j47835K6977J56653K4600k8299r2175K8191L7021
$$ 4235939 4204963 4367838 4347029 4199194 4226171 4382824 4407424 4379125 4286950 4315141 4352162
6486D352162n4856N1009J2813l0500J4900j61l868j9195P3442M1237n8603K0014
$$ 4352162 4297306 4348315 4361128 4330628 4345528 4345367 4341499 4322304 4395746 4436983 4378380 4398394
6474D398394P659k5507J528Q0137K2002K996m8404n9137M0275K1998r2636j095
$$ 4398394 4406053 4380546 4382074 4462211 4484213 4487209 4438805 4379668 4419943 4441941 4349305 4348210
6462D348210J35250j1021J5270n8647N5581n729j4318l236J1811p3409n3546m1823
$$ 4348210 4483460 4472439 4487709 4429062 4484643 4478914 4464596 4461360 4473171 4399762 4346216 4304393
6450D304393Q9596R0777j0743Q6711n777j54228k6823K6029L2618J2267L9747
$$ 4304393 4393989 4484766 4474023 4560734 4554957 4400729 4373906 4399935 4432553 4444820 4484567
6439D484567M2231k621k2535J2194k4540m1802k8253j1248l0820J0909L3021k2694
$$ 4484567 4526798 4524177 4501642 4513836 4489296 4447494 4419241 4407993 4377173 4388082 4421103 4398409
6427D398409N5313k2723q108L939k6030M1277N1367k5768k4483j0949P5109r1921
$$ 4398409 4453722 4430999 4422891 4426830 4400800 4442077 4493444 4467676 4443193 4432244 4507353 4415432
6415D415432l6066M2140O0801K8798o1874O9903m187K9812J1995n2487N4323j0785
$$ 4415432 4379366 4421506 4482307 4511105 4449231 4519134 4514947 4544759 4556754 4504267 4558590 4547805
6403D547805R2786N9124m2341q5965K383J23307K0709m6239J56851P539q8894
$$ 4547805 4640591 4699715 4657374 4571409 4573792 4697099 4717808 4671569 4828420 4835959 4747065
6392D747065P3953j3863r9472L9707L4282l2787K6946P4705k6846k1066J41660
$$ 4747065 4821018 4807155 4707683 4747390 4781672 4748885 4775831 4850536 4823690 4802624 4944284
6381D944284P746l6668k9332k9755k4160K0134R8148j657K2776R0471J7081j6999
$$ 4944284 4952030 4915362 4886030 4856275 4832115 4852249 4950397 4948740 4971516 5061987 5079068 5062069
6369E062069K2472K959j9743j0793J2338r4649P8071O9141j1821l7770N4458l2882
$$ 5062069 5084541 5087500 5067757 5056964 5069302 4974653 5052724 5121865 5110044 5072274 5126732 5093850
6357E093850L96P7427K9960l5229M2509m2184N5019N3877P8123N9901J18361J07102
$$ 5093850 5094246 5171673 5201633 5166404 5208913 5166729 5221748 5275625 5353748 5413649 5532010 5639112
6345E639112K8463O0479O6233J7414J0958J5676m1569r0336j11038l5839j69358
$$ 5639112 5667575 5728054 5794287 5811701 5822659 5838335 5796766 5706430 5595392 5559553 5390195
6334E390195j58235j03503l7351r5004k3401p2068k03634n3552m1235q2186j22838
$$ 5390195 5231960 5128457 5091106 4996102 4972701 4900633 4696999 4643447 4602212 4520026 4397188
6323D397188o8381M2921n5961m5663j21384K8384l0387M127n7755O1656L3369
$$ 4397188 4328807 4371728 4315767 4270104 4148720 4177104 4146717 4150844 4093089 4154745 4188114
6312D188114m305l9901m3328R6023K0522j13074L565p9516O0906j1526k4647r899
$$ 4188114 4183809 4143908 4100580 4196603 4217125 4104051 4107616 4028100 4089006 4077480 4052833 4042934
6300D042934j07902p7737J9872K9887O4234n2913J4914J0129p9608J0164l4282
$$ 4042934 3935032 3857295 3877167 3907054 3971288 3918375 3933289 3943418 3863810 3873974 3839692
6289C839692j04156j8703N908J1927l3342n4942Q5162o579l2729o6063J04321
$$ 3839692 3735536 3716833 3722741 3734668 3701326 3646384 3731546 3724967 3692238 3626175 3730496
6278C730496M7711J8487n1413j9275l0022j1597o6122l7694J12511j10275n3130
$$ 3730496 3778207 3796694 3745281 3726006 3695984 3684387 3618265 3580571 3693082 3582807 3529677
6267C529677J35160N1849p8352J9561j6210j7761N7466j38552L5799J0808P1625
$$ 3529677 3664837 3716686 3638334 3657895 3641685 3623924 3681390 3542838 3578637 3589445 3661070
6256C661070m5296m5076O726j0799k8317p8243m0804L6545L4232k7518n7876o115
$$ 3661070 3615774 3570698 3577424 3566625 3538308 3460065 3419261 3455806 3490038 3462520 3404644 3398529
6244C398529L0126N7567l1738q1027J067p284J420K2063o3093m8294M0538j6813
$$ 3398529 3428655 3486222 3454484 3373457 3374524 3367240 3368660 3390723 3327630 3279336 3319874 3303061
6232C303061k9183o9673N7727j6848n4690K3650O6589j32r746M8586q2753l8901
$$ 3303061 3273878 3204205 3261932 3245084 3190394 3214044 3280633 3280501 3270755 3319341 3236588 3197687
6220C197687o370K1873M7366j3799l4881M4257N1684k5549R2461p0042n7895k5592
$$ 3197687 3191317 3213190 3260556 3246757 3211876 3256133 3307817 3282268 3374729 3304687 3246792 3221200
6208C221200o7827N727N5204J4561k4886K4685l2651J9364N3821p2325j17857
$$ 3221200 3153373 3159100 3214304 3228865 3203979 3228664 3196013 3215377 3269198 3196873 3079016
6197C079016O7438M8891K5384j5424N7844k1156l5139l1202p3565K9534q0796
$$ 3079016 3146454 3195345 3220729 3205305 3263149 3241993 3206854 3175652 3102087 3131621 3050825
6186C050825R3994K6354L8169q4345r2278L2791N1401P0346n784j22261M5105
$$ 3050825 3144819 3171173 3209342 3124997 3032719 3065510 3116911 3187257 3181473 3059212 3104317
6175C104317K3994n0874J5258K9042O5022n1427M8636m0422r6536j7193k843K1481
$$ 3104317 3128311 3077437 3092695 3121737 3186759 3135332 3183968 3143546 3047010 3029817 3026974 3048455
6163C048455J986o2557P9397N4053j2316N982n7403j6110n621n3339j1189L8008
$$ 3048455 3050441 2987884 3067281 3121334 3109018 3115000 3057597 3041487 3035866 2982527 2971338 3009346
6151C009346k176k2524l5854J05914K0794l016K0586l9481J2369J8942m0067r1598
$$ 3009346 3007170 2984646 2948792 3054706 3075500 3072484 3093070 3053589 3065958 3084900 3044833 2953235
6139B953235J12458O6122j370K0194P8277P0019l1158k1267j7389L072N7577m9292
$$ 2953235 3065693 3131815 3130445 3150639 3228916 3298935 3267777 3246510 3229121 3232193 3289770 3240478
6127C240478J916r892j9081P4569J61964p601P2499k3709n9986P6338k0900K0145
$$ 3240478 3242394 3232502 3213421 3287990 3449954 3442353 3514852 3491143 3431157 3507495 3486595 3506740
6115C506740j1739O2665l7663q2453M5043J4694j7674l4232k3502j5024j9652
$$ 3506740 3495001 3557666 3520003 3437550 3482593 3497287 3479613 3445381 3421879 3406855 3387203
6104C387203J3848J29073J14144j890l7167m4210O8515K9292m2765P949k6727
$$ 3387203 3401051 3530124 3644268 3642378 3605211 3561001 3629516 3658808 3616043 3623992 3597265
6093C597265m3008J9345j06608J05790J0549J7803J0387j408J44484R109J2017
$$ 3597265 3554257 3573602 3466994 3572784 3583333 3601136 3611523 3610115 3754599 3763708 3775725
6082C775725K1878k3859n8993o3675j10619j26059n1344n070l5674o9370l2160
$$ 3775725 3797603 3773744 3714751 3651076 3540457 3414398 3363054 3357984 3322310 3252940 3220780
6071C220780K2010l7042K7031K2981l4747j09341J08632J3918m6045J4448K6190
$$ 3220780 3242790 3205748 3232779 3255760 3221013 3111672 3220304 3234222 3188177 3202625 3228815
6060C228815R7492q4645n4763P4884M803m2311P3453K7191k975N2659J23837J04354
$$ 3228815 3326307 3241662 3186899 3261783 3266586 3224275 3297728 3324919 3321944 3374603 3498440 3602794
6048C602794j01680j05765j11749j07965n5146k2355K8093l193o8362j8656n424
$$ 3602794 3501114 3395349 3283600 3175635 3120489 3098134 3126227 3123034 3054672 3036016 3030592
6037C030592p1084q4503K3536k447l4091N120o8664M2864O5184p9836k575R7351
$$ 3030592 2959508 2875005 2898541 2896094 2862003 2867123 2798459 2841323 2906507 2826671 2824096 2921447
6025B921447k7642R162l492n4367r4849L7288N5868M179K6264K5311l3479o7919
$$ 2921447 2893805 2902967 2899475 2845108 2750259 2787547 2843415 2847594 2873858 2899169 2865690 2797771
6013B797771m2038p818M2906k1918o7466K3132j9756j0329J6872J2094q3963n0225
$$ 2797771 2755733 2747915 2790821 2768903 2701437 2724569 2704813 2694484 2711356 2723450 2639487 2589262
6001B589262l5774k203J32O0910q711j1783l4996N6898L8602J3895o3770l5396
$$ 2589262 2553488 2551285 2551417 2612327 2603616 2591833 2556837 2613735 2652337 2666232 2602462 2567066
5989B567066N939o418J3434l0255N5531n7805J4077R525j6497O20M944n0685N0453
$$ 2567066 2573005 2566587 2580021 2549766 2605297 2547492 2561569 2571094 2554597 2555217 2560161 2509476 2559929
5976B559929O5420L9872j02145l3855j9280n0846N1924O7285m8085p0615N5925
$$ 2559929 2625349 2665221 2563076 2529221 2509941 2459095 2511019 2578304 2530219 2459604 2515529
5965B515529p708J7810Q881q2726R6514L3874N49j1350k683l0905J3335o2762
$$ 2515529 2507821 2525631 2534512 2451786 2548300 2582174 2582723 2571373 2568690 2537785 2551120 2488358
5953B488358K9127K7004m4261J283M0374p3822o8668k133j7955J43499q59n420
$$ 2488358 2517485 2544489 2500228 2501511 2541885 2468063 2399395 2397262 2379307 2522806 2521947 2516527
5941B516527m4572L4329L2339J6625J5928q4887Q3062J64921n583m7104n9736
$$ 2516527 2471955 2506284 2538623 2555248 2571176 2486289 2569351 2734272 2728689 2681585 2621849
5930B621849J6027P1619k1015J2572M6489r8O585m2277j03134l9775K4426J9036
$$ 2621849 2637876 2709495 2688480 2701052 2747541 2747443 2754028 2711751 2608617 2568842 2593268 2612304
5918B612304l2682R6222O1071m2858L1065j8512P630j3861k1116K2619P7552o6737
$$ 2612304 2579622 2675844 2736915 2694057 2725122 2706610 2714240 2700379 2679263 2701882 2779434 2712697
5906B712697k0768j5015K4406P468K5409k4779N9679l5573n4083l7865J6338K7674
$$ 2712697 2691929 2676914 2701320 2708788 2734197 2709418 2769097 2733524 2679441 2641576 2657914 2685588
5894B685588o7832N7711N454K8822K8007K419k5076j5859n0216L6622L6216k6985
$$ 2685588 2617756 2675467 2680921 2709743 2737750 2740169 2715093 2699234 2649018 2685640 2721856 2694871
5882B694871J7149Q3703n2325r6092l4940N6963R5922R1483K3932Q3866K5979
$$ 2694871 2712020 2795723 2743398 2647306 2612366 2669329 2765251 2856734 2880666 2964532 2990511
5871B990511K1786j5869O7411M437j45228o101L4555M9286L9405r8372O478p3974
$$ 2990511 3012297 2996428 3063839 3068276 2923048 2916947 2951502 3000788 3040193 2941821 2948299 2874325
5859B874325p5442P9246N3535L7072L722m0023l2591j7211m8267l9557J0258M0482
$$ 2874325 2798883 2878129 2931664 2968736 2972458 2932435 2899844 2882633 2834366 2794809 2805067 2845549
5847B845549l729k376J5537p5731J0887k7832L1135N7072l6124r9171R4658K9488
$$ 2845549 2841820 2839444 2854981 2779250 2790137 2762305 2793440 2850512 2814388 2715217 2809875 2839363
5835B839363j0410L1454m3258k0477R886n2445N936K1508n1929k6932j6453J7332
$$ 2839363 2828953 2860407 2817149 2796672 2806558 2754113 2760049 2781557 2729628 2702696 2686243 2703575
5823B703575m8091k810n2841k1163L5919k3473q966L5604N3035N1649l6367p4455
$$ 2703575 2655484 2652674 2599833 2578670 2614589 2591116 2582150 2617754 2670789 2722438 2686071 2611616
5811B611616J0385K8591M723P2969j8066r7397p1921K9540m6812L8539M6180j00665
$$ 2611616 2622001 2650592 2655315 2728284 2710218 2612821 2540900 2570440 2523628 2562167 2608347 2507682
5799B507682m4972M6563r7792O6181L2654M2776R129j3689M7699m0361L6490K5734
$$ 2507682 2462710 2509273 2411481 2477662 2510316 2553092 2562221 2548532 2596231 2555870 2592360 2618094
5787B618094o896J9690o2869k4090P122j6536Q055N7675l2475M6160J805m1044
$$ 2618094 2611198 2630888 2568019 2543929 2551051 2534515 2542570 2600245 2567770 2613930 2615735 2574691
5775B574691k1982J2883K4110j052o6954J3794Q5286o2135n4972O5083J6685k2290
$$ 2574691 2552709 2565592 2589702 2588650 2521696 2535490 2620776 2558641 2503669 2568752 2585437 2563147
5763B563147k1503J54394J79369j49552l6318r879l706R619K4333Q5654k2556
$$ 2563147 2541644 2696038 2875407 2725855 2689537 2679658 2675952 2685571 2709904 2795558 2773002
5752B773002l1886N383P5793l8427K376l8936P2905J5515O917M9225J7240J1172
$$ 2773002 2741116 2746499 2822292 2783865 2786241 2747305 2820210 2835725 2842642 2891867 2909107 2920279
5740B920279r4308J1833j0367O939N9251Q7804p2601k8229J9266n41J13199K1440
$$ 2920279 2825971 2837804 2827437 2834376 2893627 2981431 2908830 2880601 2899867 2899326 3012525 3033965
5728C033965K0228M5065n9681k5680R8823O3704O1495K8074O3633J24085P9266
$$ 3033965 3054193 3099258 3039577 3013897 3112720 3176424 3237919 3265993 3329626 3453711 3532977
5717C532977J55116J60933J76736J07180P9463Q3986j45974k13893j59029j73175
$$ 3532977 3688093 3849026 4025762 4132942 4212405 4296391 4150417 3936524 3777495 3604320
$$ [...]
##END=
