##TITLE=1H_IV
 200.13MHz, CDCl3,
 8 sc
 
 17.2.2025
##JCAMPDX= 6.0         $$ Bruker NMR JCAMP-DX V2.0
##DATA TYPE= NMR FID
##DATA CLASS= NTUPLES
##ORIGIN= UXNMR, Bruker Analytische Messtechnik GmbH
##OWNER= pz
$$ XWIN-NMR		Version 3.5
$$ Mon Feb 17 16:15:43 2025 Russian Standard Time (UT+4h)  she@DPX200
##.OBSERVE FREQUENCY= 200.1313
##.OBSERVE NUCLEUS= ^1H
##.DELAY= (6, 6)
##.ACQUISITION MODE= SIMULTANEOUS
##.ACQUISITION SCHEME= undefined
##.AVERAGES= 8
##.DIGITISER RES= 18
##SPECTROMETER/DATA SYSTEM= spect
##.PULSE SEQUENCE= zg30
##.SOLVENT NAME= CDCl3
##.SHIFT REFERENCE= (INTERNAL, CDCl3, 0, 14.3821)
##AUDIT TRAIL= $$ (NUMBER, WHEN, WHO, WHERE, WHAT)
$$ ##TITLE= Audit trail, XWIN-NMR		Version 3.5
$$ ##JCAMPDX= 5.01
$$ ##ORIGIN= Bruker BioSpin GmbH
$$ ##OWNER= she
$$ F:/spectra/data/she/nmr/H-C/1/audita.txt
$$ ##AUDIT TRAIL=  $$ (NUMBER, WHEN, WHO, WHERE, WHAT)
(   1,<2025-02-17 16:14:42.46 +0400>,<she>,<DPX200>,
      <created by zg, POWCHK disabled, PULCHK disabled
       configuration hash MD5:
       00 E9 B6 7A A2 85 ED C7 34 08 36 98 17 FE 4E 26
       data hash MD5: 16K
       1A D6 F9 B2 38 D7 5C 69 71 E9 F5 FA 92 98 08 4D>)
$$ ##END=
$$ 
$$ hash MD5
$$ A0 13 1B FC A9 6F E2 0E 42 28 41 DD 5B DF 1D BA
##$RELAX= 
##$RELAX= 
##$RELAX= 
##$RELAX= 
##$RELAX= 
##$RELAX= 
$$ Bruker specific parameters
$$ --------------------------
##$DU= <F:/spectra>
##$EXPNO= 1
##$NAME= <H-C>
##$PROCNO= 1
##$TYPE= <nmr>
##$USER= <she>
##$AMP= (0..31)
100 100 100 100 100 100 100 100 100 100 100 100 100 100 100 100 100 100 
100 100 100 100 100 100 100 100 100 100 100 100 100 100 
##$AQSEQ= 0
##$AQ_mod= 1
##$AUNM= <au_zg>
##$AUTOPOS= <>
##$BF1= 200.13
##$BF2= 200.13
##$BF3= 200.13
##$BF4= 200.13
##$BF5= 200.13
##$BF6= 200.13
##$BF7= 200.13
##$BF8= 200.13
##$BYTORDA= 1
##$CFDGTYP= 0
##$CFRGTYP= 5
##$CHEMSTR= <none>
##$CNST= (0..31)
1 1 145 1 1 1 1 1 1 1 1 1 1 1 1 1 1 1 1 1 1 1 1 1 1 1 1 1 1 1 1 1 
##$CPDPRG= <>
##$CPDPRG1= <>
##$CPDPRG2= <>
##$CPDPRG3= <>
##$CPDPRG4= <mlev>
##$CPDPRG5= <mlev>
##$CPDPRG6= <mlev>
##$CPDPRG7= <mlev>
##$CPDPRG8= <mlev>
##$CPDPRGB= <>
##$CPDPRGT= <>
##$D= (0..31)
0 0.7 0 0 0 0 0 0 0 0 0 0.03 0 0 0 0 0 0 0 0 0 0 0 0 0 0 0 0 0 0 0 0 
##$DATE= 1739794481
##$DBL= (0..7)
120 120 120 120 120 120 120 120 
##$DBP= (0..7)
150 150 150 150 150 150 150 150 
##$DBP07= 0
##$DBPNAM0= <>
##$DBPNAM1= <>
##$DBPNAM2= <>
##$DBPNAM3= <>
##$DBPNAM4= <>
##$DBPNAM5= <>
##$DBPNAM6= <>
##$DBPNAM7= <>
##$DBPOAL= (0..7)
0.5 0.5 0.5 0.5 0.5 0.5 0.5 0.5 
##$DBPOFFS= (0..7)
0 0 0 0 0 0 0 0 
##$DE= 6
##$DECBNUC= <off>
##$DECIM= 32
##$DECNUC= <off>
##$DECSTAT= 4
##$DIGMOD= 1
##$DIGTYP= 9
##$DL= (0..7)
0 120 120 120 120 120 120 120 
##$DP= (0..7)
150 150 150 150 150 150 150 150 
##$DP07= 0
##$DPNAME0= <>
##$DPNAME1= <>
##$DPNAME2= <>
##$DPNAME3= <>
##$DPNAME4= <>
##$DPNAME5= <>
##$DPNAME6= <>
##$DPNAME7= <>
##$DPOAL= (0..7)
0.5 0.5 0.5 0.5 0.5 0.5 0.5 0.5 
##$DPOFFS= (0..7)
0 0 0 0 0 0 0 0 
##$DQDMODE= 0
##$DR= 18
##$DS= 0
##$DSLIST= <SSSSSSSSSSSSSSS>
##$DSPFIRM= 0
$$ [...]
##$SUBNAM0= <"">
##$SUBNAM1= <"">
##$SUBNAM2= <"">
##$SUBNAM3= <"">
##$SUBNAM4= <"">
##$SUBNAM5= <"">
##$SUBNAM6= <"">
##$SUBNAM7= <"">
##$SUBNAM8= <"">
##$SUBNAM9= <"">
##$SW= 18.0517328524113
##$SWIBOX= (0..15)
0 0 2 0 0 0 0 0 0 0 0 0 0 0 0 0 
##$SW_h= 3612.71676300578
##$TD= 16384
##$TD0= 1
##$TE= 0
##$TE2= 300
##$TE3= 300
##$TEG= 300
##$TL= (0..7)
0 120 120 120 120 120 120 120 
##$TP= (0..7)
150 150 150 150 150 150 150 150 
##$TP07= 0
##$TPNAME0= <>
##$TPNAME1= <>
##$TPNAME2= <>
##$TPNAME3= <>
##$TPNAME4= <>
##$TPNAME5= <>
##$TPNAME6= <>
##$TPNAME7= <>
##$TPOAL= (0..7)
0.5 0.5 0.5 0.5 0.5 0.5 0.5 0.5 
##$TPOFFS= (0..7)
0 0 0 0 0 0 0 0 
##$TUNHIN= 0
##$TUNHOUT= 0
##$TUNXOUT= 0
##$USERA1= <user>
##$USERA2= <user>
##$USERA3= <user>
##$USERA4= <user>
##$USERA5= <user>
##$V9= 5
##$VALIST= <valist>
##$VCLIST= <CCCCCCCCCCCCCCC>
##$VD= 0
##$VDLIST= <DDDDDDDDDDDDDDD>
##$VPLIST= <PPPPPPPPPPPPPPP>
##$VTLIST= <TTTTTTTTTTTTTTT>
##$WBST= 1024
##$WBSW= 4
##$XGAIN= (0..3)
0 0 0 0 
##$XL= 0
##$YL= 0
##$YMAX_a= 152141
##$YMIN_a= -114050
##$ZGOPTNS= <>
##$ZL1= 120
##$ZL2= 120
##$ZL3= 120
##$ZL4= 120
##$ABSF1= 10
##$ABSF2= 0
##$ABSG= 5
##$ABSL= 3
##$ALPHA= 0
##$AQORDER= 0
##$ASSFAC= 0
##$ASSFACI= 0
##$ASSFACX= 0
##$ASSWID= 0
##$AUNMP= <proc_1d>
##$AZFE= 0.1
##$AZFW= 0.1
##$BCFW= 1
##$BC_mod= 2
##$BYTORDP= 1
##$COROFFS= 0
##$CY= -3
##$DATMOD= 1
##$DC= 2
##$DFILT= <>
##$DTYPP= 0
##$F1P= 0
##$F2P= 0
##$FCOR= 0.5
##$FTSIZE= 0
##$FT_mod= 4
##$GAMMA= 1
##$GB= 0.15
##$INTBC= 1
##$INTSCL= 1
##$ISEN= 128
##$LB= 0.25
##$LEV0= 0
##$LPBIN= 0
##$MAXI= 10000
##$MC2= 0
##$MEAN= 0
##$ME_mod= 0
##$MI= 1.114404
##$NCOEF= 0
##$NC_proc= 0
##$NLEV= 6
##$NOISF1= 3.799351
##$NOISF2= 2.8
##$NSP= 1
##$NTH_PI= 0
##$NZP= 0
##$OFFSET= 14.38212
##$PC= 1
##$PHC0= -466.761
##$PHC1= 10.79222
##$PH_mod= 1
##$PKNL= yes
##$PPARMOD= 0
##$PSCAL= 0
##$PSIGN= 0
##$REVERSE= no
##$SF= 200.129724274929
##$SI= 16384
##$SIGF1= 3
##$SIGF2= 2
##$SINO= 400
##$SIOLD= 16384
##$SREGLST= <1H.CDCl3>
##$SSB= 0
##$STSI= 0
##$STSR= 0
##$SW_p= 3205.1282051282
##$SYMM= 0
##$S_DEV= 0
##$TDeff= 0
##$TDoff= 0
##$TI= <>
##$TILT= no
##$TM1= 0
##$TM2= 0
##$TOPLEV= 0
##$USERP1= <user>
##$USERP2= <user>
##$USERP3= <user>
##$USERP4= <user>
##$USERP5= <user>
##$WDW= 1
##$XDIM= 8192
##$YMAX_p= 0
##$YMIN_p= 0
$$ End of Bruker specific parameters
$$ ---------------------------------
##NTUPLES= NMR FID
##VAR_NAME=  TIME,          FID/REAL,        FID/IMAG
##SYMBOL=    X,             R,               I
##VAR_TYPE=  INDEPENDENT,   DEPENDENT,       DEPENDENT
##VAR_FORM=  AFFN,          ASDF,            ASDF
##VAR_DIM=   8192,          8192,            8192
##UNITS=     SECONDS,       ARBITRARY UNITS, ARBITRARY UNITS
##FACTOR=    0.0002768,     1,               1
##FIRST=     0,             0,               0
##LAST=      2.2672688,     0,               0
##MIN=       0,             -114050,         0
##MAX=       2.2672688,     152141,          0
$$ Real data points
##PAGE= N=1
##DATA TABLE= (X++(R..R)), XYDATA
0@%%%%%%%%%%%%%%%%%%%%JoJ2j5J6j6J6j6J7k2K8l1L3l8M4m7N3o0O7p4Q1r0R9
$$ 0 0 0 0 0 0 0 0 0 0 0 0 0 0 0 0 0 0 0 0 0 1 -5 7 -8 8 -8 8 -8 9 -13 15 -16 17 -21 23 -24 29 -31 36 -38 43 -47 52
43E2j10J21j33J48j64J80j98K18k39K63k91L22l58M01m50N08n78O64p75R20j117
$$ 52 -58 63 -70 78 -86 94 -104 114 -125 138 -153 169 -189 212 -238 270 -308 356 -419 501 -616
64f16J401j843K596m110Q193l8962q0709J78850Q7341j69303o8142J02572N796
$$ -616 785 -1058 1538 -2572 5621 -33341 -114050 64800 152141 -17162 -85304 17268 23064
77B3064p5708J3078P0737L6363k1599o9482k5162N5508O753p2726O802J00812
$$ 23064 -52644 -39566 31171 67534 45935 -23547 -48709 6799 13552 -59174 -52372 48440
89D8440J8032q9158k2795Q3254J1911j11943k0117J35863L3776j25752o182J19623
$$ 48440 66472 -22686 -45481 37773 49684 -62259 -82376 53487 87263 -38489 -44671 74952
101G4952l1782j19655L8978Q7948l8923m7468K6993J8220O671r65n0246n195Q0966
$$ 74952 43170 -76485 -37507 50441 11518 -35950 -8957 9263 15934 14969 -35277 -40472 40494
114D0494q786r6875M2460J11998o3589j10068P6480R7021p9839q4659P2517O7385
$$ 40494 31708 -65167 -22707 89291 25702 -84366 -7886 89135 9296 -75363 -2846 64539
126F4539o6117n6453N9798N0183n3307m9500L6140M2409j6699l2608q74L2952
$$ 64539 -1578 -58031 1767 51950 -1357 -50857 -14717 27692 10993 -21615 -22489 10463
138A0463K4941l4500m0468M9767N0268p3253n6913R2952N6085j03062m4799J01594
$$ 10463 35404 904 -39564 10203 60471 -12782 -69695 23257 79342 -23720 -68519 33075
150C3075K3103j00136q175Q7280k505p0439N526N3320M878k9494j6182J0054K9533
$$ 33075 56178 -43958 -52133 35147 32642 -37797 -32271 21049 25927 -3567 -19749 -9695 19838
163A9838K756m3553k388O3964k594q2619Q413R2049k0351r9273K6943R1866l4353
$$ 19838 22594 -20959 -23347 40617 38023 -44596 -36183 55866 35515 -63758 -36815 55051 20698
176B0698p8672M2061O7136m3443n8210L7229N0488k1474l8960J1577L1605L114
$$ 20698 -57974 -15913 51223 7780 -50430 -13201 37287 15813 -23147 -11570 20035 23149
188B3149k6275j7036K2192K8053k9900m3455M0120N8643n3394o8676O2483O3870
$$ 23149 -3126 -20162 2030 30083 183 -43272 -3152 55491 2097 -66579 -4096 59774
200E9774p4592m9957Q5177L5588q1946j7503P3101P731n3526o654K9130J2869
$$ 59774 -14818 -64775 20402 55990 -25956 -43459 29642 37373 -16153 -22807 6323 19192
212A9192p544k1197n430L2514M009n0470n184O1824M661o8349k994P0894L602
$$ 19192 11648 -9549 -14979 17535 21544 -28926 -34110 27714 32375 -35974 -38968 31926 35528
225C5528p0787R52P1247n638p0421J5987P0581k0592o2508K0498M4143j8835k5678
$$ 35528 -35259 -34307 36940 31302 -39119 -23132 47449 26857 -35651 -15153 28990 10155 -15523
238a5523R490Q256M269l173k4953O315M5024j6675n9428L0192O5843l9724n8043
$$ -15523 -6033 2223 6492 3319 -21634 -15319 29705 13030 -46398 -16206 49637 9913 -48130
251d8130M9373M8570n2956l8086N2409L1516m7934l0005L7737K6398k8234k3174
$$ -48130 1243 49813 -3143 -41229 11180 42696 -5238 -35243 2494 28892 658 -22516
263b2516J7629J7212j0788j7301J104K3349J2933l0861k3288M3550L2146n4829
$$ -22516 -4887 12325 1537 -15764 -14660 8689 21622 -9239 -32527 11023 43169 -11660
275a1660l0203O4315K1287o9116q043O9057l881o4750N336N0872n549l6342J509
$$ -11660 -41863 22452 43739 -25377 -33420 35637 31756 -32994 -27658 23214 17665 -18677 -17168
288a7168K3886M814j6459j1825J4588K0636j1856k8798J1595M0009p910m7835
$$ -17168 6718 11532 -4927 -16752 -2164 18472 6616 -22182 -10587 29422 21512 -26323
300b6323P465N3122j5181n7643K5220N7670l6590n5047M1701M3499m1145l0017
$$ -26323 -18858 34264 19083 -38560 -13340 44330 7740 -47307 -5606 37893 -3252 -33269
312c3269L3603J7232j9534q444P675J0927N694j8833j5203K9030K3160l6756k4766
$$ -33269 334 17566 -1968 -10412 -2737 8190 13884 -4949 -20152 8878 32038 -4718 -29484
325b9484L8806K0919m1034j9929M1920J7832m5518j9021M8306J8549m7926j4406
$$ -29484 9322 30241 -10793 -30722 11198 29030 -16488 -35509 12797 31346 -16580 -30986
337c0986M5701P059l6436K224K7222m131j3723j934R14J5113Q237l1847j2904
$$ -30986 14715 21774 -14662 -12438 14784 10653 -3070 -5004 -4090 11023 19260 -12587 -25491
350b5491M4632N973n3739M390N5200j7454n1474K5092M5503k4027l6720J9667
$$ -25491 19141 25114 -28625 -24235 30965 13511 -37963 -12871 32632 8605 -28115 -8448
362h448K9988j2120k3638Q709K2477o328k2337J878K0820K603j8641j1658J3589
$$ -8448 21540 9420 -14218 -5509 16968 10640 -11697 -9819 11001 13604 -5037 -16695 -3106
375c106J9428j2584k7998J7191L3609k6820l5458L9027L4399m4946k6308M6648
$$ -3106 16322 3738 -24260 -7069 26540 -280 -35738 3289 37688 -7258 -33566 13082
387A3082J6523m0617n597L0554j000k0316n09Q908O630o93j8197n991K5592Q332
$$ 13082 29605 -11012 -16609 13945 12945 -7371 -7880 1028 7658 6965 -11232 -17223 8369 16701
401A6701l0934o211L5159L500l7019o3M1032j027m1370J925M1670k842l8563M977
$$ 16701 -14233 -20444 14715 18215 -18804 -18867 22165 21138 -20232 -18307 23363 20521 -18042 -13065
415a3065L2151q836k8263Q779K2173n823j6618k523J0623J1642o251j9184O532
$$ -13065 19086 10250 -18013 -9234 12939 7116 -9502 -12025 -1402 10240 3989 -15195 -8663
428h663K7151r529l1258J8435L4480k5664l5135L0584L1350l2342k5025L0630
$$ -8663 18488 8959 -22299 -3864 30616 4952 -30183 401 31751 -591 -25616 5014
440E014J5167k8225r871K1697O853j3599q404N276J2949L648j6743p607K1257
$$ 5014 20181 -8044 -17915 3782 10635 -2964 -11368 -6092 6857 10505 -6238 -13845 7412
453G412R405k4509o796K8899N666l2463o758L3324O263l3976p010L2875L725l2584
$$ 7412 16817 -7692 -14488 14411 20077 -12386 -19144 14180 20443 -13533 -20543 12332 16057 -16527
467a6527N96L0852m880k6499O648J9709l182p776k281q6J0953M009k0663r66K8979
$$ -16527 -15931 14921 10041 -16458 -9810 9899 6717 -1059 -3340 -3426 7527 11536 -9127 -10093 18886
482A8886p011l6169J5175L5966k2214l1802K3498K2644k1725j4684J7938J2316
$$ 18886 11875 -24294 -9119 26847 4633 -27169 -3671 18973 -2752 -17436 502 12818
494A2818j2367j2261P396J6232k361j7631N83J6577J192j4268l860J2386O844
$$ 12818 451 -11810 -4414 11818 9457 -8174 -7591 8986 10178 -4090 -7950 4436 11280
507A1280j4617j4300J8396K0418k5602k2537L1371J9691l6202r643L7435Q26l2750
$$ 11280 -3337 -17637 759 21177 -4425 -26962 4409 24100 -12102 -21745 15690 16516 -16234
520a6234O343K4676o403j2804J090K550O431K571j5470k590K1106l330k5737Q012
$$ -16234 -9891 14785 8382 -4422 -3332 -782 5649 8220 -7250 -9840 11266 7936 -17801 -9789
534i789K7257j0789k6352J0232K4970p607k2481P505K3216p867k3828J0681K3989
$$ -9789 17468 6679 -19673 -9441 15529 7922 -14559 -7054 16162 8295 -15533 -4852 19137
547A9137j2480k1022J1190J3446p954p041J119K574N376l949j3948J0019K1042
$$ 19137 6657 -14365 -3175 10271 2317 -4724 -3605 -1031 4345 396 -13552 -3533 17509
560A7509j7476k2868K4437K1735k7282j5119K8322Q914k6529m536K2856L644j8886
$$ 17509 33 -22835 1602 23337 -3945 -19064 9258 18172 -8357 -12893 9963 13607 -5279
573e279n598J2495O687q545q462N275Q853l337j0388J826J4046J264j8081k850
$$ -5279 -10877 1618 8305 -240 -8702 -3427 5426 2089 -8299 -6473 7573 8837 -9244 -12094
587a2094K3510L930k5635j937K7138k637k7131O899K4942j0493k1982R157J6358
$$ -12094 11416 15346 -10289 -12226 14912 12275 -14856 -7957 16985 6492 -15490 -6333 10025
600A0025o783j1062K762O765J265m224n149N982J0205p224j4445J0022J8549j1891
$$ 10025 3242 -7820 -5058 1707 2972 -1252 -6401 -419 9786 2562 -11883 -1861 16688 4797
614D797j9816J3372J8716j6825j6880J8777J3833k0814j2079J8892R300j4101
$$ 4797 -15019 -1647 17069 244 -16636 2141 15974 -4840 -16919 1973 11273 -2828
626b828o812R242N696l954n255P22R041J940j2701l839J6239O261j9428p131J9573
$$ -2828 -9640 -398 5298 1344 -3911 -3189 5852 7792 -4909 -8748 7491 13752 -5676 -12807 6766
641F766N912k1641m320K2848J180k3992M7K4116j612j9984K984J5387k730r058
$$ 6766 12678 -8963 -13283 9565 10745 -13247 -13200 10916 9304 -10680 -7696 7691 4961 -4097
655d097K122N257K266l639p952L120J3953m611j9203N681K0369r581j9532J2414
$$ -4097 -1975 3282 5548 1909 -6043 -2923 11030 6419 -12784 -7103 13266 3685 -15847 -3433
669c433J7397j4622j5605J5322J5296j3479j3235J2305J1083r509q231P748O197
$$ -3433 13964 -658 -16263 -941 14355 876 -12359 -54 11029 1520 -6711 1037 7234
682G234n277o286J155O944L129r527q641J1648J0861j5049j0375J8337Q367k1013
$$ 7234 1957 -4329 -3174 3770 6899 -2628 -11269 379 11240 -3809 -14184 4153 12520 -8493
696h493m590K2915K881k1229p44J7714j01j2985N63Q972k41p160k402M843N084
$$ -8493 -13083 9832 12713 -8516 -9260 8454 8353 -4632 -4069 4903 4662 -2498 -4900 -57 5027
711E027l373r172J121J2524k1j4784Q09J7211k583j8522O387K0722r407j9161
$$ 5027 1654 -7518 -6397 6127 6106 -8678 -7869 9342 6759 -11763 -5376 15346 5939 -13222
725a3222J0871J5545j0247j1812Q445P062n947o250K393O134J296q309m756R746
$$ -13222 -2351 13194 2947 -8865 -420 6642 695 -5555 -3162 2972 4268 -4041 -8797 949
739I49P553r505q538J0322R812j1568r507J3770J0760j6210j1197J7600R789j8439
$$ 949 8502 -1003 -9541 781 10593 -975 -10482 3288 14048 -2162 -13359 4241 14030 -4409
753d409o808J6411K012j3984N62R820p41m496k611J91P567L595j1363l691J5462
$$ -4409 -11217 5194 7206 -6778 -6216 3604 2863 -1633 -4244 -4053 3514 7109 -4254 -7945 7517
768G517J606j7261K412J7564n403j7210N233J5350m474j3946K346J2770k377j2200
$$ 7517 9123 -8138 -5726 11838 6435 -10775 -5542 9808 5334 -8612 -6266 6504 4127 -8073
782h073K885J2117l546j0538L240Q802n72m773k783K345P329k354j1716N299J4693
$$ -8073 -5188 6929 3383 -7155 -3915 4887 4315 -458 -3241 -896 6433 4079 -7637 -2338 12355
797A2355j1183j6152J5076J4419j7723j0889J7025O011j4705j480J0731J385o315
$$ 12355 1172 -14980 96 14515 -3208 -14097 2928 8939 -5766 -7246 3485 4870 -1445
810a445k989L460O451l47q703q95R981J34j0187m08R830K38j0827k492J2476M180
$$ -1445 -4434 -974 5477 5130 -3573 -4468 5513 5647 -4540 -4948 4882 5120 -5707 -8199 4277 8457
826H457j5133m264J6720K569j6157J317J5499m321j2615O217Q478l690m083o55
$$ 8457 -6676 -10940 5780 8349 -7808 -6491 9008 4687 -7928 -1711 6767 3077 -1006 -1661
840a661Q44L955N60q796O05J1321m578j2906P492J3533r130j2909J0033J1169
$$ -1661 -817 3138 3698 -5098 -4493 6828 2250 -10656 -3164 10369 1239 -11670 -1637 9532
854I532q543q922Q366P759p385p290O898P326n534p625K871O418j199n483j927
$$ 9532 989 -7933 433 8192 807 -6483 415 7741 2207 -5418 -2547 3871 2672 -2811 -4738
869d738N245L560o519n336R396P206j1941p645J4521P203j4841m760J4983K015
$$ -4738 507 4067 -2452 -7788 1608 8814 -3127 -10772 3749 10952 -3889 -8649 6334 8349
883H349j4168L29J2056j379r645K54N588J128k117l832K89O127j07q993K317J1171
$$ 8349 -5819 -5490 6566 5187 -4458 -4204 1384 2512 395 -3437 -3148 2979 2872 -6121 -3804 7367
899G367l427j2246M909J2655m929j1549N357J0144o045r225N575Q435n580q682
$$ 7367 3940 -8306 -3397 9258 4329 -7220 -1863 8281 2236 -6989 -1414 7021 1441 -7241
913g241M038Q009l063o259J782M536K12l191j778L563N145m531q452P647R969
$$ -7241 -3203 4806 1743 -4516 -2734 1802 2014 -1177 -2955 608 5753 1222 -7230 417 10386
928A0386j0183r820J2047O649j3266l477J2397R79j0860o15P524J206l472k462
$$ 10386 203 -9617 2430 9079 -4187 -7664 4733 5712 -5148 -5763 1761 2967 -505 -2967
942b967J138M571J78o180J232P487j696q698J981R146j047r770j39R386Lj0478
$$ -2967 -1829 2742 2920 -3260 -2028 5459 3763 -4935 -2954 6192 5145 -4625 -4764 4622 4625 -5853
958e853N30J1251k341j1787L693J1409m556p871M414M246k048j109m74M28L883
$$ -5853 -5323 5928 3587 -8200 -4507 6902 2346 -5525 -1111 3135 1087 -22 -496 -68 3815
973C815j673p606L919R444o627j0690Q708Q544r510n882R056M608q598l595P335
$$ 3815 2142 -5464 -1545 7899 1272 -9418 -710 7834 -1676 -7558 1498 6106 -2492 -6087 1248
988A248M676n855m748M717M771m022l535L083K972k464l238NM335J954o442m240
$$ 1248 5924 69 -4679 38 4809 787 -2748 335 3307 843 -2395 -2390 1945 3899 -2543 -6783
1004f783Q719M310j0496k571J1703O83j1987K212J1303l176q804K614O773j968
$$ -6783 1936 6246 -4250 -6821 4882 5565 -6422 -4210 7093 3917 -4887 -2273 4500 2532
1018B532l859K32K178J214k457l156K393M919l684o017L242P172l122p524L905
$$ 2532 -1327 -1095 1083 2297 -160 -3316 -923 3996 312 -5705 -2463 4709 1587 -5937 -2032
1033b032P754m600p420O375P656p227o707O987M925n989l188M282J353l046q71
$$ -2032 5722 1122 -6298 77 7733 506 -6201 786 5711 -278 -3466 816 2169 -877 -1748
1048a748K67K162J711m332k709N890L520o391l481P424L192p874j744Q562J206
$$ -1748 -1481 681 2392 -1940 -4649 1241 4761 -1630 -5111 2313 5505 -2369 -4113 4449 5655
1063E655r201j142Q575N71p774j58N559k55m534N12K498J426j526k974O23N516
$$ 5655 -3546 -4688 3887 4458 -3316 -3474 2085 1830 -2704 -2192 306 1732 206 -2768 -2145 3371
1079C371Rp070N52Q364j392q606L022Q430n017p829M660O898m358o101L608M617
$$ 3371 3380 -3690 -3138 5226 3834 -4772 -1750 6680 1663 -6166 -1506 5392 1034 -5067 -1459 3158
1095C158k993l304K390L123j540k719J5L349K486l459l760L577M927m651n519
$$ 3158 165 -3139 -749 2374 834 -1885 -1870 1479 3965 506 -3254 323 5250 599 -4920
1110d920O348M540q205m517Q709L609q539k669P559J182n799K14M356O93l332
$$ -4920 1428 5968 -2237 -6754 1955 5564 -2975 -5644 1915 3097 -2702 -2488 1868 2561 -771
1125g71j235K218K714n95m477J82M845M35o226j06O780j336p534J404Q252k032
$$ -771 -2006 212 2926 2331 -2146 -1964 2881 3316 -2910 -3016 3764 2428 -5106 -3702 4550 2518
1141B518p914K478P018k595n418L165M459k731l202J665K870Q0k760j857J974
$$ 2518 -5396 -2918 4100 1505 -3913 -748 3711 980 -2222 -557 2313 2393 -367 -2224 -250
1156b50K956j987m258K254M740l941n090N225N971o345n004O724M192o311k746
$$ -250 2706 719 -3539 -1285 3455 -486 -5576 -351 5620 -725 -5729 995 5187 -1124 -3870
1171c870O152Q65m737l63L344R47j875k356j6L116J009m443q75M779O30n640O1
$$ -3870 2282 3147 -1590 -1953 1391 2338 463 -1893 -1909 1207 2216 -2227 -3102 1677 2307 -3333 -3272
1188c272O269r7o190l53P188M2o071Q8O122j296n670J621N218k049m171J046J748
$$ -3272 2997 2900 -3290 -3643 3545 3587 -2484 -2396 3726 2430 -3240 -1619 3599 1550 -2621 -1575 173
1205A73N93m31k235k79L999l50n341K515O844m290o425N275N680n396m468N275
$$ 173 766 335 -1900 -2179 1820 1470 -3871 -1356 5488 1198 -5227 48 5728 332 -4136 1139
1221A139K613m519j932L036K025k167l070J016L983q76l590L40L357j01k699p6
$$ 1139 3752 -767 -2699 337 2362 195 -2875 -1859 2124 1248 -2342 -2002 1355 1254 -1445 -1521
1237a521K901J598l901l002N925K966o702l216P910Q15p814J023O737k390n107
$$ -1521 1380 2978 -923 -3925 2000 4966 -1736 -4952 2958 3773 -4041 -3018 3719 1329 -3778
1252c778K348L002n39j050j186J6L031j5l905J186M770k703m843L409M404k972
$$ -3778 -1430 1572 1033 -17 -1203 -1187 1844 1829 -2076 -890 3880 1177 -3666 -257 4147 1175
1268A175m534J999M174k267m105K154M407k608m571L464M118k889k751K013J674
$$ 1175 -3359 -1360 2814 547 -3558 -1404 3003 395 -4176 -712 3406 517 -2234 -221 1453
1283A453r09m49n41O83K299k351l466L665M158n569l979N740L234o813j029N983
$$ 1453 544 95 -446 237 2536 185 -3281 384 4542 -1027 -5006 734 3968 -2845 -3874 2109
1299B109R5m518n4M106N32k912j074J885J799j192j908J038J861p03k914M83L607
$$ 2109 2204 -2314 -2368 1738 2270 -642 -1716 169 1968 776 -1132 -94 1767 1064 -1850 -1367 2240
1316B240m98m339m61N304J42n525P13N842j567n673K888N178k677m381K799K489
$$ 2240 1742 -2597 -3058 2246 2388 -3137 -2424 3418 1851 -3822 -934 4244 1567 -2814 -15 2474
1332B474j944j313M89N98N62j167j979J905L026k923l900L816M185l946l797M559
$$ 2474 530 -783 -294 304 866 -301 -2280 -375 2651 -272 -4172 -356 3829 -117 -3914 645
1348F45K731m595j333M295J743m164j855L151J895k774j747J888Q80q85j622Q47
$$ 645 3376 -1219 -2552 1743 3486 -678 -2533 618 2513 -261 -2008 -120 760 -125 -1747 -900
1364i00J977l3k877o47M017J005l948j170M605J272n857N68N885j555n640J466
$$ -900 1077 1044 -1833 -2480 1537 2542 -1406 -2576 2029 3301 -2556 -1988 3897 2342 -3298 -1832
1380a832M704j765l132J224J727j100p28k13O29K300j420k969K040L657k438l493
$$ -1832 2872 1107 -2025 -801 926 -174 -902 -1115 -486 1814 394 -2575 -535 3122 684 -2809
1396b809K833L057k443l325L203K665l287l457L409L039l161k895K707K136k294
$$ -2809 24 3081 638 -2687 516 3181 -106 -3563 -154 2885 -276 -3171 -464 1672 -622
1411f22j198J964J010j222o70k73J597J994k848k261L676J970m588j468N611o3
$$ -622 -1820 144 1154 -68 -738 -1011 586 2580 -268 -2529 1147 3117 -1471 -2939 2672 2609
1427B609n640L69N033o55m064N52K788J6k007N7J799L90j543j023J752J673j280
$$ 2609 -3031 -2662 2371 1716 -2348 -1796 992 1008 -999 -942 857 1247 -296 -1319 433 2106 826
1444H26k313K36L027m71l455P39L989j343m965K430M435k583m055L066K672k465
$$ 826 -1487 -1251 1776 1305 -2150 -1411 2578 1235 -3730 -1300 3135 552 -3503 -437 2235 -230
1460b30j295J902J238j188j311O29J288P28j999k063K510J775k769j710K907J773
$$ -230 -1525 377 1615 427 -884 -255 1033 1761 -238 -2301 209 1984 -785 -2495 412 2185
1476B185l667j458L844J651l930j460L867J618l919m06L755m85k683L99J436L12
$$ 2185 -1482 -2940 904 2555 -1375 -2835 1032 2650 -1269 -1675 2080 1595 -1088 -689 747 1059
1492A059q97j244l06K304N90l250l09L697k79m438J706M383j681m078J826L493
$$ 1059 162 -1082 -1388 916 1506 -1744 -2053 1644 1365 -3073 -1367 3016 1335 -2743 -917 2576
1508B576j274l114J830K038j508k074J205J765r32j934K63J180Q09o37j878R22
$$ 2576 1302 -1812 18 2056 548 -1526 -321 1444 512 -1422 -1159 21 830 193 -1685 -763
1524g63K238j428k777K725L416l638k870M001K482m052j378L299M24l016j67K304
$$ -763 1475 47 -2730 -5 3411 -227 -3097 904 3386 -666 -2044 1255 1679 -1337 -1504 800
1540H00K44j496j236J075J101P05k261j46K413J84k262j00K856J6l165l03L884
$$ 800 1044 -452 -1688 -613 488 1193 -1068 -1214 1199 1383 -879 -979 1877 1893 -1272 -1575 2309
1557B309j6l891L0L585j097l169J239L002j772k109P52J853j07o81q39M83J855
$$ 2309 2293 -1598 -1568 2017 920 -2249 -1010 1992 220 -1889 -1137 716 609 -72 -911 -428 1427
1574A427l93k423J354K717j997l194K378L156k782l115K517K258k599j381K186
$$ 1427 1034 -1389 -35 2682 685 -2509 -131 3025 243 -2872 -355 1903 -696 -2077 109
1589A09J312j990j112J444J681p70j673K41J634L46j439m88J583O94k369j201
$$ 109 1421 -569 -1681 -237 1444 674 -999 -758 876 1222 -217 -705 878 1572 -797 -1998
1605a998L099J101l550j538L692R41l645K05L450m66l257J083K396m41j496o2
$$ -1998 1101 2202 -1348 -2886 806 1747 -1898 -1693 1757 1291 -1966 -883 1513 1072 -424 -486
1621d86O08P21j05j267P5J818p76k715J353K806j455l028J597K451j470k042J596
$$ -486 122 843 738 -529 -454 1364 588 -2127 -774 2032 577 -2451 -854 1597 127 -1915 -319
1638c19K372j628k239J772K006j164k060R51J567o78j278J92O79J79n02j532J589
$$ -319 2053 425 -1814 -42 1964 800 -1260 -309 1258 580 -698 -506 173 352 -150 -1682 -93
1655i3J733k051k228K760K506l405j597L776N52l237j43L288k43k301K39P99K67
$$ -93 1640 -411 -2639 121 2627 -778 -2375 1401 1953 -1284 -1427 1861 1618 -683 -444 355 622
1672F22j68j125m6J306l73j870Q65J739k29k169N86K121K29k525N9K577r9l436
$$ 622 454 -671 -717 589 216 -1654 -789 950 721 -1448 -862 1259 1488 -1037 -978 1599 1500 -1936
1690a936J057L532j709k667J078K599j929j473P63O18j19p9q01J118J391j410
$$ -1936 -879 2653 944 -1723 -645 1954 25 -1448 -685 -67 -186 -265 -1066 52 1443 33
1706C3j937J998K591k575k080K589J488k641q10K309L02j883j156K050O75j004
$$ 33 -1904 94 2685 110 -1970 619 2107 -534 -1344 965 1267 -616 -1772 278 953 -51
1722e1j506J595L22p37l78J025N61l06j162j99J529J216k476j172K907P58l405
$$ -51 -1557 38 360 -377 -755 270 831 525 -637 -836 693 1909 -567 -1739 1168 1926 -1479
1739a479L1L190j071k914Q50K606o80j872P52R58l22k26k41O74N73q45q27J272
$$ -1479 -1448 1742 671 -2243 -1393 1213 533 -1339 -587 371 49 -177 -418 256 829 -16 -843 429
1757D29J337j183k341J439J651j051j580P61J839j688j822K189J962j964j450
$$ 429 1766 583 -1758 -319 1332 281 -1299 -538 1301 -387 -2209 -20 1942 -22 -1472
1772a472J567J248j626k60J474j45n32p12j27J030P75j583j041J558J091j650
$$ -1472 95 1343 -283 -543 931 786 254 -458 -585 445 1220 -363 -1404 154 1245 -405
1788d05j258K360P44k999j36L384l46k434j25K466l93j232j84J258or65k35Q37
$$ -405 -1663 697 1441 -1558 -1694 1690 1344 -1090 -1215 1251 858 -374 -558 700 694 -271 -506 331
1806C31O33q19j276M47J403l8j970M12K106o07k360J123K625j398k365J299K518
$$ 331 964 145 -1131 -684 719 681 -1289 -877 1229 622 -1738 -615 2010 612 -1753 -454 2064
1823B064j607j440J295O99j421o33J011L89Q8r18q59J350J283j512j586J832J263
$$ 2064 457 -983 312 1011 -410 -1043 -32 357 445 -473 -1332 18 1301 -211 -1797 35 1298
1840A298j657j160K539P92k592n87K407J87j794j43J265L52j608OJ019K30q74
$$ 1298 -359 -1519 1020 1812 -780 -1367 1040 1227 -567 -710 555 907 -701 -695 324 554 -320
1857c20m25L34P28K46j005l27J573K43j776l7K414n12k748J107K154p24k421J090
$$ -320 -745 -411 317 563 -442 -769 804 1047 -729 -766 1648 1136 -1612 -505 1649 925 -1496 -406
1875d06J464j223r26J040N75n29o99n9Q00P53o19r69O21J242j002q21J091J102
$$ -406 1058 -165 -1091 -51 524 -5 -704 -763 37 790 171 -798 -177 1065 63 -758 333 1435
1893A435j560j581J880J437j846j620J917J061j952k66J844l14j059l21P91P82
$$ 1435 -125 -1706 174 1611 -235 -1855 62 1123 -829 -1095 749 435 -624 -945 -154 628
1909F28j0o74n17R53P46j154o55J670j42j963j44K376j34k419J87J948K2k156
$$ 628 618 -56 -573 380 1126 -28 -683 987 845 -1118 -1262 1114 980 -1439 -1252 696 718 -1438
1927a438P30J696p64j280O96J128M1r16nK62L23O7j270J93J627r22k007J173K177
$$ -1438 -708 988 224 -1056 -360 768 809 -107 -112 150 473 540 -730 -537 1090 168 -1839 -666 1511
1946A511j559j663J633J187j284j114J442R85j409o52J257O95o36j064M79P34
$$ 1511 -48 -1711 -78 1109 -175 -1289 153 1138 -271 -923 334 1029 393 -671 -192 542
1962E42l6p92l31Q16L50j235m23J373Q62j885o50K003O93k030k92K228Jk429Q43
$$ 542 506 -286 -617 199 549 -686 -1109 264 1126 -759 -1409 594 1287 -743 -1035 1193 1194 -1235 -392
1981c92J889q20j346R5P98J22j91o99k97J074Mj353R37J217o60j826J188J790
$$ -392 1497 677 -669 -574 224 346 155 -544 -841 233 237 -1116 -179 1038 378 -1448 -260 1530
1999A530j035j210O79J149p06j265Q79J051r84j122O22J124o65o26K56K72JQ2
$$ 1530 495 -715 -36 1113 407 -858 21 1072 88 -1034 -412 712 47 -579 -323 -51 -50 32
2017C2o59N73J210j169j168J594J088j770j143K018N26j848k29J570J61j499k79
$$ 32 -627 -54 1156 -13 -1181 413 1501 -269 -1412 606 1132 -716 -945 625 786 -713 -992
2034i92R56M53o76n14K06P92J50q22J87J235l15j395J79J569K36k139k8J767k08
$$ -992 -36 417 -259 -773 -567 225 375 -447 -260 975 660 -735 -556 1013 1249 -890 -918 849 641
2053F41j627M22J585p42j802R28J535o39j323P61O67k33k77J65K00N44o25p98
$$ 641 -986 -564 1021 279 -1523 -595 940 301 -1022 -261 406 173 -104 61 261 805 180 -618
2071f18N95J226j011j588J240J385j530o81J367M79j441n13J571N55j033o16M48
$$ -618 -23 1203 192 -1396 -156 1229 -301 -982 385 864 -577 -1090 481 1036 3 -613 -165
2088a65R30q58JL51L42k12m03m06Q72L20j127o70J127Q61j599n42K110r3j992
$$ -165 765 -93 -92 259 601 389 -14 -420 452 772 -355 -1025 102 963 -636 -1178 932 839 -1153
2107a153L07K137n84j824R47Q24m81j43K10j36M33l96o19J02J523n89j519L75
$$ -1153 -846 1291 707 -1117 -170 654 173 30 240 104 537 141 -478 -376 1147 558 -961 -586
2125e86J505j006q09Q04R74p07j200J173R21o86j244P26J316r55r95Q93N39q99
$$ -586 919 -87 -896 -92 882 175 -1025 148 1069 383 -861 -135 1181 226 -769 124 663 -236
2143b36m01N70K18J88o37o38O52J441j314q44J405L39j142m72K191m60j732R3
$$ -236 -637 -67 151 339 -298 -936 -284 1157 -157 -1001 404 743 -399 -871 1320 860 -872 -779
2161g79J549o1j266J3P07J7l72n23P02N67o80r67P90R25l40q01M71P13J09j296
$$ -779 770 709 -557 -544 163 180 -192 -715 -13 554 -126 -1093 -303 622 282 -519 -48 665 774 -522
2181e22M23R07j28j473L25J801j191j159O80P52p12n74P90L90j65n56m15J156
$$ -522 -99 808 680 -793 -468 1333 142 -1017 -337 415 -297 -871 -81 309 144 -412 -827 329
2199C29M33n84r16R94P61q68p26R08P44j277r73J621M00j589l16J024O18j251
$$ 329 762 178 -738 256 1017 149 -577 331 1075 -202 -1175 446 846 -743 -1059 -35 583 -668
2217f68j36J263M8r76J70K09M21J27o86q8P18L36j001j46R99j38j232J98J366
$$ -668 -804 459 507 -469 -299 -90 331 458 -228 -316 402 738 -263 -409 590 452 -780 -582 784
2236G84j54j691N40J231m86r67P54M96n35r8N4M88l8o18n58P25O02p35m21P20
$$ 784 630 -1061 -521 710 224 -743 11 507 -28 -126 -72 416 378 -240 -798 -73 529 -206 -627 93
2256I3M63p01q59Q83J058j403r77J435R89j141m82J108M53j177j9N94N92p06k70
$$ 93 556 -145 -1004 -121 937 -466 -1443 -8 981 -160 -642 466 919 -258 -277 317 909 203 -67
2275f7j49N12J16m02n42Q71J03j274L8J657j43j476l20J758o1q06k51J298m57
$$ -67 -216 296 412 10 -532 339 442 -832 -794 863 720 -756 -1076 682 621 -185 -436 862 405
2294D05j004N41N38j18j035K64J88M42l47m15j39R86L0j024M99J146n39j360O70
$$ 405 -599 -58 480 362 -673 -409 -221 221 -126 -541 -680 306 336 -688 -189 957 418 -942 -272
2313b72J148m44j368J156N97q90l86R94M2n77p07M59M99m0n16l44P71L05n75k24
$$ -272 876 432 -936 220 817 -73 -459 535 577 0 -707 -248 251 211 -305 -649 122 427 -148 -372
2333c72R62J68j193k97J234M32j076o64J104L71j111j73J166k81r84L04O74j27
$$ -372 590 758 -435 -732 502 934 -142 -806 298 669 -442 -615 551 270 -714 -410 264 137
2351A37l39j71K58k61P47m93q7J055n33j301P40J218m40j480N09J143p91o12M97
$$ 137 -202 -373 -115 -376 371 -122 -209 846 313 -988 -248 970 530 -950 -441 702 -89 -701 -204
2370b04R34p37q91K87P61P2o09M67l3K27l24o7M70R9m67o54O54Q55o31j024O51
$$ -204 730 -7 -898 -611 150 222 -387 80 47 274 -50 -117 353 452 -15 -669 -15 840 209 -815 -164
2391a64P97q54p07J338J74j100j16R63J64n93J8J04K15J32n99J07O58l33o99M96
$$ -164 633 -221 -928 410 584 -516 -632 331 495 -98 -80 24 239 371 -228 -121 537 204 -495 1
2411AL59N3r30N8P90j88q46n4J097J93j194J43J474o09n71k3Q11m30k35L15k48
$$ 1 360 413 -517 -459 331 143 -703 -757 340 533 -661 -518 956 347 -224 -247 564 134 -101 214 -34
2432c4J72l0n26L70P74p94j016Q47R04m64j275J282M64p90l27O85N97q87m07N23
$$ -34 138 108 -418 -48 726 -68 -1084 -237 667 203 -1072 210 674 -116 -443 242 839 -48 -455 68
2452F8O27o61n50O36J82m57l18K66L83l28k81p0O51K66o42l51J034O6r67J76J013
$$ 68 695 34 -516 120 302 -155 -473 -207 176 -152 -433 -503 148 414 -228 -579 455 521 -446 -270 743
2473G43j21j422M51R44j80q33P6L07p1j75k22L64N40r2r42L19R11j8j116O32M88
$$ 743 622 -800 -349 595 415 -418 -342 -35 -106 -281 -503 -139 401 309 -633 -314 597 579 -537 95 583
2494E83l46o64N74O64p30n97J33R08n60o82O76M65m54m61O46R3k64O0k95M56L18
$$ 583 237 -427 147 811 81 -516 -383 525 -35 -717 -41 424 -30 -491 155 248 -16 44 -251 205 523
2515E23m62o93R50M93p98m75P98L75j267K41P54L9r00M9L44J29Qm34L86J71k02
$$ 523 61 -632 318 811 13 -462 336 711 -556 -315 439 478 -422 -373 -29 100 108 -326 60 231 29
2536B9k36N55k3K5l17l09O62M0p71J6P44k26j187M60R31m31p98P10O59p13k73
$$ 29 -207 348 325 350 33 -276 386 426 -345 -329 415 189 -998 -538 393 -38 -836 -126 533 -180 -453
2557d53O73J01J97p39K11K44J09k43p28N83N25n33o85M85N02o16l94R29K05n02
$$ -453 220 321 518 -221 -10 234 343 100 -628 -45 480 -53 -738 -253 249 -367 -761 168 373 -129
2577a29m14O56L61n87k63P98p8k53n66O20K69k3o71Q8J72J73l16m00P96k84n71
$$ -129 -543 113 474 -113 -376 422 344 91 -475 145 414 391 -280 -192 -20 153 -163 -563 233 -51 -622
2598f22M39P95m14j055M29J068m39m50N20M71o96l85L54L14j95k32o39P57J5K16
$$ -622 -183 612 198 -857 -428 640 201 -249 271 742 46 -339 15 329 134 -98 -737 20 35 251
2618B51o27K31M42l32l33K14O57l18p13M05J002q43o25J167J23j156M0O02Q9n39
$$ 251 -376 -145 297 -35 -368 -154 503 185 -528 -123 879 36 -589 578 701 -455 -415 187 276 -263
2638b63k19L74Q6J71l00M1J19L05o55L47P25l59p22p6J030m9p53o5M83j90o07
$$ -263 -482 -108 -22 149 -151 -110 9 314 -341 6 731 372 -350 -426 604 555 -198 -263 220 30 -577
2659e77L06N99k79p51M72L31q0l1l86L55q7P5j52m0Q28l82n94P4J043l45r09L77
$$ -577 -271 328 49 -702 -230 101 21 -10 -396 -41 -128 -53 -205 -245 583 201 -393 -319 724 379 -530 -153
2681a53M55o18p0M98M32o79k63J94M37P8n22K74R3J74m43Q6L05R0n83l0L57L75
$$ -153 302 -316 -386 112 544 -135 -398 -204 233 311 -211 63 156 330 -113 -27 278 368 -215 -245 112 487
2703D87p21l52O81J50n47l84J148l63o23K16O97k33L5l97K58K29l11K1o0N27l29
$$ 487 -234 -586 95 245 -302 -686 462 99 -524 -308 389 156 191 -206 52 281 -30 -9 -69 458 129
2724A29k28J36M65m04o35J13R53k99o84N16M39n22n46M46R45m38o20nK95J14j85
$$ 129 -99 37 502 98 -537 -424 529 230 -454 62 501 -21 -567 -121 824 386 -234 -239 56 170 -15
2745a5JJ44lj75k00J56N63n82o34O93P53r46J00K47L49q08K1P39k00k32n0K05
$$ -15 -14 130 127 -48 -248 -92 471 -111 -745 -52 701 -245 -145 102 451 -357 -336 403 203 -29 -79 126
2767A26K01j85k23j47N14n81k4L2P12k8q72J37O90k97l39L55K14k57m43N32P05
$$ 126 327 142 -81 -228 286 -295 -319 -287 425 397 -475 -338 352 55 -284 71 285 28 -415 117 822
2788H22n90o66K9N89k4j02k16K06j75k55K71J08K14k89l82N44J27o2m19M06K01
$$ 822 232 -434 -405 184 160 58 -158 48 -127 -382 -111 -3 211 -78 -460 84 211 149 -270 136 337
2809C37n48p7L30M16o32j30J09M40q5n78L05K41k45j32K40L06l10l71L12M14L00
$$ 337 -211 -288 42 458 -174 -304 -195 245 160 -418 -113 128 -117 -249 -9 297 -13 -384 -72 342 642
2830F42l32l59K90k04m81L70M96j77p80k1Q08j29m29K51M35l51k00J79J63q8m7
$$ 642 310 -49 241 37 -444 -74 422 245 -535 -556 252 123 -306 -55 380 29 -171 8 171 83 36
2851C6j03j2O56k06o48J73L07j47m25K99K76k07m16L16O09l79o57L01M82k42L6
$$ 36 -67 -79 577 371 -277 -104 203 56 -369 -70 206 -1 -417 -101 508 129 -528 -227 255 13 49
2872D9q3J55j43K31k04L55k43n5l71J37N01o05o8K48K86n87m4O35J05n28K27J65
$$ 49 -34 121 -22 209 5 360 117 62 -309 -172 329 -276 -344 -96 190 -397 -441 194 299 -229 -2 163
2894A63J41n40M16l14L53k50J46P4J56l25l13J77L71j26l43r6K26M6k28j1N31
$$ 163 304 -236 180 -134 219 -31 115 189 345 20 -293 -116 255 129 -214 -310 -84 -38 -266 -277 254
2915B54q6p07O98J25M6l22j6J65k76k00O10j8k79k37j06M31j4J5n42N59J92n40
$$ 254 168 -539 159 284 330 8 -8 157 -119 -319 291 273 -6 -243 -349 82 68 83 -459 100 292 -248
2937b48r1N14J2l16k81N64L88n25l50M08P8l81L4K83J97m05rj39K88J91m16j41
$$ -248 -339 175 187 -129 -410 154 542 17 -333 75 153 -228 -194 89 286 -119 -128 -267 21 212 -204 -345
2959c45L58K14l15J27L04l4p99K42P11l85m78J74M26l49j44N1L59j22l96J76L01
$$ -345 13 227 -88 39 343 309 -490 -248 463 78 -400 -226 200 -149 -293 -242 117 -5 -401 -225 76
2980G6J90k66m39K80L36L3k60L12J59l64l15L20M82o29m58N39M28p11P1L10J25
$$ 76 266 0 -439 -159 177 210 -50 262 421 57 -258 62 544 -85 -543 -4 424 -287 -216 94 219
3001B19o56M40L3j02L13l29L1J12j77j49n3M89K82n67k83O94k21l54k35R00k47
$$ 219 -437 3 36 -66 247 -82 -51 61 -116 -265 -318 171 453 -114 -397 297 76 -278 -513 387 140
3022A40m77J09L76J75n06k24P89L1n15K3J17M01l15r5j68K67j08o45M28N37l73
$$ 140 -337 -228 148 323 -183 -407 382 413 -102 -79 38 439 124 29 -139 128 20 -625 -197 340 -33
3043c3k97N00L72n60k11M76on48J10K89L22j88m30K59J01q6j82%M22j62m74RM37
$$ -33 -330 170 542 -18 -229 247 241 -307 -197 92 414 226 -204 55 156 70 -112 -112 310 148 -326 -317 120
3066A20J71p33j85O00Q6kj50L65j76k13l29P83M0m56J4p6n1p0J06K17O6M6o42
$$ 120 291 -442 -627 -27 59 57 -93 272 96 -117 -446 337 377 -79 -65 -141 -192 -262 -156 61 127 173 -469
3089d69N22N4J31p95K62P38m10j53J51M34n22k51N63r5K63p16K00M0j19K44L2
$$ -469 53 107 238 -557 -295 443 33 -120 31 465 -57 -308 255 160 423 -293 -93 -53 -172 72 104
3110A04k50j56J82oP1K82k29k85L52K49k30k70K53K52n15o0M85K35q65j9L00K12
$$ 104 -146 -302 -120 -126 -55 227 -2 -287 65 314 84 -186 67 319 -196 -256 229 464 -401 -420 -120 92
3132I2j26k17j24K56J08k37J38M05l29l88K75J69O3l17K84K03j60m87K99L03j72
$$ 92 -34 -251 -375 -119 -11 -248 -110 295 -34 -422 -147 22 85 -232 52 255 95 -392 -93 210 38
3153C8k84J00M56n2n63J95k5L89k46J57k44K39k73J16L74K65m81l69J88M36m66
$$ 38 -246 -146 310 258 -305 -110 -135 254 8 165 -79 160 -113 3 377 642 161 -208 -20 416 -50
3174e0j78LN87o79J4J50J11j18mR6L20m12q5M06p8p4j96K66Q0O3k30j77M20q6
$$ -50 -228 -225 362 -317 -303 -153 -42 -160 -164 -68 252 -160 -245 161 83 9 -187 79 159 222 -8 -185 235 149
3198A49n78J70J35L21n97l5O75Rn07J43L38j3qk71L42j10n45J93L20J92m50l16
$$ 149 -429 -259 -124 197 -400 -435 240 249 -258 -115 223 210 202 -69 273 163 -382 -189 131 323 -127 -443
3220d43J93M57k5m58K04J96j43l83L16M51k99l49Q1N13l79j71K10K77l47k20J70
$$ -443 -250 207 182 -276 -72 124 -19 -402 -86 365 66 -283 -202 311 -68 -239 -29 248 -99 -319 -149
3241a49L63o3K7o86N41N9k76k3K06P4m67J76O19j50m19m43P77o6P0m8m0l22J60
$$ -149 214 151 178 -508 33 92 -184 -207 -1 73 -394 -218 401 251 -168 -611 166 100 170 122 82 -240 -80
3264h0L7J23Nk85k15O21k05K00m02J16O0P9m13O77P4k79l95M1M86k64L0j77L53
$$ -80 -43 80 85 -200 -415 206 1 201 -201 -85 -25 54 -359 318 392 113 -282 -241 245 -19 11 -166 187
3287A87n10L04j36M16l02k32K4L95J44k47j76m1K53j42l12P54k63j19k08J44K99
$$ 187 -323 -19 -155 261 -41 -273 -249 146 290 43 -133 -174 79 -63 -375 379 116 -3 -211 -67 232
3308B32m28P8L1r1l28R5O10Pl39O4kM86m44l02K60K65J05m45RN27j64m26J74K02
$$ 232 -196 -118 -87 -178 -506 -411 199 206 -133 -69 -71 415 -29 -331 -71 194 299 -146 -137 390 226 -200 -26 176
3332A76j24j51r3J31j11J5K61Q5l4o1j64K45p3l86m8N42R2l55J76n9j76j30J31
$$ 176 52 -99 -192 -61 -172 -157 104 189 155 94 -70 175 102 -284 -332 210 302 -53 123 64 -112 -242 -111
3355a11n0M18k09j00o4M09k35m56M27j31k06K19K31N5l24K62j23J4j09N1k7K61
$$ -111 -161 257 48 -52 -116 293 58 -398 29 -102 -308 -89 142 197 -127 135 12 26 -83 -32 -59 202
3377B02j00l88J39K61N1m77M32J72j18j23J15k7L3n60K70N7J66n4k32J93o8j31
$$ 202 102 -286 -147 114 165 -312 120 292 174 51 166 139 172 -388 -118 -61 105 51 -181 12 -56 -187
3399a87lK06j83K13j37J02L13o5o64L20L89l97l08M02M81n49L3K26M7k84Q8k28
$$ -187 -190 16 -167 46 -91 11 324 259 -405 -85 304 -93 -401 1 482 -67 -34 192 239 -45 43 -185
3421a85L92jo3j73l9J96l10O7L30J24m01j08K57J35k43n1J96J47m29m9M93j49
$$ -185 207 206 143 -30 -69 127 -183 -116 214 338 -63 -171 86 221 -22 -73 123 270 -159 -208 285 136
3443A36k85k00L46L6k27P1K15M2j53J94j35J45L3j89j99K99J97m01J85L8j55j17
$$ 136 -149 -349 -3 33 -194 -123 92 134 -19 175 40 185 218 29 -170 129 326 -75 110 148 -7 -124
3465a24J29P7j87j07K06K90j41j4m24L19K01q3j17p0n6K58k09P9J61j48mN6R5
$$ -124 5 82 -105 -212 -6 284 143 129 -295 24 225 142 25 -45 -101 157 -52 27 188 40 36 92 187
3488A87l67j16L43R0n81L55J31J12k82k62N41rk80K25k6J87j3m02m7K26k2k20
$$ 187 -180 -296 47 137 -444 -89 42 154 -128 -390 151 142 -138 87 61 248 235 -167 -214 12 -10 -230
3510b30q7K13L1j63J83J94k77k42K90P9K72m77N4N56m39K02m5N0N6k26P1o9J66
$$ -230 -317 -104 -73 -236 -53 141 -136 -378 -88 -9 263 -214 -160 396 -43 159 114 164 220 -6 65 -4 162
3533A62l68m2J71Lo7j73L13J39m86J86K31J8J89k92K10k33J28m53M41k01J6p8
$$ 162 -206 -248 -77 -74 -141 -314 -1 138 -348 -162 69 87 276 -16 194 -39 89 -364 77 -124 -108 -186
3555a86O2L66K3m09q5L50R1K4n58L07J32j71QM00k23K5m8J1Rk24M2L29k17m2p
$$ -186 -124 242 265 -144 -229 121 212 236 -322 -15 117 -54 -46 354 131 156 108 119 128 -96 -54 275 58 16 9
3580IM6J2k98j47K94K35r1n3j03M33m19j13M88k97L28o31K14r0L27n04M98J47
$$ 9 55 67 -231 -378 -84 151 60 7 -96 337 -82 -195 293 -4 324 -307 -93 -183 144 -360 138 285
3602B85m41K21l41N05p6m59p0K10K25n8k5J32j71m5k6J19Ok06n9M56k93M5J67
$$ 285 -156 65 -276 229 153 -306 -376 -166 59 1 -24 108 -63 -108 -134 -15 -9 -215 -274 182 -111 -66 101
3625A01k34K32k03L19k58l27K67K37p3m4k16K97j04J8l31N57j99J44J40m34o6
$$ 101 -133 99 -104 215 -43 -370 -103 134 61 17 -199 98 -6 12 -319 238 39 183 323 -111 -177
3646a77j14K13k38M05N9m70L95j91J98J93o23Q4N10j03J5k39J09Oq2J91k36J73
$$ -177 -291 -78 -316 89 148 -322 73 -118 80 273 -350 -266 244 141 156 -83 26 32 -50 141 -95 78
3668G8m97L72p8J74k19Q3J2J09m5j80L65M9k64k30L85J34k61l0pR6K2j09O0K36
$$ 78 -419 -47 -125 49 -170 -87 -75 34 -11 -191 174 223 -41 -271 114 248 -13 -43 -50 46 68 -41 19 255
3692B55k45J90m66R0K26p1k26M71j24JR1j74J64K3m21M3J32K40r3j38K27k40P5
$$ 255 10 200 -266 -176 50 -21 -247 224 100 101 192 18 182 205 -216 -173 -41 199 106 -32 195 -45 30
3715C0k73K97l28L20J50J78k90l53K89J89j81k44M52n2j95O9k0L21l39j15J14
$$ 30 -243 54 -274 46 196 374 84 -269 20 209 28 -216 236 184 -11 58 38 359 20 -95 19
3736A9K07l75J09j80K01P9j17J17R5r8K7p0k8J72J20l6j35l2j88J01M28m65n5
$$ 19 226 -149 -40 -220 -19 60 -57 60 155 57 84 14 -14 158 278 242 107 75 -113 -12 416 -49 -104
3759a04l50N93o7m3j50l9L56J3k27q6N3o5j23K11J73k3l80L38K25l56k59J77M47
$$ -104 -454 139 72 29 -121 -160 196 209 -18 -104 -51 -116 -239 -28 145 122 -258 80 305 -51 -310 -133 314
3782C14k88q0M9M3K3k57n0J84L52k61j03q3L35j10k35J32K43j96r4l01L81J40
$$ 314 26 -54 -5 38 61 -196 -246 -62 290 29 -74 -157 178 68 -167 -35 208 12 -82 -383 -2 138
3804A38k84J26k7j27j53M08q6J48P2l67K17J02k70J23O8l7m27L24J76R9m69Q6
$$ 138 -146 -20 -47 -174 -327 81 -5 143 215 -152 65 167 -103 20 88 51 -376 -52 124 223 -246 -160
3826a60J04J0r4L27j85q9M0J57K44k11r3o5M2k11K55lK96l38J05k41K94k63k8
$$ -160 -56 -46 -140 187 2 -87 -47 110 354 143 50 -15 27 -184 71 68 364 26 131 -110 184 -79 -107
3849a07L27m25L97k06j9L27K1m66NJ87J18Q4j14qm6r8J58j44J64l06O9O0oJ80
$$ -107 220 -205 192 -14 -33 294 315 -151 -146 41 159 243 129 121 75 -23 135 -9 155 -151 -82 -22 -28 152
3873A52j47j07k8J83O2j44J58k80J72q1K8K59l78K41M6L4k09j21J31LJ24k9m5
$$ 152 5 -102 -130 53 115 -29 129 -151 21 -60 -32 227 -151 90 136 170 -39 -160 -29 -26 98 69 24
3896B4J16l22J04m4K81j15J27o3j39j22N5L03l9l36K81m8J44l24J23K05m61L55
$$ 24 140 -182 -78 -122 159 44 171 108 -31 -153 -98 205 166 -170 111 63 207 -117 6 211 -250 105
3918A05k43L00L9k07PL9P1j01j49OJ31J76j65j55jJ87M2j07j13J01p6L96l54o7
$$ 105 -138 162 201 -6 1 40 111 10 -139 -133 -2 174 9 -146 -147 40 82 -25 -138 -37 -113 283 -71 -138
3942a38j74K48O3Lj7j93J11L52l77L0J25M0Q7j62L3O8Q5l08q8K77j35m0K46p2
$$ -138 -312 -64 -1 2 -15 -208 -97 255 -122 -92 33 73 160 -2 31 99 184 -124 -212 65 -70 -110 136 64
3966F4k70K20nJ81j87K5p8K44M7l27L52q1m29N21k63q1p6o8m5K63o5k52L21P8
$$ 64 -206 14 9 190 3 28 -50 194 241 -86 266 185 -244 277 14 -67 -143 -211 -256 7 -58 -310 11 89
3990H9LJ61l33M2J00q0k02M83k13K32m60L53p4k22J11K9L9j55j26N5K12j59m8
$$ 89 92 253 -80 -38 62 -18 -220 263 50 282 -178 175 101 -121 -10 19 58 -97 -223 -168 44 -115 -163
4013a63M9K75l01N3M6K59k14Q3k11M00n9j09O6n27L63J49r8k67L99l75J47Q1k63
$$ -163 -114 161 -140 -87 -41 218 4 87 -124 276 217 108 174 -353 10 159 61 -206 193 -182 -35 46 -217
4036b17L11k50L19j98k73M27q0l0k3J78l98L1L47l7k97K99r9o2P8J25j43k1j95
$$ -217 94 -156 163 -35 -308 119 39 9 -14 164 -234 -203 144 107 -190 109 10 -52 26 151 8 -13 -208
4059b08J3M82m86lK08J45k32L62j52j48j27K7J0J19J3p7j80J36L66j42On4q9o5
$$ -208 -195 287 -199 -202 6 151 -81 281 129 -19 -146 -119 -109 10 23 -54 -234 -98 268 126 132 78 -11 -76
4083g6J64j9Q8l60L84n2k01n7L24k67P5j96L91k23j14J50K5R6o2l43K55J35M1
$$ -76 88 69 157 -203 181 129 -72 -129 195 -72 3 -193 198 -25 -139 11 36 132 70 -273 -18 117 158
4106A58m11K48J75p7J37l92K69K21l8m70M09l10R8j79j10K81M1Q5Qn1j13p4K22
$$ 158 -253 -5 170 93 230 -162 107 328 290 -180 229 -81 17 -162 -272 9 50 135 143 92 -21 -95 127
4129A27m30M18k72N11m08j02j8J96o4M8K9m9j46J59m6k6J86j24R1l40K96k69J66
$$ 127 -303 115 -157 354 -54 -156 -174 22 -42 6 35 -14 -160 -1 -47 -73 113 -11 80 -260 36 -233 -67
4152f7J66j68J07o1J10j1nj97J97R9j31O3k26K25j3M4o8j40J00K02k04J4K08k22
$$ -67 99 -69 38 -23 87 76 71 -126 71 170 39 102 -124 101 88 132 64 -76 24 226 22 36 244 22
4176B2Nq1N1K54p0l10J76N9j04P3j24lk39M17j11j28l1J38r1O2N7j38K21K05k19
$$ 22 27 -54 -3 251 181 -129 47 106 2 75 -49 -52 -291 126 15 -113 -144 -6 -97 -35 22 -116 105 310 91
4201I1k96K27Q0ql5J82l35N2R3j70J36k7lr9L00o5n2k42L78k37J48k52K19l59
$$ 91 -205 22 102 94 59 241 -94 -42 51 -119 17 -10 -13 -112 188 123 71 -171 207 -30 118 -134 85 -274
4225b74K47J13k7R6k73J20k30N66n59L53l21J46R8Q6k4k37K06N9j60L9k29P8M28
$$ -274 -27 86 59 155 -118 2 -228 338 -221 132 -189 -43 55 141 117 -120 86 145 -15 24 -205 -127 301
4248C01j42k16j13J77N1K20j39r7p8j48j43M15l09L24k53K06K68k31k98Q5O1l9
$$ 301 159 -57 -170 7 58 278 139 42 -36 -184 -327 88 -221 103 -150 56 324 93 -205 -120 -59 -98
4270i8q9L58l5j27M4n0P0q0p2K8J63k46J88O5l31L64k63o%J05jP6OJ34j79qJ4
$$ -98 -187 171 136 9 53 3 73 -7 -79 -51 112 -134 54 119 -212 152 -111 -117 -117 -12 -13 63 69 203 24 16 30
4297C0j19JQ8k42K67K4j96J79l16K19O8R9k15K28j89o0K44L7j39K0J26l1J9j98
$$ 30 -89 -88 0 -242 25 49 -147 32 -284 -65 3 102 -113 115 -74 -134 110 147 8 28 154 123 142 -56
4321e6m1J7m6M52m40M42l71P2j12L17k98L22l98J85J69m48K54j43L14o17K37K1
$$ -56 -97 -80 -126 326 -114 328 -43 29 -83 234 -64 258 -140 45 214 -234 20 -123 191 -426 -189 -168
4343a68K3L43j51j13j42K95k48L12m88L80N9O1q8j08J16j56K0l0K28j06k02L3
$$ -168 -145 198 47 -66 -208 87 -161 151 -337 43 102 163 75 -33 83 -73 -53 -83 145 39 -163 -130
4365a30K1J95J12m8k22k4Q8j87L55Q6j71q9R8J7J0j04J6Q7j1j60J06Q3j8j95m3
$$ -130 -109 86 198 150 -72 -96 -8 -195 160 246 75 -14 84 101 111 7 23 110 99 -61 45 128 110 -85 -128
4390a28L59m03lJ54j09o4p2N22l71J87o4L2j84L72j16j98N2K1J84P2k65P2j7P
$$ -128 231 -172 -175 -21 -130 -194 -266 256 -115 72 8 40 -144 228 112 -86 -34 -13 171 243 -22 50 33 40
4414D0o2n2p5K6Q8j09K2K02J78j34j79j67R5J25N9R6j11q1J2r5K45Ol65L25j08
$$ 40 -22 -74 -149 -123 -35 -144 -122 80 258 124 -55 -222 -127 -2 57 153 42 -39 -27 -122 123 129 -236 89 -19
4439a9pl0K8J9k20L07j86k9J58P8l17K47K80j63Q5k63j64L18k05J36J07m03K35
$$ -19 -26 -56 -28 -9 -229 78 -108 -137 21 99 -218 29 309 146 231 -32 -196 122 -83 53 160 -243 -8
4462hJ2k48K94L04n98N8J64J93k89K55M2k16P9j41J80l3k01K53j84j03K31N1k22
$$ -8 4 -244 50 354 -244 -186 -22 171 -118 137 179 -37 42 -99 81 48 -153 100 -84 -187 44 95 -127
4485a27J32P2j37j30J88o2L48k10jJ7N2j58r9K8OJN1j42j26L73j76p3K36j24J12
$$ -127 5 77 -60 -190 -2 -64 284 74 73 90 142 -16 -115 -87 -81 -80 -29 -171 -297 76 -100 -173 63 -61 51
4510E1q5J1j06J22k36L54M9k53L2Qj90L75j1j4j93j02K41N6l2r9k49L41J29k61
$$ 51 -34 -23 -129 -7 -243 111 160 -93 -61 -53 -243 132 121 107 -86 -188 53 109 77 -22 -271 70 199 -62
4534f2QK30n6k28J02k58M35n5J13j07k51n9p5N5J69o7N27m60k67K67r9K53k8M6
$$ -62 -54 176 120 -108 -6 -264 171 116 229 122 -129 -188 -263 -208 -39 -106 421 -39 -306 -39 -138 115 87 133
4558A33l45K38j08L07j25l6M3j30J66j65L59k63j50j05K5K56j04O0R6l21L49l28
$$ 133 -212 26 -82 225 100 64 107 -23 143 -22 337 74 -76 -181 -156 100 -4 56 152 -169 180 -148
4580a48K82n6n2J95m33J32j60J81J6n5P4j14K88k62j3J80or9j00M92k11r4M2N
$$ -148 134 78 26 221 -212 -80 -240 -59 -43 -98 -24 -138 150 -112 -125 55 49 -50 -150 342 131 37 79 84
4604H4j20M36q84O03O5q6J55l62P6l58K74l7J93O5l96L50J75m38L87j46j2K8k0
$$ 84 -36 400 -484 119 184 98 253 -109 -33 -391 -117 -154 39 104 -292 58 233 -205 182 36 24 52 32
4627C2J7Q0j21k22L10j64p6J06p0kK06P8q3O8M8j75k56n7l2M16N0M3k9p0l60M55
$$ 32 49 129 8 -214 96 -68 -144 -38 -108 -110 96 174 91 159 207 32 -224 -281 -313 103 153 196 167 97 -263 192
4653A92k08P7J88j69p1J14m7K25j71k44J60k45l1L25l48L53R0j75O9P6k29K65
$$ 192 -16 61 249 80 9 123 76 301 130 -114 46 -199 -230 95 -253 100 190 15 84 160 -69 196
4675A96j61Q9M9K8k93M7l1j31L69j83Pj74L01J79l58K07k9l85L20q0J77P0j53
$$ 196 35 124 173 201 -92 -45 -76 -207 162 -21 -14 -188 113 292 -66 141 112 -273 47 -33 144 214 61
4698F1K15l20J31j99J88j63J8K30l23K08k08M0Q8J36n1j1Q2R6j10k99l4L64p1
$$ 61 276 -44 87 -112 76 -87 -69 161 -162 46 -162 -122 -34 102 51 40 122 218 108 -191 -225 139 68
4721F8j44k04O17n78J95q3L04j02O9n84L07M07j53K5j80J50k4O9l01n5K12m3J26
$$ 68 -76 -280 337 -241 -46 -129 175 73 142 -442 -135 272 119 144 -36 114 90 159 -142 -197 15 -28 98
4744I8j07k3L1k29K88j04K32j13p9j13L03k27K04j71K63J9n10L08O7k9L51n49
$$ 98 -9 -32 -1 -230 58 -46 186 73 -6 -119 184 -43 161 -10 253 272 -238 70 137 108 459 -90
4766i0J55J04k62J19l72J58K88l7p3p3J30N3l1j50L14l61L76j81q7j84M50k22
$$ -90 65 169 -93 26 -346 -188 100 63 -10 -83 47 100 69 -81 233 -128 248 67 -20 -204 246 24
4788B4k7J17L0o3k72O4j81K48J07l2J21l37K36O0rl25L81r7nj0l12J99J33k14
$$ 24 -3 114 144 81 -191 -127 -308 -60 47 15 136 -201 35 95 86 -239 142 45 40 30 -282 -83 50 -164
4812a64K51j28lJ6J05j75J10q0J97j93J47l7Jk12J16J20j29O4j65J45R0j16K14
$$ -164 87 -41 -44 -28 77 -98 12 -68 129 -64 83 46 47 -165 -49 71 -58 6 -159 -14 76 -40 174
4835A74q6q2j62L12P5k28Q1j75J78J01L4j68j35J50j25K5OK78j81q8j0J76j37
$$ 174 88 6 -156 156 231 3 84 -91 87 188 222 54 -81 69 -56 -31 -25 253 72 -16 -26 150 13
4858A3O0j27K22k05j5l5Q8j22O8J7J72r1R5l89J26M06j66J03k04J70l17N3k1M9
$$ 13 73 -54 168 -37 -52 -87 1 -121 -53 -36 136 45 140 -249 -123 283 117 220 16 186 -131 -78 -99 -50
4882e0j24J62K01Lo1j72o8L3l6l1J78N0l75J76J63p9j03K69r8K2L6j17K66j63
$$ -50 -174 -12 189 192 131 -41 -109 -76 -112 -143 35 85 -290 -114 49 -30 -133 136 38 60 96 -21 245 82
4906H2j79j50L29K2K7l05J98k87J88K22j44J00l8n1NP3j56K2o8K13P4k22J39k11
$$ 82 -97 -247 82 104 131 -174 24 -263 -75 147 3 103 65 14 19 92 -64 -42 -110 103 177 -45 94 -117
4930a17pJ72o6m7L92l65K11k20L7K80m21L44l56M06k25k58K02K58n24O6L48j35
$$ -117 -124 48 -18 -65 327 -38 173 -47 -10 270 -151 193 -163 243 18 -240 -38 220 -304 -238 110 -25
4952b5o7J03r3q5K00p9k03KL19k16P3P7J71l32K81M9k94K74l30K83m6l1L6m8q
$$ -25 -92 11 -82 -167 33 -46 -249 -247 72 -144 -71 6 177 -155 126 175 -119 155 -175 108 62 31 67 19 11
4977A1L2o2oo9P0k64L59k26J71J76j65o2r7J97r6L7jj45P1M17m90J28P3j10P2
$$ 11 43 -19 -25 -94 -24 -288 71 -155 16 192 27 -35 -132 65 -31 6 5 -140 -69 348 -142 -14 59 -51 21
5002B1j07J77j34k72J85K76Ok28%Q9J5l7j0o6O3k12K98p9j55R3j05o6K94m4K6
$$ 21 -86 91 -43 -315 -130 146 152 -76 -76 13 28 -9 -19 -85 -22 -234 64 -15 -170 -77 -182 -248 46 2 28
5027B8j84K83N9j76j57k2J08R6J08j73Q9K99m36J91M5k14N8P8k20N8J98P2j20
$$ 28 -156 127 186 10 -147 -169 -61 35 143 -30 59 358 -78 113 158 -56 2 80 -140 -82 116 188 68
5050F8Mk80O9L48k16m6m5k0K99J2l03K69l40q5J04J55j14J27N5J79n00J41O8J07
$$ 68 72 -208 -139 209 -7 -53 -98 -118 181 193 -110 159 -181 -266 -162 -7 -121 6 61 240 -260 -119 -51 56
5074E6R1k40K73j66k05K18O3j80J57Jj23J0JQ5J31j76K70j88R4l57P2K02j22j05
$$ 56 147 -93 180 14 -191 27 90 -90 67 68 -55 -45 -44 41 172 -4 266 78 172 -185 -113 89 -33 -138
5098a38K26m9l5L22j29k5j59j38J37k28J81K08m57o9J96Q2q2L20k54L96l69J49
$$ -138 88 39 4 326 197 172 13 -125 12 -216 -35 173 -284 -353 -157 -75 -157 163 -91 305 -64 85
5120H5M2k8k74J15J37R2k84m0l3L71j08l00N89k93J06p0j86J38O6K9J7k26J92
$$ 85 127 99 -175 -60 77 169 -115 -155 -188 183 75 -225 364 71 177 107 -79 59 125 154 171 -55 137
5143A37q3k98J63L19k51L7Q6j39R8j47J15o7J9j7N7p3K48P6m38L50n24M32O8r4
$$ 137 54 -244 -81 238 -13 24 110 -29 69 -78 37 -30 -11 -28 29 -44 204 280 -158 192 -332 100 168 74
5167G4j3j3M0L6K09j99nj4j64J63l27j7L29q2lJ26j72J43j75J81r8j9o6K54l7
$$ 74 61 48 88 124 333 134 129 115 -49 114 -213 -230 99 17 14 140 -32 111 -64 117 19 0 -66 188 151
5192A51j40O7PJ46l25J23J12k22L16l15K76l67N2R8n0L13j43j05O8L7Rr9j64L55
$$ 151 11 78 85 231 -94 29 141 -81 235 -80 196 -171 -119 -21 -71 242 99 -6 62 99 108 9 -155 200
5216B00k92K68k49L69r4j24k4j91K22j73k57L86K41k37m8L1o3O5l06J62M92j90
$$ 200 -92 176 -73 296 202 78 54 -137 85 -88 -345 41 282 45 -3 28 -35 30 -276 -114 378 188
5238A88k59J90l33K45m9j74L83N0l23Q1R5N3l13L8L97j4l44L53l49R8J05j8J5
$$ 188 -71 119 -214 31 -18 -192 191 241 -82 -1 94 147 -166 -128 269 255 -89 264 -85 13 118 100 115
5261A15p4J79q4m3l15L24Oj15R3k6Q6j94L04k26k44J66J62l66J82M8L01l68M07
$$ 115 41 220 136 93 -222 102 108 -7 86 60 146 -48 256 30 -214 -48 114 -252 -70 -22 279 -89 318
5284C18m78J17J23j53J64j9j95L1O6j0j48L18j13ln4j54M64r8k60J54J33j85J6
$$ 318 -160 -43 80 -73 91 72 -123 -92 -26 -36 -184 134 21 18 -36 -190 274 176 -84 70 203 18 34
5307C4k44K27P3j58N9Q6j18L33m13M67l51K38m41J88O4nJ51j84l2k6L47j92q5
$$ 34 -210 17 90 -68 -9 77 -41 292 -121 346 -5 233 -208 -20 44 39 190 6 -26 -52 295 103 18
5330A8J68l18r4l7P16m78J13ok13L66l53J57k5N7N9M3l07K08k30K86jk72K15J86
$$ 18 186 -132 -226 -263 453 -25 88 82 -131 235 -118 39 14 71 130 173 -134 74 -156 130 129 -143 72 258
5354B58k64K61l01J83k9j90J93q9o8P7J66k62J44m01J82Q7k0k01J77j10J55J17
$$ 258 -6 255 -46 137 108 -82 111 22 -46 31 197 -65 79 -322 -140 -53 -73 -274 -97 -207 -52 65
5376F5k39J31J84m00M09j6k14J99j72P1J6J62r8k52Q8j2r0K23k92K94pk35J35
$$ 65 -174 -43 141 -259 150 134 -80 119 -53 18 34 196 98 -154 -66 -78 -168 55 -237 57 50 -185 -50
5399e0r4%m3J36j5P5J76k02j13J5k7L64m16K0Q0J66k46J53J27j42N01m92J4l29
$$ -50 -144 -144 -187 -51 -66 9 185 -17 -130 -115 -142 222 -194 -174 -94 72 -174 -21 106 -36 465 -27 -13 -342
5423c42O26k23n0k28K82j35j56R2L18j10K02j83p3n8J03o6k9O0K0r0J70j84k5
$$ -342 284 61 11 -217 65 -70 -226 -134 184 74 276 93 20 -38 65 -1 -30 30 50 -40 130 -54 -79
5446g9N21l23m69J32K46q2O3l52L77L30l35P7k03K37j51N1J74k90J07q9Q5j54
$$ -79 442 119 -350 -218 28 -54 9 -343 34 364 29 106 -97 140 -11 40 214 -76 31 -58 27 -127
5468a27K52r0J54l69K86j04j7j75L12k66N1K00j53j4L49l36J61k90J95J96k76
$$ -127 125 35 189 -180 106 2 -15 -190 122 -144 -93 107 -46 -60 289 -47 114 -176 19 215 -61
5489f1l9K57k8l15L37K3k08J56j48J28p1k9r3M5P3K64k82q7J84j08pP2k81L29
$$ -61 -100 157 129 -186 151 174 -34 122 -26 102 31 2 -91 -46 27 291 9 -78 106 -2 -9 63 -218 111
5513A11j51N7L6n5J41k55k3L72k81K54oj37q1r0K68p6k35J17P6n2N4kP1k52L15
$$ 111 -40 17 53 -2 139 -116 -139 233 -48 206 200 63 -18 -108 160 84 -151 -34 42 -10 44 42 113 -139 176
5538A76k94n7J46j79J34r1L41k91M93k32j10N1p5n1N2j13J78p2L2j1j35J26j89
$$ 176 -118 -175 -29 -208 -74 -165 176 -115 378 146 36 87 12 -39 13 -100 78 6 38 27 -108 18 -171
5561a71K17k13L01k4N5J3r4j14K04l49M9K29J0j04M8J94l27K11J00Pj65J5k58
$$ -171 46 -167 134 110 165 178 84 -30 174 -175 -126 103 113 9 57 251 -76 135 235 242 77 92 -166
5584a66J2j16R5K61j44K97k45J31o4J22j69M7m1J09j54p2K34l54O7r3J16J93L2
$$ -166 -154 -270 -175 86 -58 239 -6 125 61 183 14 61 20 129 -25 -97 137 -217 -150 -243 -127 66 98
5607I8rJ12j25l04J80j63J19K75j5J08l91mR1j31J89J36k16J2n4N3j40L23q4R
$$ 98 89 201 76 -228 -48 -211 -92 183 168 276 -115 -119 -28 -159 30 166 -50 -38 -92 -39 -179 144 60 69
5631F9k96L19l10K17k50K47k06J74j01K42J02j43Q2k97K81pj19J35l13M07k16
$$ 69 -227 92 -218 -1 -251 -4 -210 -36 -137 105 207 64 146 -151 130 123 4 139 -174 233 17
5652A7k93M16l80L63k75J27J41m1j29L30k80p4N9J42M8l79j7J80J76n4j48K29
$$ 17 -276 140 -240 123 -152 -25 116 75 -54 276 -4 -78 -19 123 171 -208 -225 -45 131 77 -71 158
5674A58k46Q2r7N1K04k10Q8J2j58j17j18M36k88qK45L1j46M9l9J52K91o21R7R6
$$ 158 -88 -6 -103 -52 152 -58 30 42 -116 -233 -351 85 -203 -211 34 65 -81 -32 -71 81 372 -249 -152 -56
5698e6J2K79o06K63L52j46j27j44L15j72J35j74L0j3J72j89L48j59j70O6K00k55
$$ -56 -44 235 -371 -108 244 98 -29 -173 142 -30 105 -69 -39 -52 120 -69 279 120 -50 16 216 -39
5720c9k47O14l26j64K09j6K7j00n2Q6L7J09j5K59n12J57R1j14O4J28j1l20J06
$$ -39 -286 328 2 -162 47 31 58 -42 -94 -8 29 138 123 382 -130 27 118 4 68 196 185 -135 -29
5743b9p1Q7j0J18Rk66J31L1J30j10j04k25K80L7r1j74M69j77m2j69R1j07J01K61
$$ -29 -100 -13 -23 95 104 -162 -31 0 130 20 -84 -309 -29 8 -83 -257 212 35 -7 -176 -85 -192 -91 170
5767A70o9q6L6j58l3J92j33QJ8m1K20k9j29j05M89n00J4k6J9L02l74N8J44N2r6
$$ 170 101 15 51 -107 -140 52 -81 -73 -55 -96 124 95 -34 -139 350 -150 -136 -162 -143 159 -215 -157 -13 39 -57
5792e7K9p5J23J85l12N1J21J28j70L9j73J58K03l11L54k70K0j63M1j0j62M8K59
$$ -57 -28 -103 20 205 -107 -56 65 193 23 62 -111 47 250 -61 293 23 43 -120 -79 -89 -251 -203 56
5815E6L70k95j01Q8j53R3k84J2K40K20k18ok24J43K47k2l54K51m14J80M74k64
$$ 56 426 131 30 118 -35 58 -226 -214 26 246 28 22 -202 -59 188 166 -188 63 -351 -171 303 39
5837C9j10Q1Q8rj31J34l09M14l10j33K89k9L4nJ8k69J90L56k7m76K68l62K35J16
$$ 39 -71 10 98 89 -42 92 -217 197 -113 -246 43 14 48 43 61 -208 -18 338 311 -165 103 -259 -24 92
5861I2k32J58L2P0l52M1K59K2j41J49j14J23k52L37k14N8n7J77k89J1P7J67k01
$$ 92 -140 18 50 120 -232 -191 68 90 -51 98 -16 107 -145 192 -22 36 -21 156 -133 -122 -45 122 -79
5884g9q2L18l70J16J79M6j65p3J01K24m14K37J29J7j41k31M3J14p9J49J56k39
$$ -79 -161 157 -213 -97 82 128 -37 -110 -9 215 -199 38 167 184 43 -188 -145 -31 -110 39 195 -44
5906d4J91j6m4L7j1K8k06J61j37Q8o2jq6N4O9j73K93j89L7K10j94K39j81J39m7
$$ -44 147 131 87 124 113 141 -65 96 -41 47 -15 -16 -102 -48 21 -152 141 -48 -11 199 5 244 63 202 155
5931A55m53L45k79L22P6j38R2m1l2l21K34Q9r7k03Q0K25J38j64K7O3j25N0j41
$$ 155 -298 47 -232 90 166 28 120 79 47 -274 -40 49 -48 -251 -171 54 192 28 55 118 -7 43 -98
5954i8L52l74K81k79P2J66j6j58J52j17K54l17J30j19J93J1j05J05k49J75j38
$$ -98 254 -120 161 -118 -46 120 104 -54 98 -19 235 -82 48 -71 122 133 28 133 -116 59 -79
5975g9kj13J32J29m5k27j70K85K22j85k56K55P6k41J34j0j1p1J68P7j26N0J26
$$ -79 -81 -194 -62 67 22 -205 -375 -90 132 -53 -309 -54 22 -219 -85 -95 -106 -177 -9 68 -58 -8 118
5998A18k35L27j33o0o7J5J43Qk06Q7J1L0K2r2Q6p7O0K8l59N03k38L1k1K87q7n20
$$ 118 -117 210 77 17 -50 -35 108 116 -90 -3 8 38 60 -32 54 -23 37 65 -294 209 -29 2 -19 268 181 -339
6024c39N81j42l73K30J88j18m7J43n0l70J84O7J20l08O6M52k99j82L58j06l2l33
$$ -339 242 100 -273 -43 145 27 -20 123 73 -297 -113 -46 74 -234 -168 284 -15 -197 161 55 23 -310
6046c10L31J22j65Q7k75N18l79m4J12L0M4om6j92L92l74L28r6r8p1J86n0o2l1
$$ -310 21 143 -22 65 -210 308 -71 -115 -3 27 71 65 19 -173 219 -155 173 77 -21 -92 94 44 -18 -49
6070d9k73L41k37L92j68J38j84O0J87k46J07k99J49K77j95mP5J55l90L14Jr8L2
$$ -49 -322 19 -218 174 6 144 -40 20 207 -39 68 -231 -82 195 0 -4 71 226 -164 150 151 53 85
6093H5n1P0P9p5j60m10K62l7J26K11j72K52l74J89J94p2j64n0J92l57K19J01J49
$$ 85 34 104 183 108 -52 -462 -200 -237 -111 100 -72 180 -194 -5 189 117 -47 -97 95 -262 -43 58 207
6116B07Rk58q0QK57k03J06J00k27J50k12L10k27J31j01J28j71J28n2J64j40N4
$$ 207 216 -42 -122 -114 143 -60 46 146 -81 69 -143 167 -60 71 -30 98 -73 55 3 167 27 81
6138H1p3n4o3K41j1L8k89LJ42Q5l55K98j95L32N8l41K47l97K47j31K17j78q9Q4
$$ 81 8 -46 -109 132 121 159 -130 -127 15 100 -255 43 -152 180 238 -103 144 -253 -6 -137 80 -98 -187 -103
6162a03J50j51L31l40J47j98j23M26k12M26K5m57R1k8j10K23k3j12J05j72OK12
$$ -103 47 -104 227 -113 34 -164 -287 139 -73 353 378 -79 12 -16 -126 97 74 -38 67 -105 -99 113
6184A13j89M8j88M0J47k4LL04l12J71j15J61j18p1j4n8p4K70k19N9M3O6l8J17
$$ 113 -76 -28 -216 -176 -29 -53 -50 254 -58 113 -2 159 41 -30 -44 -102 -176 94 -125 -66 -23 43 5 122
6208A22j78L7k1n7M12k38k72J39j31N8K32j36N6j10K15q5k32J68Q1j28L1J27n00
$$ 122 -56 -19 -40 -97 315 77 -195 -56 -187 -129 103 -33 23 -87 128 43 -189 -21 60 -68 -37 90 -410
6231d10K52K6j01K71j70K55l31K21j52N7m0J88q4j08J46r1QJ41j93K96n7k6J24
$$ -410 -158 -132 -233 38 -132 123 -208 13 -139 -82 -122 66 -18 -126 20 -71 -63 78 -115 181 124 98 222
6254B22k72k2K89k64J32o6j98L29j28J39O1k55J04K92k18l16K02j9n7J29R1k43
$$ 222 -50 -72 217 -47 85 19 -179 150 22 161 222 -33 71 363 145 -171 31 12 -45 84 175 -68
6276f8rJ89j46J10k60J08QJ73r6J06q8n5j63J70n4q6j79M50n4RL77n40rK90l02
$$ -68 -77 112 -34 76 -184 -76 -68 105 9 115 27 -28 -191 -21 -75 -161 -340 110 56 65 442 -98 -107 183 -119
6301a19K82j97l9M13k21l2K29l09L49m18K78k24m3n8J62J32m41J62K24j93P5k56
$$ -119 163 -34 -73 340 119 87 316 7 356 -62 216 -8 -51 -109 53 185 -256 -94 130 -63 12 -244
6323b44K03K54j75j28Q5j49O3K63j98J33j31J17l20J93K25k27K67k50J02L7M7
$$ -244 -41 213 38 -90 -5 -154 -91 172 -26 107 -24 93 -227 -34 191 -36 231 -19 83 120 167
6344A67l06J79k95M81k8p5Q8n1J59l46J46j68J32l1L1k40K42r3lNj53K45L7l3
$$ 167 -139 40 -255 226 198 123 211 160 319 -27 119 -49 83 52 83 -157 85 -8 -11 -6 -159 86 123 90
6368I0l50J67j4K54j19O0J4L1M2l54L17k42M9L53l07M3K0j01j43J18j63K83P8
$$ 90 -260 -93 -107 147 28 88 102 133 175 -179 138 -104 -55 298 -9 34 54 -47 -190 -72 -235 48 126
6391A26j65l29N10k1J04J32k12M5j21M4k36L75l26J52k35N7m9j12J35K35k4J4
$$ 126 -39 -368 142 121 225 357 145 190 69 113 -123 252 -74 78 -157 -100 -149 -261 -126 109 85 99
6413I9j87M9J3o7K44q9j41R2k59P0J67k14J35J73j3j32J79k15Q2k24J16R1o3J06
$$ 99 -88 -39 -26 -93 151 62 -79 13 -246 -176 -9 -223 -88 85 72 -60 119 -96 -14 -238 -122 -31 -94 12
6437A2J96n12N20j13j94J15J81j66k21L20j54j0o4K09j97N8n9j93M85j13k02L6
$$ 12 208 -304 216 103 -91 24 205 39 -182 138 -16 -26 -90 119 -78 -20 -79 -272 213 100 -102 -66
6459f6L09j90k09L00r2K89k04m18N75j64l6k00K1Q9J44R3n46J43L65j70L03k67
$$ -66 243 53 -156 144 52 341 137 -281 294 130 94 -106 -85 4 148 241 -305 -162 203 33 336 69
6481F9N0J33m37R9J8K71k09O5j66J49L08n33J39PO6K27o40L26M0m4J6j38M9K61
$$ 69 119 252 -185 -86 -68 203 -6 59 -107 42 350 -183 -44 -37 29 256 -384 -58 -18 -62 -46 -184 -135 126
6505A26j56L3J36r7J03k78J75L00m20Q4K8o1j77J73M8p3J47j80J66p2K45k55l73
$$ 126 -30 3 139 42 145 -133 42 342 -78 6 34 -27 -204 -31 17 -56 91 -89 77 5 250 -5 -378
6528c78N25m4o2m4Jn9K03j91l2Q8Kr7K95k28j70mr2K27L8p1j04N1K02O6k11j72
$$ -378 147 103 41 -3 -2 -61 142 -49 -81 7 9 -88 207 -21 -191 -195 -287 -60 -22 -93 -197 -146 56 122 -89 -261
6554b61L16l33M71k45J13j16J21k1j65K38k01k55N18k8k03l5O6q7K08j74j69N87
$$ -261 55 -278 193 -52 61 -55 66 45 -120 118 -83 -338 180 152 -51 -86 -20 -107 101 -73 -242 345
6576C45j82l58J15J76J09m2k36j99L78k0j23Q4%j50j94J19J71ql4L96m89J55j26
$$ 345 163 -195 -80 96 205 163 -73 -272 106 86 -37 47 47 -103 -297 -178 -7 -15 -49 347 -142 13 -113
6599a13rP2j01J33M34n00M8R2r5M4J03l71K98J40j68J87N1N4j47o4J29k27l1J15
$$ -113 -122 -50 -151 -18 416 -84 -36 56 -39 5 108 -263 35 175 7 194 245 299 152 88 217 -10 -41 74
6623G4K84k28l02K53j55Q8R6K86j41j61k57LK37o8o7j27L90q4l32L6n0L81k59
$$ 74 358 130 -172 81 -74 14 110 396 255 94 -163 -160 77 9 -58 -185 205 121 -211 -175 -225 156 -103
6646a03P8J3k3k25K62J23k2K7j31JL8j77K32%J61k20L9j21L03k53k2K97m16R5
$$ -103 -25 -12 -35 -260 2 125 103 130 -1 0 38 -139 93 93 254 34 73 -48 255 2 -20 277 -139 -44
6670d4r4M47l27Q7J10l55k0L81n27M47j16k8J8k24L85l22q6J25j5K03l00K02J5
$$ -44 -138 309 -18 69 179 -176 -196 185 -342 105 -11 -39 -21 -245 140 -182 -268 -143 -158 45 -255 -53 -38
6693c8j28K8p5K30j36J68j7M0Lj60J25R2J17l50J62k08K30J4R6p7O6r5k59M15
$$ -38 -166 -138 -213 17 -119 49 32 72 75 -85 40 132 249 -101 61 -147 83 97 193 116 182 87 -172 243
6717B43m0r0K2j00j82L01Q3p0l97J29Q6L07n96N05n12K22J25J00j34r7r4J87j80
$$ 243 203 113 135 35 -147 154 237 167 -230 -101 -15 292 -304 201 -311 -89 36 136 2 -95 -189 -2 -182
6740a82M2R8r0L82l89O6J52k7R0k49K64j63J14k36J25j54L7K03n4P9j52M8J04
$$ -182 -140 -42 -132 250 -139 -73 79 52 142 -107 157 -6 108 -128 -3 -157 -120 83 29 108 -44 4 108
6763A08o0J65j22j63K79m62K30J45k64L8j3K95k68R3j21J26O0J01k55J70j82J06
$$ 108 48 213 91 -72 207 -255 -25 120 -144 -106 -119 176 -92 1 -120 6 66 167 -88 82 -100 6
6785Fp3o0J61pN3K47k91r4J68J20k78N8j02q4L2M00J67m47k44K91J68k91M33k32
$$ 6 -67 -127 34 27 80 327 36 -58 110 230 -48 10 -92 -176 -144 256 423 -24 -268 23 191 -100 333 101
6809A01K05o13K47j96J06K43J38l77J30K42k24k97M44p5k75J23r8J25J93j51J40
$$ 101 306 -307 -60 -256 -150 93 231 -146 -16 226 2 -295 149 74 -201 -78 -176 -51 142 -9 131
6830A31oj87J05j42P5Qr0N9k2L03p3k49M4n4N0M1j64L18k4J89m00n7J70k49J03
$$ 131 125 -62 43 -99 -24 -16 -106 -47 -69 234 161 -88 -44 -98 -48 -7 -171 147 123 312 -88 -145 25 -224 -121
6855a21K12j03j08L7n2J11L53l62k10M4L24j69m6P5n2j54J45l6P7J28j29J34k46
$$ -121 91 -12 -120 -83 -135 -24 329 -33 -243 -199 125 -44 -90 -15 -67 -221 -76 -112 -35 93 -36 98 -148
6878a48N29k37k15K35m60L06R7p5j00N6J73j07K47k81K16j76J82j13k30J78J70
$$ -148 381 144 -71 164 -296 10 107 32 -68 -12 161 54 301 20 236 60 242 129 -101 77 247
6899B47n34N28l05j73j2K28O5l48L45K41l92j5K70j38PmO0j18J44p9j80O9K47
$$ 247 -287 241 -64 -237 -249 -21 44 -304 41 282 -110 -125 145 7 14 10 70 -48 96 17 -163 -94 153
6922A53j98J50l08L7lO11n46L22l28J38J08n6k37K08Q4l03K84rj50J64j09j70
$$ 153 -45 105 -203 -166 -169 442 -104 218 -110 28 136 80 -157 51 135 -168 116 107 -43 121 12 -158
6944a58M32k31Lk80K54m1k99M82Q8j60p5j47L34k80kK50n1j11n5n5j11L25k46
$$ -158 274 43 46 -234 20 -21 -320 162 250 90 15 -132 202 -78 -80 170 119 8 -47 -102 -213 112 -134
6967a34M1K10j65M39k91l76M67l08L15k62L31j82k74J05M4M4l9P4J71j42j34J71
$$ -134 -93 117 -48 391 100 -276 191 -117 198 -64 267 85 -189 -84 -40 4 -35 39 210 68 -66 105
6989A05k46o5K12L23l76J17k01L48j9k87j61K04J60j17oq9N0R2j16J02P5n9K4
$$ 105 -141 -206 6 329 -47 70 -131 217 198 -89 -250 -46 114 -3 -9 -98 -48 44 -72 30 105 46 70
7012G0k60L06k44J67p4P0m1o4N3J4L7J97j35j1K5l19K50JQ6J37j17j09l5j08K08
$$ 70 -190 116 -128 39 -35 35 -6 -70 -17 -3 34 231 96 85 110 -209 41 42 128 265 148 39 4 -104 104
7037A04k18K43j37j44R3j7O4J30j9j95o6P0J58o1l40L32J46l67L62k13J87J88
$$ 104 -114 129 -8 -152 -59 -76 -12 118 99 -96 -162 -92 66 5 -335 -3 143 -224 138 -75 112 300
7059C00j72j31roQ2Qj88K24j71K46o5Ol79K40n3L48m58K80j93P5K3j48J46J66
$$ 300 128 -3 -12 -18 64 72 -116 108 -63 183 118 124 -255 -15 -68 280 -178 102 -91 -16 7 -141 5 171
7083A71K9q8j56o8L2M3N2J17O8j32J50k76K02j1l63K14j70K49k5Q7l05P4J07J05
$$ 171 200 112 -44 -112 -80 -37 15 132 200 68 218 -58 144 133 -230 -16 -186 63 38 125 -180 -106 1 106
7107A06N9n32K17j08K31L2j22j19M28j27p4J51k57J2M6K9j13J93J2j16K3j49J52
$$ 106 165 -367 -150 -258 -27 5 -117 -236 192 65 -9 142 -115 -103 -57 -28 -141 52 64 -52 -29 -178 -26
7130b6N5L4K6N2p5QL9j28J85k96J58m79M48k25J73K81m22QL28m3p2l1M7R1j19
$$ -26 29 63 89 141 66 74 113 -15 170 -126 32 -447 1 -224 -51 230 -192 -184 144 101 29 -2 45 136 17
7155A7j46j30L08m2j38J69J15k10J25p7Q1J09j07j24j06n9K58lK99l18R4Km8q1
$$ 17 -129 -259 49 7 -131 38 153 -57 68 -9 72 181 74 -50 -156 -215 43 40 339 21 115 117 69 -12
7179a2J6j04j8K83j24j03L38n40L49J13j97J20P6j48j12N8j06p7P3kJ09J46n58
$$ -12 4 -100 -118 165 41 -62 276 -264 85 198 1 121 197 49 -63 -5 -111 -188 -115 -117 -8 138 -420
7202d20N55j53j0q9J06j28l2p7k9M19p2j30q9K76l04J44J64k22N2j48J45J64o4
$$ -420 135 -18 -28 -117 -11 -139 -171 -248 -277 142 70 -60 -149 127 -177 -33 131 -91 -39 -187 -42 122 58
7225E8j27J69q6o7M97l77R2m7O5n33O32l04O5L0k36j38P0K62m25K10K08j82L28
$$ 58 -69 100 14 -53 444 67 159 112 177 -356 276 -28 37 67 -169 -307 -237 25 -400 -190 18 -164 164
7248A64J7mk96l9kJ31L8J24L06l57l69L13p8J53j51Q8p0j05L16j37l6M1k67M09
$$ 164 181 177 -119 -158 -160 -29 9 133 439 82 -287 26 -52 101 -50 38 -32 -137 179 42 6 47 -220 189
7272A89j23j5n1J20K9L9l69K42Q6O5j35jk40L75n2k80J22R4q1l28J88JL7K76j35
$$ 189 66 51 0 120 149 188 -181 61 147 212 77 76 -164 211 159 -121 1 95 14 -314 -126 -125 -88 188 53
7297E3k44J76k1j85L4K90j69k8j8K92k31K60l4M3j83J41J76k79j7P6j02rJ15m2
$$ 53 -191 -15 -36 -221 -187 103 -66 -94 -112 180 -51 209 175 218 35 176 352 73 56 132 30 21 136 94
7321I4m31K00J75j56K82m82M70k19Rl74L54R2j90L13K09k15k32j15K02k7L1O8
$$ 94 -337 -137 38 -118 164 -318 152 -67 -58 -432 -78 14 -176 137 346 131 -101 -216 -14 -41 -10 58
7343E8j16K8j38K35M8r1j17L8n7O2J9k44K35N8R0k9k4J58k36l07M10L8j10j6J95
$$ 58 -58 -30 -168 67 115 24 -93 -55 -112 -50 -31 -275 -40 18 108 79 55 213 -23 -330 80 118 8 -8 187
7368A87k62j22K48j55Q9k5qjj79K20j31K68l06J40L03m04QL57j83O3q2k18K42
$$ 187 -75 -197 51 -104 -15 -40 -48 -49 -228 -8 -139 129 -177 -37 266 -138 -130 227 44 107 25 -193 49
7391D9j40N9n4J0J57J1j71P4R7j65m7J2J80j18M0J20mj80k47M39j54K42J72n52
$$ 49 -91 -32 -86 -76 81 92 -79 -5 92 -73 -120 -108 72 -46 -6 114 110 -70 -317 122 -32 210 382 -170
7415a70K4J30J11l12K38Nl2o1P9n3O3k9k4l7P5k43K43J28j52P6l98K81J19J18
$$ -170 -146 -16 95 -217 21 26 -6 -67 12 -41 22 -7 -31 -68 7 -236 7 135 -17 59 -339 -58 61 179
7439A79k95J53j48m4r1j61K28L55l64J16K68k10j9J72P9n6j73L40l87M6K42K2
$$ 179 -116 37 -111 -155 -246 -407 -179 176 -188 -72 196 -14 -33 139 218 162 -11 329 -58 -12 230 252
7461B52l83L09q2J94m10Q0j08K02q5R2L6N9j38J49r5k17R8K15M2j77l17J05J15
$$ 252 -131 178 96 290 -120 -40 -148 54 -31 61 97 156 18 167 72 -145 -47 168 210 33 -284 -179 -64
7484f4K12k31K02L0k75N1J33l5L7lk86K60K20l04J44L1l13L8l6K31R8k62n6K31
$$ -64 148 -83 119 149 -126 -75 58 23 60 57 -229 31 251 -53 91 122 -191 -153 -189 42 140 -122 -178 53
7508E3K1O2L7j59l35M19J93M1k43m5k06K43j71Q5j27K04n9J02j43K79k31j9Q0
$$ 53 74 136 173 14 -321 98 291 332 89 44 -162 81 -90 -5 -132 72 13 115 -28 251 20 1 81
7531H1j97J54j1J42k08J92m72N43P2k25j33J02n2O6Q1J9k57K15l04L43j79j6K30
$$ 81 -116 38 27 169 -39 153 -319 224 296 71 -62 40 -12 54 135 154 -103 112 -192 151 -28 -44 186
7554A86k68p9P2J95l20K95rk1L9j47q0KK15j11K8p5N9r9L29l67m0O1L8N6J80j04
$$ 186 -82 -161 -89 106 -214 81 72 51 90 -57 -137 -135 80 -31 -3 -78 -19 -118 211 -156 -196 -135 -97 -41 139 35
7580C5j66J9O2J70k05L26l05N8K7K9j86mK91l60M22j64o0lj39J09k61J89r5L02
$$ 35 -131 -112 -50 120 -85 241 -64 -6 21 50 -136 -140 151 -209 213 49 -11 -14 -153 -44 -305 -116 -211 91
7604I1m9j87m20O81Rn0j16J98L18n03k25Q1J80q6O2j55J55j30J52N8k48M48k75
$$ 91 42 -145 -565 116 125 75 -41 157 475 -28 -253 -172 8 -78 -16 -171 -16 -146 6 64 -184 264 -11
7627a1J48m03L81j57J00J17k27L5j12J00j45O6j23L0L80l6M9Q8m71K61j2k3qj85
$$ -11 137 -266 115 -42 58 175 -52 -17 -129 -29 -174 -108 -231 -201 179 143 192 280 -191 70 58 35 27 -158
7651a58l6J19K31J31k90k1j65o4M11j76K34q2qm6k90J71R6q0O4j45J55r2J30P7
$$ -158 -194 -75 156 287 -3 -24 -189 -253 158 -18 216 134 126 80 -210 -39 57 -23 41 -104 51 -41 89 166
7675A66j69j71J16l3N3j34J70j00P4Q6j51J63k24M8R0M24n31K14r4oJ77l0j79
$$ 166 -3 -174 -58 -91 -38 -172 -2 -102 -28 58 -93 70 -154 -106 -16 408 -123 91 -3 -9 168 138 -41
7698d1L20l45MRk25K95j71J13j27K79j57l18L66p3rK14nl76K92J7j3j80J15oL4
$$ -41 279 -66 -62 -53 -278 17 -154 -41 -168 111 -46 -364 2 -71 -80 134 129 -247 45 62 49 -131 -16 -22 12
7723A2l21L78r2J22j50n2K75j43N0K03m58K14O1m55L50N4K96n27M7K80pp7n7J41
$$ 12 -309 69 -23 99 -51 -103 172 29 79 282 -176 38 99 -356 -6 48 344 -183 -136 144 137 60 3 144
7747A44k85j06P5kJ67j73K06j56K09j44J26O5k09J66N8n1r6R6k23K50k52NO5Q0
$$ 144 -141 -247 -172 -174 -7 -180 26 -130 79 -65 61 126 -83 83 141 90 -6 90 -133 117 -135 -130 -65 15
7771A5j39r8J71R0j27L82j36p8J64Rq1j75J6k30O5K82Q7k45J39mK93m52K58k51
$$ 15 -124 -222 -51 39 -88 294 158 80 244 253 172 -3 13 -217 -152 130 217 -28 111 107 400 -52 206 -45
7795d5Q8J23j69P4K3K10l97J12J0N6l1J2k81L37j68R8k07L90j31q9J38j68K74
$$ -45 43 166 -3 71 94 304 -93 19 29 85 54 66 -215 122 -46 52 -155 235 104 15 153 -15 259
7818B59m05P0J56L6l24L49Q2k53M3m0k05K64M9k63L85k32K94j17j98o0M3j45K5
$$ 259 -146 -76 80 116 -208 141 223 -30 13 -27 -232 32 81 -182 203 -29 265 148 -50 -110 -67 -212 -187
7841a87J47J4N5q8J26j29P5k06K55P6o2j87l6K73j16l54M15k30q5J2K59l20L13
$$ -187 -40 -26 29 -59 67 -62 13 -193 62 138 76 -111 -147 126 10 -344 71 -159 -244 -232 27 -293 20
7864B0j50P3n9K12j83R9R6J06j86j08k1q8J12J72j52P7l9o4O0k67M52j07j05J92
$$ 20 -130 -57 -116 96 -87 12 108 214 28 -80 -101 -189 -77 95 -57 20 -19 -83 -23 -290 162 55 -50 142
7888A42k46R3n0KL3o3r9O5K63K0J9k83L27k55m8j9n5L47m61O32l31L5j73p4L5
$$ 142 -104 -11 -61 -59 -26 -89 -188 -123 140 160 179 -104 223 -32 -80 -99 -154 193 -268 364 33 68 -105 -179 -144
7913a44K50o3K39m22K68N1k66r6J61r1K9K8K86j36m1j39J70j13J03m5M8j69l3
$$ -144 106 43 282 -140 128 179 -87 -183 -22 -113 -84 -56 230 94 53 -86 84 -29 74 29 77 -92 -125
7936a25J44J10j43L2R7j36R9j82R5j52J15JK69k81j32M28q3l92j8J43K19k4M1
$$ -125 19 129 -14 18 115 -21 78 -104 -9 -161 -46 -45 224 -57 -189 239 156 -236 -254 -111 108 84 125
7959A25k50O9K30m64Q2R0K43o5Q2l1L3Lk35r0J77j57P1k9M5j21M36k29l30N27
$$ 125 -125 -56 174 -290 -208 -118 125 60 142 111 144 147 -88 -178 -1 -158 -87 -116 -71 -192 244 15 -315 212
7983B12k16N0k54K86j78J12k38j4K67n9K13j72P6J98j75l25J45K6J27p5J72R7
$$ 212 -4 46 -208 78 -100 12 -226 -240 27 -32 181 9 85 283 108 -217 -72 -46 81 6 178 275
8005B75m17K61j04N1j61K57l0p9N0r7K12o4p3%q3K33l13J01O3m4R8r1L00l82j15
$$ 275 -142 119 15 66 -95 162 132 53 103 6 218 154 81 81 -2 231 -82 19 82 38 136 45 345 -37 -152
8030a52K50L9j81J25o0l9L0n1j16l7J01mJ91l8J29l9k50K48J47k36q1J05r0L9
$$ -152 98 137 -44 81 21 -18 12 -39 -155 -192 -91 -95 96 58 187 148 -102 146 293 57 -24 81 -9 30
8054C0M4j32n7j86J07J59K53k08J20J69j35k97j4n4M3k1k2L00J01p1m96L87p2
$$ 30 74 -58 -115 -301 -194 -35 218 10 130 299 164 -133 -147 -201 -158 -179 -201 99 200 129 -367 20 -52
8077e2K39q7j45j03J44Pj4J44l01J26J51j08J57L9m06N17n07M6K78J10j13j59
$$ -52 187 100 -45 -148 -4 3 -11 133 -168 -42 109 1 158 197 -209 308 -199 -153 125 235 122 -37
8099c7j19L26l1J61l5m36j79K39K99j55O5j67M0j72J20m7j50M40j66j20J81j1
$$ -37 -156 170 139 300 265 -171 -350 -111 188 33 98 -69 -29 -201 -81 -128 -278 162 -4 -124 57 46
8121D6j28nN2q1J60j15J57o1j21l1O7L02k92j13M1Q7R2N6L3J58k87j41R8J08j00
$$ 46 -82 -87 -35 -116 44 -71 86 25 -96 -127 -60 242 -50 -163 -122 -35 57 113 146 304 17 -124 -26 82 -18
8146a8J24m8l0q1oj24L99k63j31L64k55j19J01K05pk9k87M49q7r9M1j13j58LM8
$$ -18 106 58 28 -53 -59 -183 216 -47 -178 186 -69 -188 -87 118 111 82 -205 244 157 58 99 -14 -172 -169 -121
8171a21Q9j2K34j97N8j69M1Q5J82q1k76J68l6j17J34J95j85j23J31k
$$ -121 -32 -44 190 -7 51 -118 -77 8 190 109 -167 1 -35 -152 -18 177 -8 -131 0 -2
8191b
$$ Imaginary data points
##PAGE= N=2
##DATA TABLE= (X++(I..I)), XYDATA
0@%%%%%%%%%%%%Lj1J6j6J6k4L2l2M0m8N6p1Q0q9J05j23J45j68J93k22K49k82L20
$$ 0 0 0 0 0 0 0 0 0 0 0 0 0 3 -8 8 -8 8 -16 16 -16 24 -24 32 -39 41 -48 57 -66 79 -89 104 -118 131 -151 169
35A69l61M08m56N09n68O32p03P80q68R64j061J169j290J422j568J730j906K099
$$ 169 -192 216 -240 269 -299 333 -370 410 -458 506 -555 614 -676 746 -822 908 -998 1101
53A101k317K558k828L135l486L892m367M931n616O472p570R033j1103J4276j9802
$$ 1101 -1216 1342 -1486 1649 -1837 2055 -2312 2619 -2997 3475 -4095 4938 -6165 8111 -11691
68a1691L2152j14079N0077J64749j51710k9782J32220K0993j36207k1702N2907
$$ -11691 20461 -93618 -43541 121208 -30502 -60284 71936 92929 -43278 -64980 -12073
79a2073K6998j6431j2177J6365O6395q213r6608l1652P8393J2005p0063L340J02281
$$ -12073 14925 -1506 -13683 2682 69077 60864 -35744 -67396 10997 23002 -47061 -43721 58560
92E8560J4768j10994l8996J09367K2944j22572m968J42029k446j19692K8981R2869
$$ 58560 73328 -37666 -76662 32705 55649 -66923 -71891 70138 67692 -52000 -23019 69850
104F9850n1625p2777L6794L8488m725l730k9582q758O0029n053r2998K4913J08592
$$ 69850 18225 -54552 -17758 20730 16005 12275 -17307 -26065 33964 28911 -64087 -39174 69418
117F9418n0267j08484P4891J06946p8773r1308P5837P4218p0378o1534O3789N4513
$$ 69418 19151 -89333 -14442 92504 13731 -77577 -1740 72478 2100 -59434 4355 58868
129E8868n6091m9839M4373M3840l0705m1790N812L1325J5017k9449k9499M3410
$$ 58868 2777 -47062 -2689 41151 10446 -31344 -25532 5793 20810 -8639 -38138 5272
141E272M6790o1313n6181Q2801N8423r7564m9423J06231L5824j02036j7440R1398
$$ 5272 52062 -9251 -65432 17369 75792 -21772 -71195 35036 70860 -31176 -48616 42782
153D2782j795q2594L485O2388L99m0290r258J9825K2151l430l7269k812N4457
$$ 42782 40987 -41607 -38122 24266 24665 -15625 -24883 -5058 17093 13663 -23606 -26418 28039
166B8039K801p0012P588R0132j4396r8758K0819R4087l2208q6685L9619P3240
$$ 28039 30840 -39172 -31584 58548 44152 -54606 -33787 60300 28092 -58593 -18974 54266
178E4266m3645o2380L9736N2351l2189m5746J7259L7903k62k5242q510K4031K1415
$$ 54266 10621 -51759 -12023 40328 8139 -37607 -20348 17555 17293 -7949 -16459 7572 28987
191B8987k7193l6733L3903N2813m5560o3551N7918O6300p1806o1514P7734M2013
$$ 28987 1794 -34939 -1036 51777 6217 -57334 584 66884 -4922 -66436 11298 53311
203E3311q3629k4336Q1668J3605o4033o887M0549Q318j6634j4054K189K8903O632
$$ 53311 -30318 -54654 27014 40619 -23414 -30301 10248 18566 1932 -12122 -9933 18970 25602
216B5602m2212o956N4120J683o6781l985P0822M106p1085k711O9866l896p1626
$$ 25602 -16610 -23566 30554 32237 -34544 -38529 32293 36399 -34686 -37397 32469 28573 -43053
229d3053J1789P2484j6263o5557K2270N4942k0993l4535J4615J5785l265m703
$$ -43053 -31264 41220 24957 -40600 -18330 36612 15619 -18916 -4301 11484 8219 3516
241C516j5052L021L4150j2153n4504K2497O3832l5800o2954M5231N4272n0182
$$ 3516 -11536 -8515 25635 13482 -41022 -18525 45307 9507 -53447 -8216 46056 -4126
253d126m1474N4101L5573n0255l0247M2738K8366l2546k4679K3022J9869j5242
$$ -4126 -45600 8501 44074 -6181 -36428 6310 34676 2130 -22549 473 20342 5100
265E100j8111M213J7808M709k6633j8051L7935K9647m8815l2328N9785K6553o6329
$$ 5100 -13011 -8798 9010 13719 -12914 -30965 6970 36617 -12198 -44526 15259 41812 -24517
278b4517j3617P1556L079o6986N487N7449p456m4863K553K8862J671j9704q092
$$ -24517 -38134 33422 36501 -30485 -24998 32451 24995 -19868 -17315 11547 13218 -6486 -14578
291a4578J4674J4700j4213k5283J2130L5646q046m2585Q584N1477j0565n5997
$$ -14578 96 14796 583 -24700 -12570 23076 15030 -27555 -18971 32506 21941 -34056
303c4056J9370N8185l0366n6935M0099M9496m2869l9167L6594K1865k7363j1562
$$ -34056 -14686 43499 13133 -43802 -3703 45793 2924 -36243 351 22216 -5147 -16709
315a6709J4024R058k83j4203j0729K4411K0724l2589k3494L9161K4067m0073k0569
$$ -16709 -2685 6373 6090 -8113 -18842 5569 26293 -6296 -29790 9371 33438 -6635 -27204
328b7204M0745J8252m4299j9023M6507J8047m9065j7456M6679J0325m1778j735
$$ -27204 13541 31793 -12506 -31529 14978 33025 -16040 -33496 13183 23508 -18270 -20005
340b0005L2818l338j9670K689Q008Q590M988k3143j1407L9261J0401n0362j647
$$ -20005 12813 9475 -10195 -7506 502 9092 14080 -9063 -20470 18791 29192 -21170 -22817
353b2817N4292j2763n4441K1733M8520k6032m1420K1923L3088j5642k5919J0478
$$ -22817 31475 18712 -35729 -13996 34524 8492 -32928 -11005 22083 6441 -19478 -9000
365i000K3398o336k1103M834K2547m3k0166o412J5658J4728j2814k4483J3629
$$ -9000 14398 8062 -13041 -8207 14340 14297 -5869 -12281 3377 18105 5291 -19192 -5563
378e563L0149k2098l5417L2154L5176m2704l0962M7639K2168m3544r501L6106
$$ -5563 24586 2488 -32929 -775 34401 -8303 -39265 8374 30542 -13002 -22503 13603
390A3603J896k4853J238J4913L321m651j2224m170K1727O775k9384q666L2838
$$ 13603 15499 -9354 -8116 6797 10118 5467 -6757 -10927 10800 17575 -11809 -20475 12363
403A2363M868l5840k084L9347q08m1090J687M2671j304l9341M422L5829o446l0348
$$ 12363 17231 -18609 -20693 18654 17846 -23244 -21557 21114 19810 -19531 -15109 20720 14274 -16074
417a6074R031K4349q301j9591J983J2982O111q835j6147N260K3162p611k8806
$$ -16074 -7043 17306 9005 -10586 -8603 4379 10490 1655 -14492 -9232 13930 6319 -22487
430b2487J4702L3896k1731l5308K9092L4257l1442k8212L2318K0463k9862j2299
$$ -22487 -7785 26111 4380 -30928 -1836 32421 979 -27233 5085 25548 -4314 -16613
442a6613K4812O581j8919q197R758J0176j130j4489o235J9022Q671k2839p482
$$ -16613 8199 14780 -4139 -12336 -2578 7598 6468 -8021 -14256 4766 13437 -9402 -16884
455a6884K7618O598k9864n415L3427O859l3971p528L3009N513l2552j935L1452
$$ -16884 10734 17332 -12532 -17947 15480 22339 -11632 -19160 13849 19362 -13190 -15125 16327
468A6327l816k9703N324K2858n079j3816J018M054O980L395j5440k780K5891k530
$$ 16327 12511 -17192 -11868 10990 5911 -7905 -6887 -2833 4147 7542 -7898 -10678 15213 12683
482A2683l2963J1644L6920j9186l4893K3121K6722k3514j9244J9587J2602j5713
$$ 12683 -20280 -8636 28284 9098 -25795 -2674 24048 534 -18710 877 13479 -2234
494b234j2098R935J4136m161j6953J271J8145J520j5457j525J3596M891j2909
$$ -2234 -14332 -4397 9739 5578 -11375 -10104 8041 9561 -5896 -7421 6175 11066 -1843
507a843j0573J5894J7544k2664k2468K8224K1161l4466j5531L6728N302l5733
$$ -1843 -12416 3478 21022 -1642 -24110 4114 25275 -9191 -24722 12006 17308 -18425
519a8425L609K9657o815j8164M787P543L010J279j0734k847J8038j01k4291N601
$$ -18425 -14816 14841 8026 -10138 -5351 2192 5202 6481 -4253 -7100 10938 10837 -13454 -7853
533g853K5975r934k7316J0396K4740r072k3410O967K2838p157k2923R528K4793
$$ -7853 18122 8188 -19128 -8732 16008 6936 -16474 -9507 13331 6174 -16749 -7221 17572
546A7572j1461k2137J2115J8295j0155r996M974M182J408k841j0435O160J6922
$$ 17572 6111 -16026 -3911 14384 4229 -5767 -793 3389 4797 1956 -8479 -2319 14603
559A4603j3997k2831K1062K2964k5874j8541K8127J2341k7188n773K5498L865
$$ 14603 606 -22225 -1163 21801 -4073 -22614 5513 17854 -9334 -15107 10391 14256
571A4256k0815l785J5710O084j0711q094O514P974m715r637K105J1658p36j6037
$$ 14256 -6559 -10344 5366 11450 739 -7355 -841 7133 2418 -7219 -5114 6544 5808 -10229
585a0229k198K0733M374k4540k985K7330L14k6665N272K6046q845k3572J0078
$$ -10229 -12427 8306 12680 -11860 -14845 12485 12799 -13866 -8594 17452 8607 -14965 -4887
598d887J9570r004j3930M089Q576j455n693l453M879P430o274j2160R240J6733
$$ -4887 14683 5679 -8251 -4162 4414 2959 -2734 -6187 -1308 6122 -152 -12312 -3072 13661
612A3661j0339j9157J3069J9912j4619j7787J7850J5469k0202j3039J9606J0058
$$ 13661 3322 -15835 -2766 17146 2527 -15260 2590 18059 -2143 -15182 4424 14482
624A4482j7345q247J1234N639o586m763K091O773P46j0194k499J5091N572j7870
$$ 14482 -2863 -11110 124 5763 -823 -5586 -3495 3278 4024 -6170 -8669 6422 11994 -5876
638e876o319J9734O786k0528n008K1489K719k4099q51K3712j244k2450K019J7714
$$ -5876 -12195 7539 14325 -6203 -11211 10278 12997 -11102 -11953 11759 10515 -11935 -9916 7798
652G798l081j2053K681P621k4l380m587L171J1496l281j6667M890K0062p816k0396
$$ 7798 4717 -7336 -4655 2966 2942 -438 -5025 -1854 9642 6361 -10306 -5416 14646 6830 -13566
667a3566J0465J8098j4115j7059J5172J5262j4750j4149J2894J2053j0144r504
$$ -13566 -3101 14997 882 -16177 -1005 14257 -493 -14642 -1748 10305 161 -9343
679i343Q556P977o133o069L790O987Q37q262o417J0572R635j3594j1245J5932
$$ -9343 -787 7190 1057 -5012 -1222 5765 6602 -1660 -8077 2495 12130 -1464 -12709 3223
693C223R485k0114p010K2229L482k1895j448J9908M64j4802L33J1638j51p829
$$ 3223 12708 -7406 -14416 7813 11295 -10600 -12048 7860 8324 -6478 -6145 5493 5342 -2487
707b487p50N913L961m792p667K075J0556o87j3899j97J5675j764j8396N022K0314
$$ -2487 -3237 2676 6637 1845 -5822 -3747 6809 6122 -7777 -7974 7701 5937 -12459 -7437 12877
722A2877q050j9914J0455J8451j0495j3557R794R381p445o277M300N586r38p266
$$ 12877 4827 -15087 -4632 13819 3324 -10233 -439 8942 1497 -4780 -480 5106 4168 -3098
736c098l504Q095O400r733q415R777R208j0631r331J2652J0537j4908j0506J7401
$$ -3098 -6602 1493 7893 -1840 -10255 -478 8730 -1901 -11232 1420 11957 -2951 -13457 3944
750C944J0675j7746q435J7864M323j5689q79J2018j701p577o34J785M387K525
$$ 3944 14619 -3127 -11562 6302 10625 -5064 -5943 6075 4374 -3203 -3837 -2052 2335 4860
764D860r956l867J3795K970j6317P74J8198l755j7256N686J6532m820j4849K898
$$ 4860 -5096 -8963 4832 7802 -8515 -7741 10457 6702 -10554 -4868 11664 6844 -8005 -5107
778e107J3387k755j2457K481J1374l416j1809L078R893k159o031p38L024N850
$$ -5107 8280 5525 -6932 -4451 6923 3507 -8302 -5224 4669 2510 -3521 -4259 -1235 4615
792D615j336r661L637J3465p638j5743J3343J5722j7294j3062J7303Q022j5983
$$ 4615 3279 -6382 -2745 10720 3082 -12661 682 16404 -890 -13952 3351 11373 -4610
805d610l753J1887J276q407j905M879M631j396p733L35R970M46r459j50R634L31
$$ -4610 -8363 3524 4800 -3607 -5512 -633 3998 2602 -5131 -4796 5174 5620 -3839 -3989 5645 5976
821E976j0326j600J1699L009j4396m663J5778L738j7105q37J5927k757j3786N584
$$ 5976 -4350 -5950 5749 8758 -5638 -10301 5477 9215 -7890 -8727 7200 4443 -9343 -3759
835c759J0670m553o059J966K519K375L62o628j58J0224k708j2569N664J3270q945
$$ -3759 6911 2358 -3701 -1735 784 3159 3521 -3107 -3265 6959 4251 -8318 -2654 10616 1671
850A671j3639R717J1829r202j0289Q969Q097p632p270P236Q030n740p757M599
$$ 1671 -11968 -2251 9578 376 -9913 -944 7153 -479 -7749 -513 7517 1777 -5980 -1381
864a381P036j924n707p94N075J954n805m375P371O185j0889p939J3156P901j4214
$$ -1381 5655 3731 -1976 -2770 2305 4259 -1546 -5921 1450 7635 -3254 -11193 1963 9864 -4350
879d350o330J5332L535j3943m22J3322j149j0461P25P374O86m035k843Q53M939
$$ -4350 -10680 4652 8187 -5756 -6178 7144 5995 -4466 -3741 3633 4319 284 -2559 -1706 3233
894C233o55p475R08R951k895j2107M464J2944n108j1616N266J1015n384r345N889
$$ 3233 2578 -4897 -3989 5962 3067 -9040 -4576 8368 3260 -8356 -3090 7925 2541 -6804 -915
909i15R009n991q763N184Q086l864p233K298M638r35l743o29K873L493m052o634
$$ -915 8094 2103 -6660 -1476 6610 2746 -4487 -2189 2449 1514 -2229 -2858 15 3508 -544 -7178
925g178O808R367q731r881J1182Q934j2995n287J3009K189j2303l79R014J45n401
$$ -7178 -370 8997 266 -9615 1567 10501 -2494 -7781 5228 7417 -4886 -5265 3749 3894 -1507
940a507k215K052L699n56n336M88P080j467p393K180Q780j009r434L71R738O7
$$ -1507 -3722 -1670 2029 1473 -3863 -3375 3705 2238 -5155 -2975 5805 4796 -4638 -4267 5471 5538
956E538r978K46J0296j531j1866K926J1663m697r761M575O182l375k596J322O65
$$ 5538 -4440 -4194 6102 4571 -7295 -4369 7294 2597 -7164 -2589 3593 218 -2378 -1056 -391
971c91K587r11n451L086Q509n190r970P531R346r195p266Q776M959q941l789P494
$$ -391 2196 1285 -4166 -1080 7429 2239 -7731 -200 9146 -49 -7315 1461 6420 -2521 -6310 1184
987A184L972o664m758N697M806l955m160L651L629k532k861J387L446J053n263
$$ 1184 5156 -1508 -6266 -569 4237 282 -3878 -227 3402 870 -1991 -604 2842 3895 -1368
1002a368l379O967M364r655m112J1101J466j2086R38J1651k293j0459L331Q174
$$ -1368 -4747 2220 6584 -3071 -7183 3918 5384 -6702 -5764 5887 3594 -6865 -3534 4640
1016D640k345m677R84L088P76k538j825K675L609l360o023L465O681l244p728
$$ 4640 2295 -2382 -1398 1690 2466 -72 -1897 778 4387 1027 -4996 -1531 5150 1906 -5822
1031e822L200P710m181p972N835P882o852p183P988O154o563m160N147K203l550
$$ -5822 -2622 5088 907 -7065 -1230 6652 -200 -7383 605 6759 196 -3964 1183 3386 -164
1046a64j004J225J740L0l429k277M857L293o016m328P320L387p429k271Q384J911
$$ -164 -1168 57 1797 1827 -1602 -3879 978 4271 -1745 -6073 1247 4634 -2795 -5066 3318 5229
1062E229q662j401Q943J574q377n79O623m37m802N04L132l33k204j891Q42M155
$$ 5229 -3433 -4834 4109 5683 -2694 -3273 3350 2913 -1889 -1385 1747 1414 -790 -2681 -1839 2316
1078B316J6o383K94P547q23q158K746Q589m045p396M105P679m729o286L529M939
$$ 2316 2332 -4051 -3757 3790 2967 -5191 -2445 6144 2099 -5297 -1192 6487 1758 -4528 -999 3940
1094C940l115l865K109L243j929l603J270L106J216k990l060L570M245l537m814
$$ 3940 825 -3040 -931 2312 383 -3220 -1950 1156 2372 -618 -3678 -108 4137 600 -4214
1109d214N077N253p456m267Q446L694r027l141Q071J635p075j48M844p4l671q58
$$ -4214 863 6116 -1340 -5607 2839 6533 -2494 -5635 2436 4071 -3004 -3152 1692 1618 -2053 -2911
1125b911L053K229j508l440P39M525M13n331K7N851m32p015J450P282j773q250
$$ -2911 142 2371 863 -2577 -1838 2687 3100 -2231 -2204 3647 3215 -3800 -2350 4932 3159 -5091
1141e091K078P451k648o713L235M965k903m110K745L569j231k105j076K468K502
$$ -5091 -3013 4438 1790 -4923 -1688 3277 374 -3736 -991 2578 1347 -758 -1834 634 3136
1156C136k199l457K231M392l738n107M571N112n594n902O995M508o402l626O337
$$ 3136 937 -2520 -289 4103 365 -4742 -171 4941 -653 -6555 440 4948 -1454 -5080 1257
1171A257K052n757j00M333Q29k504j616Q62K630M85l833j087M503P98n471j70
$$ 1257 3309 -2448 -2548 1785 2614 110 -1506 -644 1986 2471 -1362 -2449 2054 2852 -2619 -2789
1187b789N673n52o512L40O888P4o584K67O137k14o069J572N753j547n193J906
$$ -2789 2884 2332 -4180 -3840 3048 3122 -3462 -3195 2942 2728 -3341 -1769 3984 2437 -2756 -850
1203h50K983l72j570j265j03K358N26n019J016O408l615o673N289O474n547n070
$$ -850 2133 1761 191 -1074 -1177 1181 1707 -3312 -2296 4112 497 -6176 -887 5587 40 -5030
1219e030N721L340m428k011L617J893k645k857J985L327j467l759L97L306k08
$$ -5030 691 4031 -397 -2408 1209 3102 457 -2400 -415 2912 1445 -2314 -1917 1389 1181
1234A181k944m08L062Q27l206k134N339L286o570l165P354K412p901N2O909j723
$$ 1181 -1763 -2171 891 1718 -1488 -3622 1717 5003 -1567 -4732 2622 5034 -2867 -2815 4094 2371
1250B371n858K145L945j422k339k87J05K387%l293O69M757k306n050L498N117
$$ 2371 -3487 -1342 2603 1181 -1158 -1445 -1340 1047 1047 -2246 -1577 3180 874 -4176 -678 4439
1266D439l312m702L081L897j905m145J950M388l091m707L257M458l214l686K623
$$ 4439 1127 -3575 -494 3403 1498 -2647 -697 3691 600 -4107 -850 3608 394 -3292 -669
1281f69K094j635o21L63M68J588j562k804L312L894m624m197N904L209o355j931
$$ -669 1425 -210 -831 -468 0 1588 26 -2778 534 4428 -196 -4393 1511 4720 -1635 -3566
1297c566N971M36n683J7M655j73l124q95K435J611j252k049J218K356j004k354
$$ -3566 2405 2841 -2842 -2825 1830 1657 -1467 -2362 73 1684 432 -1617 -399 1957 953 -1401
1313a401P16L230k59m497m35N192J42n877L57N573j428n621K548N590k782m479
$$ -1401 -685 2545 2286 -2211 -2646 2546 2688 -3189 -2832 2741 1313 -4308 -1760 3830 1048 -3431
1329c431K744L496k263j784J379P74M05n84j976J398K402k456l803L286M046l982
$$ -3431 -687 2809 546 -1238 141 915 1320 736 -1240 158 2560 104 -3699 -413 3633 -349
1345c49l934M599K902m506k435N073J702m368j561L988J451k667j273J892J320
$$ -349 -4283 316 3218 -1288 -3723 1350 3052 -1316 -2877 1111 2562 -105 -1378 514 1834
1360A834j502j333R30J608l68l200j56L551Q64m350j272M758J016n076J26O223
$$ 1834 332 -1001 -71 1537 1169 -2031 -2187 1364 2228 -2122 -3394 1364 2380 -2696 -2570 3653
1376C653j243n981J859N378j542m506J756K182j126j008N1O03J058j127k591J514
$$ 3653 2410 -3571 -1712 3666 2124 -2382 -626 1556 430 -578 -527 76 1134 7 -2584 -1070
1392a070L886k532l687K606L740k755k854L046K872l326k880L341L309l189l467
$$ -1070 2816 284 -3403 -797 2943 188 -2666 380 3252 -74 -2954 387 3696 507 -2960
1407b960L014K303l048j275K158O93j577o15N79J149J412k262k286L248K861m640
$$ -2960 54 2357 -691 -1966 192 885 -692 -1307 -728 421 1833 -429 -2715 533 3394 -1246
1423a246j581N397M82n479K16N416j063m847Q65L022l29k198r7K008M6j641p18
$$ -1246 -2827 2570 3052 -2427 -2211 3205 2142 -2705 -1840 1182 853 -1345 -1442 566 612 -1029 -1747
1440a747K091J135p80k197O42K568j17l131N21L926j412m296J721M736k536m906
$$ -1747 344 1479 699 -1498 -856 1712 1595 -1536 -1015 2911 1499 -2797 -1076 3660 1124 -3782
1456c782K888L706l082k259K417J325j702n13M98J523L91j696j404K509J775k823
$$ -3782 -894 2812 -270 -2529 -112 1213 -489 -1002 -504 1019 1410 -286 -1690 819 2594 -229
1472b29j669K601J905l611j676L620J821m541j544M087J510l925r21L951K27l078
$$ -229 -1898 703 2608 -1003 -2679 941 2762 -1779 -3323 764 2274 -1651 -2572 1379 1606 -1472
1488a472M73K351j16j299m76L06J610K79k880m17L112J16m081N86M493j696m079
$$ -1472 -999 1352 1236 -63 -539 -233 1377 1656 -1224 -1641 1471 1587 -2494 -1908 2585 889 -3190
1505c190J523M237j576l382J359K937j110k280J430K231j166j938K90J496L87
$$ -3190 -1667 2570 994 -2388 -1029 1908 798 -1482 -52 2179 1013 -925 -635 861 1248
1520A248r39j395L47K059j286k377J748L417l200l211L826K934l841k105M044
$$ 1248 309 -1086 -739 1320 34 -2343 -595 2822 -378 -3589 237 3171 -670 -2775 1269
1535A269R43l014m43K659J26j766q33P66J512o11j925j17J739N64k077j84K410
$$ 1269 2212 -802 -1245 1414 1540 -226 -1059 -293 1219 608 -1317 -1434 305 869 -1208 -1392 1018
1552A018L67l017l51M208j47l714J13L691l79l488R21K931j330k871J534J805
$$ 1018 1385 -1632 -1983 2225 2078 -1636 -1523 2168 1789 -1699 -778 2153 823 -2048 -514 1291
1568A291n63j387m86M27J443k15j917O94K588j623k590K522L140k689l046K883
$$ 1291 728 -659 -1145 -718 725 510 -1407 -713 1875 252 -2338 184 3324 635 -2411 472
1584D72K310k778j962K562J177k478j328K139J127j226j436M15J467K23r52m06
$$ 472 2782 4 -1958 604 1781 -697 -2025 114 1241 15 -1421 -1006 461 684 -268 -674
1600f74J304O65j802p99K417J609l405j493L453J337l853p75L888p59l457M65
$$ -674 630 1295 -507 -1306 1111 2720 -685 -2178 1275 2612 -1241 -2016 1872 1113 -2344 -1879
1616a879L305p41k014N11J158L68o49j84m26K032o09k099P42K964j635l111J449
$$ -1879 1426 685 -1329 -818 340 708 59 -125 -551 1481 872 -1227 -485 2479 844 -2267 -818
1633h18K913j662k562J460K227j521k117J569K343j584k034J342K017j343p27
$$ -818 2095 433 -2129 -669 1558 37 -2080 -511 1832 248 -1786 -444 1573 230 -497
1648d97P17P48l09o34l37M41J540j809k387K402K833l403j984L325J162l489q1
$$ -497 220 968 659 25 -312 129 1669 -140 -2527 -125 2708 -695 -2679 646 1808 -1681 -1762
1665a762K922P8k315L28J578L12o63j046K09J164k6j777O29J520q53k193P62K343
$$ -1762 1160 1238 -1077 -749 829 1141 478 -568 -359 805 779 -998 -369 1151 298 -1895 -1133 1210
1683A210m6k629j36K851k5k954P53L382j415l295J998K467j434j573P73P79o55
$$ 1210 1164 -1465 -1601 1250 1225 -1729 -976 2406 991 -2304 -306 2161 727 -846 -73 706 51
1700E1j64k87p5J118o80k252J829K412k143k143K738J702k704r19K712N80k217
$$ 51 -113 -400 -475 643 -37 -2289 -460 1952 -191 -2334 404 2106 -598 -1517 1195 1775 -442
1717d42r97J983J307j874j455J346J150j222p01Q34O87p90q20N4J311O27j360
$$ -442 -1439 544 1851 -23 -1478 -132 1018 -204 -905 -71 616 -174 -994 -940 371 998 -362
1734c62j353K717J135k956m36L363q73k927J006K791j229k306P25J405j004j33
$$ -362 -1715 1002 2137 -819 -1255 2108 1235 -1692 -686 2105 876 -1430 -705 700 -304 -437
1750d37k73N22J99m03p03R84J523r88j745Q87K268j270j735J106J726j448j951
$$ -437 -710 -188 11 -392 -1095 -111 1412 424 -1321 -434 1834 564 -1171 -65 1661 213 -1738
1767a738J853J951k035k306K003J365j530q53J521M91p91j59L5Q25M25r64j257
$$ -1738 115 2066 31 -2275 -272 1093 -437 -1290 231 722 -69 -228 -193 632 1057 93 -1164
1784a164J742J203k125j198K115R15k651m05K630K16k866K84J923n8j348m9J343
$$ -1164 578 1781 -344 -1542 573 1488 -1163 -1568 1062 1278 -1588 -1304 619 561 -787 -836 507
1801E07j27p48k1J020O40p51j129K32J459l19j405k14J943m82k271R59K287j234
$$ 507 380 -368 -389 631 1271 520 -609 -377 1082 763 -642 -856 1087 605 -1666 -707 1580 346
1819C46k579J675K320j470j628J635J050j137p57R84K72k34m16o47Q96P49j017
$$ 346 -2233 -558 1762 292 -1336 299 1349 212 -545 439 711 477 61 -586 310 1059 42
1836D2j730J552J286j607j112J763J333k805k43K227R27j989p75J794O57j716
$$ 42 -1688 -136 1150 -457 -1569 194 1527 -1278 -1521 706 1633 -356 -1131 663 1320 -396
1852c96o3J292k13p03r05R40Q06m96j092l6Q76Q02j760k04K550q36k039P68K756
$$ -396 -459 833 620 -83 -988 -48 758 262 -830 -866 10 812 -948 -1152 1398 562 -1477 -709 2047
1871B047r25k368J173J377r13j188Q78R25r64p52J10O62M69r01n09N53J206r66
$$ 2047 1122 -1246 -73 1304 391 -797 81 1006 42 -710 -600 62 531 -370 -879 -326 880 -86
1889h6p98R86J115j459j063J554J670j905j538J866J122j911p02K099lj999q5
$$ -86 -884 102 1217 -242 -1305 249 1919 14 -1524 342 1464 -447 -1149 950 947 -1052 -1137
1906a137Q50L88l50l08L0O47O80j347k19J857p1j533l8J963m34k066j55K159R5
$$ -1137 -287 101 -249 -557 -527 120 800 -547 -766 1091 1020 -513 -551 1412 978 -1088 -1243 916 1011
1925A011k380O40J832q49j419M68J579l35j151L40K75N10l0j080O9J581n51j740
$$ 1011 -1369 -729 1103 254 -1165 -697 882 547 -604 -264 11 521 491 -589 -520 1061 510 -1230
1943a230R72J968j394k022J479J633j569j330J676O25j344n64J267P89j051m15
$$ -1230 -258 1710 316 -1706 -227 1406 -163 -1493 183 808 -536 -1100 167 956 -95 -510
1959e10K3J359q0j002k19R50k2p44n67J338O83j960o70J387J277k021p34K316
$$ -510 -487 872 792 -210 -429 521 499 -245 -812 526 1209 -751 -1421 -34 1243 -778 -1512 804
1977H04R2j930P35J826p96j652M34J251k91o3p23kQ80j56j360N68J268l05k158
$$ 804 896 -1034 -299 1527 731 -921 -487 764 473 410 -313 -315 565 409 -951 -383 885 580 -1578
1996a578P35J877o75j533O60J366p01j222R43J365j012j217P04J488o76j033O4
$$ -1578 -843 1034 359 -1174 -514 852 151 -1071 -128 1237 225 -992 -288 1200 524 -509 -445
2013d45O65k15k33m50L95R36p92j100J470J004j474j159J950J096k127m25J612
$$ -445 220 5 -228 -678 -283 653 -139 -1239 231 1235 -239 -1398 552 1648 -479 -904 708
2030G08J82j563m7J495l4j176p2J43N91l82l37j84R40r7r32K19J619k07j687j39
$$ 708 890 -673 -720 775 741 -435 -507 -364 227 -155 -492 -676 264 167 -765 -546 1073 866 -821 -960
2050i60J819K76j727K2J946o56j993P43J830j010j358Q25M93l52k14m1m6Q88n08
$$ -960 859 1135 -592 -570 1376 720 -1273 -530 1300 290 -1068 -243 250 -102 -316 -357 -403 485 -23
2069b3r49R60J230q27j569J304J045j186j000J597L61j736j76J000N44j062p83
$$ -23 -972 -12 1218 391 -1178 126 1171 -15 -1015 582 943 -793 -969 31 575 -487 -1270
2086a270J246P56q84m84M57N30l03l64J81Q59J84j164n28J151N51j122q12J606
$$ -1270 -24 732 -152 -636 -179 351 48 -316 -135 724 908 -256 -784 367 918 -204 -1016 590
2104E90N4j641r3K319o40j871O79J288m66o58L77K20J3J68p16M08R25q90q71P83
$$ 590 644 -997 -1090 1229 589 -1282 -603 685 219 -439 -62 158 171 339 -377 31 956 66 -805 -22
2124b2R10o83j434P53J328j125r17J074J157j120j324J172J482r51j301J172P30
$$ -22 888 205 -1229 -476 852 -273 -1190 -116 1041 -79 -1403 -231 1251 300 -1001 171 901
2141I01r07k24O60k12j49N6p38N58Q81j010j013J062J074j546n54J777K74j829
$$ 901 -6 -230 430 218 69 125 -613 -55 826 -184 -1197 -135 939 -607 -1161 616 890 -939
2159i39k28K026k59j229K67O96J77q24J6O70K68p78o93Q19M75l11j186L56Q47
$$ -939 -1167 859 600 -629 -362 334 511 -313 -297 373 641 -137 -830 -11 464 153 -1033 -677 170
2178A70m3q02J65J554o25j671R30J904j355j236J112P77n66r31J039j05l24m88
$$ 170 127 -675 -510 1044 419 -1252 -322 1582 227 -1009 103 880 314 -617 422 317 -7 -495
2196d95K60L9Q10o00j081J003R80j077q08J375P28j416m80J649O9j170o29Q78
$$ -495 -235 -196 614 14 -1067 -64 916 -161 -969 406 1134 -282 -762 887 956 -214 -843 35
2214C5N88j010k38O92J98p67j03O61Q5P9m30n7O57L39q87m15J146j45j208j6J931
$$ 35 623 -387 -625 67 265 -502 -605 56 141 220 -210 -267 390 729 -158 -573 573 428 -780 -796 1135
2235A135l34j946N78J288n57j074N04Q55l72p32L80N09K4l24k76M09P24m20n88
$$ 1135 801 -1145 -567 721 164 -910 -406 449 77 -655 -275 234 258 -66 -342 67 791 371 -217
2254b17N9J219j064m48O28J026j518p58P00J351j112j027J374J36n53n72J011
$$ -217 -158 1061 -3 -451 177 1203 -315 -1073 -373 978 -134 -1161 213 349 -204 -776 235
2271B35J01l34j89K33N99q9k99o74R76j02p57o34J362L59j607J6J240J07q61l12
$$ 235 336 2 -187 46 645 556 257 -417 559 457 -300 -934 428 787 -820 -804 436 543 -318 -630
2291f30J090k38r06K88J368m18j086J82O56J95n70j52j76Q44l68p01L69J050q11
$$ -630 460 222 -684 -396 972 554 -532 -350 306 501 -69 -221 -397 447 79 -622 -253 797 -14
2310a4j152O46J480q92r18J001O21r69n22J085M63p84o52N16N27J11n43k78M11
$$ -14 -1166 -520 960 68 -850 151 772 -197 -719 366 829 45 -607 -91 436 547 4 -274 137
2329A37r3k63k85O81L22j071m50J236M13o92o79J238R8r29O8J071k77r72K7Q96
$$ 137 44 -219 -504 177 499 -572 -1022 214 627 -65 -744 494 592 -337 -269 802 525 -447 -420 476
2349D76P3n90l37O1N18j58m97J07N84J71j169O41J489r01r45J89J125l04r43K64
$$ 476 549 -41 -378 -317 201 43 -454 -347 237 408 -761 -120 1369 468 -477 -288 837 533 -410 -146
2369a46J046q46r57N32Q25k06r40K27J73J32j3j14M23Q7l33j12P7J244j227q26
$$ -146 900 54 -903 -371 454 248 -692 -465 -292 -160 -173 -287 136 223 -110 -222 -145 1099 -128 -954
2389i54J228P76j175n34Q32P85j788K95R98j8r25K8L98K4J67l31J90J51M4m32
$$ -954 274 1050 -125 -659 173 958 -830 -535 463 445 -480 -452 -54 -30 137 -194 -4 147 191 -241
2409b41J29P43j0j136L54L76M15j328J72R24m98n48K36J180m86r50O43M63l72
$$ -241 -112 631 621 -515 -161 215 630 -698 -526 398 -100 -648 -412 768 282 -668 -25 438 66
2428F6m02M88J75j78j17K19pL22l59r94M79J138p29j147J247J20o49l53O84N19
$$ 66 -336 152 327 149 32 251 244 566 207 -787 -308 830 101 -1046 201 321 -328 -681 3 522
2448E22p33m87P48N16n35qJ68J54l79j55K44L53m02m53J49K30P11j071l14R66
$$ 522 -211 -698 50 566 31 23 191 345 -34 -189 55 408 6 -447 -298 -68 643 -428 -742 224
2468B24P3q62qJ222k27j180M00R95k54l51j27O03m09J6j52J09M25p64k37K44N92
$$ 224 297 -565 -573 649 422 -758 -358 637 383 32 -95 508 99 115 -37 72 497 -267 -504 -260 332
2489C32k06r13J85R29j04p05O45O57q24p34N41J091n21r60M15N48o95j57N41J84
$$ 332 126 -787 -602 327 223 -482 163 820 -4 -738 -197 894 373 -587 -172 376 -319 -476 65 249
2509B49k00m27J31K47K08l75l88M64N57m36k37N84K29r60q0J126M1r74m7N57k
$$ 249 49 -378 -247 0 208 -167 -555 -91 466 30 -207 377 606 -354 -434 692 733 -241 -288 269 267
2530B67n90j27P08K7n51k1J29P57l62p03K12M52m1k89k4O43l00p97K33J094o22
$$ 267 -323 -450 258 285 -266 -287 -158 599 237 -466 -254 198 157 -132 -156 487 187 -610 -377 717 95
2551I5p71N27M98l22p12O43M72p03j23K22K24J83k6q10Q42J30l22n58Q55Q5j005
$$ 95 -676 -149 349 27 -685 -42 430 -273 -396 -174 50 233 207 -603 239 369 47 -511 344 429 -576
2572e76L26P06K25j072k64Q19L7m22l22Q23p1m08M3L23P4l45o6L37K8O8l53l43
$$ -576 -250 456 681 -391 -655 164 201 -221 -543 280 209 -199 -156 167 241 -104 -170 167 195 263 -90 -433
2594d33L60L35p07P3Q84l88p33K19R06l58o47M75L11l31j86M0K98K21m10k65L29
$$ -433 -73 262 -445 -372 512 124 -609 -390 516 158 -489 -14 297 -34 -220 -180 118 339 -71 -336 -7
2615gM42m16k13P5M07l08k58K40N24o78o22P80P08p79l17L62L95o74J0Q44l0o53
$$ -7 435 19 -194 -119 288 -20 -278 -38 486 -192 -814 -34 674 -105 -422 -60 335 -339 -329 515 485 -168
$$ [...]
8191A75
##END NTUPLES=NMR FID
##END=
