##TITLE=1H_III
 200.13MHz, CDCl3,
 8 sc
 
 17.2.2025
##JCAMPDX= 6.0         $$ Bruker NMR JCAMP-DX V2.0
##DATA TYPE= NMR FID
##DATA CLASS= NTUPLES
##ORIGIN= UXNMR, Bruker Analytische Messtechnik GmbH
##OWNER= pz
$$ XWIN-NMR		Version 3.5
$$ Mon Feb 17 16:09:36 2025 Russian Standard Time (UT+4h)  she@DPX200
##.OBSERVE FREQUENCY= 200.1313
##.OBSERVE NUCLEUS= ^1H
##.DELAY= (6, 6)
##.ACQUISITION MODE= SIMULTANEOUS
##.ACQUISITION SCHEME= undefined
##.AVERAGES= 8
##.DIGITISER RES= 18
##SPECTROMETER/DATA SYSTEM= spect
##.PULSE SEQUENCE= zg30
##.SOLVENT NAME= CDCl3
##.SHIFT REFERENCE= (INTERNAL, CDCl3, 0, 14.3821)
##AUDIT TRAIL= $$ (NUMBER, WHEN, WHO, WHERE, WHAT)
$$ ##TITLE= Audit trail, XWIN-NMR		Version 3.5
$$ ##JCAMPDX= 5.01
$$ ##ORIGIN= Bruker BioSpin GmbH
$$ ##OWNER= she
$$ F:/spectra/data/she/nmr/H-C/1/audita.txt
$$ ##AUDIT TRAIL=  $$ (NUMBER, WHEN, WHO, WHERE, WHAT)
(   1,<2025-02-17 16:08:13.56 +0400>,<she>,<DPX200>,
      <created by zg, POWCHK disabled, PULCHK disabled
       configuration hash MD5:
       00 E9 B6 7A A2 85 ED C7 34 08 36 98 17 FE 4E 26
       data hash MD5: 16K
       17 79 20 86 6D AA EF 97 B0 CA 68 77 02 5F 2E F6>)
$$ ##END=
$$ 
$$ hash MD5
$$ 24 9A F8 3B 85 32 77 DC 5A 1A 16 9D C8 7A 14 A2
##$RELAX= 
##$RELAX= 
##$RELAX= 
##$RELAX= 
##$RELAX= 
##$RELAX= 
$$ Bruker specific parameters
$$ --------------------------
##$DU= <F:/spectra>
##$EXPNO= 1
##$NAME= <H-C>
##$PROCNO= 1
##$TYPE= <nmr>
##$USER= <she>
##$AMP= (0..31)
100 100 100 100 100 100 100 100 100 100 100 100 100 100 100 100 100 100 
100 100 100 100 100 100 100 100 100 100 100 100 100 100 
##$AQSEQ= 0
##$AQ_mod= 1
##$AUNM= <au_zg>
##$AUTOPOS= <>
##$BF1= 200.13
##$BF2= 200.13
##$BF3= 200.13
##$BF4= 200.13
##$BF5= 200.13
##$BF6= 200.13
##$BF7= 200.13
##$BF8= 200.13
##$BYTORDA= 1
##$CFDGTYP= 0
##$CFRGTYP= 5
##$CHEMSTR= <none>
##$CNST= (0..31)
1 1 145 1 1 1 1 1 1 1 1 1 1 1 1 1 1 1 1 1 1 1 1 1 1 1 1 1 1 1 1 1 
##$CPDPRG= <>
##$CPDPRG1= <>
##$CPDPRG2= <>
##$CPDPRG3= <>
##$CPDPRG4= <mlev>
##$CPDPRG5= <mlev>
##$CPDPRG6= <mlev>
##$CPDPRG7= <mlev>
##$CPDPRG8= <mlev>
##$CPDPRGB= <>
##$CPDPRGT= <>
##$D= (0..31)
0 0.7 0 0 0 0 0 0 0 0 0 0.03 0 0 0 0 0 0 0 0 0 0 0 0 0 0 0 0 0 0 0 0 
##$DATE= 1739794093
##$DBL= (0..7)
120 120 120 120 120 120 120 120 
##$DBP= (0..7)
150 150 150 150 150 150 150 150 
##$DBP07= 0
##$DBPNAM0= <>
##$DBPNAM1= <>
##$DBPNAM2= <>
##$DBPNAM3= <>
##$DBPNAM4= <>
##$DBPNAM5= <>
##$DBPNAM6= <>
##$DBPNAM7= <>
##$DBPOAL= (0..7)
0.5 0.5 0.5 0.5 0.5 0.5 0.5 0.5 
##$DBPOFFS= (0..7)
0 0 0 0 0 0 0 0 
##$DE= 6
##$DECBNUC= <off>
##$DECIM= 32
##$DECNUC= <off>
##$DECSTAT= 4
##$DIGMOD= 1
##$DIGTYP= 9
##$DL= (0..7)
0 120 120 120 120 120 120 120 
##$DP= (0..7)
150 150 150 150 150 150 150 150 
##$DP07= 0
##$DPNAME0= <>
##$DPNAME1= <>
##$DPNAME2= <>
##$DPNAME3= <>
##$DPNAME4= <>
##$DPNAME5= <>
##$DPNAME6= <>
##$DPNAME7= <>
##$DPOAL= (0..7)
0.5 0.5 0.5 0.5 0.5 0.5 0.5 0.5 
##$DPOFFS= (0..7)
0 0 0 0 0 0 0 0 
##$DQDMODE= 0
##$DR= 18
##$DS= 0
##$DSLIST= <SSSSSSSSSSSSSSS>
##$DSPFIRM= 0
$$ [...]
##$SUBNAM0= <"">
##$SUBNAM1= <"">
##$SUBNAM2= <"">
##$SUBNAM3= <"">
##$SUBNAM4= <"">
##$SUBNAM5= <"">
##$SUBNAM6= <"">
##$SUBNAM7= <"">
##$SUBNAM8= <"">
##$SUBNAM9= <"">
##$SW= 18.0517328524113
##$SWIBOX= (0..15)
0 0 2 0 0 0 0 0 0 0 0 0 0 0 0 0 
##$SW_h= 3612.71676300578
##$TD= 16384
##$TD0= 1
##$TE= 0
##$TE2= 300
##$TE3= 300
##$TEG= 300
##$TL= (0..7)
0 120 120 120 120 120 120 120 
##$TP= (0..7)
150 150 150 150 150 150 150 150 
##$TP07= 0
##$TPNAME0= <>
##$TPNAME1= <>
##$TPNAME2= <>
##$TPNAME3= <>
##$TPNAME4= <>
##$TPNAME5= <>
##$TPNAME6= <>
##$TPNAME7= <>
##$TPOAL= (0..7)
0.5 0.5 0.5 0.5 0.5 0.5 0.5 0.5 
##$TPOFFS= (0..7)
0 0 0 0 0 0 0 0 
##$TUNHIN= 0
##$TUNHOUT= 0
##$TUNXOUT= 0
##$USERA1= <user>
##$USERA2= <user>
##$USERA3= <user>
##$USERA4= <user>
##$USERA5= <user>
##$V9= 5
##$VALIST= <valist>
##$VCLIST= <CCCCCCCCCCCCCCC>
##$VD= 0
##$VDLIST= <DDDDDDDDDDDDDDD>
##$VPLIST= <PPPPPPPPPPPPPPP>
##$VTLIST= <TTTTTTTTTTTTTTT>
##$WBST= 1024
##$WBSW= 4
##$XGAIN= (0..3)
0 0 0 0 
##$XL= 0
##$YL= 0
##$YMAX_a= 499552
##$YMIN_a= -560210
##$ZGOPTNS= <>
##$ZL1= 120
##$ZL2= 120
##$ZL3= 120
##$ZL4= 120
##$ABSF1= 10
##$ABSF2= 0
##$ABSG= 5
##$ABSL= 3
##$ALPHA= 0
##$AQORDER= 0
##$ASSFAC= 0
##$ASSFACI= 0
##$ASSFACX= 0
##$ASSWID= 0
##$AUNMP= <proc_1d>
##$AZFE= 0.1
##$AZFW= 0.1
##$BCFW= 1
##$BC_mod= 2
##$BYTORDP= 1
##$COROFFS= 0
##$CY= -3
##$DATMOD= 1
##$DC= 2
##$DFILT= <>
##$DTYPP= 0
##$F1P= 0
##$F2P= 0
##$FCOR= 0.5
##$FTSIZE= 0
##$FT_mod= 4
##$GAMMA= 1
##$GB= 0.15
##$INTBC= 1
##$INTSCL= 1
##$ISEN= 128
##$LB= 0.25
##$LEV0= 0
##$LPBIN= 0
##$MAXI= 10000
##$MC2= 0
##$MEAN= 0
##$ME_mod= 0
##$MI= 1.114404
##$NCOEF= 0
##$NC_proc= 0
##$NLEV= 6
##$NOISF1= 3.799351
##$NOISF2= 2.8
##$NSP= 1
##$NTH_PI= 0
##$NZP= 0
##$OFFSET= 14.38212
##$PC= 1
##$PHC0= -472.2076
##$PHC1= 18.79222
##$PH_mod= 1
##$PKNL= yes
##$PPARMOD= 0
##$PSCAL= 0
##$PSIGN= 0
##$REVERSE= no
##$SF= 200.129724274929
##$SI= 16384
##$SIGF1= 3
##$SIGF2= 2
##$SINO= 400
##$SIOLD= 16384
##$SREGLST= <1H.CDCl3>
##$SSB= 0
##$STSI= 0
##$STSR= 0
##$SW_p= 3205.1282051282
##$SYMM= 0
##$S_DEV= 0
##$TDeff= 0
##$TDoff= 0
##$TI= <>
##$TILT= no
##$TM1= 0
##$TM2= 0
##$TOPLEV= 0
##$USERP1= <user>
##$USERP2= <user>
##$USERP3= <user>
##$USERP4= <user>
##$USERP5= <user>
##$WDW= 1
##$XDIM= 8192
##$YMAX_p= 0
##$YMIN_p= 0
$$ End of Bruker specific parameters
$$ ---------------------------------
##NTUPLES= NMR FID
##VAR_NAME=  TIME,          FID/REAL,        FID/IMAG
##SYMBOL=    X,             R,               I
##VAR_TYPE=  INDEPENDENT,   DEPENDENT,       DEPENDENT
##VAR_FORM=  AFFN,          ASDF,            ASDF
##VAR_DIM=   8192,          8192,            8192
##UNITS=     SECONDS,       ARBITRARY UNITS, ARBITRARY UNITS
##FACTOR=    0.0002768,     1,               1
##FIRST=     0,             0,               0
##LAST=      2.2672688,     0,               0
##MIN=       0,             -560210,         0
##MAX=       2.2672688,     499552,          0
$$ Real data points
##PAGE= N=1
##DATA TABLE= (X++(R..R)), XYDATA
$$ plain form
0 0 0 0 0 0 0 0 0 0 0 0 0 0 0 0 5 -8 8 -8 8 -8 16 -16 16 -20 24 -28 32 -36 38 -45 53 -60 62 -73 81 -91 100
37 100 -112 124 -137 153 -168 183 -203 226 -247 272 -297 328 -363 400 -439 485 -538 599 -668 749
57 749 -847 964 -1108 1292 -1529 1853 -2309 2991 -4103 6121 -10513 23697 -137041 -560210
71 -560210 140785 333237 -307996 -73484 423201 -66344 -327351 179101 104471 -286012
81 -286012 87687 314329 -170487 -188643 210761 -21451 -265985 144595 234111 -188324
91 -188324 -102642 205011 -59541 -221585 150018 175586 -168142 -33412 203454 -87152
101 -87152 -206353 146603 132185 -164601 13670 186108 -135694 -177363 167330 55708
111 55708 -186471 95362 187325 -191724 -130260 196990 -19882 -171652 184559 150359 -230104
$$ packed form
0@%%%%%%%%%%%%%%Nj3J6j6J6j6K4l2L2l6M4n2O0o8P4q3R8j13J22j35J54j72J91
37A00k12K36k61K90l21L51l86M29m73N19n69O25o91P63q39R24j023J137j267J417
57G49j596J811k072K400k821L382m162N300p094J0224j6634L4210j60738m23169
71e60210P00995J92452o41233K34512M96685m89545k61007N06452p4630l90483
81b86012L73699K26642m84816j8156L99404k32212k44534M10580Q9516m22435
91a88324Q5682L07653k64552j62044L71603K5568l43728J34730K36866k90606
101h7152j19201L52956j4418k96786J78271J72438l21802m1669L44693j11622
111E5708k42179K81833R1963l79049O1464L27250k16872j51770L56211l4200l80463
$$ plain form
122 -230104 -46821 193603 -112526 -130211 239438 65236 -241661 46988 152899 -198519
132 -198519 -78899 260169 -7135 -213423 114557 104721 -219488 -10081 244236 -66097
142 -66097 -159406 165784 57745 -224436 37813 212742 -113178 -124145 184791 16425
152 16425 -225414 57233 176254 -131177 -84606 179959 -17529 -187072 89624 123640
162 123640 -142800 -17759 182193 -60028 -150382 123328 71375 -159274 26596 166831
172 166831 -95726 -120752 129426 23160 -155919 54734 134340 -109075 -73753 130381
182 130381 -15094 -133643 85599 107282 -111306 -28711 126941 -46703 -111485 103630
192 103630 67648 -122001 7527 115145 -83326 -90499 116110 23342 -125017 49061 96618
$$ packed form
122b30104J83283K40424l06129j7685L69649j74202l06897K88649J05911l51418
132a98519J19620L39068k67304k06288L27980r836l24209K09407K54317l10333
142f6097r3309L25190j08039k82181K62249J74929l25920j0967L08936j68366
152A6425k41839K82647J19021l07431M6571K64565j97488j69543K76696L4016
162A23640k66440J25041J99952k42221r0354K73710n1953k30649J85870J40235
172A66831k62557k5026K50178j06266j79079K10653P9606k43415L5322K04134
182A30381j45475j18549K19242K1683k18588Q2595J55652j73644o4782K15115
192A03630l5982j89649J29528J07618j98471p173K06609r2768j48359J74078M7557
$$ plain form
203 96618 -111505 -48043 132417 -18979 -109124 92626 67268 -126256 839 125490 -63510
214 -63510 -80698 114539 21053 -129158 37039 94989 -92823 -45451 113776 -17404 -105299
225 -105299 65053 62392 -98131 -8907 106287 -35766 -79156 77608 44547 -90831 2455
236 2455 88093 -40001 -62272 67251 22582 -81624 13892 66538 -55138 -42560 76810
247 76810 1654 -83484 37117 64893 -68029 -25741 87914 -12027 -74695 53257 46660
258 46660 -73408 -2407 75104 -37330 -53902 60309 12631 -69795 21948 50544 -52679
269 -52679 -24176 57843 -10981 -47553 40305 27946 -49364 3154 49283 -23605 -30097 43054
281 43054 12401 -44369 8524 34960 -27734 -23078 33716 630 -38979 13951 27776 -31455
$$ packed form
203I6618k08123O3462J80460j51396r0145K01750k5358j93524J27095J24651j89000
214f3510j7188J95237r3486j50211J66197N7950j87812M7372J59227j31180q7895
225a05299J70352k661j60523Q9224J15194j42053m3390J56764l3061j35378R3286
236B455Q5638j28094k2271J29523m4669j04206R5516N2646j21676J2578J19370
247G6810p5156q5138J20601K7776j32922M2288J13655r9941o2668J27952o597
258D6660j20068P1001P7511j12434j6572J14211m7678q2426R1743K8596j03223
269e2679K8503Q2019o8824l6572Q7858j2359p7310N2518M6129p2888o492P3151
281D3054l0653n6770N2893K6436o2694M656N6794l3086l9609N2930J3825n9231
$$ plain form
293 -31455 -13992 39516 -5884 -37312 27436 28122 -37175 -2640 44007 -16828 -32308 37159
305 37159 12559 -45181 10824 36238 -35185 -22194 41113 -4229 -39714 21054 21721 -32998
317 -32998 -1784 32366 -13119 -16717 25465 4704 -21144 11357 15645 -15695 -4727 15183
329 15183 -4490 -13180 5170 5348 -8203 -7196 4118 3373 -6943 -3655 9852 2663 -10403 4962
343 4962 13472 -8116 -5467 15596 546 -13831 8864 8528 -14334 -1351 11168 -10033 -8614
356 -8614 10511 -3282 -10663 7992 3664 -9999 3872 7348 -6296 2074 7794 -4719 -52
369 -52 8783 -4446 -3480 8410 -3788 -8049 7635 -559 -11750 5932 4958 -13382 1128 11620
383 11620 -10252 -4829 15823 -3596 -11450 15097 6730 -16150 6720 15629 -14451 -6305 18019
$$ packed form
293c1455J7463N3508m5400l1428O4748O86o5297L4535M6647o0835j5480O9467
305C7159k4600n7740N6005K5414p1423J2991O3307m5342l5485O0768O67n4719
317c2998L1214L4150m5485l598M2182k0761k5848L2501M288l1340J0968J9910
329A5183j9673q690J8350J78j3551J007J1314p45j0316L288J3507p189j3066J5365
343D962Q510k1588K649K1063j5050j4377K2695l36k2862J2983J2519k1201J419
356h614J9125j3793p381J8655m328j3663J3871L476j3644Q370N720j2513M667
369e2Q835j3229R66J1890j2198m261J5684q194j1191J7682r74j8340J4510J0492
383A1620k1872N423K0652j9419p854K6547q367k2880K2870Q909l0080Q146K4324
$$ plain form
396 18019 -5420 -16598 12397 5679 -19157 2215 13797 -14024 -8133 17205 -1694 -15041
408 -15041 12148 10315 -15026 1637 17935 -9120 -11704 17641 4590 -19797 5172 16951
420 16951 -15281 -13251 18151 1246 -21838 6886 17285 -16103 -9755 20976 178 -19487
432 -19487 12217 16020 -17294 -4201 22666 -4446 -18996 15260 11059 -22824 -1507 22441
444 22441 -12245 -19832 20185 7989 -28372 3818 26738 -16759 -18249 28080 6520 -30206
456 -30206 11526 28052 -23815 -13261 33586 -4203 -32642 21663 20512 -35319 -3391 35925
468 35925 -19455 -28676 33396 8411 -39938 13929 33263 -31847 -14566 42409 -5739 -35229
480 -35229 27298 21807 -36799 -63 35909 -19261 -24309 30733 4649 -35132 9953 24359
$$ packed form
396A8019k3439j1178K8995o718k4836K1372J1582k7821N891K5338j8899j3347
408a5041K7189j833k5341J6663J6298k7055k584K9345j3051k4387K4969J1779
420A6951l2232K030L1402j6905k3084K8724J0399l3388O348L0731k0798j9665
432a9487L1704L803l3314J3093K6867k7112j4550L4256m201l3883K1317K3948
444B2441l4686p587M0017j2196l6361L2190K2920m3497j490M6329k1560l6726
456c0206M1732J6526n1867J0554M6847l7789k8439N4305j151n5831L1928L9316
468C5925n5380r221O2072k4985m8349N3867J9334o5110J7281N6975m8148k9490
480c5229O2527n491n8606L6736L5972n5170n048N5042k6084l9781M5085J4406
$$ plain form
492 24359 -25047 -11891 30328 -3007 -26895 17010 17911 -25296 -4218 30686 -5581 -24424
504 -24424 19267 16708 -28484 -5322 30776 -9385 -27281 22161 13198 -34624 333 33983
516 33983 -18750 -24480 34125 6414 -40546 14623 34469 -30375 -12728 43094 -9634 -39183
528 -39183 30365 22500 -42375 3065 42598 -28004 -31579 38778 5621 -42004 19386 32697
540 32697 -36169 -14450 39697 -9190 -31822 31587 21696 -36703 -1009 33300 -20009 -24178
552 -24178 33943 11462 -34557 5575 26400 -26398 -19508 33683 4989 -31583 13626 23913
564 23913 -30270 -13345 36673 -1052 -28910 23499 19889 -37315 -5659 38266 -12780 -27099
576 -27099 32731 10632 -44719 4340 35316 -24986 -18391 41232 -694 -44346 16490 28665
$$ packed form
492B4359m9406J3156M2219l3335k3888M3905R01m3207K1078L4904l6267j8843
504b4424M3691k559m5192K3162L6098m0161j7896M9442q963m7822L4957L3650
516C3983n2733n730N8605k7711m6960N5169J9846o4844J7647N5822n2728k9549
528c9183O9548p865o4875M5440L9533p0602l575P0357l3157m7625O1390J3311
540C2697o8866K1719N4147m8887k2632O3409r891n8399L5694L4309n3309m169
552b4178N8121k2481m6019M0132K0825n2798O890N3191k8694l6572M5209J0287
564B3913n4183J6925N0018l7725k7858N2409l610n7204L1656M3925n1046j4319
576b7099N9830k2099n5351M9059L0976o0302O595N9623m1926m3652O0836J2175
$$ plain form
588 28665 -32202 -5009 44609 -10623 -37017 24819 15986 -36142 6711 40499 -20682 -28228
600 -28228 28572 2049 -38515 16000 35795 -25989 -18220 31643 -6290 -35914 23352 29549
612 29549 -27256 -5756 32757 -16230 -32323 28464 19708 -30019 5136 30020 -26881 -26079 31583
625 31583 6308 -30702 18117 25550 -34454 -16095 33777 -4354 -25322 28934 19213 -36537
637 -36537 -5340 30596 -15181 -18547 33845 9882 -35961 2684 22470 -24213 -12297 35883
649 35883 2052 -31543 11116 15961 -29603 -4375 37500 -3864 -26100 19992 10296 -34350
661 -34350 2158 36392 -11658 -20699 26322 2680 -38165 7479 31217 -18861 -12893 30298
673 30298 -5571 -35263 15322 23093 -23027 -812 32610 -13435 -28500 21799 12509 -26672
$$ packed form
588B8665o0867K7193M9618n5232k6394O1836q833n2128M2853L3788o1181p546
600b8228N6800k6523m0564N4515J9795o1784P769M9863l7933k9624N9266O197
612B9549n6805K1500L8513m8987j6093O0787q756m9727L5155K4884n6901Q02N7662
625C1583k5275l7010M8819P433o0004J8359M9872l8131k0968N4256r721n5750
637c6537L1197L5936m5777l366N2392k3963m5843L8645J9786m6683J1916M8180
649C5883l3831l3595M2659M845m5564K5228M1875m1364k2236M6092r696m4646
661c4350L6508L4234m8050r041M7021k3642m0845M5644K3738n0078N968M3191
673C0298l5869k9692N0585P771m6120K2215L3422m6045j5065N0299r290l9181
$$ plain form
685 -26672 9218 30281 -21541 -22767 24112 2432 -27614 14888 25587 -24105 -15051 23888
697 23888 -5024 -23818 20849 21019 -23628 -5549 23082 -12987 -19891 25749 13286 -24613 3225
710 3225 20485 -21123 -16379 27040 4491 -24131 11451 16261 -25654 -9048 26804 -3019 -18522
723 -18522 18896 10622 -26195 -466 23043 -10446 -12573 22372 3414 -25251 4568 16911
735 16911 -15496 -7127 21837 -2221 -21709 8773 12212 -17801 -1872 22827 -5157 -18078
747 -18078 13555 9236 -19485 1723 23172 -8838 -16105 16648 3959 -22750 5643 20137
759 20137 -14990 -11659 19996 -2543 -22542 12966 16285 -18991 -3010 22799 -9312 -18611 18405
772 18405 9381 -20495 4777 18894 -14936 -11768 18228 -87 -17489 10255 11323 -16643 -4235
$$ packed form
685b6672L5890K1063n1822j226M6879k1680l0046M2502J0699m9692R054L8939
697B3888k8912j8794M4667J70m4647J8079K8631l6069o904M5640j2463l7899K7838
710C225J7260m1608M744M3419k2549k8622L5582M810m1915J6606L5852k9823j5503
723a8522L7418q274l6817K5729K3509l3489k127L4945j8958k8665K9819J2343
735A6911l2407Q369K8964k4058j9488L0482L439l0013J5929K4699k7984j2921
747a8078L1633m319k8721K1208K1449l2010p267L2753j2689k6709K8393J4494
759B0137l5127L331L1655k2539j9999L5508L319l5276J5981K5809l2111r299L7016
772A8405r024k9876K5272J4117l3830L168K9996j8315j7402K7744J068k7966J2408
$$ plain form
785 -4235 15873 -6015 -11719 12919 6668 -14860 925 13105 -7264 -8526 12483 4081 -12415
798 -12415 1846 9870 -7691 -7088 10823 1425 -11740 3647 8647 -10354 -4837 12868 -1052
811 -1052 -12077 8014 8779 -12591 -1702 14881 -4699 -11086 12132 4588 -14891 2649 12740
824 12740 -10663 -7290 13846 -1328 -14350 7799 8587 -12959 -1397 13794 -5737 -9886 10919
837 10919 4175 -12033 3394 10511 -7999 -5644 10653 -136 -10180 4863 6616 -8698 -3193
850 -3193 8883 -2030 -7699 5011 4582 -6988 -1147 7181 -2199 -5372 5065 3195 -5637 789
864 789 6010 -3550 -4078 5285 899 -6741 1719 5155 -5030 -3236 5994 146 -6244 2803 4866
879 4866 -4753 -1534 5796 -857 -4139 3799 2421 -4311 727 4375 -3522 -3154 4325 113 -5230
$$ packed form
785d235K0108k1888n704K4638o251k1528J5785J2180k0369j262K1009q402j6496
798a2415J4261Q024j7561O03J7911r398j3165J5387N000j9001N517J7705j3920
811a052j1025K0091P65k1370J0889J6583j9580o387K3218p544j9479J7540J0091
824A2740k3403L373K1136j5174j3022K2149P88k1546J1562J5191j9531m149K0805
837A0919o744j6208J5427P117j8510K355J6297j0789j0044J5043J753j5314N505
850c193J2076j0913n669J2710m29j1570N841Q328r380l173J0437j870q832O426
864G89N221r560n28R363m386p640Q460L436j0185J794R230n848o390R047K063
879D866r619L219P330o653l282P938j378o732N038L648p897L68P479m212n343
$$ plain form
894 -5230 2300 3478 -4467 -1618 5038 -1322 -4001 4040 2375 -4553 809 4813 -2824 -2906 4193 311
910 311 -4126 1888 2744 -3915 -1043 3456 -2046 -3286 2629 966 -2868 790 2470 -1625 -641 2263
926 2263 -148 -1323 1265 955 -786 -30 945 -308 -862 -597 359 -78 -1219 -219 898 -452 -1494
943 -1494 910 760 -1387 126 2082 -627 -564 1855 493 -1241 847 941 -1646 -403 1062 -745
959 -745 -1304 701 -54 -1176 -245 391 -184 111 -274 51 1046 -113 -220 1305 307 -778 1007 926 -1479
978 -1479 -5 1659 -1717 -1143 2506 -1048 -2829 1829 1543 -2935 236 2939 -1754 -1540 3408 588
994 588 -2698 1983 2374 -2717 -109 3216 -1522 -2314 2313 426 -3092 593 1920 -2124 -977 2493
1010 2493 -417 -2366 1844 1850 -2223 -4 3074 -379 -2351 2105 1751 -2599 -427 2926 -1394 -2876
$$ packed form
894e230P530J178p945K849O656o360k679Q041j665o928N362M004p637q2P099l882
910C11m437O014Q56o659K872M499n502j240N915j663l834L658J680m095R84K904
926B263k411j175K588l10j741P56R75j253n54K65R56m37j141J000J117j350j042
943a494K404j50k147J513J956k709O3K419j362j734K088R4k587J243J465j807
959g45n59K005p55j122R31O36n75K95l85L25R95j159j07J525r98j085J785q1k405
978a479J474J664l376N74L649l554j781M658k86m478L171K703m693K14M948k820
994E88l286M681L91n091K608L325m738p92M627j887l518L685J327m044J147L470
1010B493k910j949M210Om073K219L078l453j972M456l54m350K172L353m320j482
$$ plain form
1026 -2876 2396 1219 -3484 379 2947 -2487 -2151 3454 -199 -3948 2221 3233 -3636 -790 5067
1041 5067 -1447 -4093 3593 2046 -5161 269 4933 -3041 -3479 4188 636 -4879 1301 3599 -3281
1056 -3281 -1466 4376 -300 -3550 2904 2533 -3933 -95 4635 -1247 -3619 3352 2076 -4787 -234
1071 -234 4160 -2255 -3576 4031 1337 -4894 872 4316 -3414 -2308 4899 300 -4600 3008 3622
1086 3622 -4473 -842 5103 -1859 -4036 4202 2032 -5994 833 4787 -3912 -2826 5425 -15 -5671
1101 -5671 2533 3966 -4543 -1023 5557 -1169 -4173 3810 2353 -4952 400 5030 -2848 -3662 4004
1116 4004 727 -5034 1681 4239 -4048 -2794 4822 -7 -4927 2878 4388 -4076 -1373 5208 -1627
1131 -1627 -4518 3718 2892 -4696 79 4585 -3099 -3849 4394 1404 -5096 1697 4131 -4094 -2599
$$ packed form
1026b876N272j177m703L863K568n434L36N605l653l749O169J012o869K846N857
1041E067o514k646P686j547p207N430M664p974m38P667l552n515O180K298o880
1056c281J815N842m676l250O454l71o466L838M730n882k372O971j276o863M553
1071b34M394o415j321P607k694o231N766L444p730J106P207m599m900P608O14
1086C622q095L631N945o962k177Q238k170q026O827L954q699J086Q251n440n656
1101e671Q204J433q509L520O580o726l004P983j457p305N352M630p878q14P666
1116D004l277n761O715K558q287J254P616m829m920P805J510q464K703O581o835
1131a627k891Q236q26p588M775M506p684p50Q243k990o500O793K434q225J495
$$ plain form
1146 -2599 5352 -192 -4535 3605 3698 -4992 -1456 5663 -1483 -4334 4622 2320 -5495 -93 4588
1161 4588 -3270 -3287 5271 789 -5747 1700 3779 -5048 -1457 6570 -608 -5085 3676 2476 -5454
1176 -5454 252 6382 -2593 -3731 4520 416 -6067 1677 5126 -3397 -2167 4626 -1203 -5427 2747
1191 2747 3293 -3867 -111 4962 -1829 -4248 3414 2299 -3767 876 4615 -3014 -4064 3461 1128
1206 1128 -4295 1779 4371 -3478 -3237 3778 271 -4768 3183 4325 -4117 -1928 4625 -1499 -4113
1221 -4113 4320 3209 -4938 -57 4524 -3722 -3863 5461 1462 -5374 1857 3737 -5122 -2001 5846
1236 5846 -376 -3902 3840 2339 -5641 -564 5026 -1841 -2561 4472 609 -5623 818 3529 -2912
1251 -2912 -1162 4345 -731 -4388 1541 2544 -3038 -22 4578 -915 -3964 1913 1828 -3367 323
$$ packed form
1146b599P951n544m343Q140R3q690L536P119p146k851Q956k302p815N402M681
1161D588p858j7Q558m482o536P447K079q827L591Q027p178m477Q761j200p930
1176e454N706O130q975j138Q251m104o483P744L449q523J230O793n829m224Q174
1191B747N46p160L756N073o791k419P662j115o066M643L739p629j050P525k333
1206A128n423O074K592p849K41P015l507n039P951J142q442K189O553o124k614
1221d113Q433j111q147M881M581q246j41R324l999o836P231J880q859L121P847
1236E846o222l526P742j501p980N077N590o867p20P033l863o232O441K711o441
1251b912J750N507n076l657N929J003n582L016M600n493l049N877q5n195L690
$$ plain form
1266 323 4525 -1369 -3345 2164 1049 -3837 1079 3909 -2519 -2519 2980 -439 -4410 2170 3749 -3084
1282 -3084 -1177 4312 -1355 -4214 3426 2542 -3813 429 3955 -2840 -2897 4018 767 -3604 1555 3172
1298 3172 -3711 -1959 3475 -406 -3137 2970 2190 -3723 -597 3274 -1515 -2484 3405 1553 -3489
1313 -3489 472 2535 -2450 -1687 3537 579 -3198 889 1909 -2825 -1000 3544 -451 -2568 1909
1328 1909 1310 -3021 120 3479 -1115 -2056 2488 731 -3436 412 2709 -1773 -1717 2553 -222 -3303
1344 -3303 1231 2295 -2327 -748 2886 -398 -2661 1808 1778 -2757 125 2639 -1293 -2329 2168
1359 2168 775 -2781 857 2414 -1852 -1762 2243 -155 -2499 1353 2175 -2347 -638 2406 -692 -2113
1375 -2113 2120 1221 -2460 315 2372 -1628 -1589 2227 268 -2223 755 1538 -1819 -855 1868 -9
$$ packed form
1266C23M202n894j976N509j115m886M916K830o428%N499l419l971O580J579o833
1282c084J907N489n667k859P640q84o355M242L526o795n7O915l251m371N159J617
1298C172o883J752N434l881k731O107p80n913L126L871m789r69N889j852n042
1313c489L961K063m985P63N224k958l777M087J020m734J825M544l995k117M477
1328A909n99m331L141L359m594r41M544j757m167L848K297m482N6M270k775l081
1344c303M534J064m622J579L634l284k263M469l0m535K882K514l932j036M497
1359B168j393l556L638J557m266R0M005k398k344L852Q22m522J709L044l098j421
1375b113M233q99l681K775K057m000L9L816j959k491K978P83l357R64K723j877
$$ plain form
1391 -9 -1701 1178 1333 -1717 -166 1716 -551 -1176 1222 840 -2057 242 1633 -727 -1132 1581 246
1408 246 -1734 330 1024 -1302 -754 1631 -230 -1561 942 1303 -1412 -394 1666 -273 -1317 1465
1424 1465 626 -1665 463 1436 -1209 -1004 1296 -221 -1564 492 1050 -1144 -298 1429 14 -1044
1440 -1044 1038 639 -1290 78 1044 -533 -956 709 620 -1125 41 972 -563 -466 850 209 -913
1457 -913 223 859 -690 -312 1074 -368 -797 679 580 -905 7 934 -147 -795 855 179 -1092
1474 -1092 163 791 -844 -529 952 -47 -751 316 640 -665 -209 609 -366 -290 185 37 -125 82
1492 82 310 -288 -265 297 -290 -467 -34 540 -414 -397 477 86 -357 270 -61 -237 -402 269 38 -303 321
1513 321 160 -312 -4 155 -402 -322 38 54 -406 -43 205 -540 -316 372 39 -156 269 431 -133 114 246
$$ packed form
1391ij692K879J55l050J551J882k267o25K398l82k897K299J391k360m05K713j335
1408B46j980K064O94k326N48K385j861j331K503L61k715J018K060j939j044K782
1424A465q39k291K128R73k645K05K300j517j343K056N58k194Q46J727j415j058
1440a044K082l99j929J368R66j577m23J665q9j745J166R31j535R7J316o41j122
1457i13J136O36j549L78J386j442m29J476r9j485R12R27j081o48J650o76j271
1474a092J255O28j635L15J481r99p04J067L24j305M56Q18r75P6M75j48j62K07
1492H2K28n98K3N62n87j77M33N74r54J7Q74l91m43O27l31j76j65O71k31l41O24
1513C21j61m72L08J59n57Q0L60J6m60L63K48p45K24O88l33j95M25J62n64K47J32
$$ plain form
1534 246 -14 -139 184 -94 -336 -53 44 -324 -82 5 -199 -21 -14 -99 377 82 -241 185 509 -43 -414 350
1556 350 175 -232 195 269 -390 -120 414 -329 -329 244 -48 -357 -39 441 -142 -228 298 -17 -214 349 315 -341
1578 -341 -35 125 -116 18 96 249 -577 25 591 -35 -254 102 273 -428 163 147 -106 -76 376 42 -133
1599 -133 61 253 -206 30 377 76 -286 -54 -172 -212 -200 289 66 -302 349 225 -298 -10 530 164 -143
1620 -143 426 -133 -231 236 26 -497 -35 522 -160 -388 336 453 -598 -99 210 -392 -390 609 112 -909
1640 -909 281 595 -414 54 461 -223 -538 614 223 -346 -61 328 -150 -261 408 144 -464 -69 445
1659 445 -289 -232 540 -75 -294 249 465 -216 -321 489 238 -311 124 303 -367 -169 565 -9 -526 349
1679 349 296 -338 256 523 -111 -296 442 103 -407 343 417 -425 -74 612 -415 -548 417 123 -507 -36
$$ packed form
1534B46k60j25L23k78k42K83R7l68K42Q7k04J78Pq5M76k95l23M26L24n52l71P64
1556C50j75m07M27P4o59K70N34p43%N73k92l09L18M80n83q6N26l15j97N63l4o56
1578c41L06J60k41J34P8J53q26O02N66o26k19L56J71p01N91j6k53L0M52l34j75
1599a33J94J92m59K36L47l01l62K32j18m0J2M89k23l68O51j24n23K88N40l66l07
1620a43N69n59r8M67k10n23M62N57o82k28P24J17j051M99L09o02KR99m97j021
1640i09J190L14j009M68M07o84l15J152l91n69K85L89m78j11O69k64o08L95N14
1659D45p34N7P72o15k19N43K16o81j05Q10k51n49M35J79o70J98P34n74n17Q75
1679C49n3o34N94K67o34j85P38l39n10P50P4q42L51O86j027j33R65k94o30M71
$$ plain form
1699 -36 366 -161 -383 372 11 -679 62 382 -465 99 529 -443 -237 362 103 -419 150 520 -549 -336
1719 -336 439 167 -337 -29 498 -379 -439 257 -134 -312 5 348 -315 -183 526 31 -390 269 372 -498
1739 -498 -37 462 -473 -526 584 274 -209 258 448 -319 -166 550 252 -534 23 205 -389 -158 428 35
1759 35 -32 381 -48 -642 -92 299 -244 -561 346 19 -460 249 230 -278 -194 521 -107 -405 217 449 -3
1780 -3 9 448 -243 -277 243 343 -293 84 431 -245 -131 406 -151 -230 160 -2 -272 -26 407 -192 -490 292
1802 292 117 76 159 359 36 -61 257 196 -265 76 211 -349 -200 492 58 -395 35 559 -404 37 93 -55
1824 -55 -64 329 198 -344 -191 60 -126 -34 415 -150 -356 192 438 -106 13 78 -104 -328 -67 82 -251 -48
1846 -48 495 102 -183 98 -142 -374 197 248 -105 -5 37 199 -100 29 467 -232 -188 18 -45 -224 268 25
$$ packed form
1699c6M02n27k22P55l61o90P41L20q47N64M30r72K06N99k59n22N69L70j069K13
1719c36P75k72n04L08N27q77o0O96l91j78L17L43o63J32P09m95m21O59J03q70
1739d98M61M99r35n3J110l10m83M67J90p67J53P16k98p86N57J82n94K31N86l93
1759C5o7M13m29n94N50L91n43l17R07l27m79P09j9n08Q4P15o28k98O22K32m52
1780cJ2M39o91l4N20J00o36L77L47o76J14N37n57p9L90j62k70K46M33n99k98P82
1802B92j75m1Q3K00l23r7L18o1m61L41J35n60J49O92m34m53M30N24r63M41N6j48
1824e5rL93j31n42J53K51j86R2M49n65k06N48K46n44J19O5j82k24K61J49l33K03
1846d8N43l93k85K81k40k32N71N1l53J00M2J62k99J29M38o99M4K06o3j79M92k43
$$ plain form
1868 25 -317 346 19 -152 -125 418 -180 -286 57 245 -169 -186 -145 42 -258 68 335 -156 -181 175 -197 -310
1890 -310 266 77 -197 37 17 -120 -253 -75 -119 -177 86 252 -333 126 570 27 -188 161 -68 -223 266
1911 266 365 -51 -299 290 130 -341 -104 178 -312 -277 306 112 6 167 41 101 -54 290 -123 -22 331
1932 331 150 -205 -227 232 66 -345 252 100 -433 190 132 -123 -234 41 -185 -367 174 42 -333 363 112
1953 112 25 -141 115 240 -264 -78 216 -187 -25 124 -28 -37 48 53 -363 45 62 -131 -246 20 -17 27 101
1976 101 319 286 -72 16 -14 111 -55 123 -107 -37 263 -177 15 12 205 -72 -68 216 -3 -193 314 109 -148
1999 -148 -56 133 -160 0 140 346 -321 34 14 -109 59 133 57 139 180 168 116 -14 -218 -155 22 111 66 136
2023 136 142 89 55 -110 183 -86 -336 -18 160 -170 -4 154 -20 162 -75 -33 106 -225 280 -107 -19 206
$$ packed form
1868B5l42O63l27j71K7N43n98j06L43J88m14j7M1J87l00L26K67m91k5L56l72j13
1890c10N76j89k74K34k0j37j33J78m4n8K63J66n85M59M44n43k15L49k29j55M89
1911B66R9m16k48N89j60m71K37K82m90L5N83j94j06J61j26O0j55L44m13J01L53
1932C31j81l55k2M59j66m11N97j52n33O23n8k55j11K75k26j82N41j32l75O96k51
1953A12q7j66K56J25n04J86K94m03J62J49j52rQ5Nm16M08J7j93j15K66l7M4P4
1976A01K18l3l58Q8l0J25j66J78k30P0L00m40J92lJ93k77MK84k19j90N07k05k57
1999a48R2J89k93J60J40K06o67L55k0j23J68P4p6Q2M1j2n2j30k04O3J77Q9m5P0
2023A36On3l4j65K93k69k50L18J78l30J66J58j74J82k37M2J39l31N05l87Q8K25
$$ plain form
2045 206 134 -92 42 -4 52 -30 -75 202 -148 -85 262 -59 60 -4 112 -204 -77 241 -156 95 183 -472 -42
2068 -42 -114 135 -34 168 11 -24 0 164 10 200 -74 31 -278 -204 -44 -7 -131 106 145 78 -198 -279 142
2091 142 -309 75 -23 16 -103 -182 9 -179 20 -175 -101 -271 -257 -166 -67 -111 -72 72 -12 -7 -218 4 -240 20
2115 20 134 -128 117 15 -18 197 -199 -90 62 -23 83 -126 -86 -236 -10 133 114 -8 184 -16 -15 128
2137 128 -54 -64 -154 154 188 36 48 -18 36 -192 46 -228 119 91 30 -74 -196 -42 121 142 -90 -256 -253 -15
2161 -15 -19 153 184 41 -122 112 -145 -156 198 -140 131 169 228 -26 48 144 -138 -189 -133 -156 121 17 120 -51
2185 -51 55 18 21 -61 -32 43 -127 -42 -44 80 -17 -93 -273 -226 -386 -173 -80 -107 91 270 -37 4 166 -19 -162
2210 -162 66 -29 78 -20 328 274 -16 68 0 43 -186 -50 13 344 -22 -126 -215 126 37 146 -5 82 -130
$$ packed form
2045B06p2k26J34m6N6q2m5K77l50O3L47l21J19o4J16l16J27L18l97K51Q8o55M30
2068d2p2K49j69K02j57l5K4J64j54J90k74J05l09P4J60L7j24K37L9o7k76q1M21
2091A42m51L84r8L9j19p9J91j88J99j95P4j70J4R1R9m4L9J44q4Nk11K22k44K60
2115B0J14k62K45j02l3K15l96J09J52q5J06k09M0j50K26J43j9j22J92k00JJ43
2137A28j82j0r0L08L4j52J2o6N4k28K38k74L47k8o1j04j22J54J63K1k32j66LK38
2161a5mJ72L1j43j63K34k57j1L54l38K71L8N9k54P4R6k82n1N6k3K77j04J03j71
2185e1J06l7Lq2K9P5j70Q5kJ24r7p6j80M7j60K13R3k7J98J79l07M1J62j85j43
2210a62K28r5J07r8L48n4k90Q4o8M3k29J36O3L31l66j04q9L41q9J09j51Q7k12
$$ plain form
2233 -130 185 -134 -6 0 -48 85 -214 -84 -120 29 104 -107 4 316 188 -13 -78 92 -38 -50 188 54
2255 54 -179 112 86 -118 88 -87 -123 121 -158 68 -42 143 24 65 331 76 -79 0 27 97 -115 -57 59
2278 59 13 118 -158 3 181 11 135 -18 -72 -77 83 -305 157 244 -234 -31 -317 -4 -155 -138 47 -25 42
2301 42 20 -12 53 -23 -104 29 -41 42 -198 155 163 49 175 239 31 -120 -256 -46 44 -8 197 -48 -102 123 -114
2326 -114 85 223 272 247 -241 97 -6 133 112 246 -227 -124 -9 199 213 -162 194 -45 3 161 -63 -10
2348 -10 -94 162 -2 21 84 -122 -310 182 83 58 137 -103 101 25 218 -136 56 -94 177 -47 86 -89 257
2371 257 -104 -16 207 -166 142 397 -149 59 127 -110 -207 -127 5 -132 164 -217 10 -175 192 -88 -80 148
2393 148 -39 134 48 99 69 -177 150 131 244 -53 -99 -14 -140 249 123 -254 1 157 83 -114 -10 183
$$ packed form
2233a30L15l19J28Om8J33k99J30l6J49P5k11J11L12j28k01o5J70j30j2K38j34
2255E4k33K91k6k04K06j75l6K44k79K26j10J85j19M1K66k55j55P9K7P0k12N8J16
2278E9m6J05k76J61J78j70J24j53n4nJ60l88M62Q7m78K03k86L13j51J7J85p2O7
2301D2k2l2O5p6q1J33p0Q3k40L53Qj14J26O4k08j51j36K10R0n2K05k45n4K25k37
2326a14J99J38M9k5m88L38j03J39k1J34m73J03J15K08J4l75L56k39M8J58k24N3
2348a0q4K56j64K3O3k06j88M92r9k5P9k40K04p6J93l54J92j50K71k24J33j75L46
2371B57l61Q8K23l73L08K55n46K08O8k37r7Q0J32j37K96l81K27j85L67k80QK28
2393A48j87J73q6N1l0k46L27j9J13k97m6Q5j26L89j26l77K55J56p4j97J04J93
$$ plain form
2415 183 -111 215 0 -425 -366 -186 -316 -30 45 9 -41 -342 -162 -112 -315 80 213 -41 181 297 -108 159
2437 159 319 -193 19 -59 -123 -288 59 -73 -2 -548 72 70 -320 40 165 174 -61 135 192 -62 0 20 17 -170
2461 -170 -10 -4 20 314 -26 157 55 -278 31 -246 -243 237 -32 35 -250 -296 -302 11 27 -4 -216 107 -230 -216
2485 -216 418 91 164 72 192 -155 128 130 41 -153 336 82 -13 123 -66 -130 -34 -214 20 -277 -87 103 -326
2508 -326 -91 65 10 85 39 216 -58 -1 -49 -93 -290 396 32 -4 231 189 46 82 -136 19 -105 -448 196
2531 196 -200 201 154 99 264 376 107 -273 168 40 -96 -353 105 156 -172 123 214 105 200 65 5 -272
2553 -272 -38 125 -135 -45 167 42 -139 193 200 -157 176 -172 -238 59 -50 104 -169 -91 280 42 -146 232
2575 232 134 -244 18 234 -214 142 125 288 206 -215 -70 -135 257 124 -24 120 290 -75 18 37 142 -219
$$ packed form
2415A83k94L26k15m25N9J80j30K86P5l6n0l01J80N0k03L95J33k54K22J16m05K67
2437A59J60n12K12p8o4j65L47j32P1n46O20kl90L60J25Rk35J96N7k54O2K0lj87
2461a70J60OK4K94l40J83j02l33L09k77LM80k69O7k85m6oL13J6l1k12L23l37J4
2485b16O34l27P3r2J20l47K83Kq9j94M89k54r5J36j89o4R6j80K34k97J90J90m29
2508c26K35J56n5P5m6J77k74N7m8m4j97O86l64l6K35m2j43L6k18J55j24l43O44
2531A96l96M01m7n5J65J12k69l80M41j28j36k57M58N1l28K95R1j09R5j35o0k77
2553b72K34J63k60R0K12j25j81L32Pl57L33l48o6K97j09J54k73P8L71k38j88L78
2575B32r8l78K62K16m48L56j7J63q2m21J45o5L92j33j48J44J70l65R3J9J05l61
$$ plain form
2597 -219 86 141 124 -309 -68 209 -302 72 85 27 -191 -272 -224 114 14 39 42 -192 -54 227 74 -202 113
2620 113 -148 35 56 -240 -272 335 -100 -262 -102 4 82 -137 -395 40 -60 -190 -56 96 171 112 101 -54
2642 -54 193 178 -70 -289 120 -75 25 193 -121 60 -77 -1 46 5 15 172 57 -235 -141 -75 23 98 -162
2665 -162 -91 -161 235 -113 -108 -85 -84 108 -138 102 -60 -26 207 15 45 -30 -34 -107 -300 103 148 -110 107 -23 164
2690 164 -182 279 -118 -114 72 -195 37 -24 25 129 -17 90 58 179 137 -88 -144 218 -13 146 98 -57 81
2713 81 -181 -5 148 -125 -119 315 -7 -85 -137 -16 38 -231 6 98 -9 172 -21 -60 -64 -44 -57 -72 130 -63
2737 -63 94 142 47 46 -160 -77 288 -10 62 83 -109 118 140 -130 -164 -3 168 -178 -263 -184 191 -49 94 4
2761 4 201 -19 -242 -200 -11 -332 -69 -78 -68 172 -23 101 -271 47 393 -141 -7 65 100 15 -272 316 94
$$ packed form
2597b19L05N5j7m33K41K77n11L74J3n8k18q1M8L38j00K5Lk34J38K81j53k76L15
2620A13k61J83K1k96l2O07m35j62J60J06P8k19k58M35j00j30J34J52P5n9j1j55
2642e4K47j5k48k19M09j95J00J68l14J81j37P6M7m1J0J57j15k92R4O6R8P5k60
2665a62P1p0L96l48NK3JJ92k46K40j62L4K33j92L0p5mp3j93M03M5k58K17j30J87
2690A64l46M61l97MJ86k67K32o1M9J04j46J07l2J21m2k25n6L62k31J59m8j55J38
2713H1k62J76J53k73OM34l22p8n2J21N4k69K37R2j07J81j93l9mK0j3j5K02j93
2737f3J57M8r5jk06Q3L65k98P2K1j92K27K2k70l4J61J71l46q5P9L75k40J43r0
2761DJ97k20k23M2J89l21K63rJ0K40j95J24l72L18L46n34J34P2L5q5k87N88k22
$$ plain form
2784 94 6 -18 263 202 -71 46 -119 149 9 -107 14 146 -76 90 135 -235 -95 -6 303 48 -235 21
2806 21 -103 232 -250 192 -271 -135 -42 294 239 -239 248 -91 113 -4 -13 -47 -197 246 -406 -372 174 130 132
2829 132 -70 -7 -49 117 -40 69 -109 -59 -78 -89 -32 128 -118 -142 45 340 -57 55 -125 50 137 12 129
2852 129 -186 221 157 38 -116 470 -59 -414 279 19 -329 -70 171 -250 -97 -49 61 -77 6 204 -66
2873 -66 -162 98 78 -157 132 252 240 -17 53 -29 -157 250 -176 9 -64 117 -73 -360 126 -11 78 296 364
2896 364 -141 -262 61 247 -8 127 98 -108 -218 -11 -268 -285 -97 109 81 82 -118 15 129 305 256 -329
2918 -329 218 31 -101 -328 93 -53 -120 -107 35 257 -113 -119 -118 -300 187 -69 58 77 290 34 -34 230 148
2941 148 -148 -40 113 -169 188 512 111 -249 18 -144 6 -21 -32 -270 -29 139 109 -412 47 111 85 -28
$$ packed form
2784I4q8k4K81o1k73J17j65K68j40j16J21J32k22J66M5l70J40Q9L09k55k83K56
2806B1j24L35m82M42m63J36R3L36n5m78M87l39K04j17rl4j50M43o52L4N46m4K
2829A32k02O3m2J66j57J09j78N0j9j1N7J60k46k4J87K95l97J12j80J75Q7j25J17
2852A29l15M07o4j19j54N86n29l55O93k60l48K59K41m21J53M8J10j38Q3J98k70
2873f6r6K60k0k35K89J20j2k57P0q2j28M07m26J85p3J81j90k87M86j37Q9K18O8
2896C64n05j21L23J86k55J35k9k06j10K07k57j7J88K06k8Jk00J33J14J76m9n85
2918c29N47j87j32k27M21j46o7J3J42K22l70oJj82M87k56J27J9K13k56o8K64q2
2941A48k96J08J53k82L57L24m01l60K67j62J50k7j1k38K41J68l0n21M59O4k6j13
$$ plain form
2963 -28 286 -241 34 120 199 -81 -53 -88 -147 -159 -175 318 -197 161 -7 41 95 199 132 -441 -144 151 -47 -127
2987 -127 81 -147 -143 162 47 -109 -300 492 -122 -5 278 82 -204 56 333 -124 -196 151 319 -79 -190
3008 -190 187 -71 -61 224 -28 -355 -133 270 -268 97 233 140 -274 252 89 -114 94 389 265 -33 106
3029 106 -147 -321 61 304 -180 -312 -4 -306 -361 -305 139 -154 -168 57 -140 -241 114 99 -44 188 45
3050 45 -68 -111 103 60 -338 184 64 -214 177 219 199 -112 -133 12 -96 54 231 19 -29 -36 111 -50 -4
3073 -4 413 -98 -6 21 80 -196 29 136 22 176 200 99 -70 -134 191 -38 91 202 -195 -302 77 148 -352
3096 -352 138 273 -106 58 112 -203 -183 74 17 -211 159 522 135 -108 75 149 -86 70 228 60 22 16
3118 16 398 -49 19 53 -89 -183 306 27 157 -88 106 46 -313 199 -103 -138 53 -11 -78 131 88 -73 -92
$$ packed form
2963b8L14n27K75Q6P9k80K8l5n9j2j6M93n15L58j68M8N4J04o7n73K97K95j98q0
2987a27K08k28ML05j15j56j91P92o14J17K83j96k86K60K77m57p2L47J68l98j11
3008a90L77k58J0K85k52l27K22M03n38L65J36r3m14N26j63k03K08K95j24k98J39
3029A06k53j74L82K43m84j32L08l02n5N6M44k93j4K25j97j01L55j5j43K32j43
3050D5j13m3K14m3l98N22j20k78L91M2k0l11k1J45j08J50J77k12m8pJ47j61M6
3073dM17n11R2K7N9k76K25J07j14J54K4j01j69o4L25k29J29J11l97j07L79P1n00
3096c52M90J35l79J64N4l15K0K57n7k28L70L63l87k43J83P4k35J56J58j68l8o
3118A6L82m47O8L4j42r4M89k79J30k45J94o0l59N12l02l5J91o4o7K09m3j61j9
$$ plain form
3141 -92 46 214 64 221 -20 -199 -14 395 3 -77 226 -122 -25 -116 126 -45 43 -71 126 -15 -130 26
3163 26 -193 17 113 -101 -119 -75 64 -349 38 53 -67 59 212 229 -55 120 -74 -16 -187 -301 129 -11
3185 -11 -64 139 103 -166 -66 54 -352 96 78 -174 -1 77 -101 246 -120 -85 -106 169 -37 89 19 99 165
3208 165 151 -134 176 -320 -263 102 -40 -127 -111 -192 233 150 102 -101 50 52 -79 150 -212 54 -210 -85 -108
3231 -108 -19 -98 16 -80 -77 264 220 75 106 116 17 -58 -349 131 -403 -263 44 -64 -7 89 0 -107 -12 30 79
3256 79 -102 86 -30 -242 -152 116 69 -235 189 -44 69 196 62 -237 -15 279 312 -63 50 198 6
3277 6 85 94 121 80 -17 -24 -198 -201 120 1 30 138 -36 -12 -137 -33 204 -274 -6 -271 -145 -68 229 -10 364
3302 364 69 -109 185 -25 12 181 -65 -179 153 139 -289 56 -97 7 -6 6 -315 -135 -223 -47 126 -108
$$ packed form
3141i2J38J68j50J57k41j79J85M09l92q0L03l48R7r1K42j71Q8j14J97j41j15J56
3163B6k19K10R6k14j8M4J39m13L87J5j20J26J53J7k84J75j94N8j71j14M30j40
3185a1n3K03l6k69J00J20m06M48j8k52J73P8j78L47l66L5k1K75k06J26p0Q0O6
3208A65j4k85L10m96N7L65j42q7J6q1M25q3m8k03J51Kj31K29l62K66k64J25k3
3231a08Q9p9J14r6LL41m4j45L1J0r9p5k91M80n34J40L07j08N7R6q9j07R5M2M9
3256G9j81J88j16k12R0K68m7l04M24k33J13J27j34k99K22K94L3l75J13J48j92
3277FP9RK7m1r7pj74lL21j19K9J08j74K4j25J04K37m78K68k65J26P7K97k39L74
3302C64k95j78K94k10L7J69k46j14L32j4m28L45j53J04j3J2l21J80q8J76J73k34
$$ plain form
3324 -108 124 -102 -215 129 -174 -83 -141 -34 168 92 -111 -232 220 -261 -63 -57 96 -159 -190 208 -64 111
3346 111 -165 -18 -81 29 -177 19 -229 -121 49 104 -118 34 -139 41 9 -82 -106 -2 -67 266 31 -179
3368 -179 35 37 -267 -1 -109 99 -236 23 88 -281 30 -55 -4 -64 -83 -72 -102 155 -44 -152 195 157 14
3391 14 -199 50 149 -71 28 128 -27 -296 -5 -72 82 -111 30 -35 -45 -66 -177 -153 32 141 -49 -130 336
3414 336 -143 -166 352 264 -78 -165 -9 9 45 200 -257 -25 180 -2 51 -59 314 44 -143 84 223 -114
3436 -114 -22 25 96 -219 184 -120 -135 -111 222 -80 40 -158 178 -54 43 -64 -6 381 117 410 23 339
3458 339 -43 3 257 186 -237 -87 39 45 -57 146 280 -134 -136 -81 -311 -68 221 216 63 -52 106 -2 -186
3481 -186 177 13 -198 -91 323 -163 -198 254 194 55 243 211 6 63 151 -378 -17 369 -29 -158 -121 176
$$ packed form
3324a08K32k26j13L44l03R1n8J07K02p6k03j21M52m81J98OJ53k55l1L98k72J75
3346A11k76J47o3J10k06J96k48J08J70N5k22J52j73J80l2r1k4J04o5L33k35k10
3368a79K14Kl04K66j08K08l35K59O5l69L11q5N1o0j9J1l0K57j99j08L47l8j43
3391A4k13K49R9k20R9J00j55k69K91o7J54j93J41o5j0k1j11K4J85J09j90q1M66
3414C36m79k3N18q8l42q7J56J8L6J55m57K32K05j82N3j10L73k70j87K27J39l37
3436a14R2M7P1l15M03l04j5K4L33l02J20j98L36k32R7j07N8L87k64K93l87L16
3458C39l82M6K54p1m23J50J26Oj02K03J34m14kN5k30K43K89nj53j15J58j08j84
3481a86L63j64k11J07M14m86l5M52o0j39J88l2k05N7Q8n29L61L86l98j29L7K97
$$ plain form
3503 176 81 -150 154 -25 9 -83 14 -74 153 79 -118 -163 -147 234 -60 -253 -116 -216 -279 119 -76 -165 -222 430
3527 430 -70 51 114 -143 62 147 -73 -35 0 350 194 -44 130 99 2 -142 20 -21 -10 228 262 -108 -136
3550 -136 -194 113 -126 -62 -94 -133 -98 16 83 -3 298 45 -338 -44 -165 -45 73 31 -332 -44 351 -288 -92
3573 -92 -40 -130 8 -210 258 -90 -98 209 62 -346 39 103 -243 76 249 -79 -141 -26 -190 15 99 77 -54
3596 -54 -81 232 75 -116 -15 271 -169 -178 71 66 -2 -166 191 -10 -53 235 0 -49 -122 -20 92 -75 70
3619 70 135 -299 -16 221 -122 124 -7 208 -173 226 -305 -107 -69 -179 -170 -85 -71 -75 -136 -139 63 60 -7 40 -32 -7
3645 -7 77 39 -64 25 -68 -168 -271 -18 120 -275 88 288 56 38 -14 -87 -238 -40 23 -327 -36 140 -188
3668 -188 -96 272 241 -210 -158 14 -157 -63 317 -36 -84 19 124 -126 216 202 -261 -261 122 -49 -217 -206 155
$$ packed form
3503A76r5k31L04j79L4r2R7q8K27p4j97m5J6L81k94j93J37j00o3L98j95q9n7O52
3527D30n00J21O3k57K05Q5k20L8L5L50j56k38J74l1r7j44J62m1J1K38L4l70k8
3550a36n8L07k39O4l2l9L5J14O7q6L01k53l83K94j21J20J18m2l63K88L95o39J96
3573i2N2r0J38k18M68l48qL07j47m08L85O4l46L19J73l28o2J15j64K05Q4k2j31
3596e4k7L13j57j91J01K86m40rK49no8j64L57k01m3K88k35m9p3J02J12j67J45
3619G0O5m34K83K37l43K46j31K15l81L99n31J98L8j10RQ5J4mo1lK02lo7M7p2K5
3645gQ4l8j03Q9r3j00j03K53J38l95L63K00k32j8n2p3j51J98O3l50K91J76l28
3668a88R2L68l1m51N2J72j71R4L80l53m8J03J05k50L42j4m63%L83j71j68J1L61
$$ plain form
3691 155 98 -305 -194 -170 -165 197 102 -89 -166 413 20 110 194 190 -117 -15 167 25 -83 -66 587 123 -210 185
3715 185 -175 -66 62 -221 -345 -77 92 53 11 24 -197 -102 -49 52 4 -137 -35 205 -153 354 103 -1
3737 -1 -93 57 -220 -235 217 -23 -29 160 363 -79 -189 -91 -48 -151 203 347 -180 -107 223 208 61 378 231
3760 231 -211 9 -17 -97 17 28 -21 -159 152 -113 82 -58 71 -338 -129 128 -36 94 15 89 -152 -99
3782 -99 -63 288 54 138 267 -77 99 -57 -301 -110 308 -55 -216 -209 -15 -100 32 98 -6 203 -5 312
3804 312 -81 141 -19 185 11 279 -12 -1 -27 92 140 101 -298 -110 -9 -174 119 405 31 165 -209
3825 -209 308 -440 53 -162 86 364 356 119 -40 -157 67 -188 -172 68 -147 377 -170 -125 -35 318 19 -10
3847 -10 137 -55 -186 140 -133 -413 11 22 -104 -364 -4 41 238 15 196 304 18 -134 -64 94 -36
$$ packed form
3691A55n7m03J11K4NL62r5j91p7N79l93R0Q4ml07J02J82j42j08J7O53m64l33L95
3715A85l60J09J28k83j24K68J69l9m2J3k21R5N3J01m8j41J02K40l58N07k51j04
3737ar2J50k77j5M52k40oJ89K03m42j10R8M3j03L54J44n27P3L30j5j47L17j47
3760B31m42K20k6q0J14J1m9j38L11k65J95j40J29m09K09K57j64J30p9P4k41N3
3782i9L6L51k34Q4J29l44J76j56k44J91M18l63j61PJ94q5J32O6j04K09k08L17
3804C12l93K22j60K04j74K68k91J1k6J19M8l9l99J88J01j65K93K86l74J34l74
3825b09N17p48M93k15K48K78qk37j59j17K24k55J6K40k15N24n47M5R0L53k99k9
3847a0J47j92j31L26k73k80M24J1j26k60L60M5J97k23J81J08k86j52P0J58j30
$$ plain form
3868 -36 -49 23 -79 -61 -343 57 -31 63 7 -84 -107 -13 41 -50 155 64 231 -36 -137 -275 41 66 71 78 -147 -105
3894 -105 -80 -116 -138 61 -32 157 -88 -84 -132 -143 -124 -41 -47 150 -67 0 -147 -197 -20 -114 70 -143 76 157 -159
3919 -159 -57 -195 149 -255 -40 -141 128 -6 -98 -173 177 5 -44 -40 -124 21 104 87 -3 -112 75 133 205 268
3943 268 -176 -55 -115 -104 -5 -158 -129 84 185 -261 7 141 185 18 17 22 -127 115 -99 37 182 375 248
3966 248 304 8 26 -107 81 -10 -62 89 215 289 -31 112 287 -46 85 -232 -145 180 230 -276 -64 76
3988 76 -68 264 284 -64 213 -224 251 6 -218 171 318 -136 66 122 -237 224 173 -94 -82 38 -124 3
4010 3 -113 -203 168 110 -57 -247 -145 32 -255 86 46 -155 -32 -149 -83 144 214 86 16 -52 -83 -7 50 -242
4034 -242 37 30 -61 -84 -90 -62 80 230 46 135 132 186 -118 167 -57 144 -192 75 79 34 100 170 -147 342 -7
$$ packed form
3868c6j3P2j02J8k82M00q8R4n6r1k3R4N4r1K05r1J67k67j01j38L16K5NPk25M2
3894a05K5l6k2J99r3J89k45Mm8j1J9Q3oJ97k17O7j47n0J77r4J84k13K19Q1l16
3919a59J02j38L44m04K15j01K69j34r2p5L50j72m9Mq4J45Q3j7r0j09J87N8P2O3
3943B68m44J21o0J1R9j53K9K13J01m46K68J34M4j67jNj49K42k14J36J45J93j27
3966B48N6k96J8j33J88r1n2J51J26P4l20J43J75l33J31l17Q7L25N0n06K12J40
3988G6j44L32K0l48K77m37M75k45k24L89J47m54K02N6l59M61n1k67J2J20j62J27
4010Cj16r0L71n8j67j90J02J77k87L41m0k01J23j17O6K27P0j28p0o8l1P6N7k92
4034b42K79pr1k3oK8J42J50j84Q9lN4l04K85k24K01l36K67Mm5O6P0l17M89l49
$$ plain form
4059 -7 -373 -6 95 22 73 163 -251 -52 -183 -99 -93 124 66 146 10 -144 316 -123 18 70 -18 -253 82 30
4083 30 -113 -103 -3 87 -174 -114 115 35 -20 -182 -75 -80 120 -218 -179 -30 185 8 96 -11 142 -149 -216 36
4107 36 38 155 55 -238 -108 62 -16 51 149 181 -84 -133 -120 79 332 96 -121 92 152 159 -15 -26 -42 -45 114
4132 114 -167 -115 167 8 30 217 185 -84 193 32 -351 -149 -25 63 71 205 -8 -204 10 -77 172 109 -73
4155 -73 -78 -129 29 -56 -200 2 -42 -219 -257 -135 156 12 -14 -39 -123 -203 113 -143 -31 -200 -197 -89 92 54 -37
4180 -37 121 52 -27 45 73 28 49 -71 170 321 79 171 -329 -83 -184 184 78 -42 76 -68 82 -112 121
4203 121 -237 11 98 124 -20 145 152 96 -155 -2 20 92 -193 222 212 173 63 63 -60 184 151 -119 243 -143
4227 -143 -17 147 69 -135 -173 -7 -160 -58 149 130 16 -161 244 -240 -181 -150 227 48 140 -85 169 102
$$ packed form
4059gl66L67J01p3N1R0m14J99j31Q4OK17n8Q0j36j54M60m39J41N2q8k35L35n2
4083C0j43J0J00R0k61O0K29q0n5j62J07nK00l38L9J49K15j77Q8j07J53k91o7K52
4107C6KJ17j00k93J30J70p8O7R8L2k65m9J3J99K53k36k17K13O0Pj74j1j6lJ59
4132A14k81N2K82j59K2J87l2k69K77j61l83K02J24Q8QJ34k13j96K14q7K49o3j82
4155g3nn1J58q5j44K02m4j77l8J22K91j44k6k5q4q0L16k56J12j69LJ08J81l8r1
4180c7J58o9p9P2K8m5K1j20K41J51k42R2n00K46j01L68j06j20J18j44J50j94K33
4203A21l58K48Q7K6j44J65Pn6k51J53K2P2k85M15j0l9j10%j23K44l3k70L62l86
4227a43J26J64p8k04l8J66j53J02K07j9j14j77M05m84N9L1L77j79R2k25K54o7
$$ plain form
4249 102 -162 6 -32 -113 54 -4 110 -12 -31 -294 92 50 -132 169 -13 263 -101 42 135 -103 65 133
4271 133 73 -205 -117 145 -145 -223 130 -63 177 155 41 49 -4 -76 278 63 -185 83 216 -81 -96 -128 64
4294 64 -129 -19 -240 -75 91 44 51 44 76 -141 -284 235 -38 -185 -59 56 -140 -98 -201 -8 -81 -48 -305
4317 -305 -110 166 65 -28 14 -42 -172 -47 -85 -10 -211 -12 89 -153 -175 -86 -142 135 187 217 10 33 -122 -55
4341 -55 5 46 14 -210 -73 -7 116 134 65 200 11 47 -77 -33 157 31 115 47 168 36 7 48 14 178 -153
4366 -153 -118 -68 132 -161 38 178 197 -36 86 -141 -195 -24 345 -292 -130 -9 -104 3 339 85 -149 63
4388 63 106 277 7 293 75 60 48 -13 -245 18 -18 -77 272 -164 182 131 -167 -131 -56 -103 -22 38 129 110 221
4413 221 -26 148 -57 180 -349 -22 -85 -103 -14 -221 -8 112 19 -178 -14 51 -31 14 -116 18 55 -210 -72
$$ packed form
4249A02k64J68l8q1J67n8J14j22j9k63L86m2j82L01j82K76l64J43R3k38J68O8
4271A33o0k78Q8K62k90p8L53j93K40k2j14Qn3p2L54k15k48K68J33k97j5l2J92
4294F4j93J10k21J65J66m7PpL2k17j43N19k73j47J26J15j96M2j03J93p3L3k57
4317c05J95K76j01r3M2n6j30J25l8P5k01J99J01k42k2Q9n6K77N2L0k07K3j55O7
4341e5O0M1l2k24J37O6J23J8o9J35j89L6j24M4J90j26Q4o8J21j32k9M1l4J64l31
4366a53L5N0K00k93J99J40J9k33J22k27n4J71L69o37J62J21r5J07L36k54k34K12
4388F3M3J71k70K86k18j5j2o1k32K63l6n9L49m36L46n1k98L6P5m7Q1O0R1j9J11
4413B21k47J74k05K37n29L27o3j8Q9k07K13J20r3j97J64O5q2M5j30J34L7k65J38
$$ plain form
4436 -72 -419 -251 -201 60 -169 -88 111 -32 -106 -207 166 -313 33 346 -42 1 57 25 -309 168 183 151 49
4459 49 -334 -7 10 -139 34 113 292 63 29 -182 135 143 218 -108 -198 139 -75 -95 -77 287 -64 -214 -198 204
4483 204 -129 134 368 -125 50 23 -19 69 -62 -32 1 119 204 113 183 212 102 -27 -378 -13 -67 -139 -195 -94
4507 -94 -24 -254 146 12 -111 2 150 -180 -137 112 -284 209 -144 -31 -123 47 55 408 42 -79 32 48
4529 48 -79 -39 13 41 -31 -9 134 -158 148 5 -106 -23 -266 -300 82 -236 -196 17 59 -110 70 108 98 194
4553 194 147 255 -134 -171 -48 -148 -93 99 65 -35 -167 107 50 -80 6 193 -236 63 194 40 1 199
4575 199 38 33 -202 -175 200 126 110 147 45 -163 -185 -176 142 268 -39 -151 -344 17 -12 -164 186 87 -132 -47
4599 -47 -157 -222 26 73 136 -126 304 149 222 -21 75 -176 124 -23 -82 64 -58 -352 12 25 -99 228 -121
$$ packed form
4436g2l47J68N0K61k29Q1J99j43p4j01L73m79L46L13l88M3N6l2l34M77J5l2j02
4459D9l83L27J7j49J73P9J79k29l4k11L17QP5l26r0L37k14k0J8L64l51j50J6M02
4483B04l33K63K34m93J75k7m2Q8j31L0L3J18Q5r1P0K9j10j29l51L65n4p2n6J01
4507i4P0k30M00j34j23J13J48l30M3K49l96M93l53J13r2J70QL53l66j21J11J6
4529D8j27M0N2K8p2K2J43k92L06j43j11Q3k43l4L82l18M0K13M2j69J80L8j0R6
4553A94m7J08l89l7J23j00N5J92l4j00j32K74n7j30Q6J87m29K99J31j54l9J98
4575A99j61nk35K7L75p4j6L7j02k08k2RL18J26l07j12j93L61k9j52L50r9k19Q5
4599d7j10o5K48M7O3k62M30j55P3k43R6k51L00j47n9J46j22k94L64J3j24L27l49
$$ plain form
4622 -121 -149 46 -113 447 104 -266 232 293 -42 -186 154 51 32 -104 -407 60 88 -35 125 158 -47 -183
4644 -183 94 165 -46 -28 12 74 51 35 -96 -25 -171 171 227 79 81 -72 -56 100 -331 68 -127 3 -54 163
4668 163 69 91 311 73 64 93 -78 -299 -86 121 24 141 -159 29 -164 283 -161 -98 -306 34 23 114 -55
4691 -55 -64 -32 -41 207 112 -165 92 128 -340 96 166 243 55 -156 122 -98 85 -24 -67 -48 -73 140 -120 34
4715 34 312 191 -175 77 57 -96 45 297 -97 -197 198 142 122 -50 -94 -62 9 113 41 -159 -364 -138 -13
4738 -13 -184 29 -390 -38 139 28 473 -233 -188 -179 132 -134 -93 -172 8 -9 188 -65 8 -30 -27 105 151 -79
4762 -79 -249 122 140 211 -4 -108 -191 6 40 -20 -159 -84 -138 -56 233 -75 107 291 205 71 -194 -31 58 -104
4786 -104 82 -50 -185 73 72 88 159 -74 -5 113 53 -96 0 170 177 162 -83 34 173 9 -5 17 5 -66 37
$$ packed form
4622a21k8J95j59N60l43l70M98O1l35j44L40j03j9j36l03M67K8j23J60L3k05j36
4644a83K77P1k11J8M0O2k3j6j31P1j46L42N6j48Kj53J6J56m31L99j95J30n7K17
4668A63r4K2K20k38rK9j71k21K13K07r7J17l00J88j93M47m44O3k08L40j1R1j69
4691e5rL2rK48r5k77K57L6m68M36P0P7j88k11K78k20J83j09m3J9k5K13k60J54
4715C4K78j21l66K52k0j53J41K52l94j00L95n6k0j72m4L2P1J04p2k00k05K26J25
4738a3j71K13m19L52J77j11M45p06M5RL11k66M1p9J80j7J97k53P3l8LJ32M6k30
4762g9j70L71J8P1k15j04q3J97L4o0j39P5n4Q2K89l08J82J84q6j34k65J63Q9j62
4786a04J86j32j35K58jJ6P1k33O9J18o0j49R6J70Pj5k45J17J39j64j4K2j2p1J03
$$ plain form
4811 37 77 147 29 -69 109 -114 -3 39 -7 95 -189 72 -119 60 102 245 136 214 -4 129 28 -34 -103
4834 -103 -45 400 33 -16 169 -188 -108 73 -354 -50 -48 8 71 111 -200 -288 -221 -19 -81 -225 -158 -207 -124 97 47
4859 47 -53 340 97 266 -79 -108 -81 -85 71 249 -205 19 -78 14 -54 91 162 -32 -30 170 -121 -84 103 113
4883 113 -242 38 -93 -186 65 -283 47 -85 72 70 270 -91 233 -115 192 -173 -313 -52 -36 -117 102 -38
4905 -38 -169 -31 66 -80 118 44 167 -195 -206 168 5 -253 270 144 142 235 -4 -48 44 104 -8 120 -27
4928 -27 25 -247 -104 153 -95 -238 -4 93 -398 -160 14 -187 0 -26 131 -113 178 -48 349 -32 -102 -203
4950 -203 -251 264 174 -323 -201 212 -5 -81 78 41 181 36 82 223 -85 -32 -91 8 -51 148 -28 -57 210
4973 210 -375 194 -24 -38 -55 -11 79 -70 -290 408 83 24 -39 -262 -28 29 92 93 205 40 -188 -309 -84
$$ packed form
4811C7M0P0j18r8J78k23J11M2m6J02k84K61j91J79M2J43j09P8k18J33j01o2o9
4834a03N8M45l67m9J85l57Q0J81m27L04KN6O3M0l11q8O7K02o2j44O7m9Q3K21n0
4859D7j00L93k43J69l45k9K7mJ56J78m54K24r7R2o8J45P1j94KK00k91L7J87J0
4883A13l55K80j31r3K51l48L30j32J57kK00l61L24l48L07l65j40K61J6q1K19j40
4905c8j31J38R7j46J98p4J23l62j1L74j63k58N23j26kR3k39m4R2O0j12J28j47
4928b7N2k72J43K57k48j43K34R7m91K38J74k01J87k6J57k44K91k26L97l81p0j01
4950b03m8N15r0m97J22M13k17p6J59l7J40j45M6J41l08N3n9R9n9J99j76k9K67
4973B10n85N69k18j4j7M4R0j49k20O98l25n9o3k23K34N7O3JJ12j65k28j21K25
$$ plain form
4996 -84 -104 -90 44 172 258 -226 -142 97 103 -77 101 -70 155 142 287 -289 -30 222 86 40 -323 -218 -21
5019 -21 -40 141 83 -35 36 216 -106 175 122 293 -68 161 48 142 -195 -196 21 -153 -220 -46 -78 5 -142 -31
5043 -31 153 -94 -148 -232 -38 276 125 138 -52 -147 -141 -355 112 61 -121 55 -77 -45 254 -132 -195 64 104 132
5067 132 229 -199 -83 -66 115 -103 -146 45 -123 17 -288 -250 46 201 151 43 178 124 -104 95 -30 -84
5089 -84 254 -254 -1 67 -305 50 -49 -270 -111 -37 95 84 -236 86 -461 -1 138 42 151 -5 71 -117
5111 -117 82 175 121 31 -17 136 66 12 -82 21 -309 -141 -25 -100 71 108 -78 -245 51 -87 84 -105 -262
5134 -262 -318 -262 157 -127 132 -80 -371 18 -121 82 20 -226 -152 94 -275 -131 -126 56 132 132 -165 -2 204
5157 204 59 58 -11 -58 -20 -125 -111 103 200 -33 -141 -28 -77 76 312 -59 -45 -58 94 -1 31 29 197 63 207
$$ packed form
4996h4k0J4J34J28Q6m84Q4K39Oj80J78j71K25j3J45n76K59K52j36m6l63J05J97
5019b1j9J81n8j18P1J80l22K81n3J71l61K29j13R4l37jK17j74o7J74l2Q3j47J11
5043c1J84k47n4q4J94L14j51J3j90r5Ok14M67n1j82J76j32L2K99l86o3K59M0K8
5067A32R7m28J16J7J81k18m3J91j68J40l05L8K96J55n0j08J35n4k28J99j25n4
5089h4L38n08K53O8l72L55r9k21J59P4J32j1l20L22n47M60J39r6J09j56P6j88
5111a17J99R3n4r0m8J53p0n4r4J03l30J68J16p5J71L7j86j67K96j38J71j89j57
5134b62n6N6M19k84K59k12k91L89j39K03o2k46P4K46l69J44NJ82P6%k97J63K06
5157B04j45jo9m7L8j05J4K14R7k33j08J13m9J53K36l71J4j3J52r5L2kJ68j34J44
$$ plain form
5182 207 -45 28 29 67 -59 190 291 -43 4 154 7 133 -64 -117 67 12 -42 -129 171 -27 180 -8 -154
5205 -154 96 62 -60 208 5 -237 -63 79 -22 -71 -9 -347 -40 67 11 -27 124 -211 108 17 -259 68
5227 68 322 61 -19 -65 -19 -93 -158 -100 -8 -52 261 -245 -65 -151 6 96 77 -272 -36 155 54 -150 95 107
5251 107 286 36 15 45 -16 -86 -92 -30 -183 103 290 82 17 -146 -71 37 -9 -115 -1 -104 156 116 -53 74
5275 74 161 -73 -170 -267 -128 86 -21 -111 -116 250 -6 -61 33 141 -64 -184 322 52 108 8 -30 64 87 21 -20
5300 -20 -7 -98 -25 131 232 -188 -39 192 -53 21 -153 82 103 -20 131 48 -11 -231 -51 174 379 182 181
5323 181 269 -265 -324 267 3 175 -93 -295 130 -40 -31 -89 -262 -63 -96 -66 198 16 113 267 27 -78 87
5346 87 -266 184 117 127 -125 101 25 469 -228 19 -51 -90 -227 -65 96 92 54 -25 286 61 34 159 -12 -214
$$ packed form
5182B07k52P3JL8j26K49J01l34M7J50j47J26j97n3J84n5n4q7L00j98K07j88j46
5205a54K50l4j22K68k03k42J74J42j01m9O2l38L07J07n6l8J51l35L19r1k76L27
5227F8K54k61q0m6M6p4o5N8R2m4L13n06J80q6J57R0j9l49K36J91j01k04K45J2
5251A07J79k50k1L0o1p0oO2j53K86J87k08o5j63P5J08m6j06J14j03K60m0j69J27
5275G4Q7k34r7r7J39K14j07r0nL66k56n5R4J08k05j20N06k70N6j00l8R4K3o6m1
5300b0J3r1P3J56J01m20J49K31k45P4j74K35K1j23J51q3n9k20J80K25K05j97j
5323A81Q8n34n9N91k64J72k68k02M25j70Rn8j73J99l3L0K64j82R7J54k40j05J65
5346H7l53M50o7J0k52K26p6M44o97K47p0l9j37J62J61ml8p9L11k25k7J25j71k02
$$ plain form
5370 -214 88 -84 -53 256 115 -130 -3 -133 271 -97 211 364 -129 308 123 -164 135 -197 -94 -119 -53
5391 -53 -195 32 229 -104 -39 -187 29 -28 -220 234 57 66 51 -113 244 -165 -130 -119 -9 -286 71 -223 -329
5414 -329 257 46 27 157 -208 65 133 179 139 49 312 -50 -176 156 144 68 -99 5 -113 -143 -57 73 158
5437 158 -136 -10 -166 161 -267 28 146 56 154 65 -357 140 -11 -2 -2 84 25 76 137 39 -89 78 22 266
5461 266 99 172 -24 -190 81 59 68 154 -49 -172 -246 55 28 45 102 -70 -211 35 111 81 54 150 -188 178
5485 178 116 152 -128 127 120 -148 -32 -160 120 53 -85 90 81 6 159 113 -225 34 69 -99 103 -5 -28 -112
5509 -112 -157 -153 55 172 101 143 6 -119 383 73 -129 -58 -14 -125 79 2 -49 -40 236 175 46 0 -52 45 191
5534 191 -42 -131 -32 -183 19 149 46 321 68 -127 167 -30 -64 197 -240 216 -42 175 59 44 -33 171
$$ packed form
5370b14L02j72L1L09j41k45J27j30M04l68L08J53m93M37j85k87K99l32J03k5O6
5391e3j42K27J97l33O5j48K16n7j92M54j77Rj5j64L57m09L5J1J10k77L57k94j06
5414c29N86k11j9J30l65K73O8M6m0r0K63l62j26L32j2p6j67J04j18l0Q6J30Q5
5437A58k94J26j56L27m28K95J18r0R8q9m22M97j51R%Q6n9N1O1r8j28J67n6K44
5461B66j67P3j96j66K71k2RQ6k03j23p4L01k7J7N7j72j41K46P6l0k7R6l38L66
5485A78o2L6k80K55pk68J16j28K80o7j38J75rp5J53m6l38K59L5j68K02j08k3q4
5509a12m5MK08J17p1M2j37j25N02l10k02P1M4j11K04p7n1RK76o1j29m6n2R7J46
5534A91k33q9R9j51K02J30j03K75k53j95K94j97l4K61m37M56k58K17j16j5p7K04
$$ plain form
5556 171 -254 121 -126 167 -218 15 -69 -128 0 21 -59 -60 -108 -190 125 10 -133 -186 -114 -16 208 278 -24 83
5580 83 -143 -268 48 -41 385 113 140 3 22 5 -25 -210 316 137 152 -19 -146 -268 -8 -216 70 -93
5602 -93 -73 62 -220 -121 264 -252 -23 43 -295 136 57 146 213 90 -1 -6 -56 -57 -44 101 -56 35 -6 -18 29 21 147
5629 147 286 -108 151 -86 -109 -144 -289 -312 52 -220 296 -19 -105 137 79 -151 162 44 77 138 185 86 71
5652 71 191 179 -92 -141 44 -26 -96 3 179 164 -202 156 276 -38 -227 112 249 -47 -57 26 42 77 129 -75
5676 -75 273 223 14 47 -1 139 -13 -85 159 -205 -166 107 -93 153 113 266 -193 -9 -174 -220 178 -44 -8
5699 -8 -195 -274 75 -226 -198 -80 -127 -42 -18 -44 -2 -48 -94 -32 -290 -222 -154 54 -162 55 113 138 -122 74 173 -61
5725 -61 -14 -104 -93 -175 225 -259 -174 52 -128 -132 -138 -256 -161 -84 -171 -137 145 206 313 267 175 -79 -67 -151 145 30
$$ packed form
5556A71m25L75k47K93l85K33q4n9J28K1q0jm8q2L15j15j43n3P2R8K24P0l02J07
5580H3k26j25L16q9M26k72K7j37J9j7l0j85N26j79J5j71j27j22K60k08K86j63
5602i3K0J35k82R9L85n16K29O6l38M31p9Q9O7j23r1nn0jJ3J45j57R1m1j2M7qJ26
5629A47J39l94K59k37k3l5j45k3L64k72N16l15q6K42n8k30L13j18L3O1M7r9j5
5652G1J20j2k71m9J85p0p0R9J76j5l66L58J20l14j89L39J37k96j0Q3J6L5N2k04
5676g5L48n0k09L3m8J40j52p2K44l64L9K73k00K46m0J53m59J84j65m6L98k22L6
5699hj87p9L49l01K8J18m7Q5K4k6M2m6m6O2k58O8O8K08k16K17N8K5k60J96R9k34
5725f1M7r0J1q2M00m84Q5K26j80moj18R5P7q7L4K82O1J07m6r2k54J2q4K96j15
$$ plain form
5751 30 14 75 50 -241 -235 -213 -146 225 -31 -82 -31 45 -233 -327 -164 187 -12 44 1 -111 217 -222 -142 -257 13
5776 13 130 -180 -164 -143 -164 -125 -35 75 448 -97 90 -67 136 -240 -133 -32 -14 199 -70 -236 21 -27 -75
5799 -75 52 -101 -26 199 80 -85 -85 202 38 138 -114 160 392 93 273 208 -127 20 445 288 14 -20
5821 -20 112 -343 -197 16 -259 32 185 -62 45 0 322 37 286 -136 37 125 -73 264 75 30 -121
5842 -121 42 -7 -34 -56 68 0 -129 -126 167 279 -31 50 422 -24 -77 -204 -75 25 248 7 142 124 113
5865 113 -146 236 -124 -91 47 -51 -73 132 -45 35 -5 90 -14 0 12 -59 123 -25 -64 190 61 239 -68
5888 -68 -74 185 -20 -31 363 77 97 4 -153 112 -10 26 176 176 -66 -77 -140 16 29 -209 -38 -77 179 308
5912 308 80 370 199 -196 42 28 284 -144 121 38 -18 -69 143 -21 -83 187 0 300 -225 66 95 -156
$$ packed form
5751C0j6O1k5k91OK2O7L71k56n1N1P6k78r4J63L51j99N6m3j12L28m39Q0j15K70
5776A3J17l10J6K1k1L9R0J10L73n45J87j57K03l76J07J01J8K13k69j66K57m8m8
5799g5J27j53P5K25j19j65%K87j64J00k52K74K32k99J80o5l35J47M25j57k74l4
5821b0J32m55J46K13k75K91J53k47J07m5L22k85K49m22J73Q8j98L37j89m5j51
5842a21J63m9k7k2J24o8j29LK93J12l10Q1L72m46n3j27J29J00K23k41J35j8j1
5865A13k59L82l60L3J38r8k2K05j77Q0m0R5j04J4J2p1J82j48l9K54j29J78l07
5888f8oK59k05j1L94k86K0r3j57K65j22L6J50%k42j1o3J56J3k38J71l9K56J29
5912C08k28K90j71l95K38j4K56m28K65q3n6n1K12j64o2K70j87L00n25K91K9k51
$$ plain form
5934 -156 -79 315 -125 -98 -12 64 35 199 35 127 -91 -103 -257 159 -145 160 -62 27 -162 25 169 86 182
5957 182 80 164 219 -122 -195 156 -3 -20 93 -161 -249 225 16 44 199 90 -22 222 8 -138 -195 84
5979 84 164 -119 281 -25 160 234 -64 24 179 -5 82 22 111 174 68 -77 -212 -162 223 68 -88 119 92
6002 92 227 -144 -123 -53 -55 154 149 -166 61 150 -115 81 1 12 61 255 -22 -47 98 -215 -256 85 -30 -241
6026 -241 -128 -139 -86 -84 162 -261 228 37 42 -25 -30 -274 51 126 2 122 36 -140 -228 -103 156 -97 196 197 24
6051 24 109 183 28 -112 -121 -166 -33 151 -200 53 5 -51 11 -223 36 -212 248 35 44 -255 250 -44 257 301
6075 301 256 -26 8 -150 -82 -174 -120 -69 109 128 56 192 -106 -196 155 48 70 -9 -128 101 -271 102 102 21 12
6100 12 3 -99 94 127 34 92 18 72 76 25 -78 74 233 -146 -129 -119 77 -130 -128 34 50 23 -123 65 -49 -101
$$ packed form
5934a56P7L94m40K7Q6P6k9J64j64R2k18j2j54M16l04L05k22Q9j89J87J44q3R6
5957A82j02Q4N5l41p3L51j59j7J13k54q8M74k09K8J55j09j12K44k14j46n7K79
5979H4Q0k83M00l06J85P4k98Q8J55j84Q7o0Q9O3j06j45j35N0L85j55j56K07k7
6002I2J35l71K1P0kK09nl15K27Q9k65J96q0J1M9J94k77k5J45l13m1L41j15k11
6026b41J13j1N3KK46m23M89j91No7nk44L25P5j24J20q6j76q8J25K59k53K93Jj73
6051B4Q5P4j55j40rm5J33J84l51K53m8n6O2k34K59k48M60k13Rk99N05k94L01M4
6075C01m5k82L4j58O8r2N4N1J78J9p2J36k98r0L51j07K2p9j19K29l72L73%q1r
6100A2rj02J93L3r3N8p4N4Mn1j03J52J59l79J7J0J96k07KJ62J6k7j46J88j14n2
$$ plain form
6126 -101 162 232 -117 59 -8 -69 115 -169 -178 45 27 -47 12 -69 36 42 -257 146 -269 -116 -6 161 105 -40
6150 -40 -58 -198 49 -15 -72 162 -143 -179 -47 -5 -70 -126 -15 3 -121 53 -194 -238 -135 -79 -23 -104 47 64 -18
6175 -18 -393 -43 56 258 2 68 -54 -64 -133 -179 88 -168 -198 -84 50 -173 -216 46 207 47 -14 -397 157
6198 157 -195 170 173 -151 93 243 -114 -130 144 -199 -67 229 192 -240 -58 42 -142 -102 48 -157 230 39
6220 39 43 -101 4 93 -152 187 119 -99 -59 -111 217 247 96 -96 -171 -48 -165 -16 -51 144 220 16 -248 -173
6244 -173 -164 -110 -32 -96 44 -163 -87 81 -110 59 34 -30 56 210 41 -442 98 147 -268 5 47 -48 -7 54 100
6269 100 -123 -15 -245 -71 12 110 -17 24 -68 -192 -132 -7 -10 16 80 -305 -19 25 -105 -77 63 -16 -31 192
6293 192 -223 175 -228 -338 410 -187 138 -69 -98 217 73 -248 65 -271 -90 -64 -328 361 -346 -97 -176
$$ packed form
6126a01K63P0l49J76o7o1J84k84rK23j8p4N9q1J05Ok99M03m15J53J10J67n6j45
6150d0j8j40K47o4n7K34l05l6J32M2o5n6J11J8j24J74k47m4J03N6N6q1J51J7q2
6175a8l75L50R9K02k56O6j22j0o9m6K67k56l0J14J34k23m3K62J61j60o1l83N54
6198A57l52L65Ll24K44J50l57j6K74l43J32K96l7m32J82J00j84M0J50k05L87j91
6220C9Mj44J05Q9k45L39o8k18M0n2L28L0j51j92p5J23j17J49l5J95P6k04k64P5
6244a73RN4P8o4J40k07P6J68j91J69k5o4Q6J54j69m83N40M9m15K73M2r5M1O1M6
6269A00k23J08k30J74Q3R8j27M1r2j24O0J25lK6O4l85K86M4j30K8J40p9j5K23
6293A92m15L98m03j10P48n97L25k07k9L15j44l21L13l36J81K6k64O89p07K49p9
$$ plain form
6314 -176 65 247 85 114 84 -127 32 -78 181 264 268 -64 -29 98 -58 235 103 -79 236 -28 -138 -45
6336 -45 16 -225 -63 148 -19 119 234 -77 333 -210 31 46 -176 -6 -172 126 136 -110 -172 -248 -16 18
6358 18 170 -153 -124 -212 22 -71 57 -226 168 44 2 128 -122 81 -92 -62 -131 44 22 257 -6 256 -130
6381 -130 15 39 54 252 0 -31 37 347 40 -77 162 -68 -67 -72 32 177 -26 -185 84 86 -72 -27 293 53
6405 53 64 31 99 -146 189 34 31 -108 69 39 -167 74 187 -56 15 196 -158 -13 -125 -191 19 162 142
6428 142 -45 126 -127 373 -94 -183 56 140 89 154 115 -2 -39 -57 190 -124 89 199 -259 74 -89 99
6450 99 -75 156 -32 -77 136 -158 -56 -120 -4 -173 161 7 -8 -102 51 31 -38 187 108 -227 -315 147 2
6473 2 -204 52 -130 -187 -227 -18 -204 -356 191 69 -109 -101 -37 -123 13 252 207 -97 -88 207 -81 -339 -30 -165
$$ packed form
6314a76K41J82j62K9l0k11J59j10K59Q3Ml32L5J27j56K93j32j82L15k64j10R3
6336d5O1k41J62K11j67J38J15l11M10n43K41J5k22J70j66K98J0k46o2p6K32L4
6358A8J52l23K9q8K34r3J28k83L94j24m2J26k50K03j73L0o9J75k2K35k63K62l86
6381a30J45K4J5J98k52l1O8L10l07j17K39k30JnJ04J45k03j59K69Kj58M5L20k40
6405E3J1l3O8k45L35j55lj39J77l0k06K41J13k43P1J81l54J45j12o6K10J43k0
6428A42j87J71k53N00m67q9K39Q4n1O5l9j17l7j8K47l14K13J10m58L33j63J88
6450I9j74K31j88m5K13k94J02o4J16j69L34j54j5r4J53k0o9K25p9l35q8M62j45
6473Bk06K56j82n7m0K09j86j52N47j22j78QO4q6J36K39m5l04RK95k88k58L09j35
$$ plain form
6497 -165 -44 -164 -210 42 -59 86 -29 -135 -237 -16 63 77 -139 -105 -128 56 17 -92 -118 40 -94 -141 77
6520 77 -216 212 30 -52 -75 -216 251 -4 4 155 -57 -187 76 108 -189 164 209 -281 104 135 117 -81 -5
6543 -5 -188 -220 -175 166 35 105 126 30 18 -100 147 98 65 98 54 73 177 97 79 -485 182 -171 -202 -274 -77 107
6569 107 -328 313 87 -64 16 93 29 -45 137 -126 -373 53 -31 -179 -191 48 80 42 -80 -92 -129 12 41 104
6593 104 -50 43 130 -92 -248 132 -27 -120 -8 47 -151 65 -18 -159 40 36 70 -53 -1 -131 -266 8 -171
6616 -171 43 21 -130 132 196 216 55 -32 96 -171 -141 -60 -170 264 -81 -4 -74 -256 61 30 -103 -208 91
6639 91 -54 -78 -77 41 -146 54 21 207 -82 234 -91 13 -120 -70 254 -160 18 74 -202 94 129 219 -166
6662 -166 -63 -6 38 -95 132 104 -407 -152 -87 -5 -195 -24 -448 -31 99 147 54 -377 0 32 143 -118 50
$$ packed form
6497a65J21j20m6K52j01J45j15j06j02K21P9J4k16L4k3J84l9j09k6J58j34m7K18
6520G7k93M28j82q2k3j41M67k55QJ51k12j30K63L2k97L53M5m90L85L1j8j98P6
6543ej83l2M5L41j31P0K1r6j2j18K47m9l3L3m4J9J04q0j8n64O67l53l1p2J97J84
6569A07m35O41k26j51Q0P7o4p4J82k63k47M26q4j48j2K39L2l8j22j2l7J41K9O3
6593A04j54R3Q7k22j56L80j59r3J12N5j98K16q3j41J99mL4j23N2j30j35K74j79
6616a71K14k2j51K62O4K0j61q7J28k67L0Q1j10M34l45P7p0j82L17l1j33j05K99
6639I1j45k4JJ18j87K00l3J86k89L16l25J04j33N0L24m14J78N6k76K96L5R0l85
6662a66J03N7M4j33K27k8n11K55O5Q2j90J71m24M17J30M8r3m31L77L2J11k61J68
$$ plain form
6685 50 -218 -25 -54 4 164 135 9 -21 140 71 41 -173 35 -176 -98 -65 -84 141 172 -137 -14 137 -49 136
6709 136 65 -36 221 72 -5 -140 -98 -70 -241 244 314 -39 190 -162 182 -17 -142 30 -161 -24 211 -197
6731 -197 6 1 -35 -224 -263 107 -228 -40 -64 182 76 -71 111 272 -116 67 299 120 155 -108 135 -82
6753 -82 -167 -144 139 44 -100 -26 -148 64 237 98 24 -61 270 -230 -23 -97 -44 125 92 20 82 -341 -10 46
6777 46 -50 -8 -83 128 278 -47 37 152 -26 -146 5 -121 50 59 191 44 -71 -108 138 236 -93 -168 281
6800 281 121 27 77 326 -117 -188 236 -144 -117 -92 -189 -33 193 272 186 65 -16 -147 45 -43 102 -135 -13
6823 -13 141 71 -68 18 114 -114 260 -179 -46 -21 82 -1 130 17 -54 14 -14 -94 -165 -50 -461 25 19 186
6847 186 -181 -83 -7 35 -185 0 -196 43 11 319 -315 -162 -74 -131 337 205 -14 154 76 -358 73 -212
$$ packed form
6685E0k68J93k9N8J60k9j26l0J61o9l0k14K08k11P8L3j9K25L1l09J23J51j86J85
6709A36p1j01K57j49p7j35M2K8j71M85P0l53K29l52L44j99j25J72j91J37K35m08
6731a97K03nl6j89l9L70l35J88k4K46j06j47J82J61l88J83K32j79L5k63K43k17
6753h2q5K3K83r5j44P4j22K12J73j39p4q5L31n00K07p4N3J69l3p2O2m23L31N6
6777D6r6M2p5K11J50l25Q4J15j78j20J51j26J71RJ32j47j15l7K46R8l29p5M49
6800B81j60r4N0K49m43p1M24l80K7K5r7J56K26P9q6j21q1j31J92q8J45k37J22
6823a3J54p0j39Q6R6k28L74m39J33K5J03q3J31j13p1O8k8q0p1J15m11M86oJ67
6847A86l67R8P6M2k20J85j96K39l2L08o34J53Q8n7M68j32k19J68p8m34M31k85
$$ plain form
6869 -212 183 131 -126 -139 261 1 -92 -156 -236 214 -116 -103 44 155 217 217 -149 38 123 151 -125 106 -159 -194
6893 -194 328 110 -74 -112 161 -100 -98 -102 -70 98 -5 160 -235 -43 16 -103 58 -104 41 47 -25 286 -42
6916 -42 141 -99 -12 -257 -130 -2 -43 133 113 20 -156 -64 91 43 -26 -21 -97 -53 -10 -149 3 61 228 24 -257
6941 -257 173 45 -185 205 246 -5 -170 -36 37 -96 -35 -269 20 158 113 132 -145 47 -277 -213 126 -267
6963 -267 103 62 -76 368 58 363 13 -147 -79 -48 124 243 79 133 125 -92 -89 207 -116 -122 -125 101 523 -16
6987 -16 242 -104 -133 -194 -25 -50 -141 7 -138 -38 31 140 9 54 -97 -68 -125 79 59 -100 166 2 20 75
7011 75 131 -86 114 37 102 -58 158 244 -129 -240 -149 90 112 -10 -142 164 51 96 -192 31 69 44 -141
7034 -141 7 46 -131 41 -2 -310 -84 -62 289 108 183 120 -275 -108 -122 135 39 107 241 4 219 94 98
$$ packed form
6869b12L95n2k57j3M00k60r3o4q0M50l30J3J47J11O2%l66J87Q5K8k76K31k65l5
6893a94N22k18j84l8K73k61KmL2J68j03J65l95J92N9j19J61j62J45Op2L11l28
6916d2J83k40Q7k45J27J28m1J76k0r3j76R2J55m8o9Np6M4M3j39J52N8J67k04k81
6941b57M30j28k30L90M1k51j65J34P3j33O1k34K89J38m5J9k77J92l24O4L39l93
6963b67L70m1j38M44l10L05l50j60O8L1J72J19j64N4qk17LK96l23olK26M22n39
6987a6K58l46k9o1J69k5r1J48j45J00O9J09j31M5j51K9n7K04k0j59K66j64J8N5
7011G5N6k17K00p7O5j60K16Q6l73j11R1K39K2j22j32L06j13M5k88K23L8k5j85
7034a41J48L9j77J72m3l08K26K2L51j81P5o3l95J67j4K57r6O8J34k37K15j25M
$$ plain form
7057 98 -140 272 -47 166 -28 8 -23 119 5 -100 47 132 115 -109 -90 -97 179 -96 115 -80 -106 -32 182
7080 182 -103 86 24 -36 52 163 -253 -97 -43 -17 45 75 -29 64 -189 -20 -61 11 5 -166 63 160 -79 -176 -92
7105 -92 50 89 -16 243 -271 -369 39 2 37 -18 -68 -96 115 118 -198 225 -28 77 -258 -89 -100 -205 322 -32
7129 -32 -293 -43 -103 -125 -10 -109 16 151 137 155 71 -162 -47 -15 -260 -252 76 -146 -14 199 114 20 -324 -93
7153 -93 24 148 -89 57 79 13 -115 243 -137 48 9 -57 150 -100 41 137 21 170 14 66 -159 127
7175 127 307 122 -64 -59 106 145 288 -122 63 314 -24 -216 -2 -12 26 228 368 235 -239 -67 -190 -106
7197 -106 38 24 -5 68 43 226 -7 -72 243 15 -165 76 44 -13 -142 5 164 66 -83 -4 183 79 -177
7220 -177 153 60 -16 -18 74 -193 -270 188 -214 232 -15 -94 -129 186 -207 -31 -6 77 285 37 285 -286 219
$$ packed form
7057I8k38M12l19K13j94L6l1J42j14j05J47Q5j7k24J9pK76k75K11j95k6P4K14
7080A82k85J89o2o0Q8J11m16J56N4K6O2L0j04R3k53J69m1P2oj71K29R7k39r7Q4
7105i2J42L9j05K59n14r8M08l7L5n5n0k8K11Ll16M23k53J05l35J69j1j05N27l54
7129c2k61K50o0k2J15r9J25J35j4J8q4k33J15L2k45QL28k22J32K13q5r4l44K31
7153i3J17J24k37J46K2o6j28L58l80J85l9o6K07k50J41R6j16J49j56N2k25K86
7175A27J80j85j86NJ65L9J43m10J85K51l38j92K14j0L8K02J40j33m74J72j23Q4
7197a06J44j4k9P3k5J83k33o5L15k28j80K41l2n7j29J47J59r8j49P9J87j04k56
7220a77L30r3p6kR2k67p7M58m02M46k47p9l5L15l93J76K5Q3K08k48K48n71N05
$$ plain form
7243 219 -45 -6 -20 -183 182 -27 266 67 391 451 0 -186 -196 -189 -114 122 39 -40 108 158 -14 235 -39
7266 -39 -225 -200 -231 -85 94 -253 -93 172 215 291 38 114 -11 87 80 -44 -75 412 -132 4 -95 105 -18 -9
7290 -9 -120 45 118 -296 113 149 -16 -48 -434 -369 -33 32 154 32 393 -109 152 153 -45 -546 41 142 -1
7313 -1 17 214 -242 -242 -24 -24 -41 -132 269 -121 -42 117 -70 89 -31 -72 9 46 -158 -230 -167 -44 51 -156 93
7338 93 132 107 -18 -253 -285 -115 53 207 -96 -71 -161 50 66 -10 279 311 61 187 48 156 40 23 -156
7361 -156 16 -34 105 116 33 -47 -100 -162 -34 -240 51 335 445 223 -36 41 -195 174 0 -32 -235 -42 105
7384 105 -78 -175 -21 -261 82 88 -58 -58 56 -97 73 -43 -45 19 -14 -109 198 139 -41 -8 -87 -192 -116 -30 104
7409 104 -2 63 63 139 7 -176 47 -128 199 70 180 -215 -362 82 -3 214 -82 177 -262 -52 135 45
$$ packed form
7243B19k64L9j4j63L65k09K93j99L24O0m51j86j0PP5K36q3p9J48N0j72K49k74
7266c9j86K5l1J46J79l47J60K65M3P6k53P6j25R8pj24l1M87n44J36r9K00j23R
7290ij11J65P3m14M09L6j65l2l86O5L36O5J22j22L61n02K61Jj98n01N87J01j43
7313aJ8J97m56%K18%j7r1M01l90P9J59j87J59j20m1Q1L7k04p2O3J23R5k07K49
7338I3L9k5j25k35l2J70J68J54l03K5r0K11J6p6K89L2k50J26j39J08j16j7j79
7361a56J72n0J39J1q3q0n3o2J28k06K91K84J10k22k59P7k36L69j74l2k03J93J47
7384A05j83r7J54k40L43Oj46%J14j53J70j16kO4l3r5L07n9j80L3p9j05P6Q6J34
7409A04j06O5%P6j32j83K23j75L27j29J10l95j47M44q5K17k96K59m39K10J87r0
$$ plain form
7431 45 -205 154 -167 118 236 181 33 -9 -105 67 -71 -66 -250 -177 -25 263 103 40 -100 100 -51 -38 58
7454 58 257 -72 -76 -393 -109 -281 248 75 -188 206 75 -33 136 -35 42 -50 239 -36 -131 117 85 183 60
7477 60 -38 -76 113 21 -24 28 -174 -63 -77 -8 90 -47 -100 249 -117 61 -67 315 81 -23 13 -14 -85 -169 -232
7502 -232 -4 304 -30 -380 -63 -78 -107 38 -22 -293 -11 -80 80 -174 -99 -158 -8 99 161 87 121 -73 64
7525 64 82 -98 63 -207 -103 24 213 51 362 -13 134 -69 7 -267 148 0 79 126 33 200 -69 220
7547 220 118 32 159 -60 99 -34 -120 171 -138 -135 204 -185 -304 152 160 -142 231 293 -23 100 125 32 165
7570 165 -63 -8 -53 61 63 16 56 361 -19 -263 -141 141 150 -109 144 -39 -104 157 160 151 -83 112 60 -227 -120
7595 -120 6 125 161 94 62 267 -139 -80 70 -1 -40 248 -23 49 -23 -74 98 289 -25 101 88 -50 103
$$ packed form
7431D5k50L59l21K85J18n5j48m2r6J72j38Nj84P3J52K88j60o3j40K00j51J3R6
7454E8J99l29ml17K84j72N29j73k63L94j31j08J69j71P7r2K89k75r5K48l2R8j23
7477F0r8l8J89r2m5N2k02J11j4O9R8j37n3L49l66J78j28L82k34j04L6k7p1q4o3
7502b32K28L08l34l50L17j5k9J45o0k71K82o9J60k54P5n9J50J07O2p4L4j94J37
7525F4J8j80J61k70J04J27J89j62L11l75J47k03P6k74M15j48P9M7r3J67k69K89
7547B20j02q6J27k19J59j33q6K91l09LL39l89j19M56Ql02L73O2l16J23K5r3J33
7570A65k28N5m5J14Km7M0L05l80k44J22K82Rk59K53j83o5K61Lrk34J95n2k87J07
7595a20J26J19L6o7l2K05m06N9J50p1l9K88k71P2p2n1J72J91l14J26j3j38J53
$$ plain form
7618 103 91 -79 82 36 133 245 -377 -52 56 112 -172 186 305 -31 -99 -361 -121 -49 -61 144 -7 159
7640 159 -151 300 105 119 59 21 -139 -128 214 182 -83 -225 200 13 -98 130 -17 -56 7 -126 -106 69 -314
7663 -314 124 -82 -18 118 137 -49 -179 30 -182 -25 -48 3 -253 90 -253 -190 179 -176 -111 -12 -9 -173 9
7686 9 224 137 35 -4 179 -148 92 -148 166 124 -212 108 -47 152 142 -38 -65 27 86 78 104 100 57 -169 67
7711 67 -56 84 -150 -152 76 82 82 -210 -82 -240 64 11 -306 -29 46 44 68 -91 143 161 -289 -42 58 -211
7735 -211 -158 -52 126 104 -11 -143 -25 -86 22 24 48 -46 38 33 40 141 -128 39 90 230 150 -167 165 -164 42
7760 42 -129 62 101 261 70 -42 224 156 153 -203 -103 110 235 -6 73 307 -91 232 -423 -82 23 -71
7782 -71 -115 153 92 -60 -33 101 129 153 107 209 139 148 40 95 -203 27 81 -238 0 145 -20 -145 2 6 221
$$ packed form
7618A03j2j70J61m6R7J12o22L25J08N6k84L58J19l36o8k62K40P2j2K05j51J66
7640A59l10M51j95J4o0l8j60J1L42l2k65j42M25j87j11K28j47l9O3j33K0J75l83
7663c14M38k06O4J36J9j86j30K09k12J57k3N1k56L43l43O3L69l55O5R9Lj64J82
7686IK15q7j02l9J83l27K40k40L14m2l36L20j55J99j0j80k7R2N9qK6mm3k26K36
7711F7j23J40k34kK28O%k92J28j58L04n3l17K77P5kK4j59K34J8m50K47J00k69
7735b11N3J06J78k2j15j32J18o1J08KK4r4Q4nPJ01k69J67N1J40q0l17L32l29K06
7760D2j71J91L9J60j91j12K66o8ll56J00K13J25k41P9K34l98L23o55L41J05r4
7782g1m4K68o1j52K7J34K8K4m6J02p0Rj08N5k98K30N4l19K38J45j65j25J47MK15
$$ plain form
7807 221 -169 69 81 109 27 -40 4 -115 374 -116 -106 -1 -209 -6 -28 -63 -109 189 198 170 -32 141 -189 122
7831 122 107 -60 19 50 231 -105 75 -130 -40 -3 -38 -82 -8 -132 178 196 184 -59 -185 -105 -156 -95 -118 57 -174
7856 -174 125 -114 51 -67 132 -37 152 -226 -140 62 -95 -32 130 -151 -46 207 187 20 -114 -193 -233 -206
7878 -206 32 -19 99 -110 -125 -106 -111 96 -93 -130 -136 -7 -218 27 46 179 -2 135 -121 55 111 106 1 -78
7902 -78 -366 34 -66 -51 -86 -229 -42 -1 -76 31 -84 -48 25 -266 -153 -63 268 -74 -74 152 207 -173 100 198
7926 198 -6 206 -52 166 465 -192 316 161 184 23 -43 -107 196 119 29 49 13 104 127 43 124 173 163 114 -20
7951 -20 -112 11 -275 177 45 -23 244 -15 -26 -121 122 -104 79 119 -64 185 -178 95 45 -163 141 330
7973 330 -133 -111 59 191 -40 264 -1 -11 -100 68 316 15 -142 22 107 79 206 30 56 -350 -117 20
$$ packed form
7807B21l90K38J2K8q2o7M4j19M89m90J0J05k08K03k2l5m6K98Rk8k02J73l30L11
7831A22j5j67P9L1J81l36J80k05R0L7l5m4P4j24L10J8j2k43j26Q0n1O1k3J75k31
7856a74K99k39J65j18J99j69J89l78Q6K02j57O3J62k81J05K53k0j67j34p9m0K7
7878b06K38n1J18k09j5J9nK07j89l7oJ29k11K45J9J33j81J37k56J76N6nj05p9
7902g8k88M00j00J5l5j43J87M1p5J07j15L6P3k91J13R0L31l42%K26N5l80K73R8
7926A98k04K12k58K18K99o57N08j55K3j61o6o4L03p7r0K0l6R1K3q4Q1M9j0m9j34
7951b0r2J23k86M52j32o8K67k59j1r5K43k26J83M0j83K49l63K73n0k08L04J89
7973C30m63K2J70J32k31L04k65j0q9J68K48l01j57J64Q5k8J27j76K6m06K33J37
$$ plain form
7995 20 -52 239 -351 63 -82 -21 -36 -96 231 162 -5 -84 20 -153 86 9 144 136 -114 19 210 131 -79 -74
8019 -74 220 -78 -67 -97 123 14 154 71 -73 120 10 -38 -7 21 -6 18 -256 21 -31 -160 -13 -97 201 306
8043 306 -181 -10 -43 89 -276 193 -91 114 7 118 -129 57 163 -15 -74 -95 -277 -12 89 211 240
8064 240 -153 -153 -239 110 61 -104 -25 110 -9 99 -298 359 239 -69 -33 -160 -26 -2 169 -51 30 309 -19
8087 -19 -193 55 67 208 205 -250 -6 -46 197 123 98 -126 -13 184 -53 -47 261 12 -48 -23 -14 -34 35 -312 105
8112 105 -41 -19 43 71 76 -35 -207 26 32 -60 -294 16 -3 51 31 126 -417 34 -38 39 71 -65 -86 -229 256
8137 256 276 126 -67 68 -111 -145 -75 -122 102 -119 -6 23 239 118 -188 -100 -150 172 -78 67 -89 -6 -10
8160 -10 -10 156 237 7 -119 -68 -123 131 -181 28 -26 37 120 18 -177 110 41 148 -84 28 -196 -218 -30 35
$$ packed form
7995B0p2K91n90M14j45O1j5o0L27o9j67p9J04j73K39p7J35qk50J33J91p9k10N
8019g4K94k98J1l0K20j09J40q3j44J93j10m8L1K8k7K4k74K77n2j29J47q4K98J05
8043C06m87J71l3J32l65M69k84K05j07J11k47J86J06j78n9k1j82K65J01J22K9
8064B40l93%q6L49m9j65P9J35j19J08l97O57j20l08L6j27J34K4J71k20Q1K79l28
8087a9j74K48J2J41lm55K44m0K43p4k5k24J13J97k37OL08k49o0K5Rk0O9l47M17
8112A05j46K2O2K8Nj11j72K33Or2k34L10j9N4k0R5n43M51p2P7L2j36k1j43M85
8137B56K0j50j93J35j79l4P0m7K24k21J13K9K16j21l06Q8n0L22k50J45j56Q3m
8160a0%J66Q1k30j26N1n5K54l12K09n4O3Q3j02j95K87o9J07k32J12k24k2J88O5
$$ plain form
8184 35 33 -155 -15 146 -94 307 97
$$ packed form
8184C5kj88J40J61k40M01k10
8191I7
$$ Imaginary data points
##PAGE= N=2
##DATA TABLE= (X++(I..I)), XYDATA
$$ plain form
0 0 0 0 0 0 0 0 0 -8 8 -8 8 -8 16 -16 24 -25 33 -42 54 -64 74 -90 109 -129 150 -175 203 -235 271 -311 356
31 356 -407 461 -522 589 -665 746 -835 934 -1042 1161 -1290 1430 -1583 1751 -1936 2137
47 2137 -2355 2597 -2859 3152 -3472 3825 -4219 4662 -5164 5729 -6380 7135 -8026 9093
61 9093 -10401 12040 -14176 17080 -21269 27865 -39824 68304 -281617 1522 499552 -256637
73 -256637 -173647 365317 6369 -412336 135903 217649 -221114 4209 331244 -139484
83 -139484 -259744 188761 88676 -245406 98961 258030 -175456 -187122 191458 8772
93 8772 -220667 109386 208799 -166052 -109848 184197 -30146 -208936 131462 187321 -149863
104 -149863 -57704 180211 -80710 -189339 160177 128008 -179377 18351 185004 -161285
$$ packed form
0@%%%%%%%qJ6j6J6j6K4l2M0m9N8p5R6j18J38j64J99k38K79l25L78m38N06n82O67
31C56p63Q68r83J111j254J411j581J769j976K203k451K720l013L334l687M073
47B137m492M952n456O011o624P297q044Q881r826J0893j2109J3515j5161J7119
61I093j9494K2441k6216L1256l8349M9134o7689J08128l49921K83139M98030p56189
73b56637Q2990N38964l58948m18705N48239Q1746m38763K25323L27035m70728
83a39484j20260M48505j00085l34082L44367J59069m33486j1666L78580j82686
93H772k29439L30053R9413l74851N6204K94045k14343j78790L40398N5859l37184
104a49863R2159K37915k60921j08629L49516l2169l07385J97728J66653l46289
$$ plain form
114 -161285 -176700 197093 59301 -187147 108061 164160 -223047 -108085 221770 -25345
124 -25345 -155929 193853 105892 -252250 -13497 203646 -124112 -113830 243072 35657
134 35657 -253252 52709 155261 -177736 -58463 242062 -29632 -211940 115841 109240
144 109240 -200076 -3727 234018 -71647 -170142 154590 71923 -210547 24901 211394
154 211394 -95717 -135618 155929 26995 -195868 52427 159305 -121388 -73686 165920
164 165920 -25876 -174735 95512 118599 -140231 -16303 172874 -62236 -147442 117620
174 117620 75806 -144657 19165 149661 -88201 -112425 118679 25149 -139078 51719
184 51719 123024 -104903 -73040 121517 -9488 -120855 82573 98087 -112922 -28324 124643
$$ packed form
114a61285j5415L73793j37792k46448K95208N6099l87207J14962L29855k47115
124b5345j30584L49782q7961l58142K38753K17143l27758J0282L56902k07415
134C5657k88909L05961J02552l32997J19273L00525k71694j82308L27781o601
144A09240l09316J96349K37745l05665r8495L24732q2667k82470K35448J86493
154B11394l07111l9901K91547j28934k22863K48295J06878k80693M7702K39606
164A65920j91796j48859K70247K3087k58830J23928J89177k35110q5206K65062
174A17620m1814k20463J63822J30496k37862k4224K31104r3530j64227J90797
184E1719P1305k27927L1863J94557j31005j11367K03428J5514k11009Q4598J52967
$$ plain form
195 124643 -45500 -104401 106236 60869 -125163 11180 111561 -87625 -79081 123719 12522
206 12522 -128154 55129 89519 -115365 -34124 133149 -30142 -103802 96331 55216 -124303
217 -124303 11080 118963 -65785 -71285 107445 12390 -116128 39695 83169 -87929 -39169
228 -39169 103089 -16689 -97368 57606 63590 -85992 -19341 95118 -19260 -73669 58755
239 58755 46611 -74157 -2508 77693 -35695 -57877 66346 20489 -85944 14902 73952
250 73952 -56915 -49364 78568 5673 -84556 34509 64685 -62877 -21996 80260 -15719
261 -15719 -64312 53208 36328 -66539 5755 62187 -40766 -40962 54730 3672 -57567 24237
273 24237 36017 -49050 -13552 50853 -13753 -39260 37124 24146 -42252 1212 43872 -16306
$$ packed form
195A24643j70143n8901K10637m5367j86032J36343J00381j99186Q544K02800j11197
206A2522j40676J83283L4390k04884Q1241J67273j63291p3660K00133m1115j79519
217a24303J35383J07883j84748n500J78730r5055j28518J55823M3474j71098M8760
228c9169J42258j19778q0679J54974N984j49582O6651J14459j14378n4409J32424
239E8755j2144j20768P1649Q0201j13388k2182J24223m5857j06433J00846N9050
250G3952j30867P551J27932p2895r0229J19065L0176j27562M0881J02256r5979
261a5719m8593J17520j6880j02867P2294N6432j02953j96R5692n1058o1239Q1804
273B4237J1780q5067L5498O4405o4606k5507P6384j2978o6398M3464M2660o0178
$$ plain form
285 -16306 -27751 32945 12380 -37950 6033 32927 -25648 -24420 33821 1602 -42117 14979
297 14979 32799 -33694 -16108 42974 -5471 -37710 30777 25822 -40309 1455 44401 -22515
309 -22515 -29632 39695 8232 -43840 11541 29450 -31282 -14007 31814 -8454 -26752 19555
321 19555 10310 -23789 5340 21077 -12013 -7825 18762 2095 -12620 6896 10302 -7018 -6622
334 -6622 5379 3620 -7121 -5917 5921 1005 -12460 -706 11539 -6934 -9504 13373 4797
347 4797 -13421 6530 13949 -10211 -3290 14988 -3928 -9975 10950 1877 -12830 4501 5535
360 5535 -12120 -1673 7407 -7297 -3540 7354 -3743 -3826 8732 -968 -4995 9138 2209 -7193
374 -7193 7424 5067 -9834 3335 8706 -11123 -3849 11387 -7817 -10765 11873 -358 -15747
$$ packed form
285a6306j1445O0696k0565n0330M3983K6894n8575J228N8241l2219m3719N7096
297A4979J7820o6493J7586N9082m8445l2239O8487m955o6131M1764M2946o6916
309b2515p117O9327l1463n2072N5381J7909o0732J7275M5821m0268j8298M6307
321A9555r245l4099K9129J5737l3090M188K6587j6667j4715J9516L406j7320L96
334f622J2001j759j0741J204J1838m916j3465J1754J2245j8473k570K2877q576
347D797j8218J9951P419k4160O921J8278j8916o047K0925r073j4707J7331J034
360E535j7655J0447R080j4704L757J0894j1097q3J2558r700m027J4133o929r402
374g193J4617k357j4901J3169N371j9829P274J5236j9204k948K2638j2231j5389
$$ plain form
387 -15747 8782 9480 -16046 693 17901 -9705 -9848 18877 2392 -16377 10650 12404 -16068
400 -16068 -2163 16342 -9944 -13107 14740 1868 -18502 5595 12028 -15222 -5135 17142
412 17142 -4612 -14084 14932 10032 -17510 1672 20274 -9387 -14784 17533 7626 -21148 1930
425 1930 18901 -13261 -15883 17415 3351 -22023 5164 17869 -15273 -10278 21668 921 -20111
438 -20111 11868 17037 -17993 -5186 24334 -4545 -21490 16427 13883 -25781 -3721 27119
450 27119 -11938 -24901 21577 12148 -30553 2366 30361 -17648 -20494 30739 6217 -32798
462 -32798 14682 29534 -28270 -11850 37537 -8570 -34352 26859 18281 -39802 1533 36867
474 36867 -25433 -25772 37860 4015 -40479 17366 30400 -32529 -9766 39471 -8381 -29683
$$ packed form
387a5747K4529O98k5526J6739J7208k7606j43K8725j6485j8769K7027J754k8472
400a6068J3905J8505k6286l163K7847j2872k0370K4097O433k7250J0087K2277
412A7142k1754r472K9016m900k7542J9182J8602k9661n397L2317r907k8774K3078
425A930J6971l2162k622L3298j4064k5374K7187J2705l3142M995L1946k0747k1032
438b0111L1979N169l5030J2807K9520k8879j6945L7917k544l9664K2060L0840
450B7119l9057j2963M6478r429m2701L2919K7995m8009k846N1233k4522l9015
462c2798M7480J4852n7804J6420M9387m6107k5782O1211q578n8083M1335L5334
474C6867o2300l39O3632l3845m4494N7845J3034o2929K2763M9237m7852k1302
$$ plain form
486 -29683 27265 15311 -34038 2961 30671 -18675 -19324 27678 3023 -31104 8935 21860
498 21860 -22770 -11729 28763 -607 -28081 13476 22179 -23204 -10231 31950 -428 -28926
510 -28926 16686 21372 -29450 -7518 35232 -10430 -31507 25920 14943 -40152 3035 38754
522 38754 -23705 -25030 38489 2182 -42403 22025 34048 -36241 -8728 45063 -15988 -38260
534 -38260 35340 19591 -42114 6588 37520 -30935 -26061 38232 1892 -37451 21199 27162
546 27162 -36021 -11526 36744 -9172 -27961 29527 19420 -34727 -2561 31418 -16341 -23244
558 -23244 31022 12658 -34724 2837 26668 -24156 -19925 34389 6298 -34057 12085 25131
570 25131 -31039 -12322 41134 -1930 -32665 23991 19929 -40172 -3170 42259 -14451 -28030
$$ packed form
486b9683N6948j1954m9349L6999K7710m9346o49M7002k4655l4127M0039J2925
498B1860m4630J1041M0492k9370k7474M1557Q703m5383J2973M2181l2378k8498
510b8926M5612M686n0822K1932M2750m5662k1077N7427j0977n5095M3187L5719
522C8754o2459j325O3519l6307m4585O4428J2023p0289K7513N3791o1051k2272
534c8260P3600j5749o1705M8702L0932o8455M874O4293l6340l9343N8650N963
546B7162o3183K4495M8270m5916j8789N7488j0107n4147L2166L3979m7759o903
558b3244N4266j8364m7382L7561K3831n0824M231N4314k8091m0355M6142J3046
570B5131n6170J8717N3456m3064l0735N6656m062o0101L7002M5429n6710j3579
$$ plain form
582 -28030 33449 7543 -46535 7839 37646 -25309 -17221 39813 -3931 -43120 18403 28568
594 28568 -29685 -2639 41119 -14026 -35716 25603 15954 -33488 8110 38546 -22540 -29896
606 -29896 27661 4806 -35314 15974 34388 -26148 -19351 30208 -5874 -33083 25039 28761
618 28761 -28774 -6693 31120 -17276 -28880 31559 17826 -31965 5382 27514 -28900 -22850
630 -22850 35071 6042 -30415 16996 22159 -35329 -13371 35388 -3607 -23441 26716 15182
642 15182 -36546 -4137 30599 -13058 -16743 31746 7058 -36693 2899 23171 -21505 -9984
654 -9984 34902 -316 -34288 10956 18134 -27639 -3101 38451 -5626 -29415 19372 11779 -32848
667 -32848 3657 37362 -12604 -23160 24193 1927 -35385 10375 30374 -20079 -12552 27832
$$ packed form
582b8030O1479k5906n4078N4374K9807o2955Q088N7034m3744l9189O1523J0165
594B8568n8253K7046M3758n5145k1690O1319r649m9442M1598L0436o1086p356
606b9896N7557k2855m0120N1288J8414o0536O797M9559l6082k7209N8122L722
618B8761n7535K2081L7813m8396j1604O0439j3733m9791L7347K2132n6414O050
630b2850N7921k9029l6457M7411N163n7488K1958M8759l8995j9834N0157j1534
642A5182n1728L2409L4736m3657l685M8489k4688m3751L9592K0272m4676J1521
654i984M4886l5218l3972M5244P178m5773K4538M1552m4077k3789M8787p593m4627
667c2848L6505L3705m9966j0556M7353k2266l7312M5760J9999n0453P527M0384
$$ plain form
679 27832 -8011 -32677 18431 22496 -23806 -428 29912 -15797 -27323 23796 14220 -25504
691 -25504 7385 27142 -20878 -22357 23749 4336 -24751 13479 22900 -24224 -14776 23553 -3969
704 -3969 -21547 21463 18355 -25625 -5000 23855 -12625 -18304 25886 11999 -26217 2964 19609
717 19609 -20529 -13862 26990 3043 -23758 10807 13728 -24327 -5806 26302 -4460 -17650
729 -17650 17500 8405 -24577 1035 22632 -9374 -11603 19499 2082 -23548 4932 16732
741 16732 -14206 -7419 20575 -2111 -21974 8940 14178 -16512 -3386 22758 -4833 -19880
753 -19880 13712 10983 -19290 1572 23093 -10276 -16880 17526 4222 -22885 7726 19844
765 19844 -17501 -10383 20771 -4564 -21471 14567 14729 -19482 -1400 20761 -10150 -15515 18045
$$ packed form
679B7832l5843k4666N1108M065m6302K3378L0340m5709j1526N1119r576l9724
691b5504L2889J9757m8020j479M6106j9413k9087L8230R421m7124R448L8329k7522
704c969j7578M3010l108m3980K0625K8855l6480n679M4190j3887l8216K9181J6645
717A9609m0138O667M0852k3947k6801L4565K921l8055J8521L2108l0762j3190
729a7650L5150r095l2982K5612K1597l2006k229L1102j7417k5630K8480J1800
741A6732l0938O787K7994k2686j9863L0914N238l0690J3126K6144k7591j5047
753a9880L3592k729l0273K0862K1521l3369o604L4406j3304k7107L0611J2118
765A9844l7345P118L1154k5335j6907L6038J62l4211J8082K2161l0911n365L3560
$$ plain form
778 18045 6613 -18009 5705 14765 -14509 -8212 16504 -1483 -14790 9492 9060 -15129 -3182
791 -3182 14141 -4150 -10686 10438 6565 -12360 -672 11998 -4159 -8129 10076 4583 -11477
804 -11477 829 10105 -7640 -7592 11440 1506 -13186 4070 10398 -11220 -5479 14528 -1700
817 -1700 -13305 9238 8814 -13449 -472 14977 -6557 -10044 12959 2597 -15205 4443 11754
830 11754 -11360 -5472 13165 -2511 -12511 8918 7271 -12113 -272 12256 -5539 -7859 10263
843 10263 3112 -10301 3035 9214 -6869 -4922 8537 211 -9004 3076 5829 -6602 -3617
856 -3617 6771 -1014 -6978 4121 4430 -5591 -958 6382 -1656 -4710 4975 3189 -5802 966 6048
871 6048 -3552 -4409 5413 1201 -6920 926 5009 -4385 -3666 4939 376 -5097 2518 3660 -4206 -584
$$ packed form
778A8045j1432k4622K3714R060k9274O297K4716j7987j3307K4282m32k4189J1947
791c182J7323j8291o536K1124l873j8925J1688J2670j6157l970J8205n493j6060
804a1477J2306R276j7745M8J9032r934j4692J7256O328k1618N741K0007j6228
817a700j1605K2543m24k2263J2977J5449k1534l487K3003j0362j7802J9648P311
830A1754k3114N888J8637j5676j0000K1429j647j9384J1841J2528j7795k320J8122
843A0263p151j3413J3336O179j6083J947J3459q326r215J2080K753j2431K985
856c617J0388p785n964J1099L09j0021M633P340q038l054R685j786q991O768N082
871F048r600q57R822m212q121P846M083r394P19Q605m563n473P615J142p866L622
$$ plain form
887 -584 5245 -1533 -3441 4439 2030 -5191 869 4505 -3521 -3193 4299 -190 -5091 2278 3099 -4746
903 -4746 -1247 4858 -1465 -3808 3885 2033 -4110 1553 3964 -2791 -1527 4086 -443 -3420 2207
918 2207 1581 -3198 -594 2277 -1629 -1742 1905 -29 -1789 960 1211 -1205 -33 1468 343 -509
934 -509 242 655 208 -597 -404 1134 -334 -1496 429 1010 -1911 -694 1479 -872 -1521 1576 483
951 483 -1385 385 1876 -834 -397 2046 -6 -1000 1012 745 -1163 -363 275 -444 -713 -342 -409 510
969 510 -239 -659 754 339 -1084 245 1440 -617 20 1941 -514 -1185 2099 375 -2894 896 2101
986 2101 -2633 -1042 2692 -1134 -2690 2447 762 -3195 1025 2917 -2037 -1133 3217 -264 -2609
1001 -2609 2309 1780 -2691 427 2684 -1601 -1375 2112 -85 -2825 1222 1759 -2367 -1371 2203 47
$$ packed form
887e84N829o778j908P880k409p221O060L636q026L28P492m489m901P369Q21p845
903d746L499O105o323k343P693j852o143N663K411o755J264N613m529k977N627
918B207o26m779K604K871l906j13L647j934j760K749K51k416J172J501j125q52
934e09P51M13m47q05J93J538j468j162J925N81k921J217K173k351o49L097j093
951D83j868J770J491k710M37K443k052r94K012k67j908Q00O38p19k69L71o7R19
969E10p49m20J413m15j423J329J195k057O37J921k455o71L284j724l269L790J205
986B101m734J591L734l826j556N137j685l957M220J892m954R04M350l481k345
1001b609M918n29m471L118K257m285K26L487k197k740M047N37m126R96L574k156
$$ plain form
1017 47 -2556 1699 2468 -2348 -888 3148 -262 -2554 2152 2281 -2977 -286 3579 -1566 -3158 2982
1033 2982 858 -4535 736 3803 -3228 -2112 4445 -277 -4935 3007 3740 -4394 -671 5495 -1532
1048 -1532 -4124 3622 2331 -4557 291 4114 -2825 -3118 3455 427 -4476 1474 3039 -3383 -1488
1063 -1488 4498 -529 -3832 2940 3071 -3612 -750 4877 -727 -4220 3354 2254 -4577 -772 4430
1078 4430 -2237 -3971 4145 1777 -5050 1312 4342 -3374 -2268 5150 -83 -4200 3134 3099 -5245
1093 -5245 -262 5551 -2589 -4076 4656 1389 -5907 881 4351 -3960 -2934 5186 -163 -5130 2411
1108 2411 3610 -4472 -727 5373 -1864 -3892 3959 2342 -4922 361 4746 -2892 -3977 4442 938
1123 938 -5342 1675 4498 -3905 -3353 4784 -25 -4851 3128 4136 -4288 -1362 4857 -1528 -4340
$$ packed form
1017D7k603M255P69m816J460M036l410k292M706J29n258K691L865n145j592O140
1033B982k124n393N271L067p031J116O557m722m658P942P33q134L723O166p027
1048a532k592P746j291o888M848L823o939k93O573l028m903N950J565o422J895
1063a488N986n027l303O772J31o683K862N627n604l493P574j100o831L805N202
1078D430o667j734Q116k368o827O362L030p716J106P418n233m117P334l5q344
1093e245M983N813q140j487Q732l267p296O788L470q311J026Q120n349m967P541
1108B411J199q082L745O100p237k028P851j617p264N283M385p638j085Q419l504
1123I38o280P017K823q403N52Q137m809m826P979J008q424K926O219o385k812
$$ plain form
1138 -4340 4014 2644 -4994 112 4571 -3266 -3829 4976 1331 -5120 1735 4285 -4338 -2730 5344
1153 5344 241 -4513 3343 3603 -5426 -1314 5470 -1487 -3992 4521 1946 -6105 377 4667 -3577
1168 -3577 -2763 5522 397 -5967 1941 3820 -4887 -901 6169 -1346 -5053 3836 2345 -5188 867
1183 867 6043 -2716 -3596 3980 56 -5175 1971 4750 -3479 -2069 4086 -1391 -4793 2973 3631 -3672
1199 -3672 -472 4337 -2023 -4594 3322 2759 -3692 464 4378 -2789 -3936 3682 1507 -4325 1604
1214 1604 4253 -3928 -3407 4268 324 -4160 3431 4146 -4865 -1927 4913 -1564 -4122 5159 2961
1229 2961 -5784 236 4204 -3915 -3150 5780 842 -5392 2076 2862 -4868 -1306 5574 -645 -3584
1244 -3584 3390 1239 -5076 307 4628 -1830 -2056 3858 -4 -5045 793 3359 -2359 -1436 3655
$$ packed form
1138d340Q354j370p638N106M459p837n63Q805l645o451O855K550q623J608Q074
1153E344n103m754P856K60r029M112O784o957k505Q513k575q051O482M290q244
1168c577Q14Q285n125o364P908J879q707L986P070p515l707Q889j491p533O055
1183H67N176q759q80P576l924n231P146K779q229J410O155n477l402P766O58p303
1199c672L200M809o360k571P916n63o451M156L914p167j147P618k175n832N929
1214A604K649q181N21P675l944m484P591P15r011K938O840o477k558R281k198
1229B961q745O020L968q119P65Q930m938o234P468P86p730L562O880o219k939
1244c584O974k151o315N383M321o458k26N914l862n041N838K566n718R23N091
$$ plain form
1259 3655 -499 -4559 973 2622 -2944 -543 4044 -616 -3627 2018 2213 -3120 459 4335 -1633
1274 -1633 -3379 2686 1033 -4036 1424 4341 -2977 -2710 3554 -457 -4360 2644 3709 -3758 -1400
1289 -1400 4043 -1587 -3810 3686 2191 -3874 579 3236 -3030 -2773 3979 775 -3693 1500 2640
1304 2640 -3725 -1728 3630 -317 -2901 2727 1985 -3622 -287 3500 -1383 -2127 3246 1355 -3293
1319 -3293 -2 2433 -1732 -1577 3035 368 -3347 804 1939 -2483 -755 3459 -442 -2669 1857
1334 1857 1497 -2798 -69 3141 -950 -2109 2559 881 -3426 400 2823 -1937 -1704 2555 -86
1349 -86 -3078 1195 2401 -2447 -720 2843 -329 -2757 1999 1545 -2251 200 2833 -1227 -2164 2453
1365 2453 615 -2431 786 2232 -2166 -1362 2527 -394 -2530 1683 1605 -2075 -599 2559 -853 -1615
$$ packed form
1259C655m154m060N532J649n566K401M587m660l011N645J95n333L579L876n968
1274a633j746O065j653n069N460K917p318K67O264m011l903P004J065p467K358
1289a400N443n630k223P496j495o065M453K657o266K57O752l204m468N193J140
1304B640o365J997N358l947k584N628p42n607L335L787m883p44N373j891m648
1319c293L291K435m165J55M612k667l715M151J135m422J728M214l901k227M526
1334A857l60m295K729L210m091j159M668j678m307L826K423m760K33M259k641
1349h6k992M273J206m848J727L563l172k428M756m54l796K451K633m060r37M617
1365B453j838l046L217J446m398Q04L889k921k136M213p8l680J476L158l412p62
$$ plain form
1381 -1615 2083 1204 -2040 189 1963 -1339 -1488 1774 209 -2123 480 1380 -1537 -505 1933 -146
1397 -146 -1525 988 1198 -1595 -94 1871 -491 -1484 1560 677 -1541 164 1688 -1278 -1184 1225
1413 1225 53 -1785 356 1665 -1258 -751 1722 -205 -1421 1100 1270 -1357 -68 1983 -967
1428 -967 -947 1492 231 -1267 443 1173 -1002 -918 1071 37 -1232 673 861 -962 -387 960 -260
1445 -260 -919 901 688 -870 160 937 -548 -782 648 512 -819 275 867 -462 -623 882 94
1462 94 -863 115 763 -826 -263 954 -147 -685 897 663 -686 -282 1017 -255 -478 621 141 -929
1480 -929 33 531 -662 -124 352 -58 -315 411 255 -470 -14 506 -296 -37 313 176 -248 187 218 -364
1500 -364 -278 112 -210 -311 -20 361 -146 -165 310 -271 -299 67 168 -57 -206 641 26 -317 264 109 -243
$$ packed form
1381a615L698q79l244K229J774l302j49L262j565k332K603R00k917J032K438k079
1397a46j379K513K10k793J501J965k362r93L044q83k218J705J524k966R4K409
1413A225j172j838K141J309k923N07K473j927j216K521J70k627J289K051k950
1428i67K0K439j261j498J710P30k175Q4J989j034j269J905J88j823N75J347j220
1445b60o59J820k13j558J030P77j485k34J430j36j331J094N92j329j61J505p88
1462I4r57R78O48j589N63J217j101n38J582k34j349M04J299j272k23J099m80j070
1480i29R62M98j193N38M76m10k57P26j56p25M56N20q02K59L50j37m24M35L1n82
1500c64Q6L90l22j01K91L81n07j9M75n81k8L66J01k25j49Q47o15l43N81j55l52
$$ plain form
1521 -243 -111 263 -364 -76 -30 97 -495 202 62 -362 -437 308 154 -151 462 -130 -142 -19 200 -252 130
1542 130 278 29 18 -21 126 13 241 -72 5 244 -79 -110 200 -30 -242 142 284 -185 95 230 -212
1563 -212 -403 131 149 -402 -107 142 -350 -258 172 109 -281 192 221 -45 -283 224 -13 29 146 65 -191 13
1585 13 308 -46 -184 -62 238 -183 86 274 4 -417 -24 70 -448 78 67 -35 -268 29 176 -357 -6
1606 -6 118 18 21 429 110 -341 105 356 -283 -155 203 -16 -344 336 -109 -304 351 574 -106 -396 525
1627 525 -28 -575 584 50 -289 -32 558 -289 -467 235 -141 -791 158 620 -320 -222 435 6 -626 106
1647 106 650 -388 -374 253 -142 -310 297 161 -122 -116 214 -216 -274 497 174 -144 250 417 -75 -289 456
1668 456 461 -173 -4 335 -193 -272 327 231 -363 180 499 -506 -117 595 -200 -489 298 311 -423 114 703
$$ packed form
1521b43J32L74o27K88M6J27n92O97j40m24p5P45j54l05O13n92j2J23K19m52L82
1542A30J48k49j1l9J47j13K28l13P7K39l23l1L10k30k12L84J42m69K80J35m42
1563b12j91N34J8n51K95K49m92R2M30o3l90M73K9k66k38N07k37M2J17q1k56K04
1585A3K95l54j38J22L00m21K69J88k70m21L93R4n18N26j1j02k33K97J47n33L51
1606fJ24j00LM08l19m51M46K51o39J28L58k19l28O80m45j95O55K23o80k90R21
1627E25n53n47J159n34l39K57N90q47j78P02l76o50R49M62r40R8O57m29o32P32
1647A06N44j038J4O27l95j68O07j36k83OL30m30n8P71l23l18L94J67m92k14P45
1668D56No34J69L39n28p9N99r6n94N43L19j005L89P12p95k89P87J3p34N37N89
$$ plain form
1689 703 -528 -258 558 -73 -579 293 413 -470 -117 494 -142 -300 561 135 -624 114 577 -263 -595 170
1709 170 -39 -488 56 319 -444 -36 374 -117 -338 367 416 -310 183 43 -259 -71 322 74 -498 390
1729 390 258 -195 -398 475 1 -452 395 335 -109 -230 412 -67 -178 468 299 -666 -115 415 -375 -61
1749 -61 567 209 -411 157 327 -139 -196 353 72 -152 136 470 -183 181 322 107 -264 -63 -124 -519 -137
1770 -137 435 -317 -254 495 -32 -434 117 254 -503 -143 285 -166 -173 75 396 -233 227 314 -92 -493 124
1791 124 203 -375 285 91 -400 -444 83 20 -566 369 454 -194 -310 339 125 -563 359 372 -333 194 607 -261
1813 -261 -258 406 41 -360 293 174 -234 -315 398 -211 -101 400 192 -118 -358 316 -134 -231 263 29 -167
1834 -167 -197 188 -255 267 517 42 -499 -77 126 -109 80 370 163 -731 510 206 -257 174 200 -41
$$ packed form
1689G03j231K70Q16o31n06Q72J20q83L53O11o36j58Q61m26p59P38M63q40l32P65
1709A70k09m49N44K63p63M08M10m91k21P05M9p26M93j40l02J88L93k48n72Q88
1729C90j32m53k03Q73m74m53Q47o0m44j21O42m79j11O46j69r65N51N30p90L14
1749f1O28l58o20N68J70m66n7N49k81k24K88L34o53L64J41k15l71K01o1l95L82
1770a37N72p52O3P49n27m02N51J37p57L60M28m51pK48L21o29M60Q7m06m01O17
1791A24P9n78O60j94m91m4N27o3n86R35Q5o48j16O49k14o88R22J3p05N27M13q68
1813b61LO64l65m01O53j19m08q1P13o09J10N01k08l10k40O74m50r7M94k34j96
1834a67l0L85m43N22K50m75n41M22K03k35J89K90k07q94J241l04m63M31K6k41
$$ plain form
1854 -41 -93 135 -41 -296 1 357 -79 -502 119 -69 -252 294 150 -132 -204 69 -52 -43 90 505 -166 247
1876 247 11 -213 -287 457 110 -342 66 122 -222 133 362 -311 -259 75 169 -303 -78 49 109 -390 272 40
1898 40 -111 -32 172 -176 -283 378 230 -249 -164 154 40 -70 31 206 -148 218 84 -233 -30 141 101
1919 101 -272 308 282 -275 -126 232 -39 -216 165 94 -240 -109 191 -195 -131 373 -43 -265 -129 233 -359
1940 -359 230 50 -133 1 172 51 140 87 -106 -118 -19 144 -333 -247 166 343 -165 8 8 5 -109 152 214
1963 214 25 -187 321 -198 16 -11 -41 -315 147 -6 -152 -68 187 -61 -134 163 156 -52 -84 180 -237 -99
1985 -99 237 337 -185 -265 122 41 -61 131 122 -67 121 277 -99 -237 97 135 -109 236 -31 79 -230 -65
2007 -65 10 -243 374 -120 -122 61 -121 80 80 210 -294 -74 107 89 -158 110 -21 13 -53 37 145 -128 -61 39
$$ packed form
1854d1n2K28j76k55K97L56m36m23O21j88j83N46j44k82p2K73j21RJ33M15o71M13
1876B47k36k24p4P44l47m52M08N6l44L55K29o73N2L34R4m72K25J27O0m99O62k32
1898D0j51P9K04l48j07O61j48m79Q5L18j14j10J01J75l54L66j34l17K03J71m0
1919A01l73N80k6n57J49L58k71j77L81p1l34J31L00l86O4N04m16k22J36L62n92
1940c59N89j80j83J34J71j21Q9n3j93j2R9J63m77Q6M13J77n08J73%lj14K61O2
1963B14j89k12N08n19K14k7l0k74M62j53j46Q4K55k48p3K97pk08l2K64m17J38
1985i9L36J00n22q0L87q1j02J92rj89J88J56l76j38L34L8k44L45k67J10l09J65
2007f5P5k53O17m94kJ83j82K01%J30n04K20J81j8k47K68j31L4o6R0J08k73O7J00
$$ plain form
2031 39 -350 -28 -162 69 107 144 -153 12 117 131 111 209 -250 57 -136 11 130 -10 -97 38 172 -22
2053 -22 -23 184 62 103 -159 -69 -47 18 18 53 75 -257 19 -329 -187 119 178 -78 13 -177 49 127 69 -39 -106
2078 -106 -154 -200 229 -10 -241 -67 103 -161 -273 81 -93 218 149 -84 235 -170 -257 191 143 153 -20 -117
2100 -117 361 -28 56 -232 14 -212 -112 172 186 -40 199 154 -307 -86 -217 143 233 -166 6 64 350 -45
2122 -45 133 -61 47 159 -7 -120 132 229 131 122 -5 -92 -3 170 306 -15 -151 153 -97 -61 32 7 -263
2145 -263 13 143 98 -10 15 -74 -86 88 54 -66 253 204 -29 131 261 -116 -146 288 25 -170 -255 -200 55
2168 55 52 26 -1 -129 142 244 -160 -45 -406 84 345 225 185 149 -68 72 -92 103 75 -128 134 -107 220
2191 220 -335 58 -295 -3 -21 -155 37 -286 -33 129 101 101 25 71 -34 -221 150 47 97 -45 57 -208
$$ packed form
2031C9l89L22j34K31L8L7k97J65J05J4k0R8m59L07j93J47J19j40q7J35J34j94
2053b2jK07j22M1k62R0K2O5%L5K2l32K76l48J42L06N9k56R1j90K26P8n8j08o7
2078a06m8m6M29k39k31J74J70k64j12L54j74L11o9k33L19m05q7M48m8J0j73r7
2100a17M78l89Q4k88K46k26J00K84J4k26K39m5m61K21j31L60R0l99J72N8K86l95
2122d5J78j94J08J12j66j13K52R7r8rj27q7Q9J73J36l21j36L04k50L6R3k5k70
2145b63K76J30m5j08K5q9j2J74l4j20L19m9k33J60J30l77l0M34k63j95q5N5K55
2168E5lk6k7j28K71J02m04J15l61M90K61j20m0l6k17J40j64J95k8k03K62k41L27
2191B20n55L93l53K92j8j34J92l23K53J62k8%p6M6j05j87L71j03N0j42J02k65
$$ plain form
2213 -208 95 -13 -55 136 172 -27 -148 45 109 57 -40 -92 54 229 113 -170 -163 197 88 -151 206 -59 4
2236 4 75 -100 33 -192 -37 136 -65 174 -20 116 282 -166 -44 180 -218 119 51 201 133 -32 90 -88
2258 -88 -272 105 170 -85 8 -28 -53 -92 -138 -49 -116 282 -99 -27 -103 130 2 58 -36 51 -200 -3 -310 -76 -30
2283 -30 -26 24 -259 118 -97 -87 -2 166 179 263 -70 101 -41 -146 294 -168 -57 115 -181 258 24 -49 -84
2306 -84 186 -159 -510 -122 221 326 -34 56 23 -97 132 24 -17 93 -237 -67 -292 140 98 -83 -68 175
2328 175 134 -252 -67 -8 -50 -111 9 43 -54 -116 -77 163 -36 5 -52 -80 164 -191 94 180 -6 -190 142 -8
2352 -8 -130 -161 240 -98 -9 -108 -132 131 81 141 208 -244 132 -127 -224 44 289 98 -90 -12 309 38 -204 282
2376 282 -122 163 -43 40 -79 -95 107 -166 156 155 -256 -285 155 63 108 -124 112 -160 128 -159 -103 -53 -101
$$ packed form
2213b08L03j08m2J91L6j99j21J93O4n2r7n2J46J75j16k83PL60j09k39L57k65O3
2236DP1j75J33k25J55J73k01K39j94J36J66m48J22K24l98L37o8J50o8j65J22j78
2258h8j84L77O5k55R3l6k5l9m6Q9o7L98l81P2p6K33j28N6r4Q7k51J97l07K34M6
2283c0MN0k83L77k15J0Q5J68J3Q4l33J71j42j05M40m62J11J72k96M39k34p3l5
2306h4K70l45l51L88L43J05l60R0l3j20K29j08m1J10l30J70k25M32m2j81J5K43
2328A75m1l86J85N9m2o1J20L4r7o2L9K40j99M1n7k8K44l55K85Q6j86j84L32j50
2352hj22l1M01l38Q9r9k4K63n0O0O7m52L76k59r7K68K45j91j88P8L21k71k42M86
2376B82m04K85k06Q3j19j6K02k73L22jm11k9M40r2M5k32K36k72K88k87N6N0m8
$$ plain form
2399 -101 28 -9 227 -9 65 169 -137 70 327 -100 -90 -16 237 93 -72 1 -50 -2 207 153 148 42 -111
2422 -111 80 -73 216 -20 -91 16 -5 -80 182 -113 -204 -204 -110 -107 -31 -93 38 -113 -13 49 168 80 -114 66
2446 66 -35 197 -123 23 324 -69 18 -131 185 -176 -23 22 221 -126 186 52 135 48 47 121 -238 95 205
2469 205 -70 192 73 7 56 86 2 -207 166 309 161 231 111 69 -19 103 -103 -192 -327 -67 -126 96 164
2492 164 4 -214 -109 201 -87 34 360 -66 90 142 -88 -369 -1 -12 -312 -132 219 -58 -15 47 6 22
2514 22 -122 138 -46 -260 180 81 -171 -73 86 -57 -20 153 322 -252 9 173 -64 113 -12 60 -309 -303
2536 -303 181 -301 -162 300 11 12 5 228 92 339 467 15 -77 36 58 -105 -177 -15 -176 96 282 -13
2558 -13 -72 181 228 -210 -33 -10 -76 -58 223 297 -328 19 13 141 -416 204 194 -78 19 29 14 -62 228 124 -116
$$ packed form
2399a01J29l7K36k36P4J04l06K07K57m27J0P4K53j44j65P3n1M8K09n4nj06j53
2422a11J91j53K89k36p1J07k1p5K62k95r1%R4LP6o2J31j51J00O2J19q8j94J80
2446F6j01K32l20J46L01l93Q7j49L16l61J53M5J99l47L12j34Q3q7jP4l59L33J10
2469B05k75K62j19o6M9L0q4k09L73J43j48P0j20m2q8J22k06q9j35K60n9K22O8
2492A64j60k18J05L10k88J21L26m26J56N2k30k81L68j1l00J80L51k77M3O2m1J6
2514B2j44K60j84k14M40r9k52R8J59j43L7J73J69n74K61J64k37J77j25P2l69O
2536c03M84m82J39M62k89JpK23j36K47J28m52r2J13K2j63p2J62j61K72J86k95
2558a3n9K53M7m38J77K3o6J8K81P4o25L47oJ28n57O20j0k72R7J0j5p6K90j04k40
$$ plain form
2583 -116 214 299 -9 89 5 -66 -128 283 173 43 248 -97 126 -126 -29 430 3 5 -30 57 126 140 -59 227
2607 227 216 324 -129 -132 223 -228 -103 -117 66 143 -198 82 -135 -66 10 82 -214 -256 225 50 -180 252 96
2630 96 81 -179 29 -357 -239 37 145 95 199 -25 -36 -98 190 -92 -371 79 85 -171 6 95 196 101 -175
2653 -175 114 -206 150 49 283 -157 -211 5 66 -42 79 -164 -34 77 160 113 28 -168 113 -1 -92 -282
2675 -282 -293 -16 -51 -6 60 336 -166 21 168 -47 80 286 -124 -62 84 -13 -58 -194 125 -43 -7 109 -131
2698 -131 68 103 -1 159 -233 -208 117 -27 -52 -4 6 -214 -82 51 -162 136 -135 117 -7 -76 229 6
2720 6 -182 95 203 -148 42 154 -93 -141 126 194 143 -170 -38 -91 -104 205 -83 174 -233 -256 33 -146 121
2743 121 -42 61 -110 1 88 -141 254 59 -26 -143 -405 154 22 -117 8 -139 -81 132 -105 -203 199
$$ packed form
2583a16L30Q5l08R8q4p1o2M11j10j30K05l45K23k52R7M59m27Kl5Q7O9J4j99K86
2607B27j1J08m53lL55m51J25j4J83P7l41K80k17O9P6P2k96m2M81j75k30M32j56
2630I6j5k60K08l86J18K76J08n0J04k24j1o2K88k82k79M50Ok56J77Q9J01r5k76
2653a75K89l20L56j01K34m40n4K16O1j08J21k43J30J11Q3m7q5j96K81j14r1j90
2675b82j1K77l5M5O6K76n02J87J47k15J27K06m10O2J46r7m5j36L19j68L6J16k40
2698a31J99L5j04J60l92K5L25j44k5M8J0k20J32J33k13K98k71K52j24o9L05k23
2720Fj88K77J08l51J90J12k47m8K67O8n1l13J32n3j3L09k88K57m07k3K89j79K67
2743A21j63J03j71J11Q7k29L95j95q5j17k62N59j32j39J25j47N8K13k37r8M02
$$ plain form
2764 199 -71 -251 135 93 -100 -201 -33 -75 -221 20 -53 -81 -269 121 -270 -251 68 59 -7 -514 117 66 -35
2787 -35 314 -105 -57 27 393 48 -21 57 163 -261 140 311 -104 0 204 144 -126 113 -64 -76 -148 270 -249
2810 -249 90 -48 252 -169 -108 -151 -53 -61 -9 -20 -175 -55 35 -233 -81 13 3 -98 -175 126 -218 -121 -416 27
2834 27 -217 -1 -36 225 35 253 -52 -68 148 -129 -211 -130 49 195 1 268 7 -230 160 22 -76 -279
2856 -279 145 -158 -124 355 23 158 -79 -90 -277 -168 -28 -121 -175 147 226 -98 29 150 272 11 65 107
2878 107 -391 -40 468 -74 -185 113 53 -22 -98 111 -226 -84 89 125 -83 -57 135 105 -52 72 -139 89
$$ packed form
2764A99k70j80L86m2j93j01J68m2j46K41p3k8j88L90l91J9L19ro6n07O31n1j01
2787c5L49m19M8Q4L66l45o9P8J06m24M01J71m15J04K04o0k70K39j77j2p2M18n19
2810b49L39j38L00m21O1m3R8qN2j1j55J20R0k68J52R4j0j01p7L01l44R7k95M43
2834B7k44K16l5K61j90K18l05j6K16k77q2Q1J79J46j94K67k61k37L90j38r8k03
2856b79M24l03L4M79l32J35k37j1j87J09J40r3n4L22P9l24J27J21J22k61N4M2
2878A07m98L51N08n42j11K98o0p5p6K09l37J42J73L6k08K6J92l0j57J24k11K28
$$ [...]
8191C8
##END NTUPLES=NMR FID
##END=
