##TITLE=1H_II
 200.13MHz,CDCl3 ,
 8 sc
 
 13.3.2025
##JCAMPDX= 6.0         $$ Bruker NMR JCAMP-DX V2.0
##DATA TYPE= NMR FID
##DATA CLASS= NTUPLES
##ORIGIN= UXNMR, Bruker Analytische Messtechnik GmbH
##OWNER= pz
$$ XWIN-NMR		Version 3.5
$$ Thu Mar 13 13:55:43 2025 Russian Standard Time (UT+4h)  she@DPX200
##.OBSERVE FREQUENCY= 200.1313
##.OBSERVE NUCLEUS= ^1H
##.DELAY= (6, 6)
##.ACQUISITION MODE= SIMULTANEOUS
##.ACQUISITION SCHEME= undefined
##.AVERAGES= 8
##.DIGITISER RES= 18
##SPECTROMETER/DATA SYSTEM= spect
##.PULSE SEQUENCE= zg30
##.SOLVENT NAME= CDCl3
##.SHIFT REFERENCE= (INTERNAL, CDCl3, 0, 14.3821)
##AUDIT TRAIL= $$ (NUMBER, WHEN, WHO, WHERE, WHAT)
$$ ##TITLE= Audit trail, XWIN-NMR		Version 3.5
$$ ##JCAMPDX= 5.01
$$ ##ORIGIN= Bruker BioSpin GmbH
$$ ##OWNER= she
$$ F:/spectra/data/she/nmr/H-C/1/audita.txt
$$ ##AUDIT TRAIL=  $$ (NUMBER, WHEN, WHO, WHERE, WHAT)
(   1,<2025-03-13 13:54:43.82 +0400>,<she>,<DPX200>,
      <created by zg, POWCHK disabled, PULCHK disabled
       configuration hash MD5:
       00 E9 B6 7A A2 85 ED C7 34 08 36 98 17 FE 4E 26
       data hash MD5: 16K
       78 CB 8B C9 DD EE 36 32 D8 7C 72 25 3B 59 81 3D>)
$$ ##END=
$$ 
$$ hash MD5
$$ 78 E5 E8 28 AD 65 93 15 96 3D 35 38 16 40 5C E7
##$RELAX= 
##$RELAX= 
##$RELAX= 
##$RELAX= 
##$RELAX= 
##$RELAX= 
$$ Bruker specific parameters
$$ --------------------------
##$DU= <F:/spectra>
##$EXPNO= 1
##$NAME= <H-C>
##$PROCNO= 1
##$TYPE= <nmr>
##$USER= <she>
##$AMP= (0..31)
100 100 100 100 100 100 100 100 100 100 100 100 100 100 100 100 100 100 
100 100 100 100 100 100 100 100 100 100 100 100 100 100 
##$AQSEQ= 0
##$AQ_mod= 1
##$AUNM= <au_zg>
##$AUTOPOS= <>
##$BF1= 200.13
##$BF2= 200.13
##$BF3= 200.13
##$BF4= 200.13
##$BF5= 200.13
##$BF6= 200.13
##$BF7= 200.13
##$BF8= 200.13
##$BYTORDA= 1
##$CFDGTYP= 0
##$CFRGTYP= 5
##$CHEMSTR= <none>
##$CNST= (0..31)
1 1 145 1 1 1 1 1 1 1 1 1 1 1 1 1 1 1 1 1 1 1 1 1 1 1 1 1 1 1 1 1 
##$CPDPRG= <>
##$CPDPRG1= <>
##$CPDPRG2= <>
##$CPDPRG3= <>
##$CPDPRG4= <mlev>
##$CPDPRG5= <mlev>
##$CPDPRG6= <mlev>
##$CPDPRG7= <mlev>
##$CPDPRG8= <mlev>
##$CPDPRGB= <>
##$CPDPRGT= <>
##$D= (0..31)
0 0.7 0 0 0 0 0 0 0 0 0 0.03 0 0 0 0 0 0 0 0 0 0 0 0 0 0 0 0 0 0 0 0 
##$DATE= 1741859683
##$DBL= (0..7)
120 120 120 120 120 120 120 120 
##$DBP= (0..7)
150 150 150 150 150 150 150 150 
##$DBP07= 0
##$DBPNAM0= <>
##$DBPNAM1= <>
##$DBPNAM2= <>
##$DBPNAM3= <>
##$DBPNAM4= <>
##$DBPNAM5= <>
##$DBPNAM6= <>
##$DBPNAM7= <>
##$DBPOAL= (0..7)
0.5 0.5 0.5 0.5 0.5 0.5 0.5 0.5 
##$DBPOFFS= (0..7)
0 0 0 0 0 0 0 0 
##$DE= 6
##$DECBNUC= <off>
##$DECIM= 32
##$DECNUC= <off>
##$DECSTAT= 4
##$DIGMOD= 1
##$DIGTYP= 9
##$DL= (0..7)
0 120 120 120 120 120 120 120 
##$DP= (0..7)
150 150 150 150 150 150 150 150 
##$DP07= 0
##$DPNAME0= <>
##$DPNAME1= <>
##$DPNAME2= <>
##$DPNAME3= <>
##$DPNAME4= <>
##$DPNAME5= <>
##$DPNAME6= <>
##$DPNAME7= <>
##$DPOAL= (0..7)
0.5 0.5 0.5 0.5 0.5 0.5 0.5 0.5 
##$DPOFFS= (0..7)
0 0 0 0 0 0 0 0 
##$DQDMODE= 0
##$DR= 18
##$DS= 0
##$DSLIST= <SSSSSSSSSSSSSSS>
##$DSPFIRM= 0
$$ [...]
##$SUBNAM0= <"">
##$SUBNAM1= <"">
##$SUBNAM2= <"">
##$SUBNAM3= <"">
##$SUBNAM4= <"">
##$SUBNAM5= <"">
##$SUBNAM6= <"">
##$SUBNAM7= <"">
##$SUBNAM8= <"">
##$SUBNAM9= <"">
##$SW= 18.0517328524113
##$SWIBOX= (0..15)
0 0 2 0 0 0 0 0 0 0 0 0 0 0 0 0 
##$SW_h= 3612.71676300578
##$TD= 16384
##$TD0= 1
##$TE= 0
##$TE2= 300
##$TE3= 300
##$TEG= 300
##$TL= (0..7)
0 120 120 120 120 120 120 120 
##$TP= (0..7)
150 150 150 150 150 150 150 150 
##$TP07= 0
##$TPNAME0= <>
##$TPNAME1= <>
##$TPNAME2= <>
##$TPNAME3= <>
##$TPNAME4= <>
##$TPNAME5= <>
##$TPNAME6= <>
##$TPNAME7= <>
##$TPOAL= (0..7)
0.5 0.5 0.5 0.5 0.5 0.5 0.5 0.5 
##$TPOFFS= (0..7)
0 0 0 0 0 0 0 0 
##$TUNHIN= 0
##$TUNHOUT= 0
##$TUNXOUT= 0
##$USERA1= <user>
##$USERA2= <user>
##$USERA3= <user>
##$USERA4= <user>
##$USERA5= <user>
##$V9= 5
##$VALIST= <valist>
##$VCLIST= <CCCCCCCCCCCCCCC>
##$VD= 0
##$VDLIST= <DDDDDDDDDDDDDDD>
##$VPLIST= <PPPPPPPPPPPPPPP>
##$VTLIST= <TTTTTTTTTTTTTTT>
##$WBST= 1024
##$WBSW= 4
##$XGAIN= (0..3)
0 0 0 0 
##$XL= 0
##$YL= 0
##$YMAX_a= 59142
##$YMIN_a= -73302
##$ZGOPTNS= <>
##$ZL1= 120
##$ZL2= 120
##$ZL3= 120
##$ZL4= 120
##$ABSF1= 10
##$ABSF2= 0
##$ABSG= 5
##$ABSL= 3
##$ALPHA= 0
##$AQORDER= 0
##$ASSFAC= 0
##$ASSFACI= 0
##$ASSFACX= 0
##$ASSWID= 0
##$AUNMP= <proc_1d>
##$AZFE= 0.1
##$AZFW= 0.1
##$BCFW= 1
##$BC_mod= 2
##$BYTORDP= 1
##$COROFFS= 0
##$CY= -3
##$DATMOD= 1
##$DC= 2
##$DFILT= <>
##$DTYPP= 0
##$F1P= 0
##$F2P= 0
##$FCOR= 0.5
##$FTSIZE= 0
##$FT_mod= 4
##$GAMMA= 1
##$GB= 0.15
##$INTBC= 1
##$INTSCL= 1
##$ISEN= 128
##$LB= 0.25
##$LEV0= 0
##$LPBIN= 0
##$MAXI= 10000
##$MC2= 0
##$MEAN= 0
##$ME_mod= 0
##$MI= 1.114404
##$NCOEF= 0
##$NC_proc= 0
##$NLEV= 6
##$NOISF1= 3.799351
##$NOISF2= 2.8
##$NSP= 1
##$NTH_PI= 0
##$NZP= 0
##$OFFSET= 14.38212
##$PC= 1
##$PHC0= -471.8474
##$PHC1= 13.19221
##$PH_mod= 1
##$PKNL= yes
##$PPARMOD= 0
##$PSCAL= 0
##$PSIGN= 0
##$REVERSE= no
##$SF= 200.129724274929
##$SI= 16384
##$SIGF1= 3
##$SIGF2= 2
##$SINO= 400
##$SIOLD= 16384
##$SREGLST= <1H.CDCl3>
##$SSB= 0
##$STSI= 0
##$STSR= 0
##$SW_p= 3205.1282051282
##$SYMM= 0
##$S_DEV= 0
##$TDeff= 0
##$TDoff= 0
##$TI= <>
##$TILT= no
##$TM1= 0
##$TM2= 0
##$TOPLEV= 0
##$USERP1= <user>
##$USERP2= <user>
##$USERP3= <user>
##$USERP4= <user>
##$USERP5= <user>
##$WDW= 1
##$XDIM= 8192
##$YMAX_p= 0
##$YMIN_p= 0
$$ End of Bruker specific parameters
$$ ---------------------------------
##NTUPLES= NMR FID
##VAR_NAME=  TIME,          FID/REAL,        FID/IMAG
##SYMBOL=    X,             R,               I
##VAR_TYPE=  INDEPENDENT,   DEPENDENT,       DEPENDENT
##VAR_FORM=  AFFN,          ASDF,            ASDF
##VAR_DIM=   8192,          8192,            8192
##UNITS=     SECONDS,       ARBITRARY UNITS, ARBITRARY UNITS
##FACTOR=    0.0002768,     1,               1
##FIRST=     0,             0,               0
##LAST=      2.2672688,     0,               0
##MIN=       0,             -73302,          0
##MAX=       2.2672688,     59142,           0
$$ Real data points
##PAGE= N=1
##DATA TABLE= (X++(R..R)), XYDATA
$$ [...]
1826a45P2K01l2m4j10j89j55K37Q0n2j30K24l09L89J36k5K02l9j42J27J2l11K09
1849B06k17L7N2Q0J20n64L4K56k48l7m1J35J66j65N63q9l31K91j58J87q5k9n38
1872c75M70k15K57j79j15j84K44k58K96P0M0M5m01L57k22L96m09N35l04j26M60
1893C82k08Ql17K51Q0k67j83L25j98l64L60J5J5J97J82k4oO8l73L5J27J45Q5l73
1917c8K44k50k68r9L78J73l55j77L04j11N1L90k6P8j60j36j3K01N0j90L07k31
1939A22p1k71L20j72K10n89j93M67P4J79m2O4j74P1K65R0p7k85K93m01K23k03
1961a00j1J89j76k71K18l2j73K8K23m4MK32k52L67j40j54L03P6j00O5j09K16k26
1984A33M7k25N9N9k78L1j35O1l2K17KJ21R6m63M80p8J05J9J94m52MJ04j35Mm5
$$ y = [-145, -73, 128, 96, 52, -58, -247, -402, -165, -85, -137, -267, -43, -352, 37, 173, 148, 350, 311, 169, 296, 308, -3, 206, -11, 26, 78, 158, 278, -286, -252, 4, -244, -281, -322, -187, -21, -186, 377, 288, -43, 248, 90, 277, 192, 163, -375, 95, -120, 137, -42, -157, -341, -97, -355, -59, 11, 51, 96, -305, 52, -170, 226, -183, 352, 48, -78, 382, 174, 182, -135, 116, 196, -71, -254, 71, -127, -491, -131, -116, -101, 96, 278, 254, 248, 316, -57, -22, 105, 250, 335, -38, 206, -44, -312, -411, -33, 140, -215, -392, -88, -199, -148, 242, 216, 294, 134, -2, -15, 186, 236, 46, 353, 122, 51, -220, 100, -72, 138, -451, -644, -177, -103, 76, 34, 98, -76, -5, 260, 350, 273, -12, 281, -120, 103, -100, -111, 78, -98, -369, -151, -183, -356, -328, -105, -149, -145, 87, -165, 202, 62, -92, 211, 287, 187, 252, 143, 359, 133, 180, -45, 14, 73, -205, -174, -309, -248, -280, -63, -61, 60, 156, -307, 173, 95, 200, 219, 413, -39, -35, 69, -66, -62, -107]
2009a07J07j78K86j41k78l4O78l97k87L36K41k7l19J68JJ08K6Q7j69rP3k87J00
2032b2R6j06m10L69j08Rk7O87m57j00J91j65K24M4j04j02j74M8J61q5Q0j62K05
2055I2k38j62j2J09L2J31K3p7J70J10k31K78P2r5J13m01N6J68j56J31k82l58N16
2078a1l92L99m26K10K41j39J72M1l1L29m28j9K17K78l21j20J61j92J30j20O4k71
2100b28K07j87J32k9r6J76r3K61J14j36O0L04r0m89N7J44Q0l15L69l56jk91K10
2123a97kj60J17P6j22J6K64j34J17R5J18k90M19k04J3q2kK23l20K80k87Ol13K50
2147a19k24J91J38j47J21l6j62p8M58m3j1K2J5RL6p9j22M5k15j24L42j77Q2j27
2171b05K84j15j72Q1o4K09J56K49r8k37k24M82j81j44o1R7l87K91lk48J18k67
$$ y = [-107, 0, -178, 108, -33, -311, -345, 333, -64, -351, -15, 226, 199, -120, 48, 49, 157, 183, 270, 101, 92, 165, -122, -22, 74, -32, -442, -73, -181, -172, -199, 488, 31, -69, 122, -43, 181, 225, 121, 19, -155, -107, 54, -31, 49, -113, 92, -146, -308, -320, -211, -179, -48, -25, -102, 68, 178, -53, 225, 297, 202, 315, -86, -30, 138, -18, 113, -169, -527, -11, -403, -4, -430, -220, 21, -118, 54, 95, 64, 393, -35, -54, 163, 441, 120, 0, 161, -31, 99, -21, 43, -228, -21, -208, -76, -105, -201, -25, -118, 143, 257, 121, 181, 485, 395, -94, -37, 107, 187, -128, 241, -115, -116, -407, -197, -199, -359, -242, -166, -288, -272, -8, -142, -25, 70, 188, -102, 317, 113, 126, 44, 42, 265, -55, 225, -62, -56, -369, -119, -343, -152, -14, -161, -40, -76, -238, -316, 142, 99, 88, 110, 125, 134, 170, 91, -31, 14, -201, -325, 17, -160, -78, -205, 79, -36, -208, -127, -191, 18, 174, 423, 325, 88, -136, 346, 165, 21, -40, 57, -330, -39, -42, -290, -172, -439]
2193d39N09J04j94o0M8j14K28j79K98p5r0K27k79j54n2q5K87m27J97J76n2k91
2215d17K92J93j97J35j6K7L15k33L16q0j25k98K75l09K18j14L8j39K08l94Q0K48
2237B3k63J18j69K48L3P7Q3k12M6J37M7j63K01j03P3l85O2J60q1k9l2R6j54k7
2261b14k57N41j38K15L5j19p1J82J4k23J64K4l6M6k33J55J61j96j69n9R5j00R9
2284h4m21M17J02K2P4K42j27q7o6j50K58j09J83l08L23l78K80l63j21L08k67Q6
2306a86J08j47J74j35L65r3j21J82N8k61lL29l63J25Jj00k03K68j92j49J93N4
2328i6J61k31N3R9L74j48K19k03J33k80r8m7J32K55k95n5J13m2j82o1J50n0k08
2351c07J51K09j34N9K10R2j4q6j20m4L21j43K4j73j22j50J22j04L47p0l41j23
$$ y = [-439, 70, 174, -20, -80, -32, -146, 82, -97, 201, 126, 36, 263, -16, -170, -222, -307, -20, -447, -250, -74, -126, -417, -125, 68, -129, 6, -10, 17, 332, 99, 415, 335, 210, -88, 187, -122, 96, -18, 20, -119, 89, -305, -225, 23, -240, -122, -291, -43, -10, 67, 150, -62, -16, 121, 168, 5, 206, 103, 176, -209, -147, 13, -68, -97, -129, -33, -187, -214, -471, 70, -68, 147, 182, 63, -8, 174, 188, -35, 129, 153, 117, 163, -70, 85, 246, 50, -119, -178, -83, -183, -84, -505, -88, 14, 36, 110, 352, 225, 138, 72, -78, 180, 71, 254, -54, 269, -109, 171, -192, -313, -5, -272, -186, -78, -225, -51, -186, 179, 86, -35, 147, 205, -56, -59, 270, -93, 32, 33, -67, -270, -2, -194, -343, -150, -96, 65, -166, -113, -14, 360, 212, 431, 228, 361, 81, -17, -64, 68, 323, 28, -27, 86, 44, -138, -199, -49, -99, -307, -156, 53, -81, -22, 188, 280, 266, 180, 60, 16, 337, 194, 218, 45, -77, -227, -105, -209, 138, 68, -273, -396]
2373c96K72Q3j75J84r9L32j49j77n1P45k76k07k25J33j66J27Q3p2k58K9J0N1K07
2396EJ25j97J41j05R9J29k02J47J85k37O0Q0j21o4k53j00K73K57j81j0k15K30
2418D6k12J06J16m04L24K97M9j10J28n72O6L30k29J54L3Q6k79j88Q5L4L6k59L46
2441a7K70l72J87P9J41m58K53O1L9r7j50J95j7q8j71L25k94RK4N6j87J28m0K1
2465a03M0kK10k56J42O3l2k12K12k42K26O6j54j08K41k11k54L91ok31L37o9j55
2488a07J63J01j96J91K50m83K91r4j15R3p0j21M9L0k35K0K34oj9j89lM18k74L7
2512c5J39j66R7K33j89k24J51O6j49m2J80l01K87j74J53j97P4K56m37J73oR6K15
2535B00k1p3N6mnP0l50j62J07L51k3j62N4n1o0k07M77n69K47P7o9L63j67j09L33
$$ y = [-396, -124, -41, -216, -32, -131, 201, 52, -125, -176, 569, 293, 86, -139, -6, -172, -45, 38, -34, -292, -263, -253, -202, 5, 130, -67, 74, -31, 68, 197, -5, 142, 327, 90, 150, 230, 109, 45, -208, -308, -35, 222, 41, 31, -184, 46, -166, -60, 56, -348, -24, 273, 322, 212, 340, -232, -166, 164, -65, 89, 122, 208, -71, -259, -174, -140, -104, -363, -17, 253, -119, 68, 147, 288, -170, 83, 144, 183, 86, -64, 131, 114, 26, -145, 180, -114, -105, -81, -25, -212, -84, -124, -103, -63, -65, 145, -111, 31, 94, 62, -150, 62, -180, 46, 112, -42, -150, 91, -120, -374, 17, 11, -220, 117, 48, -107, 56, 157, -39, 152, 402, -81, 210, 116, 1, 94, 24, -97, -48, -18, -253, -233, 1, -5, -24, -213, -216, 202, -72, -35, 104, -62, 35, 268, 79, -145, 6, 72, -77, -119, 61, -240, 47, -127, 26, -171, -97, 159, -278, -105, -111, -15, 200, 179, 106, 162, 158, 153, 223, -127, -289, -182, 169, 146, -16, 38, -13, -73, -280, 197, -372, -125, -48, -117, 246, 79, -30, 303]
2560C03k29L9j57J12K85n19L19j13J60k75l8J10l18L11JL13n30L28j22L2J51r5
2582F8K16k88J68L5j49J30j3k40L62k49m0j56L60k43k26l5M00j14k91L70m48N73
2604A90j96J73k59J94k19J61J72n7l12J42j77n4L02k30J09r0L8qpM63m99L54M4
2627B34k43J80j38Q9j13K42j57k51Q3m9K16r9k12R2L58j70k85L88k00L2J30k12
2649h5K01k1J15j54L4k23J06k05Q8o8M50l19J08L6k48J38J1J66N3j15k19QP1J56
2673H4l47M30L0j69q3K39k85m5m4K82k00J27k66J68L03l74R1j3J05l68J22M91
2695B78k12J40k27J35j40k28K74L16m91R5l4M1J22k39J31j2K62k26j32J67K7J12
2717A59k06N7K24j65m9M00l82K9L1p6j61J98J7k5j05o2M3J22j93J50J5K13j97
$$ y = [303, 74, 113, -44, 68, 353, -166, 153, 40, 200, -75, -113, -3, -321, -10, -9, 304, -226, 102, -20, 12, 163, 68, 284, -4, 164, 199, 50, 180, 167, -73, 289, 40, 0, -156, 204, -39, -265, -300, 100, -14, -305, 65, -383, 190, -6, 167, -92, 102, -117, 44, 216, 159, -153, -11, -188, -242, 60, -170, -61, -151, -113, -121, -128, 335, -164, 190, 234, -9, 171, 33, 122, 9, 251, 94, -157, -74, -123, 93, -6, -218, -126, 232, 62, -223, 165, -35, -3, 127, -85, 116, 95, 210, 56, 90, -133, -27, -232, -144, -212, 238, -81, 27, 63, -185, -47, -36, 130, 183, 68, -151, -143, -72, 84, -263, 167, 197, 28, -55, 184, -101, -146, -190, 92, -108, 19, -247, -79, 224, -150, -59, -72, 33, -335, -213, 278, 66, 206, -21, 114, -26, -254, 20, 336, -155, -60, -94, -53, 69, -170, -39, -51, 211, -15, -147, 20, 47, 159, -47, 10, 234, 69, 20, 420, 38, 67, 98, 22, -139, 59, 76, 51, -54, -116, -73, 49, -144, 6, 21, 234, 37]
2740C7K59k18k67K36l2K24m81R2K72j59O1j89K83k84k7J63J24K27l94J17j32R1
2762CM3k8JR0k11J35m5lq7K18k77j28J37J93jQ7M7l04J10j04k4R5J20Opm0J74
2789B00J36k79k26O4j02O3l9rL1J40K03j62k44K64p9M05j58r8NO8J93m08J00j14
2813d6R2J02k98K58k65M90n27J94pP7oo9m6M47m98K19j75k73N61p2j95n4P6J24
2837A09l01Q2O5k53L09Q1k42K21N7l09K36j13n3K03l29N29j82k87N63m19J68j66
2859c1j80K45j07k51M31k78K59p4J1J86l23N9J72k91J65m3L00m4n4j30J51m4k14
2882h5L61p1nl56K75l9j49K36Q3j38l44K13j94M56j02l88J30M83oo03J77j42P2
2905a36L85k55l0n2K03l76j43L91o8M0Q1J45k03k36J37J37J12k58J14L25l49k9
$$ y = [37, 296, 78, -189, 47, 15, 239, -242, -150, 122, -37, 24, -165, 118, -166, -193, -30, 94, 321, -73, 44, -88, 3, 46, 18, 19, 109, -102, 33, -12, -15, -102, 116, -161, -289, -152, 41, 40, 127, 174, -130, -20, -124, -148, -53, 67, 73, 66, 26, 200, 336, 57, -169, -105, -207, -144, -183, -192, -161, -21, 182, 20, -224, 40, -39, 366, 208, 110, 115, 183, 376, -32, 68, -46, 46, 148, -150, 108, -157, 333, -194, 0, -7, 70, 64, -5, -51, 396, -102, 117, -58, -331, 230, 158, -37, -91, -15, 109, -192, -110, -45, -298, 11, 92, -150, 71, 128, -181, 55, -58, -111, 92, -237, 292, 110, -177, 386, -33, 135, -31, -211, 34, -73, -324, 107, -171, 88, 14, 25, 211, -112, -53, 119, -172, -7, -50, 250, 206, 152, 22, 173, 129, -85, 276, 205, 200, -156, 119, 80, -69, 167, 250, 112, -232, -19, -213, 243, 141, -247, -117, 366, 360, -243, -66, -208, -136, 249, -6, -36, -88, 115, -261, -404, -13, -81, -41, 40, 185, -18, -254, -117, 20, 132, -126, -12, 313, -36, -65]
2927f5N5p6K78l42K24K2j35K14j61P5J93k98j05M18k63q9R5R4j55l5J89r0q8j18
2951a63J16j34O2k56L36J29J3j99N7J33q3j56L57m6l89K77Q0k34r9J69qk6k48
2974c12L38p8L23l61L86k02K6k8q2J71k20Q3j41l67M20M7j37R4J81j44L0j40J24
2997A1k11K20j14O2J2K05k24K92k41j01L6J17p7j42L07j89k7J38n2k28RL9J2M6
3021a00l22M79JJ8Jj51J60j92L44k92J37l54K24M3k3P4M1J08j36n1Nk07J84j97
3045b06K69lo6k51L55k20o3L59j52O1j6j73k70L56mL34k79M4j3l10K4o6K39P5
3069B4j95R0J29Qo3J26Oj1k23L63l75N7j32J46K7j6J44k23N3L8L5q1K08k18l8
3094a21J20J21Mk65J1J76K13k52m0q6L10o5m26L59k81J93j93J11N9j36K50k07
$$ y = [-65, -10, -86, 192, -150, 74, 96, -39, 175, 14, 89, 282, -16, -121, 297, 34, -55, 40, 134, -21, -56, 133, 43, -45, -163, -47, -181, -119, -375, -39, 90, 103, -96, -39, 94, 11, -145, 212, 166, -223, 54, 134, -100, -199, -30, -38, -64, -312, 26, -52, 271, -90, 296, 94, 120, 92, 10, 181, -39, 44, -97, -464, -44, 3, -134, -40, 141, -3, 27, -113, 11, -200, 20, -94, -32, -20, 185, -39, 253, 12, -89, -53, 64, -13, -155, 152, -37, -64, 74, 22, -206, -197, -158, -146, -100, -422, 57, 58, 76, 77, -74, 86, -106, 238, -54, 83, -271, -47, -4, -27, 47, 88, 196, 60, 9, 14, -193, -9, -206, 63, 60, -6, -257, 98, -122, -185, 174, 22, 83, 67, -106, -376, -20, -24, 310, 31, 75, 62, -248, -224, -290, -51, 24, -171, -81, 48, 56, -7, 119, 125, 114, -109, 254, -121, -64, -196, -50, -23, -39, 105, -118, -65, -27, 8, -73, 135, -83, -121, -1, 120, 124, -141, -130, 46, 259, 7, -33, -119, 191, 126, -300, 59, -222, -29, -222, -111, -52, -188, 62, -145]
3116a45N25n5k02j90L04l37M37n74K71rJ9L5j68K95l59R3J21M2m39M40j14q4J21
3139B7lj54rK53M0l08L9L10j18K0r3j33j52M82k39j21k25L86L7K2p6J63Pm01L59
3164A13r3jl1M86l34K21m98L7K91j57J46l5k06j5K11k34J09K5j65L29l21j20L17
3187G5N1K0j47O0l05n2j7K09J56mk00Q9j2j5l48N39n8n8P6k95K55l4K83k71n4
3212e7L2J55j78k4Mn0q9J68J27M4k99J37j60M22r1k53R8r5J5N7L6J49j15J00n43
3237d10L64J32r6K08j94l7k37J94n8J53k55K20j54J63j45J65K54k52J95J06m61
3258a45R0O5K17k42k3N37m00j82n1K37L1j05M8r5J09K66q9k23K61k27O1kk71J19
3282a4j05J64l05J72O1J56k57o2p0J12J17k95k9N06j32J18J37m29K28j5L0P7k45
$$ y = [-145, 380, 325, 123, -67, 237, -100, 337, -237, 34, 25, 44, 79, -89, 206, -153, -60, 61, 103, -336, 104, -10, -94, 27, 24, -130, -139, 114, 154, -154, -115, 195, 77, 97, 4, -129, -281, 201, -38, -159, -384, 2, 39, 61, -15, 148, 155, -246, 113, 20, 19, -12, 474, 140, 361, -137, -100, 191, 34, 180, 145, -61, -76, 135, -99, 10, 35, -130, 199, -122, -242, 75, 126, 146, -1, 59, -246, -298, -315, -106, 50, 46, -154, -65, -77, -92, -440, 99, 41, -17, 59, -236, 19, -15, 268, -3, -57, -25, 130, -48, -72, -68, -118, -207, -39, 88, 132, -167, -30, -190, 232, 141, -112, -14, -109, -94, -37, -1, 148, 33, 133, -410, -46, 86, -10, 198, 4, -33, -270, -76, -134, 19, -236, -16, -170, -7, -152, 13, 267, 15, 210, 316, -145, -55, 10, 227, -15, -38, 499, 99, -83, -134, 103, 134, 29, 77, -18, 91, 357, 268, 45, 306, 79, 140, 138, -133, -14, -119, 45, -260, -88, -27, 129, -128, -190, -260, -148, -31, -326, -355, 151, 19, 137, 274, -155, 73, 58, 88, 165, -80]
3305h0npJ3J27j29r9K02jk9J04P0k31p7K21Q0k78NL12m16J69K10l89K92n6j63
3330a55Q3Jl8m7K0K10j06RM0K51j28J84k13k04P3J04k73J3P6p2L68l92L87k11
3354b0J80j52MK41j5j65m8O6k19J1K11J20l23Q1j84L95j90k14N27o08J97J35j9
3377A1M4j02K0j23K31P6m06K01k2J89j74O1q4O3N7n5j03j50N7n0L13L7P9p8j91
3402i9J47M3k18K67j68J89j65l0o6K56j55o5p7K70l9l7o6rQ5k25k3J16n4MN7J13
3428E1k10L64M3k76nJ00j24J32O8r6J51n28J0M31J1r9j00o3O4J92k24J04J54m02
3452b52K81J14O6l12j16J86l1jnR1O0j63P6K6j16o2J79j27J34Q6j30J98p9j15
3476a2l09M10n4o6k04M31l9r8j49R0j09p7L07p4p5m9J90k08J27nR9J4l63K86R6
$$ y = [-80, -85, -92, -79, 48, -81, -180, 22, 21, -8, 96, 166, -65, -142, 79, 159, -119, -114, 198, -218, -49, 161, -228, 64, 8, -155, -72, -71, -109, -156, -136, 74, -32, -23, 17, 268, 140, 324, 111, -93, -20, 84, -189, -176, -100, -172, 196, -196, 191, -20, 160, 8, 12, 253, 238, 73, 25, 91, -128, -117, 94, 214, -109, -28, -212, 183, -7, -221, 306, -302, -105, 30, 11, 55, -47, -27, -150, 81, 157, -249, -48, -70, 119, -55, 6, -78, -15, 42, -13, -116, -266, -209, -259, 54, 91, 170, 92, -99, 48, 91, -127, 140, -28, 161, -4, -34, -100, 156, 1, -64, -141, 129, 90, 53, -13, -22, 63, -162, -185, -69, -123, -119, -62, 51, -159, 205, 248, -28, -33, 67, -57, 75, 143, 47, 198, -330, -320, 111, 122, 23, -77, -140, -76, 116, -108, -4, 150, -252, 29, 143, 209, -103, -219, -33, -64, -65, -70, 21, 81, -82, -6, 20, -96, -158, 21, -106, 28, 114, -16, 182, 103, -12, -321, 89, 35, -31, -235, 196, 157, 59, -90, 0, -109, -186, 121, 47, -28, -77, 113, -95, 32, 27, 126, 140, -223, 63, 159]
3501A59k93J12J53j17K7k58N6k4o3L03k37J75j72P0M5R2Rj9q2q9K21L5k2J7l33
3526b35K72p0J61l1k64K69l33L33L4m18L36k33L04qK55o03L76j17nM4J82j55P3
3549A67k29q4K9J08J21M47o26o2J42L7J4j04N9j10M73n41K2k32N35j81m7R6K5
3572E9p7M1K59q9j54j13J00q7K26J67m52L09m65K48Q0k52O57l80j10J17J24j42
3594F6k58J22J50P5j89J70q1O2o7ol21M38j50n2M5j00p7J54j47J65J45k05M30
3617C69l68J42n8m75N40R2k39K3k76M53n1j22j68L24j50Q4l53M95k15J70j26k66
3639a75L17J30k55k14R2k5K25j84O7O7l7N0j9q2M7j83K10m4J66o8j43L13r4l28
3663a67K87l89K73O5j04j5P3J00j69k9J07J3RM4j81K14j14n9J66j8l6Rj43m8n8
$$ y = [159, -134, -22, 131, 14, 41, -217, -161, -185, -248, 55, -182, -7, -179, -109, -64, 28, 37, 18, -64, -153, 68, 103, 81, 98, -235, 37, -33, 128, 97, -167, 102, -231, 102, 136, -282, 54, -179, 125, 117, 372, -231, 145, 28, 23, 67, 249, 94, 167, -62, -146, -117, -9, 112, 559, -67, -129, 13, 50, 64, -40, 19, -91, 382, -159, -137, -369, 166, -15, -62, 34, 59, -18, 23, 282, 193, 39, -74, 26, -61, 165, 332, -120, 189, -276, -28, 52, -200, 457, 77, -33, 84, 208, 66, -192, -70, 80, 155, -34, 136, 55, 117, 50, 44, -277, 161, 11, -41, 4, -96, -173, -19, -166, -1, 144, -61, 369, 1, 143, 85, -390, 150, 242, 3, 26, -250, 203, 152, 30, -138, 186, 36, 120, -233, 262, 47, 217, 91, -175, 142, 272, 17, -197, -105, -130, 95, -89, -22, 45, 8, 58, 39, -43, 4, -179, 31, -13, 153, 85, -58, 255, 161, -167, 120, -269, 4, 69, -35, -50, 23, 123, -46, -75, 32, 45, 54, 98, -83, 131, 17, -42, 124, 106, 70, 79, -64, -112, -170]
3688a70L43q7o9r1M0J19qJ82j06k15J30k7J21Q3j91j49M1J08O4m90J74L57m7j16
3712dk96R2Q2L09k06MN1j27J68q2k0j90J59J05j9J89l10O8j66J88O3j18K14J70
3736C24k07r2r1J09k2m0L28k10M0j17j07J40k15L9K56k16P0j56O6k0K23l53K43
3759hk96L66N5J07M4k23P7q2Ml3m5J42P2k72K03r4j44L21k45j18L41q5j8N6k2
3784A03J4L4k82N9K31k79L1J40NN3o5j6O7m6R2j59o6PM6m6L30k64J57l7K9L8M2
3811B18J6n85L60J25j78j87M7J33J32k09k5J73k0J33o9k79L56l2k32K27k46K02
3833F0j07K54m6k75K99k06L0k03J61N2k40M56k17j82K42Lj07j67K58J81j91M7
3855A02k83L34p6N0j09J42p9k35n4L4L68l18k2K73j32kK0n7J34L8j63J71l72L08
$$ y = [-170, 173, 86, 17, -74, -34, 85, 77, 259, 153, -62, 68, 41, 162, 245, 54, -95, -54, 54, 118, -372, -198, 159, 112, -4, -300, -208, -126, 183, -23, -19, 32, -95, 73, -9, -29, -219, -60, 45, 26, 215, -95, -27, -193, -5, 58, -60, 154, 324, 117, 25, -66, 43, 21, -19, 309, 99, 139, 22, -85, 55, -160, -121, 135, -81, -11, -167, -101, -121, 102, -251, -8, -304, 62, 117, 224, 268, 45, 122, 40, 44, 11, -34, 108, 180, -92, 111, 17, -127, 194, -51, -169, 172, 87, 69, 125, 103, 117, 151, -131, -72, 159, -120, -89, 51, 56, 109, 44, 28, 95, 49, 141, -18, -84, -77, -31, -77, 253, -11, 146, 109, 138, 176, 218, 234, -351, 9, 134, -44, -231, -184, -51, 81, -128, -153, 20, 0, 133, 64, -215, 141, 109, -123, 104, -142, 60, -47, 207, 161, -114, 185, -21, 9, -194, -33, 19, -221, 235, 18, -164, 78, 81, -26, -193, 65, 246, 55, 102, -181, 153, 77, 127, 18, 160, 81, -154, -208, -174, 194, -124, -146, 127, -5, -7, 13, -44, 90, 128, -35, 136, -236, 72]
3879G2j66J82J5J93j62Ll5J35q7k65J15K61l14o0K4J35J31k19O4Q1j05r8L17l02
3903h5L51O8k09o0K40k49j76O1k8J85o1k3K6K6j37K0O8mK22j38j32j3K22O2n3
3928A83l7o2o7j22qJ07l91O39o3l29M70j53R0m86M32m18L05k07K09k34J58Q0p2
3951B4k73N93k11j36K6o7k16J2l1J74K37r2m9k6J22k54J45J65o9o7k07K66j38
3974g2N8L2k68L35j15K27m12K62j99l0K24j5p5j6M24k69j26j06K28j88K67p1l48
3997b53J9L07j41k6J05j92J02J9M3K78l21O3L15k71J40J48O5l80j07J90j27n7
4019h1o7Q9p8K38j04J4m1o3k97M29n2K13l31J27j59j10J39l5N0J82J7j86j03L
4043b06K35l81O22j24M3l06O6O9RJ16k95K48j10k5j9%P8j11%P8J46l16M41m01
$$ y = [72, -94, 88, 103, 296, 134, 137, 102, 237, 150, -115, 0, 261, -53, -113, -89, 46, 177, -42, 22, 103, -2, -100, 217, -85, 266, 334, 125, 65, 305, 56, -120, -59, -87, 98, 37, 14, 40, 66, -71, -51, 17, 13, 235, 97, -35, -48, 174, 236, 183, 146, 84, 17, -105, -113, -6, -397, 242, 179, -150, 320, 167, 257, -229, 203, -215, 90, -117, 92, -142, 16, 96, 24, -249, 344, 133, -3, 23, -44, -260, -248, -279, -105, 132, 40, -9, -35, 87, -167, -22, 143, 74, 7, -200, 66, -72, -14, 18, -250, 85, -30, 197, -215, 47, -152, -182, 42, 27, -48, -64, 360, 91, -35, -141, 87, -101, 166, 95, -253, -234, 73, -68, -94, 11, -181, -79, -60, -17, 261, -60, 3, 318, 47, 187, 335, 400, 20, -87, 103, -24, -81, -148, -59, -137, 101, -3, 11, -30, -93, -390, 39, -13, 200, -131, -4, -163, -273, -134, -169, -119, 63, 80, -106, -209, -206, 29, -352, 270, 146, 189, -117, -51, 18, 27, 143, -152, 96, -14, -39, -58, -58, 20, -91, -91, -13, 133, -183, 258, -143]
4067a43K52j96L06j03r2l49J94L97j24O5l13L76k17o3J7J54q4k8P1k15l5K20J86
4090B76k51N3r6j33P5j12J59R9k55K72j03L72k75j06O6j2j10J4P1Nj96L68l12
4113a31K73k33j55M11j14j70M38k78m8J52k93P8j24M48k58l9n4M18k94k08j16
4134b97J41P7K05k11J41L2k64k96M50J53j0j46J18J98j77k00J04k53L82l66L53
4155A34j58P0j26L00k5L7Rl95J85l9N9p5K45m53L48LK1J18k64q4J56k06k4J51
4179a3J56m07Q7J98j15K12j23J8L38k87L1q9l6k5k86L58J09k82Q1K78l34J04l9
4202f6K29k75j7o2J40J25p0n4l8J04K66l98K64n6j03k0K76l43R9L6J74m9l16J23
4226c1K74l42k07L94j79J62j15K87k13j19j02J24J33l16P4M9R6PJ44j46J39j58
$$ y = [-143, 109, -87, 219, 116, 24, -325, -131, 266, 142, 207, -106, 270, 53, -10, 7, 161, 77, 49, 120, -95, -130, 90, 276, 25, 78, -18, -151, -76, -188, -29, 70, -185, 87, -16, 356, 81, -25, 41, 29, -81, -67, 4, 9, -187, 181, -131, 142, -91, -246, 165, 51, -119, 319, 41, -7, 145, -148, -70, -194, 254, -4, -43, -97, 321, 27, -181, -297, -156, -79, 126, -85, 56, 88, -176, -472, -22, 131, 121, -25, 93, 291, 114, -86, 18, -235, 147, -219, 134, -24, 46, -80, 220, 195, 232, 241, -154, 31, -8, 51, -24, 221, -232, 116, 119, 140, 258, -6, -90, 66, -140, -164, -13, 143, -264, -177, 21, -94, 118, -5, 13, 351, 64, 95, 6, -30, -55, -341, 17, 126, -156, -75, 203, -131, -27, -66, 163, -112, -129, -191, -51, 74, 4, -50, -88, 16, 282, -116, 148, 92, -11, -31, 245, -98, 1, 37, 211, 162, -154, -31, 243, -99, -306, 88, -91, 71, -44, 243, 30, -89, -191, -67, 66, -250, -176, -127, -31, -24, 120, -26, 113, -45]
4248d5J16j18Q4J59l23N4O7M5j1n3j00J02l67M68K8l9j23M3J8j38J94J19j51J28
4272A57L5j78p2j9J67O0J4j37O2k16K67k20K32p4j2k35K93l00K91j53J11o3j10
4295a00m6J65N6o9kJ38kj9k0j40Q6J07P4j25j27l2J49j73N5M11n81K88l5K40l07
4320iJ13j8mj86L48k14p8n6k7J55p5K40o8n2k5n3o3kK57P5q6q1k4n6m1R0j51K41
4348A50M2m24K66P3K2l3n2l46M27j53M7K1r2J58j1L3n3M5q2m6J22O8l79J06K88
4373A97o6k18OM4J70J06j66O3J70l04m8kj53M27j77k62k3L55k65L97l55J37J44
4396A77k50kJ76kj33o6R9j74kJ24L18k78j29J97RL3j70K60k80n1P5q4J42J28k40
4421a23j21J60K02m93J51J22J91k44M06k86m8j30M07m43K28q0J11j7PQ8K0j71
$$ y = [-45, 71, -47, 37, 196, -127, -73, -6, 39, 28, -25, -125, -23, -390, 78, 106, 67, -56, -13, 5, -133, 61, 180, 29, 157, 192, 14, -58, -77, 90, 150, 164, 27, 89, -127, 140, -80, 152, 78, 66, -169, 124, -176, 115, -38, 73, 10, -100, -146, 19, 75, 6, 4, 142, 140, 121, 101, -39, 47, 154, 228, 103, -24, -56, 93, -80, -25, 386, -195, 93, 58, 298, -9, 104, 86, 82, -104, 244, 30, -48, -104, -131, 24, -51, 189, 121, 69, 44, -9, -72, -74, 183, 258, 172, 91, 67, 11, -30, 60, -91, 150, 192, -232, 34, 107, 129, 96, 44, -302, 125, -28, 19, 40, -52, 106, 95, 128, 75, 120, 38, -8, 114, 182, -197, -91, 197, 131, -87, -81, -37, 133, 239, 73, 136, 306, 2, -46, -48, -201, 226, 49, -213, -236, 119, -146, 251, -104, 33, 177, -73, -75, 101, 99, -34, -100, -1, -175, -177, -53, 265, -13, -142, 55, 64, 97, -73, 187, -93, -144, -69, -153, -11, 117, -123, -244, -84, 118, -375, -224, -102, 89, -155, 251, -35, -83, -213, 194, -249, -21, -101, 10, -7, 0, 88, 108, -63]
4443f3Q6r6J13Q3n1J18K4j53j07r2J0K8K8N2J68l02p3J32L5%J76R0j55J85k12
4468B4J32l20j42M49k27J80J65l67L70k67k46L05K1k7K06j16q3j86J6lO9J10M7
4491A10k98J62L2m6J39J13j81r4l6K75k01M9j36K17K62l49l34K41J70k68J65j63
4513a71j05K61k86L51l59L34J14j12J6kp9KN7n0O4l0J78j68K5M1O3j36r8N9J32
4538A01j23n1r7J62jJ67j39J07k52J65p7O5j72J64kj09L7o3K05K42k20j67K29
4561A71J3l02J21J14j64k7k8P7K91j60k66rJ44p1R8K00l16L62n29K62J11n3k28
4584a89M9J71pj2q7Q0Q1m05N19l42L04m52J32K10K07k28j32J66j39J48J31j02
4606A03j23J04j88J23O0N0ll3k37P3Q0K05p9l67L77j41M13n08Q4J7j02n3p4K48
$$ y = [-63, 23, -73, 40, 123, 72, 190, 214, 61, -46, -138, -128, -100, -72, -20, 148, -154, -227, -95, -60, -60, 116, 206, 51, 236, 24, 156, -164, -306, 143, -84, 96, 261, -106, 264, -3, -249, 56, 77, 50, 256, 140, 57, -129, -113, -116, -47, 63, 110, -188, -26, 6, -40, 99, 212, 31, -63, -99, 176, -25, 24, -112, 105, 367, 18, -316, -75, 95, -173, -8, -171, -276, -15, -301, 50, -309, 25, 139, 27, 43, 41, -38, -36, 21, -29, 35, 5, 183, 15, 40, 81, 144, 8, -90, -31, 101, -22, -73, -170, -8, -9, 158, 19, 126, -126, 39, -38, 27, -145, 19, 17, -92, -55, -118, 87, 329, 109, -58, 171, 184, -118, 3, 117, -47, -74, -102, -25, 266, 106, -160, -169, -25, -96, 2, 202, -114, 248, -281, -19, 92, 39, -189, -140, 31, 24, 12, -75, 5, 86, -319, 200, -142, 162, -290, -158, 52, 259, 31, -101, 65, -74, 74, 205, 103, -20, 84, -104, 19, 79, 129, 126, 93, -144, -71, 9, 214, 135, -232, 145, 4, 417, -91, -7, 10, -92, -145, -219, 29]
4630B9J33po7Mk22K56l33K12p5k8Qj4L08M1n86L33j5K92k18J5P8j17l52K65M25
4655C65l51J08N0k48J21J50k06j6N1j05O1K9j97r9M49j15J06m81L36J61n3j94
4677g8R9J3K2q2J62r7R6k12j47L06o9Q8l91N05O9l32M3Q9J26k02k02L6J40J2o2
4702f8J87J91k26j5J8j24J62K7j31n3l09M44kk36K73l08J68Q9O1L0q4L1k66K39
4726I8j69l5Q3J21j00J63k64J91l3l39N40m87L08k8k7j00j03L72K02n46K41l05
4748b17K32L0l6K18j24l52L81J77m29k0m6K37q4J57l1J8k44M1N1Q5K96m01J27
4771F6l8j76J42K26q6j93L31k90J18o0lk06K31pj18N9J02m11M13O8j50j87J21
4794d8RK0R3j02J57k45J97j84J76l9j12l3j84N41k53J76j4k29J62j65K50mk77
$$ y = [29, 162, 155, 88, 92, -130, 126, -207, 5, -70, -98, -90, -104, 204, 245, -341, -8, -23, 269, 51, 66, 144, 27, -325, -60, 365, 14, 122, 172, -76, 45, 195, -11, -27, 24, -81, -20, 9, -188, -287, 162, 47, 153, -328, 8, 169, 116, -78, 21, 34, 56, -26, 136, 39, 135, -77, -224, 82, 13, 101, -290, 215, 284, -48, -5, 84, 210, 8, -194, -158, -18, -6, -68, 119, 310, 84, 69, 87, -37, 125, 152, 21, -32, -341, 103, 101, -135, 138, -170, -2, 87, 148, 178, 94, 125, -141, 98, -71, -106, -23, 98, -2, 161, -103, 88, 55, -284, 256, -231, 77, 49, 22, -78, -181, 191, 393, -153, 88, -217, 15, 45, 9, 227, 103, -249, 132, 309, -120, -140, -186, 51, -33, 124, 93, 111, -133, -92, -41, 44, 340, -61, 66, 28, -148, -6, 220, 134, -59, 272, -18, 100, 40, 37, -169, 62, 55, -63, -4, 98, -313, 100, 168, 18, -169, -48, -39, -19, 74, -28, 129, -116, 81, -103, 73, 34, -78, -111, -295, 246, -7, 169, 155, -74, 88, -77, 173, 169, -108]
4817a08J12n5K90p8l91K79J51n67L16K48k64K07j01p2L9J13l05K86J67l47P5k3
4839b8k31M95m2k84J14M1jJ4l05Q1K36Q4j34j81P4K10N7M4j36n7j83l9P5K05k24
4864a15K87k8r7j76L50K8k85L5j99M11m28M08n4j88K68j78J01k34P9k6j1J73O1
4887A82k45l8L15j98J72l74J89M0K01l13J3r3J42l7P8J18j27q7j2J43l31J32K15
4910H5J24k22j36M8m7N6J58j63PN3k06M33m51K64k19J32j82J89K31m7k71LM03
4933B42O9l29j68M8K02J21j36j13M9k2J18P2k78L17K25m42j1M41m72J85m1k73
4955a96J85P4m3M3j63M8L0o2K72k16r7L31m58K53J10o1k4j27Q4J0L26l80R2K76
4979C07k86j51J9Q3J09K04m9n58M23J67k59PJ82l1k87P7l0R6K89k31k37K86j30
$$ y = [-108, 4, -51, 239, 161, -230, 49, 200, -367, -51, 197, -67, 140, 39, -33, 6, 119, -186, 100, 267, -80, -5, -28, -259, 236, 194, -90, 24, 65, 64, 78, -227, -146, 90, 174, 40, -141, -67, 143, 200, 244, 108, 51, -132, -171, -96, 109, -115, 172, 144, 47, -129, 221, 249, -36, -1, -200, 211, -217, 191, 137, -51, 217, 39, 140, -94, -15, -41, -52, 121, 182, -63, -101, 214, 16, 188, -186, 3, 43, 244, -69, -56, -149, -7, -44, 34, 152, 25, -62, -74, 69, -262, -130, 85, 209, -13, -149, -101, -148, -92, 66, -97, -90, -37, -243, 190, -261, 3, -216, -84, -266, -77, 154, 107, -164, -161, 242, 311, -18, -186, -138, 64, 185, 49, -64, -15, -37, 81, 153, -125, 192, 417, -25, -36, 405, -67, 118, 77, -196, -11, 63, 20, 63, -100, -52, -22, -84, 188, -28, -125, 206, -252, 1, 111, 50, 26, -101, -17, -7, 319, -61, 31, 307, 21, -130, -111, -28, 81, 285, 236, -322, 101, 268, 9, 16, 198, 167, -120, -43, -73, 23, 312, 81, -156, 130, 0]
5002@K60m05K17p1P9j63J53J34j5n3l35L42J9j94Pk26J61J52k92L43j73P2k27
5025b15L34J1k02k37K57L60j72l15L92J6O8l66J89J20l15l4QR9j40m1J50J10K33
5048C10m9k08j20R6p8j8o9J53K38j31k05Kj7nO9K08j87j6J48l2j53J93o9o4m8
5073e2O4r5Q7J71l39J25p6j25K01J79j52p6R8j69J82k2j32J49p7N6J78k25PrJ07
5098E5J85m29K88n2Q4j08j79J32J2k74J41K94p5KL9l33K46PK79l03R3m0O8j25
5122GQ0j51j98K66M4l19J50L83j07j34j5j30O0L4n2R0J2p1L4P4n1r6K34l82K12
5147b6l3k87L62p6Q9K9k14L63j35q0J08K8k96j99L06JO6o0p0M83o0m26N84l89
5171F8j11J98J02j59j87o3K77q6k71j4Q1K07l98K68O0o4K61j07J49k76R1k68K81
$$ y = [0, 260, -145, 72, 1, 80, -83, 70, 204, 189, 136, -199, 143, 162, -32, -25, -251, -90, 62, -230, 113, -60, 12, -215, 119, 130, -72, -309, -52, 308, 136, -179, 213, 229, 297, -69, 120, 240, -75, -109, -101, -2, -142, -183, -33, 77, 310, 261, 53, -67, 29, -49, -67, -136, 17, 255, 124, -81, -79, -96, -101, -32, 176, -11, -27, 121, 89, -64, 129, 60, -4, -52, 12, -83, 4, 175, -164, -39, -115, -240, -39, 140, -12, -88, 10, -159, 23, 1, -131, 18, -59, -3, 175, -50, -43, -52, 55, 240, -189, 99, 47, 131, 23, -156, -24, -12, -286, -145, 149, 74, 76, 115, -218, 28, 35, 314, 11, 104, 64, 132, 7, 87, -64, -262, 4, 48, -271, -121, 262, 155, 21, 6, -124, -64, -30, -82, 8, 20, -51, -17, 57, 6, -90, 144, -238, -26, -59, -346, 16, -60, 29, 58, -156, 207, 72, -8, 100, 128, -168, -367, -61, -60, 6, -54, -124, 359, 299, -127, 457, 68, -43, 155, 257, 98, -89, -152, 125, 39, -232, -246, -165, 42, -356, -88, -28, -92, 169, 62, 211, -65, 26, -242, 39]
5194C9l22O9J37J51k93J86J00k17J91k3L21j36l66J17J17o9J7J33j94K45k83J54
5216G4l3p8Q5m43M74j26N0l1L6L7J17o9l5l00L54m46J83J59J37j74N7kJ76j4k69
5241h1J13m79O50j35j79J21L7j5J7m19L95K62l97K22k28q8L29l01P5K42k51K30
5263A20q2m4k3K21k41J28k36J59j56L6J46j80L06M5o7j0q1j26Om8J86j62r3J05
5287i1K18j97K92l49J13O1L8q1k37L0J71O6r8q3p8L25Q5k07r4J36j89N13m06N1
5311a1K23l76J60j2k12N2l1L16K8J23k26o3J91o4j22n2N44o28P2j52K99J25J8
5334B02l54Q1R8n0j03m6J27J50j21l6J70l15k8R5J0J77j61R2n5K33l93K15K2R6
5358A06j19l11L87P7q0K6j85K2n6N0J67O9j9r0P1k9j06K1J52l05L61k62L02k0
$$ y = [39, -283, -214, -77, 74, -219, -33, 67, -150, 41, 18, 339, 203, -163, -46, 71, 2, 19, 152, -42, 203, -80, 74, 41, -37, 48, -395, 79, -47, 3, -28, 8, 45, 162, 93, 58, -242, 112, -334, -151, 8, 145, -29, 28, 26, 202, 188, -81, 32, -447, 203, 68, -111, 10, 47, 32, 49, -370, 25, 287, -110, 112, -116, -204, 125, -176, -101, 141, -110, 120, 38, -6, -29, 192, -49, 79, -157, 2, -154, -118, 28, -152, 154, 199, 132, 122, 41, -85, -79, -127, 59, -103, -196, -91, 127, -70, 222, -127, -14, 47, 85, 4, -233, -203, -32, 34, -64, -147, -225, 100, 185, -22, -116, 20, -169, 344, -62, -11, 212, -164, -4, -16, -228, -176, -207, 109, 137, 260, 34, -29, 162, 98, -24, -76, 468, -160, -88, -240, 59, 184, 202, -152, -71, 27, -23, -126, -172, -45, 105, -16, -52, 118, -197, -225, -130, -120, 57, -104, -12, -67, 166, -227, -12, 10, 106, -13, -324, 63, 140, 60, 86, -99, -77, -133, -83, 84, 153, 134, 44, 115, 86, -20, 1, 153, -152, 209, -53, 249, 229]
5382B29m00J02j26jP8J81r9m3M20l29L67m04J98L9J2j86k93K75N8k25J80j22K4
5405f5j3K36l00J02O1k76K75l01L20p4q7K6L67k95K65j49r6P3j77K04k40RL17
5428A82r3l32K57r2J29k67L1L06l03K87j43J82l9L9J8k6K41l05mJ51j30J13k57
5451e5r0M68j97k8o3q9k0R4j07K33j30O9J63k00j12K34j81L14k64k30M76m17O8
5474f4J23k17K45l40K34j59r7L49k68K35p4Q6M5n6k36K51j78Q1O1j56J13L94p4
5497B98l92l3j26M79q7j93J61n65N33j07J8N60j69n38K89J25k63K7p4L56l53Q
5519d6Q0K26q1j74L5j40p9q4K07M9q0l7L40m22k8Q3K73n2N3r9Qm58O51k71j75
5544b21J49j29J65K46r4j77K21k2k66O3M9k20MlK34Q8L6l39NK85j63Q1l0J16o5
$$ y = [229, -171, -69, -195, -196, -118, 63, -36, -79, 341, 12, 379, -25, 173, 212, 224, 38, -255, 20, 78, -147, 33, -89, -65, -78, 158, -142, -40, 21, -255, 20, -281, 39, -35, -122, -96, 271, -24, 241, 92, -4, 69, -108, 96, -144, -135, 182, 89, -243, 14, -78, 51, -216, -185, 121, -182, 105, -38, 144, 105, 144, 162, 136, 377, 72, 68, 219, 89, 202, -55, -145, 323, 126, 98, 35, -54, -74, 20, -87, 146, 16, 85, 248, 48, -64, 170, -11, 303, 39, -191, 285, -132, -64, 59, -158, 87, -253, -19, -178, -275, 74, -194, 41, -33, 53, 98, 42, -194, 57, -121, -40, 21, -135, -22, 372, 298, -94, -127, -253, 226, 139, -54, 107, -458, 75, -32, -14, 546, 377, -161, 128, 253, -10, 17, -57, 299, -54, -46, 34, 260, 179, 5, 40, -100, -179, -263, -56, -7, -87, -124, 216, -206, -234, -151, 122, 70, 123, 24, 32, -426, 225, -46, -221, -72, -201, -36, 210, 116, -61, 160, 138, -128, -65, -16, -236, -232, -235, -1, 87, 123, -216, -211, 74, -89, -8, -38, 78, 13]
5569A3k19K83p5N6jj56p2R7L01j06j02J96l97L00j28m5rj09O4J75J30l55K84m2
5593H3l4k37J60J87k25J51k22J82nN7j36J95l7k31J76j81K34l22M50l13k1K93
5615B04j03j44K29j70l48L59R4j08K92m91L64k37Q5k2l19K39L1Q7q5J12k46K49
5637G2k62K40k00Q7K73k51J65r7m9l3K07l03J29J65m09M39k40M2K55p2q4j36P2
5660A0l7k60L49R8l38J63J71k39J94l60N66j50r1j45J87L7j48J22om18L05O5j70
5683i5P3J50j95j1J76j98L4K10k89PK90j60o4J98l22J47l4J39p7J74M2k63L07
5706B39m95L67JN9l38J39J57j30K3l3L4j7M0j36J00L8Rk22P4J34K67j08o5N5k25
5731c3P3r3l5J81o5k10J58J38J05l03J06K41p3P6k09M8j74J22K27j90k84J32m3
$$ y = [13, -206, 77, 2, 58, 57, -99, -171, -74, 227, 121, 19, 215, -182, 118, -10, -55, -64, -173, -109, 66, 196, -159, 125, 83, 49, -188, -28, 159, -66, 85, -137, 45, 40, 97, -39, 156, 119, -112, 64, -117, 117, -205, 245, -68, -89, 204, 101, -43, 186, 16, -332, 27, 121, 13, 305, -186, 178, -59, 26, 4, -315, -76, -45, 42, -43, 69, -177, 72, -190, 50, -150, -63, 210, -41, 124, 27, -22, -55, 152, -151, -22, 143, -266, 173, -67, -25, 230, 158, 74, -62, 10, -27, -287, 62, 160, -178, -15, 156, -83, 111, -249, 317, 167, 76, -69, 118, 155, 7, 129, 123, -295, 10, 75, -95, -22, 128, -67, -78, 98, -100, -66, 144, -145, -138, 152, -8, -72, 126, -196, -49, -83, 56, -21, 153, 195, -68, 239, -256, 111, 112, 171, -167, -28, 129, -1, 22, -11, 23, 6, 46, -90, 10, 48, 57, -165, -91, 43, 310, 202, 137, 192, -33, 40, -53, -88, 93, 28, -182, -24, 114, 219, -84, 22, 263, 190, 266, 57, 105, -69, 53, 280, 90, -194, -62, -105]
5754a05J83j3RQ3k14P7L0m31N87j4l48n2K55j44J99l36K18O3Q8l0k75J02j08l4
5778b10P4N0J37m3j54L5J56j33M7R4J12p3k50J27J23n0J7kK98l60q8LK36j35j18
5803a07Q6J66j12J56k21o4K86n3j64J16j56J50l6J15j95j5k02J07L41l23K57Q4
5825B16k27j3J6J18k02l1J74k23J27R3J25m36O7J61J82j28J59lk36l2J04j33l0
5848a52L23n5o8k37M46l26k1R9k07J28%o7K68j20j6j5J28j63J73j54K46j28j24
5871d2K27j39Q9m2J4j84q9o2K64j29K01m15K33K35Jr7m12N05l46j9K10K44m02
5894a55J25J42q8k29K4J73k7Q7K30l41m2K8j02K89j63P3P3R1n86M64K21k79L45
5917C53m19l8J2jJ60k30K87k45K1P3J94J0J21k58k8J05o6k5j66O1J21k46M05k24
$$ y = [-105, 78, 65, 74, 157, -57, 20, 50, -381, 206, 192, -156, -208, 47, -97, 102, -234, -16, 47, 135, 105, -170, -68, -176, -210, -136, -86, 51, 8, -146, -111, 45, -88, -41, 53, 165, 92, -158, -31, 92, 42, 59, 57, 355, -5, -93, -90, 146, 11, -107, -21, 145, 33, 189, -32, -96, 190, 137, -27, 89, -67, 83, 47, 162, -33, -48, -250, -143, 198, -125, 132, 216, -11, -24, -8, 110, -92, -123, 51, -172, -45, 48, 173, -263, -196, -35, 147, 19, 178, 175, -61, -93, 11, -122, -152, 171, 116, 48, -189, 257, -69, -90, 9, -198, -70, -70, -137, 131, 11, -5, -20, 108, -55, 118, -36, 210, 82, -42, 185, 46, 135, 93, 107, -77, -166, -228, 36, -93, 108, -307, -74, 161, 162, 65, -347, 158, -188, -207, 3, 247, -155, -30, 112, 24, -205, -181, -8, -35, 52, 282, -59, -101, -73, -175, 114, -49, 24, 97, 188, -398, 66, 287, 8, 353, -66, -104, -92, -93, 67, -163, 124, -121, -100, -27, 167, 177, 298, 40, 12, 117, 51, 26, -140, -79, 42, -204, 201, -23]
5941b3m4k9j5J5k45L38R7j55L9j26n9M34L0l38K30p7l28K94j32K65k26K39k28
5964d4K23N7k26j72J93n0j6J78kj80L23l97K05m2k06ON3P1Q9K4J41k3j89p9k4
5989h7o7m6K71q7LJ04m5j64J01J90n16N35J07l12M2P1j60M8J39l03K94l37k4K08
6013c5L51n55J89R7k24j83K81J44M9k35J57p3j36M1N5j09J02l45L62K40l71J47
6035e1q3J89j30jR9j61j50M45j54l5J82m5o1q8J05Q7m8j62K48j78K36j60Q9k90
6059a17J9J0j40N23k78k6j12L42l66J09J4K7k41L08l9p9k71M50k59qP5j6N1J08
6083H4j77R9M3R2m3k35K7K52P0j87m4j55J37j8J32j21J86l91J82L29k11k0k1o1
6107e1k86M04p6Ok44r2O30n05N12l04m6J47j55L41k84j11K97j68k65L00j21j07
$$ y = [-23, -67, -96, -111, -96, -341, -3, 94, -61, -22, -148, -207, 227, 257, -81, 149, 72, -256, 38, -94, 171, -55, 184, -44, 179, 236, 10, -162, 31, -19, -35, 143, 141, -39, 284, -113, 92, 50, -156, -150, -97, -26, 63, 87, 228, 205, 16, -63, -87, -154, -200, 71, -16, -13, 91, 46, -118, -17, 173, -343, 192, 299, -13, 29, 100, -60, -12, 127, -176, 118, -219, -243, -35, 316, -239, -50, 47, -177, -360, -79, 65, 114, -121, 36, -37, -173, -132, -77, -186, -84, -429, -67, 173, -198, -51, -134, 55, -75, -76, 23, -138, -288, 157, 3, -32, 150, 105, 44, -44, 61, 148, 100, -62, 186, 8, 244, 84, 173, -117, -98, -88, -228, 295, 17, -9, -121, 221, -145, -36, -22, 5, -236, 72, 33, -46, -317, 133, -126, -134, -59, -75, -24, 84, -93, 6, 49, 141, 98, -137, -110, 142, 212, 25, -19, -174, -37, -55, 77, -44, 142, -249, -67, 262, 51, 31, 10, -51, -337, 67, -9, -3, -247, -339, 291, -214, 298, -6, -52, 95, -60, 281, -3, -114, 183, 15, -250, 50, -71, -178]
6129a78L25l23J13LJ43k48L2L14l2k00j08J59j05l2N2J93k42J68q5J5j11J25m6
6152f8k02M28l96K24k54J57R3n3L7K86ok66P2k11K38Lj74M1K24j74J27L7j89j8
6176d4n7L2M0j43J95k44J09P1J43n8j39K97k70L00k56K02Rl03J95k03J41K6k24
6199a81Q6J12JO2j04K04k4k3P6k92J11k1J87M2k6j76r0j52M13j78j55L3J90j91
6223i6J78j94J71P2j05m62N87j06j92L12k24j54k17N75rm59L62l19L68n5k03J
6245a69j14J63l7M5J81j64J09L4j32L32j03r9m8J88j2j01o7j98lO5R7Q3j52J72
6269G0J56k09m1j25K46j59K3J80n8j19J12L9j09P7l4q1R9r2r3j1J66J79l98K07
6293B5N1K71m22M10k47k80L51j28K84l70%L9J95j25p1J60j10o8qK4K34q3l06J30
$$ y = [-178, 147, -176, -63, -60, 83, -165, -133, 181, 149, -51, -159, 0, -105, -137, -85, 108, -134, 34, -51, -36, -147, -22, -68, -270, 158, -238, -14, -268, -111, -18, -71, -34, 252, 246, -20, 52, -159, 79, 82, -92, -51, 173, -1, 126, 163, -26, -44, -101, -69, -29, -172, 23, -221, -112, -41, 102, 44, -95, 202, -68, 232, -24, 178, 187, -116, 79, -124, 17, 43, -181, -95, 17, 18, 80, -24, 180, 156, 133, 209, -83, 28, 7, 194, 236, 210, 34, -56, -208, 205, 27, -128, -95, 95, -96, 82, -112, 59, 131, 26, -436, 151, 45, -147, 165, -59, -213, -430, 145, 136, -323, 39, -280, 88, 33, -170, -169, -283, -120, -157, -112, 69, -95, 14, 48, -84, 248, 145, 46, -2, 186, 174, 73, 6, -192, -195, -130, -33, 50, -102, 70, 226, 17, -24, -149, 97, -62, -39, 141, 83, -36, 76, 115, 6, 83, 49, -32, 67, -25, -118, -129, 37, 216, -182, 25, 76, 347, -75, 335, 88, -192, 159, 31, 315, -55, -55, -16, 179, 54, -17, 143, 33, -35, -43, -19, 215, 132, -174, -44]
6317d4J72j06L4n0j25K01J04j39J14p9l35M34r7j44J39LJ4j82J7L17l45K19k77
6340a55j72N2L60J41J37l15j00k5k01K39L26k45J39j34k25L45l01K30j00J3q0
6361g1l8K06Pj09p6M1J01K5o1J45p7j42O4J72l14J78j41k1L67N3l93PM3J33J86
6386B85m58K33k84L50j92Q7j42J62K14l74M0j1J34j70J70O5M7j77j75J96q5q8
6408a73M55j3l73N5M7m6k12J67J90o8L75m16Q9K38n80L82p7r4K44l35J02K80j01
6431A36j06p0OL79j51j79k24J49k4R3k20m2J47J36k38J51nJ44o4m10N89k54n5
6454a12L1K83q9J18l16J13l5j23J86O8j62R4o2j81L84j64J95Mj73l9j89J43KM11
6478C87j41m42L91n25L64J02q9J69p8j29j63J2J94l10K17K59o3j36N8k88K32J04
$$ y = [-44, 128, 22, 56, 6, -119, 82, 186, 47, 161, 82, -253, 181, 84, -60, 79, 82, 96, -86, -69, 248, -97, 122, -155, -327, -275, 85, 226, 363, 48, -52, -77, -278, -39, 287, 42, 181, 47, -178, 167, -134, 96, -4, 9, -71, -109, 97, 104, -5, -81, -40, 61, 86, 25, 170, 93, -49, 15, 187, -127, 51, -90, -111, 256, 309, -84, -77, -34, 99, 285, -173, 60, -224, 126, -66, 21, -121, 41, 255, -119, -79, -90, 44, -126, 44, 109, 156, -21, -196, 0, -85, -173, 282, 269, -104, -49, -2, -48, -260, -93, 97, 29, 404, -12, 77, 315, -265, 117, 40, -54, 190, -145, -43, 237, 136, 30, -40, -34, 345, 194, 15, -209, -60, -84, 9, -211, -253, -106, 30, -208, -57, -62, 82, 18, -392, 197, -57, -112, -81, 202, 113, 231, -85, 28, -7, -130, 56, 124, -38, 56, -6, -187, 197, 33, 228, 232, 59, 20, -169, -26, -24, 387, 246, -196, 195, -330, 34, 136, 47, 216, 138, 9, -154, -142, 52, -258, -41, 218, 155, 19, 77, -211, 21, 125]
6500A25q2P4j04l9R9k35L3L15M4k03K84m18K11k85J71J67Mj24J95k53n5r8p5l9
6524b88N27mm94L47k54J07o9L8RM32k97j43j16m7K7K88j38M6K52j82jj13J6O7
6548A0R9NJ31J12l36j56J26l1j09J4jK60k41J29Q2Qkr0J41j38J2j22L32k95K60
6573B00l05J32l1J73j30Q7k55J37j10J03J2L5K24J6l91M00l06m5P0J36j31K59
6595B80m50K01M5q3J48k15nN9j6J6m6l9J85l08L66l34J77o4k82L97o3J93l1j73
6619d2J96k84O5J36J10j00l05K22J74j95n2j6K79j60j85M6J29j91J96o0k20M95
6641B38j68j31M9j4J09j87MK90j01l61L26m3n1J11m93N74l49P4R9j03K38j20J28
6664A19R4l97J25J67k20R7O6j48J42NJ18m92O21p4m05J55K35n87M35j91K88M3
$$ y = [125, 43, 117, 13, -26, 73, -162, -129, 186, 230, 27, 311, -107, 104, -181, -10, 157, 161, 37, 232, -21, -76, -174, -249, -288, 239, 235, -259, 88, -166, -59, -128, -90, -81, 351, 54, -89, -205, -252, -225, 63, -75, -29, 223, 41, 40, -73, -57, 10, 109, 114, 245, 357, 21, -135, -9, -40, -149, -135, -136, 124, -117, 12, 94, 102, 100, 10, 151, 13, 25, -97, 235, -60, 200, -105, 27, -4, 169, 39, 126, -129, 8, -102, 1, 13, 48, 272, 288, -103, 297, -9, -54, 16, 152, 21, 280, -170, 31, 76, -7, 141, -74, -79, -20, -36, -20, -66, -105, 80, -228, 138, -196, -19, -83, -365, 32, -31, 162, 131, -42, 154, -130, -65, 71, 181, 81, -224, -2, 172, -23, -75, -91, 188, 28, -157, -111, 18, -173, 23, -37, -257, 238, 70, -61, -12, -26, 83, -104, -100, 190, 89, -272, 54, 11, -40, 71, -422, 152, -197, -123, -24, -127, 111, -9, 119, 213, -184, -59, 108, -112, -15, 51, -97, 45, 50, 168, -324, 297, 223, -182, -27, 208, -379, 56, -135, 153, 196]
6686A96j51J03M9j67l0J66N4n13K99J23R1k71k25M40j74N6Q7n4p6J42l40K98O3
6709A66L4k99r2J8P4l4K34j08n6K92j78m6Q5k55J45J20j43N9N3o3K1J15j59K81
6733B64k96j56K09P1r3O8k30L60l94L60j7p3K8j65K56n34N72k15J73l45K78j60
6755c9J61M8l57J50j34N79k51Lr0J47o0j22O7j96m9J06K81j01k3j62j65J40K74
6778B07k64j90l0M41J30k61m9N7L5j53K54k45j37L97j57Q5j26j15J76k00J54j07
6800i8J49k01K24k79J75J89k91k26K55J63P8P3p9k75J69k94K69kO7j57k89L19
6822f1J99j30J77l02l9K50j57N1l2J24qj73K59k67K82j72nR5k26L64k61J8L6j24
6846a02R5j28J8K36k7J21m17M33K1l95P2j27J73q1J3K13j30j37K30r7K14R6k70
$$ y = [196, 45, 148, 197, 30, 0, 166, 220, -293, 6, 129, 220, -51, -276, 164, -10, 46, 133, 79, 3, 145, -195, 103, 166, 200, -99, -191, -173, -99, -133, 101, -7, -63, 229, 51, 5, 90, -165, -20, 100, -43, 16, 69, 6, 27, 142, -17, 264, -32, -188, 21, 92, -1, 67, -163, 197, -197, 163, 146, 73, 101, -64, 192, -342, 230, 15, 188, -157, 121, -39, 122, 170, -187, -37, -171, 408, 157, 160, 70, 217, 157, 35, 102, -94, -143, -37, 244, 143, 120, -42, -207, -67, 207, -57, -247, -277, 164, 294, 33, -16, 41, 76, -77, 177, -68, -205, 192, 35, 120, -6, -121, 55, -145, 9, -98, 51, -150, 74, -205, -30, 159, -132, -358, -103, 60, 138, 211, 132, -143, 26, -268, 1, -1, 66, -91, -380, -61, 138, 8, 185, -117, -156, 94, -63, -12, -44, 80, 72, -101, 158, -109, 173, 1, -4, 91, -135, 229, -32, -14, 22, -102, -7, -135, -117, 119, 92, 213, -204, 229, 250, -145, -73, -200, -27, -108, -95, 118, -12, -149, 81, -16, 198, 294, 24]
6869B4r3L10l08L2J27l10L82j87M4R3j04n7J31m5J16j66p6J26j06L63l92J10N6
6892G0k18J10J01j11pK80j22k54K78o7L8r3l4M33k99j56L2J09k2j61J18R7k49
6915a27K3N1J54j97L5J0O5oM9j81K23k61K77m1R8k10L1o3P6J12j64lJ38Jq0R2
6941A02j48n4J23j08j18M50k10l6L9K5j78L56k38k4J12Q6N9N9l40j35J87j54K93
6964A48m34K11K00j76K6j8o1n8k3M22l74n6J67J62r1p2J20q8J09l52J48j1K67
6987A66j79J28J04j71J44k97P8L3j00M4J60j68J34j77K48l24qJ38J90k99J15r
7009e0RJ15L3m6J06j26j3R3P4k1r8L6rN4j44j46J11K31k48j9J56j46K1J07j35
7034e5J16l72M63l02Q8j3M5l8n8Q7J08J59k98L07k57r0L20l95J99j3j26K21K30
$$ y = [24, -69, 241, -67, -35, 92, -218, 164, -23, 21, 114, 10, -47, 84, 39, 155, -11, -87, 39, -67, 296, -96, 14, 70, -148, -38, 63, -48, -55, 225, 103, -151, 127, 60, 98, 5, -29, 404, 105, -51, -19, 90, 68, -93, 25, 122, -127, -104, -53, 101, -96, -61, -51, 14, 8, 57, -124, 99, -162, 115, 74, 172, -38, -7, -70, 6, 118, -46, -49, 89, 90, 10, 102, -46, -100, 23, -85, -203, 247, 37, 1, 40, 65, -113, 243, 5, -19, 93, 179, 238, 297, -43, -178, 9, -145, 148, -286, -75, 125, -51, -25, -43, -104, -162, -185, 237, -137, -193, -26, 136, 45, -27, 93, 5, 114, -238, -90, -101, 166, -13, 115, 219, 48, 192, -105, -27, 6, -94, -50, 110, -58, 76, -101, 147, -177, -185, -47, 143, -156, -41, -50, -41, 74, 107, 61, 167, 41, 28, 121, 195, 174, 76, 112, 103, 157, 13, -133, -22, 209, -39, -58, 98, -48, -27, 80, -55, 61, -311, 152, -150, -62, -75, -30, -68, -126, -39, 69, 228, -70, 237, -20, -110, 210, -185, 14, 1, -125, 96, 326]
7057C26j86j89o8r9j78M49k79P0p5L09l76L76j81qP5q6K77j05knk00j66L76j6
7081C9l5K4J28j00j68R7k83K50k2K43j91j1K52l60J77J73j18L5p5k2Q5j6k94R5
7105i7J27J04o6J7j62J89l55K38J66k05R3j92rQ7k7m5P7l9p6n1L24r4l87L63P1
7130E1l2q9m3r3k3K73K51m42K82k23PJ22r9m0k61K44M39n05J07l0J98j92J4p2
7154a56k14M64j19K71l04j5q8L1K51k44J89k31K79n8k40n6K63J37j95J33P3mj27
7177D0J42l00L26j97Kq5J23j91J00j79J99k16K19J08j76j6j8L9K84j03M0M7o2
7200A26j7j62K11j81J54k14m1j49J47O4j78J77L34j94k30K42k00J61m34N21j48
7221a1Q9k4r5K14j14P4l79P7m2M78k82j7J28l65K48o0q6K70r1P9l23K89j56j98
$$ y = [326, 140, -49, -117, -216, -394, 55, -224, -154, -229, 80, -296, 80, -101, -109, -34, -120, 157, 52, 50, 45, -155, -321, 55, 39, 4, 28, 156, 56, -112, -15, -298, -48, -70, 173, -18, -29, 223, -137, 40, 213, 95, 130, 55, 33, 118, 102, -192, -97, 30, 134, 68, 85, -77, 112, -243, -5, 161, -44, 49, -143, -152, -65, -92, -137, -60, -99, -175, -226, 98, 4, -383, -20, 51, 19, -70, -113, -206, -229, 44, 295, -147, 135, -88, -81, 41, -58, -98, -359, -115, 324, -181, -74, -104, 94, -98, -84, -156, -370, 94, -25, 246, -58, -73, -161, -130, 121, -123, 66, -165, 114, 56, -184, -240, 23, 160, -35, 98, 171, 167, 40, 182, -118, 208, 11, 13, -72, 51, -140, -40, -219, -20, -236, -17, 91, -85, -101, -119, -80, 204, 101, 141, 188, 126, 109, -53, 158, -23, 131, -83, -124, -273, -126, -62, -240, -63, 271, 77, -153, 89, -111, 50, -384, 137, -11, 78, 54, -41, 173, 59, 133, -246, -169, -211, 267, -15, -32, 96, -269, -21, -81, -167, 103, 12, 91, -232, 57, -99, -297]
7245b97K95J37l9m76L85j5J14l05J22R4K85l34J52l14J69J56m6j37j06J50j38
7266a48K36N7j10J59k4j21l01j0J24K88j07mo3M1J67n6j37k07L64l41K53MJ65
7289B29k60J2K23j67n6J33j87j16J87p7j42K00R9j88K32QK8q0j3M6j23LM7P5j39
7314b6k15N61m20L02j75J78j4l67L16j04j81K11j04K00Mp7J34k35q7Rm8R4j6O5
7338EK38k91j40J62q7m6M6L4N5M3k5Ln1J32q9J25k09j39J55J18N9J3m39L95O4
7363A31j57%j69P7L50k46k4k6L47l21j48L17k38o1J24N9J07k21q0J07L3R0j21
7386g0qJ50M1j55K39p9j37J35l48M8M32l93M50k16O9r3j94J21m3O7nK42m43q8
7410b78L64J55k28RnJ98m44J83K45m12J69M1J63j30M4J11j17Q2j45J13j9j99K19
$$ y = [-297, -2, 135, 96, -380, 5, -10, 104, -201, -79, 15, 300, -34, 118, -196, -27, 129, 83, -54, -160, -10, -148, 88, 145, 35, 194, 170, 49, -252, -262, -138, 150, 43, 39, -24, 17, 184, 128, -9, -216, 148, -193, 60, 64, 229, -31, -19, 204, 37, -19, 114, -73, -189, -2, -79, -221, -21, 78, -110, 122, 130, 158, 78, 65, 111, -12, -9, 38, 113, -26, -241, 320, -100, 202, 27, 205, 191, -176, 140, 36, -145, 66, -38, 162, 166, 89, 223, -12, -99, -90, -138, -44, -60, 5, 243, -48, -188, -26, -113, -159, -113, -79, -24, 19, -6, -3, -54, 78, -11, 114, -95, -234, -79, 39, 98, 111, -328, 67, 131, -26, -26, -195, -118, 232, -14, -38, -64, 283, -38, -186, 131, -107, -168, -44, 15, 122, -99, -179, -72, -39, 51, -70, -78, 72, 113, -42, 197, 118, -19, 116, -232, -184, 248, -145, 305, 89, 158, 65, -129, -8, -51, 16, 11, 253, -190, -278, 86, 241, 13, 22, 17, 215, -229, -46, 199, -213, -44, -3, 160, 30, 74, 185, 68, 150, 5, 118, 99, -100, 119]
7433A19p9j57K33n6k72Q4K54q8k1l0J23m0L3l02K79j93M35k05L4n5k21K19j08
7456a4J0o2K39j34K67l51J40m2j20K94j92K60j80j67K80k70O9j41J20o4J11k18
7478a65K53Q3k82J49O7j29j67J01J75j32J66o0j90K00Q6l3j37q3J33K9Q0j35p7
7501f8K00k53L0PJ27k37L18J36k11j99K10J6l0R2Pk05K47k11J83j68L5Q6j75J03
7525D0l3j27P4K92m45K44j05K09l30K61o7k18J50J88l45K12L9K6J34l16J35j15
7547i7j5j67K86L0N3L3k28L17m8l7k17M2j8k2O0J02k5%m1k39K26L53p67M57p2
7572c4L0k10N20m81r6L27l6J32pJ47k91J37j46j5K3r3j62K63P8q5K0R0j18k09
7596b16L56l23L02j19p5P4N8O3k16N7J82o0j32j13K30k13K33J23j00J09j89O2
$$ y = [119, 40, -117, 116, 60, -212, -128, 126, 38, 17, -13, 110, 70, 103, -199, 80, -113, 322, 117, 151, 96, -125, 94, -14, -4, -66, 173, 39, 306, -45, 95, 53, -67, 227, 35, 295, 115, -52, 228, -42, 27, -114, 6, -58, 53, -165, 88, 171, -111, 38, 105, -24, -191, -90, 85, -47, 119, 59, -131, 69, 155, 122, -15, -98, 35, 64, 144, 9, -68, 132, -121, -91, -84, 43, -194, 124, 260, 49, -150, 60, 76, 46, 138, 145, -60, 187, -24, 159, -9, 26, 112, -63, 40, 7, -120, -46, 246, -199, 45, -60, 149, -181, 80, 13, -205, -55, 133, -212, 0, 39, 65, 199, -117, 18, -97, -112, -279, 7, 37, 90, 123, -105, 212, 164, 127, -90, -48, -66, -88, -28, 74, 49, 49, 8, -231, -5, 348, -419, 38, -34, -4, -214, 306, -175, -271, 56, 20, 152, 145, 292, 1, 138, -8, -23, 0, -93, -255, 8, 86, 1, 21, 111, -7, -216, 140, -183, 119, 0, -75, -1, 57, 120, -96, -39, 143, 83, -49, -162, 68, -145, 88, 211, 111, 220, 31, 93]
7618I3j2q8J20l9m58N06q5M0j75J50j47N4q9k4L51j35J9j8j75p6J73r7K39k8O3
7643A62j52j72K76j17l8o7K03J08q6K30j96j76j8O8J9m0j34L36j52k58M69n22
7665b57K44o0j4L69k54j34J69k11K51k58M12m80m3J95j48L44l45K88J79l11j0
7686g4Q4jJ34k43J93k29J75J40PJ9l47L48j78k7J42j52Q9o9J10n25M62J71j76
7709E3K6R3j98p2J67j52L0o5R7k67L12R8k44L05q2k90K36j24Q5K51J2j13k28L8
7733c2O7p2j92M48k37J76j2k49o7K02J75n2l23J32oQ5n9j04J22N3J00oJ60j69
7757A40j32J5K4J45k49j29L42J00J82n17J29q6p2K63k28P0j40K11j16J42j43j
7779e0j61J68Q2j6l38L16j82J2K93k04j17L31M4j78l7R9P5l6k18k5J74q1N9N5
$$ y = [93, 81, -7, 113, 74, -384, 122, 37, 77, -98, 52, -95, -41, -130, -154, 197, 62, 81, 63, -112, -188, -15, -112, 127, 99, 162, 10, -162, 114, -3, -41, -108, 95, 203, 117, 347, 151, -25, -43, 25, 44, 4, -130, 206, 54, -204, 265, -257, -13, -73, -87, 282, 28, -106, 63, -148, 103, -155, 257, -223, -266, -71, -219, 125, -220, 68, 247, -64, -74, 10, 9, 143, -100, 93, -136, 39, 179, 186, 205, -142, 206, 28, 1, 143, -9, 80, 11, 121, -404, 58, 229, 53, 79, 172, -26, -98, 69, -83, -53, -118, -21, -288, 24, 122, -122, 183, 101, -189, 47, -77, 8, 259, 271, 158, -70, -32, 35, -37, -229, 219, -18, 158, 146, -103, -170, 32, 207, 155, -168, -36, -42, 43, -16, -120, 2, 55, 155, 149, 309, 140, 8, 23, 47, 192, -57, -186, 156, 256, 438, -79, 50, -36, -108, 155, -73, -3, -143, 68, -48, 94, -49, -50, -211, -43, 39, 23, -315, 1, -181, -169, 124, -80, -197, 134, 178, 0, -37, 62, 137, 101, -117, -142, 32, -49, 10, 65]
7803F5J83l03j0r6K09k96M06r9P0p4j08J46q7n0RL31j69j16jJ87j58K57j41j50
7827Em6K8j14j94L94n2o8K81k05Ll14J53J22k14J69n5K80j0K18j85k22j38J72
7850HK93k25o2l00L27J9j41OK0J06J23l90K76k39J69J29r5K22l91J06J82j35j2
7873dK68k97R2M7j05o8Q3p9R9m2J54k13n3O1j6R0j78J90j11N7JJ53lp2K0q7k33
7900b46R5N47n79K29l80K68J4K9Q1J5ln9J88j19K54n12L77j05kj96J72j70P4j28
7924a56J84k97L97k1rk33mJ22q6K92k06J89k13J57l05Q1j24J85J04k12K30k02
7946a27K82k30K82k05M6j11J34K35q8L9k58J20k8L31j67j29j48j08K14j37N8j68
7968a63r4K06M21m61l3J97j09K01k55J5P1R4j61K25L3l25L09l94j1O1K79j19K2
$$ y = [65, 248, -55, -65, -161, 48, -248, 158, 59, 129, 55, -53, 93, 6, -44, -35, 296, 127, 11, 10, 197, 39, 296, 155, 5, -41, -13, -127, -321, 73, 21, -47, 234, 29, 32, -282, -129, -7, -221, -52, -107, 173, 163, 381, 196, -26, -164, 8, 301, 76, 14, -286, 41, 60, -81, -75, -55, 51, 174, -216, 60, -179, -10, 119, 24, 246, -145, -39, 143, 8, -4, 264, -33, 59, 106, 1, -67, 16, -63, 36, -6, 148, -65, -118, -57, -73, 17, -161, 29, -82, -25, -24, 129, 126, 54, 74, -13, -246, -151, 396, -183, 46, -334, -66, -52, -23, 58, 73, 70, 11, 199, 80, 334, -178, 199, 94, 92, -104, 68, -102, -28, -156, 28, -269, 128, 107, 98, -135, -139, -17, -103, 189, -17, 172, -41, 116, -189, -108, -232, -47, 57, -155, 75, -127, 155, -75, 207, 2, 48, -63, 71, 306, 218, 257, -1, 119, 91, 422, 255, 126, -22, -130, 84, -53, 5, -163, -257, -51, 370, -91, -124, 73, -36, 165, -90, -75, -4, 90, -71, 154, 187, -138, 171, -223, -234, -173, 106, -13, 9]
7991Ij36K34j66j8K94n04L5K22L0R6j10k44M25P9j95J70k06l6J91k14L52k94q9
8014g5M1O9n7j39k7kL67k14N9n9O9K23k99j01j02M35j05J11m0k20J02J46k34K91
8038B39k30K5k4K31k07J28r4l43J22j43K46p8P2j96L17J51l06M1o6O4K2k60J61
8061a28J75m9N5j24K2J52k4j97M60m50L97k41Q5K1l29L47k13J21J1K41j02l62
8083a32P7L23m10k9K0k1K18j25K92k98j08K86k8o4J29j40K05l55K46J64r1m55
8105b96K76P9n6J45j67j2m6P9j16L45j70o8Q7n9N4K64m83J16k19Q9m0J81j2j3
8129d2P1l7K4j03k3q0Q6K26k51M1J68n5j13O8K45m09Q3J21j66J62j0Q7o2l34J05
8154a98K22r5J37k60K24J1j57Q6k8J00j15K83l82N84m84K9j37j3K98k46mpL79
$$ y = [9, -127, 107, -59, -77, 217, -287, -252, -30, 0, 96, -14, -258, 167, 246, 51, 221, 15, -21, 170, -44, 308, 14, -75, -34, 35, -22, -161, -188, -190, 177, -37, 22, -37, 32, 255, -44, -145, -247, 188, 83, 194, 154, -66, 36, 182, -52, 239, 9, 34, 10, 241, 34, 162, 68, -275, -153, -296, -50, -128, -56, -252, 65, 216, -90, -49, -115, -51, -29, -289, -128, 47, -2, 53, -71, -49, 103, 79, -118, 342, -108, 289, 48, 133, 154, -175, 172, -41, 80, 91, 332, 230, -132, -55, 268, -142, -171, -151, -172, 46, -79, 213, -85, -193, 93, 65, 1, 130, -10, 195, -160, 86, 250, 159, -296, -20, 59, 3, 148, -19, -31, -77, 2, -114, 231, 61, -7, 80, 21, 75, 339, -144, -28, -247, -158, -198, -17, -29, -42, 29, -8, 16, -87, -110, -190, -104, 122, -129, -88, 80, 25, -88, -20, 225, -184, -101, 20, -146, 16, 6, 93, 31, -303, -198, 24, -71, 66, -194, 30, 41, -116, -30, -58, 42, -73, 210, -172, 412, -72, -43, -180, -193, 105, -141, -145, -152, 227]
8177B27j77j93J93Jl7K32p0j03l59K53o0k10L89n9
$$ y = [227, 50, -143, 50, 51, 14, 246, 176, 73, -286, -33, -93, -303, 86, 27]
8191B7
$$ Imaginary data points
##PAGE= N=2
##DATA TABLE= (X++(I..I)), XYDATA
0@%%%%%%%%%%%%%%%jRj6J6j6J6k4L2l2M0m8N3o1P2q2R0j04J20j36J53j74J97k21
38a17K48k76L07l41L78m20M66n14N66o25O89p61Q39r24J020j124J239j372J521
57G99j689J887k118K390k720L132l661M367n364O890r546J5476n7495L3098P3696
72E9142o8753j5430L6170J243k7176J6294K578p136J0651R189k1052m417J7725
85I028J3377j2277k3577q184J8689O525q370M147O706j2703o433N124N280R698
99G030O849j2214o254O904r86K743J1728j2379j4701J7116M175k1992R280J9226
113A6525k4674j8385K0929N176q036J9234P239k5519n142J5444k376j624J1870
126A0661j673r258K472M793p86m434o235j737J03n604M566J5515j267j1518O18
$$ y = [0, 0, 0, 0, 0, 0, 0, 0, 0, 0, 0, 0, 0, 0, 0, 0, -1, 8, -8, 8, -8, 8, -16, 16, -16, 24, -24, 29, -32, 40, -42, 48, -56, 64, -72, 81, -93, 104, -117, 131, -145, 162, -179, 199, -221, 245, -269, 297, -328, 361, -400, 439, -485, 535, -589, 650, -722, 799, -890, 997, -1121, 1269, -1451, 1681, -1980, 2387, -2977, 3913, -5633, 9843, -47652, -14554, 59142, -9611, -25041, 11129, 12372, -14804, 1490, 4068, -3068, 7583, 16772, -4280, -8697, 9028, 22405, 10128, -13449, -21633, -2944, 3581, -4789, -642, 6064, -6639, -13072, -7948, -2668, 7030, 13879, 1665, -4589, 2315, 1329, 4072, 15800, 3421, -11280, 5836, 10011, -11981, -2701, 16525, -8149, -26534, -5605, -429, -8465, 10769, 18008, -7511, -12653, 2791, 415, -1209, 10661, 8988, -270, 2202, 6995, 6209, 1775, -4460, -6197, -6094, -11698, -7132, 8383, 7116, -4402, -3784]
141c784k585o643J4443J2086j1873k124R588q328m100J5283k442j5630M202M206
155B299q856M555Q575j0750m378O850o055l258J6200O694j0725o120O79K955O097
170D762J802j610K251k795o309K830J611o337J221P97q624L084J2672k546m845
185b036M576q072q298J3616Q157p791N032Q240j2772n073J0963k234o882M274
199A700k393p512P011O319o738k947K114l329j020M624K968M403p5o608m82N349
215C384j04J287M328o892n810N506j176o452O525J495j0404K288Q547m598j142
230c218P423o657o386Q947L003l602Q743L791j1228k975N310l264j211L764l858
245a418k641M835j180l448K825l51l849R46L48J569P957K195p265l87L245l229
$$ y = [-3784, -6369, -13012, 1431, 13517, 1644, -480, 9108, 780, -3320, 11963, 9521, -6109, -1907, 2299, -6557, -2002, 6573, -4177, -8555, -1705, -7760, -11018, 5182, 11876, 1151, -4969, -4290, -1335, 4762, 6564, 4954, 7205, 4410, -1899, 931, 2542, -3795, -2574, -1777, -10401, -7317, 5355, 2809, -2036, 2540, -5532, -13830, -214, 7943, 152, 5184, 13424, 652, -4421, 6542, 4308, -2574, 1700, -693, -8205, -1194, 5125, -1613, -4560, -2446, -5775, -6795, -2171, 797, 5200, 5125, -1483, -1965, 3384, 3280, 4567, 8895, 2003, -3807, 1699, 523, -5929, 596, 2091, -8313, -6025, 2522, -2076, -3218, 4205, -2452, -8838, 109, 3112, -490, 8253, 12044, 816, -2159, 3151, -113, -1324, 2440, -1418, -4059, 776, -404, -3852, -1027, -1378, -5227, -4281, -3933, -2364, 5593, 7788, 523, 136, 3381, 152]
261A52K219L265n561r19M494n571m074P761r24p091M721R29q187N718J0543q618
277a143o221R425K852m519L217K325l203o44j461l908J694L496l24j565k895j548
293d422M607J82p573K162P325m636j872R290M27n535M183n1p685L497O745o027
309F17j486N180m273m654M698k95m827K030J359k561L182J962k679L308K900n012
325e51o29N761j68l579J042o37j603M33P9k21P68l035r74K766k967l475P438K268
343B716p795L792Q278n386l668P357k568o755O504K854p454K650N215o712m073
358e045N186j892l765L582R48k364L003J611k162J019J704p83J52L39n9K130o18
375B986l151J335J071m191pL207l630j995L559r07k727M241K74k370M202J891
$$ y = [152, 2371, 5636, 75, -844, 3650, -1921, -5995, 1766, 842, -6249, -1528, -599, -8786, -3068, 7475, -1143, -7364, 2061, 4913, 394, 3611, 5936, 2733, 2089, 628, -3280, -1586, 1910, 1586, 21, -2874, -4422, 185, 367, -7206, -5044, 2281, -2355, -4227, 5063, 5490, -45, 4138, 4087, -3598, -101, 6644, 617, -869, 4311, 38, -4616, 82, -213, -5040, -3010, -1651, -4212, -1030, 932, -1747, 1561, 4461, -551, -1180, 4581, 4413, 834, 1876, 1239, -364, 69, 148, -73, 695, -2340, -3314, -548, -3515, -6990, 448, 2716, -5079, -1287, 6991, 1605, -2063, 5294, 2726, -4029, 2475, 5329, -2125, 525, 5740, -972, -5045, 141, -1751, -5516, -1934, -986, -3350, -347, 1264, -898, 121, 1825, 1042, 1194, 1533, 1474, 3604, 2986, -165, 1170, 2241, -1950, -1957, 1250, -2380, -4375, -816, -1723, -4450, -209, 65, -2305, 1897, 3788]
391C788n871K307N466m988l609O958K2n283K750R65m923K36K084l221q44K737
407a426K74N24J012j637J066J884j751o75L041m40l15K744k093l325K830N63n298
424c022R91K625l199j27L018k531j067M583j611l108M614J961m004J892K829l373
440D71m27L381j159j831Q40j216j530N69j443r11K171O24j747J094J338p79P30
457A75J06k325L298K776l566N65M055l153l468K953q07l885K931Q84m185J991
473a655K807l549p43M321k184j902L889J317k187J918O25j801J021K76k305P00
489E48J344k402j073P47j006N39N57j695P56K314j732j084L746m54k791L152K026
506C492k971J007K246l247n52J770k696k053M192p69m147K679J916l081o4J914
$$ y = [3788, -2083, 224, 5690, 702, -2907, 4051, 4073, -1210, 1540, 2505, -2418, -2182, -98, -3319, -4163, -1426, -1152, -628, 384, -1253, -187, 1697, -54, -729, 2312, 1872, 1557, 4301, 2208, -1117, 1713, 2276, -3022, -2031, 594, -2605, -2732, 286, -2245, -3312, 1271, -340, -3448, 1166, 3127, -877, 1015, 3844, 471, 44, 3425, 2266, 435, 1275, 59, -1471, -902, -2345, -3256, -1085, -461, -2208, -1114, 224, -555, 175, 281, -2044, 1254, 4030, 464, 1029, 5084, 1931, -1537, 1416, 609, -3276, -345, 539, -3646, -1655, 1152, -2397, -3140, 1181, -1003, -2905, 984, 2301, 114, 2032, 2657, 856, 1877, 2153, -152, 548, 1892, -510, -1583, -836, -1842, -1303, -746, -2441, -1685, 629, -1103, -2187, 1559, 1105, -1686, 1466, 3492, 521, 1528, 3774, 527, -25, 1745, -951, -3004, 1188, 419, -3728, -1049, 867, -2214, -2278, -364]
522c64j264Q31K239j228L01K509p78j511J010m81j194R17r09q67J135j109k098
539b861K080K44k850J148L319j817r55K828m36r61K821p12k165K799J045m550
555a023J25L121k278j841K121o92j376J476p25j557J862K66j497J885J762q51
571G78M66J025j284L08J97j686N98J827k862r97K666q80k868J860L39k578J919
588a172J577k201J622K626k654k27K666o69j786K465K55l056N59J705k082n64
604i36Q02j193n76J116o29l66Q79K96L70O6m15J507K516k439j734K751J71k921
622g35J424J456k771K86J026k942p8K935j719k320K809J176k404K074J994k825
638f14j8K947r08j411J938l9k023J056l62j511J68P40j085j91n05J52J002L09
$$ y = [-364, -1628, -797, 1442, 214, 515, 3024, 2246, 735, 1745, 1264, 70, 987, 78, -789, 346, -763, -2861, -781, -537, -3387, -2239, 1080, -737, -1692, 1136, 700, -261, 2560, 1848, -317, 2482, 3527, -1023, -898, 2223, -55, -1896, 225, -467, -1843, -367, -1092, -2649, -787, -521, -2018, -133, 1629, 778, 1244, 2269, 985, 1293, 1490, -196, 402, 2229, -633, -1630, 1036, 156, -2712, -852, -513, -3091, -1172, 405, -1796, -174, 2452, -202, -429, 2237, 1568, -218, 2247, 2502, -554, 5, 1710, -372, -936, -134, -1327, -1903, -787, -1416, -1782, -903, -607, -237, -171, -586, 921, 3437, 998, -736, 2015, 2186, -735, 689, 2145, -626, -340, 686, -2256, -2334, 601, -1118, -3438, -629, 547, -1857, 217, 2211, -614, -632, 2315, 1407, -4, 1934, 1895, -128, 928, 566, -945, -777, -37, -1122, -1313, -1818, -1666, -664, -355]
656c55p20J043K59o91J303J828k002j30J505j278j403K096Q1k411J191o5k854
673b603P58K568k163q73K468n01j202J962J202j860R11N84j374R40J499q50p56
690G10J39p96o63K21r24K93J039j350j181J666O95l01Q02m23q26K100J174k482
708a07R37J596k252o33J711m60j285J298j229k254J509J331j813J02J684l46q36
725a047R67N34K6J025p08q31P31R34j72K30j640q07O97k81j776J271J033j704
743a518J41J039q45j66K489l06k106J844J107j502J280J193k113n54O95o19n35
760d76R86j033j820J139O03q74N97P01n28M88M80p28J270J281j155n25O60l91
778F75j36J025j103j172M53n27j050J495Rj254P36Q63j651Q56J818r46l09J599
$$ y = [-355, -1075, -32, 227, -464, 839, 2667, 665, 535, 2040, 762, -641, 1455, 1536, -875, 316, 251, -2603, -1845, 723, -1440, -2313, 155, -346, -1548, 414, 1616, -244, 667, 1251, -123, 817, 2316, 1466, 710, 849, 53, -610, -389, -1313, -1020, 19, -1331, -2512, -846, -151, -452, 350, -73, -899, 1201, 2375, -107, 830, 2426, 174, -459, 1252, 792, -493, 805, -424, -2678, -1169, 162, -1651, -1549, 135, -211, -1047, -80, 454, 480, 1505, 797, -34, 697, 1631, 1459, 1689, 49, -758, -61, -342, -2118, -847, 186, -1518, -1377, -338, -1183, -1349, 1140, 834, -1272, 572, 1679, 177, 1457, 2650, 537, -17, 678, 59, -476, 510, -523, -2343, -1204, -601, -1475, -878, -177, -705, -217, 263, -465, 805, 2086, 931, 406, 1066, 675, 539, 1564, 461, -711, -258, -785, -1835, -340, -331, -1585, -849, 14, -1637, -781, 1037, 91, -218, 1381]
796A381k38j637K166M10j836j32N59j265k19J419o58r82L45p76J60Q28N7j95R55
815C42o9m61J129k2m61J246N5k043O09J132j289k85Q00j657j258K216J91j908
833a733R26P42j043L61J207l98L94J407j165q71J488J21j019K36m02p50O50n4
851I7r92M81j06q53J82O45o38Q58J099n94m35J233j48l34J152m96j875J073J221
870A570j853j65Q62o85j400J093j22o15J215R9j192N19R10p3L95N56p72q6Q32
889A088l59j57K95p53k34N5o67m01Q78j37j021L61k9K90J354L4j134R24J121j096
909D12l25J180k57n05K28o15j102R81J014j919m31P17l09l34J408m53n06P47N12
928D43m10p9Q44N13j21o78m51P00L46j470M02k10q19N33L17r78J70Q23l34o86
$$ y = [1381, 1143, -494, 1672, 2082, 246, 114, 673, -592, -811, 608, -50, -1032, -687, -1463, -1303, -475, -418, -613, 342, 273, -188, 941, 919, 458, 1704, 1759, -284, 325, 1457, 168, -117, 683, -974, -2232, -16, 175, -1733, -807, -65, -1108, -747, 460, 62, 456, 1863, 698, -173, 1315, 1436, 417, 653, 251, -499, 151, 97, -895, -414, -520, -1373, -1191, -546, -1184, -326, 773, 179, -256, 977, 829, 495, 1647, 1151, -724, 349, 1570, -283, -448, 414, -271, -1671, -578, -700, -1315, -100, -1, -1193, -674, 236, 163, 558, 1114, 342, 256, 1088, 729, 572, 867, 114, -120, -65, -732, -1133, -255, -392, -1413, -1052, -1081, -791, 563, 597, -537, 387, 1508, 412, 87, 1267, 1010, 505, 733, 118, -984, -3, 1011, -908, -1339, -622, -931, -1265, 143, -310, -816, -69, 443, 33, -46, 798, 1311, 1190, 512, 61, 761, 1107, -363, 39, -171, -990, -457, -140, -1118, -948, -125, -459, -1145]
948a145J077N27m94N54O47j158L54R08p00k86P47j204k78N48j15j279M69O90q35
967i73L34J35N2L11O81q07K56R70k28j56M76m91l79M88l73q07N89m44p15K92J77
988f12q89O15R55q35j98J116R7k36P94j72o01P74N16j009l64J082p13m60J09k56
1008b87m41M42m41k29N16J54j28L02K97K2K43R8o03R54J15q54J61K44p58k88O58
1029A77l19r47O18J4m58J71O63p55L94J179n87l85P19M85m79K02n2k97K18p0n57
1050f6j97L37n10j0J92l16R5J6k13K16P85m83M1P19r3n41R78L63o94l37L91p91
1072a18nP23j162l46N72o7n79M27N34o64O20N22l59R3O61j64n02O26j37l23M54
1093H06l55p98J36J76n45K59k15m89P20P1p95M21R25n49K88K40J48j10P49k47
$$ y = [-1145, -68, 459, -35, 519, 1166, 8, 362, 1270, 570, 284, 1031, -173, -451, 97, -18, -1297, -828, -138, -973, -639, -504, -452, -141, 540, -267, -11, 959, 731, 575, 1051, 560, 181, 669, 296, -511, 78, -366, -1081, -789, -612, -1501, -886, 69, -766, -964, 152, 249, 13, 807, 635, 34, 808, 1324, 315, -49, 1033, 320, -140, -31, -287, -728, -286, -727, -956, -440, -286, -414, -112, 185, 207, 450, 548, -55, 899, 1014, 160, 321, 565, -193, -481, 177, -142, -1089, -471, -457, -915, -744, -81, -836, -442, 737, 150, -235, 484, 969, 490, 692, 640, 343, 561, 491, -66, -263, 74, -436, -446, -254, -570, -475, -459, -672, -456, 329, -154, -113, 606, 513, -28, 950, 1313, 619, 282, 673, -118, -123, 600, -562, -908, -336, -403, -982, -555, -21, -685, -65, 457, 98, 191, 852, 688, 186, 812, 675, 352, 806, 451, -347, -211, -35, -580, -321, -536, -1025, -305, -234, -1029, -608, 317, -232, 56, 296, 444, 334, 1083, 836]
1113H36r25M15L37q76l6K30l84k63M21l44l54N36M31k88J69J05J91O83k23n46
1133A15L26K30j14k41L38n15j50N32j190l65O60pk89j2L47l54N81L45l69P4N33
1154D75l02J41M32l02j78J02p9l63r8K60n99J34k6k47L03oo9M7N25O8K2J93j45
1177B88K55L14o17k22P46k63p29K95Q6n59J50R8m35j70Q40l77n49Q98N12o00J97
1198A58O74q58J64P40n40l72J84L31m39j69k46p2M50k19n64Q9K37K74m0J79k08
1219b47L21O51p73N13N06p84L59j48l93j44J93L3p25J67n6k09l4O66m97N0P55
1240B04j83k08K61L81j67J05J25k45J32Mj18m13M56n85J7r1k33L62r3m31K26P01
1262B07n5k42l0Q82n20L42q8l6k54L24j50m28q3K80p15J39K1K43m35M34m04L12
$$ y = [836, -89, 326, 663, -213, -249, -19, -403, -666, -245, -589, -943, -407, 24, -264, -95, 10, 201, 884, 661, 115, 441, 671, 557, 316, 654, 139, -11, 521, -669, -1034, -374, -381, -670, -682, -335, -689, -108, 237, -132, -58, 475, 173, 314, 746, 444, 266, 368, 289, -74, -172, 88, -511, -377, -403, -650, -347, -353, -422, -375, 150, 218, 240, 433, 288, 543, 857, 240, 18, 764, 501, -228, 67, 153, -406, -256, -158, -593, -763, 77, -300, -849, 49, 561, -39, 158, 832, -26, 138, 878, 338, -34, 150, 481, 42, -127, -373, -445, 5, -214, -778, -689, -452, -178, -218, -39, -247, 74, 725, -48, 465, 971, 187, 546, 398, 5, -139, 54, 87, -638, -471, -527, -736, -770, -104, -601, -551, 204, 21, -187, 74, 455, 288, 393, 518, 273, 405, 409, 291, -122, 334, -251, -234, -325, -558, -196, -289, -720, -494, 207, 152, -90, -120, 762, 242, 584, 496, 460, 206, 530, 380, -48, -131, 149, -566, -427, -406, -163, -598, -164, -568, -256]
1284b56L02o0K3K82K21k44L85j58m59K68j97JJn0m47K55j34n26L01J58l82N93
1306a23M85o12L46K81K04m82P53l74l38L38P3m39k17L75o94k31N80k78P5k25J69
1327c34q1L98K20j46J21J55nM4L43m40j66J33k27J4Q1m36J06J47k21k81K25K32
1349a18l60M33L52l39j63N19Q8m3K32J43m86q2Nj23J7M3l77j46J77l12J00j66
1371f06L83jJ74j33M7M59j02J87j16K91k58K24j43k55k11K40k90k80K56k14l96
1392g44L15K77l33mN86k92J85L08j64q4L57K49m46N4l01k35M91l38o7M8k22r1
1414d51J20M0j54L45L35k95p1K00M63k28L06m62J53K66o4p07M44m31j12l12M58
1435a57l0j94K29k13j19K16K44O6J50j09L51k66K92j68j32J92l03M4r6l90K8L31
$$ y = [-256, 46, -14, 9, 291, 512, 268, 653, 495, 36, 304, 107, 108, 109, 59, -388, -133, -267, -793, -492, -334, -716, -123, 362, -250, 96, 377, 581, 99, 852, 478, 140, 478, 551, 112, -105, 270, -424, -655, -75, -353, -278, -503, -334, -415, -17, 203, 57, 178, 333, 328, 372, 715, 275, 109, 242, 15, 29, 110, -326, -220, -73, -294, -575, -350, -118, -478, -45, 307, -32, -195, 324, 412, 369, 601, 744, 258, 176, 181, 58, 75, 118, -259, -405, -228, -540, -440, -606, -223, -224, -50, -183, -136, 323, 221, 408, 292, 583, 325, 549, 406, 151, -60, 180, -110, -390, -134, -348, -744, -429, -152, -485, -489, 97, -195, -10, 298, 134, 50, 407, 656, 210, 264, -37, -272, 219, -119, -186, -138, -360, -451, -331, -291, -445, -100, 235, -60, -131, 69, 532, 304, 610, 148, 301, 567, 503, -204, 240, -191, -303, -615, -157, -187, -381, -152, -365, -484, -268, -24, 42, 192, 83, 434, 168, 460, 292, 160, 352, 49, 93, -3, -393, -365, -34]
1457c4k08k50J14J49N7J95J11n10L32O34l87R1L14m25j87N40k79j66O7k6k67q2
1479b17j6m08K48K73j19m7J48K68r4J69k2n2L0J23k68J98J39n08L0O3j49j93O7
1502c37rK35n5k35r4L84j76P4N31k64J51q0M15l63J02j51k00jJ65K9n56j8L2k12
1526f33L41P2n6J60MR8J65M38m78O4J80j13k52m4L65j41q0l08j00O3J04j61r5
1549d07L32l1l89M97M9J7QK29o9P1R9l6j89K84n4r28L52L3l58K33k21L80j60k57
1573e15M08M04l36m7K50J13L5j63J60R3j75L8k10j30K53N1o50K58J51k66j69L67
1595h0L6k31J24J75L8K80j41K0j1o7L0J38o4l38J03j68K3L02o19q2K62J03l66
1618e33M29j7J85l20K95K10j00K84P6k23J83j72k41n1K72m33J8j13k45J85J73
$$ y = [-34, -242, -492, -378, -229, -172, 23, 134, -376, -44, 590, 203, 294, 608, 183, -4, 536, 257, 91, 158, 132, -135, -217, -233, -641, -393, -120, -239, -286, -138, 130, 36, 205, 183, 131, 161, 284, 16, 214, 353, -155, -125, -62, -211, -404, -337, -346, -111, -166, -401, -495, -111, -287, -213, 318, 54, 205, 125, 540, 177, 279, 128, -72, -73, 92, 121, -435, -453, -421, -633, -292, -220, -276, -116, -112, -14, 151, 589, 111, 175, 355, 242, -10, -54, 311, 170, 90, -218, -318, -255, -151, -312, -407, -75, -106, -495, 2, 51, 68, 76, 305, 236, 307, 406, 370, 181, 465, 411, -517, -165, -132, -490, -257, -478, -98, -258, -515, -107, 297, -39, -86, 164, 277, 312, 149, 309, 402, 227, 265, 55, -75, 178, 229, -421, -163, -12, -278, -447, -80, -44, -275, -151, 24, 62, 342, 201, 221, 210, 143, 173, 311, 247, -91, 12, -156, -133, 169, -450, -532, -270, -167, -533, -104, -121, 64, -256, 39, 249, 149, 433, 509, 286, 469, 297, 56, 5, 277, -156, -138, -251, -496, -311, -138]
1639a38j55j82J44L21j08J73J06R1J33j56J2j29K87r4l53J06K1k85N0J60k81K91
1661A4j98J2j1q2J35J56J76O4k62M6L36m59P6J75o1l84L40n58K58K4m17L96k5
1684b49J10j45L22l34P9K83L08k8j00Rm6J31r5k57N2q2J49k92J63j80l29L36J64
1707c1k23K88Q3k48J69K97k43K64J1j99P4k6k03J18k8j97J2r6J01k0r1k57N14
1730F9j79k6j16L57L09j37k32N14l86k17K74k20j66M19l31J38ml03Oq1K59k33
1752b86O9K50M8R9j3J26j60K17j39n8K37k86K29j41l76R0J36j18j51j67K60Ok5
1775a53Q4j85J19J84M2o8K32KK0k88K32J08m33P3p7k83J35J02J1q8l6q4P7K36
1799c8j8j49L80rk3K19o8o9k2pj91n0mM2k63M47k92j25O0l5r8M97j7j74J36j09
$$ y = [-138, -293, -475, -331, -10, -118, 55, 161, 252, 385, 229, 241, 112, 399, 305, -48, 58, 79, -206, -156, 4, -277, 14, -184, -172, -183, -265, -130, 26, 202, 266, 4, 50, 386, -73, 3, 178, 117, -267, 73, -485, -227, -203, -620, -224, -249, -139, -284, 38, -296, -217, 66, 374, 346, 246, 255, 209, 340, 245, -12, 40, -42, 107, -185, -22, -202, -531, -195, -31, -254, 34, 117, -131, 38, 335, 92, 356, 367, 168, 242, 216, 13, 131, 103, -94, -82, -178, -77, -97, -188, -445, 69, -110, -136, -252, 105, 414, 277, 45, 559, 173, -44, 230, 10, -156, 263, -68, 70, 66, -237, -231, -312, -53, -286, -217, 33, 81, 180, 167, 293, 133, 350, 211, 153, 390, 104, 333, 192, -184, -94, 42, -76, -227, -394, -134, -128, -153, -69, -254, -135, 49, 91, 23, 255, 257, 277, -11, 221, 329, -104, -31, -108, -391, -256, -154, -143, -231, -267, -351, -274, -38, -56, -205, 175, 166, 143, 362, 294, 225, 203, 196, 5, -45, -49, -7, -270, 177, -115, -240, -180, -215, -313, 184, 167, -7, 129, 20]
1825B0J6N2O52n69r6j31L7P4J51l66q3J17j18q7k11N98J00k63Pj0J35J13j0j96
1849f8L10r0R5P9l13J49j68M9m70Q4J32n0k0j9J92j10K79j57N7K69k3r1M9P4m5
1874A94M8J21j62k05K6P4m8n4m12J57p1K74j77j26N77k38j42M32j61M1K87k76
1896A59j49O3Q2K13l95p8N1j33J93j51J23K62k94l30K54K80l38L29j33J09J9J63
1918B99P8r1j26J15m37rL5j20M8K25k5l52P5L16k96K13L46m87J17L03J05J57k79
1941B10j88M36l94j51n8N5J02J6k84L9N44j41l29p9K16K85l35J16M18k24j61O4
1963A57j96K32l60L44j23j42l1O3L77n76J62j3j34m4K95q4K4K41m6j62L92j05
1985B71Q9k59J87m86O4K78m01L34k32J21q6j7L9R9j99k3J99j40K02J88l10M01
$$ y = [20, 36, 88, 740, 171, 75, -56, -19, 55, 206, -160, -243, -126, -244, -331, -542, 56, 156, -107, -100, -110, 25, 138, 128, -68, 242, 152, 247, 326, 13, 162, -6, 43, -427, -343, -211, -261, -281, -300, -108, -218, 61, -96, -39, 230, 207, 116, 165, 239, 194, 242, 363, 201, -4, 22, 96, 48, -6, -418, -261, -332, -58, -235, -361, 216, -22, -164, 268, 107, 148, 435, 159, 10, 73, 155, 368, -27, -105, -54, -187, 6, -145, -22, 240, -54, -384, -130, 150, -188, 141, 8, 117, 136, 299, 377, 286, 160, 275, -162, -171, -136, -256, -208, 17, -8, -360, -285, 31, -265, -52, 294, -193, -76, 227, 332, 489, 210, 22, 458, 64, -87, -145, -90, 12, 28, -256, -217, 327, 186, -143, -222, -6, 279, -56, 60, 478, 254, 93, 157, -39, 193, -167, 177, 54, -88, -119, -56, 321, -255, -93, -106, -240, -284, 11, -73, -49, 192, 146, -16, 376, 271, 360, 101, 288, -198, -134, 144, -257, 77, -155, -34, -120, -137, -98, 1, -198, -221, -22, -162, 40, 228, -82, 319]
2007C19k39J6P5pj7k98o7K2R8P8k02L1M9m18N73mN2k32L87k36r5K21L42k50j77
2032B1J19k39N0M3p4p5o0L40l77J40J78m3m3j26K3L5K35R2k46M93n63R1K21r7
2056A38M7q1k22j19J82k62K0K74j00J20j15j16M41r8k78N07l49J02J23j84N7J14
2078B01o0k09rQ9r6J08j81J93l48J96R1n8N6p8J36J48q9J02N3j93L1j05Q1K7J55
2103B41l07K32n01K48n8M1r3j17R8K07k3J52J2q1j04J27J29j40J99j6j68r0j73
2126a85K44k47J99m3l62M13k69L13J40j28K8j88M0M24k24P2l4J04k48j28K11j20
2148A2J40k27m1j01J01k6j90J57J79J21j2q9J46p3J19j81K52j00L7J93m25n0K3
2171c5J76m03Q8r4K02K24Ko18K95J96J58k07R5j54j1K16N4o4q2J69l15J44l75
$$ y = [319, 80, 96, 171, 164, 147, -151, -218, -196, -98, -20, -222, -191, -142, -560, 13, 9, 61, -171, 216, -20, -115, 106, 448, 198, 21, 140, -99, -49, -6, -80, -155, -215, 125, -252, -112, 66, 23, -20, -146, -123, -88, 147, 239, -7, 486, -77, 14, 235, 138, 185, 104, -118, -237, -55, -317, -297, -23, -123, -3, -118, -234, 207, 109, -169, 338, -11, 91, 214, 30, 87, 201, 141, -68, -77, 12, -84, 24, -157, 36, -312, -116, -25, -83, -27, -105, 31, 179, 90, 192, 245, 52, 83, -22, 59, 86, 241, -66, 166, -335, -87, -145, -104, -197, -314, -216, -9, -32, 120, 132, 51, -53, 74, 203, 63, 262, 246, 78, -12, -185, 59, -188, 11, -32, -394, 19, -250, 63, 203, 75, 103, -85, -45, 379, 155, 227, 193, 297, 49, -79, 132, 12, 152, -75, -116, -217, -116, -142, -332, -175, 4, 125, 113, 24, 170, 97, 216, 35, 287, 187, 224, 417, -8, -58, -35, 141, -262, -174, -268, -66, 158, 160, -458, -163, 33, 191, -16, 79, -75, -86, 130, 184, 120, 38, 207, -108, 36, -339]
2194c39L6jL68k83j4J48K37k99K61k71K58J05l22J95K18pl90L54l40K21K2j85
2216b8k50J55r5K68k30L59N2m05J45j74J52QK7K19j81K05Rpk90P3L26m66p1J85
2240a4n0o2k61M52q1o2K44q4p1R7l98L88J35N9r3l24K62k05K21j59k61K91m65
2263d41J30K34lJ07p0K95j75K3k02J41J52n3mj33J86k5j83J78j71l01J54j68J96
2286a33K35j42q5k07K67M3j32K49K4j41J47j51N0q4L72m12l6M76l48q6J39R5j79
2309c9r7L05p14N58k19L21J7J7K11l85O8m6L34p5j13k94QJ66m8j58J56R7j84J88
2333G4k58M0m7L56J5j32q9M31Qk21o6P0p8k4l6R2n16K95r3O4K04j86j01P5J43
2358B0l79K32p3K79o6K33j09J51j60J2p8Q0l01j8J58K7k87J71j1nr2J61ml01L24
$$ y = [-339, -303, -304, 64, -219, -233, -85, 152, -147, 114, -157, 101, 206, -116, 79, 297, 290, -100, 254, -86, 135, 157, -28, -278, -123, -218, 50, -180, 179, 231, -174, -29, -203, -51, -43, -16, 203, 22, 227, 236, 229, -61, 12, 338, -128, -199, -14, -64, -126, -387, 65, -16, -78, 166, 82, 11, 108, -290, 98, 233, 292, 199, -125, 137, -68, 153, -6, -267, 24, -441, -311, -77, -80, 27, -43, 252, 77, 100, -102, 39, 191, 138, 134, 1, 187, 162, -21, 157, -14, -315, -161, -329, -133, 102, -40, -125, -332, -65, -22, -154, 95, 119, -22, 125, -26, 24, -60, 312, -100, -136, 340, -8, -94, 45, 140, -39, -136, 169, -545, 13, -206, 115, 132, 149, 360, -25, 43, -3, 331, 256, 143, -151, -143, 23, -25, -183, -27, 70, -114, 74, -184, -144, -191, 165, 180, 48, -41, 390, 398, 177, 111, 181, 103, 79, 43, 135, -381, -86, -179, -115, 89, -97, -198, -123, 20, -359, -127, -200, 79, 13, 246, 137, 288, 128, 140, 62, 142, -159, -177, -19, 8, -279, -108, -119, -124, -216, -55, -59, -360, -36]
2383c6P2Q6R0k04J02q6n0k7R8M2k76K68r0q6j63L63k31j78K86J98l93L87r9j54
2407h1j06L59j70M29k20p0rK20j25k24k50o0M13j39J1j9o7O0J18k02j06K77q7
2430d8J01R6M9M7k2k40l1J09j86J7j17K42K3r3j6l60L83K29m29J05J09M21l00
2453H9L21k92J9j17N0L00q8l63J22k81K89m10K59MJ38J46L6k77j13K38j62J67
2475G5k83K11K7n7M47n72J00k1Q6R9k65L51m9k40K67j80p1L70m59J77K79k25k01
2498a34P0K45n76M97k64M14l27n9J79p0j76J67l0j59L30N6j21j94K64j89L00j88
2520C5K0L2l5o5K27k07LR0m81L97k3l1j31j37J65K38l08j23L37k09N38oj74k05
2544e3J95n7p4k47K66O9j30J06j46j38k14J27R0J98m9R0J8K9m6rJ5p5M9p5J84
$$ y = [-36, 36, 122, 212, 8, 110, 24, -26, -53, 45, 87, -189, 79, -11, -97, -260, 103, -128, -306, -20, 178, -215, 172, 73, -81, -187, 172, 2, 431, 211, 141, 132, 352, 227, 3, -247, -307, 106, -33, -22, -41, -108, -48, 70, -132, -238, 39, -48, 53, 149, 198, 245, 223, -17, -48, 61, -125, -108, -225, 17, 40, -53, -69, -429, -46, 183, -246, -141, -32, 389, 89, 410, 118, 137, 20, 70, 370, 282, -81, 41, -240, 49, -361, -102, -98, 40, 186, 222, -55, -168, 70, -92, 75, -208, 3, 30, -27, 420, -152, -52, -73, 13, 112, -153, 198, 149, -91, 176, -4, -75, 295, -164, 13, 292, 67, -134, -64, 181, -395, 102, -162, 252, -75, -134, 45, -25, -201, -34, -64, -223, 107, 163, 42, -152, 112, -77, 223, 35, 55, 87, 52, -13, 214, 7, 10, 100, -381, 16, -7, -38, -169, -306, -141, 97, -211, -334, 3, -206, 332, 326, 152, -53, 142, 85, 11, -236, 30, 99, -31, 75, -71, -209, -423, -296, -206, -8, -57, 33, 51, 80, 34, 25, 40, -35, 14, -61, 123]
2569A23j42J46k61O7k38K31QL03k24j54N9K56j70r1L52k25n4J77J19Oj40j5L0
2592A63pm2J6j64j84k8L12k22J69k03j90N39k82L05k45J03m2p2M53k43p3l8N5
2615H0J49j69j05L4N00p13J03K04k08o9P5M43m21J03M9m4o9K78p3Q7k48J82l03
2638a35K42R3k19j7j86K83k92j40K73J9p7J94j59M12j73N6r0m1j13M2R0K18l70
2661i0J48k14J43J26k33J83k68K03K91l91j44N48n97K80k6L5q0Q4J20k36J00K7
2683IL0L19k28j27o2L22o29K04N2L99m40K21j03m4K70o4J18k4j5r6j20M79o29
2706a58J05j66J34q4J13M7j53k3M8K80r5l26K74R1n2o7K59l96J08M28m60J35K5
2729F7j55J18o5n5j12J17N8j97L94m21K95L66l90R8mm7L2n2K07j29j20O3j16K46
$$ y = [123, -19, 127, -134, -67, -305, -74, -66, 237, 13, -141, -82, 174, 4, -87, 265, 40, -14, 163, 282, 288, 148, 133, 163, 156, 114, 130, -34, -218, -246, 66, -156, 13, -190, -380, 159, -123, 182, -63, 40, -2, -74, 379, 136, 63, 25, 80, 229, 60, -45, -11, 489, -224, -121, 83, -125, -194, -119, 324, -97, 6, 55, 11, -58, 220, 147, 234, -14, 168, -135, 107, 200, -19, -36, -222, 61, -231, -371, -98, -79, -156, 38, -121, 291, 118, 174, 84, 43, -70, -28, 62, 280, -90, 58, -156, -13, 113, -120, 63, -205, -2, 289, -102, -246, 302, -295, -15, -41, -6, -86, -2, 118, -118, -18, 9, 39, 358, 130, 3, -59, 263, -366, -162, -110, 289, -151, 70, -33, -77, 193, 129, 247, 223, 208, 112, -8, 471, -158, -53, -219, -85, -169, -56, -9, -162, -185, -137, 143, 48, -278, -4, 87, 35, -32, 227, -169, -61, 367, -93, 42, 67, -88, 30, -35, -90, -202, -85, -27, -224, 170, -251, 44, 410, 20, 118, 114, 67, 99, 47, 254, 125, 5, 68, -48, 198]
2753A98k79j73K19k60J06J24j08K93j68l8J53rk14J10K88q3j02R6l8K8Qj58j80
2776a87K4J56K21m95M5K41j19K65j80j6J82p0L71j55M4k84K52l48Q1j00k63J06
2798b29L15k79k2K86k23J65L05n31J90K16k45J24j93N05k67K45m33K43l3k24L
2819h2p3P7L46l71N4M04k73j48n3k34M95j9n9K01P8L2k43k05Q7k18K00lQ6r0n0
2844f1J66M1R7l50O6L9m1j16N7R6N2J48j17R8j55M0k8j57J67j84K49k02J89k99
2868b05K88j84j32L03Mj25j43K75P2j62MJ07n4J3L5m8p3J98k52k58M98j17J24
2891A68j31k50l8R2K49M8p3j66J41M8%k27J99J03j28j45J14k91k1L42k86qM24
2914A64j66k19K14P9j30Q7P0p7j9R2Q7l61M02j11o6j07J53o8M5K45l21O1l52J21
$$ y = [198, -81, -254, -35, -295, -189, -65, -173, 120, -48, -86, 67, 58, -156, -46, 242, 159, 57, 153, 115, 143, 151, -7, -187, -163, -7, 214, -281, -236, 5, -114, 151, -29, -45, 137, 67, 438, 283, 327, 43, 295, -53, 28, -72, -335, -229, 86, -193, -215, 71, -152, 13, 318, -213, -23, 193, -52, 72, -121, 384, 117, 362, -71, 172, 139, -85, -82, -155, -78, 268, -103, -49, 355, 82, -66, -119, -353, 142, 123, 64, 265, 343, 375, 132, -73, 14, -204, -4, -7, 79, -11, -61, 105, 146, 243, -107, -41, -2, -43, -159, -102, -6, 46, 194, 77, 175, 20, 60, 32, -125, 42, -142, 107, -95, 94, -205, 83, -101, -233, 70, 74, -51, -194, 81, 153, -9, -5, 102, 48, 61, 96, 48, -25, 173, -79, -337, 161, 44, 168, 37, -213, -251, -159, 90, 138, 65, -101, 40, 88, 88, -139, 60, 163, 35, -110, 4, -287, -308, 34, -252, -260, 164, -2, -221, -7, 72, -58, 29, 99, 22, 3, 95, 182, -179, 223, 112, 46, -61, 92, 24, 69, 314, -7, 54, -298, -177]
2938a77J04q0k4J43J84q7K12k69J19j00qk42K87J59j12ol72LJ71J57l21L81k52
2961a30K98J9k48q8OL05Q5k19q6K71k83kK97l44N8n0Q5Q3O8J17m20K20j41J21
2985B2M0o6K9L77m69K54j81j02J60j05k77M54M7j75p2j48R7K15p8J65k00j79L44
3008A52k43J46J2Q1j15n1J34L00m44L11l56M4J0K39l17R8p1J41J77k05j03R9J51
3031A90l86K74k65J12K15k61K65j96N9k53K84j0m6j19QJ2K01j46JL47j88j36j01
3054a39N7k09L15Q3N1k56K49j91K32p7r1r3L52k14j3L2p0j1J43r1J35k02M9J11
3078A52m32L33n1K01M4l15J90j02l6k74J35Q0k46M99m46P0J00n3K8K80l53J13
3100h3K08j96J00l0L3n9q1j39J48J42n9k71J18K68j51j04K14J40k9k54j59K44
$$ y = [-177, -73, -153, -177, -34, 150, 63, 275, 6, 125, 25, 17, -225, 62, 221, 109, 103, -269, -266, -95, 62, -259, 122, -130, 168, 187, -61, -149, -143, 162, 247, 28, -58, 213, -70, -72, 225, -119, -61, -111, -26, 57, 125, 242, -178, 42, -99, 22, 62, -4, 25, 402, -67, 187, 6, -96, 64, -41, -318, 136, 183, 8, -64, -212, -115, 100, 22, 187, -13, -192, 152, -91, 55, 67, 148, 33, -18, 116, 416, -28, 283, -73, -29, -19, 220, -97, 1, -70, 71, 248, 43, -60, 39, 190, -196, 78, -187, -75, 140, -121, 144, -52, 7, -246, 38, 28, -18, -137, -129, -117, 84, -62, -61, 286, 98, -38, -139, -82, -291, 24, 107, 158, -98, 151, -40, 192, 115, 24, -69, 283, 69, 56, 88, 18, 7, 150, 59, 194, -8, 41, 152, -280, 53, 2, 203, 247, -68, 122, 20, -16, -290, -155, -75, -321, 178, -268, -198, -98, -151, -123, 157, -196, -83, 125, -71, 29, -1, 32, -27, -108, -247, -99, 43, -16, -287, -169, 99, -52, -156, 58, 198, 169, -85, -244, 0]
3122@J40k59K98J09k19o5J56l45n7L36j28J2k24j42J98M05l05jj98j73L41J94
3144G3K2R3k32k64K37M11k96J67l09J09nP0J19k67K25k20K21q6P8k43J54j03K23
3167A77j83J48k79k1J71L4L4j74k2J11J7M5j06K02k55k9k00M63j90K96m73Q6J97
3190D9l25K96K35j85N2k06j23J54M1Q6j97K45l05m9K42n9Q9J25k18J14K58k5l72
3213g8j73L14J83l24j32N1K65J07K20k58l09Q6qj77J81r6K7L12l87J30M72m43
3235c7q5K82j4j78M2mk4J15j25k72J6K08P7j91O4L14m51M19j93k22J45K4J38j65
3259a17j05J93J19m9P1j15K06j12j83K07o4k11J64l7kK53j72n1jJ38k19l4q2J02
3283a01K11p1k26P6K9mJ76k43K46k66K86m39J31K63j23J97l57K95P0m6n7J71k36
$$ y = [0, 140, -119, 179, 288, 69, 4, 160, -185, -242, 94, -34, -22, -246, -388, -190, 215, -90, -91, -289, -462, -121, 73, 95, 188, -44, -308, -71, 340, 44, 211, -98, 11, 6, 76, 195, -72, 153, -67, 154, 68, 146, -97, 57, -46, 177, -6, 142, -137, -158, 13, 47, 81, -93, -115, -4, 13, 58, -48, 154, -101, -130, -330, 133, -57, 239, -234, -148, 49, -276, 20, 255, 70, 122, -84, -207, -53, -12, 74, -123, 122, -183, -232, 10, -49, 40, 165, -53, 61, 319, 294, -78, -251, 63, 246, -78, -210, -159, 106, 213, 433, 175, -134, -48, -56, -233, -52, -148, -121, 191, -196, -66, 406, -37, -122, 160, 146, -32, 10, 6, -18, 97, -28, -300, -284, -76, 1, -190, -126, 188, -263, 156, -37, -259, -114, -90, 48, -117, -222, -29, 90, 41, 112, -3, 203, 91, -92, 115, 51, -160, 4, -33, -35, 218, 46, -5, -6, 132, -87, -121, -203, -101, 110, 39, -187, -111, -82, -86, 90, -153, 93, -173, 113, -326, -195, 68, -55, 142, -215, 80, 150, 104, 47, 218, -18]
3306a8N2M7K75m18J96m69M86j61rj63K02J6J06l49K29RJ79j10P8l52J29K28pJ40
3330C16k72k5o6m4r6mL49l08n0J24N2K05o3k8k32J83j02K85k27j95K61L4l11Q0
3354a34R8K04j99k95L34K74k78J03k07L69k75m5M08l32J17k83K56J58j67p0j27
3375i1j4Q8N9j93j66M11k41J25M3J8J20l41m5R8O1J53K60m48K70L5j26J52k63
3398c5L32l35K53j34j2m5k07K90j66j82J24K77k64O1J14l89R5K0M65j59j03L5
3420C5J8p7n7K46J34m16r8m7L81m3m4J92o02L43P9K6j17J73m07J59k19K36J55
3443E0l36P8K23j61J35j56j12K73n2K32k39j04O5J24J44k72K98l74J86J38k58
3464a18J24L04k80k7K42j94r9j27P5K64j9l33Q7R5R5J07j71j03K03J00l59K04
$$ y = [-18, 34, 81, 356, -62, 134, -335, 151, -10, -19, -182, 20, 36, 142, -207, 22, 31, 210, 100, 178, -174, -45, 183, 176, 316, 44, 19, -47, -91, -187, -191, 158, -150, -200, -76, -24, 181, 118, 90, -142, 41, -61, 224, -3, -198, 63, 97, -214, -134, -36, 168, -31, -326, 8, 282, 4, 107, -100, 269, -6, -51, 357, 25, 142, -141, 115, 273, 106, 36, -91, -105, -17, 42, -151, -317, 94, -147, -22, 21, 39, 159, -182, -227, -129, -68, 85, 345, -103, 167, 202, 76, 228, -35, 297, -38, 215, 81, 69, 24, -183, 107, -59, -241, -117, 160, -104, -43, 71, -318, -223, -203, 262, 103, 0, 35, 53, -24, -81, 165, 299, -117, -215, -262, 119, 76, 32, 224, -378, -35, 44, 70, -47, 126, -281, -122, -341, -105, 50, -286, -208, 15, -146, -11, -167, -279, -6, -58, 174, -65, -169, -104, 20, 164, -108, 190, -184, 2, 140, -118, 6, 310, 30, 3, 245, 51, -48, -175, -100, 164, 145, -188, -101, -6, 89, 196, 25, -78, 125, 225, -134, 70]
3486G0p0K30m41K3j38M08j9r1R7k54M10j80K5j72J97k62J46m8K04j37P9n9R4k25
3510a13K9J43J13p8j76J8l7K61k07K55j28l52K11J54j30jk99J98J65JJ1Q2j82
3533f2K91k37J06l16K13m3R1k20J69PpL5m3N2L65l62q7M8R3L7k56%nJ05o8qJ6
3560h6j16J95j69L93m97M49j93n1m4K47k28K38J27k59P7j11K5J49j3k08M3J99
3582A67j38K3l0K31l39J21j8J14Q3l39n5K76M6K1k35m1Q6P0L9k1k02L89m94N5
3606a91K97j13j45J66N8K12J04m57J65J8q2j60J03k03R5P9K2r0K32j79r3J96r
3629B5l40M41j16K16k97N6JP9L8m8O2j52K82m73K44K58k88pJ42j22q2K78k8l00
3653a31k99L58j43K74r2qR6j74J74j18K55j16nP6j0l7k88K44Rj60L27l28L60k52
$$ y = [70, 0, 230, -211, -188, -326, 82, 63, -28, 69, -185, 225, 45, 70, -102, 95, -167, -21, -69, 135, -2, 77, 18, 112, -113, -84, 59, 172, 94, -82, -64, -101, 160, -47, 208, 80, -272, -61, 93, -37, -38, -337, -139, 26, 27, 38, 120, -62, 229, -8, 98, -218, -5, -48, 43, -177, -8, -1, -8, 27, -16, 36, 401, 39, -48, 0, 93, 130, -126, -126, -131, -26, -94, -102, -86, -202, -7, -176, 217, -280, 169, -24, -75, -119, 128, -100, 138, 265, 6, 83, -28, -3, 146, 133, -75, -32, 167, 29, 52, 22, 253, -86, 35, 17, 131, 214, -125, -180, 96, 142, 163, -72, -113, -27, 43, 82, 61, -141, 248, -246, -191, 106, -7, -152, 14, 72, 284, 388, -69, 96, 114, 32, -128, -25, -228, -133, -54, -32, -122, 110, -69, -162, 34, 25, -315, 126, 10, 226, -71, -15, -14, 65, 103, 55, 117, -35, 247, -226, 18, 276, -12, -19, 123, 1, -81, 197, 169, -131, -430, -72, -215, 59, -33, -41, 55, -119, 55, -63, 192, 76, 71, 147, 137, 100, -188, 56, 65, -95, 232, -96, 264, 12]
3677A2K09k76j44N5K04k01J34j06m0k23L73n6j96J79J05L3k2J57m41K60k06ML92
3700B06J26m22J10N8R1K3k20K0Pj5N0p5k33J16J59j16K05n7o9P6j65L48l0j10
3724H3J08j67j80q1J19k40M06P7o0j40Q0k29M82m36M7J80J31k72J39K1J15j4j67
3747Bn9K4J77lL0k79M85k28r5R3j16O3qj55J19p5j32P0K12P8k20j72m9K00M66
3772D28l69k9o8K36k51J34k07J06L75m46R0k5l9Q7L1j39M8J04j18r6R6J83k49
3795a18J97K1j34J07p2P3j56Q8p9R0j07M14m39l5n1K26m3M5K3l22O74k3o93K85
3819b9j27L31k14L82k16J34k01j29P8K83k59k73M77k55p5L51j77J50m49K37o7
3840d8j30N4N8L85j22n4r7L0qJ9k28J48Q7o0k3N9l21J62K01k05J40K42k34l39
$$ y = [12, 221, -55, -199, -144, 60, -141, -7, -113, -153, -376, -3, -59, -255, -76, 29, 62, 40, 197, -244, 16, -190, -186, 206, 332, -90, 20, 78, 169, 192, -28, -8, -1, -16, 34, -41, -274, -158, 1, -115, 90, 33, -36, 40, -125, 223, 193, 83, 191, 24, -156, -237, -118, -358, 48, 125, 65, -75, 5, -224, 258, -178, -131, 49, 180, -92, 47, 68, 183, 169, 2, -57, -33, 144, 141, 171, -108, 377, 149, 54, 147, 31, 94, 86, -69, 50, -25, -157, -87, 125, 203, -17, -189, -238, -38, 428, 59, 30, -38, 198, -53, 81, -126, -20, 355, -91, -1, -26, -65, 22, 53, -86, -38, 66, -52, -148, -52, 131, -118, 79, 100, -34, 73, 1, 74, -82, 6, -73, 17, -90, 324, -115, -150, -201, 25, -18, 27, 50, -272, 402, 379, -314, -29, -156, 175, -39, 343, 127, 261, 60, -69, 9, 292, 33, -240, 237, -18, -93, 258, 81, 231, -218, 19, -48, -178, -124, -66, 319, 197, 143, 46, 76, 68, 87, -141, 7, 94, 34, 11, 70, -251, -89, 112, -93, 47, 289, 55, -284]
3864b84K98J32l48K71J61l82J41N9qj99O7J77j11l2J75L5N9j32J06j55l5J20J01
3887B16m0k19J63j66k50J75J70R6j77J97l44Q4j20J35P0L8j13j4j7J14j3m00J01
3910c14N02j78j70R0j03qj83J13N78l49j00K30p5j3K15m03Q2K69l72P7P1j71L99
3933A87k56J94l41K46k31K24q0J01j2r3K23k91J08R7k8P3j09J65j23J11k36j2
3955h3j2J11j56r0K61k86J14K2K34k87L07j64lR6L7q1j63J26r6j2K68n7l54K59
3979ij92J09P9p6l7J7j5K69j33k4N0M4k19J41l0j43L59j15j34M7r2n3J46j8K56
4004B27j45j53K29OJ4n1m08K30k19K15l28L33J75j82J54M1j40m0P5Q8m86m5O57
4027B47j10j42j89J75j35L8j0L04n29K12K08k5k09L67l25o7L0R1k6J35r7L8R3
$$ y = [-284, 14, 146, -202, 69, 230, -152, -11, 48, 40, -159, -92, 85, -26, -58, 117, 152, 211, 79, 185, 30, -5, 115, 216, 176, -43, 120, -46, -296, -121, 49, 145, -32, 165, -179, -95, -215, -80, -10, 28, -85, -99, -116, -2, -15, -415, -314, 188, 10, -160, -70, -173, -181, -364, -251, 327, -22, -122, 108, 33, 20, 235, -168, -86, 183, -189, -112, -41, -212, 187, -69, 125, -216, 30, -201, 23, -57, 44, 32, -61, 162, -129, -21, 76, 48, 121, 12, 177, 54, 165, -71, -83, -95, 16, -140, -230, 31, -255, -141, -119, 115, -172, 135, -29, -32, 64, 101, 20, -143, -17, -113, -125, 143, 86, -268, -9, -201, -92, -13, -89, -126, -109, -124, 145, 12, -12, 38, 82, -137, 4, -26, -169, 190, 75, -59, -12, -104, -157, -11, -29, 227, 82, -71, 158, 164, 178, 127, -281, -51, -270, -55, -383, -50, 125, -57, 97, 138, -2, -42, 33, 121, -365, -410, 247, 137, -5, -194, -19, -154, -116, -126, 178, -351, -139, 69, 44, -165, 202, -123, -190, -160, -69, -95, 40, -57, -19, 74]
4050G4j34q5N4Q0j51J13J3%J24l5K65k74r6K77k73M70m77J21J30l0m22R6K20k9
4074C1j7K1J07r1O9j99J68jK20m81K60j2J30l65J31J09jj76O3KM0P1j92j06L55
4099A36O5n12N46k54L54m43J16J49l4n8qM3j18l35M77j61N2n1j1l8r9N40k03P1
4123B24o5j90k62K75K24j88N5j63L50j2K04k66k18k6M4J51j47j69K25O2l83K77
4145Bj32J63P5l95L10R9j0pLj72J37j47n9P8qJj26m3J24O9M9K06l86M3J84Q1J12
4172B51o5l02K64j21j82q9K69j71N4J4K78k48J73m4k5J59k86L55l87Q5L73m07
4194e2J24m0p5L26l71K5P8J41l07j75J9M56j7j58J58k77K00r4M8j57K46j68K17
4217A47Jk3R1j65J88l02r0R8KO1J4k55J70J64R8m38L01K8R8k33qP8O6k12K26L1
$$ y = [74, -60, -145, -91, -11, -162, -49, -36, -36, 88, 53, 318, 44, -52, 225, -48, 422, -55, 66, 196, 166, -256, -160, 60, 31, 14, 35, 142, 51, 120, -79, 89, 88, 308, -173, 87, 75, 205, -160, -29, 80, 79, -97, -34, -32, 8, 79, -113, -219, 136, 201, -311, 235, -19, 335, -108, 8, 157, 123, 65, 57, 100, -18, -353, 124, -37, 15, -36, -47, -85, -184, 356, 153, 224, 159, -31, -293, -18, 206, 18, 73, -90, 260, 248, 452, 186, -32, -58, -14, 137, -10, -179, 46, 108, -275, 2, -130, 33, 108, -287, 23, 122, 112, 105, 108, -64, 73, -74, -133, -55, -63, -62, -188, -231, -107, -38, 11, 217, -169, -126, 58, 139, 251, 186, -116, 148, 27, -155, -244, 25, -146, -92, -78, 200, -48, 125, 81, 56, 215, -71, 284, -103, -18, 355, -52, 72, 32, -43, 283, -88, -63, 15, 156, -151, -326, -307, 149, 132, -26, 132, -145, 55, -39, 9, -148, 98, -70, 147, 148, 125, 216, 51, 239, -63, -153, -55, -53, 8, 22, -233, -63, 101, 199, -239, 62, 90, 188, -45, -53, 25, 91, -121, 105, 136]
4243A36km6j09P3LK83o76J37P9K68j74L05j74k7r2L18k88M1K69k08k10J40J75
4266B21l00j83K17j92J80J71j43L66j44j77J37l01j12K08Q3j70kN0K43P2j59q4
4288a9J91k48r9L89rl16M1j57P1J75o5K8lJ09J09l20K25q1q6k45M56l28L17L8
4312A73k09l5J85l26J98j42K32r4J91r2j02K9j32J82j63K8J27r0J03J07J9j99
4334a0J18r5l26L83l4L9j86J18J49k83J82Q4k1j64M3n6N8j32K45K1j31m22M25
4357EJ13n9P0j68K30j13L0j03J3r2J41M4j58m3K78q4m9r3m1J77Lj49J12n5J70
4382A79m5l34M1J74mK08j56k84K27K16l22J95o2K57l93J28n2K39j53j52p8q2M19
4405A66l79K66k6l20K71N9rq2M5J94j02L0m5o4j95N5n4P3K81k99J99m1l37K98
$$ y = [136, 134, 88, -21, 52, 55, 338, -338, -201, -122, 146, -28, 277, 103, 76, -16, 302, 14, 55, 324, 116, -94, 46, 221, -79, -262, -45, -237, -57, 114, -29, 337, 193, 16, 153, -148, -260, -52, 31, -139, -141, -91, 152, 224, 65, -19, 172, -76, -175, 214, 205, -111, -70, -227, -156, 19, -46, -18, -21, 88, 197, -123, 102, 21, -65, -310, 146, -182, 135, 173, -36, -71, 114, -212, -14, -156, 76, -18, 173, 81, -21, 8, -124, 58, -105, -77, 50, -40, 63, 170, 189, -10, 108, 13, -313, 70, 36, 75, -111, 7, 156, -127, 55, 139, 118, -46, -3, -59, -1, -133, 112, 133, 2, -420, 5, 118, 59, 129, -39, 191, 78, 108, 5, 18, -74, 67, 111, -47, -90, 188, 104, 55, -38, -79, 98, 101, -48, 64, 9, 179, 134, -200, -159, 15, 11, 219, 63, -221, 6, 222, -100, 95, 33, 290, -103, 25, -27, 212, 59, -93, -171, -253, 166, -213, 53, 27, -293, -22, 37, 28, -54, -9, 185, 83, 113, 68, 4, -191, -136, -190, -117, 164, -135, 64, 23, -314, -16]
4429a6j22J39P9j79K94k08J80J33m04R7l53N79m78L69l31Q1k85P31n50L38k27
4450a33K13j49l09M56J3o2J6K2j7p8l98N43j00J45n8j21j80J45o0K01k57K16n
4473D3r3J26J08l60M03k43k36K48l9o4K7QK25M8j85J27l36K31j32K47j14j31L2
4496f0k4L2n4n1J84l6K5m7r8R8JO0LO6k64J29K0K45n00J86J69n7N9k7M9L9J52
4523B99l75K1K33k91J45n1K31k97k05K37J05M4k24m8J51l9lj32K65qq7j52K68
4546H7k00L17k1k95K03j55M01l05k8j32J21K2R5l67J56K06k52Q9OJ14j75K88m4
4569A31k6j86l1j3J41p3n1J69l96O45k73K74j61m8m3j72K9L81l75P2j69J43P7
4592D5l5j86K77j70p0J23J34j47K76j66n4n3R8k44J29K33l49L47j26p9P7j9j21
$$ y = [-16, -138, 1, 80, -99, 195, -13, 167, 300, -104, -7, -360, 219, -259, 110, -221, -140, -425, 306, -244, 94, -133, 80, -69, -378, 78, 91, 29, 45, 67, 50, -28, -426, 117, 17, 162, 104, -17, -197, -52, -112, 89, -168, 48, 43, -50, 76, 184, -176, 227, -16, -252, -4, -43, -107, -80, -72, 153, 201, 16, 143, -193, 38, -94, 153, 39, -92, -60, -84, -52, -106, -157, 27, -9, 16, -31, -129, -31, -30, 30, 33, 99, -165, -36, -16, 229, -271, -85, 84, 27, 86, 59, 108, 147, 299, -76, -55, 178, -113, 32, -19, 212, -85, -290, -53, 52, 96, -128, -176, -25, -64, -67, -199, 66, 58, -29, -181, 87, -113, 204, 183, -112, 91, -64, 337, 32, 4, -128, -7, 15, 110, -257, -101, 105, -147, -58, -52, 62, -113, 175, 131, 105, -81, -112, -125, 16, -57, -108, 61, -335, 310, 37, 311, 150, 102, 59, -113, -84, 297, -78, -6, -175, -32, 45, 10, -176, 101, -69, -139, -16, 118, -29, 247, 81, 27, -26, 72, -172, -43, 190, -159, 188, 62, -17, 60, 41, -80]
4615h0J66j16J06q2K2K65q1l27J7L5K73r7L2l23L86q6R7k33J31m4P7q3k54jL92
4640A92l04J92J47j79k27Q3K47j18P8J2k01O7M2j26r8R1J92k46j6J80N1m7J57
4663A69k02j67k5N8K95J3k2l09O4K15k03m7R1r7K07J30m4j46j10Q0N4j42J83J64
4687B09j88j32M6o4J3J39J2m2L97n03J08M6k98L68j10J35j64O6M0j92K10o2K55
4710B89l61K7P3k5L84l41j72l0Q4k03J54N2J20k85K42L58j56j54j9J61k13J65
4732A50M2l93K32J06P1l27N0nK15k45k30L09K03j70J68j64K0j34P3m4J67M5Lk13
4756g1L2k15j03L76L0m3nj58J43%J41L3k17J19L6j15J44k29L24k42M03j50k67
4779c4J51n8J09j66k67K01J02L0J45j72m4j78j47M25j54k7K52m00L11J3k09K01
$$ y = [-80, 86, -30, 76, -6, 16, 281, 200, -127, -110, -75, 198, 101, 133, -190, 196, 110, 207, -26, 105, 61, 138, 55, -199, -200, 192, -112, 80, 227, 48, -179, -96, 151, 33, 111, 123, -78, -11, 31, -95, -193, -102, 90, -156, -172, 8, 59, 12, 169, -33, -200, -225, -167, 128, 141, 119, -190, -126, 89, -114, -161, -70, -167, 40, 170, 126, -20, -130, -50, 4, -138, 45, 209, 21, -111, -65, -129, -116, 23, 35, -7, 390, -113, -5, 41, -257, 111, 1, 136, -28, 38, 78, -114, 96, 34, 289, -72, -45, 28, 3, 387, 46, -126, -156, -72, -275, -121, -69, 51, -234, 8, 366, 210, 56, 37, 198, -15, 150, 192, -201, 31, 137, 208, -119, -69, -74, 141, -104, -334, -25, 178, 8, 176, 12, 32, -102, -29, -73, 94, 139, 142, -71, -39, -254, -357, 19, 49, 6, 1, -157, -14, -14, 127, 160, -57, 62, 98, -17, 127, -102, 222, -20, 383, 233, -34, 117, 59, 168, 2, -265, -64, 38, 68, 213, 41, -3, -181, -328, 97, -57, -84, 168, -232, 79, 92, -117, 84]
4801H4p3K58k45l03J59L24k49J46j95J40J52P7j94P1Rl96K21J48j51k26K4J29
4823i0J19J45k29j73L12n5n3K53j23L2l06J03J06O1k30L90l68J88k42o1M46j98
4845B7N1k51J35J68k69m6J42K18l50K1J98j98R1L17j75o0k55K68r4j66K23j4k49
4868b68K18J72P0m9j03l7KP2j00L82l26k85N37l59J73L5k23r1J33k18J74K90j80
4891A9n2k76L95l09K84J12k55O0k2Q6O3J52j92j6r0p6K90j85rJ04j83l9J33P7
4915G1q2Q9k32l37L51QM5j48M45n6j50J10k8Pk3p8n9j2J92N4j13j3k74K83p3n4
4941g7J10J81k39J42j83l0M0N3J90m03L26j47K79j09k72K23P7K0k28J89k47P5
4963c0J80k49M02m17L1l7K25K5P8j07j52K2L6K23j77j13K47k34l5P4k94J8L69
$$ y = [84, 11, 269, 24, -279, -120, 204, -45, 101, -94, 46, 198, 275, 81, 152, 161, -235, -14, 134, -17, -243, -219, -90, 29, 174, -55, -228, 84, 29, -24, 229, 106, 138, -168, -65, 41, 102, -128, 262, -106, 82, -160, -221, 225, 27, 78, -173, -38, 130, -139, -185, -43, 175, -175, -154, 44, -154, -63, 254, 79, 19, -236, 32, -62, -228, -5, -19, -268, -50, 122, 192, 143, 40, 3, 5, 77, -23, 359, 33, -252, 285, -74, 99, 134, -89, -180, -47, -265, -91, 199, 19, -33, -309, 86, -223, 61, 173, -82, -22, -44, 42, 105, 257, 65, 49, -41, -117, 173, -12, -21, 83, -100, -139, -6, 71, -11, 78, -154, -491, -140, -132, -87, -235, 210, 154, 4, 114, 86, 93, 70, -8, -67, -79, 113, 167, 54, 41, -233, 50, -23, -77, 33, 214, -25, 117, -66, -96, -56, -3, 187, -216, 110, -37, 242, 133, -139, 84, 161, 181, -47, 142, -105, -30, 150, -99, 303, -114, -83, -120, 105, 130, 208, 101, -51, -29, 7, 230, 53, -60, 187, -47, -82, -8, -302, -284, 85]
4986H5q7qr8O8N8P4P3l32L76kj79Q6j7J88k64k47J43j29Q1j09J69q4L3R6RK6j18
5013a09Q9K85k33l8Q3o0K08q3j42m2j29n6J54j5P1k38J69L7L4o6O5Lk29K82j09
5038f9K22n4k36Q0L86k12j17O2j92M97l11P0j81K35rK9o6j84P6j82L0P9Q1R6q0
5063E0M2j94r3M05L0l79M58k15j87J4m7r0L53j42j9j06rK86k03k33O47m07M1j2
5087a0J57k71K25J36l16J84j29j89K58k15K31k0k6R9k84r6K06K66k26L33m16R9
5109dJ08q5j99K07k93L36J01l5j17J19k87j51N55l04L2j28J38j36J74mj34R6K9
5132A8n4K27o7Nk31K80j43R1k96J36k8k37R6Q5j11J42k00N16o4k15J86l72J92
5155d4J52K73k79k75K82p3M9m8L3j30K22k57n7J43jM6o8K32l2n8mj62J50j30P4
$$ y = [85, -2, -10, -108, -40, 18, 92, 165, -167, 209, 207, 28, 114, 97, 285, 21, -226, -83, -212, -131, -240, -71, -155, -122, -26, -17, 9, -109, -20, 265, 32, -6, 77, 17, 225, 142, 0, -42, -171, -227, -73, -88, -17, -255, -86, -49, -15, -81, -16, -13, -242, 40, -69, 153, 99, -137, -57, 329, 117, 0, 62, -130, 367, 56, 126, -55, 180, 171, 200, 134, -50, 26, -156, -126, -47, 34, 130, 50, 92, -102, -195, 210, 240, -139, 319, 104, -83, -69, -116, -206, 147, 5, -14, -120, -129, 157, -46, -279, 368, -39, 2, -10, 147, -124, 101, 237, -79, 105, -24, -213, 45, -170, 61, 41, 15, 114, -170, -266, -60, 206, -20, 313, -103, -4, 104, 19, -180, 27, -266, 70, 171, 136, 19, 138, -149, -300, 255, -49, -17, -145, -7, -143, 31, 27, -107, -11, 18, -36, 191, 124, 129, -102, 178, 35, 126, -170, -34, -62, -299, -203, -118, -229, -87, -287, 229, 165, -50, 136, -236, -44, 108, 381, 102, -173, 109, 36, 85, 37, 70, -60, 162, -95, -152, -9, -10, 36, -32, 200, 168, 110, 106, -56, 94, -36, 38]
5180C8O3K4k71o7L31k34n8J19Q6j35J56j85J35K07m75K54J64m3l43K73j15j13
5202a89K74j43pkN7l8J71j23O7j56J91Q9j74RM18n10J12p5K2R9k34Q5j97J48J91
5227H5k62K69k99K8l6L3K09k99k2L32l79L63J06m46L45n0o0J03o4N8K20l50J32
5250A6p0J23k72K22R6r9L17P4n17J83k21K26k18L4J08k06M04q8j06K55m2m29N96
5273C86n21J37J6R0O8k53P6j35%J10R2l03K21K8p8r2O12k95j49N9J70k31k73L08
5297D3j91J97j79rL66m68n1J27J63M5m9j2J57j26J09q6k6R0m33K75K48l63L15
5320A42k29L3j2l13J65J9K27m0K1k9Q6k17J61J22p8J60l28L10k60k04J35K04k79
5343b04M7J49O2n5J71j5j93j57L11K73m48R6l41M30k41O2L13pk93MK5J10k65K94
$$ y = [38, 101, 125, -146, -213, 118, -116, -174, -55, 31, -104, 52, -133, 2, 209, -266, -12, 152, 109, -234, 39, -76, -189, 85, -58, -65, -67, -10, -48, 123, 0, 67, -89, 102, 191, 17, 26, 444, -66, 46, -29, -7, 92, -142, -57, -254, -106, 85, -177, 92, -207, -179, -215, -182, 27, -272, -294, 38, -341, 22, 128, -318, 27, -23, -83, 20, -44, 14, 234, -116, 16, -54, 69, -203, 19, 115, 16, 333, 407, -110, 73, -148, 78, -140, -106, 2, -204, 200, 112, 6, 261, 219, -210, 386, -135, 2, 18, 108, 176, -77, -1, -136, -136, -26, 66, -237, -16, 12, -66, -158, 454, 159, 10, 69, 239, 8, -265, 43, -148, 49, -130, -139, 227, -241, -292, -165, -2, 43, -6, -18, 139, 13, 122, 36, 10, 100, -333, -58, 190, -173, 142, -87, -54, -66, -379, -214, -195, 32, -8, 13, -16, 70, -147, 14, 136, 58, 218, -110, 200, -60, -264, -129, 75, -204, -157, -8, 54, -1, 170, 155, -38, -195, 116, 389, -59, 37, -304, 126, -115, -53, 260, 253, -40, -36, -11, 99, -166, 128]
5367A28nj58m5J09k91J95J3Q0m1r4J17l7j3J7J68l07J11L6k52l7L30NK5Q8l79
5392b37M30j86o0J48L2rj50M26k38k29o1O0L24j3k41j83K15j15pm8k4L8J17L54
5416C43l74j09K13j85K23J45k42O5k97JK87K08k56p7m7P6j45J57O2k24M1P6j63
5439b22L37r6n6J78k2qJ01n24N09j33J38l65K07K6n40O96l90l0L8P2K44j46k32
5462b18J06J47j36q8J01j1K15l53K61l59M17K32j9l62kM33k92m6k6j56J99J4K0
5485G7ml60L37Qj32M34j92L6k14j30m3Q0M9jo9K31J01l25k05L07J89k87RL02j78
5510B0j36k13N67M3j98qj65K29p0P5Mj47j17L60k06J2k83K99k10M2l02K31o6J59
5534h0N8O4q4mJ74l51K56j04O0j02P2L3o1J3J95l76m0L7L47j37J3m5K21r0N6k57
$$ y = [128, 123, -35, -80, 29, -262, -67, -54, 26, -15, -109, 8, -29, -42, -25, 143, -164, -53, -17, -269, -306, 24, 29, 54, 142, -237, 193, 7, -53, 95, 127, 118, -32, 394, 156, -73, -134, -74, 250, 237, -4, -187, 28, -87, -94, -142, -166, -128, -11, 343, -31, -140, 73, -112, 111, 256, 14, 79, -218, -217, 70, 278, 22, -55, -102, -26, -171, -14, 48, -176, -135, -59, -222, 115, 19, -37, 141, 119, 111, 212, -312, 197, 64, 202, -163, 44, 70, -470, 226, -164, -194, -156, -84, 160, 14, -218, -112, 35, -101, -189, -88, -99, 116, -237, 24, -335, 82, 314, 295, -67, -69, 364, 72, 26, 0, -156, 43, 57, 77, 73, -287, 50, 58, -74, 360, 168, 204, -10, -140, -183, -103, -54, -55, -124, 107, 208, -117, -322, -15, 174, -113, -104, 198, 20, -116, -329, 238, 281, 83, 75, -90, 139, 69, 144, 148, 1, -116, 244, 38, 50, -233, 66, -144, -102, -404, -173, -239, -80, -22, 42, -42, -46, 128, -223, 33, -71, -11, -113, -41, -8, -69, -56, 139, -237, -277, -240, 107, -30, -17, -62, 159, 69, 125, -132]
5560a32j9K34r3lM2J6n00N38j45j16J99k02K4J06J06m65J12N59j05j94Mk91M35
5583A10k29J33J36l85J82N0j23M23m21N3L55n13J52PL53k50Q8r1j82J58P9j36
5605e1K48l8p0N7k14L11m15r2K36J11j89L6M0m2j5K44j97k41K58qm1L66j46l09
5629a61J68O2k30K23J41j95n1m1o4O13l88j91L13j21n6mj87J18o1J82l6J02Q4
5652B20m48L76m2K7j83j82K43j55L45l38L36K1k79J27l06K26J41%j96k7R8J80
5674A84k80L73l66L3K6o4j40K26P6p6K4k22L01Mk20J72Q7J06j35j68k18L00q1
5697e8j55N4O1K4P0j36J58k40L66j5n4L0l65M26k45K79L1k70j35L96m68M14kM1
5721B07j28J22k7k38j51NJ55K01k45J89j55L2J0jR4j05j70L94k87K97l97J01J03
$$ y = [-132, -151, 83, -10, -13, 29, 45, -455, 83, -62, -178, 21, -181, -157, -51, 55, -410, -298, 261, 156, -38, -34, -325, 110, -119, 14, 150, -235, -53, -3, -126, 297, -124, -71, 284, -229, -77, -70, 283, 33, 121, 30, -152, 6, 85, -51, 197, 159, 89, 146, -68, 243, -172, -264, -28, 83, -106, -70, -30, -72, -87, 157, -40, -281, -23, -31, -72, 294, 148, -161, 7, 69, -161, 62, 203, 8, -43, -84, -148, 465, 77, -114, 199, 78, 22, 18, -169, -51, -112, 70, 34, 136, 220, -228, 148, 106, 133, -50, -232, 11, -144, 201, -137, 199, 220, -59, 68, -238, -12, 129, 129, -67, -94, 4, 184, -96, 277, -89, -56, -30, -94, -234, -8, 68, -8, 16, -206, 95, 99, -121, 51, 138, 244, 109, -59, -277, 23, -58, -213, -159, -98, -74, -4, -140, 18, -222, 144, 129, 75, 105, -260, 166, -79, 200, 231, -39, -174, 222, -246, 168, 166, 207, 79, 201, 174, -64, -215, -210, -55, 146, -99, 90, -65, -33, -23, -24, 70, -35, -205, 189, -98, 199, -198, -97, 6]
5744FM9j8r8R3j23R1J24j41k27L64J25k94K26j38j81M26k95J11p9J35j67K50m22
5767a83Q4K48j43j34L1L15k31n6J5J80j08j92J14J37j72J03k02J49O9k54N00o17
5789c47L08J71J60J6k69k79K88kj28M1O1j58P3k43L06K7m7j84K72k86M18l52k0
5812a74J62m6K99l21Q9j05P8l07L35n2K16k27Q8j58n7Q9m3q1L04N6j31q3J25O1
5836A17K6l23J67p8K21K04j69m17J51P2P2k55K95j40p7%K05k74J53M67j57L3l92
5859i9n0K74kK91p61L63l17K33J66m03K14L8K35j11p9pJ12j33l97L07J44K52j60
5882A10O5l35J09l0J31k46J39J68j63k2l6J60r9K05k64K83m08J17J54j21R8k30
5904b15K24q5M6J91k47P2K13k22J4J36k46Q1K78k67mj00J62j76K9R9m0J15R9k50
$$ y = [6, 55, 37, -61, 32, -91, 0, 124, -17, -244, 120, 245, -49, 177, 39, -142, 284, -11, 100, 21, 156, -11, 239, -183, -99, 149, 6, -128, -97, 218, -13, -69, -54, 126, 18, -174, -60, 77, -95, 8, -194, -45, 24, -230, 270, -347, -39, 132, 292, 308, 39, -240, 48, 46, -82, -41, 20, -138, -65, -308, -2, 25, -22, -206, 66, -220, 198, -154, -174, -12, -58, 241, -80, 9, -96, -18, -325, 10, -42, 174, -53, 35, -123, -180, -91, -134, -215, 89, 145, 14, -69, 56, 117, 143, -180, -13, -91, 130, 334, 165, -252, -101, -29, 43, -212, 83, -57, -134, -134, 71, -203, -50, 417, 260, 293, -99, -149, 125, 123, 414, -347, 16, -301, -68, 98, -305, -91, -53, 182, 71, -8, -15, 97, -36, -433, -126, 18, 270, 110, 175, -160, -51, -81, 50, -196, -57, 111, -52, -74, -110, 50, -49, 156, -108, 175, -233, -116, 38, -83, 15, -215, 9, -76, -30, 161, -86, -14, 199, -23, -9, 127, -119, -38, 240, -27, -31, -131, 31, -145, -116, -17, -57, 58, 157, -93]
5928i3k67M71j87j9Nj63L44o8K09m78K32J88k97O9K54m75K05K4j62K0J64P8L9
5951I3R1k39Q4j62j39R1L78m69K68K75pm75K86o9K38m82L45n1k95K75M3k6j46
5974i3J29k82J93P5K0K12l87lPJ64J74m09k9K87p8K5n1K76k49oj07K43R9o8J57
5999B99k32l20J67j99K24J37J04j65J46o1o2L20m49K4K63k37L1l46N56r8n5M1
6021H8j58K52j74J43j26k30M14j09k90L05k80k7J03P5J63k03L4J91j83J64j46
6042Fkj90J60p2K51j77l3K67k91j5J02k4J55j16J20o0J97j39N4O1j21j09k69Q4
6066a61J92j40J93k67K17Q5r9l8n1R7J62j4k07L6j78L31k08R1k8J60l3o4q4j24
6090a32k9K89k87j18L89j37j28r9J68J67L4o7LKl7L1j51K16j93rN8o0J43n2m0
$$ y = [-93, -360, 111, -76, -95, -90, -253, 91, 23, 232, -246, -14, 174, -123, -54, 200, -275, -70, -46, -208, -188, -24, 54, 93, 184, -55, 29, -133, -272, -181, 197, -272, -4, 271, 264, -211, 75, 6, 244, -238, 107, 56, -239, 36, 79, 53, -93, 36, -246, -53, 22, 42, 254, -133, -136, -129, 35, 209, -200, -229, 58, -20, 5, -46, 230, -19, -25, -132, 111, 210, 142, 299, 67, -253, -86, -285, -61, 76, 180, 15, 161, 100, 38, 358, -91, -67, 196, -41, -10, -356, 200, 102, 47, 88, -70, 182, 8, 151, 25, -205, 209, 100, -190, 115, -165, -192, -89, -14, 149, -54, -20, 171, -12, 152, 6, 4, -186, -26, -98, 153, -24, -57, 210, -81, -96, 6, -18, 137, 21, 141, 81, 278, 139, 193, 254, 133, 24, -245, -161, 31, -109, 84, -183, 34, 119, 20, -18, -69, 28, 190, 176, -31, 5, -173, 158, -50, 41, 13, 173, 140, 76, -8, -132, -161, 128, -159, -277, 112, -25, -153, -252, -84, 83, 117, 50, 53, 55, 18, 49, -102, 114, -79, -88, -30, -90, 53, 1, -39]
6115c9J22k40j35K70K3j30QL46k36K2m3R2k48J95J29l63J52k22J47J41L0k07M14
6138B28m26J12oK11J16k79K90k95n3j20K74jjj5L5k41N76m06Q3j78J38l48K86
6161b0Kl4K6L25k82K04k49n8O3l58M02k62KK56R0P2l03L17n39K16K5j16N70l87
6185c8R6j85k24K54j3L5JM7P3j95L29k06p0R8j56L06q2Q7l75L09j46l0m7J21m6
6210e7j05L44k42j74L90k4N4j73j60J76p6J84j67k02k6K4M05l5k83L02l11L32
$$ y = [-39, 83, -157, -292, -22, 1, -129, -121, 225, -11, 11, -32, 60, -188, 7, 136, -227, -75, -297, -150, -9, 21, -186, 228, -198, -86, -92, 119, 235, -44, 246, -49, -102, -222, 52, 51, 50, 35, 70, -171, 405, -1, 82, -96, 42, -306, -20, -18, -52, -26, 299, 17, 221, -28, -86, -23, -381, 21, -241, -239, 17, 107, 179, -124, 193, -346, -130, -105, -221, 349, -38, 58, -127, -351, -97, -110, -75, -74, -27, 46, -149, 180, -26, -96, 2, -154, 152, 70, 157, -218, 91, -55, -85, -132, -11, -57, -162, 182, -60, -234, 156, 132, 186, 13, -147, 29, -47, 137, -30, -232, -258, -234, 171, 136, -147, 155, -156, 176]
$$ [...]
8191F5
##END NTUPLES=NMR FID
##END=
