##TITLE=1H_I
 200.13MHz,CDCl3 ,
 8 sc
 
 13.3.2025
##JCAMPDX= 6.0         $$ Bruker NMR JCAMP-DX V2.0
##DATA TYPE= NMR FID
##DATA CLASS= NTUPLES
##ORIGIN= UXNMR, Bruker Analytische Messtechnik GmbH
##OWNER= pz
$$ XWIN-NMR		Version 3.5
$$ Thu Mar 13 14:14:58 2025 Russian Standard Time (UT+4h)  she@DPX200
##.OBSERVE FREQUENCY= 200.1313
##.OBSERVE NUCLEUS= ^1H
##.DELAY= (6, 6)
##.ACQUISITION MODE= SIMULTANEOUS
##.ACQUISITION SCHEME= undefined
##.AVERAGES= 8
##.DIGITISER RES= 18
##SPECTROMETER/DATA SYSTEM= spect
##.PULSE SEQUENCE= zg30
##.SOLVENT NAME= CDCl3
##.SHIFT REFERENCE= (INTERNAL, CDCl3, 0, 14.3821)
##AUDIT TRAIL= $$ (NUMBER, WHEN, WHO, WHERE, WHAT)
$$ ##TITLE= Audit trail, XWIN-NMR		Version 3.5
$$ ##JCAMPDX= 5.01
$$ ##ORIGIN= Bruker BioSpin GmbH
$$ ##OWNER= she
$$ F:/spectra/data/she/nmr/H-C/1/audita.txt
$$ ##AUDIT TRAIL=  $$ (NUMBER, WHEN, WHO, WHERE, WHAT)
(   1,<2025-03-13 14:13:56.68 +0400>,<she>,<DPX200>,
      <created by zg, POWCHK disabled, PULCHK disabled
       configuration hash MD5:
       00 E9 B6 7A A2 85 ED C7 34 08 36 98 17 FE 4E 26
       data hash MD5: 16K
       22 13 15 69 0B 6F 56 80 D2 E8 84 77 30 89 E1 16>)
$$ ##END=
$$ 
$$ hash MD5
$$ D1 13 36 77 59 67 2B C6 FC 17 72 36 3B 5F 4B 7B
##$RELAX= 
##$RELAX= 
##$RELAX= 
##$RELAX= 
##$RELAX= 
##$RELAX= 
$$ Bruker specific parameters
$$ --------------------------
##$DU= <F:/spectra>
##$EXPNO= 1
##$NAME= <H-C>
##$PROCNO= 1
##$TYPE= <nmr>
##$USER= <she>
##$AMP= (0..31)
100 100 100 100 100 100 100 100 100 100 100 100 100 100 100 100 100 100 
100 100 100 100 100 100 100 100 100 100 100 100 100 100 
##$AQSEQ= 0
##$AQ_mod= 1
##$AUNM= <au_zg>
##$AUTOPOS= <>
##$BF1= 200.13
##$BF2= 200.13
##$BF3= 200.13
##$BF4= 200.13
##$BF5= 200.13
##$BF6= 200.13
##$BF7= 200.13
##$BF8= 200.13
##$BYTORDA= 1
##$CFDGTYP= 0
##$CFRGTYP= 5
##$CHEMSTR= <none>
##$CNST= (0..31)
1 1 145 1 1 1 1 1 1 1 1 1 1 1 1 1 1 1 1 1 1 1 1 1 1 1 1 1 1 1 1 1 
##$CPDPRG= <>
##$CPDPRG1= <>
##$CPDPRG2= <>
##$CPDPRG3= <>
##$CPDPRG4= <mlev>
##$CPDPRG5= <mlev>
##$CPDPRG6= <mlev>
##$CPDPRG7= <mlev>
##$CPDPRG8= <mlev>
##$CPDPRGB= <>
##$CPDPRGT= <>
##$D= (0..31)
0 0.7 0 0 0 0 0 0 0 0 0 0.03 0 0 0 0 0 0 0 0 0 0 0 0 0 0 0 0 0 0 0 0 
##$DATE= 1741860836
##$DBL= (0..7)
120 120 120 120 120 120 120 120 
##$DBP= (0..7)
150 150 150 150 150 150 150 150 
##$DBP07= 0
##$DBPNAM0= <>
##$DBPNAM1= <>
##$DBPNAM2= <>
##$DBPNAM3= <>
##$DBPNAM4= <>
##$DBPNAM5= <>
##$DBPNAM6= <>
##$DBPNAM7= <>
##$DBPOAL= (0..7)
0.5 0.5 0.5 0.5 0.5 0.5 0.5 0.5 
##$DBPOFFS= (0..7)
0 0 0 0 0 0 0 0 
##$DE= 6
##$DECBNUC= <off>
##$DECIM= 32
##$DECNUC= <off>
##$DECSTAT= 4
##$DIGMOD= 1
##$DIGTYP= 9
##$DL= (0..7)
0 120 120 120 120 120 120 120 
##$DP= (0..7)
150 150 150 150 150 150 150 150 
##$DP07= 0
##$DPNAME0= <>
##$DPNAME1= <>
##$DPNAME2= <>
##$DPNAME3= <>
##$DPNAME4= <>
##$DPNAME5= <>
##$DPNAME6= <>
##$DPNAME7= <>
##$DPOAL= (0..7)
0.5 0.5 0.5 0.5 0.5 0.5 0.5 0.5 
##$DPOFFS= (0..7)
0 0 0 0 0 0 0 0 
##$DQDMODE= 0
##$DR= 18
##$DS= 0
##$DSLIST= <SSSSSSSSSSSSSSS>
##$DSPFIRM= 0
$$ [...]
##$SUBNAM0= <"">
##$SUBNAM1= <"">
##$SUBNAM2= <"">
##$SUBNAM3= <"">
##$SUBNAM4= <"">
##$SUBNAM5= <"">
##$SUBNAM6= <"">
##$SUBNAM7= <"">
##$SUBNAM8= <"">
##$SUBNAM9= <"">
##$SW= 18.0517328524113
##$SWIBOX= (0..15)
0 0 2 0 0 0 0 0 0 0 0 0 0 0 0 0 
##$SW_h= 3612.71676300578
##$TD= 16384
##$TD0= 1
##$TE= 0
##$TE2= 300
##$TE3= 300
##$TEG= 300
##$TL= (0..7)
0 120 120 120 120 120 120 120 
##$TP= (0..7)
150 150 150 150 150 150 150 150 
##$TP07= 0
##$TPNAME0= <>
##$TPNAME1= <>
##$TPNAME2= <>
##$TPNAME3= <>
##$TPNAME4= <>
##$TPNAME5= <>
##$TPNAME6= <>
##$TPNAME7= <>
##$TPOAL= (0..7)
0.5 0.5 0.5 0.5 0.5 0.5 0.5 0.5 
##$TPOFFS= (0..7)
0 0 0 0 0 0 0 0 
##$TUNHIN= 0
##$TUNHOUT= 0
##$TUNXOUT= 0
##$USERA1= <user>
##$USERA2= <user>
##$USERA3= <user>
##$USERA4= <user>
##$USERA5= <user>
##$V9= 5
##$VALIST= <valist>
##$VCLIST= <CCCCCCCCCCCCCCC>
##$VD= 0
##$VDLIST= <DDDDDDDDDDDDDDD>
##$VPLIST= <PPPPPPPPPPPPPPP>
##$VTLIST= <TTTTTTTTTTTTTTT>
##$WBST= 1024
##$WBSW= 4
##$XGAIN= (0..3)
0 0 0 0 
##$XL= 0
##$YL= 0
##$YMAX_a= 71085
##$YMIN_a= -87457
##$ZGOPTNS= <>
##$ZL1= 120
##$ZL2= 120
##$ZL3= 120
##$ZL4= 120
##$ABSF1= 10
##$ABSF2= 0
##$ABSG= 5
##$ABSL= 3
##$ALPHA= 0
##$AQORDER= 0
##$ASSFAC= 0
##$ASSFACI= 0
##$ASSFACX= 0
##$ASSWID= 0
##$AUNMP= <proc_1d>
##$AZFE= 0.1
##$AZFW= 0.1
##$BCFW= 1
##$BC_mod= 2
##$BYTORDP= 1
##$COROFFS= 0
##$CY= -3
##$DATMOD= 1
##$DC= 2
##$DFILT= <>
##$DTYPP= 0
##$F1P= 0
##$F2P= 0
##$FCOR= 0.5
##$FTSIZE= 0
##$FT_mod= 4
##$GAMMA= 1
##$GB= 0.15
##$INTBC= 1
##$INTSCL= 1
##$ISEN= 128
##$LB= 0.25
##$LEV0= 0
##$LPBIN= 0
##$MAXI= 10000
##$MC2= 0
##$MEAN= 0
##$ME_mod= 0
##$MI= 1.114404
##$NCOEF= 0
##$NC_proc= 0
##$NLEV= 6
##$NOISF1= 3.799351
##$NOISF2= 2.8
##$NSP= 1
##$NTH_PI= 0
##$NZP= 0
##$OFFSET= 14.38212
##$PC= 1
##$PHC0= -473.6558
##$PHC1= 15.59221
##$PH_mod= 1
##$PKNL= yes
##$PPARMOD= 0
##$PSCAL= 0
##$PSIGN= 0
##$REVERSE= no
##$SF= 200.129724274929
##$SI= 16384
##$SIGF1= 3
##$SIGF2= 2
##$SINO= 400
##$SIOLD= 16384
##$SREGLST= <1H.CDCl3>
##$SSB= 0
##$STSI= 0
##$STSR= 0
##$SW_p= 3205.1282051282
##$SYMM= 0
##$S_DEV= 0
##$TDeff= 0
##$TDoff= 0
##$TI= <>
##$TILT= no
##$TM1= 0
##$TM2= 0
##$TOPLEV= 0
##$USERP1= <user>
##$USERP2= <user>
##$USERP3= <user>
##$USERP4= <user>
##$USERP5= <user>
##$WDW= 1
##$XDIM= 8192
##$YMAX_p= 0
##$YMIN_p= 0
$$ End of Bruker specific parameters
$$ ---------------------------------
##NTUPLES= NMR FID
##VAR_NAME=  TIME,          FID/REAL,        FID/IMAG
##SYMBOL=    X,             R,               I
##VAR_TYPE=  INDEPENDENT,   DEPENDENT,       DEPENDENT
##VAR_FORM=  AFFN,          ASDF,            ASDF
##VAR_DIM=   8192,          8192,            8192
##UNITS=     SECONDS,       ARBITRARY UNITS, ARBITRARY UNITS
##FACTOR=    0.0002768,     1,               1
##FIRST=     0,             0,               0
##LAST=      2.2672688,     0,               0
##MIN=       0,             -87457,          0
##MAX=       2.2672688,     71085,           0
$$ Real data points
##PAGE= N=1
##DATA TABLE= (X++(R..R)), XYDATA
$$ [...]
1839g0J25K00r6o0J86J9k37K50R7p41J99o4K22n05J55n3J35K57r6l19J83J39J81
1862A07j25L48r0J17m21M31j93j45k7j3J16l8j25O5k60N6p6J35p4L68k87j43L64
1885I0j47J34L7K24L7k22l28K04k11R9M74m43P6Q8m78K49R0j65j3L4kK87L4J42
1909B90j71M46l44J24j54M41l46l02N1k18J78k06L0jl5k83L94k36L49L18j25j30
1931G0J65l0L6J27k01J7J25m58J63r4Q5k16N2j76j07L71K62l23K63N9k52J30K69
1954C37k48L4l4r0P3K2k41J73j11k3k52L09k94L29n7j48J49P1K9l27N38k71K88
1977B56l51J41r1M64l61J06Q9l59j09J58m6k71L36n6l54M53N4k47M38k69k60K27
1999e2L39j0j27m7j70J13P5j10L12m75q4j16K48kj72J73k86K70M5j07M01j68Q9
$$ plain form
1839 -70 55 255 159 99 285 304 67 317 414 -327 -128 -192 30 -475 -320 -373 -238 19 -77 -396 -213 -74 107
1862 107 -18 330 240 357 -64 367 174 29 2 -11 105 67 -58 7 -253 -197 -273 -138 -212 156 -131 -274 90
1885 90 -57 77 114 338 375 153 -175 29 -182 -83 391 -52 24 112 -366 -117 -27 -192 -205 -171 -173 114 148 290
1909 290 119 565 221 345 191 632 286 -16 35 -183 -5 -211 -181 -182 -217 -500 -106 -342 7 325 200 70
1931 70 235 205 241 368 167 184 309 -149 14 -80 5 -211 -159 -335 -442 -71 191 -132 131 190 -62 68 337
1954 337 89 123 89 -1 72 94 -147 26 -85 -108 -360 -51 -345 -16 -73 -221 -72 -1 28 -299 239 -32 256
1977 256 -95 46 -45 419 58 164 253 -106 -215 -57 -103 -374 -38 -94 -448 5 59 -188 250 -19 -279 -52
1999 -52 287 277 150 103 -67 46 121 11 323 -152 -236 -352 -104 -106 -278 -105 -391 -121 -76 -183 218 50 139
2022A39K01Ll22K46K2k88j0mk2j28k19J29j4K29q6j25M53k56J29l00M26j46L12
2045C69j2r0n8pk85K76k22J72k30k3nk07J21K28j86k73p1M35J66j16M43j89pk1
2069B08q9N6m30L50M4Lm47Q3Q9j34J42l1J57p3K4PL38l96L61k15J81j30K81j01
2093B78l16L59n25J38j0J8Q1m46KK86j42J09l7J63P7r0K60j5jK69l03K45j62k61
2117b3J15L0j28j94j2q7j6L60j79Pk73K88K24q2K87k08k4K24p3l6r4k56K73o3
2141F0k15P4r8k1J79J82j97j25J12J75o3O9L3j97K00J0kJ53j39J71j87k5l7p0
2165D2J4l29R9j23J00l0r7L62J00j95k4M54q8j63K17k61J76j86m9J54l61J13K52
2188A77k83q8K48j69r0N3P4J38k01L65O4j07L0Rq2N0k18J65j95J31O3j03j46M2
$$ plain form
2022 139 340 343 21 267 289 1 -9 -13 -35 -163 -382 -253 -267 -38 -124 -249 204 -52 77 -223 203 57 369
2045 369 357 267 209 202 -83 193 -29 143 -87 -110 -115 -322 -201 27 -159 -432 -503 -68 98 -18 425 236 229 208
2069 208 119 175 -255 95 139 142 -305 -222 -133 -267 -125 -156 1 -72 -48 -41 297 -99 262 47 228 98 379 278
2093 278 -38 321 -204 -66 -76 -58 23 -423 -421 -135 -277 -168 -205 -42 35 -55 205 190 189 458 155 400 238 -23
2117 -23 92 122 -6 -200 -212 -299 -315 45 -134 -127 -400 -112 112 30 317 109 85 309 236 200 106 -150 123 60
2141 60 -155 -81 -179 -200 -21 161 -36 -161 -49 126 63 132 165 -32 168 178 176 329 190 361 174 149 112 42
2165 42 56 -273 -174 -297 -197 -227 -324 38 138 -57 -81 373 285 122 339 78 254 68 19 173 -188 -75 177
2188 177 -106 -194 54 -115 -205 -152 -78 60 -141 224 288 181 211 220 138 188 -30 135 -60 71 134 31 -115 -73
2212g3k31J04j6J26K3k3k31L61j09M19j32k04J21q1M8n9QJ86j14p3k93l5J04L9
2236a35j60L14j60k13K00K97P3k62K10o2l1M6k16P0K97j25k00k57N19k35j25k26
2258c81J85J84J20j12n0k31L82p4N1q0k1J76m4j6r6P9J08j70nj73J61j53Q0O6
2282a4k21l4J40J71r5J39n8k60M03j76k43M66k23J73l3N4m57K91q2K9P1P1q4R2
2306A20J32l11j78J22K08J12j69M9L2J07q6q6j64j07L64j60Pk41r3K70j20R0J8
2329h4K29l62K79J23J64k55j59J36J69k97K25j5j80M8j67j71J27N5p2J34K21l57
2351b09J17N0K88j50k40J90Q6J51k48J46n9Qj06k8j53K96k79o4K69j99O3O4k24
2374b31K93K14r2M7k39j2L47k68L23l85k8Q3j90K27q5j96J74k33J35R3n2o5l2
$$ plain form
2212 -73 -304 -200 -216 -90 -67 -90 -321 40 -69 350 218 14 135 54 102 43 51 237 123 50 -243 -278 -174 -135
2236 -135 -295 19 -141 -354 -154 143 216 -46 164 102 71 117 -99 -29 268 143 -57 -314 205 -30 -155 -381
2258 -381 -196 -12 108 -4 -54 -285 97 23 74 -6 -27 149 105 89 -7 72 180 10 5 -168 -7 -160 -80 -14
2282 -14 -235 -269 -129 42 -53 86 28 -232 171 -5 -248 218 -5 168 135 189 -268 23 -59 -30 41 112 28 120
2306 120 252 -59 -237 -115 93 205 36 85 117 224 138 52 -112 -219 145 -15 -8 -249 -342 -72 -192 -102 -84
2329 -84 145 -217 62 185 349 94 -65 71 240 -57 168 153 -27 21 -146 -317 -190 -135 -207 -73 148 -209
2351 -209 -92 -42 246 96 -144 46 132 283 35 181 122 130 24 -4 -157 139 -140 -204 65 -134 -71 -7 -231
2374 -231 62 276 184 231 -8 -20 327 59 382 -3 -31 52 -138 89 4 -192 -18 -251 -116 -23 -75 -140 -172
2397a72NL8J48J34j84o1j2M8K87j58j02j32J95n5J8j3J85j33j86j33L13l15J68
2420a17k3k9K51Mn2N7j86J58o0K46l12L1r7l3K65m12K50k68K09j16Q3m1J68m4
2444f8L42k28N1Mr9K9kn4J28L9k19R7j45P3j30O5Q7K52l07K39M3j30J07j43J37
2469A68k51P2Q1j50J50K36k57j79K56k51j7N5m8J58j10j29L02M5l7j35P6K22l74
2492a17P1K62k58K68k46J36q9j03%J83j23J28m35J46K9K48m42M17k44L71j54k80
2514b32M43M9k00K47k02q2l8r9j9K2j07K34j06J71n52L67J22Qq5O2K01o6j91J59
2538A06j32k01N44j58j44jm8k69L27k19k5J26K62k99L0N8J35l5k4k54Q5K72k45
2561a09J48K01P6l69K07M8k57J4K15k75K71r6l68N31k64j56M18k59J98k63K06
$$ plain form
2397 -172 -167 -129 19 153 -31 -92 -104 -56 231 73 -29 -161 34 -21 -3 -16 169 36 -150 -283 30 -285 -117
2420 -117 -140 -169 82 86 34 91 -95 63 3 249 -63 -32 -129 -162 103 -309 -59 -327 -118 -234 -151 -192 -24 -68
2444 -68 274 46 97 101 2 31 29 -25 103 142 -77 20 -125 -52 -182 -117 -30 222 -85 154 197 67 174 31 168
2469 168 -83 -11 70 -80 70 306 49 -130 126 -125 -142 -87 -135 23 -87 -216 86 131 94 -41 35 257 -117
2492 -117 -46 216 -42 226 -20 116 27 -76 -76 107 -16 112 -323 -177 -148 100 -342 75 -169 202 48 -232
2514 -232 211 260 60 307 105 23 -15 -114 -133 -111 -218 16 -90 81 -471 -104 18 26 -59 3 204 138 -53 106
2538 106 -26 -227 317 159 15 14 -34 -303 24 -195 -220 -94 168 -131 -101 -43 92 57 33 -221 -136 136 -109
2561 -109 39 240 316 -53 154 202 -55 -41 174 -101 170 74 -294 237 -27 -183 235 -24 174 -89 117
2582A17n9p4J42M8k08Q2o4J02m15j63K86K7J20j57R7l7r1K02J56J23j45k25N15
2605C79l17Q8JJ88l58l93M11p4p0J81j86k25M33q5R4K3N1l18L35j98K11j11oJ42
2629A96kj2l6m00L20M0j36j30K9K62N6m67M26j77j04K13J97j70k5K4j43K13J03
2652B77K8j12j54r3K26l41J45J30k79QJ02j53L77J71q8j31M6J57m63K19j28L2
2674b4j07J44j23J21J44k21j65J39J45j52l6K37jk20K5N8l9K36P6k45Pj5J8M2
2698D4O6Q4l18K16j96R3l18J53N0r9K34j60L13j66J0M7J88m83K87o5j5k0J60m2
2722F3k85Q1K29n14M24j56J12l07L12j00Q6MQ4j6M4p7r9K18J60j21j18j50K59
2745A33J70m10J7K06l94K61k6J88r8l00L69r5k01J73j38M16j26j00J33j33n8J58
$$ plain form
2582 117 58 -16 126 174 -34 48 -16 86 -329 -492 -206 -179 -59 -216 -119 -156 -247 -45 111 234 89 -136 379
2605 379 62 150 151 339 -19 -412 -1 -75 -145 36 -150 -375 58 -27 67 90 141 -177 158 -40 171 60 54 196
2629 196 194 182 146 -254 66 106 -30 -160 -131 131 187 -280 146 -31 -135 78 275 105 80 104 -39 174 277
2652 277 305 193 39 -54 172 -169 -24 106 -173 -165 -63 -216 161 332 244 113 159 316 -147 72 -56 -24
2674 -24 -131 13 -110 11 155 -66 -231 -92 53 -99 -135 102 101 -119 -94 -36 -75 161 237 -8 -1 -16 2 44
2698 44 110 194 -124 92 -104 -11 -329 -176 -126 -225 9 -151 162 -4 6 53 241 -242 45 -20 -35 -55 105 63
2722 63 -222 -141 88 -426 -2 -158 -46 -353 -41 -141 -55 -51 33 17 61 -16 -115 103 263 142 24 -126 133
2745 133 303 -107 -90 116 -278 -17 -43 145 47 -253 116 21 -180 -7 -145 271 145 45 178 45 -13 145
2767A45jk45J99k25q6L36k53L12q0k11K47m53J67K35o7L03l31J83Q1k40M6l1m2
2790a1n1q6Q7J58k97Q7K01m2K3Q1k65N0l4M9K09r3N1l90M39j37J01q0o0N5j18
2815g3J05j04l0M8k7k72L79l8J11l2j51J25J00J02l31K73j32o2J03J4k91K58k76
2838b01J52J16j05J47k76L58J3j39j76K05O9l5Ok60L08o8j23p8J79J91n44K06
2860e5R0J5r9J1q5M3J42j1K1j13J02j07J73r1nJ84q7J3K1j44M6q4J66j83j46K00
2886A7o9j50J39O8J77j90k5L58m52J5K42j36L0O7j51K56ll64N8j17J36J75K38
2909C19k21k07K17q7K12m28K39P3q6P2j63J04J03j45J41q5j9n3L9O0j20R9j50
2932h6J94j41m9l2q3K11L2ok06J94J57q3q5K23n2j96pJ50l29J90Ll5J52k71Q3
$$ plain form
2767 145 144 -101 98 -127 -213 123 -130 182 102 -109 138 -315 -148 87 20 323 -8 175 256 16 62 31 -11
2790 -11 -62 -148 -61 97 -200 -113 88 46 69 150 -115 -65 -99 -50 159 66 117 -273 166 29 130 50 -10 45 -73
2815 -73 32 -72 -102 -54 -81 -353 26 -12 99 67 -84 41 141 243 -88 185 53 -9 94 108 -183 75 -201
2838 -201 -49 67 -38 109 -167 191 204 65 -111 94 163 128 134 -126 182 114 -9 -87 92 283 -261 -55
2860 -55 35 50 -49 -38 -123 -80 62 51 72 -41 61 -46 127 36 31 215 128 141 162 18 64 -20 146 -37 -183 17
2886 17 -52 -202 -63 5 182 -8 -33 325 -127 -112 130 -6 24 91 -60 196 193 -171 -113 -230 -94 81 319
2909 319 98 -109 108 21 233 -195 44 117 31 103 -60 44 147 2 143 58 39 -14 25 85 -35 64 -86
2932 -86 108 -33 -82 -114 -197 14 46 40 -166 28 185 102 17 240 188 -8 -15 135 -194 -4 -1 -36 116 -155 -72
2957g2J0K5J56k46j1K07j31J0J27m2k22J2K28m06J48LJ10J02K46l51j26M8K14
2980C9o8j70J61m3M08k41l3o2Lk10J55n8P4k56K52K16R7k81j89M56j72n6j6M4
3004E0Q6L08k57l81K47J0J04j93Q2J36j8j51J77m02p3K25o2J26j10K41j60j13
3026a28j3n9J68N3q7M0N6O4j39or8L27j62n9p0K87k47j64J48KL37n13J90J16o5
3051b2K78l51L36j73R9m22L30k02RL61k99%j01L00n18J23J64J8N7j19N1J93r9
3074A3l2J96L8j34o5J82k65K25j87M8R1k06R5O0j47J24n7j34J85l85N32O9l67
3097a21J82J27J2k35J62j10J27k30N2J56k01J82r7j16l1J52J79k10j97J42K8j09
3119a56K03J32p9J42l22m0J90k68L79l44O6p8nK3Q4K4k03L53JN5m7K35q0l44J19
$$ plain form
2957 -72 -62 -37 119 -127 -138 69 -62 -52 75 33 -189 -177 51 -355 -207 -204 -94 8 254 -97 -223 -175 39
2980 39 -29 -199 -38 -81 327 86 53 -9 -6 -216 -61 -119 -45 -301 -49 167 264 -17 -206 250 78 22 6 50
3004 50 136 444 187 -194 53 63 167 -26 56 192 174 23 200 -202 -275 -50 -112 14 -96 145 -15 -128
3026 -128 -141 -200 -32 21 -66 -26 30 94 -45 -51 -149 178 16 -43 -113 174 -73 -237 -89 -87 250 -263 -73 43 -22
3051 -22 256 -95 241 68 167 -255 75 -127 -118 243 -56 -56 -157 143 -375 -252 -88 -70 -13 -132 -81 112 13
3074 13 -19 177 215 81 16 198 -67 158 -29 19 110 -96 -1 59 -88 36 -21 -155 30 -355 177 246 -121
3097 -121 61 188 200 -35 127 17 144 -86 -34 122 -79 103 6 -110 -141 11 190 -20 -217 -75 -47 -156
3119 -156 47 179 100 242 -80 -120 70 -198 181 -163 -97 -175 -180 -157 -73 -49 -252 101 102 157 110 345 265 -79 40
3144D0mL1P3J66k09j84k3O3jK50j49j69P6n2K11l60J26J77j99N75m52L1J91m09
3168b01J56M5M9J7k19J35N3L0k61L21p1o9P5LQK12n20J89K30q9k23J58q1k25K26
3193e2L19k75k34K30O6j3l00L5J45L65k69K2J5J28J00j74p5j15J72m85O26l20
3215h9K49j0n9j78L6j4j2J61j0k42J1J85J33j4l8j33PK13j33J11l01K7j57J06
3239a51P9k11j1Q9J68J18k85K78K4n5j60J51J33j06M5O5L3j48j70K11p4j11K8
3262f0j5N8j20n6J20J80k87J65j08K18l57R3K29k1p8P7o0J46j62J42J01l9m77
3285c11M59j75p5L27pJ35k00J59m79k5J64r7k4L31j08Lo6L8J46k55J55j27N1p3
3309e4j14M30j18l10l8K8K28j36J78n9n3J78j03j33J91k05QJ87k18O6k40K71j70
$$ plain form
3144 40 36 67 140 306 97 -87 -110 -47 -48 202 53 -116 -40 -92 119 -241 -115 62 -137 438 -14 17 208 -201
3168 -201 -45 0 49 66 -153 -18 35 65 -196 125 54 -15 60 63 71 283 -237 -48 182 93 -130 28 -53 -278 -52
3193 -52 267 -8 -242 -12 54 41 -259 -224 -79 286 17 39 54 182 282 108 33 -82 90 -395 231 -89
3215 -89 160 150 91 -87 -51 -65 -77 84 74 -168 -157 28 161 147 109 -24 -17 196 63 174 -127 -100 -257 -151
3239 -151 -72 -283 -294 -205 -37 81 -204 74 98 43 -117 34 167 61 106 171 204 56 -114 97 23 -88 -60
3262 -60 -75 -17 -137 -193 -73 107 -180 -15 -123 95 -262 -169 60 39 -39 38 -22 124 -38 104 205 166 -311
3285 -311 148 -27 -102 225 218 353 153 312 -167 -192 -28 -125 -149 182 74 77 11 49 195 -60 95 -32 19 -54
3309 -54 -168 262 144 -166 -204 -176 52 -84 94 35 -18 160 57 -76 115 -90 -82 105 -113 -47 -287 -16 -186
3332a86K90K1j19J96k03N8q3L5j40K64j51m3J42l8o8M0j19k3Q8k7K17m78K83J76
3356A32j68j71K46L3j11o7j6M5J51j68P3k9k1J47n28L47K23o1j42oJ68n8q8J7
3380e2j58J59K72k18J18k02O1k3L32j45k40K83m30K5L36l46M94n17J98J80k74
3401a47J22R6l7l91K37l3K8J81j81K2O6L3j40J43M3j60j00J55O0j84j26J76J75
3424C8n8q2o5K34j05K30J2j07k10K99k54K71J7j66j85n4j11L38l2j55P6k57J73
3447a53J01j46K17L3j25M4r5j04J75J05j3P7jN7q3l38J33N8N2j19k8Q8j43J97
3471a1j39K61k1K59k93j44k71K94j55J30L6j63J56J81k17J42j18J70l54r4K05
3492a46K41k38l8J24J07j00J15np7N0j55J00J96j78J31J23l23P3r9J19k54K71
$$ plain form
3332 -186 104 125 6 202 -1 57 -26 9 -131 133 -18 -61 81 43 -25 15 -104 -127 -39 -66 151 -327 -44 132
3356 132 -36 -207 39 72 -39 -106 -122 -77 74 -94 -21 -50 -71 76 -452 -105 118 57 -85 -91 77 19 -69 -52
3380 -52 -210 -51 221 3 121 -81 -20 -43 289 144 -96 187 -243 -218 118 -228 266 -251 -53 127 -147
3401 -147 -25 71 34 -357 -120 -153 -125 56 -125 -103 -37 -4 -144 -1 42 -118 -218 -63 -3 -187 -313 -137 38
3424 38 -20 -102 -167 67 -38 192 204 97 -113 186 -68 203 220 54 -131 -185 -296 42 10 -145 -69 -326 -153
3447 -153 -52 -198 19 52 -73 -29 -124 -228 -53 52 39 116 115 172 89 -249 -116 -58 -6 -125 -153 -65 -208 -11
3471 -11 -150 111 90 349 56 -88 -359 -65 -220 -90 -54 -217 -61 120 -97 45 -73 97 -257 -351 -146
3492 -146 95 -143 -181 -57 50 -50 65 60 -17 33 -122 -22 174 -4 127 250 -73 0 -99 20 -234 37
3514C7k90j34M08j38Q2K61k85k8l2M46m51j12Q3N65m39K11l48N9R1j8K38oj67
3537C3J48q2j37J18o0r6o6K1P2j17J3J73O8k66L73j31j02l6L12j34n0j01J41j25
3561c1o3n0J23Q5m8P5j61K96k57M8L7J0l11J69J06k04J34P6K3n0N2J1p8k37L91
3586A46q3j31kp5M71k54r3O5o3n5O4j8J9K10k0k29J63q9n9j83K9J22L9p1L50j03
3612A50k74J09m7l0K08N1q2ok99K28j64L48j02Mo0k40J50K26j99o4L46n49M18
3635A22k55R7k1K47l50K56j88J86k65K73j79J70j92o9L95j76j36P3n2k2k3Q8K51
3658B30q2L2k45L06l96L80o0k37J28q3L6J90l17j00J62j15L9Q3l8K23k12M4r1
3681a23L00j18j16J33j22o5N1r3O6J1K15k25N1J16Lj95J07K4l1k07J15O3J99k63
$$ plain form
3514 37 -253 -387 21 -117 -35 226 -59 -87 -119 327 -124 -236 -153 412 -27 184 -164 -105 -14 -32 206 200 33
3537 33 181 99 -38 80 20 -76 -142 -121 -49 -166 -153 20 88 -178 195 64 -38 -74 238 104 54 -47 94 -31
3561 -31 -94 -144 -21 64 16 91 -70 226 -31 17 54 64 -247 -78 28 -176 -42 34 57 7 59 70 -8 -245 146
3586 146 63 -68 -70 -145 326 72 -21 44 -19 -74 -10 -28 -9 201 181 -48 115 26 -33 -216 -187 -65 -26 -97 253 150
3612 150 -124 -15 -62 -92 116 167 85 79 -220 8 -156 192 90 94 34 -206 -56 170 -29 -93 253 -296 122
3635 122 -133 -36 -57 190 -160 96 -92 94 -171 102 -77 93 -99 -168 227 51 -85 -12 -64 -86 -109 -21 230
3658 230 148 180 -65 241 -155 225 165 -72 56 -27 9 199 -118 -218 -56 -171 -132 -49 -87 136 -76 -32 -123
3681 -123 177 59 -57 76 -46 -111 -60 -153 -87 -76 139 -86 -35 81 84 -111 -4 20 -11 -218 -103 -40 159 -104
3705a04J32j2l6J63k17J48j69L9o4L49j98j1q9J05N3k0K9J08k27J30Rj82K1O0
3729A7j47rJ98n4J1J33j16J70k05J83k25j71J14m0K26o9j46J55l58M2N62m09L88
3752B50j02j98r4k82N31P7M3o42N11j47l7M4M47k47j32j05j4J9J08J22o9L9k5
3775I7l03J49p8J87j48o8OJ24K07k25J26on5l8l0L8j21J17R7j18P4o5j63K10j51
3800a37r6J57J07J25k47J56K3o8J4j25J48N1l07K47j32K59j46K09k3q5m64L45
3822A1r7J34o7l5J00J8R8k93L99l97J74k01L1K29r6O3j69J67K79k26k26j54L90
3845A32l02L2J83j91J21j65K28K82l84j70L45K14k97J30p2k40K64k41K29j99J76
3866G5m9j54M5J43k20J9L09k13J30Q0j04m4j83L47L3j17j48j05J85J35k83J94
$$ plain form
3705 -104 28 16 -20 143 -74 74 -95 -56 -120 229 31 20 -69 36 89 69 98 206 -21 109 118 -64 -43 17
3729 17 -130 -139 59 5 16 149 33 203 -2 181 -44 -215 -101 -141 85 16 -130 25 -333 -291 271 -138 250
3752 250 148 -50 -144 -426 105 182 225 -417 94 -53 -90 -46 401 154 22 -83 -97 -78 30 152 83 122 97
3775 97 -206 -57 -135 52 -96 -164 -158 -34 173 -52 74 68 13 -25 -55 -17 -138 -21 76 -42 32 -33 -196 14 -137
3800 -137 -233 -76 31 156 -91 65 88 20 34 -91 57 108 -199 48 -84 175 29 238 215 130 -334 11
3822 11 -86 48 -19 -54 46 64 162 -131 268 -129 45 -156 -125 104 8 71 -98 69 348 122 -104 -258 132
3845 132 -170 -138 45 -146 -25 -190 38 320 -64 -234 111 325 28 158 86 -154 110 -131 98 -101 75
3866 75 26 -128 -83 60 -160 -141 168 -45 85 165 61 17 -166 181 214 97 -51 -156 29 164 -119 75
3888G5m22K93P6MK1l1J98o9k04q8O5J38M6j86M38j12j79J90l15R2J18M8j49N1
3912I8L1Q5m03J09L1J36N4j92J86k81M82o0m10L34k07P9N6j64J39O2k25L8J96
3935A74j1p0j23k3o4JK48j90j80L93l24O05j30k19RJ8o6q4J31k51J27m01N26p6
3959B0j06J01k32L9J22R2M0ll0q9R3nR2O1j53J75k77O2K07j99k62J46K48j7j44
3984a9k28J34L09R9k05k51J45l58M07J31k05p2qk4K35M5k68O1N2N5m22J67O1J85
4008B6q6J10p8K90j15k5J72m17P3k07K86m1l18L13M2k94K71j55N1j3M20m93J57
4031c1N3p5L30k88j73l2K11j54J32L2J3Q4Q7j99n8K55m6R7k8m6n32K57Q1K97n0
4056B17k00l4j08J41j31L90j44k59O5K04l41J11L02j61k14J01J39Oo4l8K43j54
$$ plain form
3888 75 -347 -54 22 26 47 16 214 145 -59 -147 -82 56 102 -84 354 242 63 253 -62 30 148 196 47 98
3912 98 129 214 -189 -80 -49 87 141 -51 135 -146 336 276 -134 200 -7 72 128 -36 103 165 -60 -22 174
3935 174 163 93 -30 -53 -117 -116 132 -58 -238 155 -169 436 306 87 96 114 48 -36 95 -156 -29 -430 96 20
3959 20 -86 15 -217 -178 -56 36 76 73 43 -46 47 42 134 195 42 217 -60 2 209 10 -252 -106 142 125 -19
3984 -19 -247 -113 196 295 90 -161 -16 -374 33 164 -41 -113 -121 -145 90 135 -133 -72 -20 35 -387 -220 -159 26
4008 26 -60 50 -28 262 147 122 294 -123 -50 -257 29 -12 -330 -17 25 -269 2 -153 -102 -115 305 -188 -31
4031 -31 22 -53 277 -11 -184 -216 -5 -159 -27 5 18 102 189 -10 -68 187 141 238 210 164 -368 -111 -30 267 217
4056 217 17 -17 -125 16 -115 275 131 -128 -63 141 -200 -89 213 52 -162 -61 78 84 20 -18 225 71
4078G1j73Q1j52J55j61N4J44k33K73j4N1l66J18k0K84k2j13m2J72K5k52K59j1
4101A28l6k8K20l33L37j28j42L7P3n0q4K50l27J88p7r2O5J82j93O4K0q0J54j71
4125b3R5j49J0O3j35K8J75J06j78M7j97K5J48J25j46m0K42j01J5j71K15k32j6
4148i4K73l19J07p7J75p1K27j58j10J58k90pJ52k57L35p4J5j70L33M2j97j67L40
4171A66k15L8J42j54n2L47n74K57J68k80J3J28J92n2p6j7R6p6M5J18j38j09J84
4194A51n6j77N1L38k47j02L5j06M9J1J62l22J48K09j43j75J66J20n6j61K26j09
4216A2K2nJ02j43j70q1K56j30J01O7Jk00J53o1n3M51j79j9R0k35K88l44J16k42
4240b03J66j05p6J06P7j60R0L30k62o5K23k02J06k43L01j48OO2j43L73j90j53
$$ plain form
4078 71 -102 -21 -173 -18 -179 -125 19 -214 59 45 96 -270 -152 -172 112 90 -23 -65 107 132 -120 139 128
4101 128 92 64 284 -49 288 160 18 55 128 78 -6 244 -83 105 28 -64 1 183 -10 54 74 -6 148 -23
4125 -23 72 -77 -67 -4 -139 -111 64 170 -8 39 -158 -133 15 140 -6 -46 196 95 110 -61 154 -78 -94
4148 -94 179 -140 -33 -110 65 -6 221 63 -47 111 -179 -186 -34 -291 44 -30 -15 -185 148 190 -7 -174 166
4171 166 -49 -11 131 -23 -75 272 -302 -45 123 -157 -144 -16 176 124 48 31 127 51 96 214 76 -33 151
4194 151 95 -82 -31 307 60 -42 -7 -113 -64 -53 109 -213 -65 144 1 -174 -8 112 56 -105 121 12
4216 12 34 29 131 -12 -182 -263 -7 -137 -36 31 32 -168 -15 -76 -129 322 143 124 214 -21 267 -77 39 -203
4240 -203 -37 -142 -218 -112 -35 -195 -105 225 -37 -102 121 -81 25 -218 83 -65 -59 3 -140 233 43 -110
4262a10N4j09J55K18l01J24J17r4n4J39l03L01j2j13J21j29L4j52O1k85K96j13
4284a55O93o59K93k04j43O5J26kj66J33k75M62m4nl29K84p8n9o3L9j63J23q1L45
4308A37l3m01M13k42q2M47k16l39M73j17j61j33L53%j4l1k0j44J3k1O7r1Q8J0
4332d4J7J60n09L29J6J3pP0j09J23k37L81k21j18R1m1M6K5m7M2nK1O6k30K80M4
4358A56j50K8k19K24j62N4p2J67J12j21nq3P6M4k66j68M27J77j43k04Q7Q1j55
4381a15J61j20j66M46n17M67j31j94K23oK4j18K8j39K38J7k11r8K26J22j69p3
4403a05K25j52p8R5j28L29k17m7K3J92M6j05k1k45J21J01k3j54j35N31k64k5r2
4426a28J02K8j04l20L46k5P8K01k90M9R2p5J23q8j27J90j27J14k68J81K21q9N5
$$ plain form
4262 -110 -56 -165 -10 208 -93 31 148 54 0 139 -164 137 125 12 133 4 38 -114 -53 -338 -42 -155
4284 -155 538 -121 172 -32 -175 -110 16 14 -152 -19 -294 168 124 119 -210 74 -4 -63 -126 -87 -250 -127 -208 137
4308 137 104 -297 116 -126 -208 239 23 -316 157 40 -121 -254 99 99 85 54 34 -110 -97 -118 -51 -142 -54 -44
4332 -44 -27 133 -376 -47 -31 -18 -25 45 -64 59 -178 203 -18 -136 -45 -86 -40 -15 -62 -20 -25 -4 62 -168 112 156
4358 156 6 34 -185 39 -123 -69 -141 26 138 17 12 -71 5 49 -217 -385 42 219 76 -128 -41 40 -115
4381 -115 46 -74 -240 206 -311 156 25 -169 54 48 72 -46 -18 -157 81 98 -113 -211 15 137 -32 -105
4403 -105 120 -32 -110 -15 -143 186 -31 -78 -55 137 183 78 57 -188 -67 34 11 -143 -278 253 -11 -36 -128
4426 -128 -26 2 -102 -422 -76 -101 -23 178 -112 -63 29 -46 77 -11 -138 52 -75 39 -229 -48 173 84 139
4449A39k32P6J78k31J59j08q3p9M02l71J93L8J53k63J6J27o06K72J73J72o8o9
4471a2j0J30r2k51O7K34M5l3j19J17k9q3r0K29K21n30Q1K6J46j57LL64k37k95
4495b75K02J65j38J01PL78m15m9J59k06k03p5L88J88m39M6K04R6q7j95J5J69J35
4518A71k29J37o8R9m3j41m9Kj92N0J68K57k80p3L59M0k95O7j94O4J98j50JJ63
4542F2M3j26j41L78j81J88j94M1l6j46J06M2l53L58j73K9J54j75L63l68L17l38
4564a50K04M9l33M73j14r6p6n4j89M26j77j31K54q5j10N4o6K59r5J56K1j44N2
4587A28j86M1R4m2KNJ79l00K98k78J15k05m5M38l57J55j12N6O4r1k6P4J78q9p4
4612B2K39l50j86L99j57J2K32lm33K63j55K68l07K17k36l4M25m87K89j21K77k0
$$ plain form
4449 139 -93 -17 161 -70 89 -19 -102 -181 221 -150 43 81 234 -29 -13 114 -492 -220 -47 125 57 -12
4471 -12 -22 108 16 -235 -168 66 111 78 -41 76 47 -36 -126 103 324 -206 -125 -99 47 -110 -107 257 20 -275
4495 -275 -73 92 -46 55 62 440 25 -24 135 -71 -274 -349 39 227 -212 -166 38 134 47 -148 -133 36 171
4518 171 -58 79 11 110 67 -74 -123 -121 -313 -263 -95 162 -118 -191 168 208 -87 -20 -214 -150 48 -102 -101 62
4542 62 105 -21 -162 216 35 223 29 70 34 -112 -6 36 -317 41 -132 -103 51 -124 239 -129 188 -150
4564 -150 54 103 -230 243 129 33 -43 -97 -286 140 -37 -168 86 1 -109 -55 -121 138 43 199 220 76 128
4587 128 -58 -17 77 35 37 42 221 -79 219 -59 56 -149 -194 244 -113 42 -70 -14 50 -41 -67 7 185 96 22
4612 22 261 -89 -275 124 -33 -21 211 208 -225 38 -117 151 -156 61 -175 -209 216 -271 18 -103 174 154
4634A54j69J4k4l0m3J02q8m2J49l56K17J83K0k44N7j2M13m15J33R5m2j46J23k93
4658b44J76M0J0K04j89L5kk82K14p1O3K31p1j21J29p0o3j02k9J50nmJ40N4k01
4683hQ0J35K0p0l70L0k8K50m9j08K11k0L8k17M9L13k23j1j20j14K32J26p4j32
4707f0J61m38K89J09l36L57l94N55k76k3J51L3o4k24L95j97K69n32K7M00k94L03
4729B11k52P1k86M34k41KN8j16K23l26L1J29j26J36J67%k10K76r5j21J58L3Jk32
4753g5L9R0l20J95J40K9k28J83j30K74k89L10l42k2K41K24l05O0j63K71j33j24
4775g5k05R9L3M26n46K85R6k37L2K31k20L70j77j90j80L48j69O1J99J24k40j47
4797h2j45N6J42K10k08j88K96l13M7J25q6J40j24K71k42k3L01k06L11m23J07J02
$$ plain form
4634 154 -15 -1 -25 -55 -98 4 -84 -126 23 -333 -116 67 87 -157 -100 -112 301 -114 19 114 72 -74 49 -244
4658 -244 -68 -28 -18 186 -3 32 30 -252 -38 -109 -46 185 114 -7 122 52 -11 -113 -142 8 3 -1 139 193 -8
4683 -8 72 207 227 157 -213 -183 -211 39 -10 -118 93 73 111 -106 -57 256 33 22 -98 -212 20 146 72 -60
4707 -60 101 -337 -48 61 -275 82 -312 243 -33 -56 95 128 64 -160 235 38 307 -225 -198 202 -92 211
4729 211 -41 30 -256 178 -63 -61 -3 -119 104 -222 -191 -62 -188 -52 115 115 -95 181 86 -35 123 156 157 -75
4753 -75 -36 54 -266 -71 69 98 -130 53 -77 197 -92 218 -124 -146 95 319 14 74 -89 182 49 -75
4775 -75 -280 -181 -148 278 -268 17 113 -124 -92 139 -81 289 112 -78 -258 90 -79 -18 181 305 65 -82
4797 -82 -227 -171 -29 181 -27 -215 81 -232 -185 -60 -146 -6 -130 141 -101 -124 177 -29 282 -141 -34 68
4819F8M31q00L53j05k7K75j62oQ9k54K25q8J17l02J21J95j76K85l5l58N1O4j35
4842a74J06J7K27o2l6Ro2j37J82k53K83k83K29j43K69J08p9l08N03m57J72k21
4864a10R4k18M1R3r9K31k18K61j26l4K33r7j37K50r7K54l06Q4j53o9j68L65p1
4887Cl0M5j28J6j02K14j68K02Jj87Q7j36J13J89j93L49k33J3j40O1P3J01k24J10
4911C6r2R7p6K45k7k17K42j18k64M31l03p3J94j65P4j51M45m22j26M67m49K48
4933dj66L06j85j42K11p8L09j65j45J61j6l66J48J61J81nk31J10k50K35N9N3k12
4956c1l60K44J32J74j19L4j12K2J27l42J35K28k95J98J76k20m2j99K56J33l1j73
4978f5j30L00j61Rj08K85K9q4j04j55L41n9j91o3K10q1j85J13N3J43M4k09k0O8
$$ plain form
4819 68 499 -301 52 -53 -80 195 33 27 116 -138 87 -1 116 -186 -65 130 -46 239 204 -154 -103 -39 -174
4842 -174 -68 -51 176 114 78 87 25 -112 70 -183 100 -183 46 -97 172 280 201 -107 396 -61 111 -110
4864 -110 -16 -234 -193 -100 -199 32 -186 75 -51 -85 148 51 -86 164 67 321 15 99 -54 -123 -291 74 3
4887 3 -27 18 -110 -94 -196 18 -150 52 53 -134 -47 -183 -70 119 -74 275 42 55 -85 -24 49 150 -74 36
4911 36 -56 41 -35 210 183 -34 208 90 -174 257 -46 -119 75 -90 -16 -167 278 -144 -270 197 -252 -4
4933 -4 -170 136 -49 -191 20 -58 251 86 -59 102 86 -280 -132 29 210 205 -26 84 -166 69 128 181 -31
4956 -31 -391 -147 -15 159 40 74 -38 -16 111 -231 -96 132 -163 35 211 -9 -51 -250 6 139 108 -65
4978 -65 -195 105 -56 -47 -155 130 159 75 -29 -184 157 98 -93 -156 54 -27 -212 -99 -46 97 141 -68 -88 -20
5002b0j84Q4j2K56l33L1K02M6k15J20n5J46K68j41l35j31K54J06l27K03R1N6j41
5025c1J91r8l87KL24N2l38K91J44O7kj38k21n1J55r5K97k31L88m07k2R1j09J49
5049B1j16J5m2J58j14M5J21m6m7K69m30J05N2M7J4r4J19k15q4L13O0j42r6J15
5073B8K74l24p9k60L89m9L3J73j47k3j92K78j83N9J20L40n16K37k0j15k16J53
5095d0N7k06PK53k5o0J45l45%K02O4J04Q1j30j35OJ14k45K38k33K09n2n7J13j42
5120g7Jm5K8r9J99J25q4M4j8q3JJ3J89l50K45q4m3K33l50R7n3L7J56l11M88k49
5146A0j27j01L00j49m8J84l78J18L58o1j49J04N9r3j46K74r6r6l20L07J56n9k27
5169a80Q7J89L27l07l85L46k95K16l8J69M8m75N1J54J78r5j29J26j75K00M0J1
$$ plain form
5002 -20 -204 -120 -132 124 -209 -178 24 70 -145 -25 -80 66 334 193 -142 -273 -19 87 -240 -37 54 110 -31
5025 -31 160 62 -325 -323 1 53 -285 6 150 217 215 77 -144 -195 -40 -135 162 -69 319 -88 -110 -19 -128 21
5049 21 -95 -80 -122 36 -78 -33 88 42 -5 264 -166 -61 -9 38 52 -42 77 -138 -222 91 151 9 -87 28
5073 28 302 -22 -101 -361 28 -21 12 185 38 15 -177 101 -82 -23 97 437 -79 158 138 23 -193 -40
5095 -40 17 -189 -182 71 46 -14 131 -214 -214 -12 52 156 237 107 -28 -22 92 -153 85 -148 61 9 -48 65 -77
5120 -77 -76 -121 -93 -192 7 132 48 92 74 -9 -8 5 194 -156 89 5 -38 195 -155 -58 -111 -74 82 -229 259 10
5146 10 -117 -218 82 -67 -115 69 -309 -191 167 106 -43 61 120 27 -119 155 59 -37 -357 -50 106 47 -180
5169 -180 -93 96 423 116 -269 77 -218 -2 -40 129 177 -298 -247 -93 85 -10 -139 -13 -188 12 52 63
5191F3k37N5m7O4m8j49L31k96J56j92L13j53K07P4Q9j74j42J34J3J43Rm19M80
5214B74l60K90k57j5r7j28L85k45o0L4K1L33m04O7J43O3M5k47q1L07m3l11M09
5237A23mN2j69l09L22J59j38m6R8j35j88K47k61j02J73K83k65K32m9j16J22l21
5259b92M50j68R3J76k23j9j99J20n1J49p2r8J65J0j55KL73n30L84m3j4J05J09
5282B72m92O17m57j33K9M07n02K10j36J57R6j29r5J27J1k11N4J65m3M8J59j56
5304bP3m4J4J7k12K67j70P2j59J90k39L77j80j67J72j93J44j6m4R2j18J30Q1j13
5328b8K71o1j23m42N34o8j22L77k57k1J7j07r3p3M14k61L02k39j22l9J64r3n9
5351a29K28j65K2j51J12K24j02K5k74K10K2k67L40K2j89J88%l71K29N9k6J0j47
$$ plain form
5191 63 -174 -119 -166 -102 -150 -299 32 -264 -108 -300 13 -140 67 141 230 56 -86 48 61 204 213 -206 274
5214 274 -86 204 -53 -68 -165 -293 92 -153 -213 -179 -158 175 -229 -162 -19 44 89 -158 -239 68 25 -286 123
5237 123 119 171 2 -307 15 174 36 -10 88 -47 -235 12 -249 -351 -178 105 -160 72 23 -93 29 -292
5259 -292 158 -10 83 259 36 17 -182 -62 -113 36 -36 -134 31 41 -114 -112 261 -269 115 72 58 163 272
5282 272 -220 397 -60 -193 -164 243 -259 -49 -185 -28 68 -61 -156 -29 -18 -229 -175 -10 -53 -5 154 -2
5304 -2 71 27 41 58 -154 113 -57 15 -144 46 -193 184 4 -163 9 -184 -40 -56 -100 -8 -126 4 85 -28
5328 -28 243 182 59 -383 151 83 -39 338 81 60 77 -30 -123 -196 218 -43 259 20 -102 -141 23 -70 -129
5351 -129 99 -66 -44 -195 -83 141 39 64 -210 0 22 -245 95 117 -72 116 116 -255 -26 33 7 17 -130
5374a30K12l5j3j04NK18k15J3K6j34R6k86N47m36K60%J25k38J29P3K7j27k40K94
5398F7k39p7L55k01J35j8J33j56N3k30L21j88n2k8K2K26l41J48L2J7K16q9j64
5421e8K48q8j37R4P8j91M25o27J73K32j68m3p5J3M8r1j2J24J44k27L42p0j85J37
5445H6l1k5j57ln4J56%L1j92J35j35L13l02J10j43R8L6Q6r5K58k21M1R8j29jl5
5471g5K95k41k10K01j51J20R6m3K22j95O7K16k88J87k30o9j76K22J08m0L54k21
5493A49n5k76r2K80J7J14k31L9o3K58j64j21L20j69j18J73p1J05K20m09J74j55
5515g5q4K20j21q1lJ73M1j62pj15J54k11N7J43k20L37K38l48K1K02N9k21p2J71
5539I6r1M2m5k38K35k56J1J27J41O2J2R9r2o7J22j30k40K80k18L83j20k95K58
$$ plain form
5374 -130 82 47 34 -70 -65 153 -62 -49 -23 -157 -61 -347 200 -236 24 24 149 -89 40 113 140 13 -227 67
5398 67 -172 -249 106 -95 40 22 155 -1 52 -178 143 -45 -97 -125 -103 123 -218 -70 -38 -21 195 106 -58
5421 -58 190 102 -35 59 137 -54 371 -256 -83 149 -19 -62 -137 -124 -76 -167 -179 -55 89 -138 204 134 -51 86
5445 86 55 30 -127 -130 -184 -28 -28 3 -189 -54 -189 124 -178 -68 -211 -113 -77 9 -86 172 -49 -8 90 -39 -40 -75
5471 -75 220 -21 -231 -30 -181 -61 35 -8 214 19 86 302 14 201 -29 -98 -274 -52 56 16 370 149
5493 149 94 -182 -274 6 23 137 -94 -55 -118 140 -24 -145 175 6 -112 61 -10 95 315 -94 80 -75
5515 -75 -159 61 -60 -141 -144 29 70 -92 -99 -214 -60 -271 -214 -71 -291 46 284 -64 -43 159 218 -3 -75 96
5539 96 5 47 2 -236 -1 -257 -246 -119 22 84 96 195 103 36 158 28 -212 68 -150 233 113 -182 76
5562G6j83J94K4j51j79K15j45K45k88J69j36L11j42J51j10j10O33p98O4J61j92
5583a91K19K6K39k47k48jL41l23N4M50m85J67K24l41Q3J43j03J05p9o1K7J0o8
5606e9k8K35M0j61m9J57n1J65l72J67K73m39J99r8j47L97k14P4m06L36J51m16
5628b46N54k98j61P2R1K3J80j84J43K9j26O7j78J10k9J8k30J3J73K09l55p7L14
5651A12k10J56k47n1K52j5K9L44n63J79K46j45n4K3K7R7j44K72m00K28j27J33
5673A42J20m67O0M12m52k77L29Pk56L88L6l5J60l22K61q5nNL6Q2L7k19l0K42q8
5698H1K42k82k19L3J76J62k53J4K3K2K09l1k8K60m80J30n2Q2k88K71o0l9K8k20
5722b19K81m3R3l21L24j89j5K39o7m41K75J58q1K38l02N1J8op2K24P7l50J03J10
$$ plain form
5562 76 -107 87 111 -40 -219 -4 -149 96 -192 -23 -159 152 10 161 51 -59 574 -224 -160 1 -191
5583 -191 28 54 293 46 -202 -203 138 -185 -131 319 -166 1 225 -116 -33 110 7 112 33 -28 -1 9 -59
5606 -59 -87 148 188 27 -22 135 84 249 -123 44 317 -122 77 -21 -168 229 15 89 -317 19 170 -246
5628 -246 308 10 -151 -79 12 35 215 31 174 203 77 144 -34 76 47 65 -165 -152 21 230 -125 -202 112
5651 112 -98 58 -189 -240 12 -3 26 370 -193 -14 232 87 33 56 83 180 36 308 -92 136 9 142
5673 142 262 -205 -145 267 -185 -462 -133 -126 -382 6 42 7 167 -155 106 21 16 21 57 139 176 -43 -73 169 81
5698 81 323 41 -178 -145 31 193 -60 -46 -23 -1 208 177 149 409 -71 59 7 89 -199 72 12 -27 1 -219
5722 -219 62 19 112 -209 115 -74 -89 150 83 -358 -83 75 -6 232 -70 -19 -1 -7 -79 145 222 -128 -25 85
5746H5j34O9j03J38l08L25k28K32l5k50J20J08N2Nk36M4K88n9k46q8O5P3q2J11
5770e4P8j47J63J32j82K19l68K69j19q2R9k22L05j97J32o9Q2j6j43m7L45l00K7
5793i5J50j06j06M22k00M1j05m6J57j56M72l01l20J49K26k39N6l9J55k06K41Q7
5815B37k89J14q8p1o0K01Q6P7m36L75j13M3J13j96J33k31O9R5m0L26k93p7J9j4
5839b0q6K55n5l0N4k70J99J17k1J12k77M65m58O5L7j93J79J2M6J27l46J05jK04
5863B20j59K09l63j30J56K50k23q7M01n06J83J27j83J85J36l60M0j52N24l20r
5884f1Q1p1M36k60J27k27j93K54j46Q0j03M1K34j14L0K08n19K74M3j08n0J27j24
5907d1k08K09Nj00r0L42j10J02j48J91K31l17j96J21j69j69L60l7j51N75l10j92
$$ plain form
5746 85 -49 20 -83 55 -253 72 -156 76 41 -209 -89 19 71 76 -160 -116 172 113 -133 -221 -156 -83 -165 -54
5770 -54 24 -123 40 172 -10 209 -159 110 -9 -91 8 -214 91 -106 26 -43 39 23 -120 -167 178 -122 -95
5793 -95 55 -51 -157 265 65 106 1 -45 112 -44 428 127 -193 -44 182 -57 -1 -40 115 -91 150 237
5815 237 -52 62 -26 -97 -157 44 130 207 -229 146 33 76 189 -7 126 -105 -36 59 19 345 52 -25 -6 -20
5839 -20 -106 149 94 64 118 -152 47 164 143 255 -22 443 -15 50 87 -106 73 85 131 258 -88 17 16 220
5863 220 61 270 -93 -223 -67 183 -40 -127 274 -232 -49 78 -105 80 216 -144 -104 -256 268 -52 -61
5884 -61 20 -51 385 125 252 25 -168 86 -60 20 -83 -42 192 78 108 316 -203 71 114 6 -44 83 -41
5907 -41 -249 -40 -35 -135 -225 117 7 109 -39 152 383 66 -130 -9 -178 -347 13 -24 -175 400 90 -102
5929a02J25r6J92Q9l9J56l10O7j08n7j94K50j19j4M8j06J30M5K00l13J76j69R7
5952e2j68J32qO1L5%j86J51J71o2j52K79j27j78R6L73j88m47K42J58k89M48k14
5975G5q8j11J35J7k55J38K47o2k3J05k01k58R9M2L10j34J14M8j80J22j10l1j67
5998a68L32j78p0k14L89k49J44K04k91k7M1J27J56m10J26j02O9J99J16j21j08
6019c5J28l25J68m8j66L75m9j97J17K50k96j31J17p1L37o5J83k88L36m92m9L46
6041A45qk44K2L71j55k84P8K35L03k29j85JO4n17M87K09l66J72JJ0N7k85K09j05
6065a4k77M73ok51J19J47k16q8M8O4J4J68m5j70j62O1o5M28j81Pj39J11J13J12
6089B51k10o1L05j85J01m51L69k18L59k64j17L46j80J38k75J91p1P3o4j10M6Q3
$$ plain form
5929 -102 23 -73 119 208 169 325 15 82 -26 -83 -277 -27 -146 -160 -112 -218 -88 -43 157 -156 20 -149 -52
5952 -52 -220 -88 -96 -35 0 0 -186 -35 136 74 -78 201 74 -104 -8 365 177 -270 -28 130 -159 289 75
5975 75 -13 -124 11 28 -227 -89 158 96 73 178 -23 -281 -182 -140 170 36 150 198 18 140 30 -1 -168
5998 -168 164 -14 -84 -298 91 -158 -14 190 -101 -128 -87 40 196 -214 -88 -190 -121 78 194 73 -35
6019 -35 93 -232 -64 -112 -278 97 48 -149 -32 218 -78 -209 -92 -163 174 109 292 4 340 -152 -201 145
6041 145 137 -107 -85 286 131 -153 -75 160 463 234 49 50 114 -403 84 293 -73 99 100 110 167 -118 91 -14
6065 -14 -291 182 176 -75 44 191 -25 -113 -65 -1 13 181 136 -34 -196 -135 -200 228 47 54 -85 26 139 251
6089 251 41 -20 285 100 201 -250 119 -99 260 -4 -121 225 45 183 -92 99 28 101 37 -73 -27 56
6111E6K22n2O4j80m30K39n2L6K0K25J7j2p3J69k05k4K07l07K2q3K26l5k0Q5k63
6136a48J33j7M5j59K35J44k35QK97l43J94m1k87J53k14J31L15l77M4J15N6K3j46
6159g4K43j60nj08K47j62j3q9O8K67m3j53j83O0M0l5P3K25j54J73k59M3Q3K13
6183B97n04J71J71k58K26mk56M3j21L23j5K60m32J36j59J83L31j89l07L46k55
6204a3K59k51j12J73k27L9q8R0M7J70Rj84J68O1k04L31l72L05l04K70O5k70M1
6227CPL23k61K4k78K23Nk78N02k76N1j01O3K3J70k58K53l28n8k5J99L44k65J21
6251A83l94M36k50l96L29O1o7Q7J9l9L7N6k15J87J9j2J33L7k15j8O3q0m8J18k26
6276a95L08k6j64J34j48K54k02K24k57L25k9k37J17K6j05k43M03k12K36l10J04
$$ plain form
6111 56 278 226 290 110 -320 -81 -133 -97 -77 148 165 153 80 249 44 20 227 -80 -58 -141 85 50 30 115 -148
6136 -148 -15 -32 13 -146 89 233 -2 6 303 -40 154 113 -174 -21 -235 -104 211 -166 -122 -7 49 72 -74
6159 -74 169 9 4 -104 143 -19 -32 -121 -53 214 171 18 -165 -105 -65 -100 -27 198 44 217 -42 1 84 297
6183 297 -207 -36 135 -123 103 99 -157 -114 -235 88 73 333 -99 37 -122 61 392 203 -104 242 -13
6204 -13 246 -5 -117 56 -171 -132 -220 -130 -83 87 96 -88 80 141 -63 268 -104 201 -103 167 232 -38 3
6227 3 10 333 72 96 -182 41 46 -232 270 -6 45 -56 7 30 200 -58 195 -133 -191 -216 -17 327 62 183
6251 183 -211 225 -25 -421 -92 -31 -98 -11 8 -31 6 62 -153 34 53 41 174 211 -4 -22 41 -39 -87 31 -195
6276 -195 113 87 -77 57 -91 163 -39 185 -72 253 224 -13 104 130 25 -218 185 -27 209 -101 3
6297CJ69R4l50p5Q8L09j66J56k31J09j07qK50k35j11K34k59L2J01Q5J87j44l88
6320b57J82K19j65k79L72k77K84J7k18K66j18p1R3K83k83J03p5l28L73o7l78M69
6342A45l16L20n7j0J43J59m50K40m16L64l63L49q0O6L11n66J26j6k16L82j35K03
6364A83q8KJ56k15k75K33o9K02n3J51j57o8q1p6J22Q2K42k42J46m53L94l41L36
6387A31l99K96j34P9j45L64l63PK16J47j25K16m57J1J71k23J78L9K1J0L29m58
6409h9J33n1J82rL7j19o2j33K91j08k11L15j13Q1n8J62k93L6j8q2j62L74k3Nl5
6434E0k32M43j17j83o0J24Q6R5l56K13L1j7o2l2m5p2O7P8R3r5J02n1r8j1nq5M7
6461i2j29l7J92pQ1j19M3l1L25o8j42q3k18L80j00p2J95k03K2KR7k1j92L53j72
$$ plain form
6297 3 172 266 -84 -159 -71 238 72 228 -3 106 -1 -9 241 6 -105 129 -130 -98 3 88 275 131 -257
6320 -257 -75 144 -21 -300 72 -205 79 96 -122 144 26 -45 48 331 48 151 76 -252 121 54 -324 145
6342 145 -171 149 92 82 225 384 -66 174 -242 122 -241 108 28 94 405 -161 -35 -51 -267 115 -20 183
6364 183 95 97 253 38 -237 -4 -73 129 76 227 70 2 -79 -155 -33 49 291 49 195 -258 136 -205 131
6387 131 -268 28 -106 -27 -172 192 -171 -164 52 199 74 290 -167 -156 15 -208 -30 9 30 40 369 -89
6409 -89 44 -7 175 166 203 84 22 -111 180 72 -139 176 63 144 86 248 -45 -9 -27 -109 -271 103 80 85 50
6434 50 -182 261 144 -39 -99 25 111 206 -150 63 94 77 15 -17 -62 -134 -67 11 104 9 111 60 -38 -49 -54 -139 -92
6461 -92 -221 -258 -66 -73 8 -111 -68 -99 226 158 16 -67 -285 95 -5 -77 118 -85 -63 -61 36 15 -177 176 4
6486Dn2J10k8k43M52k63J41K4l24J17N0P2j10J78J62l20O5k17J02K1L58l46J55
6509A08K5k40QK83k72M6l71L09Q7J03p1k30N85l16j43J73l75J14J70o2K47K1n4
6532A45r9j0l00M92k41q7k26L81r9J62j60K9j58K57j2l9k1j85J15J13l12L84r6
6555C3J87K40l44N1k17K16K3j06j77K9p3k04L51m0m2K79l37K29k1Q6m9j22k75
6578b83K86J17L79m91j48J73n5J1j18J47P5j17m4J77j29q9q8J89P4p6R4J15m28
6601b29L76j40j4j98K32J90m47O7L74J00k67J8m17L39q2J80j17r5M06k20j51K77
6623A82M5j03k9k40J57J02J64k10j92L94l33K24j53k05K55j66J53J3N3n1j12J14
6645F2qj93r5L30r2l10K33N1j12L27l30o4L03j59O1j76Q3o0K14K7K03j42r9K15
$$ plain form
6486 4 -48 62 34 -209 243 -20 121 145 -179 -62 -12 60 -50 128 290 -30 35 -182 -80 -59 299 -47 108
6509 108 133 -107 -99 184 -88 -42 -413 -104 -17 86 15 -215 370 54 -89 84 -291 -177 -7 -69 178 199 145
6532 145 46 36 -264 228 -13 -100 -326 55 -44 118 -42 -13 -171 86 74 35 14 -171 -56 57 -255 129 33
6555 33 220 460 116 167 -50 166 189 83 -94 -65 -138 -342 9 -31 -73 206 -131 98 77 163 114 -8 -283
6578 -283 3 120 499 8 -140 33 -22 -11 -129 18 93 -24 -68 109 -20 -109 -197 -8 66 -10 84 199 -229
6601 -229 147 7 -7 -205 27 217 -230 -163 211 311 44 62 -355 -16 -98 82 -35 -130 276 56 -95 182
6623 182 227 124 95 -145 12 114 278 68 -124 270 -63 161 8 -197 58 -108 45 58 111 60 -52 62
6645 62 54 -139 -234 96 4 -306 -73 -22 -134 193 -137 -201 102 -57 4 -172 -89 -149 65 92 295 153 54 269
6669B69k12K63m31k4K48J59k87J53l85M52l9l3N0k39L6K9L9m14M90N0m31K92J96
6692B31k08%K8k61J33J32k61K69m0l2L29l51J55K91k23m16L10j63mM6k62L44j34
6715h7nJ97o5o9j17K45%J51j72r1JJ5L7q5J07j11R5M6k08K95q4k78K20L4r9l1
6741e9L09k33j3l2j40J74R3j50j52M51k97j84L66l98K49J5P7n9Q1j81O4n0J45
6764G6j08J0K9j69L10p0k01J41J50K6n15J65J97J15R8l23N7k34K32J9P0j61l0
6787a16K11k6k70J98q2M6qJ3k13K8J55p7K30J6J56q9k35m2J76rn9K97o93L05J45
6812E7L3L5O6J16l95K08Q8k42J56j47R4K1j24K5J54j38J13j06J34k88J82kP5p8
6836C7J17o3j27m0m9K20k05K28k19J16J04K4k79K22j88O0L9J0q3m5l6L66q4k18
$$ plain form
6669 269 57 320 -111 -135 113 272 -15 138 -247 205 166 133 183 -56 -20 9 48 -366 124 174 -257 35 231
6692 231 23 23 51 -210 -77 55 -206 63 23 -9 320 -31 124 415 192 -224 86 -77 -81 -35 -297 47 -87
6715 -87 -92 105 40 -29 -146 99 99 250 78 -13 -12 3 40 -45 62 -49 46 92 -116 179 95 -183 37 71 -28 -59
6741 -59 250 17 4 -28 -168 6 99 -51 -203 248 -49 -233 133 -265 -16 -1 76 17 98 -83 -19 -69 76
6764 76 -32 -22 7 -162 148 78 -123 18 168 194 -321 -156 41 156 254 -69 -12 -246 -14 5 75 -86 -116
6787 -116 95 69 -201 -3 -85 -39 -47 -34 -247 -219 -64 -141 89 105 261 172 -63 -105 71 62 3 300 -393 -88 57
6812 57 90 125 191 307 -88 120 208 -34 122 -25 69 90 -34 -9 145 7 120 14 148 -140 42 40 115 37
6836 37 154 91 -36 -76 -125 95 -110 118 -101 15 119 143 -136 86 -102 -42 -3 7 -76 -121 -157 209 125 -93
6860i3J99j56L53m02K02k60K5L18l87M26k00Q0L9m6k63N1M0L02n4l29K72k18J04
6883CM8j97K62l09m3M93k70m14M63Q1l49K75o6j72L64k3l12K29j17k14M51l13
6905a30R7J6j44M36k54L40m05J5J4n0K17l40n4K24J63q5l12J36L92j70j14o8J08
6928C2j3p6K11j87K43j64O6l5j33k89J86K17J13Q8l46P6R4k61R0Rj15N89o43K05
6952d3K32N9r8j06n05M91m0L3r5L18Q8j44j99k5J00n9J29j70J45j35j02p1J39
6975e8K98j0k52k7J20j6L3n2nL2j24R4Jj37k7oj27K93j9Qj80K80k06l8J21N8Q7
7002A41k19j63K90p8k63K02j62L77o4KL2J2J41l36J9Q4j18M09m29J49P8k3K56
7025C37k91j35L04j27j41N0p6J92k63L55l51L10k96r9J65M02k21m08K95O5j21
$$ plain form
6860 -93 106 -50 303 -99 103 -157 -132 186 -201 225 25 105 144 98 -165 -114 -74 228 174 -155 117 -101 3
6883 3 51 -146 116 -193 -236 257 -13 -427 36 117 -232 43 -23 -195 169 146 -166 63 -54 -268 183 -130
6905 -130 -33 -17 -161 275 21 361 -44 -29 -15 -65 152 -188 -242 -18 145 60 -252 -116 276 106 -8 -76 32
6928 32 19 -57 154 -33 210 46 112 77 -56 -345 -159 58 171 259 -87 -11 83 -178 -88 -79 -194 395 -248 -43
6952 -43 189 248 150 44 -461 30 -10 23 -72 246 334 190 -9 -34 66 7 136 -34 111 -24 -126 -197 -58
6975 -58 240 230 -22 -49 71 55 88 36 31 63 -61 33 34 -103 -130 -136 -263 30 11 19 -161 119 -87 -125 -4 54 141
7002 141 -78 -241 49 -29 -292 -90 -252 125 61 63 95 107 248 -88 -69 15 -103 306 -123 26 104 81 337
7025 337 46 -89 215 88 -53 -3 -79 113 -150 205 -146 164 -132 -231 -66 336 115 -293 2 67 -54
7046e4oj37O2q0K99r1K00j11o8k8J39j52j0L95m44M3L45l55r4K87R0k55L8k42
7070b29L04l70J38K99l72L68K0P5k04r0P4K66k80r4k0J61Q1m3k6n4L6qk24K69
7094G7%j37j70K37r4j01K87j69J57k04K64nl01K02k0r8N9Q9j19l2J08J78l77j47
7118c16J88J45r3J85l76J66P1j07J5J36k03L35k59K73r8l75J41q5J45j2J08R8
7140H2l7L0l6j68K78j65j36J80K7j78k0M1k83O28l07m9J43j00m8K67j24k05K44
7163F4l20P9K61M8k74J28j54J64%j26Q8R7K2L7j03k00j17M12j20r8L9N4K5k6L89
7188C69k87j90J00R1kk33K53l3p6J21o6L5M6k45j40M08k20K78j35m5O1qJ13q6
7212A09k3p0J14j1J59l49L35n0q4J4o8j78J2J97k31K54n2K4j32l6J59m8Jl50L00
$$ plain form
7046 -54 -60 -197 -135 -215 84 -7 193 82 14 -14 125 -27 -37 358 -86 -43 302 -53 -147 140 230 -25 13 -229
7070 -229 75 -295 -157 142 -230 138 158 233 29 -61 13 279 -1 -95 -115 46 127 84 58 4 40 32 -192 77
7094 77 77 -60 -230 7 -87 -188 99 -70 87 -117 147 142 -159 43 23 -75 -16 73 -46 -78 30 208 -169 -316
7118 -316 -128 17 -76 109 -267 -101 -30 -137 -122 14 -189 146 -113 160 62 -313 -172 -257 -112 -124 -16 82
7140 82 45 75 39 -129 149 -16 -152 28 55 -123 -143 -102 -385 243 -64 -113 30 -70 -118 149 25 -180 64
7163 64 -256 -177 84 132 -142 -14 -168 -4 -4 -130 -42 55 77 114 11 -189 -306 106 -14 -112 -73 -19 6 -20 369
7188 369 82 -108 -8 83 81 -152 101 68 -8 113 47 82 128 -117 -257 151 -69 209 74 29 90 82 195 109
7212 109 86 16 130 119 278 -71 264 214 130 144 76 -102 -90 107 -124 130 78 102 -30 -66 93 45 46 -304 -4
7237dK31q5k32J00m6l8M03l68K2L2p9j79J36M05l69K21q2P4l96L45n1K12J0m30
7261a68O3K32Lk49L05l20J9J90J32kl25L80k73j1k00J94P2L0j41K14j30J25k49
7284a09K80j68K00k59J95k57K19K25n71J89J77N2K9R6l59R2j32J92j92K35k24
7305i0J62k43J01P1J19k85J87R3o0n4K70l51j55N09m62J90N0L9j77J45K0l54n7
7328c32M57j20l4J42j41Q2k21O5K4K82j89J71k45K16j32j90J5K87K7o6k24K9J44
7351D7j0K0k40J81L2M34m83R3J7j31n0J18J36n72M83n0k02m8J94j84J52L2j8M3
7375fNp9R5K47l79J88j59O0P6P0K2j82L16m49j0J82j13J2O0o8P3O1l05J61nJ99
7401G2O6j39j12L8R9J56m19L77j42r8K35k07J33r2j76L67N7J5k53L6j82L4J44
$$ plain form
7237 -4 227 142 -90 10 -36 -74 329 -39 -17 15 -64 -243 -107 298 -71 150 68 142 -254 91 40 252 262 -168
7261 -168 -105 127 130 -119 186 -134 -115 75 207 205 -120 260 -13 -24 -224 -30 42 72 -69 145 15 140 -109
7284 -109 171 3 203 -56 139 -118 101 326 -245 -56 121 173 202 298 -61 31 -101 91 -101 134 -90
7305 -90 72 -171 -70 1 120 -165 22 115 55 1 271 -80 -235 274 -188 2 52 91 -86 59 79 -275 -332
7328 -332 125 5 -29 113 -28 54 -167 -102 -78 204 15 186 -59 157 25 -165 -150 137 164 98 -126 -97 47
7351 47 37 57 -183 -2 30 464 -19 74 91 -40 -90 28 164 -408 75 25 -177 -225 -31 -215 -63 -31 -49 -6
7375 -6 -1 -80 15 262 -117 71 -88 -28 48 118 140 -42 274 -175 -185 -3 -116 -104 -44 -112 -39 22 -283 -122 -127 72
7401 72 138 -1 -113 -75 24 180 -239 138 -4 -102 133 -74 59 -33 -209 158 215 230 -23 13 -169 -135 9
7424Ij04J50p1J52j5k0j61O2L6o7j01J47M1j68J03J00M4k68L63q6N9l37M6P8j69
7449a77J91Pk04j4L56r9j17J27k31K19k97K45m5j19L31m23L98op4k05o6J15J78
7472I0k85J70p0K79oj39O2l49r0L93j82M36m07O6j75P7R9K03k12J32j33J54j39
7495b6j94mJ98K51n00K77K6j8K19J74m16l67N53J60n38K87k42K11q8O8k87K9K78
7518E1M5j01KK10k28No8K80l40j98L58j52K22j86j68M33k6j22RM9k42J78j16k84
7542c89M39k6J28k92R3K4j22K08m5r8J38J8j60L4J93j24JJ35m65M31j19l8Q8L
7566E5l26K55Q9j51K71k12J46k23O0M4l7j37L86l45K57k35l12N30j28k9k4K78
7588B12l89K54q8q3n1j85L13j86J53l0L53l23K21p2p3J63j62j7N6R1l37K89j50
$$ plain form
7424 9 -95 55 -16 136 121 101 -60 2 38 -29 -130 17 58 -110 -7 93 137 -131 232 146 205 -132 -86 -8 -177
7449 -177 14 21 -183 -197 159 60 -57 70 -161 58 -239 6 -39 -158 173 -250 148 142 68 -137 -203 -88 90
7472 90 -195 -25 -95 184 178 39 101 -248 -338 55 -127 309 -98 -32 -207 -130 -31 172 -40 92 -41 113 -26
7495 -26 -220 -224 -26 225 -275 2 28 10 229 403 -13 -380 173 333 -205 82 -160 51 -37 31 -256 -227 51
7518 51 96 -5 -3 207 -21 -16 -84 196 -144 -342 16 -136 86 -100 -268 165 139 17 26 75 -167 11 -105 -389
7542 -389 50 24 152 -140 -47 -23 -145 63 18 -80 58 76 -84 -50 143 19 20 155 -310 121 2 -36 52 55
7566 55 -271 -16 73 -78 193 -19 127 -96 -36 8 -29 -166 220 -125 132 -103 -415 115 -13 -42 -66 212
7588 212 -177 77 -11 -94 -145 -330 -17 -203 -50 -80 273 -50 171 99 26 189 27 10 66 157 -180 109 -41
7611d1K14%k86L19m0q1k80K24j23J29j17M3K0J82L0k59K28k37KK23j07J34k24
7634d7K59k34J22k9j03J34O5l40J93L5k18J95K54j07k75J25l37J90j01P8K37l51
7656b55L70P1j25O4j76L58l47L67k50J97m00K16o9K22l89K28j30K3K07O1n23J90
7678i0M7j17j7P1J7L47m6k06j09o2J98k12M70j00k76K85l1j53J66k39K64j72P1
7701A06nqr3k58J34J75L9k33L94l65M19q8L8k33m18L15l6r0J85j16K18K3o8q7
7725e2J85k59J54l9j68M63l48nl6K19j69j57J26R9r6J4KJ85J4r8K4o7p2k96Q64
7750D87m93J63k59j4L7N1K65l97J65K78k07j29Q0K9p3J3P9j18K4j64L26j54p5
7773h6J22K2o4J67j96j3K65k62J88J11l55j07O9R0J36K0Or3K81n1j91P6n7j75
$$ plain form
7611 -41 173 173 -113 206 166 85 -195 29 -94 35 -82 -39 -19 163 193 -66 162 -75 -73 150 43 177 -47
7634 -47 212 -22 100 71 -32 102 167 -173 20 55 -163 32 286 179 -96 29 -308 -118 -219 -141 96 -255
7656 -255 115 186 61 125 -51 307 -40 327 77 274 -126 90 21 243 -146 82 -48 -25 182 243 -280 -90
7678 -90 -43 -160 -177 -106 -89 258 212 6 -103 -165 33 -179 291 191 -85 200 169 16 182 -57 207 35 106
7701 106 101 93 0 -258 -124 51 90 -143 251 -114 305 217 255 22 -396 -81 -117 -207 -22 -138 80 103 35 -52
7725 -52 133 -126 28 -11 -179 284 -64 -69 -105 114 -55 -212 -86 13 -83 -69 -67 118 132 34 58 -9 -81 -377 487
7750 487 -6 157 -102 -116 -79 -28 237 -160 5 283 76 -53 27 56 -17 -4 75 -43 -19 -183 143 -11 -86
7773 -86 36 58 -6 161 -35 -48 217 -45 143 254 -101 -208 -139 -49 87 107 113 20 301 250 59 135 78 -97
7797i7J86m6j0J3P7k88J03qj9L90l37R2j90L23j57j55k8M65l03K07k89m6M01j76
7821A08j78J49l0k08l4J32J40l8q7j73J87lP2k00M18m75J57J48j09M20m13J28
7843A11k17R4J15q4K61k76j36QQ1j16J97k45K55k0L9m9J35j61k0j20K4J26N1Q6
7867A39j19Q9j62K09l84L57L4k76K12l58K69Q3k18J28P3J3J35j61J14n59M20r0
7889e2j55K46k5J8k22L16J22r9p6n6J71j50r3K73l42M3K55k28o8L97k85k9j05
7912a44Q9j79K7J24J22m7J1j82K06q0L7O0k79K68l10qL25q2J0jj4r5r8M64j53
7937G1m3q0J8L0n2j5j04N3M8j51M93j88k94K66j38R0J53k68M21k49l58K95l16
7960c18L81k4L2k1km8L5k20Q1J61Q5l8M3m5j80M0J02k9K67j24j78N2k09K09k24
$$ plain form
7797 -97 89 43 33 46 123 -165 -62 -70 -89 301 -36 56 -134 189 32 -123 -151 314 11 218 -71 -117 284 108
7821 108 -70 79 49 -159 -193 -61 79 41 -46 -219 -32 -35 37 -163 255 -220 -63 85 -24 396 -17 111
7843 111 -106 -12 103 19 280 4 -132 -124 -43 -159 38 -207 48 28 67 18 153 -8 -28 -148 -124 2 53 139
7867 139 20 109 -53 156 -228 129 163 -113 99 -259 10 93 -125 3 76 89 224 63 177 -382 38 -52
7889 -52 -207 39 14 32 -190 126 248 149 73 17 188 38 -55 218 -124 -81 174 -54 -122 275 -10 -39 -144
7912 -144 -55 -234 -207 -83 39 -8 3 -179 27 -53 -16 44 -235 33 -277 -285 40 -42 -32 -33 -47 -142 -240 224 71
7937 71 28 -52 -34 -4 -56 -71 -175 -122 -74 -225 268 80 -214 52 -86 4 157 -111 310 61 -297 -2 -318
7960 -318 63 39 71 50 48 0 35 -185 -104 57 142 104 147 102 -78 -38 64 35 302 178 0 52 -157 52 -172
7985a72J74J54j92Q8L6o7J00m8j0k18l4L19j43N0j9k09j36L36k57K68k33L53m
8008A36k12r6K07m5l7nK67j84j4j24rr7K99k18J29j07L33l51K80k9k8j96K44k96
8032a53J84j85N3j4J05m3K84m94J61K83K2p9j25mj71J86j46M9O2K05j35j47J31
8055B9m9j2K10J60m35j14M64j91J2j25m0L13k51l7nJ58k51R8n9K62p7J70j50l71
8079b91J38mK53r8j33J34J41p2m1J94j88m2m7K56q1o7P5l4q3P1q5K09j98k14K42
8104C5K22k53l8o6J35n5K69n74K03K40q1lk43J64O2j4j12j12j12K60K19l05J86
8127B7J43l06J0J97K7Qn0l12K81K00l07m5J31j31K80j80J36j75J08j25R2k4j81
8150a96j04J53K93r9J21m62L49o3k56J66J04j03r1L80j65Q9m60L75L8P3m50K45
$$ plain form
7985 -172 2 156 -36 52 88 21 121 73 63 -155 -189 130 -13 37 18 -191 -327 9 -248 20 -213 140 136
8008 136 -76 -172 35 -10 -47 -52 215 31 17 -107 -116 -213 86 -132 -3 -110 223 -128 152 123 95 -101 143 -153
8032 -153 31 -154 -101 -115 -10 -53 231 -263 -102 181 203 124 -1 -5 -176 10 -136 -87 -25 180 45 -102 29
8055 29 -20 -32 178 338 -97 -211 253 62 74 -51 -91 222 -29 -66 -71 87 -164 -66 -125 137 60 230 80 -291
8079 -291 -153 -157 96 -2 -135 -1 140 68 27 221 33 -9 -56 200 119 52 127 93 10 81 -4 205 7 -207 35
8104 35 257 4 -34 -100 35 -20 249 -325 -122 118 37 34 -209 -45 17 3 -109 -221 -333 -73 146 -159 27
8127 27 170 -136 -126 71 98 106 56 -256 25 225 -82 -127 4 -127 153 -27 109 -66 42 -83 9 -15 -196
8150 -196 -300 -147 146 47 168 -294 55 -8 -264 -98 6 -97 -188 192 27 116 -344 31 69 142 -308 -63
8172f3L67m13J10k76K8M83l06J72KJ03j94n7J6L0M5q5J22j49j47
$$ plain form
8172 -63 304 -109 1 -275 -247 236 -70 102 104 207 13 -44 -28 2 47 -38 84 -65 -212
8191b12
$$ Imaginary data points
##PAGE= N=2
##DATA TABLE= (X++(I..I)), XYDATA
0@%%%%%%%%%%%%%%%qJ6j6J6j6K2l0L2l8M6n3O1p2Q2r1J05j21J38j57J79k01K26
37A20k55K85l17L53l93M37m85N37n94O55p24P99q78R67j065J174j294J428j581
56h31J753j951K178k444K760l142L618m228N044o196P959j1025J7875o4789L5068
71a8351Q9436p7607k2146L9526N186l0396J4008J834m125J1743O921k1506l574
84i051J6970J8736j0347l3605j3800K8930J0946j5969O057J3589j8630j3337R760
97i751Q914Q568R434j4145j1609P704M665K273Q716j2391j3033J6614K085k1307
111a3263J4715J8949l2024j9035K4613L889n555K4983L089l0790k812J4374n522
124d389M640J5220p980j0152P252K817k042m39q802o246K201m482L543K0000J487
$$ plain form
0 0 0 0 0 0 0 0 0 0 0 0 0 0 0 0 0 -8 8 -8 8 -8 14 -16 16 -22 24 -29 32 -40 42 -49 56 -65 73 -84 95 -106 120
37 120 -135 150 -167 186 -207 230 -255 282 -312 343 -381 418 -460 507 -558 616 -678 750 -831
56 -831 922 -1029 1149 -1295 1465 -1677 1941 -2287 2757 -3439 4520 -6505 11370 -53419 -18351
71 -18351 71085 -6522 -28668 10858 16044 -14352 -344 1490 -2635 9108 16029 -5477 -9051
84 -9051 7919 26655 16308 -17297 -31097 -2167 8779 -7190 -1133 12456 -6174 -19511 -9751
97 -9751 -837 7731 17165 3020 -8589 -885 3780 6053 14769 2378 -10655 5959 8044 -13263
111 -13263 1452 20401 -11623 -30658 -6045 -2156 -7711 17272 20361 -10429 -13241 1133 -4389
124 -4389 251 15471 7491 -2661 4591 7408 5366 4927 -3875 -10121 -7920 -12402 -8859 11141 12628
139A2628j7034j101j298r059J4985J7854j1981o693Q526o477k691J5735l858j6453
153f917M937K772q850P482Q112j1955k375M922j0863P90K2028L969j3528m436
167c912k716P28J2662L092o654M727j51j0998K271M796p484n06K959j0656J532
182a0310J7828j66q622K596p826r026J4444Q806p523Q003P706j6526n927J3004
196F461j461o852L711n821n905J1478M395r023P51J149q286J761P225N84N276
211E443L446j1181l445R806M53o23O642o755r773O825Q62q029N613M196j1041
226g561M96Q752l323L21O695r182p109J1281K562l347J0945L040j3298j951L883
241B204n073K206N047q079j588Q811l975n068O989j956p939L243J948o22J0287
$$ plain form
139 12628 -4406 -5507 -6805 -15864 -879 16975 4994 -1699 6827 350 -2341 13394 9536 -6917
153 -6917 -1980 792 -8058 -576 7536 -4419 -6794 -1872 -12735 -11945 10083 14052 524 -3912
167 -3912 -6628 -5900 6762 9854 3200 7927 7776 -3222 -951 3845 -3639 -4145 -1186 -11842 -10310
182 -10310 7518 7352 -1270 1326 -6500 -15526 -1082 7724 201 8204 15910 -616 -6543 6461
196 6461 5000 -1852 1859 -3962 -9867 1611 6006 -3017 -2266 -1117 -9403 -7642 -417 167 5443
211 5443 8889 -2292 -5737 4069 4522 3899 10541 3786 -5987 838 1700 -6329 -716 3480 -7561
226 -7561 -7065 1687 -1636 -1315 5380 -3802 -10911 370 2932 -415 10530 13570 272 -1679 2204
241 2204 -2869 -663 4384 -3695 -5283 3528 -447 -5515 1474 -482 -8421 -5178 -3230 -3852 6435
256F435M501j0812j808N654l304j98N286m113k498L481n188k617Q104k425p512
271g014O434Q8j0162Q049J1948j0608p098J0024L039l803M613K36l746J782l257
286E25o729N019N473l156j104j891l490N574J678j0822J815J1300o031n182J3082
301F061L020q886K433J555q472L204P472n749j282N719n220n443N718J88m954
316d636J800k99r06M940R2m216O288K905r091J123Q984k646m570K832j163l920
332b483L055N73j435J131k361k799L525k291m628P767L686q249K877R324n841
347A851m081Q314l635q123Q460K948p751L159N127p791l126M526l095k027M644
362f00j308k217N786L03m415L637J538l172J191J517j385K615N32n417J599L604
$$ plain form
256 6435 10936 124 -1684 3970 666 468 5754 1641 -857 2624 -2564 -5181 2923 498 -7014
271 -7014 -580 -492 -10654 -2605 9343 -1265 -8363 1661 4700 897 5510 5746 2000 3782 525
286 525 -6204 -1185 4288 1132 28 -1863 -5353 221 1899 -8923 -7108 4192 -1839 -7021 6061
301 6061 9081 195 2628 4183 -4289 -1085 6387 638 -644 5075 -145 -5588 130 318 -4636
316 -4636 -2836 -3135 -4041 899 991 -3225 3063 5968 -3123 -2000 6984 4338 -232 2600 1437 -2483
332 -2483 572 1145 -290 841 -1520 -4319 -794 -3085 -7713 54 3740 -4509 -1632 7692 1851
347 1851 -2230 6084 2449 -5674 2786 5734 -2017 1142 6269 -1522 -4648 -122 -3217 -5244 -600
362 -600 -1908 -4125 1661 1964 -2451 1186 2724 -448 743 2260 875 3490 4022 -1395 204 3808
378C808n347k169N167k226m146K950K09j795L639k87k499N627J590p548L007O591
394F571o542k908P606j448m461M200m85o673K349K125n131M11M205j457J028K102
410A492k861M56L879l304j998N344J48k893L803m07n148K038K133n272j71L120
426C59k951k86L595l218j244N318j586l226M903Q92l857L256J824m768J319M352
442D682k967k065K638k731k180K947k767k413M488J057l918K410K405k824J353
457A15J385l730K182M514k984n94M172l148l626L173j131m143L125J505l965J492
473a658K572l657O34L644l486j553N681l79k056L235m60l006L249O8m157K032
489G03K080m091j264K599j968m43K595j954j194M053j388k004L151M42l018L219
$$ plain form
378 3808 -1539 -3708 1459 -767 -4913 -1963 -1754 -3549 90 -197 -2696 2931 4521 -3027 -20 6571
394 6571 29 -2879 4727 3279 -1182 3018 2533 -4140 -1791 334 -4797 -4386 -181 -1638 -610 1492
410 1492 -1369 -913 2966 -338 -2336 3008 3156 263 4066 3659 -1489 549 2682 -2590 -2761 359
426 359 -2592 -2878 717 -2501 -3745 1573 -13 -3239 1664 2556 -1301 1955 3779 -989 330 4682
442 4682 1715 -350 2288 -443 -2623 324 -2443 -4856 -368 689 -3229 -819 1586 -1238 115
457 115 1500 -2230 -48 4466 1482 888 5060 1912 -1714 1459 328 -3815 -690 815 -3150 -1658
473 -1658 914 -2743 -2109 1535 -1951 -3504 2177 1798 -258 2977 2517 -489 2760 2828 -1329 703
489 703 2783 -1308 -2572 27 -1941 -2384 211 -1743 -2937 1116 -272 -2276 875 1317 -1701 1518
505A518K421l644R99L026l505j359J609k780r40M068j637l692L770J110l884J308
521a612J123k295K708K394k923J122L813k121k406K332q62k203K176l46l178K383
537A05M41l138J282J482l501Q84M090k394j674L791J00j676K241k21j742K981
553C051K3m362R86K279k963n37K322j900j096K663j987j662K769k41k184L117
569B78J748k083J739J431k730k34K053k436qK634k558j952L599j286l374K176
585a003M99k649J690J753j793J382K317k559L45K880j552j556L140r23l471J864
601C64J300k536L97Q25k313l7J948j691l27K244p11m18J390o08R95K896k298k845
619a425K849R72l225J123J850k861j84J698k646j092L346j309k539L046J89j722
$$ plain form
505 1518 3939 295 1294 4320 815 -544 1065 -1715 -2655 1413 -224 -3916 -146 964 -2920 -1612
521 -1612 -489 -2784 -76 2318 -605 517 4330 2209 -197 2135 1273 -930 1246 900 -2278 105
537 105 546 -2592 -1310 172 -3329 -2445 1645 -749 -2423 1368 1468 -208 2033 1812 70 3051
553 3051 3074 -1288 -302 1977 -986 -1523 799 -1101 -2197 466 -1521 -3183 -414 -655 -2839 278
569 278 2026 -57 1682 3113 383 149 2202 -234 -242 2392 -166 -2118 1481 195 -3179 -1003
585 -1003 -504 -3153 -1463 290 -1503 -121 2196 -363 -18 2862 1310 -246 2894 1971 -1500 364
601 364 1664 -872 -475 350 -1963 -2000 -52 -1743 -2070 174 -537 -955 435 -173 822 3718 1420 -1425
619 -1425 1424 2396 -829 294 2144 -717 -901 797 -1849 -2941 405 -904 -3443 -397 -208 -1930
635a930L341J493l818M19K966k087j61K745j808j559J837r96j979J357N02k030
651a708O01o1j378J733J698j863M92O07n99J640J747k109o61K014j572j558K241
668A264L69k235J087n40l050J358K354k632K2K646j253j210L109L0j546J364j89
685I48k189K565J730k363l77R59k062m93J737j380p60J738p65j879J830J071p87
702d77Q44k42j782K543J647k011M91J482k390n94K052q61j008J493k060k467K491
719h49J236k892J104K233j481n64J416k30Q77J564j846j876K522Q57m74l02q32
736D63j716J010m3j907J513J578k200o83J875r76J9K312n88j987J932J138j464
753B76J478Q65k524m63O00q68M77J226j982j271J811k72j168J473N73j490J507
$$ plain form
635 -1930 1411 2904 -914 -495 2471 384 223 2968 1160 -399 1438 442 -1537 -180 322 -1708
651 -1708 -1107 -1168 -2546 -813 885 -978 -486 121 -478 1162 2909 800 139 2153 581 -977 1264
668 1264 1633 -602 485 -55 -3105 -1747 607 -2025 -2003 643 -610 -1820 1289 1319 -227 1137 948
685 948 -1241 1324 3054 691 314 1273 -789 -1282 455 -925 -1685 53 -712 -2591 -761 310 -477
702 -477 367 125 -1657 886 2533 522 1013 2495 105 -489 1563 702 -306 1187 -873 -3340 -849
719 -849 387 -2505 -1401 832 -649 -1213 203 -27 850 2414 568 -1308 1214 2071 1597 1295 463
736 463 -1253 -243 -286 -2193 -680 898 -1302 -1985 -110 -1086 -1067 1245 657 -1330 602 1740 276
753 276 1754 2619 95 -368 232 -636 -159 1067 -915 -2186 -375 -647 -1815 -342 231 -1259 248
770B48M02j911J636K522j887j088J052m44J59J265j298j696N40P6j496J511L83
787b6j256O86J78j207Q23J855j099j32J655o94j157K410K32k444N13K25j862P48
805e52J428j121j174R87j597K10K006k39j139J419Ol35P81J97m86J425j27k378
823f89L60K030j075p74N65j710n26J951p3j873J245M97j007P40P31o69J223J069
841B015j931k96J869o47l76N24j068j462J300M64j629P80M27j294j46R85n48J168
859A35R08j110m67J696r9o49J003j20j912J061O74j493J25Q76j741p91J343n45
877a106jJ612n80j401J071Q46l61Q88L26q42L50O52j230K6R74r95n63L16r11p78
897a707J691r7j173q6M52L91J161N3j255Q59J248j042n11J390o48l58P04j063
$$ plain form
770 248 650 -1261 375 2897 1010 -78 974 530 689 1954 656 -1040 -500 -424 -1920 -409 -26
787 -26 -1282 -596 -418 -1625 -802 1053 -46 -178 1477 783 -374 2036 2268 -176 337 562 -1300 -552
805 -552 876 -245 -1419 -432 -2029 -1819 187 -52 -1191 228 234 -101 680 877 391 1816 1689 -689
823 -689 -329 1701 626 -148 417 -1293 -1819 132 59 -1814 -569 -72 -1079 -339 392 -277 946 2015
841 2015 84 -212 1657 1010 634 1158 90 -1372 -72 392 -1237 -457 -30 -1324 -1470 -485 -1033 135
859 135 1043 -67 -534 1162 1063 414 1417 1297 -615 446 1120 -373 -248 628 -1113 -1904 -561 -1106
877 -1106 -1107 505 -75 -1476 -405 441 80 968 1294 452 802 1454 224 250 1224 229 -334 -18 -929 -1707
897 -1707 -16 -113 -1286 -1372 -920 -529 632 685 -570 289 1537 495 -16 1374 726 368 1072 9
915Ij416J864Q30k601j63J376j200M62J026o92l41J373k13r24J052J005o24K28
933A051o65o52J120J54j304k62L84o61n7O12p05j49R05o35n23J600K02n70R63
952H08N24j875J270R92j019l26O53j531k70J270p42j160J299k50r47O01M87n56
970g72N97P69r14J30J071K89n65N53l52q06P86J39j279K03J04n34K86l98o97R10
990d80O11q84NR95k81L01J028n01j126J495O5j044L02M08r89l07Q26r33o06J020
1010i5m28p13M86M59k75N74J64o81R99L51o33L58M25q89K36L31q46j53Q06l19
1030A57j185K76K59l03M77J11p98P86J175j420J10J362l57n30P24n90k07P27j08
1049F66j163l4N65m42J25k3o39j6J005m20k30N96r1l7P80K4q35P59L50p29L25
$$ plain form
915 9 -1407 457 1287 -1314 -1477 -101 -1301 -839 187 -505 -846 527 314 -610 442 1447 823 1051
933 1051 386 -266 854 1008 -296 -558 -174 -835 -892 -280 -985 -1134 -229 -864 -1387 213 415 -155 808
952 808 1332 -543 727 1719 700 374 1027 -504 -774 496 -246 -1406 -107 -357 -1304 -703 -216 -772
970 -772 -175 594 -320 -190 881 1170 605 1158 806 0 786 925 -354 -151 -47 -581 -295 -693 -1390 -480
990 -480 131 -753 -748 247 -34 267 1295 794 -332 1163 1228 184 486 894 -95 -402 424 -509 -1115 -95
1010 -95 -523 -1236 -750 -291 -566 8 172 -509 490 841 208 566 991 102 338 669 -177 -330 476 157
1030 157 -1028 -752 -493 -796 -319 -208 -1006 -220 955 -465 -355 1007 650 120 844 254 47 774 666
1049 666 -497 -531 34 -408 -283 -306 -945 -961 44 -376 -606 -10 -101 -138 642 666 -169 590 940 211 536
1070E36j3n40j70K77p42m05R45l51n03P49J09q12R65M55r19Q66O12q29N8K73j71
1091C90j95M21n67l47M78k92m26qJ61m7M5J25k17L22P45n88J05K12j81L51O32
1112A119r14j38M63L22j170J07K19m96J89Ln16l7J363m50q85L34M04K78P75m51
1132E19p72O24N51m26k3k15m72j6M48j016%O20l12m73N59P2m09Q81J30m74M93
1153B89K99M5j29L69o14J6L33n41m20N64l24n58K07o1K8L15p5o34K06R42q3j24
1175E0L80N5j51N95m83n64O28j7p91L28q9l79L02N3p13K8P48n55k46J240l40k38
1197a59P72r0k95K54N29l66o57N65l64l92L70n61j90N32p2n59L48K48k05m3LL5
1219b97N55L57o36J83Q27n95O3k72N3l15L53n00m81O93k79l37O4K68m44M52O32
$$ plain form
1070 536 523 -17 -187 90 -652 -1057 -112 -463 -966 -217 -108 -920 45 500 -419 447 1059 230 288 561 390
1091 390 195 616 49 -298 180 -112 -538 -546 -385 -432 -387 -262 -479 -157 588 0 105 317 136 487 1119
1112 1119 205 67 530 852 -318 -211 8 -488 -299 -296 -812 -849 514 64 -821 -487 -83 195 970 519
1132 519 -253 371 922 496 473 258 -214 -230 218 -798 -798 -178 -490 -963 -404 -332 -741 140 270 -204 289
1153 289 588 633 504 873 259 275 608 67 -353 211 -113 -671 -464 -525 -497 -182 -257 -891 -685 257 174 50
1175 50 430 485 334 929 446 -118 510 493 -298 30 -59 -438 -136 -83 -796 -768 -20 -575 -821 419 79 -159
1197 -159 613 523 228 482 1011 645 -12 553 189 -203 167 -394 -584 -52 -124 -683 -335 -87 -292 -335 -332 -297
1219 -297 258 615 -21 162 989 394 457 185 238 -77 276 -224 -705 -12 -291 -628 -564 -296 -740 -288 344
1240C44k40k27P58k73k44L79K48n99N14l12k56k76K31m35J25j3j64J98j37K53
1260a26l98M38K28l41N07No7M02L8m54J65J08o83o8L83l86m96N82l10m1J86o3
1282c91j81M78O5k77M95M84k27n24P78k69k4J2K69n35j29o4j72j32K30m48K83
1303b79J56k12o4M88k14J70L25l39J30M34j89k95L40o4j95k56M34l42l56J68l96
1324e56k79P77k83k34M61K8l3L61R1k64J27J53mQ1j33l26j7k45K98l12J57j90
1346c42j02K56p6l05M74L64m01J43L80j71P2L91l82q0L32o75m4J74J61o00R3M39
1368A01o31L52J68k32k85N18J36k50N08j11m8R5J53j78R0r4j60k3l84l80O72L56
1390C73q84m16Q35o1l22L04L05kJ06L80m73m06Q14l46j1j8k91K9M40n82l96K93
$$ plain form
1240 344 104 -123 635 362 118 497 745 146 660 348 92 -184 47 -388 -263 -276 -440 -242 -379 -126
1260 -126 -524 -86 142 -199 308 313 246 648 686 232 397 505 -178 -246 137 -249 -745 -163 -473 -514 -328 -391
1282 -391 -572 -94 -29 -306 189 673 446 -78 700 431 407 419 688 153 24 -40 -212 -344 -114 -562 -279
1303 -279 -123 -335 -399 89 -125 45 370 31 161 595 406 111 451 387 192 -64 370 28 -328 -160 -556
1324 -556 -835 -58 -341 -575 -114 -86 -119 242 333 69 196 349 345 426 293 -33 -50 -295 3 -309 -152 -342
1346 -342 -444 -188 -264 -569 -95 269 -132 11 391 220 292 683 301 221 553 -122 -166 8 169 -431 -338 101
1368 101 -530 -178 -10 -242 -527 -9 127 -123 385 274 226 321 474 296 386 292 132 109 -275 -655 17 373
1390 373 -511 -927 -92 -153 -475 -171 134 132 238 618 145 -261 553 207 196 178 -113 -84 356 -226 -622 -329
1412c29L03l14J22q3l0J32N6J51j1J09K48j66M37m03k50M42r1l41n8K5l13L63
1434ar1o30K03L39j15k49O14j0J72Q2j73k64M44Q5k17j49J95k40o3J43l91J0K04
1457a02j62j95J11N9m0J49l1J16K01L79k44%K28j51l2P7m67n4K39m2m81J52j10
1480d00j9L96j58n6O7J57J84p3j93N48J03k04Rk93L90M6n79J06l4j15j34K2j93
1503d23J23K96k47j2J70K91l7j64j05M02m2J61q6J17j50j98K5Q0k90j24p6m5k6
1526c60J73j58RL00j0j00R2K85k3J72K51j19k68K6k46j11L47m78k96M02k52J81
1548a83j22M21m07K4K1J17J09K27K71j73J96q4j32j01o6J00l59k83J51M2K16m55
1570d70K73J59k15KJ18L01n16P36n9l84L76L6L7o7R8m86R5Q0j59l03K25K7j79
$$ plain form
1412 -329 -26 -340 -218 -301 -331 -199 -143 8 -3 106 354 188 625 222 -28 414 323 -18 -76 -51 -364 -1
1434 -1 -92 -722 -519 -180 -295 -544 70 60 232 314 141 -123 321 406 189 40 235 -5 -68 75 -316 -306 -102
1457 -102 -264 -459 -348 -289 -329 -180 -211 -95 106 485 241 241 469 318 286 363 -104 -158 81 39 -442 -290 -400
1480 -400 -419 -23 -181 -237 -170 -13 171 98 -95 453 556 352 361 68 458 504 -75 31 -3 -118 -252 -230 -423
1503 -423 -300 -4 -251 -263 -93 198 161 -3 -108 294 252 413 327 444 294 96 121 201 -89 -213 -289 -334 -360
1526 -360 -187 -345 -336 -36 -46 -146 -54 231 208 380 631 512 244 270 24 -87 260 -218 -514 -112 -364 -183
1548 -183 -305 116 -291 -267 -246 -129 -20 207 478 305 501 417 285 184 118 218 -141 -424 -273 -231 -15 -470
1570 -470 -197 -38 -253 -251 -133 168 -348 388 329 -55 321 357 394 327 425 -61 34 114 -45 -348 -123 -96 -275
1593b75J39O3m25N13j68L0K51q4J26K26q2K10o90M01N9j69k2k62j50J17j87J72
1615b07j09Q7r0L4K4J49J20J78M1k46J31O0LR8j20k64L44l03P9k03j92J47p5R
1639c05k14J9N11q0R5K99j60q1J63J54m00K90o6j76l03M33l07k30L37k51K22k13
1661b63j19J01j28J62J44J90K35r9M4J92k49j36k7K60k96P4j26j16K31l92k95
1682f13O43k51j19J06J84J92JO2K4l9j38K73k62L45Kj52k91J93o4k42k93K18K2
1705a99J95m04k83P86Rj21L5L32n4K4Q9k79L49k65q8n7o0j65j83K38l56L04k20
1728c73K04k94O10l30O6K60O5p3J26jJ27p5J10pl51J41k32l23J33j34j12M89l70
1751c44l4K44K77m11L61P1j06L8j72M68o1O5l5qn28J26rk73K17r0j36J11R5P8
$$ plain form
1593 -275 -136 -73 -498 15 -153 -123 128 44 170 396 314 524 -166 235 294 125 103 -159 -309 -192 -379 -207
1615 -207 -316 -229 -319 -285 -261 -112 8 186 227 -19 112 172 175 273 153 -111 233 -70 9 -194 -386 -239 -314 -305
1639 -305 -519 -500 11 -69 26 325 165 84 247 401 1 291 225 49 -254 179 -128 -358 -21 -272 -50 -263
1661 -263 -382 -281 -409 -247 -103 87 322 223 267 459 210 74 47 307 11 85 -41 -157 74 -318 -613
1682 -613 30 -221 -340 -234 -50 142 143 205 229 190 52 325 63 408 410 258 -33 160 96 -146 -439 -221 -199
1705 -199 -4 -408 -691 95 104 -17 18 350 296 320 409 130 479 214 126 69 9 -156 -339 -101 -457 -153 -373
1728 -373 -169 -463 147 -183 -117 143 208 135 261 260 387 312 422 415 64 205 -27 -350 -217 -351 -463 26 -344
1751 -344 -378 -134 143 -268 93 164 58 96 -76 392 331 396 361 353 -175 -49 -58 -331 -114 -204 -340 -229 -134 -56
1775e6J03J14j57J0K25k53J97J93rl51J70J29o7j59j09o5r5p9J44J8P5K9j59J41
1799a1m3MK90J15n8k77J51r1L11j93j9k72k25J40n5J27l61L77j14J56j56K07L08
1822C11m45N5M43k07j25N35l10q4J52p0l23M53k57k77M10n01jL4nK56K02k78J49
1845A17M1L75q23K94O0R0J12k22J75J43l93K3k27J25J36Ok15j14l55M66n7P2M20
1868B49J02J01k97L58k41J42l4l60J6l29N54j55n67L50k31K66J03l65J0J10L71
1889A53K8l70M8L57J42K1p9j46O7k92Q1J1j8k45K43l34QM42j29k92K00l9o4L34
1913A27J98k41j73M4M65n92N50m21r3jJ31l35K16O8K5k83P8M5jO07n14J64j7o7
1937b0O7K5J11J3Q1K56l11j19j74J04j09k30p7L62M2j93k72L87K07k53K10K05
$$ plain form
1775 -56 47 161 4 14 239 -14 183 376 367 16 186 315 248 89 -20 -85 -180 -259 -115 -97 -22 7 -152 -11
1799 -11 -54 -50 240 355 297 20 171 80 391 198 179 -93 -318 -178 -233 -106 -467 -90 -204 -48 -204 3 311
1822 311 -134 -79 364 157 32 567 257 173 325 255 -68 385 128 -149 261 -240 -241 -207 -212 44 246 -32 117
1845 117 158 533 -290 4 64 154 266 44 219 362 -31 -8 -235 -110 26 32 -183 -297 -652 -186 -243 -171 249
1868 249 351 452 155 513 272 414 380 20 36 -293 261 106 -461 -111 -342 -76 27 -338 -328 -218 153
1889 153 181 -189 -141 216 358 379 300 154 221 -71 10 21 3 -242 1 -333 -325 117 -12 -304 -104 -143 -207 127
1913 127 325 84 -89 -45 420 -172 378 -43 -136 -137 -6 -341 -125 -57 -32 -315 -237 -192 -193 414 -100 64 47 -20
1937 -20 47 72 183 196 277 533 222 103 -71 33 -76 -306 -383 -21 21 -172 -444 -57 150 -103 107 312
1959C12J72l34J60k01r8Q5Rj94J78k13kk47M86k95k28K24J75k66M01j89J63J85
1981B83l77K75m9m7K7J48m06N31k07q5p6j27q8J75m21J13J1J72L05o8k05K94j54
2004B4K68K80n44N0l2K39l3k81j38q9K33j18K48l04J03j69N5K02o6%L2k1K34l27
2028a54M15J2k28L16l8j83l4k45j85J04nj28L29M6l43O1J42j04L60J42k91L29
2050C18j84J66l66K41J03l00J44p2p7q6l63L74j52l3K01q8j31L06j14K47qK20
2072C46k29k07K09j56K92J5R5m40k10K27K9j47k79K85J48p3LL04l82K74k77J57
2094a6L7K64k98N64m79J77l49J46L3p5k16K32j44K25k79K5J74k83O5R9J47M3J81
2117B73o8rr1l48K70P7J50l60M4o2m34K26L08l5j92J59K64m6j31J71k25q0K62
$$ plain form
1959 312 484 150 310 109 11 96 105 -89 89 -124 -126 -373 113 -182 -410 -186 -11 -277 124 -65 98 283
1981 283 -94 181 132 85 112 260 -146 385 178 93 17 -110 -198 -23 -444 -331 -320 -148 157 89 -116 178 24
2004 24 292 572 28 78 46 285 252 -29 -167 -256 -23 -141 107 -197 -94 -263 -208 -6 -72 -72 -40 -61 173 -154
2028 -154 261 273 45 361 323 140 106 -139 -324 -220 -225 -353 -24 22 -321 -260 -118 -222 138 280 -11 318
2050 318 134 300 -66 175 278 -22 122 50 -27 -113 -476 -102 -254 -287 -86 -174 -305 1 -113 134 126 346
2072 346 117 -90 119 -37 255 270 365 -75 -285 -58 -29 -176 -455 -170 -22 -95 -92 212 -170 104 -173 -16
2094 -16 21 285 -13 551 72 249 -100 46 79 4 -212 20 -124 101 -178 -153 21 -262 -197 -98 49 92 273
2117 273 205 196 105 -243 27 104 254 -106 -62 -124 -558 -332 -24 -59 -251 -92 172 126 -5 166 -59 -139 123
2140A23J38N3J40k94k7m35K95K0j01K12q7l7J53k73l3P8R7j48O0K58l03K31J09
2163B29o6l42J37J28J44q2l62P3j23J53j52nm9J04K42P3m17K06O1N10k45p5q7
2186E5K62L8k54Q6j65l3j16j57J50K00j99j35J26J19j94J80J26o3j5R0J56k55
2208BJ55l3k54K74n4k94J12Q0l9k20O9K7J75k3Rl41J97O9K27J94J7m78J45Q3p
2233I2k14J74J92m47J97k08K10j08k55K21Q7K22j65p0Q8J49j83J13q8J79J65j36
2255B15m1M7k79p0PJ27j50n6O0k55K88M2m3O7L84j78k10j60J03K12n8J95ll47
2279a03N0k65L32J40j11R5j95p0nO2j4KJ86q6K27K1R0l7k41j52j8J11l45M24Q3
2304A81j75k85J90j56K07J34n06J72K23r5J37K18m59M49l74R7J76J97j89P0j51
$$ plain form
2140 123 261 314 454 160 133 -302 -7 13 -88 124 37 0 153 -120 -153 -75 22 -126 -66 192 -111 120 229
2163 229 163 -179 -42 86 230 148 -214 -141 -264 -111 -263 -268 -317 -213 29 102 -315 -109 -48 462 217 142 55
2186 55 317 355 101 187 22 -11 -127 -284 -134 66 -133 -268 -142 -23 -217 -37 89 26 11 101 257 2
2208 2 157 124 -130 144 90 -204 -92 -12 -51 -271 -202 -175 0 -23 -14 -355 -158 -89 138 332 349 -129 16 99 92
2233 92 -122 52 244 -203 -6 -214 -4 -112 -367 -146 -59 163 -2 -72 16 165 -18 95 7 186 351 215
2255 215 174 221 -58 -128 -121 6 -144 -200 -140 -395 -107 -65 -108 -41 343 165 -45 -205 -102 110 52 247 244 -103
2279 -103 -53 -318 14 154 43 138 -57 -127 -132 -70 -84 -82 104 18 245 266 356 319 78 -74 -92 19 -326 98 181
2304 181 6 -279 -89 -245 -38 96 -410 -238 -15 -110 27 245 -214 235 -139 -42 134 331 142 212 61
2325F1K06l57J57j23pM8j17L2q8K72j21j35Q7J88J81r9K9N7J63j69j69L9j86r9
2349a50J8J20k0j26K23k68L68l55Q6N6K0K09j07m2j10J26J33l4J67k53j09N9m5
2372c4k7j30K0j29K88l3j35K61k21K85n4k16L38L34l26J03N2m51J92j51Q9j33
2394g8j0L5k22j67J58K98j70j6J18m7K44l99M02j89L64l59j48M39l23K16m60L31
2416A7nk29J08k56L41k01P5l1j09K88j19J63Q2oQ4J66r0l5q5k67PL8k2Q6k4o7
2442i1L7j03J97r6J1M2q7L78j44j1j04J20j20p4J46M3J5j65J00j82q4k1J74j08
2466a27j91M30M0m05J23L37L6k0k66m1J36J37r9J21m78K87o4k21J14J03L1J50
2488A33l46jL2R1j77L2K35j25Q5M58k25J6j61k8k14J95Q7N9k86J21k5m16N09o5
$$ plain form
2325 61 267 -90 67 -56 -63 -15 -132 -100 -188 84 -37 -172 -85 103 284 185 214 271 434 265 96 135 -51 -150
2349 -150 -132 -12 -32 -158 65 -203 165 -190 -104 -48 -28 181 74 32 -78 48 181 147 314 61 -48 11 -34
2372 -34 -61 -191 -171 -300 -12 -45 -180 81 -140 145 91 -125 213 547 221 324 376 -75 117 -34 55 -78
2394 -78 -88 -53 -275 -442 -284 14 -156 -172 -54 -101 143 -256 146 -43 321 -38 -186 253 -70 146 -314 17
2416 17 12 -217 -109 -365 -24 -225 -150 -181 -290 -2 -121 42 124 118 202 368 278 243 158 -109 -102 -64 -86 0 -24 -91
2442 -91 -54 -157 40 -56 -45 -3 -90 288 144 133 29 149 29 -45 101 144 159 -6 94 -88 -172 -193 -19 -127
2466 -127 -318 112 152 -253 -130 207 243 223 -43 -84 52 189 90 211 -267 20 -44 -265 -151 -48 -17 133
2488 133 -213 -214 -182 -91 -268 -236 -1 -126 -41 417 192 208 47 19 -195 0 87 146 -140 -19 -44 -460 49 -16
2512a6k55N01k01k34L33n6K08p5N0j19j48OJ90l31j7R9j58K11o3j17m5M11q0M6
2536A40k22P5Jj56K49j66J34L27j66k63N3KJ86j6l46J71l9qL07l41L0Oq3l5J63
2561CJ67k32L87k12k53L12Rj20o6L09k07L7K9k46j20J09j50J49j82N6L24O0l16
2584a53O6K3J26J64k82O7K8j12NJ69J50m93P6J13j34K44L5j65J20o8k17K40J45
2607A47p1k4O4l7R8j83J40o5J2l68L81j44q4j61J86l8k1NJ3n2R6J43j58J30M0
2632D9l02L18l6J11q8P1m1J41m40J26j14j30L15l1o3J33j89R5J74L9Q2k10PJ34
2656A51J92k16lk62J31J02k07J05J92k90K24J4o3r9j04M64m97L35k69J81k63K90
2678A08l31J09J07l51K58M5J69j69l26K41M5MJ09q6MJ87J49j61k59J88N3j97K92
$$ plain form
2512 -16 -271 230 29 -205 128 72 280 205 255 136 -12 -6 184 -147 -164 -65 -223 -12 -75 -192 -237 174 94 140
2536 140 -82 -7 -6 -162 87 -79 55 382 216 -47 6 8 194 178 -168 3 -36 -44 263 -78 -48 -42 -125 -160 3
2561 3 170 -62 325 113 -140 172 181 61 -5 304 97 134 163 -83 -203 -94 -244 -95 -277 -221 103 163 -153
2584 -153 -87 -64 62 226 -56 11 39 -73 -68 101 251 -242 -166 -53 -187 57 92 -73 47 -21 -238 2 147
2607 147 76 52 116 79 177 -6 134 69 81 -287 94 -50 -134 -295 -109 -147 -168 -163 -150 -202 -106 37 -121 9 49
2632 49 -253 65 29 140 52 123 82 223 -217 -91 -205 -335 -20 -51 -114 19 -170 -75 99 138 220 10 17 151
2656 151 343 127 124 -138 -7 95 -112 -7 185 -105 119 133 70 -29 -133 331 -166 169 -100 81 -182 108
2678 108 -223 -114 -7 -358 -100 -55 114 -55 -381 -140 -95 -91 18 -68 -64 123 272 111 -148 40 93 -104 188
2701A88Ll6j7r3J2K0k0J13j10q8j39K91k99L0m7J84j6M06n69K06O8j16J82k23
2725g0J8L7o9r7K43j86J81k59J71j18O8J55j43O3p9j31m7N13j84L4p4K8P1l32
2749b07K34J28j45r8p4l2MM38j8m08K73r9m7J69K18m33K72K9l58K8N7M01j78j82
2773b8m2j93L21r6J30l83J89O7n7j75K64k80J49l9L88k93L51k25K70m68K21j31
2795f0K7j21n4K24l13M74l13q8J49P5R3%j62Q4J68j06k32K88Q6j60l3K28l01k4
2819g1R6k00K77k89j61K24R9O4l17L04R3J58j43o2k4j47L66j92J23k45P6j03L83
2842C09m00K79r5k70P4J30q1J60l76K34J78n61M09m7L32l77K91j36j36M35l45
2863GK47k66Q5l0j57J45k29M30l84K29q7K42j80K8p4J24k00R2n0L4J04j67J12
$$ plain form
2701 188 191 155 138 45 57 77 57 170 60 -28 -167 124 -175 -145 -192 -8 -24 382 -187 19 87 -29 153 -70
2725 -70 -52 -15 -84 -181 62 -124 57 -202 -31 -149 -81 74 -69 -6 -85 -216 -263 250 66 100 26 54 125 -207
2749 -207 27 155 10 -88 -162 -194 -190 248 230 -178 95 -4 -51 118 336 -97 175 204 -154 -126 -69 332 154 -28
2773 -28 -70 -263 58 -38 92 -291 -102 -35 -92 -267 -3 -283 -134 -173 215 -78 273 48 318 -150 71 -60
2795 -60 -33 -154 -208 16 -297 177 -136 -224 -75 0 93 93 -69 15 183 77 -155 133 219 59 26 254 -47 -71
2819 -71 25 -175 102 -187 -348 -124 -25 39 -278 26 119 277 134 72 48 -99 267 75 198 -47 29 -74 309
2842 309 -91 188 93 -177 -103 27 -54 106 -270 -36 142 -419 -10 -57 275 -102 189 53 -83 352 7
2863 7 254 -12 73 43 -114 31 -198 232 -152 77 -10 232 52 80 6 130 -70 22 -28 6 110 -57 55
2886E5J30J50o34L49j83p5K78j45J01k00k7M9L12j27k5J17r1j14J07m8L15n41
2908b47K56J63q2r9j53M03n38K32l8J67m57L27O7k16J63k0R5M8NNO0J0j15K86
2932C22k09j14J47k19k95J95K46k54K03j2p6K4j79L28ln8p9m0K78r2j70J45j59
2955g1K44j11j79M3KJ42k24J66j1j48K09l4q6L10k32J00O5n2k29J12j37J56J08
2978A43j87K2J85l62J46J7J5K37k35k6J71P4j18k22K29MP2r3o2p7n9L47j67j57
3002a03L3K09k9j46rM9K97l71r3K76n3q1k37J80L9k9n9L04j58k53m1j51M65K0
3026E9j54n1J90j10m4k9q1L12o7k77K71J97k29k15P1O6L08k25l7k00K74lJ31k08
3050e1J58k11M0J82K8j98k4J9K9O2J44L9k97J75Rq7m04l0M12J66j29q6L3m5L07
$$ plain form
2886 55 185 335 -299 50 -133 -208 70 -75 26 -174 -201 -152 160 33 8 125 34 -80 27 -21 294 -247
2908 -247 9 172 90 -9 -162 241 -297 -65 -103 64 -393 -66 1 -215 -52 -72 23 71 76 81 141 151 36 322
2932 322 113 -1 146 -73 -368 -173 73 -181 22 10 -66 -42 -221 107 104 46 -33 -73 205 113 -57 88 -71
2955 -71 173 62 -117 -74 -72 70 -154 12 1 -147 62 28 -58 252 20 120 185 133 -96 16 -121 35 143
2978 143 -44 -22 163 -199 -53 -36 -21 216 -19 -45 126 200 82 -140 89 93 165 72 10 -67 -126 221 54 -103
3002 -103 -70 139 110 -36 -45 4 301 -70 -163 113 60 -21 -258 -78 -39 -68 -127 177 19 -234 -275 -426 39 59
3026 59 -95 -146 44 -66 -110 -139 -220 92 25 -252 19 216 -13 -228 -157 -91 217 -8 -45 -245 29 26 157 -51
3050 -51 107 -104 -64 118 146 -52 -76 -57 -28 34 178 217 -80 95 104 17 -387 -417 -5 161 32 -54 -21 -66 241
3075B41l31K43j18J94k51O6j21K41k3j48q3k2J4k8P7j0J35j76J02q6J59j3J37
3098A99j28M4K8o8Q4j24K85j78j14k25l55O67r6q1R6J09k29Np5K06j46l7K51L6
3122A54k51JL01k06K60Q7k51J41l51n8K60j87OJ56j65k49N37l39R7P8J30k68J65
3145D8N9k01J70j1l4J73k83J32q3j8k73K87k31M53m45L31l74K60m1RN31l44k14
3168i9J39l2o0N3j42K8Q4J1J47L7k2p0k53k31M21Lj91L20k16K31l31L27J85j98
3192A41k36K65k55PL63k58J57j41J20j34j73J31p7K14j5o6Kn2O6l7Q8J2j26m7
3216e1K05k96J84l08J40K18J04k4l07K69j67k67O3J30K12M7J44l21K61M1k60N8
3238G5j1j88K37j12J79j80k08L94l51K88j96J42j50O5r7L11k20J4J37m8J71q9
$$ plain form
3075 241 -90 153 35 229 -22 44 -77 164 141 -7 -90 -112 -98 -126 -49 -59 76 -100 2 -84 75 62 199
3098 199 71 115 143 75 159 35 320 142 28 -197 -552 115 19 -62 34 143 -86 -81 -156 50 -96 -133 118 154
3122 154 -97 -96 205 -1 259 346 95 236 -115 -173 87 -100 -94 62 -103 -352 185 -154 -57 21 151 -117 48
3145 48 107 -94 76 65 31 204 -79 53 -30 -48 -321 -34 -265 188 -257 74 -300 -40 -81 -72 459 115 -99
3168 -99 40 8 -52 1 -141 -113 -29 -18 129 166 144 74 -179 -410 11 14 -177 143 -73 158 -173 154 339 141
3192 141 -95 170 -85 -78 285 27 184 43 163 29 -144 -13 -90 124 109 43 45 -7 59 22 110 122 -4 -51
3216 -51 154 -142 42 -266 -126 92 196 172 -135 134 -33 -300 -237 -107 105 152 296 -25 236 277 17 75
3238 75 64 -124 113 1 180 0 -208 186 -165 123 -73 69 -81 -16 -113 198 -22 -8 129 81 252 163
3260A63j37k28M63j66J58J9j0m38L3N9K68j54L5j80j01P2J92J67l83J53K13l31
3282a33K37N8j07j38L8J08o6L2j88R4o9m8R9J05Q3l7JK07l38J54l3J12l24J67
3306A4J29%o3J58n0l28K29r4J51o8O8m8N3m3j39N0MJ03n9M5j49J02l6K7l3P7O5
3333A65k36K28j36K08k61M4k23O9k86M61K44p53N44j39J94k61L22j32K6K15m49
3354a56oJ24P2j41o8K47k35J47k5P0q4j14J5J31K0O9K50l49K3mK67j90r7J71k06
3379f9j28M9J98j55j7K00l51J87O1J51l52K93r2P7k57K43j90m2J66J47J5n7n9
3402A8j16K98m99N90n11K00j72M38l87N1J45Rn2n8K3K79j84k20K71j43J25J19
3424B24o76P16m53K43q2%o3%J24j83J08K43j80j32J7K13Ql66K68k26J07O0j27
$$ plain form
3260 163 26 -202 261 95 253 272 262 -176 -143 -84 184 30 65 -115 -216 -144 48 215 -168 -15 198 -133
3282 -133 104 162 55 -83 -45 63 -3 29 -159 -65 -134 -182 -83 22 105 68 69 276 -62 92 59 171 -153 14
3306 14 143 143 80 238 188 -140 89 -5 146 78 146 98 151 108 -31 19 23 126 67 112 -37 65 29 56 23 100 165
3333 165 -71 157 21 229 -32 12 -211 -142 -428 33 277 -476 68 -71 123 -138 184 52 78 293 -156
3354 -156 -162 -38 34 -107 -175 72 -163 -16 -41 29 -55 -169 -154 -23 -3 66 316 -33 -10 -14 253 63 -34 137 -69
3379 -69 -197 -148 50 -105 -122 78 -273 -86 -25 126 -226 67 -25 52 -205 38 -152 -194 -28 119 134 77 18
3402 18 -98 200 -299 291 -220 -20 -192 246 -141 -90 55 64 12 -46 -23 256 72 -148 123 -20 105 224
3424 224 -452 264 -189 54 -28 -28 -91 -91 33 -150 -42 201 21 -111 -94 119 127 -239 29 -197 -90 -30 -157
3447a57J00k32M11J32m80R8k1K13j13J37J07j8j70P6n9k46K11J48J49j93j96J00
3469cj37K13j40K22l96J53K37j97J31k16K87l16J85p2R4K14k62j27k06R7J33J41
3491C5q4j31L33j41M7J39k11o8qK21J9n35L06KJ74P7j34L3J62k23J91l52K97k04
3515e5j89L35o3m40N93j51j16k6K28j43r5L85k09J37J9k03k39L79k85m2J81n0
3537d9J89k37P4o1P1M4J86k51r9K2J54p5j45L3K01k4j36K55l21J13K5j32M11j79
3561F9j81L9NK22j64j51L56j66n3j32K45j20o9N5O5j95K98k3k22P4Qj7rJ66k41
3586a41N2j78L08K9J03j69M1j27j8K61n2p3q2Q3j02r0J55J38k3K5j74j08J35Q4
3610G7j68J48q0r8K59n3q2p1J36k33J23M23m45J01j60L34k18Rn7n6Q8kP8j4j76
$$ plain form
3447 -157 -57 -289 122 254 -226 -128 -149 64 -49 88 195 177 7 83 24 -222 -11 137 286 93 -103 -3
3469 -3 -140 73 -67 155 -241 -88 149 -48 83 -133 154 -162 23 -49 45 259 -3 -130 -336 -239 -106 35
3491 35 -49 -180 153 12 59 198 -13 -81 -89 132 151 -384 -78 -76 98 175 41 74 236 13 204 -148 149 -55
3515 -55 -244 91 28 -412 181 30 -86 -112 116 -27 -122 263 54 191 210 7 -232 147 -138 -180 1 -49
3537 -49 140 -97 -23 -84 -13 31 217 -34 -133 -111 43 -32 -177 -144 57 33 -103 152 -169 -56 -31 -163 248 69
3561 69 -112 -73 -68 154 -10 -161 195 29 -24 -156 89 -31 -100 -45 20 -175 123 100 -122 -48 -40 -57 -66 100 -141
3586 -141 -89 -267 41 70 173 4 45 -82 -100 161 109 36 -46 37 -65 -155 0 138 115 140 -34 -142 -7 77
3610 77 -91 57 -23 -121 138 85 3 -68 68 -165 -42 381 -64 37 -123 211 -7 2 -55 -111 -23 -25 53 39 -137
3635a37K47k45L36k49oK08l42J60r3K33J71m74O7J6J94k18M36j56rl53K57M9p3
3658A9j33L63m15J71r0M81n34j34L8K00L9K51m68K52K12m54K50l29K68p2J65O0
3680A40k31N0M6M8m3L65l81J15j08k42K12J1J01J6l39J96M7j36K06L9p7q5J23
3703G3Mr1J94k86K34l03K50P0mr6j97J25k6L7K2L0k01J23J45l19K51Oj2J40k56
3728h7k4L57k46j3K7n3J70k69J54j33j57L01r4L7j67K62Q6k01J10q9J58k00K78
3751B07k98O3J92j99j34K06K13j96j39K09l79m8K68J37k82M95j22p4j39k1J02
3772F1k62n8KL55j62L4j46K29P0r0M5o1L1L3j51K96r2j08j51J3J5J44j63K61L7
3797A82k29J18m65O55n01M86j29j74R4j52L02l50J61J83k33O3L22j91k69L11r2
$$ plain form
3635 -137 110 -135 201 -48 -54 154 -188 -28 -121 112 283 -191 -124 -108 86 -132 304 148 139 -214 43 92 19
3658 19 -114 249 -166 5 -85 396 -138 -272 -234 -34 5 256 -212 40 252 -202 48 -281 -13 -85 80 140
3680 140 -91 -41 5 53 10 375 -6 109 1 -241 -29 -18 83 99 -240 -44 3 -133 73 112 35 -50 73
3703 73 77 -14 180 -106 128 -175 75 145 141 45 -152 -27 -53 -16 6 36 -165 -42 103 -216 35 41 29 169 -87
3728 -87 -111 246 0 -13 14 -39 131 -138 16 -117 -274 27 -67 -30 -197 65 151 -50 60 -29 129 -71 207
3751 207 -91 -28 164 -35 -169 37 250 54 -85 124 -255 -303 -35 102 -180 315 193 119 -20 -41 61
3772 61 -201 -259 -257 98 -64 -30 -176 53 123 33 78 17 48 81 -70 226 134 26 -125 -112 -97 47 -116 145 182
3797 182 -47 71 -394 261 -240 246 117 -57 37 -115 187 -163 -2 181 -52 11 333 142 -127 184 92
3818I2K8m04J39O4j27R7R2j43K7K98j19k3R6l40K02pMJj29J27J75j25k4J82K5
3843B08q5k26j07L13k32K68k69j93J52j4L21p4K20j86r2O5K01O9n63P2L98K8k33
3866D1m0k08M31n66K66J89j24k07K28J76k84R5l4k26L42l34J27K62j31k6n7J64
3888H4j94n5L30r5n4J19l13J88J75rj52p5J64k15K93j78L8j85N06j04l30K0j25
3911a67J21j37J54Q2K2k15m6M9K96J66l80n5K8jK33j21j10K90j57k14L82j18k98
3934a96L00k25J1K08l76L14Oj41L55j49j20J95RO7m2n00L71Q9J41m20r2R8L57
3957B60k07j96J47K55k38j68L11k19J8R9j28J02j40J97n6j25O6M0J01j50J70j93
3979e4K12l90J84n0P3l13K58K23J01n73M84k0j14M8j51K04p0j04J91j38J80k56
$$ plain form
3818 92 120 -284 -145 -81 -208 -111 -19 -162 -135 163 44 21 117 -223 -21 -28 -24 -23 -152 -25 150 25 1 183 208
3843 208 123 -103 -210 103 -129 139 -130 -323 -171 -185 136 62 282 96 4 69 270 339 -224 -152 246 274 41
3866 41 1 -207 224 -342 -76 113 -11 -218 10 186 -98 -3 -37 -263 79 -255 -128 134 3 -23 -80 84
3888 84 -110 -165 165 70 16 135 -178 10 185 176 24 -51 113 -102 191 13 51 -134 372 268 -62 -42 -167
3911 -167 -46 -183 -29 53 75 -140 -186 -137 159 325 -55 -110 -82 -83 150 29 -81 209 52 -162 220 102 -196
3934 -196 104 -121 -110 98 -278 36 42 -99 256 107 -13 182 191 258 216 -284 87 176 317 -103 -195 -97 260
3957 260 53 -143 4 259 21 -147 164 -55 -37 62 -66 36 -104 93 37 -88 -22 18 119 -31 139 -54
3979 -54 158 -232 -48 -98 -25 -338 -80 143 244 -329 155 135 21 69 -82 122 52 -52 139 1 181 -75
4001g5n0L36l12j23K14J37m15K65L1p3J48N3J31j90r2j8l4r8K43Pq9j13J30O6
4025G9J20k2j33l84J56L93j47NN7j48j69o2K64k48M72J02j61l16L42J6m7n8j02
4048Ij02j36M12j29j84nm3J29P0Qj14J06l09K86O2R4O7j41j86K49j89M2L41n18
4072a81J35L8j04N05j87j23k11j22J96K11k39j55M90k84J71o0p1j65M09k43MK25
4094B39j24O0j54j67o0K54Pm5K16L8p9p7j65K87k55l2J29k55J29q4N8K76j92l28
4118c24L03j34R5N5J23k89K17p6L2n3K75l59K6J65J58j54l2MJ0rK2k18l2N3K35
4143I3l61J05K44k65K84k02n4J80j70Q6M0J81pj29J42l19K01l93M08k54K02k16
4165b04L80l2k48K70k36R2p2K21l19M36m86J63J18p6J38r1k69M77l96j4K57k34
$$ plain form
4001 -75 -125 211 -101 -224 -10 127 -288 -23 8 -65 83 136 267 77 -15 -33 -67 -165 78 85 -4 -117 13 79
4025 79 199 177 44 -340 -184 209 62 67 124 -24 -193 -255 9 -239 233 335 174 -142 200 216 169 111 9
4048 9 -93 -229 183 54 -130 -135 -178 -49 21 29 -85 21 -288 -2 60 154 221 80 -106 143 -46 -4 337 -181
4072 -181 -46 -8 -112 393 206 83 -128 -250 -54 157 -82 -237 253 -31 140 80 9 -156 253 10 14 239
4094 239 115 175 21 -146 -206 48 55 10 226 264 185 108 -57 230 -25 -57 72 -183 -54 -138 -80 196 4 -324
4118 -324 -21 -155 -60 -5 118 -171 46 -30 2 -51 224 -135 -109 56 214 60 28 32 42 33 55 -163 -195 -142 93
4143 93 -268 -163 81 -184 100 -102 -156 24 -146 -60 -20 161 154 25 167 -152 49 -344 64 -190 12 -204
4165 -204 176 144 -104 166 -70 22 -50 171 -148 288 -198 -35 83 7 145 54 -215 262 -134 -148 109 -125
4187a25R9n6J14K5o8Pr3q3J10J87j7j95j12K42o2P8l5Pl5J75j73j37L43k63R8
4212C1j23NN0m5Q7l5K48o4r0j32J32k4k21J51j1l3O5J81m51L69j78k1M14m70K60
4237I5j72n6q9l7J03J22j85L24l43J26J06R7j03j9m2J72k11R0j11k85L37N4Q5
4260E8k6j67k9K8L8k8o7N20j28k85J59o7Q3m03L18j0K22r7k98oj40O72m34K27
4284A40Op8K8qr8O2kO1j40Q2k00L12J94m07L6o5L15j07k13K22j85K96k23j53K36
4309A11j40L9k42L80m35L12L4J38l75O2j48J58j20K64j44K88m11J12q3K93J47
4330B40j38J46j10k64J69j56P5l9nk5J43O3j13j21K16R4K63n45J57k1K7Rr2J0
4354a7o5L90m71L34o9j44l3J16J05k30j27j7J11Q7r3K11NL1l34J83l9K4j03l7
$$ plain form
4187 -125 -26 -82 32 57 -11 -4 -97 -180 -70 117 100 -95 -207 35 -27 51 16 23 -12 163 -10 -147 196 -67 31
4212 31 -92 -87 -37 -82 5 -30 218 154 64 -68 64 40 -181 -30 -41 -74 -9 172 -279 90 -88 -109 305 -165 95
4237 95 -77 -133 -222 -259 -156 -34 -219 105 -238 -112 -6 91 -12 -31 -73 99 -112 -22 -133 -418 -81 -27 58
4260 58 32 -135 -164 -136 -98 -126 -193 327 199 -86 73 6 89 -314 4 -6 216 119 -179 -185 -325 347 -87 140
4284 140 146 68 96 88 -10 52 50 111 -29 53 -147 165 359 -48 -12 -77 238 131 -82 140 -45 251 28 -125 111
4309 111 -29 10 -232 148 -287 25 59 197 -178 -116 -264 -106 -226 38 -106 182 -229 -117 -200 93 240
4330 240 102 248 138 -126 43 -113 -38 -77 -82 -107 36 99 -14 -135 81 175 438 -107 50 29 56 65 -27 -17
4354 -17 -82 308 -163 171 102 -42 -75 41 146 -84 -211 -228 -117 -30 -123 88 93 124 -210 -27 -66 -42 -145 -182
4378a82m1R4K62p9P2p1k09K8K86j85r1Q2j08K96r4n3k43L18K48n12Q6R0j41O0
4402h7J32k14Q8j61J01K6p8L78k55J88j73M05j65k35J41J8l20K28J09L6k89j24
4424b51L52K26m39K17j41K30J39l83k62K85K19j44k56O7J99J25j56j33J19o5J94
4445A42k5N8j84j07J73R1k65L36m24L00j37K18J7j69j4J29j44k75J57lJ82j51
4467i5K06j67j40J87M27k30k00Qj34K99n9LRk56K38K29k69O7j6k67J00O9J1R4
4491A14n3J71j57j65L42m27J65N8R6l62K02J59q8j52P4j96o7L42m1L42m56J74
4513G5K26k65J5k76N2mJ43Q8mr6k8J71N0l38J67P3J7k7K65m54K01j42M6%l9OJ56
4540G8L1k12K08k52J45J70k83N3J72j42j36J27N3m5l7J23P8j09M5j27R6R4k45
$$ plain form
4378 -182 -223 -129 133 54 126 55 -154 -126 160 -25 -116 -34 -142 154 60 7 -236 82 330 -182 -96 -6 -147 -87
4402 -87 45 -169 -81 -242 -141 -115 -193 185 -70 118 -55 350 185 -50 91 109 -211 17 126 162 -127 -251
4424 -251 101 327 -112 105 -36 194 333 -50 -312 -27 192 48 -208 -141 58 183 27 -106 13 -52 142
4445 142 117 175 -9 -116 57 148 -117 219 -205 95 -42 176 193 24 10 139 -5 -280 -123 -126 56 -95
4467 -95 111 -56 -196 -9 418 188 -12 -4 -138 161 102 105 114 -142 96 325 56 123 107 -160 -60 9 20 114
4491 114 61 232 75 -90 252 -175 -10 48 144 -218 -16 143 55 -97 -23 -219 -286 56 15 357 -99 75
4513 75 301 36 51 -225 -173 -177 -34 54 50 -46 -74 97 147 -191 -24 49 66 39 304 -150 51 -91 -45 -45 -84 -78 78
4540 78 109 -103 105 -147 -2 168 -115 -62 110 -32 -168 -41 12 -33 -70 53 131 22 67 -60 36 130 -115
4563a15k00J04K50o2P6l1O8r4k35R3Q7K3L02k24j46Q4J0O6j43J80k41K14L9l9
4587F6k21M22l96R8rK41J3k75j35L53J5j56j64L28k79N7P7p8M05M1m25J34j29
4610a7K00m23Q0K37l23J28K7K22l81L04q5J38k38J64N4l1k70L84k67Q9p8K67k89
4633a08J99k13J28l04L08J84k08q0J29K09m48K56L4L5k00p9kJ44o0K04j86L0P0
4656D2j2R4j44k84M01N2k08J10k00K30m7K41m02K07k79k9L11R2l39J3K97o8M5
4679A23p8J70q4J4p9J36k36j82Q8K58k01O3o6K75N5m26L47j07k59K09l54L84k04
4702a54P9j81M37k87L12o7J0j43k14K81K11n3k07k23J48J78m6Q8R4j42m33O5N7
4725a90K35K0L8p1k09mL7j0J55J40l54J96j69K24l1N6J62l57L9K34O0k4k1l36
$$ plain form
4563 -115 -315 -211 39 -23 53 22 90 -4 -239 -146 -59 -36 266 42 -104 -20 -10 56 -87 93 -148 66 105 66
4587 66 -155 267 -129 -31 -40 201 214 -61 -196 157 172 16 -148 180 -99 -42 35 -43 362 403 -22 112 -17
4610 -17 183 -240 -160 77 -246 -118 -91 131 -250 54 -31 107 -131 33 87 56 -214 170 -97 -8 -86 181 -108
4633 -108 91 -122 6 -298 10 194 -14 -94 35 244 -204 52 86 121 -79 -158 -160 -16 -76 128 -58 -28 42
4656 42 30 124 -20 -304 97 149 -59 51 -149 81 34 275 -127 80 -199 -228 83 175 -164 -151 146 78 123
4679 123 45 215 131 145 66 202 -34 -216 -128 130 -71 -8 -74 201 256 -170 177 70 -189 20 -334 50 -154
4702 -154 -75 -256 181 -106 206 139 149 6 -208 73 284 231 24 -199 -51 127 81 169 263 121 -312 -247 -190
4725 -190 45 65 103 32 -177 -181 -144 -154 1 141 -213 -17 -186 38 7 63 225 -132 -93 141 201 177 156 -180
4749a80K00ml4Q7n0k77L65j06K7Q0j1r4J00j09K6j0l89L29J51l18J5J47O2m0K81
4774B48n5K1k17k6J41J7r1J31k03K4M3j24j24L80K01l79j86J29J99l40K50J7J69
4797B25j26j94L4j52K78lk39L62j44k23J51M52l60j59Q5K84j15k7k25K88J94n24
4819a38P9j35L02n7K36j75j14L2L6j54M4K8J57j95K7J20l1K45j43m0j59N0M6J69
4843B30l78pJ55j84K03Q7m2j0k28K12j24J11j9j64J35L89l17J18j06j20n4k06
4865c19L54k0k7k57L49q0k39oJ96q5N7j57L89k4j61J18j24j24L1N5J96N2j58k43
4889b27K52j08qJ69J8p1j11j07L74k20j42K17m4o3J13Nj0m1J10n5J24m58K81k5
4913b7j57M65k37J53j10J2j0j35L3jJ35n6j67J03K82j75j31k2j62L69o5Kl07J6
$$ plain form
4749 -180 20 16 -18 69 19 -258 107 1 28 108 97 3 103 -6 20 10 -379 -50 101 -217 -202 -55 7 -33 248
4774 248 193 214 -3 -29 112 129 38 169 -34 -10 33 -91 -215 165 366 -13 -199 -70 129 -211 39 56 225
4797 225 99 -95 -61 -213 65 62 -177 185 41 -182 -31 421 61 -98 -13 271 156 129 -96 192 386 -138
4819 -138 -59 -194 108 51 287 112 -2 30 66 -88 -44 -16 141 -54 -27 93 62 307 164 124 -35 15 61 230
4843 230 -148 -155 0 -184 19 106 64 54 -174 38 -86 25 6 -158 -23 366 49 167 61 -59 -113 -319
4865 -319 35 15 -12 -269 80 0 -239 -245 -49 -134 -77 -234 155 131 -30 88 -36 -160 -129 -74 122 174 16 -227
4889 -227 25 -83 -91 78 96 25 -86 -193 181 -39 -181 36 -8 -71 42 47 37 -4 106 51 175 -283 -2 -27
4913 -27 -184 281 44 197 87 99 89 -46 -13 -14 121 65 -102 1 283 108 -23 -45 -207 162 97 99 -208 -192
4937a92L45l40o7J89J86K3k52J04J5j08L70l52J6K49j45K3l66M7K01M2N1l75L86
4960E0k63J44k2k9J28K41m13K24o2K63k89K82l00J31K0j13k03R0M01j53l42K62
4982D7q2l2qj37J9K19j02J89j81J00k37P2J34N4k2l5j74k6R7O3l5j38J24K73j79
5007Cj76J62o2m8K17j41O6o3o1O0J10j83p1P0L39j17m0l36M56n0o2Q4l80K06K4
5032GPk23M33k79K34k30r6K0M1J29q0p2K81j20k61L03k43K45k0l80N31n7j36l29
5056b95L58O9k17M05l30q8J91j23k7K29P6k08k6j35K41L2nm81R5JL02K4j19N6
5080B5N7N4j81K26k57M9M9r8k7l8L53j30l38J50O4J8k16M91l77j98K27J7K56m4
5104A32k80J80j63l6l3J4N9O1J70m2r1k31J27J86k01J34K43l31K9q0K35j20q1
$$ plain form
4937 -192 153 -187 -254 -65 121 144 -108 -4 11 -97 273 -79 -63 186 41 64 -302 -255 -54 -12 39 -336 50
4960 50 -213 -69 -91 -120 8 249 -164 60 -2 261 -28 254 -46 85 105 -8 -211 -121 280 127 -215 47
4982 47 -35 -67 -75 -212 -193 26 -76 113 -68 32 -205 -133 1 55 33 -2 -176 -202 -105 -42 -77 -215 -91 182 3
5007 3 -173 -11 -73 -121 96 -45 21 -42 -103 -43 67 -116 -187 -117 222 105 65 -271 185 135 73 157 -223 -17 7
5032 7 14 -209 224 -55 179 -51 -147 -127 -86 43 -37 -109 172 52 -209 94 -149 96 76 -304 227 170 34 -295
5056 -295 63 132 -85 320 -10 -98 93 -30 -57 172 248 40 14 -121 120 152 147 -334 -239 -238 64 88 -31 25
5080 25 82 136 -45 181 -76 -27 22 -76 -103 -141 212 82 -256 -106 -42 -24 -240 251 -126 -324 -97 -80 176 132
5104 132 -148 32 -131 -167 -200 -186 -127 -66 104 62 -29 -260 -133 53 -148 -14 229 -102 -73 -153 82 -38 -119
5127a19K71j28Nj88L10K0l84K96N6k5j58J3P7M7q9O4k32k30K55l0J64l9L19q7
5151A88l18j19N33k55%J84l24J46j10J67R5l53K94k17J02n5q9K06k13J96k20Q3
5173g9j72J71J17j9p8q4J04n0J07J48j20j85J05L5L42m80J41%K76o4m61N32j87
5196I9j30N8j44K30j26K21m24J42j19J74k0j04J94M3J3j77K53m6j52J17J62j91
5218G3O9j29j0lM1K4p7l02K24K2j18K05O3o6j51p1J05K7J60l37K39m0J76k06j23
5243b05K81P0m36M57l07J40q1j6N7J25j63n4J67j39Q4J79Q3m02K95P5l40q3N07
5266B94k28j38J96l03m1L5J92J34l5j87J9ko5m7J13N17n13j12J45J61j01j19J22
5289C7J31k35l4M03n35K86j61J9K89p3j19n6j7P1L2l16M27k25J97J22l63K53l44
$$ plain form
5127 -119 152 24 29 -159 151 171 -213 83 139 114 -44 -31 46 93 4 68 -164 -394 -139 -169 -5 -44 275 188
5151 188 -130 -249 284 29 29 213 -111 35 -75 92 187 -166 128 -89 13 -42 -131 75 -138 58 -162 -79
5173 -79 -251 -80 37 18 -60 -144 -40 -90 17 165 45 -140 -35 0 342 -138 3 3 279 215 -246 286 99
5196 99 -31 27 -117 113 -13 208 -216 -74 -193 -19 -39 -143 51 94 107 -70 183 137 -15 102 264 73
5218 73 142 13 3 0 41 65 -12 -314 -90 -68 -186 19 82 16 -135 -206 -101 -74 86 -251 -12 -52 124 -82 -205
5243 -205 76 146 -290 167 -140 0 -81 -97 -40 85 -78 -132 35 -104 -20 159 242 -160 135 210 -130 -213 294
5266 294 66 -72 124 -179 -220 -185 7 141 106 -81 -62 -64 -129 -176 -63 454 -59 -171 -26 135 34 -85 37
5289 37 168 -67 -101 302 -233 53 -108 -89 200 127 8 -48 -65 6 38 -278 149 -76 121 243 -120 133 -211
5312b11K04K26k53n6J60r9r4J92J0n0K35l81N4M4j05K31j72J74n3J3r4QJ37M3
5336A63k63K54l09L13k36K22r5n7R6k53Q2j43Q4k1J08K57k87K56MJ33j88j27J90
5359A83k46M9p4K87k28O0k04K13j71j33J35J98j15J38j46P2m7j07M7j53L62K4
5381A44m7k90K66j85J46R6o7j62K44j42jJ13l19N4K94l52J82nR2k6o3l04L26n6
5405f2K80k28Oj12J20P6k28K9R5J45q9k19K57J61m14K91m5R1J25j79p2J52j65
5428A5M09l17k76j7L42j02m8l81K88m6J65R9j00J76l9j80r1p0R8K0L40l71K60
5451A74L6m70R4O1K16mk3j14p4M4k7K30mk15K24m30O8J4K0J60nL0p3Q0N1j05L
5478c9j32J87n4M0K52j11k23J30J23l26J1J07J03o5m70M25J3o2K58j77j18J34
$$ plain form
5312 -211 -7 219 -34 -90 70 -29 -123 69 79 29 264 -117 -63 -19 -124 107 -65 109 56 69 -25 -17 120 163
5336 163 -100 154 -155 158 -78 144 49 -8 88 -165 -83 -226 -142 -163 -55 202 -85 171 175 308 120 -7 183
5359 183 -63 -14 -88 199 -29 31 -173 40 -131 -264 -129 69 -46 92 -54 18 -29 -136 -89 -242 120 144
5381 144 97 -193 73 -112 34 130 63 -99 145 3 2 115 -204 -150 144 -208 -26 -31 61 35 -28 -332 -6 -62
5405 -62 218 -10 -4 -116 4 80 -148 -119 -24 121 32 -187 70 231 -183 108 63 154 279 100 28 180 15
5428 15 424 107 -169 -186 156 54 6 -375 -87 -133 32 131 31 207 168 -12 -103 -173 -75 -55 285 -86 174
5451 174 210 -260 -166 -105 111 107 84 -30 -104 -60 -87 143 139 -76 148 -282 -214 -200 -180 -20 -25 5 -68 12 63 -42 -39
5478 -39 -171 16 -38 2 254 143 -80 50 173 -153 -142 -35 68 3 -467 -42 -29 -91 167 -10 -128 6
5500FRj88P9J85j78p6n9J07K16j39K83q2J02j04j28j08L7K42k36P9q1j93K26n2
5524e3R1p1m8K81j64L5j21L82j10l23Q3j0L06n05K01K13k31J21j07J8L0J30j35
5547A3P0P6l21r9L15R0m66M56N4k00m5J78k30J98l55N2K64j70J87kN1K00j67J59
5571C08m38J61j24K24j58r2o1M15n17K11K2p5J26J01j65J19j25k19L25ok55LL35
5594A15j96q1L45k99J24K15k45q5J8j30J14J55q4k47L68q1r0Np7J50J74j81j20
5617a33K7j37L45k3l78M57l27J29j65J35L73n27J03K43Q0k57J68r0R8n7O7j0j28
5640gL3J65J8m73J40J8J47k33M11k31l9J38k80J56n9K05l93M49j00j59nq4m4M19
5664A92l7j88L7N6Ro2m3l86K94J60K09m29J89j00R9K78j54j54J25J93l84J42J9
$$ plain form
5500 6 15 -173 -94 91 -87 -163 -222 -115 101 -38 245 163 265 161 33 -75 -38 204 -32 47 -34 -227 -1 -53
5524 -53 38 -33 -81 200 36 71 -50 332 222 -101 -18 -28 278 -227 -26 187 -44 77 -30 -12 18 148 13
5547 13 83 159 -162 -261 54 144 -322 134 188 -12 -57 121 -109 89 -266 -214 50 -120 67 65 116 316 149 308
5571 308 -130 31 -93 131 -27 -119 -180 235 -282 -71 -49 -124 2 103 -62 57 -68 -287 38 32 -223 -220 115
5594 115 -81 -162 183 -116 8 223 -22 -107 -89 -219 -105 50 -34 -281 87 6 -84 -79 -156 -6 168 -13 -133
5617 -133 -106 -243 102 79 -299 158 -169 -40 -205 -70 303 -224 -121 122 202 -55 113 23 121 64 131 121 -7
5640 -7 26 191 209 -264 -124 -106 41 -192 219 -12 -51 87 -193 -37 -96 109 -284 165 65 -94 -99 -183 -227 192
5664 192 155 -33 4 60 69 7 -36 -422 -128 32 241 -188 1 -99 0 278 124 -30 95 288 -96 46 65
5687F5q5M9j60n6J01NK8J54k07O9J91j95j68o1L69p0j84M3R8j41j18M85k89J92
5711A15k52K20k90J59K41q9o8j11L43j91P8k68QrO13m98r7K4Q5l31M3L01m5K74
5735B55j65j52K80k81L6J59o2J83l65j23M82m59L93j06j49L13k03l0J75k02k5
5756d6J91K6j26M86l67O6N2j29k16j22M7J49oj46M87n25jJ62J7J15k51K21K0m24
5780c20M03j49O9p0m1M3K11k6J45k22pk41J23o8K27l5j76JN5j03J31J82l06M0
5804a34J05L56m79L6K47k70K71j00Kj31k70K8L17J35j54J54j81K10m0K7k97K10
5826D2k5J12l59L52j34K22l2k57K39m22K61L35l85o5j92L00J08k16K85k94O0l
5848f8k01K73k8k48O53m32j24N5L25m9j26j64rQ2k57K65J48j70J99k43rK75j80
$$ plain form
5687 65 -20 29 -131 -187 -86 -81 -53 101 -106 -37 154 -41 -209 -270 99 29 -155 -112 -14 -155 -273 212 -77 115
5711 115 -137 83 -207 -48 193 104 36 -75 268 77 155 -113 -105 -114 499 1 -96 -72 13 -318 -275 26 -19 255
5735 255 90 -62 218 -63 -27 132 70 253 -112 -235 247 -212 181 75 -74 239 36 6 181 -21 -46
5756 -46 145 171 45 531 164 230 282 153 -63 -185 -138 11 5 -141 346 -179 -180 -18 -1 114 -137 84 104 -320
5780 -320 83 -66 3 -67 -108 -65 146 120 265 43 36 -205 -82 -150 77 42 -134 -133 -78 -181 -50 132 -174 -134
5804 -134 -29 327 -152 -116 131 -139 132 32 34 -97 -367 -339 -22 113 -41 113 -68 142 102 129 -168 42
5826 42 17 129 -230 122 -12 210 178 -79 160 -262 -1 334 -51 -116 -308 -8 100 -116 169 -125 -65 -68
5848 -68 -269 4 -24 -272 381 -51 -175 -120 205 156 30 -134 -143 -61 -318 -53 95 -75 124 -119 -128 147 -33
5871c3L07l91N7J10k09J93j77o3K32J4j74K80k18K3q0J37O1J28k41q1O7J42k40
5894a56J11j35J06J51J18j98k20L12J30l20j13L70R0l52J58m6J15N1n9o6q3k50
5916b86L94j30l3l02J21M07j54j77N5K00q9j61N4J65J67Q4l11QM3K40j68l82K44
5939a1K00k41J84J61l02j33R6j18K1J90k63J16K6J21m03L75K2L45m62K04L00m72
5961d4J90j50l0K8o8r2L2J99R9j52j52J76k34PL15k85J38j60j46O21l84K8J12
5984D8j5Rk93L36q1j12J14K30m37L09O0j78j73L10J22m03r1K26k97M10m39L11
6006c4RJ72q7k06N5K14k37J87j37J1j64k6L24k86K83l81M11o9p2o6M5p4q9J77
6030d0K61j28O9r5n8r9K03L0j80J28M9L8L1r5l47J3K95J0k8p0M0j45K1q5J54r9
$$ plain form
5871 -33 274 -117 -60 50 -159 34 -143 -206 26 40 -134 146 -72 -49 -129 8 69 197 -44 -125 -58 84 -156
5894 -156 -45 -180 -74 77 195 -3 -223 89 219 -101 -214 156 246 -106 52 6 121 172 113 47 -36 -286
5916 -286 108 -22 -55 -357 -236 171 17 -160 -105 95 6 -155 -101 64 231 315 4 12 55 295 127 -255 -11
5939 -11 189 -52 132 293 -9 -142 -46 -164 -143 47 -216 -100 -74 47 -356 19 41 386 -76 128 428 -44
5961 -44 146 -4 -34 -6 -74 -166 -134 65 164 12 -140 36 -198 -191 124 -161 -23 -183 -329 292 -92 -64 48
5984 48 33 42 -251 85 4 -108 6 236 -201 108 168 -10 -183 127 249 -154 -245 -19 -316 94 -345 -34
6006 -34 -25 147 60 -146 -91 123 -114 73 -64 -53 -217 -243 81 -205 78 -303 108 39 -33 -99 -54 -128 -217 -40
6030 -40 221 93 162 67 9 -90 113 143 -37 91 140 178 209 114 -233 -220 75 85 57 -13 27 -118 -97 -182 -28 -127
6056a27J18J36r0K7m6k19K61L1k57J17K1r0J53J45k71J65k19R0j93M24k01R3m3
6079B5L9o2q2K88j39q6J69j37j75L3K95J39m45o9R3L36j26j92J58j59j15K45l6
6102cJ36O8q9m2J32k13J70j93k9M8j55J29N4j5k70K86j1k0N9n8P1r2K50l53J52
6127A2J88k66j85K72K04k24p0K2j83L27k1J0r4N7R2J6k5k28j47K90p5L12k86m15
6151d17O09j31N0l7M6j23R7m4J81k65k2k00M38j07nr4j6k66M73j36k39O1o0L04
$$ plain form
6056 -127 -9 127 37 64 18 -201 60 91 -166 -49 -28 -118 35 180 -91 74 -145 -55 -248 176 -25 68 25
6079 25 64 2 -80 208 69 -17 152 15 -160 -127 168 307 -138 -207 -114 222 96 -96 62 -97 -212 33 -3
6102 -3 133 201 112 70 202 -11 159 -34 -63 -15 -170 -41 13 -2 -272 14 3 -17 42 -16 55 -37 213 -140 12
6127 12 200 -66 -251 21 225 1 -69 -47 -230 97 76 86 -8 49 141 157 132 -96 -243 47 -28 284 -2 -417
6151 -417 192 61 111 74 120 -3 94 50 231 -34 -56 -256 182 75 70 -24 -40 -306 167 31 -208 -147 -207 97
$$ [...]
8191D7
##END NTUPLES=NMR FID
##END=
