##TITLE=1H_Forskolin(XAQA)
 DMSO-d6, 8 sc, 
 11.6.2020
##JCAMPDX= 6.0         $$ Bruker NMR JCAMP-DX V2.0
##DATA TYPE= NMR FID
##DATA CLASS= NTUPLES
##ORIGIN= UXNMR, Bruker Analytische Messtechnik GmbH
##OWNER= root
$$ XWIN-NMR		Version 3.5
$$ Thu Jun 11 11:09:01 2020 Russian Standard Time (UT+4h)  she@DPX200
##.OBSERVE FREQUENCY= 200.1315
##.OBSERVE NUCLEUS= ^1H
##.DELAY= (6, 6)
##.ACQUISITION MODE= SIMULTANEOUS
##.ACQUISITION SCHEME= undefined
##.AVERAGES= 8
##.DIGITISER RES= 18
##SPECTROMETER/DATA SYSTEM= spect
##.PULSE SEQUENCE= zg30
##.SOLVENT NAME= DMSO
##.SHIFT REFERENCE= (INTERNAL, DMSO, 0, 15.7039)
##AUDIT TRAIL= $$ (NUMBER, WHEN, WHO, WHERE, WHAT)
$$ ##TITLE= Audit trail, XWIN-NMR		Version 3.5
$$ ##JCAMPDX= 5.01
$$ ##ORIGIN= Bruker BioSpin GmbH
$$ ##OWNER= she
$$ F:/spectra/data/she/nmr/H-F/1/audita.txt
$$ ##AUDIT TRAIL=  $$ (NUMBER, WHEN, WHO, WHERE, WHAT)
(   1,<2020-06-11 11:07:49.71 +0400>,<she>,<DPX200>,
      <created by zg, POWCHK disabled, PULCHK disabled
       configuration hash MD5:
       00 E9 B6 7A A2 85 ED C7 34 08 36 98 17 FE 4E 26
       data hash MD5: 16K
       13 43 34 CE 39 6F 08 F1 F7 0D 68 EF F5 4A E0 F6>)
$$ ##END=
$$ 
$$ hash MD5
$$ D3 44 8E 7E C4 42 08 F5 29 A3 EA 16 B4 10 86 13
##$RELAX= 
##$RELAX= 
##$RELAX= 
##$RELAX= 
##$RELAX= 
##$RELAX= 
$$ Bruker specific parameters
$$ --------------------------
##$DU= <F:/spectra>
##$EXPNO= 1
##$NAME= <H-F>
##$PROCNO= 1
##$TYPE= <nmr>
##$USER= <she>
##$AMP= (0..31)
100 100 100 100 100 100 100 100 100 100 100 100 100 100 100 100 100 100 
100 100 100 100 100 100 100 100 100 100 100 100 100 100 
##$AQSEQ= 0
##$AQ_mod= 1
##$AUNM= <au_zg>
##$AUTOPOS= <>
##$BF1= 200.13
##$BF2= 200.13
##$BF3= 200.13
##$BF4= 200.13
##$BF5= 200.13
##$BF6= 200.13
##$BF7= 200.13
##$BF8= 200.13
##$BYTORDA= 1
##$CFDGTYP= 0
##$CFRGTYP= 5
##$CHEMSTR= <none>
##$CNST= (0..31)
1 1 145 1 1 1 1 1 1 1 1 1 1 1 1 1 1 1 1 1 1 1 1 1 1 1 1 1 1 1 1 1 
##$CPDPRG= <>
##$CPDPRG1= <>
##$CPDPRG2= <>
##$CPDPRG3= <>
##$CPDPRG4= <mlev>
##$CPDPRG5= <mlev>
##$CPDPRG6= <mlev>
##$CPDPRG7= <mlev>
##$CPDPRG8= <mlev>
##$CPDPRGB= <>
##$CPDPRGT= <>
##$D= (0..31)
0 1.2 0 0 0 0 0 0 0 0.06 0 0.03 0 0 0 0 0.0002 0 0 0 0 0 0 0 0 0 0 0 0 
0 0 0 
##$DATE= 1591859269
##$DBL= (0..7)
120 120 120 120 120 120 120 120 
##$DBP= (0..7)
150 150 150 150 150 150 150 150 
##$DBP07= 0
##$DBPNAM0= <>
##$DBPNAM1= <>
##$DBPNAM2= <>
##$DBPNAM3= <>
##$DBPNAM4= <>
##$DBPNAM5= <>
##$DBPNAM6= <>
##$DBPNAM7= <>
##$DBPOAL= (0..7)
0.5 0.5 0.5 0.5 0.5 0.5 0.5 0.5 
##$DBPOFFS= (0..7)
0 0 0 0 0 0 0 0 
##$DE= 6
##$DECBNUC= <off>
##$DECIM= 24
##$DECNUC= <off>
##$DECSTAT= 4
##$DIGMOD= 1
##$DIGTYP= 9
##$DL= (0..7)
0 120 120 120 120 120 120 120 
##$DP= (0..7)
150 150 150 150 150 150 150 150 
##$DP07= 0
##$DPNAME0= <>
##$DPNAME1= <>
##$DPNAME2= <>
##$DPNAME3= <>
##$DPNAME4= <>
##$DPNAME5= <>
##$DPNAME6= <>
##$DPNAME7= <>
##$DPOAL= (0..7)
0.5 0.5 0.5 0.5 0.5 0.5 0.5 0.5 
##$DPOFFS= (0..7)
0 0 0 0 0 0 0 0 
##$DQDMODE= 0
##$DR= 18
##$DS= 0
##$DSLIST= <SSSSSSSSSSSSSSS>
$$ [...]
##$SUBNAM2= <"">
##$SUBNAM3= <"">
##$SUBNAM4= <"">
##$SUBNAM5= <"">
##$SUBNAM6= <"">
##$SUBNAM7= <"">
##$SUBNAM8= <"">
##$SUBNAM9= <"">
##$SW= 24.9337058887773
##$SWIBOX= (0..15)
0 0 2 0 0 0 0 0 0 0 0 0 0 0 0 0 
##$SW_h= 4990.01996007984
##$TD= 16384
##$TD0= 1
##$TE= 0
##$TE2= 300
##$TE3= 300
##$TEG= 300
##$TL= (0..7)
0 120 120 120 120 120 120 120 
##$TP= (0..7)
150 150 150 150 150 150 150 150 
##$TP07= 0
##$TPNAME0= <>
##$TPNAME1= <>
##$TPNAME2= <>
##$TPNAME3= <>
##$TPNAME4= <>
##$TPNAME5= <>
##$TPNAME6= <>
##$TPNAME7= <>
##$TPOAL= (0..7)
0.5 0.5 0.5 0.5 0.5 0.5 0.5 0.5 
##$TPOFFS= (0..7)
0 0 0 0 0 0 0 0 
##$TUNHIN= 0
##$TUNHOUT= 0
##$TUNXOUT= 0
##$USERA1= <user>
##$USERA2= <user>
##$USERA3= <user>
##$USERA4= <user>
##$USERA5= <user>
##$V9= 5
##$VALIST= <valist>
##$VCLIST= <CCCCCCCCCCCCCCC>
##$VD= 0
##$VDLIST= <DDDDDDDDDDDDDDD>
##$VPLIST= <PPPPPPPPPPPPPPP>
##$VTLIST= <TTTTTTTTTTTTTTT>
##$WBST= 1024
##$WBSW= 4
##$XGAIN= (0..3)
0 0 0 0 
##$XL= 0
##$YL= 0
##$YMAX_a= 100592
##$YMIN_a= -90076
##$ZGOPTNS= <>
##$ZL1= 120
##$ZL2= 120
##$ZL3= 120
##$ZL4= 120
##$ABSF1= 10
##$ABSF2= 0
##$ABSG= 5
##$ABSL= 3
##$ALPHA= 0
##$AQORDER= 0
##$ASSFAC= 0
##$ASSFACI= 0
##$ASSFACX= 0
##$ASSWID= 0
##$AUNMP= <proc_1d>
##$AZFE= 0.1
##$AZFW= 0.1
##$BCFW= 1
##$BC_mod= 2
##$BYTORDP= 1
##$COROFFS= 0
##$CY= 11.3945322036743
##$DATMOD= 1
##$DC= 2
##$DFILT= <>
##$DTYPP= 0
##$F1P= 16.9975609425685
##$F2P= -3.02152046262296
##$FCOR= 0.5
##$FTSIZE= 0
##$FT_mod= 4
##$GAMMA= 1
##$GB= 0.15
##$INTBC= 1
##$INTSCL= 1
##$ISEN= 128
##$LB= 0.24
##$LEV0= 0
##$LPBIN= 0
##$MAXI= 10000
##$MC2= 0
##$MEAN= 0
##$ME_mod= 0
##$MI= 1.114404
##$NCOEF= 0
##$NC_proc= 0
##$NLEV= 6
##$NOISF1= 3.799351
##$NOISF2= 2.8
##$NSP= 1
##$NTH_PI= 0
##$NZP= 0
##$OFFSET= 15.70392
##$PC= 1
##$PHC0= -9804.912
##$PHC1= 32.00087
##$PH_mod= 1
##$PKNL= yes
##$PPARMOD= 0
##$PSCAL= 0
##$PSIGN= 0
##$REVERSE= no
##$SF= 200.130013532006
##$SI= 16384
##$SIGF1= 3
##$SIGF2= 2
##$SINO= 400
##$SIOLD= 16384
##$SREGLST= <1H.CDCl3>
##$SSB= 0
##$STSI= 0
##$STSR= 0
##$SW_p= 3612.71676300578
##$SYMM= 0
##$S_DEV= 0
##$TDeff= 0
##$TDoff= 0
##$TI= <>
##$TILT= no
##$TM1= 0
##$TM2= 0
##$TOPLEV= 0
##$USERP1= <user>
##$USERP2= <user>
##$USERP3= <user>
##$USERP4= <user>
##$USERP5= <user>
##$WDW= 1
##$XDIM= 8192
##$YMAX_p= 0
##$YMIN_p= 0
$$ End of Bruker specific parameters
$$ ---------------------------------
##NTUPLES= NMR FID
##VAR_NAME=  TIME,          FID/REAL,        FID/IMAG
##SYMBOL=    X,             R,               I
##VAR_TYPE=  INDEPENDENT,   DEPENDENT,       DEPENDENT
##VAR_FORM=  AFFN,          ASDF,            ASDF
##VAR_DIM=   8192,          8192,            8192
##UNITS=     SECONDS,       ARBITRARY UNITS, ARBITRARY UNITS
##FACTOR=    0.0002004,     1,               1
##FIRST=     0,             0,               0
##LAST=      1.6414764,     0,               0
##MIN=       0,             -90076,          0
##MAX=       1.6414764,     100592,          0
$$ Real data points
##PAGE= N=1
##DATA TABLE= (X++(R..R)), XYDATA
$$ [...]
$$ plain form
2145 2091 624 -1673 -1998 -348 1537 1800 763 -901 -2066 -814 310 1778 1304 -432 -1727 -1564
2161 -1564 363 2059 1490 -396 -2195 -1770 466 2438 1942 -562 -2157 -1689 377 2030 1581 -343
2177 -343 -1551 -1436 -52 1795 1765 80 -1336 -1629 -290 1142 2151 787 -1224 -2198 -672 1368
2193 1368 2385 1176 -1692 -2298 -600 1754 2139 925 -1409 -2258 -491 955 1776 590 -967 -1661
2209 -1661 -1065 617 1491 1359 5 -1612 -1634 137 1882 1813 -46 -1982 -1957 356 2256 1986 -70
2226 -70 -2274 -1707 634 1874 1571 -268 -1711 -1493 348 1334 1394 6 -1105 -1853 -933 966 1994
2243 1994 997 -1046 -1901 -974 1101 2408 1340 -1009 -2409 -1076 1211 2233 906 -1428 -1877 -884
2259 -884 1367 1592 805 -561 -1633 -1277 233 1599 1572 116 -1643 -1517 -91 1408 1941 391 -1960
$$ packed form
2145B091j467k297l25J650J885K63j037j664j165J252J124J468m74j736j295J63
2161a564J927J696n69j886j799M25K236J972m96k504j595M68K066J653m49j924
2177c43j208J15J384J847l0j685j416k93J339J432J009j364k011r74J526K040
2193A368J017j209k868o06J698K354L85j214k334q49J767J446Q21j186j557o94
2209a661N96J682Q74j32j354j617k2J771J745o9j859j936K5K313J900k70k056
2226g0k204N67K341J240l03j839j443K18J841R86O0j388j111p48R20J899J028
2243A994r97k043q55R27K075J307j068k349j400J333K287J022j327k334m49R93
2259h84K251K25p87j366j072L56J510J366k7j456j759J26J426J499N33j550k351
$$ plain form
2276 -1960 -2224 -358 2307 1924 34 -2112 -1882 463 2092 1647 -133 -1632 -1355 152 1212 1390
2292 1390 458 -870 -1536 -658 389 1708 848 -501 -1907 -1105 1131 2229 1243 -763 -2430 -1335
2308 -1335 1028 2045 904 -1115 -1946 -750 1154 1476 419 -609 -1105 -660 -3 1047 1277 44
2324 44 -899 -1630 -344 1263 1848 387 -1684 -2131 -254 1545 2087 211 -1700 -1777 71 1946 1610
2341 1610 6 -1747 -1288 143 972 947 353 -714 -885 -599 365 1345 1185 149 -1514 -1126 389 1766
2359 1766 1673 -758 -2045 -1235 1100 2102 874 -1257 -1953 -1048 1071 1386 133 -867 -918 -320 240
2376 240 985 964 235 -707 -1151 -640 1007 1402 1054 -1223 -1636 -740 1476 1746 162 -1645 -1802 224
2394 224 1676 1601 -257 -1358 -1180 141 1129 860 257 -591 -760 -760 75 904 1489 230 -1502 -1289 96
$$ packed form
2276a960k64J866K665l83j890k146K30K345J629m45j780j499K77J507J060J78
2292A390r32j328o66Q78J047J319q60j349j406Q02K236J098r86k006j667J095
2308a335K363J017j141k019q31J196J904L22j057j028m96M45O57J050K30j233
2324D4r43p31J286J607N85j461k071m47J877J799N42j876j911p7J848J875l36
2341A610j604j753M59J431Q29k5n94j067j71K86R64R80j60j036j663L88J515J377
2359A766r3k431j287Q10K335J002j228k131o96R05K119L15j253j000n1N98N60
2376B40P45k1p29r42m44N11J647L95l48k277m13Q96K216K70j584j807j57K026
2394B24J452p5j858j101J78J321R88k69o03q48j69%Q35Q29N85j259j732K13J385
$$ plain form
2413 96 1753 1524 -251 -1708 -1538 553 2147 1042 -688 -1895 -747 965 1306 265 -506 -984 -375
2430 -375 12 592 854 163 -249 -840 -611 307 1286 1089 -939 -1766 -893 1090 1789 636 -1482 -2004 -172
2449 -172 1602 1302 13 -1354 -1337 176 888 650 21 -223 -378 -357 240 401 1019 208 -709 -1336 -73
2468 -73 1243 1461 133 -1684 -1976 326 1839 1315 -570 -1828 -796 894 1473 281 -723 -901 -359
2485 -359 75 57 155 395 -158 -667 -571 334 1391 859 -564 -1688 -987 617 1931 847 -1083 -1853 -409
2504 -409 1065 1110 -91 -1343 -1016 162 919 482 -250 -543 -71 -248 -126 355 776 654 -466 -1213 -509
2523 -509 1047 1328 613 -1141 -1358 102 1674 1331 -515 -1609 -836 1031 1377 185 -690 -760 -115 426
2541 426 -177 -267 -23 264 -318 -724 -140 662 1037 -294 -1451 -943 386 1379 626 -869 -1691 -448 993
$$ packed form
2413I6J657k29j775j457J70K091J594j105j730j207J148J712L41j041p71m78O09
2430c75L87N80K62o91m12n91K29R18R79j97k028q27Q73J983O99j153k118n22J832
2449a72J774l00j289j367J7J513P12k38o29k44j55K1N97J61O18q11r17o27J263
2468g3J316K18j328j817k92K302J513n24j885j258J032J690N79j192j004j78N42
2485c59M34j8R8K40n53n09R6R05J057n32j423j124P01J604J314j084j930p70J444
2504d09J474M5j201j252L27J178P57m37p32k93M72j77J22M81M21j22j120p47P04
2523e09J556K81p15j754k17J460J572l43j846j094P73J867L46j192q75p0O45N41
2541D26o03r0K44K87n82m06N84Q02L75j331j157N08J329R93p53j495q22J243J441
$$ plain form
2560 993 1398 118 -1164 -866 385 1182 351 -342 10 -86 28 -144 35 452 521 32 -1158 -550 632
2579 632 1412 802 -1002 -1459 -142 1684 1102 -400 -1586 -986 716 1111 607 -528 -856 146 458
2596 458 170 39 -12 145 281 -324 -800 378 698 309 -898 -934 24 1353 1074 -597 -1406 -616 942
2615 942 1261 383 -997 -1007 193 664 199 -574 -284 163 415 -187 -344 3 902 168 -774 -840 171 1441
2635 1441 947 -545 -1428 -407 701 1259 119 -1247 -708 553 994 434 -606 -759 11 630 -2
2652 -2 -382 -157 449 109 -87 -614 270 1020 671 -772 -856 -387 1019 1047 -452 -1254 -843 913 1229 328
2672 328 -754 -960 240 981 287 -576 -111 291 518 -92 -569 -165 619 385 -424 -705 -217 891 994
2691 994 -213 -858 -786 645 1278 270 -787 -969 53 990 212 -533 -775 294 510 52 -540 -313
$$ packed form
2560I93M05j280j282K98J251P97q31o93L52r6J14j72J79M17O9m89j190O08J182
2579F32P80o10j804m57J317J826n82j502j186O00J702L95n04j135l28J002L12
2596D58k88j31n1J57J36o05m76J178L20l89j207l6R58J329k79j671q09P90J558
2615I42L19q78j380j0J200M71m65p73K90M47K52o02j57L47Q99p34r42o6J011J270
2635A441m94j492q83J021J108N58j140j366N39J261M41n60j040j53P70O19o32
2652bl80K25O06l40j96n27Q84P50l49j443q4M69J406K8j499q02M11J756L16r01
2672C28j082k06J200P41o94q63M65M02K27o10m77M04P84k34q09k81M88J108J03
2691I94j207o45P2J431O33j008j057j82J022R37p78p45k42J069K16m58n92K27
$$ plain form
2709 -313 418 444 104 -1035 -70 314 739 -151 -1105 -454 719 1251 -240 -1004 -927 440 1002 -1 -811
2728 -811 -647 125 501 388 -573 -548 184 564 -67 -464 -466 444 582 23 -661 -436 496 756 85 -1051 -453
2749 -453 414 913 119 -680 -669 370 932 272 -461 -760 231 584 -252 -626 -688 152 892 -34 -696 -322
2769 -322 448 551 -220 -651 -406 352 1095 225 -860 -863 125 860 520 -304 -566 208 537 199 -628 -555 162
2790 162 705 191 -644 -371 326 836 45 -681 -561 -298 562 5 -422 -635 -10 568 363 -493 -481 107
2810 107 725 308 -295 -284 219 466 109 -539 -437 357 335 362 -5 -739 73 673 359 -205 -665 179 491
2831 491 416 -523 -512 -14 641 481 -476 -800 -147 607 226 -882 -617 -84 694 692 -724 -704 140 1030 591
2852 591 -125 -402 -134 564 421 -247 -597 -208 570 340 -335 -365 266 462 313 -398 -518 -200 704 192
$$ packed form
2709c13P31K6l40j139R65L84M25q90r54O51J173N32j491p64P7J367N62j003q10
2728h11J64P72L76j13r61K5P32L80o31l97kR10J38n59o84K25R32K60o71j136N98
2749d53Q67M99p94p99J1J039N62o60p33k99R91L53q36l74o2Q40P40r26o62L74
2769c22P70J03p71m31K45P58P43q70j085lR88P35l40q24k62P74L29l38q27P3P17
2790A62N43n14q35K73O97N10p91p26J20K63Q60n57m27k13O25N78k05q56J2N88
2810A07O18m17o03J1N03K47l57o48J02P94k2K7l67p34Q12O00l14n64m60Q44L12
2831D91p5r39J1M98O55j60r57l24O53P54l81j108K65N33P78kj416K0Q44Q90m39
2852E91p16k77K68O98j43o68l50L89P78k30o75l0O31J96j49p11j20L18R04n12
$$ plain form
2872 192 -438 -756 87 1040 498 -332 -650 -108 486 822 -280 -626 -113 682 321 -85 -469 -73 116 169
2892 169 -183 -550 -44 513 413 -718 -723 -151 682 597 -613 -704 59 516 425 -429 -814 68 419 405 -145
2913 -145 -338 -137 385 157 26 -774 -186 492 161 -573 -676 155 457 256 -453 -898 65 751 796 -20
2933 -20 -878 3 435 633 -201 -745 -431 245 471 221 -146 55 432 276 -238 -158 185 325 372 -245 -567
2954 -567 -80 973 409 -256 -546 -275 526 709 196 -402 -508 -7 472 180 -362 -442 60 -61 51 -167
2974 -167 -114 196 184 -259 -504 8 648 208 -330 -475 -250 774 631 75 -639 -89 296 692 196 -577
2994 -577 -785 -7 481 184 -135 -72 -266 -85 -191 -136 175 340 97 -477 -736 65 606 680 -113 -759 -464
3015 -464 459 914 204 -586 -378 135 749 452 -124 -226 -59 393 105 -251 -215 66 12 -265 -222 212 568
$$ packed form
2872A92o30l18Q43R53n42q30l18N42N94L36j102l46N13P95l61m06l84L96J89N3
2892A69l52l67N06N57j00j131nN72Q33q5j210r1P63M57r1q54l85Q82L51j4n50
2913a45j93K01N22k28j31q00N88O78l31p34j03Q31L02k01p09m45R63O86M5q16
2933b0q58Q81M32J98q34n44L14O76K26k50l67K01L77j56n14Q0L43J40M7o17l22
2954e67M87J053n64o65k90K71Q01J83n13n98j06N01M79k92n42q0N02j21J12k18
2974a67N3L10j2m43k45N12O40m40n38j45K25J024j43n56p14N50L85L96m96p73
2994e77k08P78M88k97l19O3j94J81j06N5L11J65k43n74k59Q01N41P4p93o46K95
3015d64R23M55p10p90K08N13O14k97n76j02J67M52k88l56L6K81n4k77M3M34L56
$$ plain form
3036 568 589 -337 -552 -364 509 694 138 -905 -727 -76 672 290 -386 -376 -346 447 335 81 -71 -102 160
3057 160 -61 -5 9 47 438 -65 -531 -304 482 561 -77 -738 -673 396 612 470 -569 -645 -299 393 431 178
3079 178 -302 -441 141 224 -5 273 376 -154 -298 -32 126 590 362 -202 -778 -146 504 868 25 -575
3099 -575 -538 274 677 559 -4 -689 -136 -56 430 122 42 202 -207 -74 -163 334 497 413 -369 -721 72 517
3121 517 716 75 -862 -817 47 1082 342 -252 -276 -198 302 399 268 -137 -189 -30 305 94 455 91 21 -421
3143 -421 -393 129 407 371 -16 -694 -397 243 1059 199 -258 -683 -259 515 755 -172 -814 -742 -89 309 512
3164 512 249 -2 -359 -66 0 -86 316 316 -250 -483 48 218 538 94 -313 -545 -104 786 664 -26 -938
3185 -938 -629 97 660 406 -273 -460 -256 -101 32 226 116 -104 -347 -439 47 415 160 -196 -772 -242
$$ packed form
3036E68K1r26k15J88Q73J85n56j043J78O51P48l82o76J0L0P93j12k54j52l1K62
3057A60k21N6J4L8L91n03m66K27P86P9o38o61O5J069K16j42j039p6L46O92L8k53
3079A78m80j39N82Q3k29K78J03n30j44K66J58M64k28n64n76O32O50L64q43o00
3099e75L7Q12M03j18n63o85N53Q0M86l08q0J60m09J33q9M97J63q4p82l52P93M45
3121E17J99o41r37M5Q64J035p40n94k4P8N00R7j31m05n2J59L35k11L61l64p0m42
3143d21K8N22K78l6l87o78K97O40Q16q60m57m25M24P74K40r27o42P2O53L98K03
3164E12k63k51l57K93O6q6M02%n66k33N31J70L20m44m07k32M41Q90j22o90r12
3185i38L09P26N63k54o79j87K04J55J33J94j10k20k43r2M86L68k55l56n76N30
$$ plain form
3205 -242 198 644 431 -356 -670 -432 265 579 131 -280 -279 20 207 321 169 -407 -508 -177 285 317 448
3226 448 337 -283 -644 66 354 547 93 -346 -483 -312 930 344 -185 -580 -242 -10 368 314 257 -334
3246 -334 -558 -71 123 333 433 13 -476 -270 90 383 630 -31 -446 -520 36 331 244 -138 -602 -216 196
3267 196 265 54 -418 -307 -256 84 454 165 -282 -143 -226 -26 186 311 2 -99 -477 -120 639 640 -128 -521
3289 -521 -730 -199 414 478 -13 -222 -508 -93 478 313 -252 -420 -295 80 174 506 0 -334 -299 -374 120
3310 120 498 465 -94 -143 -581 311 306 526 -237 -684 -230 121 627 70 -198 -278 -485 70 503 175 -310 -198
3332 -198 -453 30 383 198 233 -475 -301 -157 287 708 341 -90 -462 -383 389 352 25 -574 -428 46 715
3353 715 401 193 -168 -301 43 -127 237 176 156 -411 -144 -31 273 359 77 -310 -250 45 541 819 -161
$$ packed form
3205b42M40M46k13p87l14K38O97L14m48m11JK99J87J14j52n76j01L31M62L2J31
3226D48j11o20l61P10K88J93m54m39j37J71J242n86n29l95L38K32L78n4n7n91
3246c34k24M87J94K10J00m20m89K06L60K93K47o61m15p4N56K95q7l82m64L86M12
3267A96O9k11m72J11N1L40L70k89m47J39q3K00K12J25l09j01l78L57P59Jp68l93
3289e21k09N31O13O4m91k09k86M15N71j65n65j68J25L75R4L32n06l34L5p5M94
3310A20L78l3n59m9m38Q92nK20p63m47M54L51N06n57k68q0k07N55M33l28m85J12
3332a98k55M83L53j85L5p08J74J44M44M21l67m31l72P9P72l7l27n99J46M74O69
3353G15l14k08l61j33L44j70L64o1k0n67K67J13L04Q6k82l87O0K95M96K78r80
$$ plain form
3374 -161 -482 -226 77 554 308 228 -373 -243 -54 181 157 237 -181 -469 4 417 414 202 -332 -342 -110 271
3396 271 585 198 -129 -513 40 12 644 33 -28 -412 -190 277 309 93 85 -329 -134 93 177 387 -42 -112
3418 -112 -171 -37 470 329 89 -453 -424 388 263 333 130 -638 -571 -205 549 156 -388 -498 -355 26 173
3439 173 193 99 -116 -397 -383 438 301 75 -201 -597 -63 251 378 45 -278 -390 -97 154 606 82 -74
3460 -74 -329 -295 127 206 271 80 -452 -125 -6 260 376 -148 -322 -313 46 583 311 66 -161 -368 -71 159
3482 159 91 159 -111 -204 135 355 415 -82 -368 -376 157 355 185 -43 -301 -321 -132 162 53 -112 -289 -176
3504 -176 -119 192 465 94 -99 -364 -221 108 583 312 -172 -373 -236 -166 386 93 -508 -127 -74 10 115
3525 115 484 136 -424 -154 57 43 364 85 -175 -295 210 259 349 -11 -408 -401 -133 558 430 169 -416 -137
$$ packed form
3374a61l21K56L03M77k46q0o01J30J89K35k4Q0m18k88M73M13lk12n34j0K32L81
3396B71L14l87l27l84N53k8O32o11o1l84K22M67L2k16qm14J95K27Q4K10m29p0
3418a12n9J34N07j41k40n42K9Q12j25P0k03p68O7L66P54l93n44j10J43L81J47
3439A73K0r4k15k81J4Q21j37k26k76l96N34L14J27l33l23j12K93K51M52n24j56
3460g4k55L4M22P9O5j91n32L27J19K66J16n24j74RL59N37k72k45k27k07K97K30
3482A59o8O8k70r3L39K20O0m97k86qN33J98j70k28k58k0J89K94j09j65j77J13
3504a76N7L11K73l71j93k65J43L29M75k71m84k01J37P0N52k93o01L81N3Q4J05
3525A15L69l48n60K70K11j4L21k79k60j20N05M9R0l60l97PK68O91j28k61n85K79
$$ plain form
3547 -137 -150 146 242 146 -25 -134 -248 -20 649 105 -99 -291 -345 -348 581 -62 -30 -270 -483 244 67 -140
3569 -140 -43 -220 5 -14 212 290 -44 209 -118 34 447 391 262 -246 -169 218 350 159 -195 -379 -405 82
3591 82 372 14 -215 193 -194 -69 -7 117 95 -57 -132 -232 162 111 96 -211 -584 -353 185 234 435 -216
3613 -216 -110 -377 1 140 28 -86 -460 -251 188 333 -132 96 -362 -207 -67 174 -28 12 -188 -324
3633 -324 -25 -92 300 127 -228 -314 127 217 285 -195 -79 -303 188 182 401 28 -293 51 -232 16 200 257
3655 257 -140 55 -190 78 42 132 -96 -343 -146 243 484 58 235 -226 -317 74 465 -14 -124 -214 -122 23
3677 23 182 194 109 -125 -239 96 124 -116 -191 -100 -163 32 61 -14 1 -266 -231 -4 5 280 293 -113 -231 -140 144
3702 144 -45 15 -227 -95 -439 -82 345 -13 -110 -235 -143 -94 130 83 -374 -272 -168 -147 76 406 -161 -227
$$ packed form
3547a37j3K96R6r6j71j09j14K28O69n44k04j92n4lR29o43L2k40k13P27j77k07
3569a40R7j77K25j9K26P8l34K53l27J52M13n6j29n08P7L87J32j91l54j84k6M87
3591H2K90l58k29M08l87J25O2J24k2j52p5j00L94n1j5l07l73K31N38M9K01o51
3613b16J06k67L78J39j12j14l74K09M39J45m65K28m58J55J40K41k02M0k00j36
3633c24K99o7L92j73l55q6M41R0O8m80J16k24M91oK19l73l21L44k83K48J84N7
3655B57l97J95k45K68l6R0k28k47J97L89K41m26J77m61r1L91L91m79j10r0R2J45
3677B3J59J2q5k34j14L35K8k40p5R1o3J95K9p5J5k67L5K27RK75J3m06j18R1K84
3702A44j89O0k42J32l44L57M27l58r7j25R2M9K24m7m57J02J04K1K23L30n67o6
$$ plain form
3724 -227 -42 -66 78 -13 139 110 28 409 -51 329 4 -327 -172 -211 -147 174 179 -206 -384 60 193 330 -63
3747 -63 -7 -242 -126 85 128 246 208 -14 -190 222 181 51 -270 -233 54 182 -111 101 194 -11 -194 -171 217
3770 217 36 -207 -296 -171 358 202 69 -101 34 -133 -184 276 30 -40 -142 -6 -5 166 94 189 42 -279
3792 -279 67 -227 183 -101 -140 -309 -203 182 124 -163 41 -342 -172 -271 170 196 233 -176 20 -156 138 -198
3814 -198 -108 221 -104 119 41 214 -176 130 67 -66 133 177 -163 113 -195 63 -223 175 -133 23 -233
3835 -233 -117 -70 263 -152 -86 -45 141 -138 -55 76 -150 69 34 196 153 84 -114 -100 -53 78 104 217 60
3858 60 70 169 -285 -75 137 120 -191 -104 -47 79 -117 40 57 -284 51 -74 36 66 70 -92 94 -305 90
3881 90 40 80 5 6 315 221 174 246 205 -44 -112 -341 -150 -98 5 -50 -3 218 168 466 23 116 154 -75 179 209
$$ packed form
3724b27J85k4J44r1J52k9q2L81m60L80l25l31J55l9O4L21Nl85j78M44J33J37l93
3747f3N6k35J16K11M3J18l8k22j76M12m1j30l21L7K87J28k93K12R3k05j83K3L88
3770B17j81k43q9J25N29j56j33j70J35j67n1M60k46p0j02J36JJ71p2R5j47l21
3792b79L46k94M10k84l9j69J06L85n8k87K04l83J70r9M41K6L7m09J96j76K94l36
3814a98R0L29l25K23p8J73l90L06o3j33J99M4l40K76l08K58k86L98l08J56k56
3835b33J16M7L33m15O6M1J86k79Q3J31k26K19l5J62m3o9j98J4M7J31K6J13j57
3858F0J0R9m54K10K12j7l11Q7N7J26j96J57J7l41L35j25J10L0Mj62J86l99L95
3881I0n0M0p5JL09r4m7P2m1k49o8k29J91N2J03n5M7K21n0K98m43R3L8k29K54L0
$$ plain form
3907 209 53 61 220 -81 -108 169 33 -8 146 80 -8 238 19 -53 57 50 -276 122 -103 169 38 167 -24
3930 -24 20 -107 -147 -1 -232 87 -40 50 -115 82 172 -175 -55 99 30 100 -159 -11 -15 186 152 20 18 -287
3954 -287 37 68 -166 -33 38 -59 -63 -34 16 -184 39 206 -95 -28 73 104 14 -96 -236 -83 -136 6 30 211
3978 211 202 -63 -166 -42 54 -88 79 -105 3 104 -202 -54 -365 -40 -100 79 125 -83 -290 133 293 -43
4000 -43 -150 -36 54 130 7 328 -155 -172 -171 -8 -71 -84 -101 266 119 -7 297 -14 118 -48 -10 -98 195 19
4024 19 -104 -146 -40 154 -160 40 -43 -95 -173 -363 -297 79 -31 -48 -177 -234 5 -454 197 -77 54 155 -130
4047 -130 35 88 -185 -135 -278 41 -114 95 -269 66 -166 -218 15 253 -221 -68 113 133 233 -114 133
4068 133 15 -84 -42 64 81 175 -86 -160 208 -55 295 116 70 28 -16 -106 242 -36 -201 -64 -5 28 216 -70
$$ packed form
3907B09j56QJ59l01k7K77j36m1J54o6q8K46k19p2J10pl26L98k25K72j31J29j91
3930b4M4j27m0J46k31L19j27R0j65J97R0l47J20J54o9P0k59J48mK01l4j32kl05
3954b87L24L1k34J33P1r7mK9N0k00K23J67l01O7J01L1r0j10j40J53n3J42K4J81
3978B11rk65j03J24R6j42J67j84J08J01l06J48l11L25o0J79M6k08k07M23J60l36
4000d3j07J14R0P6j23L21m83j7JJ63o3j3j7L67j47j26L04l11J32j66L8q8K93j76
4024A9j23m2J06J94l14K00q3n2p8j90O6L76j10j7j29n7K39m59O51k74J31J01k85
4047a30J65N3k73N0j43L19j55K09l64L35k32n2K33K38m74J53J81K0J00l47K47
4068A33j18r9M2J06J7R4k61p4L68k63L50j79m6m2m4r0L48k78j65J37N9L3J88k86
$$ plain form
4092 -70 -90 -35 62 144 192 7 -202 -199 30 99 375 -217 -2 -182 -322 -186 107 299 101 10 -106 30 -3 77
4116 77 -63 -329 -144 -47 -62 25 86 -90 236 -33 13 140 272 -166 8 -46 -110 176 0 120 -420 235 -176
4139 -176 -97 -8 -80 -306 -91 -391 -165 224 277 4 -359 -301 68 106 234 -260 2 -205 -28 316 -53 387
4161 387 108 34 44 188 -27 -350 -516 -86 -147 94 255 -32 168 118 374 79 187 52 -206 -32 -21 184
4183 184 10 58 -53 -148 56 -33 48 -8 52 -346 137 -137 3 1 -291 -305 -29 160 427 235 -8 -124 50
4206 50 -115 -82 58 -69 -69 95 43 83 193 146 -206 -221 173 297 -53 -44 -56 -137 -69 2 -17 -41 17 107 -115 -136
4232 -136 122 37 84 -353 149 421 44 -185 48 -2 145 -2 337 43 -116 -112 23 39 415 289 141 -125
4254 -125 148 254 212 -28 -475 -226 26 -274 23 -217 33 -447 47 513 -39 -149 -241 -325 -273 457 257
$$ packed form
4092g0k0N5R7Q2M8j85k09LK29O9K76n92K15j80j40J36K93J92j98r1j16J36l3Q0
4116G7j40k66J85R7j5Q7O1j76L26k69M6J27J32m38J74n4o4K86j76J20n40O55m11
4139a76P9Q9p2k26K15l00K26L89N3k73l63N8L69L8J28m94K62k07J77L44l69M40
4161C87k79p4J0J44k15l23j66M30o1K41J61k87K00n0K56k95J08j35k58J74J1K05
4183A84j74M8j11r5K04q9Q1n6O0l98M83k74J40kk92j4K76J89K67j92k43j16J74
4206E0j65L3J40j27%J64n2M0J10m7l52j5L94J24l50Rj2q1O8P1j9k4N8R0k22k1
4232a36K58q5M7m37N02K72l77k29K33n0J47j47L39k94j59MJ35J6L76j26j48k66
4254a25K73J06m2k40m47K49K52l00K97k40K50m80M94M66n52j10r2q4N2P30k00
$$ plain form
4275 257 -56 -95 -363 -17 -197 -334 127 -113 -65 -10 184 43 206 -126 -43 -262 -47 223 322 64 -58 -214
4297 -214 -25 98 8 138 115 -72 -77 121 290 98 -259 -218 -45 -104 -21 -65 -35 96 -248 -311 272 177 -146 -10
4321 -10 -379 161 18 -97 24 -358 -289 -10 -59 229 129 -46 26 168 283 -31 126 369 -66 324 142
4342 142 262 164 -275 -321 -132 90 -76 -218 -174 44 -232 55 44 -141 -14 -80 -161 -29 462 7 14 -173 -161
4365 -161 9 156 0 38 -87 -167 -30 216 -137 -81 -138 -82 -31 191 -105 25 -200 -56 -330 230 -231 141
4387 141 -40 6 -353 -68 326 2 -116 -163 -120 -32 -102 12 -203 -241 25 182 151 162 -13 236 363 -34 513
4410 513 545 77 12 -224 218 92 -114 -66 -190 -160 192 286 -76 -193 198 142 -234 214 -98 -148 -356 -189
4432 -189 75 162 -17 217 -60 -313 3 -22 -24 28 -73 -54 26 -86 33 25 -215 -149 -68 50 -21 334 64 -309
$$ packed form
4275B57l13l9k68L46j80j37M61k40M8N5J94j41J63l32Q3k19K15K70R9k58j22j56
4297b14J89J23r0J30k3j87nJ98J69j92l57M1J73n9Q3m4L0J31l44o3N83r5l23J36
4321a0l69N40j43j15J21l82O9K79m9K88j00j75P2J42J15l14J57K43m35L90j82
4342A42J20r8m39m6J89K22j66j42M4K18k76K87j1j85J27o6q1J32M91m55Pj87J2
4365a61J70J47j56L8j25q0J37K46l53N6n7N6N1K22k96J30k25J44k74N60m61L72
4387A41j81M6l59K85L94l24j18m7M3Q8p0J14k15l8K66J57l1J1j75K49J27l97N47
4410E13L2m68o5k36M42j26k06M8j24L0L52R4l62j17L91n6l76M48l12n0k08J67
4432a89K64Q7j79K34k77k53L16k5kN2j01J9Q0j12J19qk40O6Q1J18p1L55k70l73
$$ plain form
4456 -309 108 494 35 64 82 -131 92 29 29 54 -392 144 128 -15 154 80 143 -68 -132 -330 7 -126 -251
4479 -251 -35 -226 155 167 53 230 -92 -218 103 192 341 6 -110 -179 -181 64 116 -328 -95 -161 -244 -78 116
4502 116 -146 -77 84 -175 106 -118 56 -163 -108 -175 86 64 -221 -371 -330 -242 19 -109 16 -72 10 81 102
4525 102 82 29 68 -131 -184 -17 24 131 105 -99 22 -92 -26 133 -96 -345 -200 -327 -113 39 -101 -188 -189
4548 -189 260 99 175 56 -197 -152 100 -96 12 37 170 -75 -102 -84 80 291 -272 177 64 175 136 99
4570 99 -296 -154 -65 -13 158 13 44 -36 61 -67 97 -193 -33 -20 -223 -41 20 109 65 -348 -278 -280 171 142 -263
4595 -263 43 -75 -14 -62 38 -53 -10 -206 -140 11 2 -53 -215 -291 -155 -109 68 85 61 -206 -200 -18 48 85 -95
4620 -95 -73 -116 52 30 -31 72 18 101 50 227 284 -234 -104 -121 246 -206 393 26 -199 81 -269 208 -34
$$ packed form
4456c09M17L86m59K9J8k13K23o3%K5m46N36j6j43J69p4O3k11o4j98L37j33j25
4479b51K16j91L81J2j14J77l22j26L21Q9J49l35j16o9kK45N2m44K33o6q3J66J94
4502A16k62O9J61k59K81k24J74k19N5o7K61k2k85j50M1Q8K61j28J25q8Q2P1K1
4525A02k0n3L9j99n3J67M1J07k6k04J21j14O6J59k29k49J45j27K14J52j40q7j
4548a89M49j61P6j19k53M5K52j96J08K5J33k45k7J8J64K11n63M49j13J11l9l7
4570I9l95J42Q9N2J71j45L1q0R7j28J64k90J60J3k03J82O1Q9m4m13P0kM51k9m05
4595b63L06j18O1m8J00r1M3j96O6J51rn5j62p6J36M6J77J7k4k67OJ82O6L7j80
4620i5K2m3J68k2o1J03n4Q3n1J77N7n18J30j7L67m52N99l67k25K80l50M77k42
$$ plain form
4643 -34 177 -204 -63 52 -18 -188 -348 -143 -102 17 56 -77 149 67 -124 39 -53 -257 -165 -129 -6 -84 -138
4666 -138 -35 27 -274 12 -164 72 -57 -160 -152 -174 -7 -49 -95 16 -16 235 -255 -167 297 -52 10 -240 -329
4689 -329 50 20 108 -139 91 444 194 98 212 36 -15 76 142 -100 157 138 135 21 -36 -367 -89 89 6 129
4713 129 -8 121 109 -9 -230 -134 213 -25 380 106 30 -100 -239 224 -148 -2 -79 -77 -211 -187 -28 15 -70
4736 -70 -74 55 76 -117 194 -88 15 60 340 77 42 52 -287 -237 -155 220 -187 -83 -7 -19 406 136 88 16
4760 16 -150 -111 77 100 124 -118 45 134 49 -140 -48 34 37 -541 155 150 -206 -200 -222 -6 166 273 5 65 -3 -288
4786 -288 -43 181 -16 -169 -106 -74 -91 -70 243 77 286 -317 276 140 326 -22 -120 -128 -170 -28 180 -7 210
4809 210 51 53 -26 183 352 189 49 77 60 14 -162 -197 316 -197 -161 46 115 178 -96 -7 -243 125 289 -532
$$ packed form
4643c4K11l81J41J15p0j70j60K05M1J19L9j33K26q2j91J63r2k04R2L6J23p8n4
4666a38J03O2l01K86j76K36j29j03Qk2J67m2m6J11l2K51m90Q8M64l49O2k50q9
4689c29L79l0Q8k47K30L53k50r6J14j76n1R1O6k42K57j9lj14n7l31K78J78q3J23
4713A29j37J29j2j18k21R6L47k38M05k74p6j30j39M63l72J46p7Kj34K4J59M3q5
4736g0mJ29K1j93L11k82J03M5K80k63l5J0l39N0Q2L75m07J04P6j2M25k70m8p2
4760A6j66L9J88K3K4k42J63Q9q5j89R2Q2Ln78O96nl56Ok2K16J72J07k68O0o8k85
4786b88K45K24j97j53O3L2j7K1L13j66K09o03N93j36J86l48r8qm2J42K08j87K17
4809B10j59Kp9K09J69j63j40K8j7m6j76l5N13n13L6K07O9O3k74Q9k36L68J64q21
$$ plain form
4833 -532 -207 124 80 92 -58 -65 -25 -132 -166 -61 -1 -74 -50 150 -213 -1 12 21 308 262 292 -262 144 257 -326
4858 -326 13 -79 69 116 121 -197 -24 19 -189 4 234 80 41 216 104 205 165 -44 144 396 86 -149
4880 -149 -131 92 -90 -50 329 -176 96 39 -42 -30 -164 -5 163 9 -72 -89 -120 180 -139 291 -127 -110 -116 -160
4904 -160 64 64 175 32 25 2 378 455 55 -82 119 63 -51 352 44 -81 87 188 161 170 -127 161 120 48
4928 48 -148 46 41 202 -225 -349 20 -211 46 85 -54 73 -70 -85 41 -177 27 104 -73 157 -29 -286
4950 -286 -15 -60 -101 153 -204 123 -58 -131 73 -206 -231 23 -231 13 136 -54 347 -129 4 33 136 41
4972 41 42 -164 -220 -64 255 -49 50 -173 -247 128 62 201 -23 -88 69 -201 -256 14 -78 -198 -170 -78 -104 96
4996 96 -92 235 -249 -29 208 107 -134 195 -194 49 328 182 61 -61 58 185 82 218 -75 184
$$ packed form
4833e32L25L31m4J2j50pM0j07l4J05O0p3K4K00l63K12J3RK87m6L0n54M06J13n83
4858c26L39r2J48M7Nl18J73M3k08J93K30j54l9J75j12J01m0k09J88K52l10k35
4880a49J8K23j82M0L79n05K72n7q1J2j34J59J68j54q1j7l1L00l19M30m18J7om4
4904a60K24%J11j43pk3L76P7m00j37K01n6j14M03l08j25J68J01k7Rk97K88m1p2
4928D8j96J94nJ61m27j24L69k31K57L9j39J27j43j5J26k18K04P7j77K30j86k57
4950b86K71m5m1K54l57L27j81p3K04k79k5K54k54K44J23j90M01m76J33K9J03r5
4972D1Jk06n6J56L19l04R9k23p4L75o6J39k24o5J57k70n5K70r2j20K8R2k6K00
4996I6j88L27m84K20K37j01k41L29l89K43K79j46j21j22J19J27j03J36k93K59
$$ plain form
5016 184 279 -127 -183 -168 20 135 193 -432 -382 143 -89 190 184 -192 54 -23 307 166 -197 40 110 -58 -57 100
5040 100 49 -8 79 -42 -215 369 187 315 194 7 184 309 86 -139 55 20 153 337 -114 291 -140
5061 -140 86 -88 30 -216 247 87 -21 74 -295 -188 -174 170 18 -55 -34 -38 -94 33 -26 302 341 -222 -53
5084 -53 -115 39 10 -193 191 161 -230 -42 -161 -67 -303 -155 41 307 -231 -217 -108 143 -80 214 175 -85
5106 -85 72 168 153 61 -65 55 279 169 -265 -265 148 -9 -176 210 -119 212 -70 294 -21 71 -232 -125
5128 -125 54 -259 -181 -162 -146 -241 -87 81 -23 -385 125 -114 -5 -125 -84 137 173 -302 -22 91 11 -212
5150 -212 58 8 -250 52 87 -71 50 157 -130 -170 -92 -282 -21 -110 85 -121 160 -8 9 43 -89 -122 25
5173 25 99 0 216 211 97 138 39 -11 -95 246 130 256 -16 129 0 109 -193 219 -179 -157 -146 181 145 135
$$ packed form
5016A84R5m06n6J5J88J15N8o25N0N25k32K79ol76K46p7L30j41l63K37P0j68JJ57
5040A00n1n7Q7j21j73N84j82J28j21j87J77J25k23k25J94l5J33J84m51M05m31
5061a40K26j74J18k46M63j60j08R5l69J07J4L44j52p3K1mn6J27n9L28L9n63J69
5084e3o2J54k9k03L84l0l91J88j19R4k36J48J96K66n38J4J09K51k23K94l9k60
5106h5J57R6j5r2j26J20K24j10m34%M13j57j67L86l29L31k82L64l15R2l03J07
5128a25J79l13P8J9J6r5J54J68j04l62N10k39J09j20M1K21L6m75K80J13q0k23
5150b12K70n0k58L02L5j58J21J07k87m0P8j90K61q9J95k06K81j68J7L4j32l3J47
5173B5P4r9K16nj14M1r9n0q4L41j16J26k72J45j29J09l02M12l98K2J1L27l6j0
$$ plain form
5197 135 -115 -50 25 -119 148 -4 -150 35 -16 -11 403 -213 278 -147 248 -107 -123 101 -32 111 300 -76
5219 -76 25 59 202 -76 -63 -85 224 430 116 81 -297 -23 42 19 -185 -45 193 -128 81 -147 -76 -34 117
5242 117 241 65 -268 -200 18 -82 -74 28 134 20 157 -146 -506 -2 152 -386 -229 -299 61 -227 -20
5263 -20 0 -349 -262 -120 -40 -240 -27 113 -112 122 -78 10 -72 114 -242 27 -222 -226 -137 274 81 -20 66
5286 66 -80 163 -118 226 -50 285 -60 0 268 -246 -5 -144 220 73 143 -137 -123 -177 -85 145 132 129 -86
5309 -86 -408 -12 56 4 -116 228 78 42 21 10 -291 -49 -68 -218 169 225 15 286 -229 -37 291 49 -64
5332 -64 165 262 -56 8 200 -183 141 -62 8 -198 359 202 -190 151 40 17 35 196 -291 -261 -112 -184 -230
5355 -230 -271 54 109 114 -77 14 67 -100 193 4 -58 45 29 -46 -15 -112 -80 207 131 16 -154 65 -179 107
$$ packed form
5197A35k50O5P5j44K67j52j46J85n1NM14o16M91m25L95l55j6K24j33J43J89l76
5219g6J01L4J43k78J3k2L09K06l14l5l78K74O5k3k04J40K38l21K09k28P1M2J51
5242A17J24j76l33O8K18j00QJ02J06j14J37l03l60N04J54n38J57p0L60k88K07
5263b0K0l49Q7J42Q0k00K13J40k25K34k00Q8q2J86l56K69k49mQ9M11j93j01Q6
5286F6j46K43k81L44k76L35l45O0K68n14K41j39L64j47P0k80J4n4R2K30j3lk15
5309h6l22L96O8n2j20L44j50l6k1j1l01K42j9j50L87N6k10K71n15J92L28k42j13
5332f4K29R7l18O4J92l83L24k03P0k06N57j57l92L41j11k3J8J61m87L0J49p2m6
5355b30m1L25N5Nj91R1N3j67K93j89o2J03j6p5L1r7L2K87p6j15j70K19k44K86
$$ plain form
5379 107 -213 68 -162 -93 8 -181 289 -2 -20 -63 -12 -26 50 113 279 65 -95 -266 0 116 149 107 -179
5402 -179 -40 278 -29 -42 -33 12 34 126 226 -289 131 -235 15 119 -186 78 -216 123 -354 -157 91 59
5424 59 -224 -185 73 56 52 -161 192 52 322 47 172 69 9 -179 -60 -21 150 42 22 -16 157 248 -105
5447 -105 321 131 210 -454 226 -25 46 1 -158 -181 65 -40 154 -221 -34 102 -224 246 53 154 32
5468 32 -169 163 -122 -62 132 163 -95 -136 -13 115 290 -3 -24 -109 155 -133 49 281 -202 50 9 -79 33
5491 33 122 25 -41 -501 -107 75 181 132 -184 83 139 6 27 -84 228 -38 64 247 -278 260 -81 141
5513 141 -89 71 -166 -88 38 -170 76 -215 -175 -59 -273 -193 35 -42 124 187 -117 -99 150 402 90 -44
5535 -44 -70 -137 232 -18 15 -2 -314 -237 58 147 -72 -224 -3 -111 -109 -5 -129 -77 -27 -90 3 231 -30 -5 73
$$ packed form
5379A07l20K81k30O9J01j89M70k91j8m3N1j4P6O3J66k14j60j71K66J16L3m2k86
5402a79J39L18l07j3RM5K2R2J00n15M20l66K50J04l05K64k94L39m77J97K48l2
5424E9k83L9K58j7mk13L53j40K70k75J25j03o0j88J19L9J71j08k0l8J73R1l53
5447a05M26j90P9o64O80k51P1m5j59k3K46j05J94l75J87J36l26M70j93J01j22
5468C2k01L32k85O0J94L1k58m1J23J28J75k93k1q5K64k88J82K32m83K52m1q8J12
5491C3Q9r7o6m60L94J82J06m9l16K67N6j33K1j11L12k66J02J83n25N38l41K22
5513A41k30J60k37P8J26k08K46k91M0J16k14Q0K28p7J66O3l04J8K49K52l12j34
5535d4k6o7L69k50L3j7l12P7K95Q9k19j52K21j08KJ04j24N2N0o3R3K28k61K5P8
$$ plain form
5560 73 -13 -8 63 199 -46 -207 -98 119 -116 -83 -134 13 37 -266 186 6 5 -36 224 -197 210 96 -42 44
5584 44 -87 85 -37 -94 -132 71 -196 -187 -131 45 -218 146 -146 -295 -126 316 -36 180 264 124 81 -126 13
5607 13 6 -132 -56 34 -330 -45 -141 -211 59 -180 -194 -99 41 -177 228 -115 -27 -147 23 -141 -44 -253 -33 -105
5631 -105 -18 -96 -526 -7 47 54 122 -48 8 -201 290 49 24 68 -232 158 -81 56 -171 116 -99 -113 26
5654 26 220 163 33 0 52 34 10 197 78 172 -26 -237 236 10 40 -58 -183 17 -37 215 89 -72 -8 -34
5678 -34 268 -49 -133 85 2 42 -5 126 139 79 -209 -3 4 -113 -1 -104 -221 -23 36 73 51 -117 3 -213
5702 -213 152 264 63 110 -222 251 256 286 -126 -211 300 74 136 49 9 132 -105 -69 57 -57 -229 135 -237
5725 -237 -57 145 -76 29 -162 -183 -21 41 -180 -101 7 101 41 210 184 -181 218 -154 61 247 -102 189
$$ packed form
5560G3q6NP1J36k45j61J09K17k35L3n1J47K4l03M52j80jm1K60m21M07j14j38Q6
5584D4j31J72j22n7l8K03k67RN6J76k63L64k92j49J69M42l52K16Q4j40m3k07J39
5607A3pj38P6R0l64K85r6p0K70k39j4R5J40k18M05l43Q8j20J70j64R7k09K20p2
5631a05Q7p8m30N19N4PO8j70N6k09M91k41k5M4l00L90k39J37k27K87k15j4J39
5654B6J94n7j30l3N2j8k4J87j19R4j98k11M73k26L0r8j25K00n4K52j26j61O4k6
5678c4L02l17q4K18q3M0m7J31J3o0k88K06Pj17J12j03j17J98N9L7k2j68J20k16
5702b13L65J12k01M7l32M73NL0m12q5N11k26O2q7m0J23k37L6J26j14j72L64l72
5725b37J80K02k21J05j91k1J62O2k21P9J08R4o0J69k6l65L99l72K15J86l49K91
$$ plain form
5747 189 -120 195 79 194 -88 172 237 42 -289 -183 34 -37 388 115 167 189 40 -112 65 11 -72 120
5769 120 2 130 -96 6 -58 68 -36 -86 42 104 -48 17 106 -24 44 -17 42 243 145 -260 53 -122 174
5792 174 -52 80 193 -63 -277 -4 -181 -63 108 -120 83 152 163 152 285 1 -81 50 95 -29 -21 27 130
5815 130 -13 -433 -303 -64 -106 52 82 -78 -1 173 -38 -107 -101 -121 1 -294 95 97 -103 -108 -77 -40 73 89 97
5840 97 45 66 10 32 263 25 -100 148 120 295 134 7 11 -102 -206 56 -132 -32 87 73 59 299 -59
5863 -59 45 49 -191 82 -18 17 -13 -21 -124 -38 -170 163 -203 173 -234 -26 -176 24 -479 219 -44 -242 -4
5886 -4 60 -147 63 31 -63 -24 25 -25 -345 88 5 269 -24 -19 -83 74 -125 -8 117 107 -184 -83 60 58 44
5911 44 100 -26 -126 244 -104 -55 30 64 -123 -40 -214 9 -164 203 -144 -72 298 41 -36 37 -215 -94 -131
$$ packed form
5747A89l09L15j16J15k82K60O5j95l31J06K17p1M25k73N2K2j49j52J77n4q3J92
5769A20j18J28k26J02o4J26j04n0J28O2j52O5Q9j30O8o1N9K01r8m05L13j75K96
5792A74k26J32J13k56k14K73j77J18J71k28K03O9J1j1J33k84q2J31M5j24QM8J03
5815A30j43m20J30K39m2J58L0j60P7J74k11o9Ok0J22k95L89Kk00nL1L7J13J6Q
5840I7n2K1n6K2K31k38j25K48k8J75j61j27Mj13j04K62j88J00J19j4j4K40l58
5863e9J04Mk40K73j00L5l0qj03Q6j32L33l66L76m07K08j50K00n03O98k63j98K38
5886dO4k07K10l2r4L9M9n0l20M33q3K64k93No4J57j99J17J25j0k91J01J43kj4
5911D4N6j26j00L70l48M9Q5L4j87Q3j74K23j73L67l47P2L70k57p7P3k52J21l7
$$ plain form
5934 -131 63 -124 56 208 -104 417 93 19 37 24 148 -220 -182 -41 -31 47 -235 54 -148 -354 -30 94
5956 94 -102 62 -110 -62 -84 -112 38 -69 213 -137 -361 -2 146 -52 -29 -11 106 78 42 300 233 -147 51
5979 51 -145 -45 -71 67 -21 165 -288 -162 -148 -113 -5 -69 169 76 -27 169 152 -61 327 -173 17 37 -132
6002 -132 -256 -79 -306 -41 -233 -284 -86 157 -195 116 -173 180 124 -50 -113 -69 212 50 8 -58 -237 121
6024 121 -358 -129 -17 -470 -150 56 -55 167 82 -74 -18 91 210 105 -44 -196 -41 -49 49 -124 302 -75
6046 -75 -247 -196 -43 83 64 240 64 52 -6 -228 -197 213 -90 58 174 98 31 139 84 -227 191 313 -131
6069 -131 27 -296 184 -262 -118 112 -33 137 -92 -226 29 293 -150 -59 17 55 -31 -17 49 -30 126 -149
6091 -149 94 17 80 45 -122 -200 -292 30 -383 -77 81 -135 -339 38 33 -71 163 -152 218 124 269 86 143
$$ packed form
5934a31J94j87J80J52l12N21l24p4J8j3J24l68L8J41J0P8k82K89k02k06L24J24
5956I4j96J64j72M8k2k8J50j07K82l50k24L59J48j98K3J8J17k8l6K58o7l80J98
5979E1j96J00k6J38q8J86m53J26J4L5J08o4K38r3j03J96j7k13L88n00J90K0j69
6002a32j24J77k27K65j92n1J98K43l52L11k89L53n6j74o3M4K81j62m2o6j79L58
6024A21m79K29J12m53L20K06j11K22q5j56N6J09J19j05j49j52J55qR8j73M26l77
6046g5j72N1J53J26j9J76j76j2n8k22L1M10l03J48J16p6o7J08n5l11M18J22m44
6069a31J58l23M80m46J44K30j45J70k29j34K55K64m43R1P6L8q6J4O6p9J56k75
6091a49K43p7O3l5j67p8r2L22m13L06J58k16k04L77nj04K34l15L70r4J45j83N7
$$ plain form
6114 143 -201 -234 -108 -76 274 10 239 3 -71 -134 196 -9 -35 85 90 -109 -251 -140 165 -19 -201 -166 15
6137 15 -14 5 -7 -133 -36 27 108 55 -290 27 -20 137 -195 -24 -3 117 210 109 11 231 -144 41 158 2
6161 2 63 -8 -88 -161 -89 32 400 34 32 227 130 -177 -39 119 84 -171 -28 24 -4 220 151 -26 -213 -136 -94
6186 -94 -94 125 -362 -140 94 131 -107 -124 -135 -207 -222 10 5 -63 6 -143 -23 -82 4 -107 -140 -110 -1 64 -491 -7
6212 -7 55 210 167 -144 2 256 52 5 -63 -157 -132 17 150 -122 121 87 -12 -15 -195 71 -252 9 213 -161
6236 -161 250 225 -99 158 -56 -232 131 -243 -109 48 42 5 -435 -58 -111 -57 -189 -100 -41 380 -56 118 143
6259 143 255 -197 -27 -129 -14 -181 -223 -36 -32 36 45 133 186 -71 77 256 107 90 18 -39 -33 -79 264 82 -179
6284 -179 37 53 141 46 -28 147 93 14 154 -20 109 -77 63 -200 -20 -218 122 -130 153 -202 -59 -149
$$ packed form
6114A43l44l3J26L2L50k64K29k36p4o3L30k05k6J20Nj99j42J11L05j84j82L5J81
6137A5k9J9j2j26R7O3Q1n3l45L17m7J57l32J71K1J20R3j01r8K20l75J85J17j56
6161BO1p1q0p3P2J21L68l66kJ95r7l07J38J58l5k55J43N2k8K24o9j77j87P7M2
6186i4%K19m87K22K34L7k38j7j1p2j5K32no8O9j49J20n9Q6j11l3L0J09O5n55M84
6212gO2J55m3l11J46K54k04m7o8r4K5J49J33k72K43l4r9lj80K66l23K61K04l74
6236a61M11k5l24K57k14j76L63l74J34J57ol7m40L77n3N4j32Q9N9M21m36J74K5
6259A43J12m52J70j02J15j67m2J87MO8RQ8N3k57J48J79j49j7p2n7Om6L43j82k61
6284a79K16J6Q8r5p4J75n4p9J40j74J29j86J40k63J80j98L40k52K83l55J43r0
$$ plain form
6306 -149 5 -67 21 41 -74 -61 192 12 -111 61 185 344 176 99 9 -131 -9 -47 13 347 124 -140 -17
6329 -17 64 -232 193 -65 37 -17 135 -154 -52 182 -46 348 -208 24 -133 20 29 307 44 -94 -68 44
6351 44 59 89 -9 -156 257 -162 61 -2 169 55 101 -66 -112 20 -76 29 117 51 -45 65 2 -52 408 -159
6375 -159 -79 19 54 -149 -166 65 -13 -10 371 23 20 78 154 55 -113 -53 -214 -86 -22 36 72 -56 -240 245 -188
6400 -188 -114 5 -132 -180 -5 9 -37 -149 146 -225 3 178 120 -150 135 -182 -23 87 37 154 137 -197
6422 -197 165 -34 175 -55 -283 -248 -11 162 -184 -72 -154 113 100 -25 156 4 -43 -102 405 103 83 395
6444 395 -146 -4 28 396 68 -78 -251 -68 -110 -386 -89 -3 -132 -122 -489 97 227 58 -97 -300 -54
6465 -54 70 103 35 136 55 309 -53 -31 122 -23 -119 -86 -216 176 -21 -106 118 -139 51 166 176 37 -353
$$ packed form
6306a49J54p2Q8K0j15J3K53j80j23J72J24J59j68p7r0j40J22l8O0L34k23k64J23
6329a7Q1k96M25k58J02n4J52k89J02K34k28L94n56K32j57J53RK78k63j38K6J12
6351D4J5L0r8j47M13m19K23o3J71j14M6j67m6J32r6J05Q8o6r6J10o3n4M60n67
6375a59Q0R8L5k03j7K31p8LL81l48lN8P6r9j68O0j61J28O4N8L6j28j84M85m33
6400a88P4J19j37m8J75J4m6j12K95l71K28J75n8k70K85l17J59J10n0J17j7l34
6422a97L62j99K09k30k28L5K37J73l46J12q2K67j3j25J81j52m7n9N07l02k0L12
6444C95n41J42L2L68l28j46j73J83m2k76K97Q6j29J0l67N86J30j69j55k03K46
6465e4J24L3o8J01q1K54l62K2J53j45r6L3j30L92j97q5K24k57J90J15J0j39l90
$$ plain form
6488 -353 -220 55 -190 126 -44 -144 71 -238 21 201 -162 -78 -233 126 3 -132 -81 142 -108 -93 -333
6509 -333 307 -105 169 -170 63 -252 342 48 -50 159 39 128 112 -49 107 93 111 -9 33 -148 65 34
6531 34 273 92 -80 -299 -181 243 -5 -159 30 193 -4 -114 63 -188 152 17 -92 -301 -48 149
6551 149 257 135 34 91 126 58 19 -142 39 117 90 162 -1 113 42 -91 -59 -89 123 -107 18 11 -45 -260
6575 -260 -22 -3 -64 158 118 -78 -206 71 168 -115 -1 266 -87 131 42 25 155 -297 162 88 95 -4 -96 117
6599 117 -56 -66 199 39 1 78 95 374 -108 -49 -243 51 -77 9 114 257 -118 -128 -205 13 60 4 -265
6622 -265 145 -62 231 228 -29 -86 76 89 -99 157 -92 35 269 -111 -56 -173 -223 -370 -288 65 -155 186
6644 186 -18 212 -67 -69 -280 -48 184 132 -94 251 119 114 -19 -124 52 -83 93 -19 108 -36 -42 319
$$ packed form
6488c53J33K75k45L16j70j00K15l09K59J80l63Q4j55L59j23j35N1K23k50J5k40
6509c33O40m12K74l39K33l15N94k94r8K09j20Q9j6j61J56j4J8j20M2j81K13l1
6531C4K39j81j72k19J18M24k48j54J89J63j97j10J77k51L40j35j09k09K53J97
6551A49J08j22j01N7L5o8l9j61J81P8k7P2j63J14p1j33L2l0K12k30J25pn6k15
6575b60K38J9o1K22m0j96j28K77R7k83J14K67l53K18q9j7J30m52M59p4Pr9r2K13
6599A17j73j0K65j60l8P7J7K79m82N9j94K94j28Q6J05J43l75j0p7K18M7n6k69
6622b65M10k07K93lk57n7J62J3j88K56k49J27K34l80N5j17n0j47Q2L53k20L41
6644A86k04K30k79kk11K32K32n2k26L45j32nj33j05J76j35J76j12J27j44oL61
$$ plain form
6666 319 -50 136 -106 17 32 89 239 30 -18 142 37 -212 271 -39 -328 40 -61 4 -38 -160 271 57
6688 57 221 -265 1 -97 23 45 -99 -104 -48 134 298 -87 -357 79 25 36 141 185 23 89 269 113 163 -31
6712 -31 -26 -185 -177 26 -118 -36 128 -159 -113 29 -323 122 42 -41 -152 -83 -134 -286 111 -2 237 -352 115 -115
6736 -115 198 -126 60 100 137 -80 208 -164 261 166 -88 -163 209 103 -5 -182 -192 81 46 212 105 -21
6758 -21 44 2 38 4 138 153 107 -6 -59 35 -19 149 -5 49 -76 -57 -54 -48 -113 346 -6 -29 -94 243 -254 84
6784 84 211 -194 -15 65 -137 -96 180 -361 174 -167 -327 11 -142 83 -30 93 -277 -58 -137 -63 352 20
6806 20 73 43 123 -155 -65 -12 -28 -111 -40 146 -38 -43 -77 18 19 0 -86 -55 211 320 -3 197 136 133 27 -70 43
6833 43 -22 -33 -139 -174 -200 -188 32 151 -44 81 51 -250 164 110 -109 -127 -147 57 -202 215 75 -169 -555
$$ packed form
6666C19l69J86k42J23J5N7J50k09m8J60j05k49M83l10k89L68j01O5m2j22M31k14
6688E7J64m86K66r8J20K2j44nN6J82J64l85k70M36n4J1J05M4j62O6J80j56N0j94
6712c1Nj59QK03j44Q2J64k87M6J42l52M45q0q3j11O9n1j52L97j13K39n89M67k30
6736a15L13l24J86M0L7k17K88l72M25r5k54p5L72j06j08j77j0K73l5J66j07j26
6758b1O5m2L6l4J34J5m6j13n3R4n4J68j54N4j25J9LOo5M59l52k3o5L37m97L38
6784H4J27m05J79Q0k02M1K76n41N35l41j60L38j53K25j13J23l70K19p9P4M15l32
6806B0N3l0Q0k78R0N3j6q3P1J86j84nl4R5Jj9q6L1K66J09l23K00o1lj06r7J13
6833D3o5j1j06l5k6J2K20J19j95J25l0l01M14n4k19j8k0K04k59M17j40k44l86
$$ plain form
6856 -555 -7 -10 -84 -50 -151 -58 6 -300 33 16 -32 211 -235 -32 -381 165 8 -76 -160 94 -247 162 270
6879 270 -101 -46 -168 90 75 238 -48 357 95 -25 -119 -21 -87 -139 -80 -188 62 -290 -25 108 264 36
6901 36 123 -163 73 -93 -235 72 79 -99 -109 -181 123 -277 -148 102 -162 126 -79 227 121 147 83 -83 -123
6924 -123 -83 107 -15 -143 144 -8 -135 49 129 63 -197 129 -215 117 -51 128 -45 -49 9 -134 -78 -99 -327
6947 -327 71 -145 -131 1 -1 338 59 5 -3 -16 -46 50 -157 9 -123 363 117 -48 -142 299 371 -67 -88 179
6971 179 -66 22 30 18 -280 191 137 67 -67 67 47 247 223 -135 28 -49 68 -38 -193 186 58 -36 -6 71
6995 71 246 -74 -28 93 -206 -145 -221 -50 -115 241 89 -381 100 -48 -134 -22 -22 -119 -146 118 217 135 53 -126
7019 -126 -179 -119 164 -124 21 -136 -82 360 -16 73 -162 -185 -1 -138 180 -150 -3 -35 -472 -40 -79 96
$$ packed form
6856e55N48lp4L4j01R3O4l06L33j7m8K43m46K03l49N46j57q4q4K54l41M09J08
6879B70l71N5j22K58j5J63k86M05k62j20r4R8o6n2N9j08K50l52K65J33J56k28
6901C6Q7k86K36j66j42L07Pj78j0p2L04m00J29K50k64K88k05L06j06K6o4j66m0
6924a23M0J90j22j28K87j52j27J84Q0o6k60L26l44L32j68J79j73mN8j43N6k1k28
6947c27L98k16J4J32kL39k79n4qj3l0R6k07J66j32M86k46j65r4M41P2m38k1K67
6971A79k45Q8Qj2k98M71n4p0j34J34k0K00k4l58J63p7J17j06j55L79j28r4L0P7
6995G1J75l20M6J21k99O1p6J71o5L56j52m70M81j48q6J12%r7k7K64R9q2q2j79
7019a26n3O0K83k88J45j57N4M42l76Q9k35k3J84j37L18l30J47l2m37M32l9J75
$$ plain form
7041 96 113 -20 9 -222 5 147 166 63 42 145 67 178 314 -131 14 -202 -6 -291 214 124 -251 132
7063 132 44 -14 73 -16 56 -87 -138 307 171 -122 -148 91 28 48 96 -112 -149 -34 261 81 -55 -265 -58 -57
7087 -57 201 7 -139 154 111 -112 11 -42 -224 -26 -251 -67 -80 -243 -64 80 -147 1 -125 -81 -224 254
7109 254 -87 55 -148 -135 156 -96 54 -79 -263 -89 -247 -117 -175 38 -78 -8 101 -254 -566 -64 249
7130 249 15 70 -48 -211 -250 278 -100 -28 -204 -28 -160 -19 178 -170 223 37 16 13 0 -95 -131 -68 9 -75
7154 -75 58 -93 -13 -182 -119 -76 85 87 124 140 250 -147 146 -268 100 -80 1 -35 -103 -36 186 7 -108 -17
7178 -17 103 -12 134 66 322 -88 -168 -49 -1 -49 252 -114 -62 -91 -61 47 252 -41 178 125 185 -115 -192 -85
7202 -85 104 22 -122 -363 76 123 -110 -296 105 159 134 -81 219 -93 -125 -271 -52 134 207 -21 -143 -192 41
$$ packed form
7041I6J7j33K9k31K27J42J9j03k1J03p8J11J36m45J45k16J96k85N05r0l75L83
7063A32q8n8Q7q9P2j43n1M45j36k93k6K39o3K0M8k08l7J15K95j80j36k10K07J
7087e7K58j94j46K93m3k23J23n3j82J98k25J84j3j63J79J44k27J48j26M4j43M78
7109B54l41J42k03J3K91k52J50j33j84J74j58J30n8K13j16P0J09l55l12N02L13
7130B49k34N5j18j63l9N28l78P2j76J76j32J41J97l48L93j86k1lj3r5l6O3P7q4
7154g5J33j51Q0j69O3M3J61KL7J6J10l97K93m14L68j80Q1l6o8O7K22j79j15R1
7178a7J20j15J46o8K56m10q0J19M8m8L01l66N2k9L0J08K05k93K19n3O0l00p7J07
7202h5J89q2j44k41M39M7k33j86M01N4k5k15L00l12l2j46K19J86P3k28j22m9K33
$$ plain form
7225 41 180 -129 152 74 -10 211 50 261 -42 -40 73 -20 105 -80 -25 -375 115 -229 124 119 103 86 -73 341
7249 341 -121 -106 -134 -86 41 -193 125 20 54 193 -282 -97 94 -32 89 -251 -67 -89 360 172 127 171
7271 171 -199 40 -191 -76 312 227 240 82 -114 -178 -239 -99 -97 79 349 271 95 -131 227 -136 -252 -59
7293 -59 -79 230 -135 91 -271 12 105 286 124 2 22 63 -111 86 366 -162 -156 178 -47 119 140 197 -128
7316 -128 -94 -34 1 -290 197 -122 293 -175 -202 135 413 72 6 64 -264 339 43 -324 -142 278 -85 129
7338 129 -99 109 128 116 -64 -147 82 -99 47 -49 -195 140 334 -118 -154 86 -267 9 161 -51 24 -183
7360 -183 15 153 125 -172 63 -5 -194 -76 -23 192 -44 -154 -253 -20 46 60 -245 -111 150 106 144 -22 -78
7383 -78 181 106 243 84 -145 241 -240 -16 99 74 76 -175 165 80 -203 82 82 -2 -40 191 -97 -112 39 -109
$$ packed form
7225D1J39l09K81p8q4K21j61K11l03KJ13r3J25j85N5l50M90l44L53nj6j7j59M14
7249C41m62J5k8M8J27k34L18j05L4J39m75J85J91j26J21l40J84k2M49j88m5M4
7271A71l70K39k31J15L88q5J3j58j96o4o1J40KJ76K70p8j76k26L58l63j16J93
7293e9k0L09l65K26l62K83R3J81j62j22K0M1j74J97K80n28OL34k25J66K1N7l25
7316a28L4O0L5k91M87l19M15m68k7L37K78l41o6N8l28O03k96l67J82M20l63K14
7338A29k28K08J9j2j80q3K29j81J46r6j46L35J94m52l6K40l53K76J52k12P5k07
7360a83J98J38k8k97K35o8j89J18N3K15k36j10r9K33O6J4l05J34K61m4L8j66n6
7383g8K59p5J37j59k29L86m81K24J15k5Kk51L40q5k83K85%q4l8K31k88j5J51j48
$$ plain form
7407 -109 -347 86 93 -1 141 48 18 21 -55 19 143 260 63 -6 -294 79 -132 -182 -137 -126 -16 60 -84 -151 174
7432 174 38 -65 211 88 63 117 -185 -156 272 16 -169 2 -396 -22 239 52 -207 11 120 -29 100
7453 100 20 22 -169 87 284 185 -134 78 -141 -89 -112 240 -10 -186 -140 263 87 188 213 -102 -97 148 -56
7476 -56 -15 67 -18 -79 -151 188 33 -56 -170 98 -39 -230 41 -313 98 -298 -349 119 80 -294 -89 -322 97
7499 97 260 0 266 -44 -71 -38 -3 89 -298 191 146 -122 176 -255 -17 -228 93 129 -19 206 -207 -270 -123
7522 -123 67 331 -161 155 153 110 -175 78 187 44 -35 5 257 -45 20 27 -121 -314 84 229 -54 -188 161
7545 161 -331 -45 -444 -314 250 184 -199 -44 287 142 -62 337 -67 324 315 34 110 -114 -134 139 198 -234
7567 -234 -120 29 191 -275 33 20 -338 60 -139 -251 368 127 120 161 254 281 61 -171 11 1 -325 120
$$ packed form
7407a09k38M33Pr4J42r3l0Lp6P4J24J17j97o9k88L73k11n0M5J1J10P6j44o7L25
7432A74j36j03K76j23k5N4l02K9M28k56j85J71l98L74K61j87k59K18J09j49J29
7453A00q0Kj91K56J97r9l19K12k19N2k3L52k50j76M6M03j76J01K5l15NK45k04
7476e6M1Q2q5o1p2L39j55q9j14K68j37j91K71l54M11l96n1M68l9l74K05k33M19
7499I7J63k60K66l10k7L3L5R2l87M89m5k68K98m31K38k11L21L6j48K25m13o3J47
7522a23J90K64m92L16km3k85K53J09j43p9M0K52l02O5Pj48j93L98J45k83j34L49
7545A61m92K86l99J30N64o6l83J55L31j45k04L99m04L91rk81P6k24k0K73N9m32
7567b34J14J49J62m66L08j3l58L98j99j12O19k41pM1R3K7k20k32J82j0l26M45
$$ plain form
7589 120 38 238 -243 -231 22 168 96 106 -129 -80 175 60 -88 -35 49 -162 -185 0 -86 44 36 -114 -17 -405
7613 -405 -174 80 -51 67 -31 247 -351 -51 82 -186 150 189 152 -187 -2 -56 48 186 -174 -28 78
7634 78 -252 -70 -185 6 -210 76 172 116 -131 -154 -242 65 104 -54 -89 334 43 -59 -110 -202 -175 98 -35
7657 -35 -71 106 -87 158 -158 40 155 23 -39 11 232 -4 -212 -44 70 15 86 -131 130 175 -185 229
7679 229 -38 -303 329 -175 -40 -45 -63 -352 -62 101 -209 -31 15 -134 303 237 324 29 -114 127 -271 47
7701 47 22 -133 76 77 -85 55 -53 -36 196 113 166 -120 107 -69 -91 -27 151 73 -165 393 -6 106 183 -172
7725 -172 156 -351 231 19 10 19 92 -202 -50 28 -123 92 -78 -258 196 250 -30 140 -45 139 145 58 -61
7748 -61 -6 -293 234 258 60 -212 -159 50 -207 34 -132 35 282 124 -54 253 -95 129 139 25 185 16
$$ packed form
7589A20q2K00m81J2K53J46p2J0k35M9K55j15j48N3Q4k11k3J85q6J30qj50R7l88
7613d05K31K54j31J18r8K78n98L00J33k68L36L9l7l39J85n4J04J38l60J46J06
7634G8l30J82j15J91k16K86R6n6k47k3q8L07L9j58l5M23k91j02n1r2K7K73j33
7657c5l6J77j93K45l16J98J15j32o2N0K21k36k08J68J14n5P1k17K61M5l60M14
7679B29k67k65O32n04J35nj8k89K90J63l10J78M6j49M37o6Q7k95j43K41l98L18
7701D7k5j55K09Jj62J40j08J7K32q3N3k86K27j76k2O4J78p8k38N58l99J12P7l55
7725a72L28n07N82k12rRP3k94J52P8j51K15j70j80M54N4k80J70j85J84Oq7j19
7748f1N5k87N27K4j98k72N3K09k57K41j66J67K47j58j78L07l48K24J0j14J60j69
$$ plain form
7770 16 -320 -155 140 139 -88 -240 47 -125 -333 -28 -46 -167 -136 -258 -36 -111 -82 -238 33 -125 203 150 -335
7793 -335 98 95 144 195 -185 -21 54 254 -307 62 -239 -85 306 -291 105 -191 194 -273 190 191 45 -102
7815 -102 232 115 -205 119 11 -73 124 -107 -81 179 -23 -105 57 185 -223 93 19 214 228 -36 152 -153
7837 -153 39 257 505 -167 32 95 69 15 19 146 -103 -8 -135 -69 -150 -254 -124 -167 -31 -56 -34 136 84 124
7861 124 -228 34 -205 19 54 -175 299 114 -141 38 61 -101 68 328 -107 -157 -214 2 202 117 -239 73
7883 73 147 95 -300 -102 28 -304 -127 131 -355 -93 -7 0 188 -113 -12 -72 -20 83 44 -74 -36 127 -115
7906 -115 -116 311 -353 27 -238 -7 -102 -63 343 498 204 -2 -112 -178 -263 -12 -94 -78 59 129 -219 -112 -208
7929 -208 -81 -231 -95 41 -51 -55 162 255 3 -289 201 259 132 210 -82 52 111 -72 35 135 -171 136
$$ packed form
7770A6l36J65K95jk27j52K87j72k08L05j8j21L1j22K22p5K9j56K71j58L28n3m85
7793c35M33lM9N1l80J64P5K00n61L69l01J54L91n97L96k96L85m67M63Jj46j47
7815a02L34j17l20L24j08q4J97k31K6K60k02q2J62J28m08L16p4J95J4k64J88l05
7837a53J92K18K48o72J99O3k6n4MJ27k49R5j27O6q1j04J30m3J36k5K2J70n2M0
7861A24l52K62k39K24L5k29M74j85k55J79K3j62J69K60m35n0n7K16K00q5l56L12
7883G3P4n2l95J98J30l32J77K58m86K62Q6PJ88l01J01o0N2J03l9j18L8J63k42
7906a15jM27o64L80k65K31r5L9M06J55k94k06j10o6q5K51q2J6J37P0l48J07r6
7929b08J27j50J36J36r2mK17R3k52k92M90N8j27P8k92J34N9j83J07J00l06L07
$$ plain form
7951 136 3 48 -74 -52 -28 151 -1 176 99 -154 -154 -52 -97 50 -48 -181 -13 -14 -101 16 -86 -188 -156 64
7975 64 1 -197 201 40 -34 -78 -43 111 380 -128 29 175 -242 91 -361 98 94 -85 178 8 57 23 -259
7998 -259 67 121 55 51 -48 -135 25 58 -264 202 50 -20 58 37 -228 -264 -112 -121 136 152 -187 -185 -9 -224 17
8023 17 99 -131 -119 -137 -34 -325 76 38 78 -53 -199 -126 93 162 81 -119 -69 -75 142 -42 208 -80 207 88
8047 88 -8 -221 -39 -198 -38 -355 -41 -107 162 -240 45 40 -127 -32 23 147 -65 12 -297 125 -191 32 -43
8070 -43 93 179 85 -8 118 338 -252 116 -100 -254 -89 -8 -73 -382 274 168 -359 -105 332 -70 83 286
8092 286 -19 156 -186 -14 -73 78 -66 -65 208 39 44 90 -142 -213 -215 145 125 -68 449 -213 74 -81 130
8115 130 127 -42 282 -294 212 150 -35 -261 31 -24 -228 -44 -160 -179 -169 119 -56 -100 303 -46 -9 -170 -34
$$ packed form
7951A36j33M5j22K2K4J79j52J77p7k53%J02m5J47r8j33J68jq7J17j02j02L2K20
7975F4o3j98L98j61p4m4L5J54K69n08J57J46m17L33m52M59mj79K63j70M9l4k82
7998b59L26N4o6mr9q7J60L3l22M66j52p0P8k1k65l6J52rK57J6l39KJ76k15K41
8023A7Q2k30J2j8J03k91M01l8M0j31j46P3K19O9q1k00N0oK17j84K50k88K87j19
8047H8r6k13J82j59J60l17L14o6K69m02K85nj67R5N5J24k12P7l09M22l16K23p5
8070d3J36Q6r4r3J26K20n90L68k16j54J65Q1o5l09O56j06n27K54M37m02J53K03
8092B86l05J75l42J72n9J51j44JK73j69NM6k32p1kL60k0j93N17o62K87j55K11
8115A30lj69L24n76N06o2j85k26K92n5k04J84j16j9J0K88j75m4M03l49L7j61J36
$$ plain form
8138 -34 63 -63 -63 -45 -23 -50 -161 -88 -203 -89 102 -224 -246 -166 10 130 69 181 -224 -56 215 -419 0 -94
8162 -94 13 -123 -203 -289 134 87 -117 -12 -14 154 185 -50 -209 -75 36 41 218 -56 -192 145 -126 -59 96
8185 96 -61 -75 -396 138 -93 -150
$$ packed form
8138c4R7j26%J8K2k7j11P3j15J14J91l26k2Q0J76J20o1J12m05J68K71o34M19r4
8162i4J07j36q0q6M23m7k04J05kJ68L1k35j59J34J11NJ77k74j36L37k71O7J55
8185I6j57j4l21N34k31n7
8191a50
$$ Imaginary data points
##PAGE= N=2
##DATA TABLE= (X++(I..I)), XYDATA
$$ plain form
0 0 0 0 0 0 0 0 0 0 0 -1 8 -8 8 -8 9 -16 16 -17 24 -26 33 -36 42 -49 57 -65 75 -83 94 -107 122 -136 152
33 152 -170 190 -210 234 -261 290 -321 355 -391 436 -480 533 -592 657 -734 820 -920 1040
51 1040 -1183 1359 -1580 1874 -2277 2871 -3836 5674 -10464 51018 97313 -10731 -80954 -73657
65 -73657 15909 72942 56429 -14838 -56101 -43357 5025 36839 38006 11395 -20913 -42862
77 -42862 -30795 13071 56038 47075 -15485 -72504 -54538 26172 85264 52824 -38830 -90076
89 -90076 -43662 47701 85600 31557 -49129 -72647 -22242 40767 55981 19466 -24796 -41078
101 -41078 -25823 5073 33170 39004 11061 -34331 -54836 -20308 43317 68584 20032 -55337
113 -55337 -75193 -12284 66721 73445 372 -71145 -63730 9583 66242 50473 -12074 -53262
$$ packed form
0@%%%%%%%%%jRj6J6j6J7k5L2l3M1n0N9o9P8r1J06j22J40j58J77k01K29k58K88
33A52l22L60m00M44m95N51o11O76p46Q27r16J013j125J249j391J554j740J960
51A040k223K542k939L454m151N148o707R510j6138O1482M6295j08044p0223P297
65g3657Q9566N7033j6513p1267m1263J2744M8382L1814J167k6611l2308k1949
77d2862J2067M3866M2967q963o2560n7019J7966Q0710N9092l2440r1654n1246
89i0076M6414R1363L7899n4043q0686k3518N0405O3009J5214l6515m4262j6282
101d1078J5255L0896K8097N834k7943m5392k0505L4528O3625K5267m8552p5369
113e5337j9856O2909P9005O724p3073p1517P415P3313N6659j5769o2547m1188
$$ plain form
125 -53262 -39034 5987 36704 33362 7616 -20912 -36131 -25232 10926 45629 41265 -9005
137 -9005 -58386 -50458 14818 69814 51255 -24930 -75172 -43715 34255 72532 32300 -38065
149 -38065 -63069 -21946 34516 49234 16572 -23759 -36151 -19557 8369 28131 29116 6920
161 6920 -27625 -43497 -17423 33111 56790 20967 -42974 -65592 -17305 52302 66397 8934
173 8934 -56669 -59689 -175 54214 48281 -4660 -44771 -36342 2924 31145 28476 5231 -17520
186 -17520 -27225 -18108 8114 33400 31532 -4394 -43940 -41785 8038 55608 45818 -15660 -62951
199 -62951 -42599 24155 63856 34697 -28872 -57472 -25082 27295 45455 18463 -19223 -32608
211 -32608 -17955 6492 22669 23020 6824 -18680 -33157 -17241 21497 44360 21296 -29157
$$ packed form
125e3262J4228M5021L0717l342k5746k8528j5219J0899L6158L4703m364n0270
137i005m9381P928O5276N4996j8559p6185n0242L1457P7970L8277m0232p0365
149c8065k5004M1123N6462J4718l2662m0331j2392J6594K7926J9762R85k2196
161F920l4545j5872K6074N0534K3679l5823o3941k2618M8287O9607J4095n7463
173H934o5603l020N9514N4389n933n2941m0111Q429L9266K8221k669k3245k2751
186a7520r705R117K6222K5286j868l5926l9546K155M9823M7570r790o1478m7291
199f2951K0352O6754L9701k9159o3569k8600L2390N2377J8160k6992l7686j3385
211c2608J4653K4447J6177L51j6196k5504j4477J5916L8738K2863k3064n0453
$$ plain form
223 -29157 -53244 -19284 38269 56178 12486 -44868 -53002 -4503 45434 45293 -670 -40106 -35479
236 -35479 975 29275 27599 4767 -16724 -23915 -15123 6145 26089 26676 -232 -32913 -36090
249 -36090 609 41646 40810 -5660 -48732 -39273 13334 51335 32830 -19911 -48319 -24148 21683
262 21683 40437 17583 -17415 -29979 -14908 8254 21158 17894 3587 -15670 -26027 -13897
274 -13897 15730 35739 20649 -20463 -44218 -21322 27099 48461 16661 -33488 -46547 -9493
286 -9493 35442 39868 2937 -32700 -30923 -319 25540 23182 2068 -15396 -18504 -9275 6400
299 6400 19413 18930 -126 -24646 -28342 -885 32487 34224 -2102 -39232 -35312 7377 42923
312 42923 31665 -12962 -41216 -24730 15479 35300 17592 -13524 -25897 -13301 7051 17311
$$ packed form
223b9157k4087L3960N7553J7909m3692n7354q134M8499M9937j41m5963l9436M627
236c5479L6454K8300j676k2832k1491p191Q792K1268J9944N87k6908l2681l177
249c6090L6699M1037q36m6470m3072R459N2607L8001j8505n2741k8408K4171M5831
262B1683J8754k2854l4998j2564J5071K3162J2904l264j4307j9257j0357J2130
274a3897K9627K0009j5090m1112k3755K2896M8421K1362l1800n0149j3059L7054
286i493M4935M426l6931l5637J777L0604K5859k358k1114j7464l108R229J5675
299F400J3013m83j9056k4520l696K7457L3372J737l6326l7130L920M2689L5546
312D2923j1258m4627k8254J6486M0209J9821j7708l1116j2373J2596K0352J0260
$$ plain form
324 17311 13698 1308 -11822 -17945 -9490 10341 25325 16011 -13846 -33581 -17735 19908 38509
337 38509 15342 -25660 -39531 -10445 29420 36167 5026 -28315 -29609 -1397 22729 21817 2169
350 2169 -14657 -16344 -6558 5670 14590 13855 698 -16794 -21748 -3050 22611 27082 1246 -28879
364 -28879 -28620 3536 32979 26534 -9207 -34039 -21686 12913 30671 15610 -12481 -24384 -11644
377 -11644 8046 16911 10931 -746 -10843 -13922 -6746 8499 19209 12891 -9172 -25113 -15618
390 -15618 12662 29999 14570 -17755 -31139 -10340 21207 28729 5095 -22630 -24082 -861
402 -861 19880 18413 161 -14517 -13387 -2729 7725 11601 8094 -1506 -13051 -15044 -1605 17092
416 17092 20764 1893 -22063 -23679 1055 25855 22734 -5093 -26979 -18864 8564 24964 13526
$$ packed form
324A7311l613j2390j3130o123Q455J9831J4984r314k9857j9735J5846L7643J8601
337C8509k3167m1002j3871K9086L9865O747l1141l3341j294K8212K4126r12j9648
350B169j6826j687R786J2228Q920p35j3157j7492m954J8698K5661M471k5836l0125
364b8879K59L2156K9443o445l5741k4832J2353L4599J7758j5061k8091j1903J2740
377a1644J9690Q865n980j1677j0097l079P176J5245J0710o318k2063j5941R495
390a5618K8280J7337j5429l2325j3384K0799L1547P522k3634k7725j452K3221
402h61K0741j467j8252j4678J130J0658J0454L876l507r600j1545j993J3439J8697
416A7092L672j8871k3956j616K4734K4800l121k7827k1886Q115K7428J6400j1438
$$ plain form
429 13526 -10109 -19935 -8851 8168 14015 6900 -3876 -9599 -8082 -1882 6525 11910 7489 -6741
443 -6741 -17689 -10683 9996 22460 10889 -13777 -24943 -8656 17397 23877 4963 -18175 -20936
456 -20936 -1838 16524 15803 -2 -12663 -11468 -842 7230 8112 3997 -2353 -8268 -8354 -304 10963
471 10963 13538 937 -14982 -15792 1454 19104 16451 -4701 -21309 -14484 8011 20965 11220
484 11220 -9410 -18275 -7745 8478 13296 5445 -5013 -8741 -5316 285 5658 7927 4074 -4810
498 -4810 -11590 -7052 6443 14728 7768 -9237 -17332 -5966 12758 17730 2721 -15277 -16147 244
512 244 15296 12736 -2304 -12812 -9441 1755 8648 7358 628 -4806 -6812 -4248 1595 7856
526 7856 8151 -378 -10635 -10845 836 12934 11726 -3436 -15402 -10176 6261 15587 7647 -8019
$$ packed form
429A3526k3635r826J1084J7019N847p115j0776n723J517O200Q407N385m421j4230
443f741j0948P006K0679J2464j1571k4666j1166J6287K6053O480j8914k3138k761
456b0936J9098J8362p21j5805j2661J195J0626Q072Q82m115o350n915q6Q050J1267
471A0963K575j2601j5919q10J7246J7650k653k1152j6608O825K2495J2954r745
484A1220k0630q865J0530J6223M818p851j0458l728L425N601N373K269l853q884
498d810o780M538J3495Q285o960j7005q095J1366J8724M972j5009j7998q70J6391
512B44J5052k560j5040j0508L371J1196O893j290o730n434k006K564N843O261
526G856K95q529j0257k10J1681J2098j208j5162j1966N226J6437R326p940j5666
$$ plain form
540 -8019 -14523 -4415 8975 11773 2677 -7433 -8698 -2637 4205 6280 3636 -1097 -5421 -6560
554 -6560 -2295 6140 10069 3901 -8054 -12305 -3372 10230 13447 1608 -11846 -12435 928 12231
568 12231 9966 -2743 -11252 -6925 3688 8800 4655 -2615 -6177 -4102 505 3912 4980 2311
582 2311 -3112 -7272 -5190 3542 10117 6185 -4895 -12224 -6548 6888 13097 5347 -8299 -12264
596 -12264 -3321 8458 10442 1726 -7608 -7969 -537 5922 5908 727 -3786 -4567 -2697 1688 5209 4646
612 4646 -305 -6927 -7030 789 9006 8265 -1985 -10618 -8191 3253 11598 7748 -4294 -11567 -5841
627 -5841 4950 10167 4623 -4403 -7801 -3690 2907 5665 3670 -555 -4677 -4856 -1001 4550 6592
642 6592 2024 -5681 -8589 -2383 7091 9854 1433 -9189 -9852 -271 9720 9586 -626 -9508 -8330
$$ packed form
540h019o504J0108J3390K798r096j0110j265O061O842K075k644m733m324j139
554f560M265Q435L929o168j1955m251Q933J3602L217j1839j3454n89J3363J1303
568A2231k265j2709q509M327J0613N112m145p270l562K075M607L407J068k669
582B311n423m160K082Q732O575l932j1080p329N676J3436O209p750j3646l965
596a2264Q943J1779J984q716r334l61P432O459j4n181m513p81J870M385L521n63
612D646m951o622j03P819Q217p41j0250q633K427J1444Q345l850j2042p273N726
627e841J0791N217n544r026l398M111O597K758j995m225m122j79L855N551K042
642F592m568p705k908O206R474K763q421j0622o63R581R991j34j0212q882J178
$$ plain form
657 -8330 1026 8585 7058 -558 -6246 -6303 -546 4997 6128 2322 -3431 -6989 -4387 3197 8094 5004
673 5004 -3737 -9469 -5487 4197 10276 4986 -6020 -10427 -4093 6635 10412 3267 -6784 -9400
687 -9400 -2918 5772 8513 3284 -4069 -7534 -4497 2260 7230 5866 -850 -7525 -7411 274 8302
702 8302 8420 -228 -9218 -8539 663 10024 8216 -1966 -9866 -7796 2020 9693 7085 -2087 -8503
717 -8503 -6479 1523 7805 6810 -30 -6801 -7732 -1293 6371 8728 2800 -6363 -10135 -3951 6663
732 6663 10917 4138 -7048 -11030 -3508 7467 10703 3179 -7267 -10006 -2885 6394 9343 2972
746 2972 -5609 -8612 -3556 4790 8701 4877 -4066 -9252 -6105 3332 10121 7182 -2895 -10818 -7960
761 -7960 2606 11156 8681 -2847 -11416 -8297 2546 10693 7828 -2224 -10286 -7820 1797 9327
$$ packed form
657h330R356P559j527p616n688n7N757N543J131l806n753l558K602P584M897l090
673E004q741n732L982R684O079n290j1006m407O334J0728L777p145j0051k616
687i400O482Q690K741n229p353l465L037O757M970j364o716o675J14P685Q028
702H302J18q648q990O79R202R361j808j0182p900K070R816P673k608r172o416
717h503K024Q002O282r95o840o771r31O439P664K357n928r163l772O184J0614
732F663M254o779j1186l982P522J0975L236p524j0446k739P121R279K949o371
746B972q581l003N056Q346L911l824q943n186L147R437O789k939j0077p923K858
761g960J0566Q550k475j1528q569L119J0843Q147k865j0052q062K466R617P530
$$ plain form
775 9327 7856 -999 -8319 -8017 -192 8017 8587 1015 -8267 -9681 -1610 8271 10450 2128 -8427
790 -8427 -11352 -2500 8740 11170 2965 -8519 -11357 -3230 7879 11323 3815 -7081 -10940 -4001
804 -4001 5839 10399 5078 -4798 -10301 -6022 4435 10702 6756 -3912 -10618 -7032 3623 11060
818 11060 8018 -3679 -11485 -7932 3167 11573 8476 -3043 -11390 -8511 2147 11167 8623 -1597
832 -1597 -10371 -9448 256 9957 10096 743 -9471 -10344 -1690 9186 11259 2225 -8995 -11463 -2608
847 -2608 8710 11579 2898 -8322 -11331 -3491 8050 11345 3531 -7930 -11693 -4161 7155 11886
861 11886 5342 -6216 -11715 -6072 5650 12064 6874 -4907 -11961 -7869 4150 12242 8393 -3421
875 -3421 -12070 -8897 2960 11901 9103 -2591 -11675 -9418 1891 10976 9502 -1200 -10694 -10056
$$ packed form
775I327j471q855p320L02P825Q209N70p572r282j414Q071R881K179q322j0555
790h427k925Q852J1240K430q205j1484k838Q127J1109L444p508j0896l859O939
804d001R840M560n321r876n503M279J0457O267l946j0668o706L586J0655P437
818A1060l042j1697p806L553J1099Q406l097j1519q347K879J0658R020k544j0220
832a597q774R23R704R701J39r353j0214q73Q654J0876K073r034j1220k468Q855
847b608J1318K869q681j1220l009P840J1541L295p814j1461l763P532J1316M731
861A1886o544j1558n499N643J1722O414n190j1781p054M092J2019Q092l849j1814
875c421q649L173J1857Q941k798j1694r084K257J1309R085j474j0702r494O38
$$ plain form
889 -10056 570 10355 10402 132 -10399 -10804 -731 9989 11463 1738 -9587 -11783 -2666 9315
903 9315 12304 3236 -8691 -12273 -3857 8291 12410 4642 -7402 -12421 -5457 6989 12225 5859
917 5859 -6276 -12170 -6387 5477 12138 7134 -4816 -12189 -7633 4437 12341 8276 -3840 -12518
931 -12518 -8836 3210 11866 9377 -2289 -11903 -9899 1610 11421 10506 -1017 -11021 -10544 39
945 39 10639 10976 837 -10286 -11236 -1578 9935 11505 2207 -8921 -11612 -3026 9173 11929 3382
960 3382 -8509 -12050 -4175 7851 12295 4929 -7375 -12349 -5615 7043 12300 6431 -6224 -12621
974 -12621 -6949 5471 12760 7911 -4557 -12576 -8538 3835 12552 8939 -2927 -11937 -9021 2392
988 2392 11568 9258 -1800 -11477 -9959 1516 11063 10319 -159 -10757 -10846 -314 10564 11149 982
$$ packed form
889a0056J0626R785M7j0270j0531m05J0073J0720J474r725j1325k196R117J1981
903I315K989r068j1927l582Q416J2148M119p768j2044n019O964J2446N236o366
917E859j2135n894N783J1864O661n004j1950p373M556J2070P904m065j2116q678
931a2518L682J2046Q656k489j1666r614K004J1509R811r15j1523j0004M77J0583
945C9J0600L37j0139j1123r50R658J1513J570r298j1128k691Q586J2199K756q547
960C382j1891l541P875J2026M444p366j2304m974O734J2658N257n869j2655o397
974a2621N672J2420P289m849j2468q019M038J2373Q717l613j1866r010K916J1413
988B392R176k310j1058r677J518J1475R547p44j0478j0598q9J0532J0878N85j0167
$$ plain form
1003 982 -9763 -11694 -1801 9536 11824 2722 -9038 -11976 -3328 8247 12272 4159 -7941 -12399
1017 -12399 -4746 7247 12034 5146 -6885 -12175 -6198 5847 12012 6667 -5418 -12347 -7089 5012
1031 5012 11838 7812 -3863 -11931 -7906 3474 11949 8836 -2893 -11699 -9194 1966 10965 9546
1045 9546 -1142 -10791 -9987 325 10471 10281 297 -10060 -10821 -1006 9831 11059 1801 -9138
1059 -9138 -11207 -2248 8651 11548 3197 -8446 -11446 -3902 7689 11667 4334 -7228 -11914 -4927
1073 -4927 6773 12065 5707 -6295 -12066 -5970 5456 11652 7042 -4536 -11727 -7287 3938 11375
1087 11375 7978 -3118 -10905 -8226 2503 10772 8889 -1619 -10491 -9034 1128 10132 9552 -523
1101 -523 -10092 -9682 -342 9789 10013 718 -9275 -10390 -1312 8453 10284 2141 -8146 -10589 -2926
$$ packed form
1003I82j0745j931R893J1337K288r102j1760k938Q648J1575M025q113j2100m458
1017a2399P653J1993M787o888j2031n290N977J2045O165n345j2085o929N258J2101
1031E012O826m026j1675q068M025J1380Q475l113j1729q806K505J1160Q999j419
1045I546j0688r649Q04J0312J0146j90r984j0357p61R815J0837J228r258j0939
1059i138k069Q959J0899K897q351j1643l000P544J1591L978p333j1562m686O987
1073d927J1700N292o358j2002n771O096J1426O196m610j1578p191M440J1225P437
1087A1375l397j1096p787K679J0729Q269j883j0508q872J457J0162R004n80j0075
1101e23r569M10R340J0131K24r295r993j115R078R765J831q143j0287k443P663
$$ plain form
1116 -2926 7774 10920 3570 -7313 -11043 -4556 6489 11125 4872 -5817 -11387 -5550 5761 10959
1130 10959 5816 -4875 -10765 -6501 4388 10732 6689 -3761 -10579 -7268 3345 10384 7460 -2669
1144 -2669 -10270 -8010 1806 9932 8637 -930 -9872 -8803 287 9522 9600 -13 -9215 -9775 -595 8824
1160 8824 9744 1389 -8235 -9836 -1905 7751 9853 2459 -6871 -9886 -3276 6529 9478 3606 -6234
1175 -6234 -10277 -4443 5555 10397 4990 -5218 -10375 -5603 4570 10350 5677 -4062 -10208 -6229
1189 -6229 3310 10175 6720 -3202 -9565 -7184 2260 9378 7177 -1620 -8763 -7781 1044 8705 8199
1204 8199 -151 -8479 -8634 -14 8126 8918 743 -8046 -8876 -1110 7558 9168 1705 -7235 -9290 -2255
1220 -2255 6668 9365 2856 -6051 -9498 -3515 5601 9112 4223 -4958 -9099 -4649 4285 9012 4976
$$ packed form
1116b926J0700L146p350j0883l730O487J1045M636o253j0689n570N837J1311N198
1130A0959n143j0691n890M264J0889O344m043j0450o818L311J0613P039k924j0129
1144b669p601K260R816Q126j295r567q942J069R090R235P8r613r202n60R180R419
1160H824R20q355r624j601P931R656K102p394r330l015O610R805K949n872r840
1175f234m043N834R998M842n407j0208n157M772J0173N780m673r739o146L979
1189f229R539O865l455r922o363K381R444P118k201q797p143R82Q825P661n06
1204H199q350q328j55Q620Q140P92q175q789q30P766Q668J610p463q940k055P035
1220b255Q923K697o509q907l447N983R116L511m889r181m141M450Q934M727m036
$$ plain form
1235 4976 -4047 -9447 -5301 3374 8931 5601 -3193 -8859 -5807 2850 8795 6099 -2261 -8213 -6171
1250 -6171 1650 7982 6969 -959 -7730 -7232 414 7506 7400 163 -7157 -7865 -1024 6835 8280 1400
1266 1400 -6643 -8244 -1618 6460 8088 1850 -5894 -8236 -2567 5446 8062 2655 -5198 -7764 -3138
1281 -3138 4622 7969 3932 -4065 -8254 -4522 3613 7976 4948 -3285 -8036 -5252 2657 8089 5759
1296 5759 -2466 -7866 -5771 1692 7608 5813 -1771 -7095 -5672 966 6627 6129 -386 -6336 -6189
1311 -6189 -296 6161 6487 486 -5760 -7011 -1330 5879 7142 1617 -5511 -7152 -1788 5454 7360
1326 7360 1866 -4866 -7049 -2259 4734 7095 2684 -4546 -6674 -3126 3362 6672 3730 -2939 -6571
1341 -6571 -4167 2495 6672 4525 -2149 -6480 -5045 1900 6631 4847 -1481 -6821 -4779 1326 6420
$$ packed form
1235D976r023n400M146Q675N557l330q794n666L052Q657N945k696q360n952K042
1250f171P821O332j013p928o771M98P646P092j06p237p320p08O841P859J445o880
1266A400q043j601O626Q078J628o238p744k342N669Q013K616n407p853k566M626
1281c138P760L347m037p997m189L732Q135M363l028q233m751K784P909N432k330
1296E759q225n400K095P463N916j795p584n324J423O638N661m98o515n950J47
1311f189N893O457L26o001o246j251N681P209J263n525p128j641N364P242J906
1326G360n494o732k183M790O993K361m411p230k128L548O488L310k942o669l632
1341f571K404O662M177k147o674m331J435O945M731j784o328n340K042O105N094
$$ plain form
1356 6420 5209 -949 -6031 -5075 723 5687 5227 35 -5583 -5597 -394 4864 5465 1122 -4816 -5851
1372 -5851 -1700 4282 6166 1746 -4214 -6208 -1926 4310 6503 1945 -3931 -5910 -2204 3387 5618
1387 5618 2426 -3307 -5519 -3013 2742 5773 3283 -2260 -5475 -3831 1732 5486 3833 -1780 -5579
1402 -5579 -4407 1492 5329 4524 -624 -5523 -4371 783 5404 4633 -687 -4669 -4501 461 4481 4250
1418 4250 355 -4120 -4355 -540 4051 4850 1152 -3487 -4908 -1263 3584 5138 1658 -3444 -4883
1433 -4883 -1761 3228 5145 2000 -3082 -4920 -1839 2788 4648 1883 -2449 -4555 -2398 1898 4345
1448 4345 2967 -1576 -4689 -2779 1373 4336 3329 -486 -4318 -3578 767 4293 3609 -545 -4330
1463 -4330 -3280 740 4485 3430 -417 -3865 -3750 129 3571 3282 121 -2760 -3759 -507 2995 3785
$$ packed form
1356F420j211o158n082R56N798M964m60n192n618j4N203N258O01m343n938j035
1372e851M151N982J884m420n960j994M282O236K193m558n876j979L706N591K231
1387E618l192n733k212K506N755L031k490n543l215J644N563L754j653n613l799
1402e579J172N899L837q05n148m899J152N154M621p71n320l982J68M962M020k31
1418D250l895m475k35L815M591P99l698m639j421L645M847J554l480n102j439
1433d883L122M989J917l145n082j838L081M627J860k765m332k106K157M296K447
1448D345j378m543l113J910M152K963j007l815l832P40M345L526o84m154l785
1463d330J050M020L745j055l847l448J15L879L442k89l161k881r99L252L502P90
$$ plain form
1479 3785 1491 -2340 -3733 -1288 2579 3832 1467 -2392 -3839 -1649 2429 4006 1765 -2296 -3896
1494 -3896 -1616 2018 3813 1711 -1823 -3474 -2029 1481 3317 2196 -945 -3321 -2418 655 3135
1509 3135 2600 -478 -3039 -2830 521 3088 2735 -252 -2926 -2894 200 3033 2806 49 -3169 -2777 -146
1526 -146 2613 2647 266 -2564 -2624 -273 1924 2555 813 -2058 -2734 -754 1736 3014 1286 -1834 -3130
1543 -3130 -1232 1507 2788 1502 -1614 -2918 -1194 1504 2580 1289 -1503 -2502 -1303 1005 2411
1558 2411 1613 -728 -2569 -1785 644 2241 1837 -508 -2409 -2029 243 2343 2267 -497 -2202 -2050 279
1575 279 2180 2003 -478 -2181 -2031 92 1948 1534 -166 -1843 -1673 16 1676 1850 115 -1472
1591 -1472 -1836 -711 1516 2032 361 -1488 -1898 -651 1218 1871 473 -922 -1994 -922 1177 1652
$$ packed form
1479C785k294l831j393K445L867J253k365l859j447K190M078J577k241m061j600
1494c896K280L634J795k102l534j651J445L510J836j121l141k376R03L073K480
1509C135n35l078k561K09L351K567l53k987k674L2L094K833k27k757l218L92K631
1526a46K759L4k381k830o0K351K197O31j742k871o76J980K490J278j728l120j296
1543c130J898K739J281j286l116j304J724K698J076j291k792r99J199K308J406
1558B411p98k341j841P84K429J597m04k345j901L80K272K100p6k764j705J52K329
1575B79J901j77k481j703J50K123J856m14j700j677J70J689J660J74j735j587
1591a472l64J125K227N16j671j849m10J247J869O53j398j395j072J072K099M75
$$ plain form
1607 1652 809 -879 -1955 -887 941 1543 769 -747 -1537 -899 796 1754 725 -451 -1642 -1412 107
1624 107 1666 1341 -535 -1529 -1105 -99 1466 1335 -154 -1643 -886 364 1656 1241 -198 -1264 -748
1641 -748 282 1371 1035 -345 -880 -1160 73 909 1155 199 -1160 -1156 -302 1084 1074 257 -981 -989 -172
1660 -172 902 1063 150 -767 -1394 -90 798 1085 148 -1117 -807 -331 638 1096 312 -553 -1110 49 611
1679 611 764 311 -814 -1005 -466 707 854 397 -798 -909 -384 680 1142 418 -757 -1097 -312 507
1697 507 706 527 -479 -815 -194 393 884 376 -544 -1196 -392 297 696 474 -457 -665 -617 61 1140 755
1717 755 -432 -761 -492 43 850 319 -674 -1014 -445 308 1048 370 -297 -692 -602 217 834 549 -371 -673
1737 -673 -685 423 727 618 -102 -656 -618 4 899 612 -196 -619 -809 116 1059 838 -212 -694 -717 -55
$$ packed form
1607A652q43j688j076J068J828O02p74j516p90O38J695R58j029j176j191K30J519
1624A07J559l25j876r94M24J006J565j31j489j489P57J250J292m15j439j066N16
1641g48J030J089l36j380n35k80J233Q36K46r56j359MQ54J386j0q17j238qQ17
1660a72J074J61r13r17o27J304Q88K87r37j265L10M76R69M58p84q65n57J159N62
1679F11J53m53j125j91N39J173J47m57j195j11N25J064M62p24j175l40P85Q19
1697E07J99j79j006l36O21N87M91n08r20o52Q04O89L99k22r31k08M8O78J079l85
1717G55j187l29K69N35Q07n31r93l40N69P53P40o78o67l95R0Q19O17k85r20l02
1737f73j2J108L04j09p20n54L8O22Q95k87q08m23j90R25R43k21j050m82k3O62
$$ plain form
1757 -55 935 692 -171 -802 -993 -94 832 1062 107 -707 -1172 59 874 757 46 -1067 -990 -127 673 1084
1777 1084 370 -588 -854 -177 681 1093 124 -874 -975 -511 538 1012 474 -915 -1114 -660 805 1335 634
1796 634 -786 -1468 -592 627 940 711 -514 -1457 -744 595 991 724 -318 -1193 -836 673 1198 711
1814 711 -457 -1323 -804 318 1222 878 -272 -1349 -948 502 1118 689 -51 -1337 -1253 -93 1101 1152
1832 1152 -63 -1366 -1141 45 1091 1003 550 -1020 -1144 -228 1436 1317 113 -1072 -1451 -333 767
1849 767 1579 477 -949 -1249 -381 1229 1414 548 -717 -1854 -751 807 1448 809 -469 -1525 -970
1866 -970 454 1611 696 -689 -1875 -1020 520 1442 962 -450 -1626 -1339 470 1541 1251 -252 -1763
1883 -1763 -1476 277 1558 1490 -178 -1620 -1673 224 1548 1366 -157 -1617 -1303 -232 1725 1585 27
$$ packed form
1757e5R90k43q63o31j91Q99R26K30r55q14m65J231Q15j17p11j113P7Q63Q00M11
1777A084p14r58k66O77Q58M12r69r98j01M64J049M74n38j389j99M54J465N30p01
1796F34j420o82Q76J219L13k29j225r43P13J339L96k67j042q75L57J509N25m87
1814G11j168q66N19J122R04l44j150j077M01J450O16m29p40j286Q4J160J194N1
1832A152j215j303K25J186J046q8m53j570j24R16J664j19j204j185l79J118J100
1849G67Q12j102j426l00Q68J610J85q66j265j137J103J558O41o39j278j056N55
1866i70J424J157r15j385j186Q55J540R22m80j412j176K87J809J071k90j503j511
1883a763K87J753J281o8j668j442n3J897J324j82j523j460L14J071J957j40j558
$$ plain form
1900 27 -1384 -1645 -250 1152 1530 515 -1063 -1729 -768 1094 1708 514 -1145 -1822 -520 901 1745
1917 1745 802 -923 -1922 -1259 747 1720 910 -788 -2057 -1165 742 1585 1526 -769 -1554 -940 235 1693
1935 1693 1426 -183 -1913 -1279 75 1370 1577 -11 -1882 -1348 -9 1557 1979 281 -1702 -1882
1951 -1882 -176 1323 1804 372 -1696 -1871 -438 1214 1705 601 -1272 -1784 -628 1272 1963 555
1967 555 -1219 -1677 -1056 885 1721 1267 -977 -2102 -761 598 2112 941 -811 -2185 -1312 571
1983 571 1799 1272 -976 -1909 -1401 603 1844 1396 -243 -1741 -1703 316 1956 1808 -160 -1899 -2006
2000 -2006 -93 1806 1998 20 -1471 -2002 -183 1531 1768 294 -1522 -1798 -443 1528 1978 780
2016 780 -1233 -1973 -1089 1166 2058 1019 -1126 -2189 -1234 856 2012 1228 -1227 -2480 -1330 822
$$ packed form
1900B7j411k61J395J402L78j015j578o66R61J862O14j194j659o77J302J421Q44
1917A745r43j725r99O63K006R73q10j698j269Q92J907Q43n9k295p85O14J175J458
1935A693k67j609j730O34J354J295K07j588j871N34J339J566M22j698j983j80
1951a882J706J499M81j432k068j75J433J652M91j104j873n12J156J900O91j408
1967E55j774m58O21J941Q36m54k244j125J341J359J514j171j752j374Q73J883
1983E71J228n27k248r33N08K004J241m48j639j498L8K019J640j48j968j739j07
2000b006J913J899J92j978j491n31J819J714K37j474j816k76J355J971M50j198
2016G80k013p40Q84K255Q92j039k145j063R55K090J156p84k455j253J150K152
$$ plain form
2032 822 2051 1300 -877 -2518 -1277 784 1948 1379 -458 -1789 -1568 337 1727 1666 -216 -1845
2048 -1845 -1784 18 1812 2059 533 -1414 -2170 -272 1791 2113 454 -1614 -2203 -322 1925 2122 560
2065 560 -1664 -1850 -744 1369 1936 930 -1014 -2041 -865 1188 2049 1161 -716 -2192 -1387 1078
2081 1078 2215 1446 -802 -2502 -1639 973 2419 1601 -697 -2313 -1428 604 2019 1441 -380 -2032
2097 -2032 -1853 284 1854 1919 288 -1649 -1626 -640 1338 2021 608 -1896 -2292 -801 1978 2187 449
2114 449 -1652 -2059 -288 1494 2135 510 -1374 -2228 -590 1226 1905 990 -707 -1629 -890 594 1768
2131 1768 1450 -732 -1981 -1368 591 2278 1607 -806 -2307 -1940 876 2425 1513 -628 -2183 -1492
2147 -1492 652 1883 1327 -425 -1926 -1483 157 1438 1616 321 -1583 -1682 -502 1440 2146 732
$$ packed form
2032H22J229p51k177j641J241K061J164n69j837j331K21J905J390o1j882j629
2048a845O1J802J794K47j526j947p56J898K063L22j659k068n89J881K247J97j562
2065E60k224j86J106K113N67j006j944j027J176K053Q61q88j877j476Q05K465
2081A078J137p69k248j700Q63K612J446q18k298j616Q85K032J415n78j821j652
2097b032J79K137J570O5j631j937K3R86J978O83j413k504l96J491K779K09j738
2114D49k101m07J771J782O41j625j884q54J638J816O79r15j697r22P39J484J174
2131A768l18k182j249O13J959J687o71k413j501L67K816J549r12k141j555O91
2147a492K144J231n56j752j501M43J640J281J78j295j904r9J180J942P06j414
$$ plain form
2163 732 -1781 -2013 -829 1766 2276 714 -1785 -2287 -404 1615 2037 614 -1273 -2004 -671 1384
2179 1384 1687 776 -658 -1496 -1216 514 1765 1632 -684 -1662 -1778 236 1846 1810 -290 -2214 -1966
2196 -1966 118 2231 1506 -669 -2147 -1719 479 2134 1453 -171 -1606 -1327 24 1434 1452 180
2212 180 -1017 -1686 -667 1119 2162 888 -1226 -2410 -1159 1381 2320 1037 -1111 -2371 -1029 1685
2228 1685 2021 707 -1120 -1724 -468 1262 1885 866 -384 -1001 -1247 192 1421 1502 222 -1523 -1761
2245 -1761 -45 1689 1918 -210 -2183 -2127 275 2043 2006 -302 -1840 -1566 262 1854 1654 -59 -1485
2262 -1485 -1089 19 1315 1136 557 -554 -1655 -1093 514 1710 1314 -995 -2199 -1335 733 2591
2278 2591 1007 -1377 -2170 -907 1207 2124 704 -1315 -1756 -494 990 1526 571 -656 -1098 -612 -161
$$ packed form
2163G32k513k32J184K595N10j562k499n02J883K019M22j423j887p31J333K055
2179A384L03r11j434q38K80J730J251j33k316r78j16K014J610l6k100j924K48
2196a966K084K113p25k175j478M28K198J655o81j624j435K79J351J410J8j272
2212A80j197o69J019J786J043j274k114j184J251K540R39j283k148j260J342K714
2228A685L36j314j827o04J256J730O23j019j250o17k46J439J229Q1j280j745k38
2245a761J716J734K29k128j973N6K402J768l7k308j538K74J828J592k00j713j426
2262a485L96J108J296j79n79j111j101N62J607J196l96k309j204Q64K068J858
2278B591j584k384p93J263K114R17j420k019m41J262J484N36r55j227m42M86M51
$$ plain form
2295 -161 827 1350 227 -1149 -1723 -322 1548 1939 407 -1710 -2084 -94 2154 1837 -69 -2124 -1813
2312 -1813 399 1735 1455 -355 -1218 -1173 -62 871 1190 342 -731 -1380 -888 504 1767 1058 -605
2329 -605 -2044 -1591 576 2192 1475 -1079 -2129 -1275 1335 2123 799 -1288 -1579 -469 907 1312 538
2346 538 -769 -879 -905 -29 931 1315 508 -969 -1347 -793 1145 1854 458 -1437 -1804 -493 1512 2091
2364 2091 58 -1633 -1703 177 1431 1456 68 -1455 -970 215 1145 559 583 -258 -1010 -1054 191 1441
2382 1441 1000 -376 -1921 -1583 406 2129 1436 -470 -2194 -1565 715 1860 952 -1403 -1742 -400
2398 -400 818 1219 387 -395 -907 -550 -156 533 882 475 -538 -1373 -869 421 1800 917 -1239 -2170
2416 -2170 -476 1546 2074 469 -1453 -1653 266 1454 1031 -242 -1251 -868 216 884 599 453 -161
$$ packed form
2295a61R88N23j123j376n74J401J870L91j532k117l74J990K248l17j906k055L11
2312a813K212J336k80j810q63M5J111R33L19q48j073o49M92J392J263p09j663
2329f05j439M53K167J616p17k554j050Q54K610P88j324k087k91J110J376M05p74
2346E38j307j10k6Q76R60L84q07j477l78N54J938P09j396j895l67J311K005N79
2364B091k033j691p0J880J254K5j388j523M85J185R30n86K4q41p52m4J245J250
2382A441m41j376j545L38J989J723o93j906j724O29K280J145r08k355l39J342
2398d00J218M01q32p82n12L57L94O89L49m07j013q35N04J290J379q83k156r31
2416b170J694K022N28j605j922k00J919J188m23j273j009L83J084O68k85j46o14
$$ plain form
2433 -161 -580 -699 126 771 879 -13 -1434 -1503 -97 1688 1300 -686 -1985 -1399 1100 1631 1045 -901
2451 -901 -1666 -597 956 1271 276 -723 -581 -312 -65 88 518 519 -461 -1015 -1054 404 1361 1242 -676 -1888
2471 -1888 -885 994 2130 552 -1586 -1629 -166 1557 1226 -170 -1089 -585 123 397 527 -67 -57 -264
2489 -264 -379 -244 464 1398 456 -985 -1219 -514 1405 1587 6 -1612 -1614 531 1431 1077 -915 -1652 -398
2508 -398 893 1121 270 -439 -292 55 74 162 441 637 106 -761 -1122 46 1152 1185 -284 -1468 -969
2527 -969 886 1778 601 -1070 -1439 -189 1458 1227 9 -1223 -676 36 580 82 34 -267 179 -150
2545 -150 -672 -61 1274 735 -522 -1110 -703 992 1610 261 -1446 -1398 111 1197 1214 -538 -1066 -380
2563 -380 951 984 72 -596 -458 428 -86 -31 165 457 439 -400 -731 -496 886 1210 -20 -1307 -953 433
$$ packed form
2433a61m19j19Q25O45J08q92j421o9J406J785l88j986j299N86K499N31n86j946
2451i01p65J069J553L15r95r99J42K69K47J53M30Jr80n54l9J458R57j19j918j212
2471a888J003J879J136j578k138m3J463J723l31j396r19N04P08K74J30n94J0k07
2489b64j15J35P08R34r42j441k34P05J919J82j581j618kK145R00l54j992p37J254
2508c98J291K28q51p09J47L47J9Q8K79J96n31q67l61J168J106L3j469j184M99
2527i69J855Q92j177j671l69J250J647k31j218j232N47P12N44m98m8l01M46l29
2545a50n22O11J335n39j257n88M07J695O18j349j707M8J509J086J7j752n28O86
2563c80J331L3r12o68J38Q86n14N5J96K92j8q39l31K35J382L24j230j287L54J386
$$ plain form
2583 433 1543 1008 -980 -1465 -296 913 1234 -248 -1115 -678 577 469 153 -121 -146 171 120 -513 -163
2602 -163 297 783 -273 -1038 -849 619 1410 660 -1105 -1283 210 1570 1017 -658 -1487 -601 595 602
2620 602 78 -349 -342 130 551 7 -152 375 328 -278 -919 -422 336 1219 254 -1123 -1257 -264 1387 902
2640 902 -757 -1235 -563 742 1056 158 -860 -469 337 350 281 -512 -380 480 176 -529 -513 139 761 78
2660 78 -693 -877 283 1008 637 -850 -1249 -120 975 1025 -184 -1068 -678 376 567 195 -703 -545 99
2679 99 386 236 -392 153 438 394 -680 -594 248 942 757 -831 -1036 -10 744 1006 -101 -1027 -365 708
2699 708 808 -96 -782 -635 282 591 -62 -415 -322 293 378 -212 -605 169 933 569 -833 -799 -389 876
2719 876 920 -249 -894 -450 838 1098 241 -893 -832 331 985 33 -711 -486 188 794 -157 -359 -73
$$ packed form
2583D33J110n35j988m85J169J209L21j482q67M37J255j08l16k74k5L17n1o33L50
2602a63M60M86j056p65J89J468P91p50j765j78J493J360n53j675q29Q86J196P
2620F02n24m27PM72M21n44j59N27m7o06o41M97P58Q83r65j377j34R93J651m85
2640I02j659m78O72J305L14q98j018L91Q06J3o9p93J32Q60l04p05J6O52O22o83
2660G8p71j84J160P25l71j487l99J129J095N0j209q84L90J054J91l72q98J58O44
2679I9K87j50o28N45K85m4j074Q6Q42O94j85j588k05J026P54K62j107r26O62J073
2699G08J00r04o86J47R17L09o53l53R3O15Q5n90l93P74P64l64j402L4M10J265
2719H76M4j169o45M44J288K60q57j134O1J163O54r52p44K25O74O06r51k02K86
$$ plain form
2738 -73 700 551 -315 -779 -82 691 479 -288 -1147 -415 618 903 22 -627 -495 673 967 132 -513 -313
2758 -313 421 507 566 -588 -558 584 345 46 -452 -462 507 473 -304 -873 -546 586 575 -290 -715 -557 486
2779 486 565 -182 -523 -816 590 670 262 -650 -751 414 541 -49 -756 -475 220 530 -134 -768 -520 465
2799 465 976 159 -827 -792 367 871 91 -621 -290 320 580 237 -611 -435 810 682 -47 -502 -505 152
2819 152 481 226 -627 -697 382 708 356 -649 -722 140 834 192 -354 -495 36 690 68 -354 -463 351
2839 351 813 119 -765 -564 313 557 233 -445 -846 277 780 176 -362 -736 -8 637 202 -412 -308 230
2859 230 563 317 -451 -461 116 532 33 -356 -446 235 397 478 -782 -684 496 843 186 -556 -690 146 888
2880 888 434 -470 -805 35 449 379 -394 -384 224 153 277 -600 -376 259 376 406 -721 -474 346 865 195
$$ packed form
2738g3P73j49q66m64O97P73k12p67q59P32J033K85q81o49J32J168K94q35o45K00
2758c13P34Q6N9j154L0J142k39k99m98j0R69l4p77n69L27J132j1q65m25J58J043
2779D86P9p47l41k93J406Q0m08r12j01J165J27n90p07K81O95L10o64o34K48R85
2799D65N11q17r86L5J159N04p80p12L31O10K60l43q48J76J245j28p29m55lO57
2819A52L29k55q53p0J079L26l52j005p3Q62O94o42n46j41N31O54o22m22j09Q14
2839C51M62o94q84K01Q77K44l24o78m01J123N03o04n38l74P28O45m35o14J04N38
2859B30L33k46p68j0N77M16m99l89r0O81J62Q1j260R8J180L47o57p42j34Q36P42
2880H88m54r04l35Q40M14p0p73J0O08p1J24q77K24O35J17L0j127K47Q20N19o70
$$ plain form
2901 195 -350 -794 168 650 723 -250 -632 -450 516 261 -238 -578 -198 -80 278 -67 -176 -3 422 173
2921 173 -652 150 208 698 -13 -673 -593 18 749 453 -641 -751 -48 823 422 -180 -762 -52 324 479
2941 479 -41 -589 -182 23 -85 -230 -208 95 428 52 -406 -425 211 932 411 -455 -859 -75 572 614 -193
2962 -193 -1146 -310 516 577 -87 -271 -262 33 250 7 -394 140 99 -75 -381 -577 198 504 -60 -511 -969
2983 -969 -192 755 410 -479 -603 -122 538 925 80 -884 -409 121 220 282 -287 -147 418 166 221 -64 473
3004 473 358 481 -307 -274 294 464 347 -413 -1151 -168 337 407 -145 -1024 -687 294 727 643 -594 -453 -28
3025 -28 0 460 -194 -74 235 264 -411 -10 408 678 310 -761 -375 -16 748 496 -281 -688 -415 546 937
3046 937 206 -374 -467 -154 665 109 92 -224 -130 82 154 -260 154 399 128 -475 -432 178 499 171 -340 -899
$$ packed form
2901A95n45m44R62M82P3r73l82J82R66k55m99l40L80J18L58l45j09J73M25k49
2921A73q25Q02N8M90p11o60Q0O11P31k96j094j10P03Q71m01o02n82P10L76J55
2941D79n20n48M07K05j08j45K2L03L33l76m58j9O36P21n21q66m04P84O47M2q07
2962a93r53Q36Q26O1o64j84RK95K17k43m01N34m1j74l06j96P75L06n64m51m58
2983i69P77R47l45q89j24M81O60L87q45r64M75N30R9O2n69J40N65k52N5k85N37
3004D73j15J23p88L3N68J70j17p60p38R83N05P0n52q79L37R81M33q4j237J41M25
3025b8K8M60o54J20L09K9o75M01M18K70l68j071L86L59P64k52p77m07K73R61L91
3046I37p31n80r3L13Q19n56j7l16R4K12P2m14M14K45k71o03M3O10L21l28n11n59
$$ plain form
3068 -899 -149 627 699 132 -623 -398 -12 417 430 -8 -458 -352 -50 9 227 -83 19 -192 -460 26 199
3089 199 584 137 -398 -602 -244 585 753 -9 -660 -422 -44 824 172 -326 -924 0 393 482 -91 -170 -158
3110 -158 91 60 63 359 47 -108 -189 -396 296 514 575 -268 -856 -277 430 681 229 -601 -826 -9 265 312
3132 312 -12 -176 -373 193 244 75 -1 84 -225 -200 86 174 464 221 -725 -562 -75 519 538 39 -978 -439
3154 -439 250 741 384 -293 -494 -264 239 302 341 -55 -360 -206 -181 -80 169 32 8 -668 -316 91 553
3175 553 335 13 -766 -264 449 580 127 -405 -843 -318 834 637 213 -494 -406 3 404 222 142 -196
3195 -196 -27 -247 -85 111 327 108 -345 -730 171 471 633 131 -479 -655 245 750 325 -105 -381 -315
3215 -315 211 518 236 -93 -360 -163 -33 333 378 333 25 -277 -245 46 802 584 -105 -729 -625 167 782
$$ packed form
3068h99P50P76P2n67p55K25L86M29J3m38m50J06L02N9K18l10J02k11k68M86J73
3089A99L85m47n35k04L58Q29J68p62o51K38L78Q68o52m98n98R24L93Q9n73p9J2
3110a58K49l1LK96l12j55q1k07O92K18O1q43n88N79P07K51m52q30k25Q17K74M7
3132C12l24j64j97N66N1j69p6Q5l09K5K86Q8K90k43r46J63M87N94J9m99j017N39
3154d39O89M91l57o77k01K30N03O3L9l96l05J54K5J01K49j37k4o76L52M07M62
3175E53k18l22p79N02P13J31m53n32m38N25J152j97m24p07Q8M09M01j82q0l38
3195a96J69k20J62J96K16k19m53l85R01L00J62n02o10j76R00N05m25m30k76O6
3215c15N26L07k82l29k67J97J30L66M5m5l08l02L2K91P56k18o89o24J04P92O15
$$ plain form
3236 782 440 -158 -621 -363 825 748 173 -233 -441 -258 220 283 385 18 -229 -208 -129 230 248 341 -295 -602
3258 -602 -177 495 756 215 -722 -338 -97 693 391 -362 -336 -551 203 313 291 -160 -498 -326 -54 174 295
3279 295 68 -82 -222 -479 -80 305 270 200 -525 -139 377 497 550 -622 -595 -219 155 633 80 -130 -434
3300 -434 -304 437 271 145 -246 -500 -353 -294 285 154 -75 -259 -422 -240 459 479 79 -335 -469 -33 324
3321 324 564 41 -508 -562 -85 537 204 -30 -397 -390 -197 83 154 164 -156 -561 -305 37 301 208 172 -520
3343 -520 -386 -197 467 439 85 -712 -374 13 329 138 106 -495 -552 35 242 368 -152 -133 -298 36 275
3364 275 540 -117 -455 -541 1 23 371 74 -343 -565 175 325 243 460 -235 -480 -141 61 515 23 -104
3385 -104 -57 -169 -117 103 461 269 -520 -255 94 125 93 -225 -404 -382 94 247 172 124 -295 -515 147 530
$$ packed form
3236G82l42n98m63K58J188p7n75m06k08J83M78O3J02l67k47K1P9L59J8R3o36l07
3258f02M25O72K61n41r37L84K41P90l02p53K6k15P54J10k2m51l38J72K72K28J21
3279B95k27j50j40k57L99L85l5p0p25L86N16J20N3j172K7L76L74M78n53k10l04
3300d34J30P41j66j26l91k54J47N9N79j31k29j84j63J82O99K0m00m14j34M36L57
3321C24K40n23n49n4M77O22l33k34l67PJ93K80P1J0l20m05K56L42K64r3l6o92
3343e20J34J89O64k8l54p97L38L87L16j91l2o01n7N87K07J26n20J9j65L34K39
3364B75K65o57l38q6N42K2L48k97m17k22P40J50q2K17o95k45L39K02M54m92j27
3385a04M7j12N2K20L58j92p89K65L49L1l2l18j79K2M76J53p5m8m19k20O62L83
$$ plain form
3407 530 186 -29 -456 -391 -201 345 25 191 -469 -190 -219 502 354 549 -94 -503 81 347 432 384 -499
3428 -499 -503 178 352 743 54 -268 -471 -176 406 610 462 -305 -554 -53 263 555 109 37 -487 -351 285
3449 285 276 266 -78 -686 -18 6 589 320 120 -394 -234 -15 213 537 86 140 -229 260 674 174 -96 -158
3471 -158 -296 86 7 115 377 -162 -422 -197 206 243 187 -326 -519 -461 151 624 -20 -207 -382 25 108 84
3493 84 308 -184 -241 -252 -84 222 356 -233 -246 -249 -129 291 182 164 -343 -326 -246 115 433 173 -159 -126 -155 206
3517 206 476 -30 -492 -504 -136 474 259 137 -113 -427 -327 68 266 300 -131 -283 123 -15 408 306 -73
3538 -73 -243 -173 103 389 41 58 -346 -245 -56 282 188 -280 -221 -52 80 508 165 -38 -494 -371 -216 48
3560 48 165 251 6 -217 120 207 338 23 -14 -333 65 273 292 -161 -129 -130 -407 175 178 398 144 -178 -197 214
$$ packed form
3407E30l44k15m27O5J90N46l20J66o60K79k9P21j48J95o43m09N84K66Q5m8q83
3428d99mO81J74L91o89l22k03K95N82K04j48p67k49N01L16K92m46p2n24J36O36
3449B85rj0l44o08O68K4N83k69k00n14J60K19K28L24m51N4l69M89M14n00k70o2
3471a58j38L82p9J08K62n39k60K25M03L7n6n13j93N8O12M73o44j87j75M07Q3k4
3493H4K24m92n7j1J68L06J34n89j3lJ20M20j09j8n07J7Q0L61L18k60l32L3k9L61
3517B06K70n06m62j2L68O10k15j22k50l14J00L95J98L4m31j52M06j38M23j02l79
3538g3j70P0K76K86l48J7m04J01J89L38r4m68N9J69J32M28l43k03m56J23J55K64
3560D8J17Q6k45k23L37Q7J31l15l7l19L98K08J9m53L2jk77N82LK20k54l22j9M11
$$ plain form
3584 214 348 190 -244 -278 -243 419 61 156 -125 -237 -374 256 472 -23 -249 -347 -232 268 427 -13 -118
3605 -118 -213 -47 42 279 302 -66 -415 -248 -337 152 -53 78 -147 -256 -93 199 322 82 2 -83 -395 -15
3627 -15 205 247 41 33 -23 178 140 140 85 -162 64 -141 -48 195 -196 -43 -327 -23 375 381 -172 -274 -66 96
3651 96 245 178 1 -192 -139 -89 57 135 81 -231 -81 -121 196 436 32 -19 -214 110 -165 354 79 -188 -109
3674 -109 -114 5 313 301 -69 -37 127 131 321 252 91 -498 -104 -205 357 313 -20 -58 -52 167 177 355 200 -83
3698 -83 -178 230 517 113 -54 80 -169 -145 72 202 -187 -87 0 158 63 391 -179 97 -181 -131 192 141
3720 141 162 212 -4 -2 323 -130 279 47 -190 95 232 247 239 71 -142 -59 213 -89 -16 -170 -63 56 63 5
3744 5 212 -316 68 -422 -211 -47 -35 111 -119 -8 -124 -297 366 -124 -35 -134 274 -227 -96 -257 -309 -310 -26
$$ packed form
3584B14J34j58m34l4L5O62l58R5k81j12j37O30K16m95k26r8J15N00J59m40j05
3605a18r5J66Q9K37K3l68l49J67q9M89k05J31k25j09J63K92J23k40q0q5l12L80
3627a5K20M2k06qn6K01l8%n5k47K26k05R3K43l91J53k84L04L98On53j02K08J62
3651I6J49o7j77j93N3N0J46P8n4l12J50m0L17K40m04n1j95L24k75N19k75k67P9
3674a09nJ19L08j2l70L2J64MJ90o9j61n89L94j01N62m4l33l8OK19J0J78j55k83
3698h3r5M08K87m04j67J34k49K4K17J30l89J00Q7J58r5L28n70K76k78N0L23n1
3720A41K1N0k16KL25m53M09k32k37K85J37J5qj68k13Q3K72l02P3j54J07J19Pn8
3744EK07n28L84m90K11J64J2J46k30J11j16j73O63m90Q9r9M08n01J31j61n2jK84
$$ plain form
3767 -26 167 85 -115 117 -54 -110 148 8 12 -90 -395 68 107 177 -153 -43 2 -231 213 139 363 -166 -132
3790 -132 -77 283 70 139 20 -102 -224 -212 111 -7 163 -67 -58 19 86 339 -27 -78 -16 -163 -74 292 -242
3813 -242 -165 100 227 132 293 -54 80 -100 -179 -1 242 301 -22 -115 -171 322 -92 -51 -164 -218 -113 160 175
3836 175 253 139 -108 62 54 112 126 91 -4 -434 272 22 -111 -45 -130 233 -60 112 7 52 -290 -161 117
3859 117 53 -172 -12 46 65 -121 -162 200 -27 87 -283 -132 -214 -19 108 66 -182 202 -16 239 115 -111
3881 -111 45 -70 305 59 -169 -244 -76 58 -38 -293 310 -68 20 -76 -141 104 218 -142 -237 -133 -49 154
3903 154 -192 167 -185 79 -286 105 98 -68 518 -43 111 -257 41 527 52 27 19 -118 -76 -63 172 -51
3925 -51 -155 233 -374 231 236 102 -47 -24 29 -14 187 -35 -128 97 274 -341 -16 135 -293 -88 70 -417
$$ packed form
3767b6J93q2k00K32j71n6K58j40Mj02l05M63L9P0l30J10M5k33M44p4K24n29L4
3790a32N5L60k13O9j19j22j22J2L23j18J70k30RP7O7K53l66n1O2j47Q9L66n34
3813b42P7K65J27r5J61l47J34j80p9J78K43N9l23r3n6M93m14M1j13n4J05K73J5
3836A75P8j14k47J70qN8J4l5r5m30P06k50j33O6q5L63k93J72j05M5l42J29K78
3859A17o4k25J60N8J9j86m1L62k27J14l70J51q2J95J27m2k48L84k18K55j24k26
3881a11J56j15L75k46k28p5J68J34r6k55O03l78Q8r6o5K45J14l60r5J04Q4K03
3903A54l46L59l52K64l65L91pj66N86n61J54l68K98M86m75k5qj37M2J3K35k23
3925e1j04L88o07O05Nj34j49K3N3m3K01k22r3K25J77o15L25J51m28K05J58m87
$$ plain form
3947 -417 88 -78 91 -209 -219 27 -80 136 -280 -171 -33 -102 -190 -31 159 134 -37 -177 -229 -176 178 -46
3969 -46 324 -96 -65 65 229 96 -120 97 66 233 280 -82 -106 -311 287 34 -3 -35 268 181 -56 103 -138
3992 -138 74 -175 -401 -149 232 -7 226 -78 -220 -121 168 116 -335 142 -206 45 235 8 71 -90 -58
4013 -58 -60 -120 368 294 7 69 -204 154 120 -239 3 -57 -59 81 110 6 131 -97 -214 -140 96 512 -48 31
4037 31 15 178 41 297 147 -141 -1 -144 208 326 84 61 147 -65 1 -29 -21 90 -269 -321 26 66 30 -94
4061 -94 -194 -9 90 -85 63 -377 202 -242 -58 284 -135 331 -97 -349 305 153 238 -233 -48 -79 -51 310
4083 310 102 194 -141 -168 225 -12 177 -181 269 -94 -49 152 126 76 51 114 -304 37 245 -12 -22 37 -60
4106 -60 60 278 -9 -7 -122 -256 -158 -239 102 97 161 -125 -146 89 32 -98 -238 -99 -39 210 147 -66 110 163
$$ packed form
3947d17N05j66J69l00j0K46j07K16m16J09J38o9q8J59J90k5j71j40n2N3L54k24
3969d6L70m20L1J30J64j33k16K17l1J67M7l62k4k05N98k53l7l2L03q7k37J59k41
3992a38K12k49k26K52L81k39K33l04j42R9K89n2m51M77l48K51J90k27O3j61L2
4013e8ko0M88p4k87O2k73L58l4l59K42o0kJ40K9j04J25k28j17P4K36M16n60P9
4037C1j6J63j37K56j50k88J40j43L52J18k42k3Q6k12O6l0QJ11l59n2L47M0l6j24
4061i4j00J85R9j75J48m40N79m44J84L42m19M66m28k52O54j52Q5m71J85l1K8L61
4083C10k08R2l35k7L93k37J89l58M50l63M5K01k6n0k5O3m18L41K08k57j0N9r7
4106f0J20K18k87Kj15j34R8q1L41nO4k86k1K35n7j30j40J39O0K49o3k13J76N3
$$ plain form
4130 163 -214 41 58 19 45 31 -1 6 76 137 -42 109 -125 -18 287 73 29 -50 6 181 -44 9 -23 14 -36
4155 -36 227 136 184 51 -147 175 241 278 111 60 -85 -72 -198 -70 65 -100 -131 42 -20 -391 185 -67 -77
4178 -77 -321 33 120 -140 -94 -359 -88 -233 98 132 125 -212 130 -39 -126 -158 105 -121 -171 -189 25 -2 -21 104
4202 104 -62 -28 32 318 47 351 -253 -293 -118 99 8 77 -240 16 -14 292 -167 -257 -354 -42 -106 125 191
4225 191 -104 -253 -61 -211 -40 161 -239 55 -368 27 81 77 81 147 -313 -113 -31 165 130 241 -127 256 73
4248 73 -99 -181 -236 40 -54 209 316 313 -138 -222 -224 120 -77 62 -26 -32 -280 132 212 29 -384 116 -451 -169
4272 -169 35 117 122 127 -72 -176 82 194 241 -219 -214 81 -42 -162 253 -136 3 50 62 169 8 39 43 -120
4296 -120 46 -35 -56 -65 -58 125 172 475 28 131 -168 -46 320 80 -22 306 -144 -111 268 144 419 -107 -336
$$ packed form
4130A63l77K55J7l9K6j4l2PP0O1j79J51k34J07L05k14m4p9N6J75k25N3l2L7n0
4155c6K63r1M8j33j98L22O6L7j67n1j45J3j26J28J35j65l1J73o2l71N76k52j0
4178g7k44L54Q7k60M6k65K71j45L31L4pl37L42j69q7l2K63k26n0j8K14k7j9J25
4202A04j66L4O0K86k71L04o04m0J75K17r1O9l17K56l0L06m59r0r7L12o4K31O6
4225A91k95j49J92j50J71K01m00K94m23L95N4mMO6m60K00Q2J96l5J11l68L83j83
4248G3j72q2n5K76r4K63J07lm51q4kL44j97J39q8ok48M12Q0j83m13N00n67K82
4272a69K04Q2NNj99j04K58J12M7m60NK95j23j20M15l89J39M7J2J07j61L1Mj63
4296a20J66q1k1rPJ83M7L03m47J03k99J22L66k40j02L28m50L3L79j24K75n26k29
$$ plain form
4319 -336 -502 -176 202 214 -105 -293 -6 -20 164 267 175 -91 -81 84 78 -87 -213 -105 -30 -34 181 224 -254
4342 -254 -237 -67 -233 174 34 -173 17 -469 -91 201 187 -204 -41 -331 -248 -111 -194 133 -30 -75 6 -174
4364 -174 120 260 -119 -393 -180 73 237 291 102 -47 -96 -80 -84 53 113 -72 -24 -159 171 448 174 -182
4386 -182 -238 216 388 -172 -106 -268 -41 -131 -10 177 -49 74 -58 -51 150 114 214 174 5 -76 -113 -136 24
4409 24 -192 -209 -299 167 -110 181 -156 82 -171 -73 278 -58 -181 -19 -90 -51 361 343 -162 -53 -40 -85 171
4432 171 137 -173 -514 -101 68 84 -2 -23 -185 -436 -402 109 -8 195 29 -48 106 5 95 -13 168 88 410
4455 410 239 22 -51 -113 36 27 -87 -121 202 -211 -39 -191 -83 78 123 -27 17 -141 116 -18 -128 30
4477 30 -105 -2 -61 -197 354 84 120 87 171 -105 -139 281 60 -113 170 35 133 50 -255 36 -90 22 29
$$ packed form
4319c36j66L26L78J2l19j88K87j4J84J03r2k66J0J65oj65j26J08P5mK15M3m78
4342b54J7J70j66M07j40k07J90m86L78K92j4l91J63k90Q3J37q3L27j63m5Q1j80
4364a74K94J40l79k74K13K53J64N4j89j49m9J6mJ37O0j85M8j35L30K77k74l56
4386a82n6M54J72n60O6j62K27r0J21J87k26J23j32PK01l6J00m0j69q1l7k3J60
4409B4k16j7r0M66k77K91l37K38k53R8L51l36j23J62p1L9M12j8n05J09J3m5K56
4432A71l4l10l41M13J69J6q6k1j62k51L4N11j17K03j66p7J54j01R0j08J81q0L22
4455D10j71k17p3o2J49rj14l4L23m13J72j52J08J61M5j50M4j58K57j34j10J58
4477C0j35J03n9j36N51k70L6l3Q4k76l4M20k21j73K83j35R8q3l05K91j26J12P
$$ plain form
4500 29 -196 2 -209 -70 53 -31 128 -215 -386 222 -170 228 326 32 -125 160 -93 266 221 140 -144 -62
4522 -62 -78 138 71 116 28 246 83 124 118 46 -188 -215 -16 101 143 3 102 -476 -187 24 -47 139 -84 -196
4546 -196 43 -123 222 7 -212 37 -83 271 213 95 -240 -113 45 171 145 -170 -135 72 -107 -1 -190
4567 -190 167 280 43 71 148 177 -2 -18 -9 -194 -182 -56 18 181 -405 -24 -80 218 134 -266 -287 -42 -140 132
4591 132 53 81 -318 -262 115 -37 6 124 -48 -201 76 256 59 47 -131 3 19 -53 45 240 -216 205 24
4614 24 173 190 -146 221 -176 -165 -190 -109 273 248 -64 -332 -57 71 338 -22 -48 -160 -139 -413 167 -86 31
4637 31 -30 -18 -268 29 4 33 160 151 -23 112 -100 239 -41 179 46 -5 100 207 -154 -109 185 10 262
4660 262 37 -214 -105 53 8 156 -191 -447 -33 58 -147 127 -102 23 6 21 63 46 254 -249 136 91
$$ packed form
4500B9k25J98k11J39J23q4J59l43j71O08l92L98R8k94j57K85k53L59m5q1k84Q2
4522f2j6K16o7M5q8K18j63M1op2k34k7J99J17M2j40R9n78K89K11p1J86k23j12
4546a96K39j66L45k15k19K49j20L54n8j18l35J27J58J26k6l15L5K07j79J06j89
4567a90L57J13k37K8P7K9j79j6Rj85J2J26P4J63n86L81n6K98q4m00k1K45r8K72
4591A32p9K8l99N6L77j52M3J18j72j53K77J80j97j2j78J34J6p2R8J95m56M21j81
4614B4J49J7l36L67l97J1k5Q1L82k5l12k68K75J28K67l60k6j12K1k74N80k53J17
4637C1o1J2k50K97k5K9J27rj74J35k12L39k80K20j33n1J05J07l61M5K94j75K52
4660B62k25k51J09J58m5J48l47k56M14R1k05K74k29J25j7J5M2j7K08n03L85m5
$$ plain form
4682 91 -111 105 -182 54 -26 340 -103 8 150 -89 -71 -45 32 93 -138 -208 12 332 -41 142 83 -111 -223
4705 -223 -117 -191 116 201 10 89 40 61 -82 -43 -118 -293 269 91 90 67 142 -182 -283 36 -33 191 -34 -38 52
4730 52 43 -163 -79 -69 -53 119 -50 -114 43 74 160 -348 -282 173 114 47 -163 -244 -104 -44 -80 -115 273 37 137
4755 137 -73 337 38 -214 60 -30 -49 -87 103 201 -93 -2 -120 37 121 26 238 117 49 -21 110 -158 -56
4778 -56 85 65 75 -168 193 277 184 -332 -133 -189 -358 111 99 -105 46 124 135 247 -104 163 -11 54 35 39
4802 39 33 -133 -91 243 -92 -58 -155 -92 167 266 100 -53 113 -179 203 52 182 -198 -304 -405 -38 -16 19
4825 19 -184 -92 -64 94 163 130 -12 -115 -166 29 -134 -147 243 95 -44 213 179 -127 156 -26 -29 88 -178
4848 -178 -339 -222 -81 77 -355 -127 -27 135 349 -133 188 26 -7 18 -12 134 -140 -73 263 -165 -13
$$ packed form
4682I1k02K16k87K36q0L66m43J11J42k39J8K6P7O1k31p0K20L20l73J83n9j94j12
4705b23J06p4L07Q5j91P9m9K1j43L9p5j75N62j78jk3P5l24j01L19o9K24k25mR0
4730E2rk06Q4J0J6J72j69o4J57L1Q6n08O6M55n9o7k10q1J40O0l6l5L88k36J00
4755A37k10M10k99k52K74r0j9l8J90R8k94R1j18J57Q4r5K12j21o8p0J31k68J02
4778e6J41k0J0k43L61Q4r3n16J99n6j69M69j2k04J51P8J1J12l51K67j74O5j9M
4802C9oj66M2L34l35L4r7O3K59R9j66j53J66k92L82j51J30l80j06j01L67K2L5
4825A9k03R2K8J58O9l3j42j03n1J95j63j3L90j48j39K57l4l06K83j82lJ17k66
4848a78j61J17J41J58m32K28J00J62K14m82L21j62l3K5l0J46k74O7L36m28J52
$$ plain form
4869 -13 -156 -119 133 -121 52 -125 -83 -135 19 42 126 83 -58 -199 -240 71 4 120 128 -121 -194 -19 117 -73
4893 -73 -28 -169 257 67 126 8 -29 -77 -200 21 -206 172 -126 -166 42 -190 -257 -245 -40 -49 -51 212 118 36 -238
4918 -238 -338 288 -292 -69 -354 -26 297 116 -218 19 119 -8 91 34 -91 335 131 256 -188 -44 -36
4939 -36 281 142 -7 -193 119 -59 -162 90 210 120 -393 174 255 198 1 114 61 -41 66 410 -70 18
4961 18 216 -20 -114 58 36 213 -92 -291 257 28 50 100 -403 -24 39 -168 -103 -151 266 132 -79 -152 175
4984 175 -165 -179 -61 -184 376 60 46 282 1 -257 -234 84 307 -186 -30 -215 -273 162 13 -184 64
5005 64 285 280 2 30 120 -29 186 94 38 -75 227 123 -176 -27 88 199 174 -210 -178 -177 70 28 -15 -7 -138
5030 -138 65 267 52 60 177 103 103 70 53 -39 123 182 160 83 134 3 -34 -300 -158 -16 2 -159 -318 -70 27
$$ packed form
4869a3j43L7K52k54J73j77M2n2J54K3Q4m3j41j41m1L11o7J16Qk49p3J75J36j90
4893g3M5j41M26j90N9j18l7m8j23K21k27L78k98m0K08k32o7J2K05rkK63r4q2k74
4918b38j00O26n80K23k85L28L23j81l34K37J00j27R9n7j25M26k04J25m44J44Q
4939c6L17j39j49j86L12j78j03K52J20r0n13N67Q1n7j97J13n3j02J07L44m80Q8
4961A8J98k36r4J72k2J77l05j99N48k29K2N0n03L79O3k07O5m8M17j34k11p3L27
4984A75l40j4J18j23N60l16j4K36k81k58K3L18K23m93J56j85n8M35j49j97K48
5005F4K21nk78K8R0j49K15r2n6j13L02j04k99J49J15J11k5l84L2JK47m2m3Qj31
5030a38K03K02k15QJ17p4%l3j7r2J62N9k2p7N1j31l7k66J42J42J8j61j59K48R7
$$ plain form
5055 27 65 -39 59 -95 198 47 -99 -272 83 -34 -115 -328 173 20 -91 -75 -225 -89 -13 -123 -169 311
5077 311 5 -173 -66 340 238 -121 -121 69 -102 21 -341 -189 -153 86 -147 -146 222 34 109 -39 103 -64
5099 -64 70 24 -261 118 87 -239 213 43 -41 -499 -171 -5 7 203 31 12 -14 -115 -148 -103 -86 -42 95 -30
5123 -30 195 35 -70 181 -319 316 -142 9 270 -161 32 121 -151 -163 141 -217 -223 196 228 215 -118 -24 151
5146 151 -129 -98 -95 238 148 -228 -338 -273 -98 199 173 -352 -90 128 155 138 -84 -184 1 -2 -52 114 -153 258
5170 258 297 207 166 -33 -315 221 210 -129 -228 -65 172 -180 -27 -248 40 -28 -189 -113 41 -57 -145 -268 -38
5193 -38 -127 -244 -101 -99 333 -68 48 -154 80 264 -232 197 74 40 -45 14 117 200 0 75 -52 100 -43
5216 -43 119 349 79 9 -121 49 -328 -139 268 204 48 -174 36 122 11 5 3 104 -205 -41 101 207 39
$$ packed form
5055B7L8j04R8j54K93j51j46j73L55j17q1k13N01j53j11J6j50J36P6j10m6M80
5077C11l06j78J07M06j02l59%J90j71J23l62J52L6K39k33JL68j88P5j48J42j67
5099f4J34m6k85L79l1l26M52j70q4m58L28J66J2J96j72j9k6j01l3M5J7M4J37j25
5123c0K25j60j05K51n00O35m58J51K61m31J93Q9k72j2L04l58oM19L2j3l33R4J75
5146A51k80L1LL33r0l76j10O5J75K97k6n25K62K18K7j7k22j00J85ln0J66k67M11
5170B58L9r0m1j99k82N36j1l39r9J63K37l52J53k21K88o8j61P6J54r8q8j23K30
5193c8q9j17J43KM32m01J16k02K34J84m96M29j23l4q5N9J03Q3k00P5j27J52j43
5216d3J62K30k70p0j30J70l77J89M07o4j56k22K10Q6j11okJ01l09J64J42J06j68
$$ plain form
5239 39 -16 121 6 -13 -539 -131 3 -155 -123 -176 -20 238 125 97 54 24 104 -112 -17 10 -342 213 -66 -85
5263 -85 4 216 -46 -49 310 49 -278 -110 -228 241 54 -37 256 -151 113 81 116 -145 260 36 157 233 -17
5286 -17 131 -389 33 -57 -61 143 -65 -2 2 -46 227 -266 207 113 -13 -40 -100 -110 -27 105 -98 5 -84 214 192
$$ packed form
5239C9n5J37j15j9n26M08J34j58L2n3J56K58j13k8m3l0Q0k16R5K7l52N55k79j9
5263h5Q9K12k62lL59k61l27J68j18M69j87r1K93m07K64l2L5k61M05k24J21P6k50
5286a7J48n20M22r0mK04k08O3Mm8K73m93M73r4j26k7o0j0Q3J32k03J03q9K98k2
$$ [...]
8191A91
##END NTUPLES=NMR FID
##END=
