##TITLE=1H_Forskolin(XAQA)-aq
 D2O, 8 sc, 
 11.6.2020
##JCAMPDX= 6.0         $$ Bruker NMR JCAMP-DX V2.0
##DATA TYPE= NMR FID
##DATA CLASS= NTUPLES
##ORIGIN= UXNMR, Bruker Analytische Messtechnik GmbH
##OWNER= root
$$ XWIN-NMR		Version 3.5
$$ Thu Jun 11 11:01:47 2020 Russian Standard Time (UT+4h)  she@DPX200
##.OBSERVE FREQUENCY= 200.1315
##.OBSERVE NUCLEUS= ^1H
##.DELAY= (6, 6)
##.ACQUISITION MODE= SIMULTANEOUS
##.ACQUISITION SCHEME= undefined
##.AVERAGES= 8
##.DIGITISER RES= 18
##SPECTROMETER/DATA SYSTEM= spect
##.PULSE SEQUENCE= zg30
##.SOLVENT NAME= D2O
##.SHIFT REFERENCE= (INTERNAL, D2O, 0, 15.7039)
##AUDIT TRAIL= $$ (NUMBER, WHEN, WHO, WHERE, WHAT)
$$ ##TITLE= Audit trail, XWIN-NMR		Version 3.5
$$ ##JCAMPDX= 5.01
$$ ##ORIGIN= Bruker BioSpin GmbH
$$ ##OWNER= she
$$ F:/spectra/data/she/nmr/H-F/1/audita.txt
$$ ##AUDIT TRAIL=  $$ (NUMBER, WHEN, WHO, WHERE, WHAT)
(   1,<2020-06-11 10:57:02.28 +0400>,<she>,<DPX200>,
      <created by zg, POWCHK disabled, PULCHK disabled
       configuration hash MD5:
       00 E9 B6 7A A2 85 ED C7 34 08 36 98 17 FE 4E 26
       data hash MD5: 16K
       FC 20 6F 1C 2A F1 67 E7 26 BC 0D 29 1C C3 0F 1C>)
$$ ##END=
$$ 
$$ hash MD5
$$ E4 DE 12 7E B4 58 CB 48 C7 71 77 C6 89 F5 34 B9
##$RELAX= 
##$RELAX= 
##$RELAX= 
##$RELAX= 
##$RELAX= 
##$RELAX= 
$$ Bruker specific parameters
$$ --------------------------
##$DU= <F:/spectra>
##$EXPNO= 1
##$NAME= <H-F>
##$PROCNO= 1
##$TYPE= <nmr>
##$USER= <she>
##$AMP= (0..31)
100 100 100 100 100 100 100 100 100 100 100 100 100 100 100 100 100 100 
100 100 100 100 100 100 100 100 100 100 100 100 100 100 
##$AQSEQ= 0
##$AQ_mod= 1
##$AUNM= <au_zg>
##$AUTOPOS= <>
##$BF1= 200.13
##$BF2= 200.13
##$BF3= 200.13
##$BF4= 200.13
##$BF5= 200.13
##$BF6= 200.13
##$BF7= 200.13
##$BF8= 200.13
##$BYTORDA= 1
##$CFDGTYP= 0
##$CFRGTYP= 5
##$CHEMSTR= <none>
##$CNST= (0..31)
1 1 145 1 1 1 1 1 1 1 1 1 1 1 1 1 1 1 1 1 1 1 1 1 1 1 1 1 1 1 1 1 
##$CPDPRG= <>
##$CPDPRG1= <>
##$CPDPRG2= <>
##$CPDPRG3= <>
##$CPDPRG4= <mlev>
##$CPDPRG5= <mlev>
##$CPDPRG6= <mlev>
##$CPDPRG7= <mlev>
##$CPDPRG8= <mlev>
##$CPDPRGB= <>
##$CPDPRGT= <>
##$D= (0..31)
0 1.2 0 0 0 0 0 0 0 0.06 0 0.03 0 0 0 0 0.0002 0 0 0 0 0 0 0 0 0 0 0 0 
0 0 0 
##$DATE= 1591858621
##$DBL= (0..7)
120 120 120 120 120 120 120 120 
##$DBP= (0..7)
150 150 150 150 150 150 150 150 
##$DBP07= 0
##$DBPNAM0= <>
##$DBPNAM1= <>
##$DBPNAM2= <>
##$DBPNAM3= <>
##$DBPNAM4= <>
##$DBPNAM5= <>
##$DBPNAM6= <>
##$DBPNAM7= <>
##$DBPOAL= (0..7)
0.5 0.5 0.5 0.5 0.5 0.5 0.5 0.5 
##$DBPOFFS= (0..7)
0 0 0 0 0 0 0 0 
##$DE= 6
##$DECBNUC= <off>
##$DECIM= 24
##$DECNUC= <off>
##$DECSTAT= 4
##$DIGMOD= 1
##$DIGTYP= 9
##$DL= (0..7)
0 120 120 120 120 120 120 120 
##$DP= (0..7)
150 150 150 150 150 150 150 150 
##$DP07= 0
##$DPNAME0= <>
##$DPNAME1= <>
##$DPNAME2= <>
##$DPNAME3= <>
##$DPNAME4= <>
##$DPNAME5= <>
##$DPNAME6= <>
##$DPNAME7= <>
##$DPOAL= (0..7)
0.5 0.5 0.5 0.5 0.5 0.5 0.5 0.5 
##$DPOFFS= (0..7)
0 0 0 0 0 0 0 0 
##$DQDMODE= 0
##$DR= 18
##$DS= 0
##$DSLIST= <SSSSSSSSSSSSSSS>
$$ [...]
##$SUBNAM2= <"">
##$SUBNAM3= <"">
##$SUBNAM4= <"">
##$SUBNAM5= <"">
##$SUBNAM6= <"">
##$SUBNAM7= <"">
##$SUBNAM8= <"">
##$SUBNAM9= <"">
##$SW= 24.9337058887773
##$SWIBOX= (0..15)
0 0 2 0 0 0 0 0 0 0 0 0 0 0 0 0 
##$SW_h= 4990.01996007984
##$TD= 16384
##$TD0= 1
##$TE= 0
##$TE2= 300
##$TE3= 300
##$TEG= 300
##$TL= (0..7)
0 120 120 120 120 120 120 120 
##$TP= (0..7)
150 150 150 150 150 150 150 150 
##$TP07= 0
##$TPNAME0= <>
##$TPNAME1= <>
##$TPNAME2= <>
##$TPNAME3= <>
##$TPNAME4= <>
##$TPNAME5= <>
##$TPNAME6= <>
##$TPNAME7= <>
##$TPOAL= (0..7)
0.5 0.5 0.5 0.5 0.5 0.5 0.5 0.5 
##$TPOFFS= (0..7)
0 0 0 0 0 0 0 0 
##$TUNHIN= 0
##$TUNHOUT= 0
##$TUNXOUT= 0
##$USERA1= <user>
##$USERA2= <user>
##$USERA3= <user>
##$USERA4= <user>
##$USERA5= <user>
##$V9= 5
##$VALIST= <valist>
##$VCLIST= <CCCCCCCCCCCCCCC>
##$VD= 0
##$VDLIST= <DDDDDDDDDDDDDDD>
##$VPLIST= <PPPPPPPPPPPPPPP>
##$VTLIST= <TTTTTTTTTTTTTTT>
##$WBST= 1024
##$WBSW= 4
##$XGAIN= (0..3)
0 0 0 0 
##$XL= 0
##$YL= 0
##$YMAX_a= 113174
##$YMIN_a= -121824
##$ZGOPTNS= <>
##$ZL1= 120
##$ZL2= 120
##$ZL3= 120
##$ZL4= 120
##$ABSF1= 10
##$ABSF2= 0
##$ABSG= 5
##$ABSL= 3
##$ALPHA= 0
##$AQORDER= 0
##$ASSFAC= 0
##$ASSFACI= 0
##$ASSFACX= 0
##$ASSWID= 0
##$AUNMP= <proc_1d>
##$AZFE= 0.1
##$AZFW= 0.1
##$BCFW= 1
##$BC_mod= 2
##$BYTORDP= 1
##$COROFFS= 0
##$CY= 11.3945322036743
##$DATMOD= 1
##$DC= 2
##$DFILT= <>
##$DTYPP= 0
##$F1P= 16.9975609425685
##$F2P= -3.02152046262296
##$FCOR= 0.5
##$FTSIZE= 0
##$FT_mod= 4
##$GAMMA= 1
##$GB= 0.15
##$INTBC= 1
##$INTSCL= 1
##$ISEN= 128
##$LB= 0.24
##$LEV0= 0
##$LPBIN= 0
##$MAXI= 10000
##$MC2= 0
##$MEAN= 0
##$ME_mod= 0
##$MI= 1.114404
##$NCOEF= 0
##$NC_proc= 0
##$NLEV= 6
##$NOISF1= 3.799351
##$NOISF2= 2.8
##$NSP= 1
##$NTH_PI= 0
##$NZP= 0
##$OFFSET= 15.70392
##$PC= 1
##$PHC0= -9608.372
##$PHC1= -144.1991
##$PH_mod= 1
##$PKNL= yes
##$PPARMOD= 0
##$PSCAL= 0
##$PSIGN= 0
##$REVERSE= no
##$SF= 200.130013532006
##$SI= 16384
##$SIGF1= 3
##$SIGF2= 2
##$SINO= 400
##$SIOLD= 16384
##$SREGLST= <1H.CDCl3>
##$SSB= 0
##$STSI= 0
##$STSR= 0
##$SW_p= 3612.71676300578
##$SYMM= 0
##$S_DEV= 0
##$TDeff= 0
##$TDoff= 0
##$TI= <>
##$TILT= no
##$TM1= 0
##$TM2= 0
##$TOPLEV= 0
##$USERP1= <user>
##$USERP2= <user>
##$USERP3= <user>
##$USERP4= <user>
##$USERP5= <user>
##$WDW= 1
##$XDIM= 8192
##$YMAX_p= 0
##$YMIN_p= 0
$$ End of Bruker specific parameters
$$ ---------------------------------
##NTUPLES= NMR FID
##VAR_NAME=  TIME,          FID/REAL,        FID/IMAG
##SYMBOL=    X,             R,               I
##VAR_TYPE=  INDEPENDENT,   DEPENDENT,       DEPENDENT
##VAR_FORM=  AFFN,          ASDF,            ASDF
##VAR_DIM=   8192,          8192,            8192
##UNITS=     SECONDS,       ARBITRARY UNITS, ARBITRARY UNITS
##FACTOR=    0.0002004,     1,               1
##FIRST=     0,             0,               0
##LAST=      1.6414764,     0,               0
##MIN=       0,             -121824,         0
##MAX=       1.6414764,     113174,          0
$$ Real data points
##PAGE= N=1
##DATA TABLE= (X++(R..R)), XYDATA
$$ plain form
0 0 0 0 0 0 0 0 0 0 0 2 -2 8 -8 8 -8 11 -16 16 -21 25 -27 33 -40 43 -51 59 -67 76 -86 100 -110 124 -140 157
34 157 -174 195 -215 241 -266 295 -327 362 -401 442 -492 544 -605 675 -754 846 -957 1087
52 1087 -1251 1456 -1724 2096 -2644 3536 -5247 9737 -47191 -121824 -65572 1386 80087 111642
66 111642 97754 31822 -43800 -102848 -109340 -67591 8765 78086 112640 91836 29679 -47828
78 -47828 -100959 -107548 -62170 11098 79835 109646 88486 25000 -49222 -100541 -103632 -58417 14478
91 14478 79735 107468 84102 21587 -50990 -98963 -100247 -54162 16997 79842 104716 80157
103 80157 17983 -52193 -97507 -96650 -50337 19365 79549 102008 76337 14865 -53216 -95894
115 -95894 -93239 -46758 21454 79167 99360 72713 12006 -53964 -94222 -89992 -43431 23257
$$ packed form
0@%%%%%%%%%KmJ0j6J6j6J9k7L2l7M6n2O0p3Q3r4J10j26J43j62J86k10K34k64K97
34A57l31L69m10M56n07N61o22O89p63Q43r34J036j149J280j429J600j803K044
52A087k338K707l180L820m740O180q783J4984n6928p4633N6252O6958P8701L1555
66A11642j3888o5932p5622n9048o492M1749P6356O9321L4554k0804o2157p7507
78d7828n3131o589M5378P3268O8737K9811k1160o3486p4222n1319l091M5215P2895
91A4478O5257K7733k3366o2515p2577m7973j284M6085P1159O2845K4874k4559
103H0157o2174p0176m5314Q57M6313O9702O0184K2459k5671o1472o8081m2678
115i5894K655M6481O8212N7713K0193k6647o0707o5970m0258M230M6561O6688
$$ plain form
127 23257 78619 96770 69323 9479 -54487 -92523 -86875 -40362 24802 77996 94256 66129
139 66129 7079 -54918 -90875 -83885 -37559 26167 77229 91827 63167 4995 -55198 -89189
151 -89189 -81095 -34981 27265 76430 89510 60412 3120 -55340 -87540 -78521 -32628 28289
163 28289 75640 87261 57856 1416 -55365 -85942 -75969 -30396 29199 74863 85150 55368
175 55368 -219 -55425 -84411 -73592 -28296 30114 74074 83109 53010 -1746 -55442 -82921
187 -82921 -71314 -26251 30897 73276 81106 50791 -3217 -55433 -81434 -69041 -24327 31603
199 31603 72491 79172 48597 -4617 -55424 -80012 -66897 -22452 32332 71710 77299 46501
211 46501 -5923 -55371 -78627 -64857 -20708 32955 70961 75459 44491 -7209 -55326 -77252
$$ packed form
127B3257N5362J8151k7447n9844o3966l8036N648M6513O5164N3194J6260k8127
139F6129n9050o1997l5957O990M6326O3726N1062J4598k8660n8172o0193l3991
151h9189Q094M6114O2246M9165J3080k9098n7292n8460l2200R019M5893O0917
163B8289M7351J1621k9405n6440n6781l0577R973M5573N9595M5664J0287k9782
175E5368n5587n5206k8986J0819M5296N8410M3960R035l0099n4756n3696k7479
187h2921J1607M5063N7148M2379P830l0315n4008n2216k6001J2393M4714N5930
199C1603M0888O681l0575n3214n0807k4588J3115M4445N4784L9378N589l0798
211D6501n2424m9448k3256J3770M4149N3663L8006M498l0968n1700m8117k1926
$$ plain form
223 -77252 -62850 -18941 33634 70226 73722 42514 -8459 -55285 -75959 -60868 -17280 34236
235 34236 69512 71974 40621 -9644 -55178 -74660 -58972 -15612 34860 68807 70327 38752
247 38752 -10828 -55184 -73424 -57099 -14047 35469 68154 68704 36911 -12014 -55148 -72235
259 -72235 -55277 -12421 36071 67479 67049 35078 -13151 -55136 -71066 -53476 -10867 36656
271 36656 66839 65483 33306 -14348 -55114 -69907 -51691 -9306 37286 66232 63926 31557
283 31557 -15514 -55107 -68701 -49922 -7759 37878 65613 62397 29874 -16585 -55057 -67577
295 -67577 -48247 -6309 38420 65001 60880 28179 -17644 -55055 -66456 -46547 -4846 38970
307 38970 64341 59413 26552 -18660 -54940 -65311 -44892 -3494 39458 63720 57931 24937
$$ packed form
223g7252J4402M3909N2575L6592L496l1208n0973m6826k0674J5091M3588N1516
235C4236L5276K462l1353n0265m5534j9482J5688M3360N0472L3947J520l1575
247C8752m9580m4356j8240J6325M3052M9516L2685N50l1793m8925m3134j7087
259g2235J6958M2856M8492L1408m30l1971m8229m1985j5930J7590M2609M7523
271C6656L0183j356l2177m7654m0766j4793J8216M2385M6592K8946k306l2369
283C1557m7071l9593j3594J8779M2163M5637K7735l216l2523m6459l8472j2520
295f7577J9330M1938M4729K6581m121l2701m5823l7411j1401J9909M1701M3816
307C8970K5371m928l2861m5212l6280j0371K0419M1398M2952K4262n789l2994
$$ plain form
319 24937 -19638 -54876 -64215 -43272 -2135 39904 63073 56499 23351 -20614 -54786 -63090 -41677
332 -41677 -716 40395 62420 55002 21766 -21631 -54693 -61975 -40019 622 40874 61804
344 61804 53558 20174 -22556 -54594 -60855 -38443 1928 41285 61111 52135 18675 -23455 -54455
357 -54455 -59694 -36886 3218 41676 60429 50697 17149 -24328 -54294 -58606 -35318 4433 41987
370 41987 59723 49276 15675 -25176 -54115 -57515 -33789 5688 42353 59037 47877 14215
382 14215 -25996 -53900 -56348 -32301 6860 42616 58348 46480 12822 -26749 -53658 -55220
394 -55220 -30845 7942 42921 57598 45144 11474 -27451 -53365 -54102 -29362 9084 43176
406 43176 56832 43740 10103 -28150 -53101 -52976 -27909 10174 43367 56127 42371 8779
$$ packed form
319B4937m4575l5238r339K0943M1137M2039K3169o574l3148m3965l4172q304K1413
332d1677M0961M1111K2025p418l3236m3397l3062p282K1956M0641M0252K0930
344F1804q246l3384m2730l2038o261K2412M0371L9357J9826q976l3460m2130l1000
357e4455n239K2808M0104L8458J8753r732l3548m1477k9966m312K3288L9751L7554
370D1987J7736j0447l3601m0851k8939l400K3726L9477L6665J6684j1160l3662
382A4215m0211k7904k448K4047L9161L5756J5732j1868l3658l9571k6909j562
394e5220K4375L8787L4979J4677j2454l3670l8925k5914p37K4740L8446L4092
406D3176J3656j3092l3637l8253k4951J25K5067L8083L3193J2760j3756l3592
$$ plain form
418 8779 -28836 -52816 -51839 -26487 11224 43534 55332 41007 7483 -29443 -52482 -50732 -25140
431 -25140 12191 43672 54549 39723 6262 -30010 -52117 -49634 -23768 13133 43803 53770
443 53770 38405 5054 -30586 -51762 -48507 -22438 14069 43888 52989 37097 3812 -31146
455 -31146 -51398 -47369 -21095 15011 43990 52181 35780 2568 -31714 -51020 -46247 -19746 15914
468 15914 44044 51367 34486 1439 -32186 -50607 -45131 -18456 16831 44097 50535 33171 259
481 259 -32662 -50191 -44013 -17135 17705 44095 49707 31869 -882 -33127 -49733 -42878 -15855
494 -15855 18472 44124 48907 30626 -1880 -33513 -49285 -41795 -14661 19210 44038 48065 29459
507 29459 -2937 -33904 -48835 -40735 -13498 19929 44013 47254 28233 -3938 -34193 -48347
$$ packed form
418H779l7615k3980R77K5352L7711L2310J1798j4325l3524l6926k3039J750K5592
431b5140L7331L1481J0877j4826l3461l6272k2107K483K5866L6901L0670R967
443E3770j5365l3351l5640k1176L255K6069L6507K9819R101j5892l3285l4958
455c1146k0252M029K6274L6106K8979Q191j6401l3212l4282j9306M773K6501L5660
468A5914K8130P323j6881l3047l3625j8421N476K6675L5287K7266O438j7364l2912
481B59l2921j7529O178K6878L4840K6390N612j7838l2751l2245j6606O855K7023
494a5855L4327K5652M783j8281l2506l1633j5772P490K7134L3871K4828M027j8606
507B9459l2396l0967j4931Q100K7237L3427K4084L241j9021l2171l0255j4154
$$ plain form
519 -48347 -39635 -12339 20641 43863 46403 27108 -4895 -34517 -47826 -38563 -11216 21317 43763
532 43763 45593 25892 -5866 -34814 -47314 -37478 -10045 22015 43663 44709 24717 -6837 -35082
545 -35082 -46795 -36401 -8908 22635 43517 43820 23535 -7750 -35345 -46235 -35345 -7836
557 -7836 23233 43347 43007 22391 -8653 -35549 -45705 -34263 -6772 23787 43160 42139 21277
570 21277 -9498 -35762 -45149 -33206 -5719 24368 42947 41255 20170 -10360 -35930 -44541 -32162
583 -32162 -4687 24870 42701 40404 19080 -11126 -36032 -43948 -31141 -3738 25340 42483
595 42483 39547 18013 -11888 -36181 -43333 -30091 -2750 25840 42178 38642 16941 -12646 -36241
608 -36241 -42741 -29059 -1782 26278 41940 37775 15886 -13411 -36312 -42143 -28063 -840 26669
$$ packed form
519d8347Q712K7296L2980K3222K540j9295l2003k9622j3309R263K7347L2533K2446
532D3763J830j9701l1758k8948j2500R836K7433L2060K1648J046j9992l1554k8245
545c5082j1713J0394K7493L1543K0882L03k0285l1285k7595j0890J0890K7509
557g836L1069K0114l40k0616l1044k6896j0156J1442K7491L0559J9373j021k0862
570B1277l0775k6264r387J1943K7487L0087J8579j692k1085l0530k5570q611J2379
583c2162K7475K9557J7831k297k1324l0206k4906p916J2807K7403K9078J7143
595D2483k936k1534k9901k4293p152J3242K7341K8590J6338l536k1701k9587k3595
608c6241o500J3682K7277K8060J5662m165k1889k9297k2901n831J4080K7223K7509
$$ plain form
621 26669 41615 36918 14865 -14072 -36355 -41505 -27062 52 27040 41253 36029 13878 -14761
634 -14761 -36397 -40857 -26083 888 27397 40930 35204 12865 -15395 -36375 -40207 -25074 1779
647 1779 27704 40612 34314 11915 -15983 -36337 -39573 -24133 2575 28005 40234 33455 10964
660 10964 -16583 -36273 -38890 -23179 3395 28282 39810 32607 10020 -17138 -36235 -38195 -22172
673 -22172 4206 28559 39434 31699 9111 -17761 -36169 -37544 -21214 4988 28783 39022
685 39022 30820 8164 -18255 -36037 -36860 -20274 5745 29016 38591 29946 7263 -18757 -35938
698 -35938 -36160 -19358 6466 29175 38168 29118 6379 -19211 -35773 -35459 -18424 7136 29361
711 29361 37734 28270 5590 -19639 -35635 -34780 -17584 7798 29474 37267 27455 4811 -20026
$$ packed form
621B6669J4946m697k2053k8937k2283n150J4443K7114K6988J4213n224k2151k8639
634a4761k1636m460J4774K6971K6509J3533n726k2339k8260k0980l832J5133K6853
647A779K5925J2908o298k2399k7898k0354l236J5440K6708K5430J2229o779k2491
660A0964k7547j9690k617J5711K6574K4887J1528p203k2587k7158j9097j960J6023
673b2172K6378K4353J0875p735k2588k6872j8408j375J6330K6202K3795J0239
685C9022q202k2656k6419j7782q23J6586K6019K3271R575q645k2683k6020j7181
698c5938k22J6802K5824K2709Q993r050k2739k5590j6562L14J7035K5560K2225
711B9361Q373r464k2680k5229j5996Q55J7196K5382K1676P793r812k2644k4837
$$ plain form
724 -20026 -35429 -34132 -16742 8416 29548 36791 26674 4047 -20377 -35192 -33425 -15917 8993
737 8993 29652 36298 25862 3302 -20765 -35018 -32748 -15099 9585 29700 35825 25034 2542
750 2542 -21053 -34819 -32069 -14272 10152 29741 35328 24232 1821 -21387 -34517 -31374 -13454
763 -13454 10691 29816 34848 23433 1111 -21704 -34296 -30692 -12682 11192 29824 34347 22674
776 22674 420 -21965 -34016 -30009 -11911 11708 29785 33849 21913 -206 -22227 -33715
788 -33715 -29313 -11138 12194 29771 33309 21142 -898 -22466 -33484 -28629 -10367 12686 29747
801 29747 32789 20369 -1588 -22758 -33193 -27971 -9600 13199 29739 32265 19579 -2270 -23008
814 -23008 -32868 -27243 -8789 13679 29761 31715 18746 -2995 -23257 -32579 -26474 -7966 14207
$$ packed form
724b0026j5403J297J7390K5158K1132P243j0117k2627k4424j4815J767J7508K4910
737H993K0659O646j0436k2560k4067j4253K270J7649K4684K0115O125j0791k2492
750B542k3595j3766K750J7797K4424J9589N587j1096k2411k3208j3130L143J7920
763a3454K4145J9125N032j1415k2322k2815j2592L604J8010K3874J8632M523j1673
776B2674k2254k2385j2051M007J8098K3619J8077M064j1936k2119k2021j1488
788c3715M402J8175K3332J7577L538j2167k2040k1568j1018M855J8262K3053J7061
801B9747L042j2420k1957k1170j0435N222J8371K2799J6540K526j2686k1849k0738
814b3008r860N625J8454K2468J6082J954j2969k1741k0262r322O105J8508K2173
$$ plain form
827 14207 29717 31198 18000 -3610 -23473 -32229 -25789 -7192 14679 29649 30633 17186 -4274
840 -4274 -23669 -31895 -25055 -6465 15135 29577 30057 16416 -4908 -23871 -31567 -24373 -5758
853 -5758 15490 29458 29534 15678 -5483 -24030 -31205 -23690 -5058 15890 29351 28956 14936 -6058
867 -6058 -24180 -30848 -22978 -4402 16243 29218 28379 14195 -6569 -24239 -30493 -22335 -3732
880 -3732 16585 29062 27843 13535 -7129 -24357 -30109 -21640 -3037 16936 28939 27269 12796
893 12796 -7613 -24414 -29708 -20989 -2419 17201 28751 26736 12126 -8114 -24498 -29310 -20313
906 -20313 -1801 17483 28558 26120 11399 -8595 -24554 -28919 -19686 -1202 17773 28389 25576
919 25576 10760 -9018 -24597 -28531 -19037 -594 18026 28180 25023 10071 -9528 -24619 -28110
$$ packed form
827A4207J5510J481j3198k1610j9863q756O440J8597K1871J4970R84j3447k1460
840d274j9395q226O840J8590K1600J4442M80j3641k1324j8963p696P194J8615
853e758K1248J3968P6j3856k1161j8547p175P515J8632K0948J3461l95j4020k0994
867f058j8122o668P870J8576K0645J2975q39j4184k0764j7670o254Q158J8603
880c732K0317J2477j219j4308k0664j7228n752Q469J8603J9973J2003j670j4473
893A2796k0409j6801n294Q719J8570J9620J1550k015j4610k0240j6384m812Q997
906b0313J8512J9284J1075k438j4721j9994j5959m365R233J8484J8975J0616k813
919B5576j4816j9778j5579l934R494J8443J8620J0154l157j4952j9599j5091l491
$$ plain form
932 -28110 -18382 17 18309 27950 24434 9398 -9971 -24663 -27673 -17669 633 18551 27750
945 27750 23855 8716 -10451 -24658 -27251 -16983 1229 18788 27559 23269 8037 -10890 -24654
958 -24654 -26808 -16311 1817 19065 27310 22669 7351 -11316 -24700 -26373 -15653 2386 19244
971 19244 27065 22080 6713 -11713 -24713 -25937 -14961 2955 19465 26770 21501 6044 -12139
984 -12139 -24658 -25474 -14283 3515 19647 26529 20870 5439 -12513 -24593 -25006 -13659 4054
997 4054 19834 26272 20265 4786 -12914 -24518 -24541 -12986 4593 20019 25989 19694 4173 -13238
1011 -13238 -24404 -24058 -12347 5132 20146 25694 19059 3575 -13588 -24349 -23593 -11720 5594
1024 5594 20284 25364 18501 2957 -13935 -24255 -23110 -11062 6052 20330 25029 17909 2351
$$ packed form
932b8110R728J8399J8292R641l516j5036j9369j4692l010J0004J8302J7918R199
945B7750l895j5139j9167j4207k593J0268J8212J7559Q771m290j5232j8927j3764
958b4654k154J0497J8128J7248Q245m641j5318j8667j3384j673J0720J8039J6858
971A9244P821m985j5367j8426j3000j224J0976J7916J6510P305n269j5457j8183
984a2139j2519q16J1191J7798J6132O882n659j5431j7952j2080m13J1347J7713
997D054J5780O438o007j5479j7700j1604k3J1555J7579J5426N970o295j5521j7411
1011a3238j1166L46J1711J7479J5014N548o635j5484j7163j0761P56J1873J7314
1024E594J4690N080o863j5544j6892j0320J145J2048J7114J4278M699p120j5558
$$ plain form
1037 2351 -14216 -24128 -22674 -10496 6518 20448 24736 17353 1821 -14537 -23983 -22149 -9918
1050 -9918 6918 20493 24447 16764 1327 -14743 -23859 -21689 -9348 7366 20546 24069 16213
1063 16213 769 -14959 -23688 -21193 -8705 7781 20575 23706 15624 252 -15215 -23514 -20681
1076 -20681 -8120 8167 20640 23386 15027 -266 -15462 -23291 -20176 -7576 8573 20672 23012
1089 23012 14491 -833 -15665 -23169 -19706 -6997 8950 20649 22606 13906 -1302 -15900 -22958
1102 -22958 -19178 -6390 9324 20649 22247 13298 -1820 -16081 -22741 -18666 -5812 9700 20621
1115 20621 21842 12756 -2297 -16247 -22494 -18155 -5289 10050 20618 21462 12190 -2760 -16416
1128 -16416 -22308 -17670 -4738 10388 20590 21097 11637 -3230 -16533 -22093 -17113 -4187 10706
$$ packed form
1037B351j6567r912J454J2178J7014J3930M288p383j5532j6358r446J834J2231
1050i918J6836J3575L954p683j5437j6070r116K170J2341J6714J3180L523p856
1063A6213j5444j5728q729K495J2488J6486J2794L131q082j5372j5467q299K833
1076b0681J2561J6287J2473K746q359j5293j5196p829L115J2600J6149J2099K340
1089B3012q521j5324j4832p504L463J2709J5947J1699J957q700j5208j4598p058
1102b2958L780J2788J5714J1325J598q949j5118j4261o660M075J2854J5512J0921
1115B0621J221r086j5053j3950o247M339J2866J5339J0568Q44r272j4950j3656
1128a6416n892M638J2932J5126J0202N07r460j4867j3303n560M980J2926J4893
$$ plain form
1141 10706 20522 20668 11075 -3707 -16697 -21817 -16636 -3623 11025 20489 20278 10506 -4142 -16789
1155 -16789 -21598 -16143 -3115 11310 20378 19858 9917 -4550 -16933 -21294 -15610 -2619 11572
1168 11572 20291 19460 9422 -4970 -17024 -21014 -15118 -2138 11851 20201 19053 8900 -5372
1181 -5372 -17089 -20752 -14635 -1631 12075 20110 18616 8354 -5766 -17160 -20500 -14107 -1118
1194 -1118 12344 20018 18214 7862 -6141 -17238 -20185 -13582 -658 12555 19859 17809 7327
1207 7327 -6524 -17264 -19880 -13086 -216 12752 19714 17363 6852 -6851 -17310 -19612 -12634
1220 -12634 215 12912 19562 16952 6384 -7155 -17291 -19303 -12187 577 13104 19408 16569
1233 16569 5928 -7466 -17304 -19008 -11750 989 13223 19259 16193 5500 -7690 -17291 -18697
$$ packed form
1141A0706R816J46r593j4782j2990n120N181J3013J4648R464k11r772j4648j2647
1155a6789m809N455J3028J4425R068n20r941j4467j2383m361N684J2991J4191
1168A1572Q719q31j0038j4392j2054l990N896J2980J3989Q350j148j0153j4272
1181e372j1717l663O117J3004J3706Q035j494j0262j4120j1394l340O393J2989
1194a118J3462P674j804j0352j4003j1097k947O603J2924J3213P304k050j0482
1207G327j3851j0740k616O794J2870J2968O962k351j0511j3703j0459k302O978
1220a2634J2849J2697O650k610j0568j3539j0136k012P116J2764J2527O304k839
1233A6569j0641j3394r838j704P258J2739J2234O036l066j0693j3190r601j406
$$ plain form
1246 -18697 -11302 1366 13372 19072 15779 5068 -7987 -17238 -18423 -10894 1737 13478 18910
1259 18910 15378 4624 -8256 -17226 -18094 -10427 2130 13614 18724 14932 4233 -8473 -17197
1272 -17197 -17797 -9958 2452 13709 18533 14565 3769 -8772 -17170 -17475 -9543 2846 13802 18310
1286 18310 14179 3352 -8978 -17074 -17161 -9119 3175 13904 18119 13803 2989 -9189 -17004 -16852
1300 -16852 -8711 3443 13994 17933 13368 2563 -9414 -16998 -16514 -8230 3813 14085 17738
1313 17738 12975 2171 -9627 -16895 -16181 -7823 4149 14140 17501 12567 1728 -9855 -16801 -15862
1327 -15862 -7406 4480 14215 17279 12155 1314 -10041 -16748 -15516 -6986 4797 14296 17058 11759
1341 11759 965 -10266 -16659 -15167 -6545 5115 14365 16816 11342 563 -10410 -16550 -14838
$$ packed form
1246a8697P395J2668J2006N700l293j0711j3055r251j185P529J2631J1741N432
1259A8910l532j0754j2880q970q68P667J2557J1484N110l792j0699j2706q724
1272a7197o00P839J2410J1257M824l968j0796j2541q398l05P932J2389J0956M508
1286A8310m131j0827j2330q096q7Q042J2294J0729M215m316j0814j2178p815J52
1300a6852Q141J2154J0551L939m565j0805j1977p584M84Q284J2043J0272L653
1313A7738m763j0804j1798p268P14Q358J1972R991L361m934j0839j1583o946R39
1327a5862Q456J1886R735L064n124j0841j1355o707J232Q530J1783R499K762n299
1341A1759j0794j1231o393J492Q622J1660R250K451n474j0779j0973o140J712
$$ plain form
1354 -14838 -6137 5410 14394 16579 10997 223 -10590 -16393 -14486 -5735 5690 14404 16358 10565
1368 10565 -128 -10712 -16319 -14157 -5357 5901 14407 16122 10182 -470 -10896 -16188 -13856
1381 -13856 -4948 6180 14419 15841 9797 -804 -11033 -16073 -13518 -4580 6440 14382 15585 9439
1395 9439 -1124 -11143 -15898 -13156 -4239 6632 14391 15352 9032 -1492 -11234 -15764 -12833 -3805
1409 -3805 6873 14387 15066 8686 -1736 -11357 -15629 -12481 -3513 7092 14350 14833 8331 -2056
1423 -2056 -11454 -15476 -12176 -3165 7286 14280 14592 7985 -2321 -11504 -15282 -11858 -2874 7469
1437 7469 14215 14303 7615 -2593 -11625 -15145 -11504 -2470 7638 14207 14046 7262 -2888 -11667 -15002
1452 -15002 -11164 -2191 7820 14170 13785 6938 -3150 -11742 -14808 -10850 -1843 8024 14109 13533 6569
$$ packed form
1354a4838Q701J1547Q984K185n582j0774j0813n803J907Q751J1425Q714J954n793
1368A0565j0693j0584n607K162Q800J1258Q506J715n940j0652j0426n292K332
1381a3856Q908J1128Q239J422o044j0601j0229n040K555Q938J1020P942J203o146
1395I439j0563j0019m755K742Q917J0871P759R61o320j0524r742m530K931R028
1409c805J0678P514O79o380j0422r621m272L148Q968J0605P258M83o502j0387
1423b056r398m022L300R011J0451O994L12o607j0306r183l778L424Q984J0343
1437G469O746Q8o688j0208r032l520L641R034J0108O569j61o784j0150q779l335
1452a5002L838Q973J0011O350l85o847j0088q592l066L958R007R867O085n76o964
$$ plain form
1467 6569 -3440 -11808 -14612 -10529 -1464 8238 14052 13205 6211 -3715 -11855 -14445 -10167 -1123 8379
1482 8379 13982 12948 5837 -3988 -11926 -14264 -9863 -813 8560 13898 12676 5467 -4249 -11973 -14057
1497 -14057 -9470 -518 8688 13831 12405 5143 -4512 -12039 -13898 -9189 -200 8861 13748 12131 4799
1512 4799 -4718 -12019 -13704 -8872 118 8998 13639 11820 4473 -4978 -12057 -13475 -8509 411 9137
1527 9137 13533 11560 4145 -5174 -12092 -13260 -8180 719 9245 13451 11277 3814 -5378 -12062 -13073
1542 -13073 -7852 1031 9366 13310 10989 3460 -5664 -12104 -12842 -7539 1265 9506 13240 10715 3148
1557 3148 -5832 -12114 -12698 -7242 1541 9560 13127 10431 2865 -5997 -12058 -12428 -6917 1782 9653
1572 9653 12963 10139 2531 -6219 -12059 -12223 -6630 2037 9779 12867 9819 2224 -6367 -12036 -11978 -6274
$$ packed form
1467F569j0009q368k804M083R065R702N814q47o994r926q140k590M278R044R502
1482H379N603j034p111r825p938k338M401R050R373N338j222p209r716p724k084
1497a4057M587Q952R206N143j426p262r655p527j859M709Q989R061M887j617p332
1512D799r517p301j685M832Q990Q880M641j819p347r451p079j418M966Q920Q726
1527I137M396j973p415r319o918j168N080Q899Q526M206k174p463r192o684j011
1542a3073N221Q883Q335L944k321p529r124o440p38N303Q804Q241L734k525p567
1557C148q980o282n84N456Q783Q019L567k696p566q862o061l70N511Q699P871
1572I653L310k824p608q750n840j64N593Q667P742L088l048p595q591n669N8N704
$$ plain form
1588 -6274 2362 9853 12712 9602 1935 -6556 -12013 -11745 -5941 2606 9906 12610 9282 1664 -6739
1603 -6739 -11948 -11539 -5642 2847 9993 12461 8968 1362 -6915 -11906 -11283 -5331 3115 10050 12272
1618 12272 8705 1062 -7065 -11864 -11065 -5032 3332 10112 12143 8407 752 -7242 -11818 -10842 -4732
1633 -4732 3565 10142 11993 8143 450 -7350 -11756 -10602 -4435 3761 10192 11788 7855 213 -7522
1648 -7522 -11682 -10362 -4123 3985 10235 11646 7569 -63 -7638 -11595 -10092 -3790 4206 10276 11515
1663 11515 7247 -383 -7762 -11519 -9828 -3512 4400 10293 11297 6961 -594 -7883 -11456 -9613 -3228
1678 -3228 4606 10297 11109 6704 -866 -7977 -11405 -9366 -2966 4770 10312 10934 6432 -1073 -8091
1693 -8091 -11311 -9121 -2692 4976 10291 10745 6170 -1324 -8157 -11191 -8868 -2413 5135 10340 10595
$$ packed form
1588f274Q636P491K859l110p667q491n457K68N804Q547P300K704l328p618q403
1603f739n209M09N897Q489P146K468l493p606q277m991O23N952Q446O935K222
1618A2272l567p643q127m799P99O033Q364O780K031l736p655p994m576R76O110
1633d732Q297O577J851l850p693p800m406J154O167Q196O431J596l933p642p735
1648g522m160J320O239Q108O250J411m077p632p575l957J503O302P996O070J239
1663A1515m268p630p379l757J691O316P912N893J004m336p555p289l573J843O385
1678c228P834N691Q12m405p570p111l428K039O400P736N542O22m502p505p018
1693h091l220K190O429P668N315M54m575p494o833l034K323O455P548N205K55
$$ plain form
1708 10595 5874 -1575 -8249 -11075 -8636 -2133 5315 10296 10378 5589 -1768 -8328 -10971 -8396 -1882
1723 -1882 5474 10263 10218 5351 -2005 -8394 -10856 -8164 -1675 5589 10212 10025 5083 -2237 -8474 -10718
1739 -10718 -7904 -1342 5777 10214 9803 4775 -2450 -8555 -10611 -7652 -1131 5893 10188 9635 4519
1754 4519 -2649 -8606 -10475 -7399 -857 6059 10173 9425 4274 -2857 -8655 -10347 -7179 -650 6189
1769 6189 10116 9230 4027 -3073 -8688 -10240 -6908 -381 6341 10046 9017 3769 -3274 -8718 -10102
1784 -10102 -6680 -138 6430 9989 8817 3504 -3446 -8767 -9955 -6428 92 6525 9941 8613 3257
1799 3257 -3634 -8791 -9819 -6230 311 6640 9856 8409 3010 -3786 -8793 -9666 -5962 530 6767
1814 6767 9810 8223 2753 -3980 -8822 -9532 -5700 772 6855 9735 8002 2500 -4088 -8815 -9354
$$ packed form
1708A0595m721p449o674k826K439O503P448M981Q2m789p357o560k643K575O514
1723a882P356M789m5m867p356o389k462K692O489P264M623j87m942p320o237k244
1739a0718K814O562P119M437m11n028p225o105k056K959O521P024M295n53n116
1754D519p168n957j869L076O542O916M114p48n151p131n798j692L168O529O839
1769F189L927q86n203p100n615j552L332O527O722L705j029n248p043n444j384
1784a0102L422O542O568L559j172n313o950n321j188L527O520O433L416j328n356
1799C257o891n157j028L589O541O329L216j447n399o796n007q73L704O492O237
1814F767L043j587n470o733m842p10L832O472O083K880j733n502o588m727n39
$$ plain form
1829 -9354 -5450 981 6939 9626 7776 2275 -4278 -8836 -9197 -5250 1188 7033 9591 7574 2038
1844 2038 -4456 -8821 -9044 -5016 1380 7112 9505 7338 1804 -4597 -8845 -8911 -4800 1563 7178 9377
1860 9377 7155 1536 -4737 -8835 -8739 -4537 1758 7239 9296 6983 1358 -4849 -8806 -8600 -4338 1943
1876 1943 7280 9185 6789 1158 -4991 -8761 -8425 -4099 2143 7331 9078 6579 932 -5085 -8753
1891 -8753 -8270 -3871 2289 7404 9007 6388 725 -5223 -8728 -8110 -3666 2475 7435 8920 6168
1906 6168 549 -5311 -8663 -7932 -3469 2593 7449 8793 6008 389 -5427 -8637 -7807 -3298 2770
1921 2770 7496 8686 5765 143 -5487 -8606 -7626 -3044 2913 7504 8575 5605 -23 -5584 -8549
1936 -8549 -7458 -2885 3059 7523 8462 5399 -190 -5693 -8491 -7312 -2641 3202 7574 8376 5217
$$ packed form
1829i354L904O431N958K687j850n501o553m558l61L947O438N845K558k017n536
1844B038o494m365k23M028O396N732K393k167n534o401m248o6M111O363N615K199
1860I377k222n619o273m098R6M202O295N481K057k313n625o207l957K06M262O281
1876A943N337J905k396n631o149l770L36M326O242N188J747k499n647o017l668
1891h753M83M399O160N115J603k619n663n948l505O18M444O141M960J485k752
1906F168n619n860l352P31M463O062M856J344k785n619n816l210Q30M509O068
1921B770M726J190k921n622n630l119R80M582N957M591J071k970n628n561k965
1936h549J091M573N944M464R39l063n589n503k798J179M671N843M372Q02l159
$$ plain form
1951 5217 -385 -5757 -8418 -7151 -2462 3358 7565 8254 5010 -537 -5871 -8367 -6988 -2274 3499
1966 3499 7583 8125 4811 -745 -5939 -8356 -6807 -2076 3612 7591 8008 4587 -948 -6033 -8311
1981 -8311 -6652 -1869 3746 7600 7882 4403 -1099 -6098 -8237 -6466 -1675 3888 7619 7742 4202
1996 4202 -1262 -6164 -8141 -6265 -1491 3996 7625 7610 4026 -1453 -6226 -8057 -6123 -1246 4108
2011 4108 7584 7487 3821 -1593 -6268 -7982 -5927 -1090 4238 7611 7350 3652 -1740 -6327 -7888 -5780
2027 -5780 -930 4353 7549 7191 3462 -1910 -6358 -7858 -5627 -713 4458 7554 7098 3279 -2055
2042 -2055 -6410 -7758 -5461 -544 4562 7523 6953 3080 -2218 -6453 -7648 -5255 -399 4668 7507
2057 7507 6786 2914 -2334 -6493 -7542 -5072 -210 4797 7473 6674 2747 -2493 -6489 -7444 -4927 -64
$$ packed form
1951E217n602n372k661J267M689N820M207O89l244n547n334k496J379M714N773
1966C499M084N42l314n556n194k417J549M731N688L979M17l421n535n085k278
1981h311J659M783N615L854K82l479n502m999k139J771M791N563L731J23l540
1996D202n464m902j977J876M774N487L629j5l584n479m773j831J934M877N354
2011D108L476r7l666n414m675j714K055M837N328L373k61l698n392m587j561K108
2027e780M850N283L196l58l729n372m448j500K231M914N171L096m56l819n334
2042b055m355j348K297M917N106K961n70l873n298m235j195K393M856N067K839
2057G507p21l872n248m159j049K470M862N007K676p99l927n240l996r55K517M863
$$ plain form
2073 -64 4842 7458 6546 2564 -2610 -6563 -7390 -4779 122 4923 7379 6397 2351 -2778 -6570 -7283
2089 -7283 -4538 282 4995 7374 6212 2182 -2917 -6610 -7223 -4412 472 5070 7299 6099 1950
2104 1950 -3023 -6592 -7091 -4220 634 5162 7273 5940 1819 -3170 -6641 -6976 -4027 806 5258
2119 5258 7215 5786 1638 -3279 -6628 -6863 -3841 970 5299 7159 5644 1456 -3412 -6622 -6742
2134 -6742 -3680 1116 5374 7093 5493 1306 -3523 -6605 -6593 -3511 1233 5427 7028 5333 1143
2149 1143 -3635 -6620 -6542 -3355 1372 5461 6969 5203 950 -3712 -6642 -6404 -3183 1531 5500 6891
2165 6891 5072 785 -3802 -6603 -6288 -3014 1711 5561 6842 4905 643 -3898 -6585 -6165 -2868
2180 -2868 1819 5617 6769 4737 522 -3968 -6540 -6069 -2716 1936 5640 6653 4609 333 -4081
$$ packed form
2073f4M906K616r12l982n174l953q27K611M901M801K456r82m046n129l792p13
2089g283K745M820M713K379j162m030n099l693o13K811M884M598K229j200m149
2104A950m973l569m99K871M854M528K111j333m121m989l471l35K949M833M452
2119E258J957j429m148m917l349k35L022M811M329J860j515m188m868l210j20
2134f742L062M796M258J719j600m187m829l082J2L082M744M194J601j695m190
2149A143m778k985P8L187M727M089J508j766m253m662k930K38L221M714L969J391
2165F891j819m287m587k801L15L274M725L850J281j937m262m541k687M20L297
2180b868M687L798J152k032m215m490k572M71L353M652L704J013k044m276m414
$$ plain form
2195 -4081 -6555 -5963 -2554 2062 5670 6602 4454 179 -4141 -6545 -5816 -2379 2154 5672 6536 4316
2211 4316 29 -4226 -6486 -5703 -2212 2293 5713 6452 4157 -88 -4320 -6442 -5548 -2047 2430 5734
2227 5734 6358 4019 -249 -4398 -6416 -5435 -1899 2545 5787 6274 3837 -428 -4461 -6361 -5322 -1710
2243 -1710 2683 5804 6200 3675 -541 -4516 -6322 -5202 -1594 2778 5807 6101 3571 -698 -4606
2258 -4606 -6317 -5057 -1437 2874 5806 6011 3398 -857 -4675 -6265 -4936 -1260 2960 5794 5936
2273 5936 3250 -952 -4719 -6226 -4802 -1167 3073 5802 5827 3092 -1101 -4743 -6132 -4689 -1000
2288 -1000 3142 5792 5720 2947 -1216 -4810 -6092 -4537 -874 3251 5832 5656 2828 -1353 -4844 -6048
2304 -6048 -4431 -693 3352 5799 5541 2663 -1439 -4887 -5965 -4299 -602 3400 5759 5421 2519
$$ packed form
2195d081k474N92L409M616L608R32k148m275m320k404P29L437M533L518Q64k220
2211D316m287m255k260P83L491M505L420P39k295m245m232k122Q94L501M477L304
2227E734O24k339m268m149k018R81L536M444L242M87k437m265m033j900J039L612
2243a710M393L121L96k525m216l975j806J120L608M372L029K94k530m269l908
2258d606j711J260L620M311K932K05k613m255l818j590J329L676M220K834J42
2273E936k686m202l767j507J424L635M240K729K5k735m193l642j389J443L689
2288a000M142K650p2k773m163l594j282J555L663M125K581j76k828m181l491j204
2304f048J617L738M045K447k58k878m102l448j078J666L697M002K359l38k902
$$ plain form
2319 2519 -1568 -4917 -5928 -4205 -473 3501 5769 5337 2404 -1662 -4944 -5903 -4055 -325 3574
2334 3574 5720 5225 2276 -1840 -4981 -5806 -3920 -200 3640 5732 5105 2140 -1913 -4967 -5730 -3774
2350 -3774 -56 3707 5679 5023 1987 -2000 -5050 -5667 -3632 60 3774 5671 4913 1856 -2082 -5021
2366 -5021 -5590 -3513 183 3829 5655 4787 1707 -2218 -5053 -5521 -3402 333 3906 5600 4694 1566
2382 1566 -2330 -5065 -5434 -3274 464 3970 5600 4582 1447 -2418 -5071 -5360 -3168 580 4018
2397 4018 5531 4456 1309 -2476 -5081 -5302 -3006 692 4070 5498 4376 1154 -2581 -5073 -5197
2412 -5197 -2894 807 4147 5429 4261 1061 -2659 -5111 -5144 -2777 910 4159 5443 4151 965
2427 965 -2736 -5108 -5012 -2628 1008 4164 5338 4057 840 -2832 -5070 -4914 -2520 1150 4208 5299
$$ packed form
2319B519m087l349j011J723L732L974K268m32k933m066l282r59J848L730L899
2334C574K146m95k949m116l141q25J886L720L840K092o27k965m053l054p63J956
2350c774L718L763J972o56l036l987l050o17K035L692L714J897p58l057l938k939
2366e021n69K077L696L646J826q68l080l925k835m68K119L735L573J694r06l128
2382A566l896k735l69K160L738L506J630j018l135l865k653k89K192L748L438
2397D018J513j075l147l785k605k21K296L698L378J428j122l222l735k492j24
2412e197K303L701L340J282j168l200l720k452l3K367L687L249J284j292l186
2427I65l701k372R6K384L636L156J174j281l217l672k238J56K394L670L058J091
$$ plain form
2443 5299 3909 679 -2896 -5098 -4872 -2369 1264 4302 5271 3799 583 -3007 -5037 -4789 -2236 1337
2459 1337 4312 5190 3692 424 -3055 -5046 -4693 -2127 1426 4334 5153 3581 294 -3126 -5042 -4590
2475 -4590 -2016 1549 4392 5110 3471 217 -3151 -5004 -4518 -1872 1679 4402 5040 3351 68 -3266
2491 -3266 -5016 -4410 -1761 1725 4420 4990 3231 -38 -3328 -4995 -4335 -1646 1862 4434 4932 3097
2507 3097 -139 -3383 -4964 -4219 -1516 1932 4466 4853 2990 -274 -3406 -4948 -4142 -1404 2000 4461
2523 4461 4794 2916 -385 -3468 -4907 -4037 -1294 2102 4459 4720 2801 -479 -3530 -4849 -3941 -1181
2539 -1181 2205 4471 4656 2676 -600 -3545 -4860 -3859 -1069 2288 4496 4590 2577 -698 -3614 -4799
2555 -4799 -3768 -945 2336 4502 4504 2478 -785 -3638 -4761 -3664 -822 2435 4464 4427 2365 -883
$$ packed form
2443E299j390l230l575k202K26K503L633L038R69j472l216l590k030K48K553L573
2459A337K975Q78j498l268l479j991L53K566L553K908Q19j572l287l420j916M52
2475d590K574L565K843P18j639l254l368j853M86K646L551K723O38j689l283l334
2491c266j750O06K649L486K695N70j759l269l290j667O60K689L508K572M98j835
2507C097l236l244j581P45K703L448K534L87j863l264l132j542Q06K738L404K461
2523D461L33j878l301l083j439Q70K743L396K357K61j919l280l051j319R08K760
2539a181L386K266J85j980l276k945j315J001K790L357K208R4k013l275k916j185
2555d799J031K823L281K166Kk026l263k853j123J097K842L257K029l7k062l248
$$ plain form
2571 -883 -3702 -4721 -3557 -733 2469 4458 4362 2218 -977 -3712 -4674 -3462 -620 2583 4459 4286
2587 4286 2147 -1083 -3795 -4642 -3396 -499 2623 4473 4206 1996 -1171 -3783 -4587 -3269 -402 2699
2603 2699 4437 4152 1866 -1290 -3854 -4539 -3157 -302 2765 4433 4030 1783 -1361 -3833 -4453 -3058
2619 -3058 -176 2806 4432 3981 1681 -1467 -3889 -4424 -2975 -89 2859 4421 3880 1600 -1527 -3898
2635 -3898 -4361 -2880 1 2932 4388 3821 1476 -1616 -3900 -4338 -2761 96 2948 4379 3708 1398
2651 1398 -1685 -3926 -4278 -2651 216 3003 4380 3647 1279 -1766 -3895 -4221 -2577 324 3050 4301
2667 4301 3579 1168 -1830 -3924 -4179 -2492 420 3099 4273 3481 1043 -1910 -3952 -4086 -2368 496
2683 496 3131 4245 3422 945 -1989 -3951 -4057 -2244 592 3185 4218 3279 860 -2064 -3943 -3975
$$ packed form
2571h83k819j019J164K824L202J989r6k144l195k735r62J212K842L203J876j73
2587D286k139l230k712q47J246K897L122J850k67k210l167k612q04J318K867L101
2603B699J738k85k286l156k564o85J382K855L067J668m03k247l144k472o20J395
2619c058K882K982J626m51k300l148k422n35J449K886K948J562n41k280l127k371
2635c898m63J481K881K931J456n67k345l092k284m38J577K857K852J431o71k310
2651A398l083k241l52J627K867K787J377p33k368l045k129l26J644K901K726J251
2667D301p22k411k998k094k55J687K912K679J174p92k438k953k042j34J718K864
2683D96K635J114q23k477k934j962j06J813K836K593J033r39k419k924j879l2
$$ plain form
2699 -3975 -2203 722 3226 4217 3214 759 -2155 -3979 -3904 -2061 771 3290 4144 3153 657 -2180
2715 -2180 -3942 -3851 -1948 868 3301 4119 3086 562 -2290 -3965 -3787 -1868 959 3303 4077 2980
2731 2980 441 -2331 -3951 -3705 -1795 1007 3361 4059 2903 368 -2352 -3949 -3642 -1678 1125 3355
2747 3355 4010 2798 261 -2423 -3925 -3579 -1582 1179 3407 3957 2699 160 -2432 -3930 -3541 -1482
2763 -1482 1298 3400 3940 2650 73 -2496 -3873 -3435 -1366 1373 3442 3888 2537 -16 -2574 -3888
2779 -3888 -3377 -1310 1419 3472 3834 2444 -89 -2625 -3861 -3309 -1183 1462 3450 3750 2327 -172
2795 -172 -2660 -3835 -3227 -1111 1563 3483 3723 2266 -272 -2706 -3841 -3172 -1019 1609 3479 3714
2811 3714 2157 -371 -2756 -3805 -3119 -941 1652 3472 3646 2127 -473 -2762 -3774 -2998 -840 1742
$$ packed form
2699c975J772K925K504R91j003k455k914j824P5J843K832K519Q54r91k496k837
2715b180j762R1J903K816K433Q18j033k524k852j675J78J919K827K344P74j097
2731B980k539k772j620K46J910K802K354O98j156k535k720j597L07J964K803K230
2747C355O55j212k537k684j502L46J997K761K228N50j258k539k592j498L89K059
2763a482K780K102N40j290k577k569j377M38K069K739K069M46j351k553k558j314
2779c888N11K067K729K053L62j390k533k536j236N52K126K645J988L00j423k499
2795a72k488j175O08K116K674J920K40j457k538k434j135O69K153K628J870K35
2811C714j557k528k385j049O86K178K593J820J74j519k600k289j012P76K158K582
$$ plain form
2827 1742 3502 3584 2021 -501 -2793 -3771 -2944 -740 1813 3518 3542 1925 -598 -2836 -3715 -2839 -689
2844 -689 1872 3512 3490 1852 -687 -2873 -3697 -2786 -608 1899 3470 3457 1764 -746 -2881 -3657 -2738
2861 -2738 -510 1962 3487 3392 1674 -824 -2921 -3649 -2683 -414 2015 3495 3337 1587 -906 -2963
2877 -2963 -3619 -2604 -306 2099 3482 3266 1516 -961 -2933 -3574 -2501 -224 2130 3480 3196 1426
2893 1426 -1052 -3005 -3521 -2456 -168 2178 3464 3154 1358 -1099 -3021 -3499 -2361 -89 2221 3451
2909 3451 3077 1266 -1125 -3011 -3461 -2304 -21 2262 3431 3020 1156 -1185 -3055 -3440 -2221 17
2925 17 2292 3409 2944 1090 -1271 -3047 -3379 -2117 160 2332 3408 2918 1034 -1326 -3020 -3312
2941 -3312 -2046 219 2349 3380 2852 934 -1370 -3045 -3272 -1975 268 2371 3379 2754 874 -1437
$$ packed form
2827A742J760Q2j563k522k292r78Q27K204K553J705K4j617k523k238q79Q76K150
2844f89K561J640k2j638k539k186q24R11K178K507J571j3j693k510k135p76R19
2861b738K228K472J525r5j718k498k097p28R66K269K429J480j58j750k493k057
2877b963o56J015K298K405J383k16j750k477j972o41J073K277K354J350k84j770
2893A426k478j953n16J065K288K346J286l10j796k457j922m78J138K272K310J230
2909C451l74j811k391j886m50J157K283K283J169m11j864k341j870l85J219K238
2925A7K275J117m65j854k361j776l32J262K277K172J076m90j884k360j694k92
2941c312J266K265K130J031n28j918k304j675k27J297K243K103J008o25j880k311
$$ plain form
2957 -1437 -3066 -3241 -1898 326 2415 3332 2708 817 -1500 -3055 -3199 -1798 403 2433 3316 2631
2973 2631 681 -1569 -3076 -3150 -1766 518 2478 3307 2560 655 -1621 -3082 -3106 -1673 528 2492
2989 2492 3289 2521 578 -1656 -3070 -3050 -1587 619 2517 3240 2407 481 -1688 -3072 -3011 -1522 727
3006 727 2566 3241 2382 402 -1730 -3071 -2940 -1404 760 2574 3182 2340 334 -1782 -3047 -2895 -1383
3023 -1383 811 2596 3195 2236 272 -1839 -3085 -2853 -1271 872 2592 3145 2187 195 -1852 -3069
3039 -3069 -2789 -1239 957 2668 3115 2102 119 -1920 -3017 -2710 -1157 989 2668 3077 2031 57
3055 57 -1947 -3008 -2704 -1073 1062 2652 3004 1968 -3 -1981 -3024 -2609 -988 1113 2680 2989
3071 2989 1915 -97 -2022 -3005 -2581 -918 1161 2715 2936 1849 -145 -2065 -3005 -2492 -825 1206
$$ packed form
2957a437j629j75J343K224K089R17o24j891k317j555j44J401K201K030Q83o85
2973B631j950k250j507p4J384K284J960Q29p47j905k276j461k4J433K201J964
2989B492P97p68j943k234j414K0J463K206J898P23q33j926k169j384O1J489K249
3006G27J839O75q59j980k132j341J31J536K164J814O08q42k006k116j265J52J512
3023a383K194J785N99r59j964k111j246K32J582K143J720N53r58j992k047j217
3039c069K80J550K196J711M47j013j983k039j097L07J553K146J679M09j046j974
3055E7k004j061L04J631K135J590L52j036j971j978j043M15J621K101J567L09
3071B989j074k012j925r83M24J663K079J554K21j087j994j920r40N13J667K031
$$ plain form
3087 1206 2698 2911 1743 -214 -2097 -3011 -2481 -803 1268 2684 2877 1701 -294 -2161 -2992 -2414
3103 -2414 -713 1345 2721 2826 1637 -358 -2167 -2934 -2324 -649 1373 2714 2802 1559 -430 -2191
3119 -2191 -2915 -2286 -584 1404 2728 2772 1517 -479 -2219 -2858 -2216 -516 1469 2733 2705 1442 -508
3136 -508 -2240 -2875 -2185 -470 1496 2711 2706 1364 -586 -2243 -2859 -2121 -336 1526 2708 2597 1274
3153 1274 -672 -2294 -2851 -2048 -329 1567 2706 2587 1217 -690 -2318 -2797 -1990 -243 1596 2699
3169 2699 2519 1162 -777 -2289 -2745 -1921 -197 1648 2716 2491 1091 -777 -2326 -2724 -1861 -116
3185 -116 1697 2708 2434 1046 -877 -2322 -2677 -1826 -57 1735 2708 2388 949 -913 -2355 -2663 -1761
3202 -1761 16 1772 2657 2357 874 -954 -2347 -2652 -1721 47 1789 2663 2275 808 -1030 -2376
$$ packed form
3087A206J492K13j168j957j883r14N30J678K071J416J93j176j995j867q31N78
3103b414J701K058J376J05j189j995j809p67O10J675K022J341Q8j243j989j761
3119b191p24O29J702J988J324M4j255j996j740o39O42J700J985J264k8j263j950
3136e08j732o35O90J715J966J215nj342j950j657o16P38J785J862J182j11j323
3153A274j946j622n57Q03J719J896J139j19j370j907j628m79Q07J747J839J103
3169B699j80j357j939j512m56Q24J724J845J068k25j400j868j549l98Q63J745
3185a16J813J011k74j388j923j445l55Q51J769J792R73l20j439j862j442l08R02
3202a761J777J756Q85l00j483j828j393l05R31J768J742Q74l88j467j838j346
$$ plain form
3218 -2376 -2597 -1612 122 1828 2646 2238 757 -1065 -2370 -2581 -1555 209 1842 2611 2160 714 -1116
3235 -1116 -2354 -2521 -1499 266 1881 2645 2136 653 -1181 -2372 -2486 -1434 311 1909 2600 2103
3251 2103 563 -1182 -2382 -2468 -1379 372 1962 2597 2052 527 -1243 -2387 -2437 -1338 412 1909
3267 1909 2539 1995 478 -1284 -2415 -2381 -1261 457 1972 2535 1915 392 -1309 -2410 -2352 -1231 520
3284 520 2020 2532 1878 356 -1336 -2395 -2319 -1126 552 2004 2491 1810 280 -1400 -2398 -2279 -1112
3301 -1112 618 2034 2451 1781 217 -1432 -2423 -2196 -1006 673 2050 2445 1743 165 -1445 -2370 -2171
3318 -2171 -956 698 2069 2434 1636 87 -1512 -2395 -2165 -926 762 2070 2408 1649 51 -1564
3334 -1564 -2371 -2103 -861 815 2070 2356 1549 -8 -1549 -2342 -2035 -805 861 2092 2343 1496 -59
$$ packed form
3218b376k21R85J734J706Q18m08j481j822j305k11J026J764J633P69m51j446j830
3235a116j238j67J022J765J615P64n09j483j834j191j14J052J745J598O91m97
3251B103j540j745j200q6J089J751J590O35n45j525j770j144n0J099J750J497
3267A909O30n44j517j762j131L4J120J718J515N63o20j523j701j101N8J121J751
3284E20J500N12o54j522j692j059P6J193J678J452M87o81j530j680r98J19J167
3301a112J730J416M17o70j564j649r91K27J190J679J377L95p02j578j610r25J99
3318b171J215J654J371L65p98j549j599q83K30J239J688J308L38p59j598j615
3334a564q07K68J242J676J255K86q07j557j541p93L07J230J666J231K51q47j555
$$ plain form
3351 -59 -1571 -2362 -2004 -727 876 2081 2326 1450 -101 -1596 -2329 -1954 -687 935 2139 2287 1392
3368 1392 -144 -1652 -2294 -1956 -626 978 2097 2253 1311 -221 -1656 -2304 -1886 -584 985 2096
3384 2096 2216 1288 -256 -1659 -2324 -1851 -558 1041 2115 2215 1233 -302 -1699 -2293 -1767 -489 1067
3401 1067 2105 2134 1201 -352 -1706 -2224 -1740 -404 1128 2112 2140 1135 -412 -1714 -2232 -1684 -339
3418 -339 1146 2142 2105 1056 -432 -1739 -2209 -1645 -300 1197 2124 2040 1044 -473 -1747 -2242 -1620 -244
3436 -244 1193 2117 1999 949 -546 -1787 -2181 -1553 -229 1245 2094 2022 909 -573 -1818 -2156 -1526
3453 -1526 -175 1267 2108 1917 882 -651 -1808 -2136 -1465 -104 1302 2091 1922 822 -652 -1801
3469 -1801 -2114 -1434 -38 1344 2082 1868 735 -694 -1810 -2093 -1356 -5 1366 2095 1817 739 -723
$$ packed form
3351e9j512p91L58J277J603J205K45q76j551j495p33L75J267J622J204J48q95
3368A392j536j508o42L38J330J604J119J56r42j532j435o48M18J302J569J111
3384B096J20r28j544j403o65M73J293J599J074J00r82j535j397n94N26J278J556
3401A067J038K9r33j553j354n18M84J336J532R84K8j005j547j302n18N48J345
3418c39J485R96l7j049j488j307m70N64J345J497R27q4r96j517j274m95O22J376
3436b44J437R24j18j050j495j241l94O28J324J474Q49p2j113j482j245l38O30
3453a526J351J442Q41j91j035j533j157l28O71J361J406P89j69j100j474j149
3469a801l13O80J396J382P38k14j133j429j116k83P37J351J371P29k78j078j462
$$ plain form
3486 -723 -1835 -2077 -1322 19 1399 2070 1767 659 -731 -1828 -2025 -1259 89 1392 2037 1754 614
3503 614 -827 -1835 -2049 -1236 118 1401 2053 1709 580 -852 -1848 -1973 -1157 151 1450 2044 1663
3520 1663 520 -869 -1862 -1946 -1131 217 1484 2033 1645 480 -902 -1855 -1964 -1085 263 1483 2004
3537 2004 1592 453 -941 -1846 -1846 -1016 309 1540 1982 1579 392 -953 -1818 -1849 -1027 334 1525 2001
3555 2001 1523 314 -980 -1886 -1816 -954 370 1523 1984 1468 261 -1023 -1835 -1817 -914 438 1551 1943
3573 1943 1449 240 -1060 -1859 -1757 -829 463 1576 1929 1404 205 -1088 -1826 -1743 -789 513 1611
3590 1611 1951 1332 176 -1120 -1832 -1701 -768 520 1565 1897 1331 130 -1143 -1827 -1668 -706 596
3607 596 1587 1868 1268 74 -1172 -1829 -1643 -704 608 1620 1845 1232 55 -1176 -1812 -1604 -622 618
$$ packed form
3486g23j112k42P55J341J380O71l03j108j390j097j97P66J348J303O45k83j140
3503F14j441j008k14Q13J354J283O52l44j129j432r96j25Q16J308J299N94l81
3520A663j143j389r93q4Q15J348J267N49l88j165j382r53j09Q79J348J220N21
3537B004m12j139j394r05%Q30J325J231M42m03j187j345q65l1Q22J361J191M76
3555B001m78j209j294r06P0Q62J324J153M61n16j207j284q12J8R03J352J113L92
3573A943m94j209j300p99J02R28J292J113L53n25j199j293p38Q3R54J302J098
3590A611L40o19j156j296p12J31R33J288J045L32n66j201j273o84J59R62J302
3607E96R91K81o00j194j246o57J86R39J312J012K25o13j177j231o36K08R82J240
$$ plain form
3625 618 1574 1817 1190 -9 -1204 -1811 -1575 -572 666 1608 1821 1127 -69 -1220 -1794 -1529 -543 724
3643 724 1656 1802 1128 -76 -1243 -1806 -1500 -507 759 1661 1753 1063 -98 -1242 -1774 -1460 -457 769
3661 769 1676 1723 1024 -133 -1268 -1793 -1431 -412 805 1650 1729 983 -215 -1333 -1786 -1408 -374 812
3679 812 1637 1688 930 -249 -1294 -1772 -1363 -343 867 1621 1671 900 -277 -1346 -1739 -1314 -309 904
3697 904 1629 1613 877 -323 -1351 -1719 -1301 -257 897 1650 1630 810 -305 -1348 -1711 -1235 -218 961
3715 961 1644 1574 765 -400 -1393 -1688 -1219 -144 964 1640 1585 756 -416 -1393 -1657 -1202 -107 942 1647
3734 1647 1513 679 -481 -1407 -1631 -1172 -88 1023 1648 1506 654 -484 -1423 -1656 -1105 -39 1047 1642
3752 1642 1455 613 -523 -1410 -1627 -1044 -28 1046 1628 1450 597 -543 -1398 -1603 -1035 44 1074 1615
$$ packed form
3625F18R56K43o27j199j195o07K36J003J238R42K13o94j196j151n74K65R86J267
3643G24R32J46o74j204j167n63L06R93J266R02R2o90j161j144n32L14J003J226
3661G69R07M7o99j157j135n25L62J019J217Q45P9p46j198j118m53L78J034J186
3679H12Q25N1p58j179j045m78M09J020J210P54N0p71j177j069l93M25J005J213
3697I04P25j6p36j200j028l68M18J044J154P53k0q20j115j043l63M76J017J179
3715I61O83p0q09j165r93k95M69J075J108O76n5q29j172r77k64M55J095J049P05
3734A647j34q34j160r26k24M59J084J111O25j42q52j138r39k33N51J066J086N95
3752A642j87q42j136q87k17N83J016J074N82j78q53j140q55k05N68J079J030N41
$$ plain form
3770 1615 1413 569 -579 -1407 -1564 -1006 41 1106 1619 1387 539 -630 -1424 -1528 -974 61 1117 1586
3788 1586 1375 457 -621 -1449 -1522 -955 112 1103 1600 1312 407 -675 -1439 -1523 -923 172 1127 1577 1312
3807 1312 358 -698 -1441 -1511 -864 183 1156 1589 1287 347 -720 -1471 -1487 -803 240 1177 1585 1208 307
3826 307 -743 -1457 -1463 -787 249 1170 1559 1177 299 -774 -1435 -1439 -741 270 1198 1579 1152 238 -787 -1430
3846 -1430 -1381 -699 320 1232 1535 1134 183 -803 -1462 -1401 -693 348 1230 1504 1104 161 -852 -1443 -1372 -650
3866 -650 387 1217 1490 1050 121 -861 -1440 -1335 -598 405 1254 1488 1007 68 -857 -1425 -1331 -543 457
3885 457 1279 1465 1013 72 -886 -1420 -1278 -545 484 1249 1452 932 0 -921 -1383 -1237 -492 514 1253
3904 1253 1396 937 2 -942 -1429 -1242 -440 514 1280 1420 909 -18 -963 -1456 -1208 -424 522 1237 1393 873
$$ packed form
3770A615k02q44j148q28j57N58J047J065N13k32q48j169p94j04N54J035J056M69
3788A586k11r18j078q28p3N67J067R91M97k88r05j082p64q4O00J095R55M50k65
3807A312r54j056p43p0O47J047R73M33l02r40j067p51j6O84J043R37M08l77r01
3826C07j050p14oO76J036R21L89l82q78j073o61mO98J011R28L81m27r14j025o43
3846a430M9O82J019R12L03m01r51r86o59O1P08J041Q82K74m00r43j013n91P1P22
3866f50J037Q30K73m40r29r82n79J05P37J003Q49K34m81r39r25n68R4P88J000
3885D57Q22J86m52r41r58n34J42P33J029P65K03n20r32r21m62J46P45J006P39
3904A253J43m59r35r44m87J87Q02R54P66J40n11r27r45m93K48P84R46P15J56n20
$$ plain form
3924 873 -68 -958 -1386 -1177 -405 574 1255 1411 845 -99 -972 -1412 -1170 -390 607 1260 1375 805 -114 -996
3944 -996 -1388 -1127 -310 627 1289 1332 808 -139 -1012 -1374 -1106 -292 664 1281 1324 766 -175 -1029 -1377 -1068 -249
3965 -249 659 1274 1284 687 -197 -1049 -1322 -1043 -236 698 1271 1277 660 -271 -1074 -1348 -1035 -191 710 1301 1246
3986 1246 627 -283 -1037 -1335 -981 -166 723 1290 1254 595 -306 -1031 -1325 -966 -115 776 1307 1209 569 -331
4006 -331 -1076 -1292 -910 -82 789 1259 1197 526 -372 -1105 -1322 -864 -70 813 1280 1151 497 -391 -1124 -1272
4026 -1272 -862 -17 795 1272 1145 468 -466 -1123 -1270 -834 15 829 1272 1104 443 -447 -1102 -1260 -807 26
4046 26 840 1261 1083 371 -445 -1116 -1240 -764 41 830 1275 1098 391 -485 -1089 -1219 -755 68 886 1220
4066 1220 1019 344 -498 -1136 -1224 -736 87 871 1240 1022 325 -515 -1113 -1186 -710 120 919 1256 996 307
$$ packed form
3924H73r41q90m28K09P72R79O81J56n66r44q73m40K42P80R97O53J15n70r19q82
3944i96l92K61Q17R37O62M3n24r47q73l62K68Q14R56O17M3n58r41q54l48L09Q19
3965b49R08O15J0n97q84q52k73K79Q07R34N73Oo17r31q03k74L13Q44R01N91n5
3986A246o19r10p54k98L54Q15Q89N67l6o59r01p25k94L59Q51Q91N31r8o40r00
4006c31p45k16L82Q28Q71M70o2o71q98p33k17M58P94Q83M67j29o54q88p33j48
4026a272M10Q45Q12M77j27o77r34o57j47M36Q49Q14M43j68o61q90o55j58M53Q33
4046B6Q14M21j78p12q16o71j24M76Q05P89M45j77p07q76o04j30M64Q23Q18L34
4066A220k01o75q42o38q8M88Q23P84L69k18o97q40n98p3M76Q30P99L37k60o89
$$ plain form
4086 307 -539 -1134 -1156 -695 127 895 1217 956 257 -565 -1149 -1157 -635 160 866 1208 956 262 -575 -1136 -1171
4107 -1171 -607 187 920 1192 961 240 -585 -1131 -1102 -600 220 937 1209 949 215 -593 -1101 -1102 -544 230 943
4128 943 1200 878 183 -616 -1097 -1076 -533 291 930 1176 877 136 -624 -1153 -1063 -530 309 935 1160 868 119
4149 119 -660 -1131 -1041 -481 313 971 1164 801 108 -693 -1124 -1029 -441 337 999 1123 762 51 -691 -1098 -1005
4170 -1005 -424 355 959 1104 763 35 -718 -1091 -947 -393 391 997 1106 746 25 -726 -1120 -978 -374 411
4190 411 988 1100 700 -7 -707 -1101 -961 -330 403 975 1086 659 -44 -767 -1097 -911 -314 441 1036 1084
4210 1084 668 -75 -760 -1090 -932 -272 463 998 1080 669 -88 -771 -1086 -863 -238 502 1004 1074 622 -100
4230 -100 -794 -1066 -849 -216 496 994 1067 593 -131 -771 -1040 -815 -198 529 1039 1048 561 -161 -773 -1063 -815
$$ packed form
4086C07q46n95k2M61Q22P68L22k61o99q22n84qN22P95P06L42k52o94q37n61l5
4107a171N64P94P33K72k31p21q25n46K9N02Q20P17K72k60p34q08n08jN58P74P13
4128I43K57l22o95p99m81K1N43Q24O39K46k99p41p60n29R0N33Q39O26K25k92p49
4149A19p79m71R0N60P94O58J93l63o93q01m31R5N88P78O62J24l61p11p42m07R3
4170a005N81P79O04J45l41p28p53l73J44N54P84O06J09l60p21p51l94J42O04P85
4190D11N77J12m00p07p00l94J40O31P33N72J11m27p03p23l30J86N97P55N95M8
4210A084m16p43o85l30J58O60P35N35Q2m11p57o83l15K23O25P40N02P0m52p22
4230a00o94k72K17O33P12M98P3m74p24o40k69K25O17P27N10Rm87p22o12k90K48
$$ plain form
4251 -815 -192 542 994 1011 510 -184 -817 -1072 -812 -138 551 996 993 507 -211 -803 -1031 -789 -125 510 997
4272 997 983 494 -225 -840 -1011 -760 -116 593 1019 975 490 -254 -851 -1044 -755 -84 589 1015 953 451 -304
4293 -304 -844 -1003 -709 -53 581 1022 941 411 -278 -843 -984 -690 -41 610 1010 888 414 -296 -845 -1016
4313 -1016 -655 -13 644 994 926 390 -344 -882 -979 -660 -22 630 988 851 339 -302 -856 -960 -637 50
4333 50 671 996 832 312 -367 -897 -962 -600 41 649 980 837 311 -400 -833 -928 -556 57 671 987 791
4354 791 310 -376 -865 -919 -551 61 714 955 796 266 -394 -869 -927 -549 102 718 961 784 238 -433 -866
4375 -866 -910 -506 143 697 956 755 210 -427 -893 -895 -519 121 717 975 771 177 -469 -877 -909 -481 194
4396 194 713 935 734 137 -459 -905 -869 -463 192 741 941 705 123 -502 -854 -857 -397 201 748 955 708
$$ packed form
4251h15O23P34M52J7n01o94o33k55K60O74O89M45lm86p18n92k28K42O64O35M87
4272I97j4m89p19o15j71K51O44P09M26m4m85p44n97j93K89O71O73M26o2n02p55
4293c04n40j59K94O56O34M41q1n30o89n65j41K94O49O51M00j22m74p10n49j71
4313a016L61O42O57L50o8n36p34n38r7L19O38O52L58j37n12o41n54j04L23O87
4333E0O21L25j64n20o79n30o5L62O41O08L31j43n26p11m33r5L72O13O14L16j96
4354G91m81o86m89n4L68O12O53K41j59n30o60m75n8L78O51O16K43j77n46o71m33
4375h66m4M04O49N54K59k01n45o37m66kL76O40N96K58k04n94o46m08l2M28O75
4396A94N19K22k01n97n96m46L6M06O55N49K00k36n82o25l52lM60N98N47K07k47
$$ plain form
4417 708 143 -472 -879 -847 -381 232 753 940 681 115 -524 -876 -830 -346 247 719 947 657 61 -523 -909
4438 -909 -819 -361 262 757 907 646 60 -516 -914 -788 -335 266 773 899 613 2 -577 -900 -827 -312 284
4459 284 780 870 555 6 -583 -867 -768 -293 301 790 900 565 -22 -593 -852 -793 -299 314 787 869 545
4480 545 -15 -583 -898 -760 -251 356 776 854 528 -47 -600 -878 -728 -235 383 775 844 501 -54 -613 -866
4501 -866 -717 -201 401 807 821 469 -67 -621 -858 -696 -182 387 788 805 466 -108 -624 -834 -688 -189 404
4522 404 798 805 428 -115 -617 -850 -649 -168 413 800 792 432 -134 -608 -837 -630 -117 423 836 773 399 -116
4544 -116 -641 -833 -625 -112 471 804 794 410 -179 -647 -813 -605 -118 450 832 778 353 -193 -647 -826 -604
4565 -604 -92 462 792 754 343 -210 -704 -819 -587 -78 479 794 753 317 -218 -636 -800 -572 -44 483 772
$$ packed form
4417G08n65o15m07L2M66O13N21J87k59n66o39l52M6M84N93M72K28k90n96n84l86
4438i09R0M58O23M95J50k61n86n76l98J26M53O01N07J26k86o11n79l23P3N15N96
4459B84M96R0l15n49n89k84R9M75N94M89J10l35n87n71k59N9M94O13M73Q2l24
4480E45n60n68l15J38N09O07M20P8l26n75n53k78J50M93O18L92O9l43n55n59k53
4501h66J49N16O02M06J4l52n36n54k37J62N14N69M01J7l39n74n16k10J46M99N93
4522D04L94Pl77n43n02k33K01M81N81L87ql60n66m74k29K07N13N40M13o3l74n15
4544a16n25j92K08N13N83L33j0l84n89m68j66K08M87N68L82n4m25n46m54j79K22
4565f04N12N54L30l8m11n53m94j15K32N09N57L15m1m36n35m18j64K28N28N27K89
$$ plain form
4586 772 731 332 -210 -661 -809 -524 -13 476 800 742 300 -230 -712 -758 -518 -3 523 794 705 296 -253
4607 -253 -667 -793 -497 -21 500 783 688 284 -275 -690 -786 -502 38 531 789 668 217 -302 -680 -781 -485
4628 -485 32 520 762 684 239 -323 -685 -749 -464 52 535 787 627 245 -326 -668 -693 -454 80 568 789
4649 789 663 183 -298 -695 -737 -395 99 533 796 649 213 -346 -675 -735 -404 96 566 789 610 138 -341
4670 -341 -707 -767 -412 91 563 760 589 178 -376 -736 -711 -367 132 582 769 573 133 -390 -729 -708 -363
4691 -363 143 579 752 574 81 -389 -696 -681 -340 174 612 725 560 85 -395 -695 -637 -319 192 634 755
4712 755 557 113 -417 -683 -655 -276 196 598 749 549 45 -422 -669 -659 -285 205 596 743 517 40 -430
4733 -430 -737 -646 -260 203 617 702 502 8 -426 -733 -623 -283 238 634 716 483 4 -443 -698 -658 -266
$$ packed form
4586G72m1l99n42m51j48K85N11M89L24n8m42n30m82m6K40N15N26K71q9m09n49
4607b53m14j26K96M76N21K83r5m04n59m15r6K84N40M93K58j21m51n19l78j01K96
4628d85N17M88K42p8m45n62l62o4K85N16M83K52j60l82n71l42k5K39N34M88K21
4649G89j26m80m81l97m2L42M94M34K63j47m36n59l29o0L31N00M70K23j79m72m79
4670c41l66o0L55N03M72J97j71m11n54l60K5L44M99M50J87j96m40n23l39K1L45
4691c63N06M36J73j78m93m70l07J5L41N14M38J13j65m75m80l00N8L18N11M42J21
4712G55j98m44n30k66K8L79M72M02J51k00n04m67k47J0L74M90L91J47k26m77m70
4733d30l07R1L86M63M14Q5k00m94m34l07J10L40N21L96Q2k33m79m47k55M0L92
$$ plain form
4754 -266 252 637 702 453 4 -428 -702 -592 -231 244 624 711 464 -4 -491 -711 -598 -198 282 630 696
4775 696 447 -21 -471 -680 -617 -201 296 652 697 414 -26 -480 -691 -568 -182 268 607 668 410 -69 -504
4796 -504 -705 -589 -148 296 623 684 394 -96 -533 -721 -556 -188 324 621 665 382 -102 -523 -699 -550 -139
4817 -139 326 661 671 362 -111 -518 -677 -516 -118 340 639 653 362 -113 -510 -685 -522 -101 354 652 678
4838 678 296 -145 -529 -679 -496 -90 372 650 627 315 -141 -546 -683 -501 -83 354 645 613 280 -175 -521
4859 -521 -667 -477 -92 384 637 589 272 -159 -539 -676 -482 -36 376 631 589 249 -168 -563 -646 -431 -3
4880 -3 418 636 578 255 -196 -556 -675 -437 -11 415 656 580 224 -219 -555 -636 -443 5 420 648 563 212
4902 212 -243 -539 -650 -400 35 416 632 549 176 -238 -584 -637 -375 23 423 611 547 184 -270 -597 -607
$$ packed form
4754b66N18L85O5k49m49m32k74J10L61M75L80Q7k47m68m87k20J13M00M80L48O6
4775F96k49m68m50k09O3M16M97L56M5k83m40m54k11J23L86M50L39O1k58m79m35
4796e04k01J16M41M44L27O1k90m90m37j88J65L68N12K97M4k83m84m21j76J49M11
4817a39M65L35J0l09m73m07j59J61L98M58K99J4k91m75l97j75J63M21M55K98K6
4838F78l82m41l84j50J83M06M62K78k3l12m56m05j37J82M18M37K91l2l33m55l46
4859e21j46J90L85M76K53m8l17m31l80j37J94M46M12K55m2l40m17l95q3K15M28
4880cM21K18n8l23m51l60j19K38M26M26K41p6l56m43l36q1J93M48M15K28q5l51
4902B12m55k96j11K50M35L81K16q3l73m14l46n3K62L98M00J88o4l63m54l27j0
$$ plain form
4923 -607 -390 37 424 601 540 174 -256 -586 -601 -354 49 454 646 503 193 -266 -548 -587 -357 61 473
4944 473 665 496 150 -264 -571 -579 -319 82 499 632 534 127 -291 -589 -589 -321 93 457 634 468 142 -326
4966 -326 -576 -594 -309 95 483 626 480 96 -314 -583 -582 -322 137 460 643 465 116 -344 -555 -570 -278
4987 -278 134 484 637 447 68 -338 -586 -559 -282 136 490 605 435 66 -325 -578 -539 -251 133 485 612
5008 612 453 57 -310 -581 -544 -249 168 507 578 413 41 -348 -562 -544 -247 176 482 562 429 15 -378
5029 -378 -584 -546 -198 197 490 553 368 21 -375 -617 -514 -195 199 505 573 394 14 -359 -566 -473 -224
5050 -224 215 519 593 371 -3 -404 -555 -484 -188 218 510 589 369 -25 -403 -556 -472 -174 242 528 599 353
5072 353 -58 -432 -557 -477 -153 232 524 548 318 -25 -430 -555 -436 -151 241 514 556 308 -51 -391 -567
$$ packed form
4923f07K17M27L87J77o1l66m30l30j5K47M03M05J92j43l10m59k82l9K30M18M12
4944D73J92j69l46m14l07qK60M01M17J33r8m07m18k98%K68M14L64J77j66l26m68
4966c26k50j8K85M04L88J43j46l84m10k69JK60M59L23J83j78l49m60k11j5K92
4987b78M12L50J53j90l79m06k48K7K77M18L54J15j70l69l91k53L9K88L84L52J27
5008F12j59l96l67k71L7K95M17L39P1j65l72l89k14J8K97M23L06Q0j33m14l93
5029c78k06L8L48L95K93O3j85l47l96k42J03L19L94L06O8j79l80l73k07R3K49
5050b24M39L04P4k22l74m01j51P1K96M06K92P9k20l94l78j53Q4K98M16K86P1k46
5072C53m11l74j25Q0L24L85K92K4k30l43m05j25J19K85L92K73M2k48l59l40j76
$$ plain form
5093 -567 -457 -151 252 527 565 292 -99 -437 -571 -422 -116 268 542 535 312 -65 -390 -576 -444 -81 261
5114 261 502 535 274 -76 -386 -567 -410 -85 301 527 546 314 -83 -412 -549 -423 -87 313 533 543 220
5135 220 -113 -426 -553 -431 -83 324 497 526 250 -127 -454 -541 -405 -57 295 517 487 237 -126 -463 -548
5156 -548 -372 -57 324 525 477 199 -157 -446 -516 -403 -23 338 515 510 207 -150 -455 -510 -376 -29 343 533
5178 533 486 233 -170 -446 -543 -357 -7 302 523 450 175 -166 -453 -525 -329 28 351 532 457 173 -198 -455
5200 -455 -514 -319 -12 361 541 466 180 -182 -451 -521 -308 42 336 511 433 158 -197 -442 -520 -311 54 377
5222 377 534 434 181 -202 -446 -514 -276 38 389 538 448 157 -217 -464 -512 -282 61 381 532 447 132
5243 132 -215 -458 -467 -281 76 357 499 407 126 -225 -461 -486 -282 97 377 507 420 131 -239 -469 -468 -223
$$ packed form
5093e67J10L06M03K75L8k73l91l38j34J49L06L84K74pk23l77l25j86J32L63L42
5114B61K41L3k61l50l10j81J57L25L86K26J9k32l97l29j37J26L36M00K20J0l23
5135B20l33l13j27J22L48M07J73K9k76l77l27q7J36L48L52K22l0k50l63l37q5
5156e48J76L15L81K01m8k78l56k89p0J13L80L61J77nl03l57l05n5J34L47L72J90
5178E33m7k53m03k76r7J86L50L09K21p3k75l41k87p2J96L57L23J81p5k84l71k57
5200d55n9J95L07L73J80p5k86l62k69p0K13L50K94J75p8k75l55k45p8K09L65L23
5222C77J57j00k53l83k44o8K38L14L51J49r0k91l74k47m8K30L43L20J51q5l15
5243A32l47k43rJ86L57K81J42r2k81l51k36k5K04L79K80J30q7k89l70k30JK45
$$ plain form
5265 -223 71 392 484 370 66 -263 -470 -468 -285 93 395 489 388 102 -265 -486 -484 -248 102 397 489 362
5287 362 81 -229 -465 -452 -204 114 409 497 395 50 -273 -507 -467 -226 129 404 519 345 60 -260 -481
5308 -481 -440 -226 115 408 523 330 63 -277 -510 -446 -175 150 420 517 344 10 -302 -504 -447 -197 153
5329 153 400 488 342 2 -310 -512 -438 -185 139 430 497 322 5 -292 -463 -378 -153 178 440 474 325 14
5351 14 -316 -469 -409 -159 193 430 469 321 -7 -282 -478 -392 -155 176 458 469 287 -21 -312 -488 -387 -129
5373 -129 220 422 455 259 -38 -344 -450 -388 -113 228 441 449 299 -45 -373 -482 -350 -87 212 432 450 244
5395 244 -83 -339 -480 -354 -85 240 447 454 252 -69 -335 -451 -365 -81 236 453 470 264 -67 -358 -440 -357
5417 -357 -87 254 439 443 219 -114 -366 -453 -348 -12 238 455 453 222 -103 -370 -445 -339 -71 250 447 424
$$ packed form
5265b23K94L21R2j14l04l29k07KJ83L78L02R4j01k86l67k21KK36L50K95R2j27
5287C62k81l10k36J3K48L18K95Q8j02l45l23k34M0K41L55K75J15j74k85l20k21
5308d81M1K14L41K93J15j93k67l40k33O4K71L25K70R7j73l34l12k02N7K50L50
5329A53K47Q8j46l40l12k02P4K53L24K91O7j75l17k97j71Q5K25L31K62L4j49l11
5351A4l30j53O0K50L52K37L9j48l28k75j96Q6K37L31K82J1j82l08k91j76J01K58
5373a29L49K02L3j96k97l06j06O2K75L41K13Qj50l44l28j09J32K63K99K20J8k06
5395B44l27k56j41J26K69L25K07Pk02l21k66j16Q6K84L17K17J7k06l31k91q2Q3
5417c57K70L41J85Mk24l33k52q7J05L36K50K17kk31l25k67p5J06K68L21J97k3
$$ plain form
5439 424 208 -137 -377 -422 -364 -44 257 420 438 183 -136 -367 -417 -330 -47 263 414 417 189 -132 -361 -432 -329
5462 -329 -15 289 428 408 159 -138 -342 -445 -277 -26 272 460 411 162 -153 -361 -438 -277 12 284 455
5483 455 385 160 -162 -401 -432 -270 15 268 431 383 151 -141 -393 -413 -276 18 291 433 388 149 -183 -394
5505 -394 -452 -283 18 256 427 393 139 -205 -387 -412 -282 39 325 431 343 138 -185 -367 -388 -260 52 300
5527 300 429 334 114 -194 -386 -409 -267 68 334 460 351 126 -180 -396 -409 -241 63 327 414 363 105 -173
5549 -173 -377 -390 -228 75 332 430 338 71 -218 -418 -385 -224 64 345 430 301 86 -191 -420 -439 -206 59
5571 59 339 432 318 61 -208 -385 -398 -228 47 315 393 321 58 -220 -408 -402 -186 83 337 454 330 30
5593 30 -235 -395 -393 -170 134 342 402 306 59 -230 -412 -330 -168 133 331 409 297 42 -234 -405 -397 -159 122
$$ packed form
5439D24k16l45k40m5N8L20L01J63J8k55l19k31n0Q7K83L10J51Lk28l21k29p1J03
5462c29L14L04J39k0k49k97k04j03J68K51K98J88m9k49l15k08p7J61K89K72J71
5483D55p0k25l22k39l1J62K85K53J63m8k32k92k52k0J37K94K73J42m5k39l32k11
5505c94n8J69L01K38J71l4k54l44j82k5J30L21K86J06q8k05l23j82k1J28L12K48
5527C00J29r5k20l08j92k3J42L35K66J26j09k25l06k16j3J68L04K64Q7n1k58k78
5549a73k04j3J62L03K57R8r2k67k89k00L3J61K88K81Q5j29k15k77k29j9K33K65
5571E9K80R3j14k57k69j77j3J70K75K68P8p2k63k78j88OK16K69K54J17j24l00
5593C0k65j60KK23L04K08O0r6k47k89j82Q2J62L01J98P8j12k55k76j71QK38K81
$$ plain form
5616 122 338 406 284 3 -258 -394 -359 -165 132 338 407 271 33 -230 -412 -369 -142 129 342 421 247 -9
5638 -9 -271 -385 -347 -108 147 350 384 258 9 -245 -382 -322 -98 178 379 354 264 -4 -250 -411 -345 -118 172
5661 172 364 407 257 -12 -262 -418 -306 -111 163 333 380 234 -25 -272 -389 -320 -91 176 379 343 216
5682 216 -26 -281 -409 -372 -105 194 352 363 227 -66 -272 -386 -307 -84 184 349 382 221 -42 -273 -370 -298
5704 -298 -76 192 371 410 220 -89 -303 -387 -304 -72 191 362 361 184 -70 -286 -358 -316 -76 197 376 390 172
5727 172 -95 -316 -390 -284 -54 223 357 342 207 -85 -281 -376 -272 -49 173 320 320 178 -94 -323 -385 -271
5749 -271 -18 221 352 347 152 -83 -329 -382 -261 -9 211 400 373 160 -112 -308 -382 -236 15 245 368 345
5771 345 123 -117 -315 -367 -257 1 223 384 339 136 -122 -324 -359 -249 2 214 375 354 97 -108 -332
$$ packed form
5616A22K16O8j22k81k61j36L5J94K97K06O9j36k38k63j82M3K27K71K13P9j74k56
5638ik62j14L8K39K55K03L4j26k49k54j37O0K24K76K01k5r0k68k46j61O6K27K90
5661A72J92M3j50k69k50j56J12J95K74J70M7j46k59k47j17O9K29K67K03l6j27
5682B16k42k55j28L7K67K99J58J1j36k93k06j14P9K23K68J65L3j61k63k31r7P2
5704b98K22K68J79L9j90l09k14q4Q3K32K63J71jj77k54k16p2M2K40K73J79J4k18
5727A72k67k21p4J06K30K77J34j5j35k92j96r5J04K23K22J47%j42k72k29o2J14
5749b71K53K39J31nj95k35k46n3J21K52K20J89k7k13k72j96p4J46K51K30J23k3
5771C45k22k40j98n2J10K58K22J61m5k03k58k02l5J10K51K12J61k1k57k05k24
$$ plain form
5792 -332 -373 -270 -10 241 355 290 123 -110 -350 -377 -238 -9 237 381 283 89 -157 -324 -367 -200 2 259
5814 259 360 313 77 -129 -330 -358 -227 25 260 353 284 125 -161 -339 -338 -200 -4 282 389 300 113 -164
5836 -164 -336 -333 -192 68 269 381 294 97 -165 -340 -352 -184 32 283 372 251 56 -175 -335 -330 -198 77
5858 77 289 342 234 54 -175 -356 -350 -195 43 285 367 230 30 -162 -339 -335 -143 53 296 360 235 56 -153
5881 -153 -326 -307 -164 101 300 384 283 59 -164 -309 -291 -149 75 278 348 244 53 -184 -354 -314 -150 107
5903 107 291 340 245 39 -196 -325 -315 -149 89 279 325 233 1 -224 -320 -298 -119 132 264 351 209 10 -223
5926 -223 -314 -313 -131 119 260 330 224 17 -232 -330 -269 -114 115 321 348 229 15 -213 -302 -255 -71 130 321
5949 321 344 215 -16 -229 -322 -282 -89 142 297 339 198 -39 -268 -367 -310 -87 122 279 310 210 -22 -251
$$ packed form
5792c32m1J03K60K51J14o5j67k33k40k7J39K29K46J44r8j94k46j67m3J67K02K57
5814B59J01m7k36k06k01k8J31K52K35R3o9j59k86j78JJ38J96K86J07q9j87k77
5836a64j72LJ41K60K01J12q7j97k62j75j2J68K16K51Q9j21j95k31j60NJ32K75
5858G7K12N3j08j80k29j81OJ55K38K42Q2j37k00j92j77MJ92J96K43O4j25j79k09
5881a53j73J9J43K65J99Q4j01k24k23j45J8J42K24K03P0j04j91k37j70M0J64K57
5903A07J84M9r5k06k35j29J0J66K38J90M6r2k32k25r6K2J79K51J32Q7j42j99k33
5926b23r1JJ82K50J41P0j06k07k49r8O1J55K29K06K7j19k14k28q9M7J84K01J91
5949C21K3j29k31k13r3M0J93K31J55M2j41k37k29r9N7K23K09J57L1j00k32k29
$$ plain form
5971 -251 -349 -258 -74 137 312 315 182 -27 -242 -325 -273 -60 178 310 338 147 -42 -230 -335 -265 -84 163 309
5994 309 314 198 -32 -251 -328 -251 -56 177 289 295 180 -26 -245 -326 -242 -79 179 341 302 159 -41 -231 -300
6017 -300 -239 -48 177 337 310 153 -75 -218 -312 -264 -50 189 322 262 133 -82 -248 -306 -230 -36 196 319
6039 319 315 127 -72 -246 -314 -211 -16 183 320 298 132 -48 -242 -280 -221 -44 187 302 301 126 -83 -231 -307
6062 -307 -210 -13 212 299 262 133 -98 -257 -303 -207 14 192 311 284 113 -73 -278 -312 -199 -30 223 313 263
6085 263 99 -107 -240 -283 -186 -14 213 300 271 69 -119 -308 -313 -177 13 185 296 268 89 -123 -268 -281 -140
6108 -140 12 228 316 275 101 -116 -230 -297 -178 31 222 317 269 97 -105 -246 -291 -168 66 222 309 241 84
6131 84 -124 -271 -266 -144 33 230 300 221 82 -154 -283 -310 -156 52 221 307 255 42 -155 -299 -288 -159 16
$$ packed form
5971b51r8R1J84K11J75Lj33k09k15q3N2K13K38J32K8j91j89j88j05P0J81K47J46
5994C09Nj16k30k19p7P7J95K33J12Oj15k06k19q1Q4J63K58J62l9j43k00j90o9
6017c00O1J91K25J60k7j57k28j43r4M8K14K39J33o0j29k15j66n8P6J94K32J23
6039C19mj88j99j74o8J03J95J99J37k2j66j80j94l8N9J77K31J15jj75k09j48p6
6062c07R7J97K25Q7l7j29k31j59m6R6K21J78J19k7j71j86k05l4J13J69K53R0n0
6085B63j64k06j33m3R7J72K27Q7k9k02j88j89nJ36J90J72J11k8j79k12j45j3J41
6108a40J52K16Q8m1j74k17j14o7J19K09J91R5m8j72k02j41m5J23K34J56Q7o8j57
6131H4k08j47NJ22J77J97P0p9j39k36j29k7J54K08J69Q6n2k13j97j44J1J29J75
$$ plain form
6154 16 229 288 242 49 -164 -305 -263 -146 45 248 281 251 38 -141 -324 -275 -132 55 252 280 217 50 -145
6177 -145 -256 -260 -133 98 231 280 195 61 -143 -279 -242 -117 90 236 303 206 52 -159 -260 -231 -122 73 213
6200 213 298 176 4 -158 -292 -241 -125 69 238 252 185 17 -179 -222 -259 -91 88 219 278 195 27 -176 -282
6223 -282 -257 -117 105 259 283 195 25 -170 -246 -217 -66 103 248 287 192 11 -164 -257 -209 -83 144 217 268 199
6247 199 0 -177 -274 -238 -86 148 247 276 163 -1 -179 -254 -225 -75 119 242 264 149 -30 -168 -256 -210 -59
6270 -59 103 230 255 138 -21 -178 -275 -214 -58 129 247 270 148 -10 -171 -267 -200 -78 139 279 252 170 -29
6293 -29 -200 -261 -225 -90 120 225 286 142 -15 -194 -283 -211 -19 132 254 250 126 -41 -221 -231 -195 -54 127
6316 127 250 269 147 -59 -211 -267 -193 -27 142 244 223 139 -69 -207 -260 -207 -25 124 266 219 130 -71 -198
$$ packed form
6154A6K13N9m6j93k13j41M2J17J91K03L3l0k13j79j83M9J43J87J97K8o3j67j95
6177a45j11mJ27K31J33M9q5j34k04j36L7J25K07J46O7r7j54k11j01K9J09J95J40
6200B13Q5j22j72j62j34N1J16J94J69J4o7j68j96m3l7J68J79J31N9q3j68k03j06
6223b82K5J40K22J54K4q8j70j95p6K9J51J69J45L9r5j81j75r3M8J26K27P3N1o9
6247A99j99j77r7L6J52K34R9K9j13j64j78p5K9J50J94J23K2j15j79j38q8M6J51
6270e9J62J27K5j17j59j57r7O1J56J87J18K3j22j58j61r6O7J22K17J40k7q2j99
6293b9j71o1L6J35K10J05O1j44j57j79q9P2J92J51J22mj24j67j80j0L6J41J81
6316A27J23J9j22k06j52n6P4J66J69J02k1q4k08j38n3N3J82J49J42m7q9k01j27
$$ plain form
6339 -198 -251 -163 -23 140 267 232 121 -46 -215 -236 -202 0 178 247 239 125 -58 -197 -224 -156 -13 164 272
6362 272 229 124 -69 -217 -240 -194 1 140 236 243 114 -90 -226 -270 -188 -2 140 244 230 73 -109 -221 -264
6385 -264 -166 4 156 283 212 59 -89 -233 -262 -137 -10 200 243 224 90 -75 -220 -242 -138 42 175 274
6407 274 219 48 -75 -198 -241 -145 43 181 235 203 79 -65 -189 -195 -127 41 176 263 169 58 -80 -214 -216 -159
6431 -159 33 170 231 197 28 -91 -212 -234 -139 2 167 243 180 55 -113 -241 -216 -119 31 163 260 174 45
6454 45 -126 -210 -222 -83 41 190 216 193 18 -122 -238 -208 -93 62 209 218 197 39 -105 -230 -219 -105 76
6477 76 192 254 164 28 -101 -217 -215 -86 76 194 214 169 37 -110 -239 -217 -77 55 178 232 137 18 -175
6500 -175 -214 -190 -111 72 181 242 150 6 -138 -243 -198 -69 82 221 228 185 13 -133 -213 -194 -84 96 209 242
$$ packed form
6339a98n3Q8J40J63J27l5j11j67j69k1L4K02J78O9qj14j83j39k7O8J43J77J08
6362B72m3j05j93j48k3M6J95J39R6Pj29k04j36m4Q2J86J42J04j4j57j82j12m3
6385b64R8J70J52J27p1j53j48j44k9J25J27K10M3j9j34j65j45k2J04J80J33R9
6407B74n5j71j23j23m3R6J88J38N4l2j24j44j24oO8J68J35Q7r4j11j38j34kN7
6431a59J92J37O1l4j69j19j21k2R5J41J65P6o3j25j68j28K5R7J50J32R7q6j29
6454D5j71q4j2J39J24J49K6k3j75j40j16L0J15J55J47Rk1j58j44j25J1J14J81
6477G6J16O2r0j36j29j16KJ29J62J18K0m5j32j47j29K2J40J32J23N4r5j19j93
6500a75l9K4P9J83J09O1r2j44j44j05M5J29J51J39Pm3j72j46q0J9J10J80J13L3
$$ plain form
6524 242 163 18 -144 -183 -186 -83 93 195 233 170 12 -146 -195 -159 -63 85 209 256 137 33 -120 -218 -171 -38
6548 -38 57 201 202 139 -32 -157 -229 -191 -70 73 200 196 107 -37 -151 -183 -175 -52 74 208 202 118 -28 -158 -220 -204
6574 -204 -68 79 206 215 121 -18 -136 -205 -168 -51 103 211 207 112 -41 -137 -226 -167 -36 132 203 195 134 -34 -144
6599 -144 -214 -138 -43 105 228 223 140 -66 -147 -221 -144 -43 108 161 168 97 -47 -159 -203 -155 -43 112 186 178 107 -54
6625 -54 -175 -236 -155 -12 106 219 174 105 -70 -191 -198 -140 -27 120 210 183 101 -29 -148 -201 -125 40 154 212 197
6650 197 109 -40 -164 -201 -148 -39 145 207 199 73 -61 -146 -186 -106 35 104 196 184 62 -74 -157 -174 -114 -13 117
6675 117 194 191 48 -67 -195 -171 -155 -9 152 176 174 81 -38 -188 -196 -137 15 113 213 172 62 -73 -184 -223 -94
6700 -94 23 166 200 155 51 -62 -159 -163 -81 43 158 202 172 44 -53 -164 -191 -112 34 140 180 190 42 -91 -160
$$ packed form
6524B42p9j45j62l9lJ03J76J02L8o3j58j58m9L6R6J48J24M7j19j04j53r8M7J33
6548c8R5J44Jo3j71j25p2L8J21J43J27mq9j44j14l2QJ23J26J34oq4j46j30o2J6
6574b04J36J47J27Rr4j39j18o9L7J17J54J08mr5j53r6q9N9J31J68P1qo1j68j10
6599a44p0P6R5J48J23nq3k06q1p4P7J01J51N3Pp1j44j12m4M8J12J55P4qp1j61
6625e4j21o1Q1J43J18J13m5o9j75j21pN8J13J47R0k7q2j30j19n3P6J65J14N8j5
6650A97q8j49j24l7N3J09J84O2qj26j34q5m0Q0J41O9R2j2j22j36q3j7O0J01J30
6675A17P7lj43j15j28K4J6J46J61K4kr3j19j50qN9J52R8J00m1j10j35j11l9J29
6700i4J17J43L4m5j04j13r7mQ2J24J15M4l0j28r7j11k7P9J46J06M0J0j48j33o9
$$ plain form
6725 -160 -196 -123 24 130 160 188 70 -103 -200 -195 -97 30 153 173 113 23 -94 -166 -187 -98 45 135 150 118 0 -97
6751 -97 -162 -166 -87 48 144 209 133 43 -74 -176 -170 -91 64 143 195 169 22 -77 -139 -158 -78 41 163 213 139 17 -80
6778 -80 -153 -122 -99 39 147 176 107 0 -92 -173 -171 -87 26 161 170 138 18 -128 -177 -162 -70 65 144 158 124 13 -99
6805 -99 -172 -151 -39 81 151 168 123 14 -86 -179 -132 -39 55 142 177 122 14 -108 -187 -110 -12 80 155 186 115 13 -114
6832 -114 -185 -128 -39 61 149 180 121 -6 -106 -174 -135 -63 71 125 136 102 -12 -134 -149 -151 -51 65 114 174 100 -14
6858 -14 -115 -167 -152 -31 88 136 165 93 -47 -114 -181 -160 -68 73 175 196 116 -19 -130 -155 -113 -1 90 154 182 75
6884 75 -13 -105 -156 -105 0 84 190 183 77 -24 -110 -201 -98 -23 77 179 189 68 -35 -123 -161 -145 -40 71 159
6909 159 129 63 -13 -142 -169 -107 -14 106 179 120 43 -16 -143 -131 -94 3 89 146 170 79 -42 -118 -169 -108 0 103 137
$$ packed form
6725a60l6P3J47J06L0K8j18j73r7NR8J27J23K0o0r0j17p2k1Q9J43R0J5l2j18r7
6751i7o5mP9J35R6O5p6r0j17j02OP9J55P9N2k6j47r9o2j9Q0J19J22N0p4j22r7
6778h0p3L1K3J38J08K9o9j07r2q1KQ4J13J35Rl2j20j46m9J5R2J35P9J4l4j11j12
6805i9p3K1J12J20P0J7m5j09j00r3M7R3R4Q7L5n5j08j22p9P7R8R2P5L1p1j02j27
6832a14p1N7Q9J00Q8L1n9j27j00o8L9P2J34N4J1l4j14j22j5kJ00J16M9O0p4j14
6858a4j01n2J5J21J19M8K9p2j40o7o7K1R2J41J02K1q0j35j11k5M2J12R1O4K8j07
6884G5q8r2n1N1J05Q4J06pj06j01q6r1J03P5J00J02J0j21j03q8l8J6J05J11Q8
6909A59l0o6p6j29k7O2R3J20P3n9p7n9j27J2L7R7Q6N7K4r1j21p6n1O1J08J03L4
$$ plain form
6936 137 151 63 -41 -104 -163 -113 -9 122 174 177 91 -22 -91 -132 -86 6 137 177 138 61 -44 -136 -152 -106 15 119
6962 119 118 148 36 -34 -137 -130 -107 7 64 93 122 5 -60 -128 -138 -97 12 109 132 117 27 -42 -133 -132 -107 13 98 157
6990 157 124 37 -31 -139 -121 -84 -24 72 169 107 61 -56 -117 -149 -82 21 117 159 153 25 -74 -132 -118 -76 17 109 145 118
7018 118 23 -84 -140 -145 -77 22 116 151 105 38 -76 -154 -128 -81 43 74 142 131 24 -39 -148 -149 -67 15 84 143 106 24
7046 24 -50 -121 -144 -52 25 105 126 119 27 -73 -115 -160 -79 51 129 146 124 34 -31 -101 -147 -29 42 134 155 82 14 -81 -119
7075 -119 -115 -67 54 119 117 96 43 -84 -128 -129 -53 25 94 110 75 -46 -121 -124 -119 -53 33 104 123 89 12 -79 -118 -124 -26 49 111
7106 111 138 113 -17 -97 -103 -85 -8 39 144 132 89 20 -96 -126 -64 16 69 113 141 115 -7 -101 -125 -90 -33 72 116 139
7134 139 86 -14 -87 -149 -131 -44 42 129 118 88 11 -95 -135 -109 -41 63 118 133 41 5 -122 -134 -137 -44 64 117 110 89
$$ packed form
6936A37J4q8j04o3n9N0J04J31N2Lq6j13o9m1M6R2J31M0l9p7j05r2j6M6J21J04
6962A19jL0j12p0j03PK3J14N7K9K9j17o5o8j0M1J09R7K3j5r0o9r1JK5J20Q5N9
6990A57l3q7o8j08J8L7O0R6R7o2m6j17o1l2O7J03R6M2oj28r9n8J4M2R3R2L6k7
7018A18r5j07n6nO8R9R4L5m6o7j14p8K6M7J24L1O8j1j07o3j09jQ2Q2O9N9l7q2
7046B4p4p1k3R2P7Q0K1pr2j00m2m5Q1J30P8J7k2r0o5p0m6J18P1R2K1p3o8r5l8
7075a19MM8J21O5kk1n3j27m4jP6P8O9J6l5j21p5lNO6Q6P1J9l4p7r1l9oR8P5O2
7106A11K7k5j30q0oJ8P7M7J05j2m3o9j16l0O2Q0N3M4K8k6j22r4k4L5N7J05M4K3
7134A39n3j00p3o2J8Q7Q6Q7j1l0p7j06m0K6O8J04N5J5r2l6j27j2lR3J08N3pk1
$$ plain form
7162 89 -3 -101 -129 -108 -20 65 124 113 57 -31 -111 -154 -96 -17 63 104 131 82 -5 -93 -89 -99 -13 66 106 129 48 -20 -99 -99 -79
7193 -79 -28 34 98 96 63 -46 -87 -116 -92 -32 76 94 96 50 -30 -117 -138 -85 -31 51 112 90 84 -36 -89 -109 -82 -24 64 103
7223 103 105 37 -34 -104 -82 -59 -33 91 124 130 51 -8 -117 -135 -76 -10 58 121 121 65 4 -80 -94 -51 -18 80 112 105 45 -27 -99
7254 -99 -104 -90 -7 62 121 98 20 -37 -105 -91 -108 14 94 104 82 5 -44 -126 -137 -47 2 67 102 99 7 -68 -114 -105 -55 8 66
7285 66 122 83 32 -53 -92 -99 -47 23 99 109 94 35 -40 -112 -65 -34 17 105 123 85 4 -48 -124 -105 -69 29 87 110 75 19 -63
7316 -63 -121 -111 -55 -1 74 112 64 -3 -71 -86 -114 -46 7 103 97 64 -1 -77 -83 -96 -49 3 94 93 86 -2 -62 -112 -101 -34 19 85
7348 85 87 96 38 -50 -75 -73 -42 67 91 133 70 6 -41 -92 -95 -37 63 105 140 80 -14 -71 -106 -94 -23 35 91 94 66 1 -70 -90
7380 -90 -102 -31 16 67 118 64 -15 -87 -88 -94 -37 19 36 133 56 -22 -72 -101 -87 -53 35 76 127 59 22 -48 -92 -70 -4 76 74 97
$$ packed form
7162H9r2r8k8K1Q8Q5N9j1n6q8q0m3N8P9Q0M1K7m9q7q8Mj0Q6P9M0K3q1o8p9%K0
7193g9N1O2O4kl3j09m1k9K4O0J08J8Km6q0q7k1N3N4Q2O1k2oj20n3k0K7N8Q8L9
7223A03Ko8p1p0K2K3K6J24L3Op9n9j09j8N9O6O8O3%n6o1q4j4M3L3R8L2po0p2p2
7254i9nJ4Q3O9N9k3p8n7o8J4j7J22Q0J0k2p7m9q2j1R0M9O5L5lr2p5m6RN0O3N8
7285F6N6l9n1q5l9pN2P0P6J0j5n9p5p2M7L1N1Q8J8l8q1n2p6J9L6R8N8K3l5n6q2
7316f3n8J0N6N4P5L8m8o7o8j5k8O8N3R6ol3o5p6oj3M7N2R1jpq8o0n0J1O7N3O6
7348H5KRn8q8k5KL1J09K4M2o3o4m7n1lN8J00M2L5o0r4n7l5J2P1N8N6Lk8o5p1k0
7380i0j2P1M7N1N1n4p9p2joN7N6J7R7p7p8n0k9J4L4Q8M1N1o8l7p0m4K2O6Q0kK3
$$ plain form
7412 97 70 -6 -76 -85 -42 4 34 91 111 60 4 -46 -96 -52 -46 49 90 93 65 -18 -52 -91 -57 -25 52 61 79 44 -25 -78 -94 -80
7444 -80 -16 28 64 87 40 -5 -61 -102 -94 -26 53 117 77 56 -20 -54 -91 -49 -20 73 85 81 48 -11 -56 -93 -44 3 11 76 89 53
7476 53 -11 -59 -95 -62 7 70 68 98 45 -20 -75 -66 -62 11 52 89 80 59 -16 -91 -104 -86 5 14 68 76 50 -14 -73 -96 -65 -37 32
7509 32 54 69 47 -23 -63 -85 -61 22 70 50 97 43 -34 -48 -78 -51 -11 49 116 62 44 -22 -77 -82 -51 34 76 75 85 13 -7
7540 -7 -85 -86 -51 14 45 60 74 15 -29 -55 -66 -61 -42 52 89 82 4 -52 -66 -95 -71 2 46 97 77 9 -24 -76 -64 -43 -5 79
7572 79 88 75 22 -48 -65 -73 -50 9 60 79 70 22 -14 -49 -86 -26 21 54 39 47 63 -16 -85 -45 -5 29 68 81 65 5 -26 -59
7604 -59 -55 -52 47 40 72 37 -5 -25 -85 -55 -26 10 48 56 42 0 -46 -84 -57 -57 -20 54 86 51 -1 -33 -69 -58 -13 39 70 67 87
7637 87 33 -62 -57 -79 -16 39 76 106 36 21 -14 -57 -48 11 29 70 73 49 21 -31 -66 -53 -12 29 96 74 33 20 -14 -79 -75 -21
$$ packed form
7412I7k7p6p0rM3M6L0N7K0n1n6n0n0M4OR5M1Lk8q3l4l9L4L2P7RJ8l5o9n3j6J4
7444h0O4M4L6K3m7m5n6m1QO8P9O4m0k1p6l4l7M2K9R3J2ml3n9m5l7M9M7QO5J3l6
7476E3o4m8l6L3O9O3kL0n3o5n5RMP3M1L7rk1p5p5j3J8R1RN4Qk6o4n9k3L1K8O9
7509C2K2J5k2p0m0k2K4Q3M8k0M7n4p7j4l0K7M0O0O7n4j8o6n5nL1Q5M2jJ0p2k0
7540gp8jL5O5L1J5J4n9m4k6j1NJ9R4L7pp8n6j4k9K4P3M4N1k0o8l3n2J2K1L8Q4
7572G9Rj3n3p0j7qK3N9N1J9rm8l6l5l7O0M7L3j5QJ6p9o9M0M0L4L9J3j6o0l1l3
7604e9MLR9pL2l5m2k0o0L0K9L6L8Qj4m2m6l8K7%L7P4L2l5n2l2l6J1M5N2L1lK0
7637H7n4r5Nk2O3N5L7L0p0j5l5m3RN9J8M1Lk4k8n2l5J3M1M1O7k2m1j3l4o5MN4
$$ plain form
7669 -21 44 62 61 68 14 -24 -48 -82 -16 36 60 48 35 -29 -24 -73 -57 -50 2 54 70 35 -14 -29 -67 -68 -34 64 59 100 48 9 -29
7702 -29 -83 -70 21 26 53 90 71 2 -13 -52 -39 -4 18 53 68 57 6 -34 -74 -53 -4 -1 52 71 29 -6 -72 -69 -65 -32 3 26
7734 26 46 19 -28 -55 -76 -40 20 21 50 66 35 -5 -46 -69 -65 -30 11 87 38 30 -25 -28 -78 -50 -12 19 56 71 43 -10 -51 -25
7766 -25 -38 3 18 90 74 44 -1 -45 -60 -62 -8 72 54 42 15 19 -67 -72 -14 -17 41 51 54 28 -20 -54 -78 -38 -19 35 53 55 47 -19
7800 -19 -53 -83 -37 -35 25 55 54 31 -43 -51 -54 -50 0 60 71 50 41 -26 -40 -51 -24 24 47 59 75 22 -26 -31 -51 -33 -2 47 72 44
7834 44 10 -17 -51 -64 -37 2 32 44 42 3 -2 -48 -75 -55 3 33 54 33 -4 -44 -56 -51 -63 5 40 27 5 11 -8 -39 -41 -57 -20
7867 -20 16 59 37 1 -10 -50 -59 -26 2 58 51 68 36 1 -51 -27 -28 16 42 69 66 42 -13 -43 -49 -8 3 38 57 35 -17 -14 -42
7900 -42 -52 -34 -32 -3 34 49 -15 -35 -43 -89 -50 -6 30 68 18 -4 -39 -61 -56 -47 -8 12 26 7 -25 -3 -58 -50 -66 23 56 37 59
$$ packed form
7669b1O5J8jPn4l8k4l4O6N2K4j2j3o4Nm9J6PN2N2J6l5m9j5l8jL4R8nM1n2l9l8
7702b9n4J3R1NK7L7j9o9j5l9J3L5K2L5J5j1n1m0m0K1M9LN3J9m2l5o6LML3L5K3
7734B6K0k7m7k7k1L6O0JK9J6l1m0m1k3ML5M1P6m9qn5ln0K8L8L1L7J5k8n3m1K6
7766b5j3M1J5P2j6l0m5m4j5kN4Q0j8j2k7Mq6nN8lN8J0Lk6m8l4k4M0J9N4J8Kqo6
7800a9l4l0M6KO0L0jk3p4qlMN0O0J1k1ro7j4j1K7M8K3J2J6n3m8nk0J8L1M9K5k8
7834D4l4k7l4j3K7L9L0J2kl9nm6k7K0N8L0K1k1l7m0j2Nj2O8L5j3k2Oj9l1kj6L7
7867b0L6M3k2l6j1m0rL3K8N6pJ7l2l5n2K4jM4K6K7lk4n5l0oM1J1L5J9k2n2Lk8
7900d2j0J8KK9L7J5o4k0qm6L9M4L6L8n0k2l5k2NRL9K0J4j9l2K2n5Qj6Q9L3j9K2
$$ plain form
7933 59 22 -8 -40 -18 -13 44 77 39 23 5 -20 -67 -24 -31 -8 6 47 38 -5 -10 -60 -63 -44 7 56 14 25 3 -6 -82 -47 -17 3
7966 3 9 25 -5 -22 -49 -40 -82 -34 22 18 51 43 16 -48 -40 -20 -36 2 20 60 7 2 -46 -48 -25 -14 18 50 42 28 -1 -30 -18 -31 -20
8001 -20 42 56 62 28 -4 -53 -39 -29 5 36 38 37 25 15 -33 -59 -31 13 0 50 14 40 -30 -35 -52 -34 -54 -11 45 23 31 -28 -55
8034 -55 -40 -30 -16 20 29 62 30 -6 -33 -50 -14 -15 28 35 43 36 7 -45 -20 -30 -11 24 52 41 15 11 -34 -47 -6 11 -3 36 27 18
8068 18 40 -62 -55 -6 31 52 23 80 -8 6 -36 -61 -42 -19 27 5 3 6 -1 -17 -54 -47 -19 -24 31 38 -5 -35 -46 -82 -27 -24 34 23
8102 23 36 13 2 -6 -37 -19 3 27 51 43 32 15 -37 -28 5 22 33 39 29 4 23 -24 -18 -14 -29 -2 37 33 13 31 -26 -5 -39 4
8136 4 12 61 35 -19 8 -61 -37 -51 6 -8 53 22 -18 -43 -50 -34 -42 19 26 62 28 2 -21 -14 -66 -36 8 -8 38 33 24 -15 -30 -16
8170 -16 -27 14 41 47 45 27 17 -28 -39 -5 -6 16 33 33 8 4 -18 -26 -25 -18 -6
$$ packed form
7933E9l7l0l2K2NN7L3l8j6j8k5m7M3pK3J4M1rm3nn0lJ9N1M9m2J1k2rp6L5L0K0
7966COJ6l0j7k7Rm2M8N6mL3qk7o4QK0j6L8J8M0n3nm8kK3J1L2L2qj4k9k9J2j3J1
8001b0O2J4Ol4l2m9J4J0L4L1Kjj2j0m8k6K8M4j3N0l6K6p0nj7J8k0M3N6k2Qn9k7
8034e5J5J0J4L6RL3l2l6k7j7L6jM3PQpk9n2K5j0J9L5K8j1k6mm5j3M1J7j4L9rr
8068A8K2j02PM9L7K1k9N7q8J4m2k5J9K3M6k2kLpj6l7PK8nN5Pm3l0j1l6N5LN8j1
8102B3J3k3j1ql1J8K2K4K4qj1j7n2RL3J7J1Oj0k5J9m7OMj5K7L9mk0J8n7K1l4M3
8136DQM9k6n4K7o9K4j4N7j4O1l1m0k5pJ6qO1PL6l4k6k3Pn2L0M4j6M6nrl9j5J4
8170a6j1M1K7Okj8j0m5j1L4jK2J7%k5mk2qJPJ2
8191f
$$ Imaginary data points
##PAGE= N=2
##DATA TABLE= (X++(I..I)), XYDATA
$$ plain form
0 0 0 0 0 0 0 0 0 0 0 0 0 0 -1 1 -8 8 -8 8 -8 11 -16 16 -18 24 -25 31 -33 39 -42 49 -56 62 -70 78 -86 96 -106
37 -106 119 -133 146 -162 178 -198 221 -241 271 -300 334 -374 418 -471 534 -610 709 -832 1001
56 1001 -1242 1622 -2301 3892 -15510 18896 94040 112951 86054 13460 -61188 -110042 -104015
69 -104015 -51319 27382 91055 113174 80384 11099 -64219 -107943 -101426 -46301 29561 91879
81 91879 109932 76633 6937 -65218 -106719 -97348 -42507 32299 91258 107169 72270 3778
93 3778 -66292 -104653 -93628 -38434 34325 90665 103939 68218 598 -66891 -102559 -89727
105 -89727 -34795 36219 89784 100800 64320 -2185 -67280 -100366 -86055 -31306 37796 88752
117 88752 97694 60663 -4720 -67471 -98204 -82561 -28186 39082 87679 94757 57263 -6911
$$ packed form
0@%%%%%%%%%%%%jKrJ6j6J6j6J9k7L2l4M2m9N6o4P2q1R1j05J18j32J48j64J82k02
37a06K25k52K79l08L40l76M19m62N12n71O34p08P92q89J005j144J319j541J833
56A001k243K864l923O193j9402L4406P5144J8911k6897p2594p4648m8854O027
69a04015N2696P8701O3673K2119l2790o9285p5318m3724O517N5125P5862O2318
81I1879J8053l3299o9696p2155m1501R371N4841P4806N8959J5911l4899o8492
93C778p0070l8361J1025N5194P2759N6340J3274l5721o7620o7489l5668J2832
105h9727N4932P1014N3565J1016l6480o6505o5095l3086J4311N4749O9102N0956
117H8752Q942l7031o5383o2751l0733J5643N4375O7268M8597P078l7494o4174
$$ plain form
129 -6911 -67498 -96042 -79267 -25373 40143 86462 91870 54067 -8889 -67369 -93906 -76169
141 -76169 -22731 41065 85256 89166 51124 -10690 -67140 -91837 -73234 -20350 41783 84007
153 84007 86558 48432 -12188 -66809 -89824 -70505 -18227 42359 82752 84117 45946 -13557
165 -13557 -66460 -87914 -67940 -16193 42863 81562 81787 43578 -14860 -66080 -86044 -65469
177 -65469 -14294 43362 80404 79498 41282 -16105 -65679 -84215 -63099 -12470 43758 79217
189 79217 77335 39130 -17237 -65285 -82474 -60837 -10763 44092 78097 75222 37047 -18338
201 -18338 -64865 -80768 -58651 -9111 44497 76954 73154 35020 -19366 -64453 -79125 -56528
213 -56528 -7521 44774 75879 71217 33080 -20349 -64037 -77517 -54476 -5994 45116 74828
$$ packed form
129f911o0587k8544J6775N3894O5516M6319N408l7803o2956n8480k6537J7737
141g6169N3438O3796M4191L910l8042o1814n6450k4697J8603N2884O2133M2224
153H4007K551l8126o0620n4621k3015J9319N2278O0586M0393J365l8171n9503
165a3557n2903k1454J9974N1747N9056L8699K25l8209n8438n1220j9964K0575
177f5469N1175N7656L7042r06l8216n7387m9574j8536K1116N0629N6228L5459
189G9217j882l8205n6367m8048j7189K1637N0074N4855L4005k875l8175n5385
201a8338m6527j5903K2117M9540N3608L2457l800l8134n4386m5087j4672K2597
213e6528M9007N2295L1105m662l8137n3429m3688j3480K3041M8482N1110K9712
$$ plain form
225 74828 69276 31221 -21332 -63642 -75963 -52482 -4492 45380 73803 67415 29421 -22214
237 -22214 -63284 -74450 -50548 -3054 45684 72822 65590 27658 -23165 -62890 -72942 -48711
249 -48711 -1637 45921 71839 63833 25859 -24037 -62536 -71475 -46828 -270 46235 70882
261 70882 62074 24177 -24948 -62214 -70083 -44991 1112 46528 69950 60375 22462 -25853 -61887
274 -61887 -68692 -43169 2528 46830 69056 58658 20758 -26749 -61573 -67292 -41372 3902
286 3902 47151 68165 57007 19116 -27584 -61203 -65957 -39637 5183 47413 67276 55392
298 55392 17525 -28404 -60882 -64600 -37952 6467 47674 66327 53782 15948 -29199 -60533
310 -60533 -63299 -36250 7680 47881 65434 52175 14428 -29972 -60167 -61981 -34624 8862
$$ packed form
225G4828n552l8055n2553m2310j2321K3481M7990M9872K8423o388l7994n1635
237b2214m1070j1166K3902M7494M8738K7138p232l7932n0823l9725j0052K4231
249d8711M7074M7558K5918q006l7974m9896l8499q939K4647M6558M6505K4647
261G0882q808l7897m9125l7266p869K5092M6103M5416K3422r575l7913m8315l6034
274f1887o805K5523M5697M4302K2226j0398l7900m7507l4824n719K5920M5274
286C902M3249K1014j1158l7891m6700l3619m754K6320M4820M2230J9863j1884
298E5392l7867m5929l2478l718K6648M4419M1207J8653j2545l7834m5147l1334
310f0533k766K7049M3930M0201J7553j3259l7747m4400l0195j814K7357M3486
$$ plain form
322 8862 48087 64559 50622 12980 -30679 -59796 -60666 -32976 10053 48284 63671 49062 11438
335 11438 -31407 -59417 -59355 -31352 11243 48432 62762 47490 9938 -32165 -59013 -58036 -29767
348 -29767 12424 48623 61883 45967 8498 -32822 -58604 -56722 -28146 13505 48736 60979
360 60979 44429 7104 -33481 -58180 -55454 -26663 14573 48848 60027 42939 5671 -34054
372 -34054 -57760 -54160 -25122 15616 48921 59113 41429 4345 -34658 -57311 -52905 -23603
384 -23603 16653 48960 58152 39950 3034 -35204 -56805 -51625 -22163 17578 48951 57249 38547
397 38547 1838 -35675 -56265 -50348 -20753 18487 48965 56324 37089 530 -36153 -55757
409 -55757 -49070 -19316 19411 48940 55348 35679 -719 -36610 -55243 -47827 -17894 20282 48867
$$ packed form
322H862L9225J6472j3937l7642m3659k9117q70K7690M3029L8231J5387j4609l7624
335A1438m2845k8010O2K8003M2595L7189J4330j5272l7552m2103k6848R77K8269
348b9767M2191L6199J3260j5916l7469m1320k5782J882K8576M1651L5231J2243
360F0979j6550l7325m0585k4699K726K8791M1236L4275J1179j7088l7268l9725
372c4054k3706L600K9038M0738L3305J0192j7684l7084l9003k2653M406K9302
384b3603M0256L2307R192j8202l6916l8238k1601N180K9462L9741L1373Q298j8702
397C8547l6709l7513k0590N917K9595L9240L0478P359j9235l6559l6683j9604
409e5757O687K9754L8727K9529O408j9669l6398l5891j8633P416K9933L8176K8585
$$ plain form
422 48867 54354 34239 -1903 -37020 -54711 -46555 -16553 21119 48779 53397 32899 -3004 -37379
435 -37379 -54140 -45376 -15278 21837 48649 52475 31559 -4105 -37758 -53583 -44110 -13976 22616
448 22616 48492 51482 30195 -5198 -38058 -52955 -42850 -12661 23412 48384 50530 28865
460 28865 -6260 -38375 -52330 -41613 -11317 24150 48210 49534 27505 -7342 -38660 -51735
472 -51735 -40397 -10100 24861 48038 48557 26205 -8379 -38897 -51122 -39147 -8851 25521
484 25521 47819 47563 24881 -9424 -39126 -50434 -37934 -7645 26144 47616 46579 23613 -10333
497 -10333 -39354 -49818 -36785 -6516 26735 47301 45597 22382 -11260 -39526 -49192 -35603
509 -35603 -5383 27285 47042 44646 21230 -12111 -39656 -48477 -34453 -4276 27807 46771
$$ packed form
422D8867N487k0115l6142l5117j7691Q156L0002L7672K7660M618k0498l5903l4375
435c7379j6761Q764L0098L7115K6812L826k0916l5664l3653j5825R473L0134L6592
448B2616K5876K990k1287l5393l2860j4897J0105L0189L6073K4972K146k1665
460B8865l5125l2115j3955J0717L0296L5467K4060J324k2029l4847l1318j3075
472e1735J1338L0297L4961K3177N19k2352l4584l0518j2225J1975L0296L4372
484B5521K2298k56k2682l4305k9702j1308J2500L0289L3789K1472j037k2966l3946
497a0333k9021j0464J3033L0269L3251K0566j704k3215l3642k8266r666J3589
509c5603L0220L2668J9757k396k3416l3341k7545q821J4024L0177L2083J8964
$$ plain form
521 46771 43678 20019 -12946 -39734 -47804 -33294 -3229 28324 46448 42700 18811 -13759 -39852
534 -39852 -47099 -32160 -2140 28775 46142 41691 17642 -14617 -39952 -46426 -30988 -1066 29274
547 29274 45824 40665 16457 -15447 -40037 -45702 -29888 -29 29701 45451 39714 15331 -16195
560 -16195 -40037 -44990 -28774 927 30073 45056 38751 14239 -16863 -40045 -44313 -27651 1893
573 1893 30486 44668 37804 13148 -17589 -40003 -43546 -26569 2848 30811 44284 36829 12069
586 12069 -18241 -39962 -42765 -25495 3721 31152 43871 35858 11010 -18887 -39888 -42072 -24416
599 -24416 4625 31437 43396 34892 9998 -19523 -39815 -41294 -23365 5516 31689 42951
611 42951 33908 8974 -20122 -39698 -40535 -22321 6328 31944 42488 32960 8005 -20652 -39556
$$ packed form
521D6771l093k3659l2965k6788q070J4510L0065L1553J8124l748k3889l2570k6093
534c9852p247J4939L0020L0915J7367m451k4049l2259k5335o474J5438K9922L0340
547B9274J6550n159k4208l1904k4590n665J5814K9859K9730J5750n737k4383l1526
560a6195k3842m953J6216K9701K9146J4983o305k4512l1102k3182m268J6662K9544
573A893K8593J4182o864k4656l0737k2414l543J6977K9417K7963J3473p455k4760
586A2069l0310k1721k803J7270K9216K7431J2719q013k4848k9897k1001k184J7656
599b4416K9041K6812J1959q504k4894k9521k0292j479J7929K8881K6173J1262
611D2951r043k4934k9096j9576q37J8214K8649K5616J0544r528k4955k8657j8904
$$ plain form
624 -39556 -39799 -21301 7162 32155 41973 32014 7009 -21168 -39414 -39008 -20281 7924 32325
637 32325 41493 31082 6088 -21699 -39215 -38247 -19277 8702 32506 41001 30132 5159 -22171
650 -22171 -39015 -37462 -18328 9442 32625 40462 29221 4286 -22609 -38833 -36700 -17333 10089
663 10089 32763 39939 28255 3382 -23049 -38616 -35959 -16311 10810 32870 39398 27376 2460
676 2460 -23500 -38340 -35129 -15386 11508 32935 38840 26406 1575 -23868 -38126 -34314 -14408
689 -14408 12156 33003 38256 25480 794 -24222 -37793 -33560 -13482 12791 33027 37689 24589
702 24589 -21 -24583 -37496 -32763 -12620 13383 33051 37125 23722 -774 -24865 -37203
714 -37203 -32001 -11730 13925 33017 36528 22848 -1511 -25131 -36893 -31249 -10975 14443 32971
$$ packed form
624c9556k43J8498K8463K4993R818r959k5005k8177j8246M06J8727K8205K4401
637C2325R168j0411k4994k7787j7516R68J8970K7979K3804Q495j0869k4973k7330
650b2171j6844J553J9134K7770K3183P837j1241k4935k6895j6224K133J9367K7422
663A0089K2674P176j1684k4873k6431j5567K657J9648K7121K2060O528j2022k4916
676B460k5960j4840L211J9743K6894K1427N905j2434k4831k5443j4258L812J9906
689a4408K6564K0847N253j2776k4686k5016j3571M233K0078K6273K0236M662j3100
702B4589k4610k4562j2913M733K0143K6003J9668M074j3403k4496k4091j2338
714c7203N202K0271K5655J9092L511j3680k4359k3620j1762N644K0274K5418J8528
$$ plain form
727 32971 35944 22021 -2214 -25354 -36523 -30512 -10152 14915 32895 35394 21205 -2898 -25559
740 -25559 -36194 -29724 -9357 15385 32848 34791 20362 -3572 -25766 -35820 -28985 -8583 15842
753 15842 32736 34221 19542 -4217 -25923 -35432 -28220 -7747 16286 32654 33614 18756 -4842
766 -4842 -26084 -35081 -27458 -6992 16697 32510 32989 17964 -5430 -26249 -34698 -26731 -6262
779 -6262 17085 32383 32385 17187 -6024 -26378 -34301 -26024 -5547 17439 32221 31795 16377 -6664
793 -6664 -26530 -33871 -25280 -4801 17821 32081 31153 15578 -7256 -26639 -33479 -24533 -4080
806 -4080 18199 31912 30536 14796 -7832 -26766 -33041 -23772 -3335 18601 31752 29946 13980
819 13980 -8432 -26857 -32612 -22982 -2547 18975 31594 29288 13165 -9031 -26969 -32166 -22179
$$ packed form
727C2971K973j3923k4235k3140j1169O011K0360K5067J7980K499j4189k4103k2661
740b5559j0635O470K0367K4742J7463J943j4429k3934k2194j0054O835K0402K4425
753A5842J6894J485j4679k3759k1706r509P212K0473K4033J6368R60j4858k3598
766d842k1242q997P623K0466K3689J5813M79j5025k3394k0819q449P967K0469
779f262K3347J5298Kj5198k3211k0354p923Q277K0477K2986J4782m26j5418k3041
793f664j9866p341Q591K0479K2622J4260r28j5575k2834j9383o840Q946K0453
806d080K2279J3713j376j5740k2628j8934o275R269K0437K1936J3151j806j5966
819A3980k2412j8425n755R630K0435K1522J2619k306j6123k2196j7938n197R987
$$ plain form
832 -22179 -1821 19380 31395 28628 12393 -9605 -27046 -31742 -21419 -1109 19663 31215
844 31215 27979 11646 -10142 -27088 -31308 -20714 -483 19978 30961 27354 10867 -10651 -27098
857 -27098 -30830 -19974 173 20221 30736 26711 10161 -11117 -27139 -30332 -19261 822 20473
870 20473 30478 26087 9435 -11560 -27111 -29856 -18557 1474 20717 30204 25486 8776 -12014
883 -12014 -27074 -29388 -17857 2049 20943 29940 24857 8090 -12417 -27043 -28922 -17166 2587
896 2587 21162 29669 24222 7402 -12847 -27032 -28425 -16448 3201 21274 29376 23605 6715
909 6715 -13228 -26951 -27946 -15772 3745 21454 29053 22961 6087 -13591 -26844 -27457 -15100
922 -15100 4289 21609 28784 22356 5404 -13951 -26778 -26950 -14411 4839 21756 28503 21717
$$ packed form
832b2179K0358K1201J2015k767j6235k1998j7441m696J0323K0310K0772J1552
844C1215l236j6333k1788j6946m220J0594K0231K0461J0983l607j6487k1518j6447
857b7098l732J0856K0147K0048J0515m025j6550k1278j6022l193J1071K0083J9651
870B0473J0005m391j6652k0995j5551k745J1299K0031J9243R487m718j6710k0790
883a2014j5060k314J1531J9906J8894Q997n083j6767k0507j4626j879J1756J9753
896B587J8575Q507n447j6820k0249j4185j393J1977J9649J8073Q102n771j6890
909F715j9943j3723r95J2174J9517J7709P599o092j6874j9678j3253o13J2357
922a5100J9389J7320P175o428j6952j9355j2827j72J2539J9250J6917O747o786
$$ plain form
935 21717 4790 -14326 -26723 -26484 -13722 5362 21922 28146 21062 4119 -14725 -26593 -25920
948 -25920 -13065 5910 22072 27775 20449 3479 -15055 -26504 -25413 -12343 6445 22159 27492
961 27492 19756 2825 -15394 -26369 -24877 -11680 6915 22291 27099 19114 2203 -15725 -26207
974 -26207 -24385 -11006 7465 22368 26769 18474 1566 -16034 -26105 -23793 -10340 7943 22447
987 22447 26401 17864 950 -16324 -25923 -23312 -9677 8427 22523 26004 17220 397 -16615
1000 -16615 -25763 -22725 -9023 8869 22590 25626 16594 -219 -16854 -25596 -22200 -8382 9305
1013 9305 22618 25254 16006 -774 -17130 -25383 -21654 -7754 9727 22637 24853 15332 -1328
1026 -1328 -17338 -25163 -21141 -7155 10116 22627 24452 14733 -1863 -17555 -24953 -20575 -6528
$$ packed form
935B1717j6927j9116j2397K39J2762J9084J6560O224p084j6943j8844j1868O73
948b5920J2855J8975J6162N703p326j6970j8534j1449J091J3070J8788J5714N333
961B7492p736j6931j8219j0975J492J3197J8595J5376M808p985j6911j7928j0482
974b6207J822J3379J8471J4903M401q295j6908j7600j0071K312J3453J8283J4504
987B2447L954q537j6914j7274r599K611J3635J8104J4096L481q784j6823j7012
1000a6615r148L038J3702J7892J3721L036r032j6813j6635q742L396J3818J7687
1013I305J3313K636r248j6780j6356q253L729J3900J7481J2910K216r521j6660
1026a328j6010p825M022J3986J7271J2511J825r719j6596j5692p398M378J4047
$$ plain form
1039 -6528 10528 22600 24052 14140 -2383 -17709 -24731 -20031 -5939 10893 22592 23631 13555
1052 13555 -2847 -17850 -24462 -19495 -5376 11234 22546 23226 12959 -3324 -18008 -24208 -18967
1065 -18967 -4838 11535 22456 22799 12363 -3802 -18158 -23959 -18412 -4251 11889 22407 22355
1078 22355 11742 -4323 -18325 -23685 -17878 -3721 12195 22307 21902 11169 -4755 -18451 -23442
1091 -23442 -17349 -3117 12467 22214 21470 10573 -5198 -18515 -23103 -16791 -2585 12769 22115
1104 22115 20990 10012 -5664 -18622 -22837 -16221 -2033 13092 22002 20602 9440 -6053 -18685
1117 -18685 -22493 -15693 -1517 13341 21906 20107 8870 -6455 -18777 -22206 -15159 -986 13576
1130 13576 21759 19659 8316 -6879 -18836 -21881 -14622 -467 13798 21591 19190 7750 -7278
$$ packed form
1039f528J7056J2072J452r912j6523j5326p022M700J4092J6832J1699J039j0076
1052A3555j6402j5003o612M967J4119J6610J1312O80j0267j6283j4684o200N241
1065a8967J4129J6373J0921L43j0436j6165j4356n801N547J4161J6140J0518n2
1078B2355j0613j6065j4002n360N807J4157J5916J0112m05j0733j5924j3696m991
1091b3442O093J4232J5584R747p44j0897j5771j3317m588O312J4206J5354R346
1104B2115j125j0978j5676j2958m215O616J4188J5125Q910j400j1162j5493j2632
1117a8685l808O800J4176J4858Q565j799j1237j5325j2322l429P047J4173J4562
1130A3576Q183k100j1343j5195j1957l045P259J4155J4265P793k401j1440j5028
$$ plain form
1143 -7278 -18873 -21562 -14040 15 14034 21463 18700 7165 -7685 -18902 -21233 -13515 512
1156 512 14236 21301 18256 6629 -8034 -18912 -20886 -12986 984 14459 21098 17799 6120
1169 6120 -8373 -18932 -20524 -12442 1449 14649 20966 17352 5601 -8696 -18924 -20184 -11919
1182 -11919 1897 14829 20724 16895 5079 -9069 -18910 -19842 -11417 2326 14929 20531 16388
1195 16388 4556 -9347 -18904 -19518 -10875 2790 15125 20312 15927 4054 -9692 -18853 -19106 -10400
1209 -10400 3148 15206 20097 15469 3612 -9922 -18796 -18770 -9860 3541 15340 19848 15028 3143
1223 3143 -10155 -18718 -18407 -9429 3909 15433 19666 14604 2745 -10393 -18611 -18040 -8968 4259
1237 4259 15495 19444 14153 2316 -10579 -18530 -17714 -8545 4569 15561 19165 13754 1906 -10841
$$ packed form
1143g278j1595k689P522J4055J4019P429k763j1535j4850j1217k331P718J4027
1156E12J3724P065l045j1627j4663j0878j974P900J3970J3475O639l299j1679
1169F120j4493j0559j592Q082J3891J3200O317l614j1751j4297j0228j260Q265
1182a1919J3816J2932N895l829j1816j4148r841r32Q425J3743J2603N602m143
1195A6388j1832j3903r557o14Q643J3665J2335N187m385j1873j3746r161k53Q706
1209a0400J3548J2058M891m628j1857j3534q874K6Q910J3401J1799M508m820j1885
1223C143j3298q563L11Q978J3338J1524M233n062j1859j3138q218N71R072J3227
1237D259J1236L949n291j1837j2895p951Q16R169J3114J0992L604n411j1848j2747
$$ plain form
1251 -10841 -18436 -17348 -8101 4945 15610 18927 13310 1471 -11032 -18333 -16999 -7645 5243
1264 5243 15643 18680 12863 1087 -11235 -18220 -16610 -7185 5526 15671 18433 12405 666
1277 666 -11387 -18119 -16247 -6755 5860 15737 18190 12035 269 -11556 -17987 -15870 -6332 6157
1291 6157 15713 17908 11627 -108 -11718 -17818 -15529 -5949 6429 15734 17656 11196 -451 -11867
1305 -11867 -17710 -15174 -5522 6708 15734 17337 10775 -855 -12035 -17585 -14804 -5068 6964 15731
1319 15731 17072 10362 -1233 -12217 -17419 -14398 -4628 7253 15715 16786 9939 -1599 -12355
1332 -12355 -17231 -14019 -4223 7525 15738 16536 9506 -1961 -12424 -17101 -13683 -3789 7784 15718
1346 15718 16228 9078 -2276 -12610 -16910 -13277 -3386 8041 15690 15927 8652 -2638 -12677 -16751
$$ packed form
1251a0841p595J088R247J3046J0665L317n617j1839j2503p301J334R354J2888
1264E243J0400L037n817j1776j2322o985J610R425J2711J0145K762o028j1739
1277F66j2053o732J872R492J2615R877K453o155j1766j1825o431K117R538J2489
1291F157R556K195o281j1735j1610o100K289R580J2378R305J922o460j1647j1416
1305a1867n843K536R652J2230R026J603o562j1630j1180n550K781R736J2032Q767
1319A5731J341o710j1595j0984n202L021R770J1881Q462J071o847j1538j0756
1332a2355m876L212R796J1748Q213P98p030j1467j0463m677L418R894J1573P934
1346A5718N10p150j1354j0334m300L633R891J1427P649K37p275j1290j0039m074
$$ plain form
1360 -16751 -12881 -3013 8266 15636 15640 8281 -2946 -12748 -16560 -12557 -2629 8438 15595 15353 7882
1375 7882 -3234 -12826 -16380 -12207 -2280 8645 15488 15047 7511 -3525 -12903 -16186 -11819 -1937
1389 -1937 8811 15440 14769 7113 -3838 -12977 -15972 -11461 -1544 9036 15369 14455 6797 -4097
1403 -4097 -13009 -15761 -11119 -1214 9226 15277 14172 6374 -4367 -13039 -15564 -10740 -873 9370
1417 9370 15207 13877 6003 -4635 -13083 -15383 -10425 -576 9502 15101 13579 5661 -4843 -13092
1431 -13092 -15180 -10048 -250 9596 14987 13268 5277 -5108 -13115 -14958 -9708 64 9758 14880
1445 14880 12982 4979 -5360 -13123 -14754 -9348 383 9910 14788 12690 4633 -5561 -13171 -14508
1459 -14508 -9025 687 10006 14676 12389 4271 -5789 -13133 -14264 -8690 986 10174 14563 12066
$$ packed form
1360a6751L870R868J1279P370Mp359j1227r802l812M003R928J1067P157k42p471
1375G882j1116r592l554M173R927J0925O843m41p536j1036r378l283M367R882
1389a937J0748O629o71p656j0951r139k995M511R917J0580O333r14p658j0894
1403d097q912k752M642R905J0440O051j105p798j0741q672k525M824R867J0243
1417I370N837j330p874j0638q448k300M958R849J0078N599j522p918j0504q249
1431a3092k088N132R798R846N391j719p991j0385q007j843N250R772R694N122
1445A4880j898q003j0339p763j631N406R731R527M878k098q057j0194p610j337
1459a4508N483R712R319M670k287q118j0060p344j131N574R676R188M389k497
$$ plain form
1473 12066 3907 -6050 -13133 -14015 -8320 1309 10288 14427 11766 3573 -6278 -13125 -13804 -7959 1615
1488 1615 10391 14284 11427 3203 -6504 -13119 -13566 -7600 1892 10492 14128 11116 2888 -6713 -13127
1503 -13127 -13324 -7291 2147 10574 14041 10843 2547 -6888 -13072 -13080 -6944 2439 10660 13864 10523 2246
1519 2246 -7075 -13031 -12807 -6573 2726 10756 13731 10192 1917 -7246 -13017 -12582 -6259 2983 10835
1534 10835 13564 9890 1584 -7402 -12967 -12344 -5922 3231 10868 13420 9553 1266 -7628 -12896 -12116
1549 -12116 -5596 3508 10945 13248 9264 967 -7752 -12833 -11846 -5280 3720 10993 13061 8948 650
1564 650 -7901 -12783 -11592 -4963 3949 11010 12887 8669 395 -8062 -12707 -11323 -4625 4205 11072
1579 11072 12706 8362 100 -8206 -12601 -11077 -4298 4432 11102 12525 8041 -181 -8332 -12526 -10816
$$ packed form
1473A2066q159r957p083q82N695R629Q979M139k661q193r851o847o79N845R574
1488A615Q776L893k857q224r707o615m47N966R492Q600L636l012q228r601o414
1503a3127j97O033R438Q427L467l198q296r435o184qO136R383Q221L204l341q277
1519B246r321n956K24O234R299Q030K975l539q275r163n771M35O323R242P852
1534A0835K729l674q306q986n565O23O422R153P637K552l867q287q894n268P80
1549a2116O520R104P437K303l984q297q719n081R87O566R000P273K068m113q298
1564F50q551m882J191O629Q912P061J877m218q274q457m645J384O698Q830O867
1579A1072J634m344q262q306m395J524O779Q730O670J423m484q222q151m194J710
$$ plain form
1594 -10816 -3981 4664 11142 12339 7743 -486 -8457 -12477 -10545 -3704 4842 11131 12118 7399 -779
1609 -779 -8566 -12338 -10290 -3379 5061 11142 11942 7137 -1051 -8697 -12283 -10027 -3108 5259 11184
1624 11184 11761 6822 -1298 -8797 -12141 -9773 -2805 5452 11132 11559 6529 -1541 -8895 -12028 -9482
$$ packed form
1594a0816O835Q645O478J197m596q229p971m020J932O841Q546O289R87m719q178
1609g79p787l772K048O911Q440O081Q00m805q188p646l586K256O919Q367N925
1624A1184N77m939q120p499l344K368O968Q257N680M27n030q070p354l133K546
$$ [...]
8191A2
##END NTUPLES=NMR FID
##END=
