##TITLE=1H_DVF-050
 d6-DMSO, 8 sc, 
 6.3.2020
##JCAMPDX= 6.0         $$ Bruker NMR JCAMP-DX V2.0
##DATA TYPE= NMR FID
##DATA CLASS= NTUPLES
##ORIGIN= UXNMR, Bruker Analytische Messtechnik GmbH
##OWNER= root
$$ XWIN-NMR		Version 3.5
$$ Fri Mar  6 18:00:24 2020 Russian Standard Time (UT+4h)  she@DPX200
##.OBSERVE FREQUENCY= 200.1315
##.OBSERVE NUCLEUS= ^1H
##.DELAY= (6, 6)
##.ACQUISITION MODE= SIMULTANEOUS
##.ACQUISITION SCHEME= undefined
##.AVERAGES= 8
##.DIGITISER RES= 18
##SPECTROMETER/DATA SYSTEM= spect
##.PULSE SEQUENCE= zg30
##.SOLVENT NAME= DMSO
##.SHIFT REFERENCE= (INTERNAL, DMSO, 0, 15.7039)
##AUDIT TRAIL= $$ (NUMBER, WHEN, WHO, WHERE, WHAT)
$$ ##TITLE= Audit trail, XWIN-NMR		Version 3.5
$$ ##JCAMPDX= 5.01
$$ ##ORIGIN= Bruker BioSpin GmbH
$$ ##OWNER= she
$$ F:/spectra/data/she/nmr/H-F/1/audita.txt
$$ ##AUDIT TRAIL=  $$ (NUMBER, WHEN, WHO, WHERE, WHAT)
(   1,<2020-03-06 17:59:12.85 +0400>,<she>,<DPX200>,
      <created by zg, POWCHK disabled, PULCHK disabled
       configuration hash MD5:
       00 E9 B6 7A A2 85 ED C7 34 08 36 98 17 FE 4E 26
       data hash MD5: 16K
       FF 2B 8F E0 DB AF 47 C8 1D D1 BB D0 9D 98 1F 44>)
$$ ##END=
$$ 
$$ hash MD5
$$ 53 76 7E 1E 49 CC 6D 19 A3 16 70 20 8D 2A 80 4F
##$RELAX= 
##$RELAX= 
##$RELAX= 
##$RELAX= 
##$RELAX= 
##$RELAX= 
$$ Bruker specific parameters
$$ --------------------------
##$DU= <F:/spectra>
##$EXPNO= 1
##$NAME= <H-F>
##$PROCNO= 1
##$TYPE= <nmr>
##$USER= <she>
##$AMP= (0..31)
100 100 100 100 100 100 100 100 100 100 100 100 100 100 100 100 100 100 
100 100 100 100 100 100 100 100 100 100 100 100 100 100 
##$AQSEQ= 0
##$AQ_mod= 1
##$AUNM= <au_zg>
##$AUTOPOS= <>
##$BF1= 200.13
##$BF2= 200.13
##$BF3= 200.13
##$BF4= 200.13
##$BF5= 200.13
##$BF6= 200.13
##$BF7= 200.13
##$BF8= 200.13
##$BYTORDA= 1
##$CFDGTYP= 0
##$CFRGTYP= 5
##$CHEMSTR= <none>
##$CNST= (0..31)
1 1 145 1 1 1 1 1 1 1 1 1 1 1 1 1 1 1 1 1 1 1 1 1 1 1 1 1 1 1 1 1 
##$CPDPRG= <>
##$CPDPRG1= <>
##$CPDPRG2= <>
##$CPDPRG3= <>
##$CPDPRG4= <mlev>
##$CPDPRG5= <mlev>
##$CPDPRG6= <mlev>
##$CPDPRG7= <mlev>
##$CPDPRG8= <mlev>
##$CPDPRGB= <>
##$CPDPRGT= <>
##$D= (0..31)
0 1.2 0 0 0 0 0 0 0 0.06 0 0.03 0 0 0 0 0.0002 0 0 0 0 0 0 0 0 0 0 0 0 
0 0 0 
##$DATE= 1583503152
##$DBL= (0..7)
120 120 120 120 120 120 120 120 
##$DBP= (0..7)
150 150 150 150 150 150 150 150 
##$DBP07= 0
##$DBPNAM0= <>
##$DBPNAM1= <>
##$DBPNAM2= <>
##$DBPNAM3= <>
##$DBPNAM4= <>
##$DBPNAM5= <>
##$DBPNAM6= <>
##$DBPNAM7= <>
##$DBPOAL= (0..7)
0.5 0.5 0.5 0.5 0.5 0.5 0.5 0.5 
##$DBPOFFS= (0..7)
0 0 0 0 0 0 0 0 
##$DE= 6
##$DECBNUC= <off>
##$DECIM= 24
##$DECNUC= <off>
##$DECSTAT= 4
##$DIGMOD= 1
##$DIGTYP= 9
##$DL= (0..7)
0 120 120 120 120 120 120 120 
##$DP= (0..7)
150 150 150 150 150 150 150 150 
##$DP07= 0
##$DPNAME0= <>
##$DPNAME1= <>
##$DPNAME2= <>
##$DPNAME3= <>
##$DPNAME4= <>
##$DPNAME5= <>
##$DPNAME6= <>
##$DPNAME7= <>
##$DPOAL= (0..7)
0.5 0.5 0.5 0.5 0.5 0.5 0.5 0.5 
##$DPOFFS= (0..7)
0 0 0 0 0 0 0 0 
##$DQDMODE= 0
##$DR= 18
##$DS= 0
##$DSLIST= <SSSSSSSSSSSSSSS>
$$ [...]
##$SUBNAM2= <"">
##$SUBNAM3= <"">
##$SUBNAM4= <"">
##$SUBNAM5= <"">
##$SUBNAM6= <"">
##$SUBNAM7= <"">
##$SUBNAM8= <"">
##$SUBNAM9= <"">
##$SW= 24.9337058887773
##$SWIBOX= (0..15)
0 0 2 0 0 0 0 0 0 0 0 0 0 0 0 0 
##$SW_h= 4990.01996007984
##$TD= 16384
##$TD0= 1
##$TE= 0
##$TE2= 300
##$TE3= 300
##$TEG= 300
##$TL= (0..7)
0 120 120 120 120 120 120 120 
##$TP= (0..7)
150 150 150 150 150 150 150 150 
##$TP07= 0
##$TPNAME0= <>
##$TPNAME1= <>
##$TPNAME2= <>
##$TPNAME3= <>
##$TPNAME4= <>
##$TPNAME5= <>
##$TPNAME6= <>
##$TPNAME7= <>
##$TPOAL= (0..7)
0.5 0.5 0.5 0.5 0.5 0.5 0.5 0.5 
##$TPOFFS= (0..7)
0 0 0 0 0 0 0 0 
##$TUNHIN= 0
##$TUNHOUT= 0
##$TUNXOUT= 0
##$USERA1= <user>
##$USERA2= <user>
##$USERA3= <user>
##$USERA4= <user>
##$USERA5= <user>
##$V9= 5
##$VALIST= <valist>
##$VCLIST= <CCCCCCCCCCCCCCC>
##$VD= 0
##$VDLIST= <DDDDDDDDDDDDDDD>
##$VPLIST= <PPPPPPPPPPPPPPP>
##$VTLIST= <TTTTTTTTTTTTTTT>
##$WBST= 1024
##$WBSW= 4
##$XGAIN= (0..3)
0 0 0 0 
##$XL= 0
##$YL= 0
##$YMAX_a= 58036
##$YMIN_a= -42943
##$ZGOPTNS= <>
##$ZL1= 120
##$ZL2= 120
##$ZL3= 120
##$ZL4= 120
##$ABSF1= 10
##$ABSF2= 0
##$ABSG= 5
##$ABSL= 3
##$ALPHA= 0
##$AQORDER= 0
##$ASSFAC= 0
##$ASSFACI= 0
##$ASSFACX= 0
##$ASSWID= 0
##$AUNMP= <proc_1d>
##$AZFE= 0.1
##$AZFW= 0.1
##$BCFW= 1
##$BC_mod= 2
##$BYTORDP= 1
##$COROFFS= 0
##$CY= 11.3945322036743
##$DATMOD= 1
##$DC= 2
##$DFILT= <>
##$DTYPP= 0
##$F1P= 16.9975609425685
##$F2P= -3.02152046262296
##$FCOR= 0.5
##$FTSIZE= 0
##$FT_mod= 4
##$GAMMA= 1
##$GB= 0.15
##$INTBC= 1
##$INTSCL= 1
##$ISEN= 128
##$LB= 0.24
##$LEV0= 0
##$LPBIN= 0
##$MAXI= 10000
##$MC2= 0
##$MEAN= 0
##$ME_mod= 0
##$MI= 1.114404
##$NCOEF= 0
##$NC_proc= 0
##$NLEV= 6
##$NOISF1= 3.799351
##$NOISF2= 2.8
##$NSP= 1
##$NTH_PI= 0
##$NZP= 0
##$OFFSET= 15.70392
##$PC= 1
##$PHC0= -9795.402
##$PHC1= 23.60082
##$PH_mod= 1
##$PKNL= yes
##$PPARMOD= 0
##$PSCAL= 0
##$PSIGN= 0
##$REVERSE= no
##$SF= 200.130013532006
##$SI= 16384
##$SIGF1= 3
##$SIGF2= 2
##$SINO= 400
##$SIOLD= 16384
##$SREGLST= <1H.CDCl3>
##$SSB= 0
##$STSI= 0
##$STSR= 0
##$SW_p= 3612.71676300578
##$SYMM= 0
##$S_DEV= 0
##$TDeff= 0
##$TDoff= 0
##$TI= <>
##$TILT= no
##$TM1= 0
##$TM2= 0
##$TOPLEV= 0
##$USERP1= <user>
##$USERP2= <user>
##$USERP3= <user>
##$USERP4= <user>
##$USERP5= <user>
##$WDW= 1
##$XDIM= 8192
##$YMAX_p= 0
##$YMIN_p= 0
$$ End of Bruker specific parameters
$$ ---------------------------------
##NTUPLES= NMR FID
##VAR_NAME=  TIME,          FID/REAL,        FID/IMAG
##SYMBOL=    X,             R,               I
##VAR_TYPE=  INDEPENDENT,   DEPENDENT,       DEPENDENT
##VAR_FORM=  AFFN,          ASDF,            ASDF
##VAR_DIM=   8192,          8192,            8192
##UNITS=     SECONDS,       ARBITRARY UNITS, ARBITRARY UNITS
##FACTOR=    0.0002004,     1,               1
##FIRST=     0,             0,               0
##LAST=      1.6414764,     0,               0
##MIN=       0,             -42943,          0
##MAX=       1.6414764,     58036,           0
$$ Real data points
##PAGE= N=1
##DATA TABLE= (X++(R..R)), XYDATA
$$ [...]
2025C46l38k45J24R3O4P5j83nj31K30K90J12o41K70n41J15M01K62j99r0l77L22
2047d6K96o9j77k36K13n8J74O0m66K06m4j2K27Q3m18K14j23l53L27L95N3k36l80
2070c70J57J60L04l7k77m77K82O19j90K04p51K6K57K0O3r0k6k09K03J57r4M8l5
2093e6m4k78P0M40L0r4j13j28J10M50j77k25j68j11L92K24l9l98j31m2N55l7l16
2116h6k34J01J80LJ08j12J54jl46K2J53L84J52o08k79L36L24J86m17n19Q0N59
2138A40L94j26k46m91J34N55j33j64J16l93M52k61K44O3l40j35N7Q5k1N4K89j94
2160G9m13n6M35P22m86p55J48J01N18P4n42N5K75M86k28j31m24k5RK44R4m25N95
2183C50J13m46k15J12Q59l43m22m12L94K44N59j21p49j70L06N85p9k05n98N97
$$ y = [346, 8, -237, -113, -20, 44, 119, -64, -69, -200, 30, 320, 432, -209, 61, -480, -365, 36, 298, 99, 9, -368, -46, 250, 181, 4, -232, -19, -77, 97, 157, -309, -103, -147, -159, 68, 151, -267, -53, -176, -529, -202, 193, 246, 10, -370, -213, -53, 251, 214, -63, -540, -258, 361, 171, 375, -376, -350, -93, -73, -10, -100, -126, -335, -132, 25, -69, -21, -56, -100, -378, -308, 132, 162, 68, -45, -173, -63, 387, 210, -15, -183, -294, 98, 322, 283, -115, -246, -288, 267, 230, -86, -320, -219, -39, -36, 72, -40, 114, 113, -233, -211, -58, 326, 478, -130, -409, -73, 251, 437, 20, -499, -419, 140, 534, 408, 162, -329, -195, 360, 227, 63, 179, -214, 238, -23, 221, 284, -56, -191, -134, -49, -70, -16, 273, 79, -334, -390, 45, 767, 281, -474, -326, -225, 293, 367, -175, -120, 155, 641, 413, 282, -142, -167, -158, 86, 180, -245, 350, 463, 17, -198, -86, 773, 430, 8, -404, -10, 234, 793, 672, -77, -247, 59, 644, 565, 360, -238, 359]
2203C59m3L09o28m4J77Q0m9k48O5K23K6j96n08L22J91M39k90m30m99Q19O11l79
2225C07m38n05L90N05J03l41j91M1P6P1k14q9M21j35Q0k03j4K51M46o48j47n0
2247b84O12L70n49l36k57M92M11k40m01o18L42N38L03n16l87L22K99M3m29l26
2267f11O59K83j98m68j04M30O0j10q6j43l2P31r8m77k66J94P79q3o50k43M92K25
2289B84L0k43k61k32N38J64m16l56M3P36k83n67J07L56K19J82j128J24M31O34
2309C62l8j126q9L35J021L3o30n64J98N59K36m09n37K21N66N55q37j52J20M14
2329B38j78k2o10P21N94n37o52k10M07Q38l7p43q06O15O23K36l12q51K66L24M05
2350C09l98m44J72L98j09j00n32N52N01k27k83m48N00Q56k96n64o19N23Q02k16
$$ y = [359, 316, 625, -3, -47, 130, 210, 161, -87, -22, 201, 227, 31, -477, -155, 36, 475, 185, -245, -744, 75, 686, 307, -131, -636, -246, 259, 362, 21, -170, -129, -53, 18, -196, -285, 136, 1, 81, -122, -136, 115, 561, -87, -234, -284, 328, 698, 149, -187, -444, 48, 459, 219, -182, -800, -458, 80, 383, -133, -520, -198, 101, 144, -285, -611, 48, 331, 133, -335, -439, -9, 51, -59, -145, -288, -320, 411, 313, -164, -430, -236, 543, 460, -190, -433, 59, 284, 314, 71, -190, -422, 116, 280, -136, -492, -449, 287, 4, -563, -456, -100, 119, 301, -827, -703, -272, 362, 324, -802, -891, -556, 465, 498, -132, -696, -498, 61, 297, -112, -649, -428, 138, 693, -144, -296, -176, 238, 60, 38, -572, 149, 743, 206, -446, -656, -249, 589, 552, -191, -997, -382, 241, 477, 165, -686, -420, -96, 309, -89, -533, -361, 37, -72, -172, -704, -152, 349, 122, -161, -609, -109, 747, 451, -113, -732, -209, 593, 377]
2370C77n48l43J66J151j98o14k71J47O01K07m43m80J26K89M27p79j78lP21J88
2390E43p66m39L53O81L04p93n92P32M57M43o41o24l4O40L91n15p70J49O14L44
2410D77m46k80k06N34Q03n49n53O6M92K24k54j087O46Q74N2p16o08L87R94K34
2430A084o70p30k98R52M46o46r34O79M12J16l16l39o3O32L76o89m84M24L72N95
2450I19r41n22K27O89M20n22j006j4Q02Q19o15o39k09O41O63n74m59l65O06L22
2470B42J72j025L76P25J87m88r08M10M85K44l23p74K10N82N20o60n69l35Q26P10
2490F07k37j078j34R21K07K38j172O8M54O10k36k67l18M27L54n67n56J70Q97M73
2510H61n82j010K07J001J68n12p05L41J81P49m00o85j67L44N86k8p93n8M14M44
$$ y = [377, -171, -514, -348, 803, 605, -9, -280, -133, 468, 675, 232, -248, -122, 167, 594, -185, -363, -366, 355, 543, -223, -662, -309, 372, 676, -117, -709, 23, 480, 923, 282, -342, -376, 264, 655, 140, -630, -481, 133, 477, 31, -249, -455, 79, 882, 333, -220, -154, 338, 562, 308, -779, -133, 741, 793, 77, -531, -144, 850, 1084, 414, -316, -614, 338, 784, 138, -796, -117, 295, 411, 95, -244, -307, 325, 701, 12, -472, -48, 324, 919, -22, -544, -317, 372, 792, 270, -736, -750, 52, 871, 256, -383, -592, 49, 712, 138, -321, -686, -80, 242, 414, -611, -235, 490, 677, 189, -719, -309, 176, 420, 97, -677, -467, 115, 635, -25, -594, -929, -103, 607, 370, -708, -842, 79, 286, 524, -648, -580, -126, 484, 248, -19, -337, 90, 444, -123, -679, -509, 388, 861, 279, -731, -524, 477, 645, 133, -572, -231, -50, 699, 299, -386, -553, -209, 377, 349, -444, -502, -88, 356]
2530C56n00k71ML95M75k20j227L88P11L57k86n24NM44Q91o44q24j23N87P64m01
2551C57q21K0L67N78o0p44K3L11O01k10p89k58O37L93l45n75k11O53R30n29n35
2572b07n88Q48O54j27o27p73O97O73K6p78m86L86Q48p0p98r2L19M10J79r30j28
2593e64M53O08J22j049l26P22P48j07q97l46Q9J334j94p08o33N47N33K41o41m32
2613e00K75P48p9m99l54K09Q54n5o65p39R83N30m93m10m87N50P31K4j007l94N67
2634b11J034n84n12m25M66O55R7o04n19K39Q61K06p41n95M29N97J65p91n19N80
2654a72Q61N1r84m61L82N69M52n54j019N42Q05L36n26p26J37N26M15q31m02J99
2674d00R45J34m75m75M58K92J45r80k08O05L23J77p96l31K96Q19Mr01n03J91Q77
$$ y = [356, -144, -415, -411, -16, 459, 239, -988, -600, 111, 468, 182, -342, -337, 107, 998, 354, -470, -593, -6, 758, 357, -464, -444, -77, 501, 441, -303, -280, 31, 632, 422, -367, -625, 12, 405, 60, -515, -726, -73, 857, 328, -207, -795, 53, 707, 580, -47, -820, -123, 550, 576, -202, -688, -302, 546, 476, -322, -414, -95, 315, 494, -436, -564, -111, 497, 619, -430, -756, -34, 714, 607, -290, -636, -547, 787, 593, -115, -748, -201, 332, 573, -68, -500, -225, 523, 444, -55, -409, -200, 654, 599, -66, -805, 178, 708, 215, -195, -682, -132, 599, 623, -384, -778, -211, 823, 239, -273, -698, -232, 423, 520, -84, -603, -364, 497, 703, -38, -633, -204, 393, 558, -233, -752, -172, 689, 740, -244, -705, -323, 246, 698, 144, -875, -333, 472, 808, 282, -444, -307, 219, 634, -197, -599, -400, 545, 679, 204, -271, 187, 479, 624, -356, -564, 41, 364, 541, -255, -586, -290, 529, 533, -368, -871, -680, 197]
2695A97M73q65m41L40M63K62o89j40j60J097M1n17q60M78O81L06r07l11K1Q03
2715B72M62q75m41J78Q41L35q46m71J54N47O46p64r74M56P86Pm03j61R1M66K6
2736C32l21k87k59P79N06q98n85J86O10M85o19o33pJ155J64o89n52J45R01L07
2756G20o50l99k08J010l07Ro25n5O71L80l87r35J16J097k45m11l59p7J105J00
2776E50n13p77O1Q34O66r15k70m15J112N02l87q96o7O46N78n05p93L55M71J99
2796D36m04m55k09R73M14o52p33j33R63L95m06o10k35Q33K86k02l05o86Q58J24
2816B52m2q09K79L75L61Jq91K72J52N01j68r50N1Q08M03l57p44J35O73L85k39
2837D48o75m42Q32K27K6n80l14O97P0qo88j30M85Q68m98o37q4P39M9j33p61K04
$$ y = [197, 670, -195, -636, -296, 167, 429, -260, -400, -560, 537, 578, 61, -799, -321, 360, 666, -241, -552, -531, 272, 734, -141, -582, -404, 437, 772, -74, -545, -391, 156, 802, 38, -936, -480, 306, 313, -90, -251, -160, 306, 332, 11, -276, -535, 244, 750, -148, -733, -547, 63, 548, -71, -704, -711, 444, 608, -81, -633, -488, 413, 720, 70, -329, -537, 473, 166, 175, -450, -505, 166, 546, 159, -776, -660, 437, 192, -219, -578, -655, 450, 550, 37, -740, -679, 155, 821, -94, -364, -779, 333, 835, 448, -448, -515, 131, 709, 204, -589, -234, 237, 436, 32, -423, -632, 341, 755, 103, -630, -763, 200, 595, 189, -421, -656, 177, 463, 261, -44, -730, 128, 252, 210, -599, -320, 55, 416, 417, -474, -202, -50, 451, 283, -667, -616, 192, 595, 238, -506, -371, 302, 687, 448, -227, -669, 163, 390, 416, -164, -478, 219, 289, 281, -407, -537, -52, 816, 318, -319, -403, 336, 385, 252, -509, -305]
2859c05N80L54j27q37r7N13M57k99o93n8L05N69j84m20j62J41N76n1k64m16M88
2880G0N14k42k93l39K37P56n46m83M4K36O57j53r44q3P62J78J03p73j21M34P55
2901G69o20o08m14P51N70l43k91o5M05lK5m33l50O87M55k59n96j80M08M81R3r00
2923d18j59O24M08K3p80j77J99R17m79m02m12N74O06l73n61J85k19M75L72n80
2943a77l52K94P24m3j024J41N88K36J11q10j07N11L6K21o21j74J92N75j39k27
2963d5l97K18J42P36o41m31K20P82j55q05M3J14M48K45o37l65L24L83L38j079
2983e62K61j06O37L3o18k66O55K31K55m85o3j72L19l8j52l01r3Q87k04m13n05
3004g00N65N16kn77k15M41L66P8m33k65k10O94J27k35l84L6L50J84k85k73J39
$$ y = [-305, 275, 629, 502, -335, -432, 81, 538, 239, -454, -512, -207, 362, 178, -242, -404, -263, 313, 262, -2, -418, 70, 584, 342, 49, -290, -53, 703, 157, -326, -282, -46, 611, 458, -486, -569, 193, 371, 474, -299, -420, 14, 769, 149, -459, -873, -122, 448, 105, -186, -251, 154, 151, 176, -257, -607, 80, 535, 276, -320, -500, -92, 389, 482, -418, -577, 47, 455, 478, -302, -479, -280, 637, 158, -244, -656, -82, 524, 151, -410, -225, -444, 31, 403, -177, -529, -235, 489, 446, -578, -437, 151, 387, 498, -312, -419, 92, 128, 349, -272, -446, -254, 321, 182, -45, -442, -224, -82, 654, 13, -418, -198, 584, 429, -376, -333, -219, 229, 474, -163, -528, -204, 179, 517, -562, -301, -407, 230, 263, -355, -621, 34, 265, 520, 35, -28, -200, 119, 81, -71, -372, -465, 422, 218, -195, -700, -135, 381, 379, -198, -413, 28, 394, 472, 39, -226, -436, 258, 385, 150, -234, -198, 152, 336, 51, -222, -83]
3025h3N36j59j52n08K14K09J33k89j78K02K12J45m54l46M44L54N4o6o86J43M29
3046A54K06n21k08L35L72q9k79l41K05M28j22l5n69L60K34Qj24j12j6K54L02n82
3068a40l37K32M67Pl34k69K6M27J32J4l87k43O26k51j70k41L97J55j04J40n39
3089c92K72K17L78n10k21P4K12J41k33l01j96P50m1j03l49j65N08M04m58n86L08
3110b91K99K81q8n22L21N6L56k40k36n8M61k1l29l49K07q2O74l70l27L2J01M10
3132B85k8l72Lq2M93K4o08j13N09J62k45Q5p5j31O0N0j61j60N61J10m30P0k31
3155b24M10M7l13q1j81M0K87N8m34M9L47P7N4n05R4m4L16J50l93K8K77K09l07
3178c9l33k5N39j22j05l00Q5J92M59k81l96J02ML24K31l54o5P7M41k41l0m40K34
$$ y = [-83, 453, 294, 142, -366, -152, 57, 190, -99, -277, -75, 137, 282, -172, -518, -74, 280, 334, 268, -418, -275, 154, 360, -161, -369, -34, 338, 249, -30, -371, -166, 262, 140, 105, -464, -104, 130, 138, 14, -98, -114, 140, 442, -140, -477, -245, 222, 229, -105, -374, -348, 79, 211, 225, -162, -405, 221, -30, -200, -441, -44, 111, 7, 147, -392, -120, 97, 475, -35, -256, -182, 30, 171, -62, -363, -559, 191, 150, 47, -302, -467, 41, 445, -13, -599, -291, 8, 289, 201, -321, 0, 56, 412, 172, -64, -122, 339, 318, -11, -360, -153, -235, 439, 69, -258, -226, -125, 285, 257, -115, -112, -194, 299, 323, -285, -398, 111, 273, 28, 113, 38, -93, -33, 17, -144, -304, 257, 367, -63, 7, -224, 186, 233, -80, -161, -342, -302, -15, 43, -391, -342, 5, 82, 136, -369, -275, -319, -3, 147, -246, -218, 59, 268, -39, -372, -397, 142, 20, -85, -385, -300, -108, 351, 70, -326, -224, -220, 104, 335, -19, -84, -7, 434, 193, 163, -277, -43]
3201d3J76j0k13O6nJ41%l28P8M10p0j45j34o4K2J24o1m3m57L40M44J8l49j96K46
3226e3J31p1Q2j14k2K22P1l32P4p3J83r6j77j21M50J44l66oj11k7K59K60j99m72
3250c64K28K37j03K1m26RM83n7j4k01J90k57Q5K37m5L58k81l4j17rJ53J04l5l89
3274b27K65k28L33k84J22j41J60l9P8j20p5J23j42J05j23K16q3K74k1j42J20n37
3296c66P56m61n83N23J0L97j24p2o8j41J09L60k32l66K35j05J66N5j60QQ0M0j9
3319D2o9r4L17k74j9k54J87k3L53j35q8R9l6q0P4R9k61J03J44K34j43j50K17l58
3343a15K31o1M4K41j84k90Q8N3K21r7n4k38J47Q9J7p8n7K7J2P1m6J5Kk51L52k80
3369a41Q3m2Q8J76q8L8l60J28L17j06k26k0R4K47K8m62J94j21J95k40M8L97k46
$$ y = [-43, 133, 123, -90, -24, -29, 112, 112, -216, -138, 272, 202, 57, -77, -141, -119, 5, -56, -99, -556, -216, 228, 246, -103, -299, -53, 78, 7, 89, -25, -47, 175, 246, -86, -12, -85, 98, 2, -175, -296, 154, 298, -68, -74, -185, -212, 47, 307, 108, -364, -136, 101, -2, 19, -407, -398, 85, 28, 14, -187, 3, -254, -169, 68, 23, 381, 100, 66, -51, -60, 93, 197, 162, -227, 38, -190, 143, -141, -19, -160, 0, -39, 39, -81, -156, -33, -175, -70, -193, 23, -60, 214, 193, 51, 171, -366, 390, -71, -654, -131, -121, 276, 152, 80, 12, -129, -20, 340, 108, -258, -23, -128, 38, 93, -67, -59, 21, 61, 42, -27, -121, 196, -78, -97, -351, -164, -187, 166, 31, -57, 42, 6, -74, 0, 99, -162, -59, 85, 319, 176, 26, 243, -115, 116, 55, 99, 340, 156, -134, -46, 7, 228, 131, 77, -161, -14, 75, 92, 14, -43, -16, -4, 67, 21, 36, 38, -213, 139, -141, -58, -100, -12, 164, 76, 114, -246, -118, 199, 93, -133, -153, -59, 188, 216, -246, -52, -173, 22, -218, -170, 227, -19]
3392a9K01j44j48L10L4P0k98J07j42J18%K36K5o3l90M63l86j5J79k12m6J06n8
3415g2K01R2k83J55o3o0K45j57l27K62j4M8o9j57K72k54k9N1K52j22pk43K95j01
3439h5mL11q5L8m2K18j42k32j7M8J2k25O78j19k58m53N18K49n44J18j4L39l69
3462f0J72k50K36m0m7J31j59J88o4l01J74l18J5L43J36q0j33K78j38k5Q5k47L75
3485B71n69J93k8J13J89j87l20M82n9j12P2P6k66K34j58%N1m4j6N6J09k93L9l4
3509b01L07j24r4O9j6J3nk1Nj7J47j22J23j95J8QJ94j46q1J56M6l54K12K74l45
3534a49L75j98M5L8k26J96k97K61l73M08R2n10J08J99Oj61j52o1K83j40K83Mj17
3557h6j39n3J48l6K90M9l73K37o6k70M02n7k54m2J54j23M2M22k28j7j03R5J33
$$ y = [-19, 182, 38, -110, 200, 234, 304, 6, 113, -29, 89, 89, 325, 350, 287, -103, 360, -26, -41, 138, -74, -120, -14, -72, 129, 221, -62, 93, 30, -30, 215, 58, -269, -7, -21, 27, -42, -199, 73, -181, -210, -159, 93, -29, -36, -279, 16, -85, -89, 222, 137, 175, 133, 351, 209, -23, -40, 8, 20, -205, 473, 354, 96, -357, 161, 410, -134, -16, -30, 309, -60, 112, -138, 98, 58, 11, 142, -17, 171, 107, -194, -20, -338, -323, 20, 156, 76, -57, 221, 83, 58, 143, -104, 271, -298, -105, -133, -20, 169, -18, -338, 144, 85, -27, 45, 121, -145, 89, -69, -69, -18, -62, -78, -22, 87, -206, -167, -201, 106, -18, -112, -43, -59, -46, -51, -72, -67, -84, 63, -59, 64, -131, -113, -105, 89, -57, -138, 18, 64, -290, -78, 196, -149, 226, 28, 73, 111, -115, 81, -216, 45, -328, 80, 172, -338, -230, -31, -25, -186, -338, -399, -116, -256, 27, 31, -86, -225, -278, -130, -166, 124, 173, -200, 37, -29, -299, 103, 46, -208, -250, -96, -219, -177, 245, 17, 0, -103, -8, 125]
3580A25o6J79p1j19m61K39L5J11n4k79K64L56k73n5K16k53L42l61J36k0j68J68
3602iN4R5O7j64k79J85m3R9Q8O4k78L22J41n47J35M43l96k32Q0K91k03Q5K21m77
3626b58L05r8Q3O4k26J98J85j67k83J88L2J17q9J41l4k84m7K22P6kj28j06j65
3649b76M25J14k76J65Q1j50j98J81J6k84N05k62M2j92o0K66j82J64R3J19k50j07
3671f6L4m2J63k55J78J42q0O8m11K90m4J34oJ49j2l45rJ79k54K03l09k99M55K72
3695A35n7K75l38R0m89O96l76k21K76n1l02P41l51L03l25j78J85K26l27K4j80
3716b44J8K36k7N4q3q3nqK01j7l38M46l17K30J42j25O1mk28k53L79k5lj19J77
3741F5j62K2j48KL52m03L19R7j63l02K14l7J18o1M9q9k98L70mlR0J07k49O4J62
$$ y = [125, 59, 238, 167, 48, -413, -174, -139, -28, -82, -361, -97, 259, -14, -69, 147, -106, 236, -125, 11, -9, -177, -9, 45, 140, 207, 43, -236, -51, -94, 5, 93, 157, -121, 201, 342, -205, -70, 373, -23, -255, -175, 116, -87, -2, 219, -258, 47, -51, 32, 96, -130, 68, 253, 86, -197, -9, 23, 140, 51, 192, 158, -126, -173, 49, 125, 123, -5, -111, -276, 149, 263, -13, 152, 233, 83, -115, 66, 82, -202, 303, 41, 83, -109, -169, 97, -85, 79, 172, 291, 41, -66, -32, -74, 89, -166, 12, 154, 74, 142, -269, 21, -23, 111, 105, 254, 242, -103, -112, 67, -187, 16, -293, -592, -137, 135, 78, 353, 15, 105, -384, 312, -64, -285, -9, -60, -362, 379, 28, 331, 6, -172, 13, 239, -88, -64, -244, -226, 10, -17, 37, -46, -129, -134, -142, 59, 42, -296, 150, -167, 63, 205, 80, 141, 137, -91, -344, 35, 10, 7, -112, 65, -97, -75, -223, -221, 131, -272, 47, 144, -19, -321, -107, -144, -26, -87, -38, -127, -425, -55, -59, -62, 28, 135, -114, -50, 112]
3766A12l13L28j60k72L85j19L49m39J17J34m50M16l81R5L33j7k97K30j4jK57m30
3788a37Kl8Q2j54K03R9K09l61L80m72K10j21K87k73K35r5N5j15J86m14N0K07N3
3811G8J40k43J05j88L04j45R1k29L3k1K49l13J71l8k0l10O13j39l42L43j91J03
3833E1M2m10L60J12k26k2L80l12j58O8J67j69rK01j00K31k68Q8jj06j52N82k47
3856A02k20K08j45j29K63k48L02l48M97l22r3K41l00P6O4K10p3M3k30l9J20qK7
3879bO6j62K06k33K65l78K85K98m48K75k3k88m2J14K48J01j94l6OK0J0j27J06
3902F7o1p2L50k14k32K88r0P1m2J43m90J30o8M99l91j39O4N06K0m74J28l8j86
3925b31M56j09l15J57K97Q2l18Q4J75l01J27k50M2J54J23l42K42J38p0k65L28
$$ y = [112, -201, 127, -33, -305, 80, -39, 310, -129, -12, 122, -328, 88, -293, -198, 135, 118, -179, 51, 37, 36, 293, -137, -135, -173, -91, -245, -42, 57, 266, -95, 285, -187, 23, -98, 189, -84, 151, 56, 111, -4, 182, -232, -182, 25, 78, 218, -25, 80, -108, 196, 51, 142, -87, -54, -75, 174, -139, 32, -6, -26, -336, 277, 138, -204, 139, -52, 51, 93, -317, 43, 155, -71, -93, 287, -25, -183, -115, 52, -117, -126, 75, -25, 206, -62, 26, 25, -81, -233, 349, 102, -118, 90, -55, -184, 79, -169, 133, -215, 282, -40, -133, 108, -192, -116, -52, 158, 85, 128, -102, -141, -21, -29, -2, 64, -98, 108, -125, 140, -238, 47, 345, -103, 172, 149, -139, -181, -67, 181, 282, 88, 52, 58, 78, 88, -39, 67, 6, -66, 284, 70, -162, 126, 36, 107, 65, 208, -282, -152, -220, 279, -112, -251, -187, 319, 339, -135, -7, -45, -231, 225, 116, -199, -42, 255, 337, 19, 103, 278, -23, 104, -146, -104, 50, 173, -169, 73, 211, 141, -124, 204]
3946B04k35k66P33l84pJ84m17J35J63k23L7J89k35L69l75PK61k4k12N8j95K88
3968E5n7P1q5l09J62L9q5k1R7P9Q2K90p1k39j02J13L1l05J14L14l94jK90l50J51
3993a31P0kL20l82P9n8K74M4n25L50jK6j59J5k35J85J73k5M7K87o19l18Q04m21
4017b02L04p3J22k28J73q4J58l96L38N2O2j64j57j49K09J33j95P1P%Q7J09n1j39
4041a3J44Nk87J00j53M08k67J18K57m58OK82m6j67J64l15j01n1L08m1L0q1K9K25
4065I6j29m3J39p6k46K9J62K05j23n9L6l8J90K2j96K87l86L15j94K19k07k89K49
4088c7l7j9J57j95K29k58N9M08m06j53O8J32K51k56k34J42l1J99N9j93J99J08
4110A92l78J30J21j12J98l8R3k95R7o2J31r2P9j9J83mp9l47M69l16M5K56k71K23
$$ y = [204, -31, -297, 436, 52, 45, 229, -188, -53, 110, -113, -76, 113, -122, 247, -128, -121, 140, 116, -96, -38, -233, 55, -2, 69, -16, -325, -163, -124, -209, -230, -133, -54, 28, 318, 247, 8, -94, 19, 50, -255, -141, 173, -221, -222, 68, -282, -131, -61, -63, 257, -125, -46, -104, 170, 214, -311, 39, 38, 64, -95, -80, -315, -130, 43, 18, 65, 352, -267, -585, 219, -202, 102, 29, 151, -77, 96, 12, 170, -226, 112, 164, 226, 62, -95, -244, -35, 98, -97, -26, -19, -19, 68, 177, 126, -13, 131, 136, -151, -51, -204, 204, -63, 55, 312, -146, -140, 142, 96, -71, 93, -222, -323, -374, -66, -107, -77, -158, -129, 96, -33, -76, 63, -13, -259, -230, -68, 137, 14, -45, -9, -47, 143, 165, -31, 256, -130, 185, -9, 210, 3, -286, -37, -74, -93, 64, -131, 98, -160, -101, 307, -99, -252, -184, -52, 199, -57, -291, -149, -180, 19, 78, -115, 84, 192, -186, -56, 65, -47, 151, 113, 206, -89, 8, -54, 77, -15, 64, 45, 228, 224, 145, -202, 267, -49, -4, 252, -19, 204]
4134B04L0J08j20k68l47K56K4nJ05k25K83M0m2m7J67l2j90O3k48L15j33J16k53
4157a99l4K84P7n66L66K5l6J04k60L05P6l09K43O4k3l95N13j98J07J8r1K34l09
4180dP2p2Ln1K36k47J02j08L2J04J69m92K70K06o37K37K03m05K76R3j08L03j36
4203D6p8j11J54o2J26j86p2Q5J40n4K45m09m0n1L19k35J41P8R8L9k08k1k9L70
4227B85l69P9N9j71J23K06j22Q3m42J34K40j39K14l49N6K00l83pJ83j71K47kJ65
4250A19k27J71M6l71K74J61m54K58J0q2M9N7n7L44j66K8q4k16J26m6O4o9L47l49
4274f7J81k25P2j47K92q9k85M55k01k83L92K2q6K67l6l01k49M73j39R2R1J3l47
4297a05K06K2R8l10J31K7J5j91L6L01l50J42j3K82l53O2l5K32l79P2M01l52K37
$$ y = [204, 234, 342, 222, -46, -393, -137, -113, -118, -13, -238, 45, 85, 43, -4, 163, 131, -59, 4, -244, 71, -62, 54, -199, -233, 51, 128, -438, -72, -47, -83, 21, -239, 66, 142, -167, 76, 140, 117, -278, 235, 37, 144, 162, 71, 305, -4, 68, -4, -1, -52, 184, -63, 39, -69, -37, 67, 236, -256, 14, 220, -417, -180, 23, -382, -106, -13, -121, 182, 46, -32, -143, 11, -51, 75, -111, -183, -98, 42, -12, 233, -176, -216, -267, 52, -183, -42, 36, 134, 173, -35, -56, -85, 285, -84, -5, 54, -117, 6, 212, 90, 173, -269, -135, 105, -34, 180, -169, -113, 87, -296, -303, -120, -291, -44, -46, 119, -108, 63, 109, -262, 12, 173, -281, -23, -13, -95, -46, 11, -46, 298, 132, 160, 76, -140, -14, -60, 4, -65, 282, -67, 114, -111, -39, -186, 106, 17, -268, 187, -14, -297, 95, 117, 31, 298, 262, -39, -288, 185, 46, 138, 229, 242, -105, 101, 123, 221, -89, 42, 69, 84, -107, -71, 230, -120, 22, 9, 291, -62, 0, -35, 197, -182, -110, 291, -61, 176]
4320A76j03o6J45l84L25J05j71j76J80j35M17m78M86j63Q7R3n48K6J46j91M9J82
4342BK77m43J09J27k1k06L20j25j67j81L50k53J67oO5l92K43K67J06j38j14j99
4364b12J11R1j72J35J98k07J02O3j21K87k55P8j20j51N39j95r9p8K7j28K0k72
4386c59L41j29n8J61J89J7k18j63L70k76M2J58P8j18O7R3k94L78m80M12j61J28
4408A78m6j92OP6j31R5J63j25J36r8k21J63J56N3l50K1L8K07k09J34P3l32L04
4431I9k07q9R2l7Q8l02O19l22n8m8L10m8k27P1K00j42l17L16L37n54L32l41R8
4454a30J11j36J17J60j00k2k9K4q2J50N0j54j02J21P7K7Pr2l0J22K9o6p9k50K43
4479c4m9M46l91l26J67K72k74K13J05j18j93pL62k5Oj42P1l46K31R5p9p4L87k98
$$ y = [176, 73, 7, 152, -232, 93, 198, 27, -149, 31, -104, 313, -165, 321, 158, 245, 338, -210, -184, -38, -229, -180, 2, 279, -164, -55, 72, 51, -155, 165, 40, -127, -308, 42, -211, -44, -50, 15, -377, -134, 133, 239, 101, -13, -212, -101, -10, -182, -47, 151, -56, 46, 109, -12, 275, 20, 98, -22, -173, 366, 171, 72, -6, 21, -107, -87, -359, -18, -147, -205, -44, 145, 162, -56, -219, 151, -125, -83, 75, 153, 35, 102, 195, -99, 279, -201, 211, 50, 178, 132, -60, -54, 22, -109, -14, 149, 24, 160, 62, -159, 4, 160, 213, -137, -116, -78, 129, -80, 54, 127, -205, 99, -108, -197, -105, -142, -54, -356, 263, -59, -117, -165, 145, 97, -130, -59, 141, -1, -318, -2, 335, -219, 113, -228, -130, -19, -155, -38, 122, 22, 0, -29, -5, -87, 63, 113, -41, -143, -22, 55, 82, 89, -3, -33, 89, 118, 52, -27, -277, -34, -83, 363, -28, -354, -187, 85, -189, 24, 129, 11, -182, -189, 173, 148, 154, 12, 83, -263, -32, 63, -16, -90, 297, -1]
4503al66L42j26J78j56J5K47l63J25K47n72N23k50R4K73l42L93n29J90k5N66o12
4525a49J01M30l90Lj21M12o83J78K11J3j61L49l60M11l17O4j03J52j77R7N0k9
4547a9q5K45k01J24Q2N6J43m18L18n70N43n9k16j77L72j47J16j55Kr6l33L77o5
4570a63L02p9p0J7J00k31o8M9m8J87l07O3J47K93q9n2L81l94k95P13n93K71k04
4593g0K04j96j11K66k24K97J05l4j57j61L21r8K5m7k50k74M83k60J37L35l19J28
4615A00k26O5J17k40l5J93q8K04k3J1q9L6P1J3j25k6j08K53j25M2J14M5k16l1
4639f8j17M79m96J07n3K79j76q0K71j84j80K91l04kK3J47J50j23J54J37k64J25
4661A16k53K45K31n70J39K05k8l5L6j89kK37j92K64j87J0j05J22j30K9M2k78J56
$$ y = [-1, -367, -25, -151, 27, -129, -114, 133, -230, -105, 142, -430, 93, -157, -63, 210, -132, 261, -268, -78, -103, 463, -149, -48, 382, -8, -5, -126, 286, -397, -219, -8, 5, -156, 193, -167, 244, -73, -9, -112, 40, -137, -40, 10, -19, -104, 141, -60, 64, 146, 202, 345, -73, 245, -325, 218, 159, -57, -234, 138, -9, 107, -48, -46, -142, -475, -98, -163, 139, 60, -10, 7, 107, -124, -192, -143, -191, -4, -311, -248, -101, 192, 103, 51, 432, 38, -257, 456, -137, 134, -70, 134, -62, -173, 93, -131, 166, 271, 237, 80, -81, 240, 142, 167, 120, -130, -404, 79, -181, -44, 291, -28, 100, -126, -61, 56, -184, -219, -26, -114, 90, 67, 78, -11, 25, 96, 109, -16, -42, -150, 103, -22, 20, 134, 179, -37, -68, -185, 294, -202, -95, -148, 131, -45, -125, 146, -38, -218, 73, -231, -233, -210, -63, 87, -36, 118, 255, -9, 116, -137, 108, 339, -231, -92, 113, 85, 50, 86, -103, -105, 132, -60, 204, 17, 27, -78, 44, -86, -57, -15, -293, -137]
4684a37K9r9R3M0M5j14K9K43j84J86j85Q6L17j69l4l28K06J82l51K89k60j71M44
4707A57j84N0j73J47n7K26j50J63j1q1j64L46j48l32j91M13K9J55K4j51j39K27
4729A56l53J50j65K25J30r9j35N8R1j73J78N3O4m2j73j2k1j58O2P7J40Q8k2J65
4753B84m78K95r6p8M07l45Q0o9k42J46K3J54qP3j21j34J14N4O4k01m0R4j83L60
4777A53m8rJ49k52k9q1N7K02l93N65p50J93K22J22J55k59o1K23k23j9M42l70j78
4800a89K37O8k52j6O7J0L44m04R3n9j4P3J24J24k35O2J57L5m59k32P00j23R9l42
4824a32l8o8K06O8J43j31l89J63K10k09l5J14J15K71J0l15K41j33k69K88j39Q5
4846E6j06J94k4m78M94k68J2K30m10j2K99j78Q0j67L26q2j33M98j97p4r8j7o0
$$ y = [-137, -108, -207, -114, -74, -29, -143, -114, 129, -55, 131, -54, 32, 349, 180, 146, -182, 24, 206, -145, 144, -116, -287, 157, -27, 23, -150, -3, -60, 166, 16, 179, 168, 87, -77, 269, 121, -211, -402, 11, 40, 195, 219, 68, -71, 156, -197, -47, -212, 13, 143, 44, -91, -33, 58, -115, 63, 116, 180, 138, -35, -47, -68, -226, -164, -87, 53, 141, 119, 284, -194, 101, 5, -73, 334, -11, 69, 0, -242, -96, -73, 81, 73, 146, 25, -109, 5, 59, 123, -78, -118, -24, -207, 153, 105, 96, 245, -7, -36, -117, -60, 142, -251, 314, -436, -243, -21, 101, 256, -3, -64, 159, -64, -83, 359, -11, -189, 48, 116, -136, -152, -85, -75, 269, -135, -42, -101, -115, -42, 82, 206, -29, 33, 190, 225, -234, -466, 234, 111, 210, -132, -170, -238, -32, 36, 179, 48, -341, -178, 32, -177, -212, -98, 17, 288, 298, -17, 224, 91, -178, 110, -29, 56, -50, 144, 120, -358, 136, -132, -120, 110, -300, -312, -13, -191, -111, -278, 48, -34, -167, 331, 134, 60, -38, -55, -115]
4869a15K18k52M27l69j6K05j36p6J25R2J12K4l68M0K63j08j48Kj47L45j55QJ20
4892I1k48K86k37J48J04k12J72r6j3J6j0j73K50j31J25m07K19L3k67L83Q1o9l28
4915b83J64K09m68K84o1J04n4K36j6l55L31r4j31L64m02K45k10K33j04r8J27r1
4937g0J35k9Q7l06N23j94R9k62L4J01l98L00n7K11l93L49j94J21j24J30O3k19
4959i3q7K07L5l83R4K00q8N4K94j89p4L08k55N7Ml11M39j31r2J54l20N41k93l18
4983b47M59m50M60l08J32j67J12K48k84J06j92K74m3Q5k29J68m14L44l84J37M03
5004B10j62lP2M3j6p4o4K5J32k90P3O1j19L8Rp9Q4R1l13L08n9j7Q6j87j07l6J52
5031a42K34k12K23l85K73K76m21K14k0r3J19j21j60L68j42q1K90J48k03l34J00
$$ y = [-115, 103, -149, 278, -91, -107, 98, -38, -114, 11, 103, 215, 239, -129, -89, 174, 66, -82, -80, -227, 118, -37, -29, 91, -157, 129, -108, 40, 144, -68, 104, 8, -5, 11, 1, -172, 78, -53, 72, -335, -116, -83, -350, 33, 114, 45, -283, -119, 90, -378, -94, -155, -51, -105, 131, 115, -240, 91, -3, -134, 230, -172, 73, -137, 96, -8, -106, 21, -70, 65, 36, 123, -183, 340, 146, 245, -17, 17, 118, -280, 20, -37, 174, -219, 130, -64, 57, -67, 63, 126, -93, -180, 27, 62, -321, -227, -27, -115, -61, 233, 44, -30, 278, 23, 80, 84, -227, 212, 81, -11, 143, -177, 364, 71, -247, 212, -238, 222, -86, 46, -121, -9, 239, -45, 61, -131, 143, 100, 185, -44, 124, -290, 54, -330, -193, 210, 48, 45, 117, 160, 144, 70, 6, 31, 163, -127, -54, 7, -112, -74, -65, -144, -60, 31, -282, 26, -33, -50, 36, -151, -258, -294, -142, 92, -120, 103, -282, -9, 267, -154, 60, 40, -53, 66, -55, -215, 153, 11, -70, 220, 368, 165, -169, -69]
5052f9J12k80K3K41P5Qj07m6Q5Jk1k22J93r0j13M32L0m61j51K66o7K07j78l8L56
5077A86k63K50k06J0j35j17J92K63k06N1Q7R0m0l32J00pj29K05K72l77K07l32
5099b31K57j19K94j03q9J42N0j54L5J15m49L90p8k12N9O1j65p5M76l45lM07l77
5122a14M1p0K48p4k27k3M60k41J84m08K94j46N2N2L1K55k36k06k9R6K7J02J32
5145B00pj39j33P4n6l21K19K01N8j5K98m05r6l2J05j54M12o7k65J80j76J53l37
5168c03O11m12j60L11O7j20l72M68k38O52m38p5J6Q8P0l28M7p4L43j13O4j6l62
5191b74M81j8p5j55n8J17K58j96l2J34k18J00Q7L7K07k65j93N3J5j93J93K61k76
5214a0J53n68K63L28m56K00j11J20P8K34M8o72N43j72j8j7m7j62J55K65j81l21
$$ y = [-69, 43, -237, -214, 27, 102, 110, 3, -43, 42, 43, 22, -200, -7, -97, -210, 222, 252, -209, -360, -94, -161, 46, -132, -170, 186, -77, 173, -33, -23, -158, -275, -83, 180, -26, 25, 112, 202, 162, -170, -70, -77, -206, -1, 271, -106, 101, -231, 26, -93, 201, 98, 9, 151, 201, 47, 82, 197, -252, 138, 60, -152, -93, -32, -197, -272, 204, -141, -144, 263, -114, -73, -143, 105, 31, -196, -219, 241, 0, 184, -224, 70, -76, -24, 28, 59, 314, 78, -128, -157, -61, -34, 68, 200, 193, 54, -79, -5, -61, -382, -163, 38, 96, 81, 379, -26, -122, -154, -49, -203, 209, 142, -123, 57, -119, 34, -303, 308, -104, -264, 47, 114, -6, -378, 90, -148, 504, 66, -9, 7, 95, 165, -163, -116, -190, 153, 40, 104, 88, -274, 207, 189, 114, -41, -99, 18, 276, 80, 48, 182, -36, 64, 151, 188, 395, 130, -63, -10, 5, -188, 5, 266, -10, 143, -425, -162, 166, -290, -90, -201, -81, -3, 231, 279, -393, 150, -22, -40, -57, -104, -266, -111, 154, -27, -348]
5236c48Q9O01r1m03J45j14N8n2j62J1M84k69p9K33j88K6J87L8j97QJ1p4n9nJ76
5261B6j98j99N95m65K24j01J1QJ63o0p5o5J11O8k41J87O3J8Q6mk23L0K50k64r
5286f4q8J98Q5n9m4j12J56M1K8q9j08Q0p4K67m49kJ57J31j55R2J05J32j91l1q6
5311h0K48l46K67j54P2j92J14k80L58R8r6p1r2J64k48J73K11j66K22k71J57j51
5333f3k9j68J47J32Q9j28j89L16p1K9L32n23L00j43J38j1j12k37N1J21O9K8l41
5356b63J61K34k95K03J43j82K33k57J71R9j15j6j03P6l14l7M4L57Jl03L09k91
5378a45M16l26J13k71K58k12l1K18J08j49K11j01j04K83k20J91K8o0l58Q9K01
5399A39j32k44n3N03j72j89N4K08R7j13j88k2L6J44J20j80J45k20q5J94Q5m85
$$ y = [-348, -259, 342, 251, -152, -7, -121, -63, -115, -277, -266, 218, -51, -130, 103, -85, -59, 128, 166, -31, -23, -12, -86, -145, -150, 26, -172, -371, 224, -241, -17, -118, -107, -99, 64, 4, -71, -136, -25, 43, -198, -11, 52, 70, 156, 152, -71, -41, 209, -55, -64, -152, 46, 131, 72, 28, -84, 72, 113, 141, 52, -56, 24, -50, 217, -232, -234, -77, 54, -101, -9, 96, 228, 37, 6, -80, 168, -178, 89, -65, 7, -185, -71, -351, 7, 105, 9, -62, -154, 10, -238, -65, 146, -20, 202, -69, 88, -63, -92, -260, -113, 19, 108, -20, -209, 107, 36, 65, 397, -126, 174, 31, 169, 158, 46, -191, -140, -19, 50, 78, -263, -102, 132, -163, 40, 183, 1, 234, -23, 148, 247, 132, 116, 13, 89, -225, -262, -218, 139, 140, -163, 146, -145, 271, -55, 58, -213, 45, -167, -198, 20, 128, -21, 190, 89, -15, 268, 48, 239, 267, 207, -151, -62, 139, 7, -237, -290, 213, 41, -148, -94, 114, 211, 98, -90, -112, -76, 68, 188, 8, 153, -67, -152, 42, 127, -358]
5421c58K91j97p5N94j9l86L1j35J91Q3j04J92M0k47M2J65O2j48n8o9M91n17J04
5444b7K67j93L6k91l8N32n62J92L7K25k23jj9q0J86j30K72k68K54N0n47O82m39
5467h5k5P2J04l57O9j39M34k91M4J40Pj14r3N35m6M4k21O7k62J79q7JP5Om20N65
5493B02n7j11n8K99m42L83m34k6K34L2L1P6L4l10K54K7J67k02nk05L1K3r3J53
5517Cj10J82M3k86K8J43j3J80j38k5k96J89k41M96j68J9L56k47k41j51K62l6j64
5540b15J96N0j73K39J79o02L08P7j35J85o7l99L59J23j70l63N03l5j21P4J5M4
5562G2k33L63j68l4k8O7k45L46P7n39J81J89J94k19k09M16j76p8k84L25rl14R6
5585b10L29L3j16l14L03J80k93K29l7j18k09K97M0l18J97m67M61j2r1K37m17K57
$$ y = [-358, -67, -264, -339, 255, 236, -150, -119, -254, -63, 20, -84, 108, 148, -99, -57, 108, 170, 22, -36, -105, 386, -131, -27, 240, 47, 83, -208, -246, 286, -276, -84, -47, 178, -45, -46, -65, -145, 41, -89, 183, -85, 169, 219, -328, 354, -85, -110, -38, 66, -291, -222, -361, 73, -218, -174, -34, -27, -141, -234, 301, 255, 299, 78, 145, -117, 62, -25, -24, 51, 57, -363, 202, 145, 34, -24, 275, -167, 216, -218, -244, -10, 22, 53, 129, 163, -147, 107, 134, 301, 99, 94, -111, -80, -57, -150, 3, -107, 75, 118, -168, -140, 3, -10, 170, 32, 7, -289, -100, -341, 155, -13, 6, 362, 115, -126, -277, -15, -51, -215, -19, 31, -142, 97, 276, -326, -18, 59, -76, 109, 42, -357, 2, 125, -45, -408, 95, 60, -61, 13, 28, 72, -161, 202, 34, 0, -28, 39, -206, 140, 217, -322, -141, 48, 242, 23, -186, 230, 54, -24, -308, 17, 8, -306, -210, 119, 152, 36, -278, 25, 205, -88, 141, 104, -14, -223, 74, 114, -204, -7, -474, -13, -25, -116, 121, -296, -39]
5607c9L9K68n08M97n9j55qJ09j74n7J40Q8m4m57L90K3J31j71r4k8m4K55k47J16
5631b9K5Q5j62K23j58j62J95j07L13l52P5l06K95R5J1Rj11j7j19M23l49MK79M9
5655B09l35l0J75K42m68K98J7k27n5J96K45k71j64Q8K37O3O4l19J39j53J50J12
5677B13k29J49p9j54k35M21Q7j0k12pq2Q9o0j35L74R0k55K62l43M59j65j18J92
5700B52r5j20J25k95J44k35M3N54k81j9o9j27m6K16j4j53q6J10K1j31M95n10J93
5723b8K08k5k52L5L2J68k47J4r4J24k23L55l66J41J94j09J08J23m07J51L95k12
5745H5P3o1R8l60M47r0l63J71QM3J71m25K60J04l91J8M5l0L24o0j14N4m2J81k07
5770f1J14j09Q6j57J11K88j64P7j76o6L05k20J72j64j39n0J45m5N4k42L86l7k68
$$ y = [-39, 0, 268, -240, 257, 198, 43, 35, 144, -30, -87, 53, 141, 97, -360, 30, 53, 184, 13, -81, -109, -153, 102, -145, -29, -4, 81, -81, 142, -16, -178, 17, -90, 223, -129, -54, -360, -65, 30, 41, 50, -61, -78, -197, 226, -123, -119, 160, 209, -126, -156, 19, 261, -207, 91, 108, -119, -174, 22, 267, -4, -168, -80, 157, 220, 284, -35, 104, -49, 101, 213, -16, 133, 54, -100, -335, 86, 173, 163, -49, -56, -138, -49, -109, -244, 130, 220, -35, 227, -116, 343, 178, 60, 252, 157, 37, 162, -133, 11, -224, -181, 373, 92, 73, 4, -123, -169, 47, 33, -120, -206, -96, -75, -206, 289, -221, -28, 180, 155, -97, -62, -30, 138, -109, -95, -189, -65, -288, 67, -299, -158, 36, -73, 35, 158, -249, -98, 297, 85, 158, 97, 195, -165, 282, 192, -171, 0, 8, 51, 222, -203, 57, 161, -230, -212, -167, -197, 127, 67, -47, 7, -35, 146, -61, 53, -56, 30, -127, -16, 272, 108, 185, 9, -57, 248, 28, 200, 36, -103, -153, -8, -53, 1, -241, 145, 108, -160]
5793a60J60j02R0J04k45K75J21k01n6L13l27j48J47J71k9j18N7MJ75K8j93l4j74
5816a42m4k06o4J39L50J13rl56J36J27o0j93J69J36k88J57P2L03n16M25k05k08
5838a64R9K11n8k34N7K59k55j70J47J1Q2K1J24l17J77J93m01M43j88K3k6j14o5
5861a45L0j11J03J41J13r0r9J45q3k41K58K07j62Ol24K18K25j69j35j55L88J40
5883B60m37L48j95r4K36J4l91K55l13L73k81K50j41o2J05M6M7J59j82j12j55K07
5905f3l3j13P6R2l7k12J25K12p2o6o4O5M11k83j84J98R5l2j14Ll3K15k86j2o6
5930a78Q2J57p0K6j65L39l52J53k24l2p1K44P5p4R5o0j27L27l45K95j08n0q5K34
5954H6J00k81j34j21J55J22M9J08j81J14N5k32k7K11K34n61O8QJ47N5Q8JJ69k57
$$ y = [-160, 0, -102, -12, 92, -153, 122, 243, 42, -14, 299, -28, -176, -29, 142, 113, -5, 52, 56, 231, 259, 66, 32, -142, -186, -392, -456, -317, 33, 146, 137, -219, -83, 44, -16, -209, -40, 96, -192, -35, 37, 340, -176, 249, 44, -164, -65, 146, 88, -146, -89, 170, -85, -255, -108, -97, -15, 6, 130, -187, -10, 183, -218, 225, 37, 60, 34, -80, -145, -115, -226, -123, 18, 131, 41, -58, 87, 4, -237, 21, 228, 66, 72, -252, -34, 191, 22, -113, -268, 120, 260, -177, 171, -24, -118, 118, 132, -259, -4, -317, 56, -225, 25, -116, -178, -73, -27, 20, 179, -3, -115, -270, -63, -96, -209, -133, -41, -78, -290, -165, 47, -25, -91, -155, -90, 321, 38, -146, 52, 147, 115, 1, 4, -29, 186, -100, -112, -178, -96, 61, -9, 17, -148, 191, -161, -8, -232, -264, -335, -91, -16, -90, 5, -55, -182, 145, -200, 95, -13, -63, -148, 86, 186, -95, -229, -350, -195, -73, -24, 84, -97, 17, 72, -160, -187, 24, 258, -303, -235, -227, -80, -25, 63, 64, 233, -24]
5978b4J38k74K62j35J80l50P5K6m7J85j57L9L9m4m1O5J57j37j15J20J73m22K30
6001e7J75j62R0p8QK7o8k49L70P7l31J57k9Kq5L09k56O4J27p9K63j15k11j19J70
6026@j02L26j97m36M84p7L0oK01l9j15j91K61k88L19o4l43J67P6O4N8k25N16j45
6050B74l63M9o0J36R7j36n8l06M03K5r6k86L12%J01N8k49J80m4K05j86j53K42
6073A45L9l08J00K4j61L25o2j80q0J93J05j80p6P2J91j06K71n18J63M8M15m49
6095b9k51J74O2K94m36J37j19J18J0K65l41L4m2J53PJ83k52j00J92j58K83k85
6117a01J98j58J74j95L69l86j12M40j31j32J89k58K11%j11O7j51L31j49J43k38
6138@j6M0J54k19J34O4J89k38j13O8l8j04K7J99j33j16K87m24M38k04m2j01L54
$$ y = [-24, 114, -160, 102, -33, 147, -203, -128, -102, -149, 36, -121, -82, -43, -87, -128, -63, 94, -43, -158, -38, 135, -287, -57, 118, -44, 46, -32, -24, 3, -65, -314, 56, 133, -198, -41, -70, -68, -153, 156, -100, -36, 91, 12, 275, 160, -51, -170, 0, -102, 224, 27, -409, 75, -2, 28, 22, 223, 184, 69, -122, 139, -149, 170, 106, -237, -70, 6, 70, 128, -97, 419, 274, -89, -40, -100, 36, 133, -3, -61, -367, 36, 61, -35, -321, -9, -9, 92, 150, -99, 81, 37, 242, 56, -97, 145, 184, -124, -24, 0, -161, 164, 102, -78, -158, 35, 140, -40, -116, -44, 147, 41, 312, -206, -43, 5, 420, -29, -280, -106, -44, 250, -186, -49, -168, -50, -40, 225, -116, -82, -124, 29, 36, 219, -33, -133, 59, -99, 184, -101, 97, -61, 113, -82, 287, -99, -211, 229, 98, -34, 155, -103, 108, 108, -3, 64, -87, 244, 95, 238, 0, -16, 24, 178, -41, 93, 157, 346, 108, -5, 63, 25, -79, -52, 147, 14, -102, 185, -239, 199, -5, -47, -148, 206]
6161B06l53J77Q6K80l76j13n8j70M48l24J81R5q0O4j62M77n76L01J3k90K82k21
6183a13k93L41O3j39p3M58l10J07J80l36k2L35j73j45m8L49j27j76O3n4K61j38
6205A0l08L88k48K7NJ9%K78qj15r0K3L9q6j1J83k31K56O6m59K35J4j15L98m54
6230a84J79J84p7J1r6j64k4J73j0k6K7O0n2k1L1m25O04l16J31j2l63N35j33k26
6254a94K44J08J3k73J00j09j41K23J48K15l07q6Q0j2r5j05Q6OJ95k05J85k94L28
6277A10j19j68L77l40j2k8K65J41O7k29J39l97J65J15J89k03j35m5J95j18O0l1
6299bN5j09j24L3O6J41P2j19j06k2KL64n0j02k52L21j24J40j30J51N2k87j38J1
6323a57P5L23j54k41K57P4r4j97J31J7k39L97k33J37K97n63L07n2j63j41J99J98
$$ y = [206, -147, 30, 116, 396, 20, -93, -151, -321, 127, -197, -16, 79, -1, 63, -99, 378, -198, 103, 116, -174, 108, -113, -406, -65, -2, -141, -214, 244, -66, 41, 221, -115, -137, 198, 25, -120, -168, 181, 54, -122, -59, -113, 148, 10, -298, 90, -158, -131, -126, -107, -107, 171, 163, 48, -42, -19, 20, -66, -77, 106, -125, 131, 197, -262, -27, -13, -128, 270, -184, -5, 179, 102, 113, 17, -147, -171, 2, -8, -34, -7, 53, 1, -20, 11, -414, 190, -126, 5, -7, -370, 165, 32, -194, 50, 158, 171, -102, -2, -111, -252, -29, 119, 334, 27, -59, 21, 9, -86, -191, -105, -99, 96, -109, 76, -218, 110, -9, -177, 200, -140, -152, -180, 85, 226, 293, 64, 203, -194, -29, 86, 275, 72, -63, -108, 87, -31, 29, -2, 53, -56, -180, -147, -81, 60, 132, 13, -93, -115, -113, 251, 201, 99, -153, 168, 44, 184, 54, 205, 257, -30, -168, -157, -82, 241, 87, -154, 103, 177, 83, -114, 17, 34, -205, 192, -41, 96, 393, -170, 137, 85, -78, -219, -20, 178]
6345A78j09j27Q4J20k97RK80k00J07lj17kl0L03l32p3Q4K24J35m59K94j48J83
6368A04k4j7J34p9j95J87J56j03l54K92l26R2P7J4K19l33K28j07J46nl43K84k36
6391a89K08j56K43j04Rl9K02j38j34n5J11K5j64K62k06J17l0o5L60m52K96l35
6413b34J87K11l48L51j08k07M29j51Q9k88K14j30q9j61L47J1l65N3J71k30J16
6434a32L29l27p5K72m07J42J49Kj28K72k2j03J58l61J43K64Qj96J96p2J47m11
6456a52j25J95J08j48J30j7L36k23J66k27p7L15o66N04j53j70M3J80Lr8j07J38
6478d5J50j07p5r6K60J13k74p7m4K74j26J37r5j43k2j8J77m18N81j51J16k14J43
6501D6N0j86J03P9K09l03k34K39j12j52M05n5O1k93L34m21J57j10L2N1M4L0r3
$$ y = [178, 69, -58, 26, 146, -151, -142, 138, -62, 45, 42, -75, -77, -107, 196, -136, -209, -125, 99, 234, -225, 69, -79, 104, 80, 63, 197, 118, -77, 110, 266, 163, -191, 101, -225, -133, -56, -42, 177, -156, 72, -35, 111, 106, -237, 47, -189, 19, -137, 106, 2, 11, -28, 174, 36, -98, -153, -42, -17, -181, 81, -125, -8, -38, -103, 257, -195, 101, -234, -47, 164, -184, 167, 59, -148, 281, 130, 219, -69, 145, 15, -74, -235, 112, 123, -242, -189, -18, -248, -132, 197, -130, -205, 67, -340, -198, -49, -47, -175, 97, 75, -28, 130, -231, -88, 176, 184, -12, 184, 112, 259, -152, -277, -82, 26, -122, 8, -9, 327, 104, 270, 43, -34, 281, -385, 119, -34, -204, -161, 19, 22, -76, -183, -45, 105, -2, -77, -173, 87, 200, -74, -151, -195, 79, -47, 90, -5, -148, -170, -188, -11, -429, 152, 1, 117, -97, 46, 96, -90, 13, 92, 301, -2, -236, 3, -109, -261, 144, 89, 150, -143, 191, -230, -73, -183, -151, -100, -56, -26, -119]
6524a19J33j14j77L60R3l35K41j76J76k75K8R1m4K29j34oK02k51J32j2k6K49k78
6547a3L45m61pM6Q4j13J76k74L22k38QK17J14p8k09J44k62L34J51k18l06L97o5
6570I4j47k14K30j1j25J59j5k01L05K89n70J78J77k73J42P7j69J99L9n1k01L50
6592B62k35Ol8N6j69mK56j58J15j89jq2J25J17o8k80K99P4p5q2j99L83q9l38L85
6617G1J87l08j80P4K01j99L18K6l86L51L2l61J28J66n6j13O3r2N4j33P1J42r9
6640d3Q4j03O3j35K0J16k03K34K70q0j92K72l21P0m6j11K33Kj84K42j67j34j3
6663a26K08J44l20J6Nj7J54r3o1l5j84M04p3J63n3j57j20J33k13L85l13N6m8n7
6687b02j3M97l06L3J52k76L50j88K07l09M6j36N13l67L2j54N9p6O6K1J2M91m59
$$ y = [-119, 14, -100, -277, 83, 176, -159, 82, -94, 82, -193, -165, -74, -118, 111, -23, -29, 173, -78, 54, 42, 16, 265, -13, 332, -129, -136, -90, -6, -119, 57, -217, 105, -133, -125, 92, 206, 128, -81, 63, -199, 135, 286, 68, -238, 159, 94, -53, -267, -37, -48, -173, -14, -29, -230, 75, 364, -206, -28, 149, -124, 18, 95, -74, 125, 164, 113, -88, 262, 27, 33, -5, 51, -118, -122, 134, -24, 91, -98, -99, -181, -56, 61, -7, -287, 12, 86, 11, -71, -270, 113, 24, -314, 71, 258, -50, -230, -156, 45, -154, 164, 190, -196, 155, 187, -174, -46, 120, 64, -49, 14, -78, -24, -157, -86, 56, -43, 41, -62, 1, -134, -114, 2, -201, 33, 303, 223, 31, 303, -18, 52, 6, -105, 128, 130, -54, 188, 21, -113, -126, 82, 226, -94, -78, -73, -90, 64, -29, -90, -125, -309, 95, 22, 185, 132, -25, -145, -12, -225, 160, -153, -97, -145, -202, -215, 282, -24, 9, 161, -115, 235, 47, 254, -55, -9, -145, 368, 1, 33, -121, -62, -138, -72, -51, -39, 452, -7]
6710gQ7j93K7n1j75N08m65l3M74j90L59k77p6N4L7j34r1O1L84q0k51r0J46n6r0
6735a22L9M9K68p7q9n2k39M68m4k18j08L26l41R2L26k78K8k50K55k4p7k76M96
6758A52j12N2o3J01j80m6K71m02N89k29k23k07L83j11K4J61k44n2M22k6o0j85
6780A5p9K65k50J8j37J03k87N01m9j07K35O0l19K72m79K30M8n6K36j37j28M07
6802C62n15K51o2j41K69Q1j64j68j68K33J78j31j41K0J08j1K8Q8l06J83j30L02
6824A66J36k26j2K41l28K07M2l81J72m6J64k48K8J49j48L11l12J82j80J0J46l46
6846b73M24j09J88n1q6p4l7j27J76J6Q1k21K08q0k76K51M8r1n4m0K90p3m14J92
6870a32M9k8J48J0k8J32j41rl87K29K44lq6jJ40j58L3J65l12K49K9m11K97j01
$$ y = [-7, 80, -113, -86, -137, -312, 196, -269, -302, 172, -18, 341, 64, -12, 42, 79, -55, -146, -85, 299, 219, -32, -122, 24, -32, -122, -83, -34, 234, 157, 68, 16, -223, 245, 201, -17, -125, 201, -140, -48, 278, 0, 28, -222, 33, 9, -68, -344, 152, 40, 92, 29, 130, -50, -96, 175, -227, 362, 133, -90, -297, 86, -25, -1, 160, -84, -136, 286, 260, 200, 15, -64, 201, -49, -31, -168, -65, -352, 149, 100, -7, 228, 288, -31, 241, -238, -8, 40, -16, 220, 83, -45, 362, -153, 98, 36, -105, 164, 245, 81, -87, -255, -22, 156, 25, -116, -96, 12, 1, 29, 117, -189, -6, -136, 166, 302, 76, 64, 305, -23, 184, 226, -155, 17, -29, 135, -113, -85, 64, -84, 227, -85, 97, -83, -73, 73, -273, 151, 42, 230, 179, 93, 19, -18, -145, 31, 47, 128, -93, 115, 35, -241, 10, 58, -33, -87, -127, 163, 90, -324, -132, -83, -111, 37, 47, 19, 151, 10, 1, -386, -157, 87, 84, -2, -3, 137, -21, 12, 177, -135, 114, 143, -268, 29, -72]
6894g2k7R8R3o1l08L20P6j04K3j20j36Q3O5N3K2J28k77Q3J16K31k54L5j21R6m0
6919Bj99K95k03j89K21J74r0J36r7K4k46K64j81j82K59M8K6K93n63K94k80L19
6941A25k41Q5K0L61m22J31j60J28K1j12K44l47n9J80M4po5M09l74r0L61m90N53
6964B95n92J50K35k14K95k79J20K52m17K75l68P3J14K98m08L71k91r3K03o0l4
6985g5p1J24j39K23K0p0J96k62K04J35m53R9J06j61R7n3j97J25J7J54j75J03l04
7008c57L97n4N0q5m8o7R7J40J50k37o2n9pL34n6j59P9j89N6k30L41PK64k45mJ23
7034A79j99J99j07lK7J41K4l23R6j9j97K9K91j22j60J14l36L33O6j00J52Rk47
7057a53K22j90J67j00K4RN8n00O26j90n9L33n06K09j87K17O8J75j19j13n7m21
$$ y = [-72, -99, -1, 92, 31, -277, 43, 119, 15, 38, -82, -218, -135, -70, -17, 5, 133, -144, -61, 55, 286, 32, 67, -54, 42, 2, -197, 98, -105, -294, -73, 101, 11, 147, 50, 74, -172, 92, -89, -271, -12, 36, 62, 355, -208, 86, -194, 125, -116, -31, -11, 350, -72, 59, -101, 27, 48, -64, 180, -167, -226, -46, -2, -9, -74, 335, -39, -129, 232, -258, 295, -297, -147, 88, -126, 169, -110, 10, 262, -155, 120, -248, -175, -61, 237, -171, 200, -91, -184, 19, -41, -75, -146, -22, -161, 62, 82, 12, 208, -54, 150, 285, -168, -69, 37, -124, -27, -80, -277, -152, -135, 19, -156, -53, -357, 40, -14, 36, -49, -97, -164, -67, 73, 223, -14, -76, -135, -142, 192, 136, -23, 56, -133, -77, -307, 34, 41, 305, 60, 56, 179, -20, 179, 72, 69, 96, 237, 261, -62, 34, 15, -182, -153, 138, 16, -144, -30, -366, -33, 33, -67, 85, 94, -153, 69, -121, 46, -54, -30, -21, 37, -463, 163, -27, -86, 247, -259, -50, -237, -20, 48, 223, 104, -9, -66, -487]
7079d87M92o5K78K7j31j74R7K62q2j15j92j73Q0K41j32J19J62K05k03k53J07J6
7101G9l8l79J48n9J68J45j82p8J96k35K66j78K16l9o0K02m83L90r5k7j24L09q9
7124E3k0l78J57L05J36l78K93J87m07k91K26K61k38R7j30J62N5R2l74k9J02K22
7146A03l40L90O8l12O4l1p4qQ1J05j16l2J46j08p6L3K26Q3k55L0m3Q5m72M19K23
7171A89k72n2K46l47L37Rk67K23k18J69j77k9Q5qK62l82mj34R3J36J53J39l69
7194b18Q7j93L18l2P1k8j79K27P5n1J35j08K90m08K36j59kJ08j95K02l43J80k06
7217a93K94O5n2r7jl5k78P9K50r5K07k21J46j25J31j82j20K54j09K26r8q3j93
7240b30J09J72j64J62J52j96j13K34k02J33L04l18K7K33k29j03L16j81n7K23l14
$$ y = [-487, 5, -60, 218, 245, 114, -60, 37, 299, 217, 102, -90, -263, -183, 58, -74, 45, 207, 412, 209, -44, 63, 79, 41, -338, -190, -249, -81, 64, -118, -196, 0, -235, 31, -147, 69, 30, -30, 172, -311, 79, -16, -43, -167, 142, 53, 33, -345, -188, 117, 253, -125, 168, 355, -52, -343, -117, 144, -94, 3, -127, 35, 90, 182, -192, -221, -119, 103, -237, 153, 221, -91, -27, -58, -132, -140, -59, 46, -70, -102, 44, -64, -140, -107, 119, 202, -53, -23, -66, 19, -453, -34, 189, -83, -135, 111, -236, 101, 110, -157, 66, -152, 17, -160, -189, -104, -112, 150, -232, -236, -370, -277, -141, 12, 151, -218, -131, -324, -6, -38, 33, 5, -174, 53, 128, 77, 212, 104, 394, -14, 222, 63, 61, 169, -26, 176, -167, 13, -193, 101, 166, 114, 17, 16, -19, -297, -218, 32, -63, 144, -77, 69, -56, 75, -107, -227, 27, -82, 144, 46, -37, -230, -121, 51, -113, 49, 201, 5, -108, 126, -76, 57, 361, 43, 70, 303, 74, -29, 287, 106, 49, 272, -42]
7261d2q3M1j0l5J61k64M27k34R7J63n14M75j03Q7R6l82K44q0j92k1K06j95L12
7284A54jm8l0j71K05L9q7m9j81L64r4K56k22j85k94L98j47l5Q2l4J8k09J81K90
7308B00K4j34p0R6k08K06m6j43Jk23L91L26n21J94k11M6K18j71J89j02K1r6N0
7331C7j05l4j85K86M11l89l04M22l76M03P6n91M32j33R9J30k22j63J55o2J26l9
7353b6j65K36q0l32M38Lj66p9j22K76n9R8j51L3J11J4o6P2j39L4J14K21k61J77
7377A81J8j76r6J06l32L94n3K5j60LQ6p2N50o09j09J90J2m7P8k52K82j63L5K12
7401A03j21j93J90N8J36m5k98P8R7p0k8j07L7J73j80L19j82J52j28P7m44N74k44
7424d6K21j16k92L69k9j87P9L30k84qJ42k31o5K22j19J0J19k0p2K11m01J97m5
$$ y = [-42, -125, -84, -94, -129, 32, -232, 195, -39, 58, 221, -293, 182, 79, 166, 262, -120, 124, 44, -148, -169, 37, -158, 154, 153, 105, 75, -96, 109, 148, 61, 12, -169, 195, 101, 357, 135, -50, -344, 54, -93, -128, -46, -80, -62, -271, -90, 200, 224, 90, 20, 116, -92, 114, 68, -75, -74, -297, 94, 420, -101, 93, -118, -72, 146, -25, 164, 62, 83, -13, 37, -68, -102, -287, -1, 410, 21, -283, 139, -237, 166, 242, -349, 83, -50, 49, 179, -43, -206, -51, -113, 13, -26, -191, 45, -35, -367, 71, 74, -92, -171, -293, -17, -76, 22, -129, -96, 15, 29, -37, 35, -104, -70, 44, 265, 4, 181, 199, 23, -73, 33, -299, 95, 42, 67, -93, -90, -4, -76, 474, -135, -244, -54, -42, -89, -11, -263, 19, -144, -109, 103, -18, -211, -21, 37, 173, 128, -170, -92, 5, -65, -93, -200, -163, 10, -170, 149, -33, 119, -9, 68, -376, 198, -46, 175, 59, -233, 136, 107, -80, -1, 329, 45, 37, 179, -52, -117, 105, -14, -4, 115, 95, 23, 234, -167, 30, -15]
7447a5m30M91q0j61R7K01N4k57N37p03K04p9J26l84M68j49J79r0R2k13L7K65n72
7470c82N15j30nM45l26J10k20n6N1N8j21J57j09K86n04M53l11Q6M4j27M25m32
7492i3m0K6J46p0k8j35K30l32N24l47J90j6l8J3q0O6k86J27K49J99m14p1K47j86
7516a19L67k87k6J76kj82R7M13n16o9K33j25J8J5j61K06m99N05P7j8K9k04r4L70
7540B04l00M8J87j1J2Q4j10j09l4k43M45k39J57k22J96J47j21M2j22k30K79m55
7562c95N69j76j77L23k17O3rj01R8Rl6J77j47K42k22J31o1L2N7k46k26L52J73
7585B13m17Q4J22J85k60J49k81K47N0J86k75r5J97J85j09k59o3K57k59J27k3M1
7607BJ7k39J93J47o7k69K46k00K02j05J87k56J27o6J40P2j24M2j29K91k82j71
$$ y = [-15, -445, 46, -34, -195, -98, 103, 157, -100, 437, -266, -62, -141, -15, -399, 69, -80, 99, 9, 101, -112, -75, 190, -382, 133, 3, -2, 443, 117, 227, 7, -49, 2, 60, -61, 96, -13, 273, -231, 222, -89, -3, 41, -86, 339, -93, -133, -107, 39, -31, -59, -194, 36, -296, 228, -119, 71, 55, 17, 30, -50, 16, -270, -143, 106, 305, -109, -180, 67, -119, 248, -39, -65, 111, 109, -73, 24, 437, -79, -148, 85, -40, -22, -7, -168, 38, -461, 44, 121, 103, 132, -72, -166, 204, -96, -48, 139, 128, 140, 224, 114, 5, -29, -272, 173, -66, 91, -131, 65, 212, 91, 133, 11, -219, 60, -395, 174, -2, -179, 144, -73, -10, -19, -120, -22, -13, -49, 128, -19, 223, 1, 132, 71, 103, 160, -86, -312, 40, 213, -204, -120, 2, 187, -73, 76, -205, 42, 92, 278, 3, -92, 105, 290, 181, -78, -141, 116, -143, -16, -39, 2, 19, -220, -27, 120, 53, -216, 30, -170, 32, -73, 114, -142, -15, -81, 59, 131, 7, 49, -80, 211, -71, -242]
7629b42K34Nj72L32j22M5j50P3j39J34k39K28Jk59K03J54k35K15k97K5K09k1K57
7652B39j02q7l7m31L76K2Q1J45j75J45p9j50K72j81j63K03k50J37j15K01J19j71
7674aJ18K58k90k88J39nK5OK11r4j4J9j23j04N3J13k86K76l4p2J41p9O3p4K0Q5
7700F3rOL5oq2J4Pn1n4K53k90M2mJo4q7N54j67j67J80r0l6N0j92K36k92J73nL9
7729E7j05kJ44q7J10k14K65k10q6K66l12L10Jq9j15K0K27j05k17j85J51l8K53
7752C9k22M10j50j6p0p4j8J50J75k79J42l90L95k98K48j81J74k89L86l70K66J62
7774A90K23l28J36o46M16K13L7n9m58K64M61k88n05K32N6j81K39m4j67J7K98K04
7796C10m43K44Rp9J41k35J25j54Q5Q3m00L90J18N3k98K23qk22J01R2k29N1K49
$$ y = [-242, -8, -3, -175, 157, 35, 80, -70, 3, -136, -2, -241, -13, -12, -271, -68, 86, -149, 66, -231, -206, 3, -18, 239, 137, 50, 13, -418, -42, -20, 61, 206, 31, 176, 97, -53, 219, 38, -125, 78, -172, -35, -150, 51, 170, -1, 117, 375, 85, -203, -64, -69, -44, -38, 173, 79, 65, 84, -39, -143, -90, 23, -263, 13, -21, -93, 48, -31, 32, -42, -22, 63, 54, 60, 95, 89, 7, 21, 28, -23, -77, 176, -114, -72, -76, -75, -139, -226, 328, 161, -6, 174, 84, 48, 98, -94, 142, -150, 23, 18, 57, -48, -50, 94, 7, 117, -97, 168, -42, -128, 138, -174, 136, 137, 48, -67, -47, 180, 75, -142, -327, -176, -214, 39, -183, 227, 77, 61, -9, -83, -101, 49, 224, -55, 87, -303, 92, -206, 42, -139, 35, -254, 132, -238, 28, 190, 413, 85, 221, -425, -9, 204, 241, 182, -276, -12, 449, 161, -344, -112, -56, -237, 2, -42, -209, -192, 106, 310, -133, 111, 120, 41, 182, -53, 72, -82, 3, 86, -314, 76, 194, 247, -51, 172, 164, -58, 43, 135, -94, -43, 206]
7819B06J46j65Ok24J84k13K39k57j46M8K60L0o0L8j91j31K17J56lj18l25K91J41
7842A29l7k00M14l62J5j1L09o35L76K5K26j85k44J07O2P1r6L0j94L97r5j18k50
7865b66K03m7K19J98l81k61K12K69l7k36J92j10K42J3k65O9R4M4j54k3q9O7O6
7888A9j56J29o2M18n07j27M18k37M07n74M65%m15P2K74O4n8k44J21J79p2k19J37
7911C2O1J45m30M17j07k28L5J96k4k19K42k95J04J56oO2J65l53j4k37L67l07L04
7934F6k67J3J55J67p8r7R8r6k4N7j11K61K37k88K12j66J9j42o4O7J01j34R6l49
7958b67J94K32p4P2j80J64j85K62P7l84J87k38P0R0k6r6j23J70J97R7l96N0l5
7981a42R7j15r9N0J92O0j64JL18l81K49p6k36L25PP1l00L33k11K12j05J6m64J03
$$ y = [206, 352, 187, 193, -31, 153, -60, 179, -78, -224, -176, 84, 114, 54, 92, -99, -230, -13, 143, 140, 22, -303, -12, 129, 92, -108, 306, -56, -41, -52, 257, -378, -2, 23, 249, 64, -180, -73, -11, 60, -36, -6, -200, 197, 102, -16, -266, -63, -110, 109, 307, -74, -335, -123, 146, 109, -127, 65, -45, 197, 210, -55, 14, 108, 152, -2, -25, -114, -47, 19, -137, -8, -70, 348, -159, -286, 132, -105, 302, -272, 193, 193, -222, -150, 124, 188, 130, -114, 7, 186, 114, -105, 32, 93, 238, -192, 225, 118, -110, -75, 121, 97, -122, 120, -175, -71, 85, 79, 141, 306, -47, -61, -298, 69, -238, 66, -201, -188, -33, 134, 56, -41, 57, -39, -63, -6, -117, 144, 381, 93, 305, 139, 158, 16, -48, 19, 120, -14, 82, -267, -73, 159, 85, 157, -23, 141, -44, 218, 295, -89, 98, -140, -70, 20, -6, -102, -225, -55, 142, 239, -157, -107, -142, -45, -160, -259, -209, -17, 43, -121, -120, 198, -183, 66, -10, -246, 79, 86, 157, -143, 190, -21, 191, 86, 102, -362, -259]
8005b59K72J29K2o5k17J18j24l7R5K81k63P4J79j71j38m2J55p9O4j04J26om5j64
8029a99K18o3J3o9K11j62L3J72l53K15J9j65N9R9j87j97J50K02k68R7M66m21N7
8052g3R1j6K02l13K76j6N8n72N10j06q2NK35m81M41l77M07n33K02J72n7p8K90
8075A85k68k16N50j42k3m23M35l2O2J67k59r0O9r1J12J05j94k1K25M7j59j06J59
8098I2Q9j8j21O7l6j43j29L05J3p4k1J72j41k54K20l9M4k0J88j47j1K59m72L50
8122A73k5k42K09k12p2oL90l55K94l81J27J3R2P8M1k57J45O3o6K70o1O3J14k26
8146A69j30O2l24%J67q3L64j85k32J85L08m80K06j54K05L0j75K08j36j22K90k91
8168a18J8J9j07M00m30M0L2J59q0N35n68J35l9J54O0l77QN0j2K40l33L11k8
$$ y = [-259, 13, 142, 164, 99, -118, 0, -124, -161, -66, 215, -48, 26, 205, 34, -104, -146, 9, -70, -6, -110, 16, 10, -35, -199, 19, -44, -31, -100, 111, -51, -18, 154, -199, 16, 35, -130, -71, 28, -159, -356, -206, -4, -272, -175, 291, -130, -73, 18, 2, 204, -109, 167, 151, 209, -363, 147, 41, -41, -36, 199, -282, 159, -218, 189, -344, -142, 30, -27, -105, 185, -83, -299, 251, 109, 86, -337, 98, 66, 128, 295, 36, -54, 15, -76, 36, 141, -53, -74, 151, 198, 39, -67, 92, 181, 163, 42, 109, 73, -70, -199, 106, 119, 45, 24, 196, 55, -199, 21, -18, 26, 6, 194, 47, 36, 295, -177, 173, 148, -94, 115, -97, -169, -175, 215, -140, 154, -227, -100, -87, 5, 83, 124, -133, 12, 75, 9, 279, 218, 281, 395, 169, 39, 101, -223, -223, -56, -139, 225, 40, -192, -7, 301, -179, 27, -127, 78, 108, -67, 141, 5, -117, 173, -118, -100, -81, -188, 212, -218, -178, -146, 13, -67, 468, -100, 35, -4, 150, 210, -167, -159, -109, -121, 119, -214, 97, 69]
8191F9
$$ Imaginary data points
##PAGE= N=2
##DATA TABLE= (X++(I..I)), XYDATA
0@%%%%%%%%%%%kJ0j6J6j6J7k4L1l3L8m6N2o0P0p9R0j03J17j32J50j69J89k12K38
35A26k66K96l28L64m04M47m95N46o04O72p44Q24r17J024j149J295j467J675j936
54a041K275k730L379m394O213j0497M0325K4506o7769l3210K0924N4493R185l4051
68G608l4998J0666L0770J1480k1355j5937P760J7509l795j8319m460K1129J5792
81B3850j3396l0550n579K9779K8899j0530l8928j9997K5441M0718N224l7771l2183
94c5023J3040M0732J5506k7004l1020N152L0565J1525j9668j8608R384K1103r45
107A4739k2521r127J9698K2268q969l0766j1393K4972L0149m874l5163k0047J9691
120a1343L3589M447k7874k4110P794K6858J0887j5780j9945R51J7390Q660j0592
$$ y = [0, 0, 0, 0, 0, 0, 0, 0, 0, 0, 0, 0, -2, 8, -8, 8, -8, 9, -15, 16, -17, 21, -25, 27, -33, 37, -42, 48, -55, 62, -70, 80, -89, 100, -112, 126, -140, 156, -172, 192, -212, 235, -260, 286, -318, 354, -390, 434, -483, 541, -608, 687, -780, 895, -1041, 1234, -1496, 1883, -2511, 3702, -6795, 33530, 58036, -9733, -42943, -22019, 32474, 41659, 7608, -27390, -16724, 14046, 25526, 4171, -11766, -4006, 13503, 9708, -8611, -13071, 8058, 23850, 10454, -20096, -25675, 4104, 33003, 22473, -16455, -36452, -11011, 29707, 34931, -2840, -35023, -21983, 18749, 34255, 7251, -23769, -18617, 11948, 23473, 3805, -14803, -5419, 15684, 14739, -7782, -16909, 2789, 25057, 16088, -14678, -26071, -1099, 29050, 24176, -10987, -31034, -11343, 22246, 26693, -1181, -25291, -17497, 9361, 20248, 4468, -15477, -14526, 2864, 11524, 932]
133I32j3295M549J6076J960j7348j2030J4041K3195k37k7009j8311J6228L2037
146B0788O090k8564k7003R183L3441J4461k1270k8190J070K5384J4530j2916j9656
159a2652L36J5587P099j1256j0580O387J3786m48j6320r942J1887K0435J237k2422
173f866j8485J0521K7461J0124k1471k6177K197K8281J7519j3969k6063m471K1018
186c81J6644p487j8983l521J4907J0259r179j3621L910J6461M059j6509j5022
199a8463R914K3293M966k1352k1044P147K6949J1847j8394k4654l06K3449J6618
212A9970j0298k2364n095J6427J3898n895j5414k355J2525P630q518j1812L562
225g739J5446N010j4253j5142N759K0979R378j5862k1605J233K3123J5352j1410
$$ y = [932, -12363, -7814, 8262, 10222, -7126, -19156, -5115, 18080, 17843, -9166, -27477, -11249, 20788, 26878, -1686, -28689, -19506, 13935, 28396, 7126, -21064, -19994, 5390, 19920, 7004, -12652, -12316, 3271, 10370, -886, -11466, -5079, 8707, 8259, -8061, -18003, -6116, 14319, 15556, -6866, -25351, -14830, 12631, 22755, 1284, -24893, -22696, 5585, 23104, 9135, -16928, -21399, -381, 16263, 8776, -10207, -13728, 1179, 11438, 2259, -11362, -7452, 9009, 13068, -3441, -18463, -8549, 14744, 19710, -1642, -22686, -15539, 11410, 23257, 4863, -19791, -20097, 3352, 19970, 9672, -12692, -17787, -1360, 12538, 6643, -8771, -11126, 1399, 9029, 511, -11301, -7739, 7707, 12717, -1536, -16678, -10919, 10060, 19438, 3576, -18029, -16796, 6327, 21679, 10269]
238A0269k3430n187J9152J7050o009j8839o445J2380J2047l708j2437k818J0830
251B855P366q108j2044K592J5081O807j3068j7136L209K0692J1523j3736k1280
264a5247j887J9979J5894p342k0329p693J4226J5897k021j5495o927Q818J0873
277H746k503j0448j939R515O240o990j1359J592J4421P675j0812j6718m80J8183
291E123J3879q567k1382o538J6582J7872l408j9352r500J1120J5154m38j2794
304b249o797O903Q970k272q791j513Q627N821p243j0996J257J3514Q560r849j5661
319a1719j113J5341J2870n824j7396p092J1318J5658K6j4135j0123N757J2596
332F164L444r788p764M895Q207o28q647k427Q299O583n444j1595j193J2800J0179
$$ y = [10269, -13161, -18348, 804, 17854, 11845, -6994, -13439, -1059, 10988, 7280, -5157, -7975, 2855, 10221, 2113, -9931, -7339, 7742, 14549, 1481, -15655, -12446, 8246, 19769, 6033, -15247, -17134, 2845, 18739, 11397, -8932, -16625, -2399, 13498, 11477, -4018, -10945, -2127, 8746, 6243, -4205, -6144, 3371, 9611, 2621, -8738, -7146, 7275, 14950, 4138, -12580, -13060, 5123, 19002, 10435, -10947, -17485, -903, 16969, 13561, -5791, -15291, -4171, 10983, 10545, -2249, -9046, -2143, 6827, 4555, -4236, -5749, 2878, 8699, 1456, -9540, -8283, 5231, 13791, 3942, -11719, -12832, 2509, 15379, 9555, -7841, -14933, -3615, 12043, 12069, -2066, -12189, -6432, 6164, 9608, -180, -7944, -3049, 5158, 4530, -4117, -6544, 1755, 8338, 2894, -8701, -9894, 2906, 13085]
347A3085o584j6037n342J3571J4916k999j6708r144R714J4419J472j1798q718
360a0153M318R310K603o155m863K830M792p68n773j641O497N687m088j0262k823
375a0489J0512J0849l344j4689p490R828J4907K120j4531j1857N176J4515N908
388A1415r629j1082J321R720M249n377n686K752N739j784o149p20P160N340m970
403B299j0343j835J0334R920k936j3633o890Q075J3547K313j1662j0770K659J2399
417C477O249o707j0167r69Q157N193l414n822Q03N174J067n449k969N114P419
432G156k251j0495m162Q419J1395j109j2510q073O878J2791K613j0264r357K253
446f716J0344M709n618p767R4O182K555l454l317J997L780l45m902k727N057N947
$$ y = [13085, 6501, -9536, -14878, -1307, 13609, 10610, -6098, -15242, -5528, 8891, 10363, -1435, -10153, -5835, 3475, 6078, -77, -4940, -2110, 2682, 1914, -3859, -5500, 997, 6684, 2596, -7666, -10489, 23, 10872, 7528, -7161, -14651, -4823, 10084, 12204, -2327, -14184, -9008, 5507, 11415, 1786, -9296, -7975, 1745, 5994, 617, -5069, -2317, 3422, 1638, -4511, -5231, 1929, 7269, 2299, -8044, -9879, 455, 10375, 7439, -6194, -13084, -5009, 8538, 10851, -811, -11581, -8922, 3477, 9726, 3019, -7148, -8117, 40, 5233, 1819, -4003, -3200, 1974, 3041, -2408, -5377, -263, 7156, 4905, -5590, -9752, -1333, 10062, 8953, -3557, -11630, -4752, 8039, 10652, 388, -8969, -6716, 3628, 8337, 2719, -5048, -4954, 1228, 3783, 329, -2988, -991, 2789, 2444, -2458, -5185, -128, 5819]
462E819r26q068n133N282R778K112r233q743K932J0825N296o514r222n04Q044
477A745N538l310o240m39M535K078k894k909K279M697j246o239k366N153P179
492G561j092q493n888N120R376K615q067q324J053Q432N839l843p982k131N239
507e85N343q90m898j638K631K117j312k394J875L449o03m814k931M397O588M53
523F788p404o209L167Q989L771o214q346l4P588N629k660p314k324L932M587p05
539C241l124j748J435J344j612j097J455K671l17m405k908L108N972J066n554
554d73n960J163P810M243m041p198j956N963N642o99n580k927K385M316K43l034
570a03j016J524J350k080j196J420L536j46m464l263K220N694J563m414n967j48
$$ y = [5819, 4893, -3175, -8308, -3026, 6752, 8864, -369, -9112, -6180, 4645, 9941, 3427, -5795, -6299, 1745, 7283, 3973, -2267, -2706, 1829, 3907, 1013, -1896, 383, 5080, 3834, -2405, -4771, 382, 7561, 6469, -2024, -7912, -2792, 6584, 9199, 1132, -7192, -6139, 2293, 8132, 4289, -3693, -5824, -585, 4758, 3868, -1030, -2668, -37, 2080, 768, -1626, 249, 3698, 3095, -1719, -4650, -253, 6335, 6788, -616, -6825, -3658, 5331, 9102, 2888, -5458, -5492, 2096, 7725, 5065, -2249, -4573, -641, 3946, 3241, 117, -1631, -196, 1148, -464, -1561, -106, 2565, 2248, -2157, -5065, -1957, 4015, 5081, -473, -6433, -5270, 2540, 6783, 2742, -4456, -6412, -449, 5193, 4494, -1086, -4013, -1628, 2688, 2931, -103, -1119, 405, 1755, -325, -1521, -101, 3435, 3289, -1175, -4438, -2218, 3476, 5039, 625, -5342, -5490]
586e490O110M632k318o286k772L983M778N02m417k812J220K457J017r23o82O62
602c39K81j315j452J756L299M02m081l203J580N510K725l809n599q28M997M602
618D526p33n652k739J961M728J192k854l101L44K024O12o33l38O63Ok088j183
635c265J693L208M66l579l304P26M950L006k535n315j490L988M416K83l989l257
651c998J154L770K017j648k246l66Q10J082LK80K94l71j851o63J096K946Q70k845
669C34l735k6L865L563j586m550k634K713M221R26k906l431J34K882J958o89j882
686h43o14N31K34K61R76Q49m67k149r27J525K550J397k266l198o81L331L418k39
704C688m034k772J592L802J677k102l146p01K093J614L49j247j021m20K72k5P25
$$ y = [-5490, 620, 5252, 2934, -3352, -6124, -2141, 2637, 3139, -1278, -4090, -2870, -413, 604, -319, -1001, -339, -58, -1373, -2825, -1069, 2230, 2632, -1449, -4652, -3072, 2438, 5163, 1354, -4245, -5073, -76, 4526, 3793, -1859, -4598, -2637, 2091, 3283, 429, -2672, -2328, -304, 308, -325, -663, 0, 6, -2082, -3265, -1572, 1636, 2102, -1477, -4781, -4055, 895, 3901, 1366, -3949, -5439, -1451, 2965, 3248, -741, -3998, -2844, 926, 2943, 1295, -951, -1317, -507, 575, 578, 858, 1152, 781, -1070, -1733, -637, 2309, 3179, 334, -3401, -3427, 438, 4001, 2415, -2135, -4769, -2056, 2165, 3091, 185, -3246, -3112, -230, 1728, 1039, -843, -1457, -926, -692, -431, 545, 1394, 927, -1222, -2149, -624, 1926, 3323, 1057, -2141, -2822, 509, 3927, 3688, -346, -3118, -1526, 2276, 3953, 1851, -1295, -1996, 97, 1711, 2060, 813, -208, -628, -356, -381, 344]
721C44J009k35j931j684P30L262J538j978l420r99K753L453R4l121k542M13L347
738A033J881p37k323j478J132J382N90J39p05j050k72J73J102J720p40k069j389
755a611P06K536J584j122l452j326J895K890O75k071k984L28J973K150o93j531
771e3j212J5P81R73P13n09j340r21O59R96J727k34j559k145P13K486J690j103
789A677k342j520R18K846J182j335k160j063J461J587J117j327j799o27N61J259
805D35Q71j42j150j420l92J625J439N2j807j340j05J540K100k09j756j702j18
822b079K485J403m96k133j178M62J610J351K7j707j007k44J416J451k66j219j182
839a306j33J038J530M48q94j879q37J368J839O61j652j732n76J667J839N5j157
$$ y = [344, 1353, 1118, -813, -2497, -1767, 1495, 3033, 1055, -2365, -3364, -611, 2842, 2936, -185, -2727, -2314, 1033, 2914, 2177, -146, -1624, -492, 890, 1480, 1619, 914, -136, -408, -235, 867, 2587, 1847, -222, -1611, -905, 1631, 3215, 2093, -1359, -2685, -790, 2100, 2775, 704, -2280, -1952, 21, 2171, 1478, -53, -1265, -1250, -469, 504, 1217, 708, -632, -1553, -894, 102, 1829, 1595, 36, -2109, -1396, 1090, 2780, 1677, -665, -2185, -1267, 1579, 2761, 1426, -734, -1797, -336, 1251, 2368, 1041, -758, -1385, -824, 435, 1306, 1164, 14, -1406, -1798, -173, 1266, 1318, -489, -1829, -1934, -394, 1706, 1497, -259, -1961, -2079, 406, 1809, 1313, -820, -1998, -1536, 74, 1425, 1452, -255, -1262, -1506, -90, 1361, 1095, -124, -1306, -1439, -401, 1129, 1577, 683, -1196, -2033, -665, 1174, 1835, 183, -1549, -2125, -458, 1381, 1436, 279]
856B79j896n95K053J262mj009j486m09J185J220L92p75j395o53Q19J661R41r89
874F01j866p56J108J900P57o74j978j151J132K146O45j495j765l53J165J606N74
891A596j045j451q55O95J858R42r06j325j074M07J419J496m22k134j034R31J635
908G33P22n09j783o22L65J401R62k68j545j253P17J642J041k54j544j138K03J306
926A76J643m94j634j316K65J693J020k44j242j342q2J594J728k06j603j794M12
943a426J624J139Q5j398j218N3J375J040M16j392j522p3J349P84O39j448r64p37
961a674J251J456M56j135j889j97J313J633J11j089j445l85Q72J893L69j113j791
978a364J37R94J209M26n76j693m78Q98J566L93r29j367k74N22J240P11o69j217
$$ y = [279, -1617, -2212, -159, 1103, 1099, 90, -1396, -1805, -620, 600, 992, 217, -1178, -1831, -1012, 649, 1590, 601, -1265, -2021, -913, 987, 1744, 1070, -908, -2059, -927, 1219, 1864, 369, -1396, -1749, -584, 1022, 1596, 551, -900, -1755, -1060, 798, 1740, 834, -491, -1565, -1158, 261, 1757, 1335, -799, -1833, -902, 733, 1455, 946, -837, -1459, -1094, 307, 1269, 1001, -544, -1797, -1080, 562, 1603, 1349, -195, -1333, -1130, 176, 1819, 1325, -309, -1625, -1360, 333, 1353, 1109, -133, -1475, -1557, 37, 1765, 1559, -44, -1838, -1426, 198, 1337, 1422, 24, -1194, -1141, 234, 1274, 1690, 298, -1224, -1297, 52, 836, 1475, 27, -937, -1674, -423, 1033, 1489, 354, -1535, -1732, -419, 1214, 1325, 236, -1209, -1594, -722, 1171, 1540, 427, -1364, -1227, -233, 976, 1402, 826, -867, -1345, -447, 1119, 1512, 583, -784, -1058, -536, 704, 1415, 746, -471]
996d71p60M40J738O73q14j450o60M98J506O57o89j243r05L42J918O83o64j355
1014e56r27N34J181J065j018q26j032M13J395J359o51j189r41K30J185J111n3
1031A280j671r72L82J369J249l41j188j441L92J498J192m05j245j097p8J224R39
1048A087m6j522p00j15J325J277l36j153j163k7J220J086L7j276r27J48J024J158
1066A097j00p91j082k91J014J272J50r65r22n69J064J317J11r31q35o64J242J185
1084A302j1p70j202m55Q96J428L33j131j398k30N90J274J15l58j140n97P71Q59
1102B76Q51o82j521m96P36J171P84p14r57j110Q98J584J58r8j448r44R09J205
1120F02P53o04r89o32L00J058J023o68q60j049K84J149O66O5j153j035J79R49
$$ y = [-471, -1231, -791, 947, 1620, 806, -644, -1304, -806, 700, 1357, 668, -575, -1480, -1138, 780, 1463, 799, -556, -1483, -949, 232, 1297, 279, -547, -1579, -1166, 229, 1588, 937, -252, -1193, -963, 222, 1333, 1280, -391, -1363, -981, 388, 1637, 1296, 108, -1333, -941, 557, 1749, 1344, 99, -998, -1076, 148, 1087, 1041, -481, -1181, -1296, 29, 1306, 970, -183, -1346, -1373, -153, 933, 970, -306, -1233, -1085, -61, 1097, 997, 206, -876, -1167, -153, 1119, 1269, 304, -618, -1187, -123, 1194, 1305, 374, -461, -1125, 117, 1302, 1291, 521, -681, -1136, -240, 1188, 1521, 390, -1008, -1238, -648, 626, 741, 383, -757, -1354, -583, 276, 1127, 445, -1076, -1572, -836, 335, 1119, 405, -552, -1662, -764, 820, 978, 880, -568, -1512, -603, 602, 1355, 751, -238, -870, -570, 488, 1511, 843, -17, -1066, -782, 367, 1033, 1098, -55, -1090, -911, 38]
1138C8J024l49j347r26J50J814N43l68j180r06N74O58R97m2j214o26n9J068J065
1157I14O6j098q57R3P89J125J35r50j228j08J297J034j15p62j127J46P72P56M57
1176A339j325q60o2Q39P63K78r19j084j4P41P65K16o09j314j59J005Q05L04n22
1195A87j179m24O77J248J35o12r30l33R50R60M42o01j221j85Q57Q58L52o68j016
1214e03m1M78P63K97o74l89q10Q16N38N24m7j595l55N38J039M64n53j075q99Q78
1234f06R03K99k20r69l44K76P40M81k60q53k19m5J089M12j02m95n56j29Q59J067
1254A328l29r86p42l3J228O91R4r31r86J00J181P51o86p71o06P4O36O47L6p68
1274g2m95J28K29O33M86q93o74m16Q12Q79K12q58p72j67Q80J100k14p99p81o7
$$ y = [38, 1062, 713, -634, -1560, -1410, 404, 947, 579, -601, -1507, -933, -275, 722, 680, -534, -1160, -1219, -151, 914, 980, -118, -975, -882, -93, 1032, 1167, 217, -1011, -1119, 178, 1212, 1097, 335, -792, -646, 126, 882, 1339, 14, -846, -908, -69, 694, 972, 53, -1031, -1045, -304, 461, 677, 68, -1246, -1405, -400, 405, 709, 187, -992, -1416, -739, 509, 644, 32, -898, -1231, -281, 679, 1121, 520, -701, -886, -29, 829, 1181, 513, -503, -544, -66, 697, 994, 320, -69, -879, -63, 475, 999, 952, -643, -998, -460, 579, 1043, 490, -585, -1484, -606, 297, 596, 376, -593, -937, -661, 79, 560, 300, -553, -772, -817, 272, 684, 582, 87, -469, -598, 261, 1328, 999, 13, -729, -762, 466, 1157, 1251, 320, -666, -566, 615, 1366, 680, -91, -697, -623, 13, 660, 696, -72, -567, -439, -210, 423, 909, 16, -658, -1074, -262, 617, 829, -29, -801, -968, -88, 1012, 798, -1, -782, -849]
1294h49J051O50Pp29m61p3R02M18J58n21o66l89O43P79J66n19q28k81L56P75N80
1315A169m38j311j79L29J436j68n55p99k68K86J102J8j67r07lJ96P28N91l67j002
1335c09j47j49Q79O82m5q49p25K38J007M16l31r67l47L27Q69O32m51r18m31M10
1355b09Q54J13l21l16p33J8Q68j3L01l73p85k79R24M07J87o13j241J60R26P76
1375F51J47j172m40J86O93N89l91m47n34L86L37N97k83l07p03R6M83M78J08m63
1395A1m62n16O42O84K69k63j119j68O73J158o6p61p59n44Q21Q68k46n51q79M05
1415h03R63J30l28qm42m23N74M87J47l90k40m87J47P27R38p17q96j11J75J045
1435D88M62p90r79k18R75O41p6n89o37J02K51N46K23j70q12J38j61M25N67j04
$$ y = [-849, 202, 852, 859, 130, -331, -404, 498, 916, 1074, 553, -113, -502, 141, 920, 1086, 567, -261, -542, -186, 589, 1169, 731, -580, -759, -430, 1006, 838, 283, -516, -784, -498, 604, 622, 455, -452, -455, -259, 469, 1060, 693, -309, -456, -605, 274, 956, 911, 62, -663, -425, 582, 998, 667, -300, -647, -320, 549, 1181, 730, -188, -619, -209, 645, 758, 437, 121, -612, -594, 274, 261, 562, 189, -596, -875, 49, 456, 643, 30, -1211, -1051, -125, 651, 798, -374, -814, -628, 65, 654, 263, -184, -718, -332, 5, 602, 319, 12, -691, -595, -112, 366, 474, 11, -451, -967, -325, 359, 628, 365, -754, -922, -249, 909, 843, 82, -677, -1221, -400, 468, 222, -329, -1208, -803, 160, 290, -38, -46, -488, -911, -337, 150, 297, -93, -333, -820, -673, 54, 992, 275, -621, -732, -557, 488, 950, 160, -819, -1037, -62, 579, 503, -86, -723, -621, -370, 176, 399, 229, -583, -445, -606, -181, 386, 282]
1455B82m87l47j23P20N03n9q65k78J89M83N33n5q47q09P98O15L55j75p36l70K26
1476d47O49K88J07p06j54j34N15K73K02n84l67l80O86M99N26j066n42L20L99Q71
1496I55l37m89n84J67J98N87N6m12k95m81J012K32j23k46l59l33J95P43K2n8m68
1517a8r20P77R76p7n31l72k39L72P99q7o30o45J52N98O53m00n79r5J31L3L45M47
1539F90l51l90j00N3M14M26q6p00n45L13P50P8l65l16m88P70L30L73q25k77O9
1560a77o2N30M02o68l88j03M12N4K61K46n63l93p4N76N59J17n95m72j14P16N03
1581G67l45q82l40M27O92N19k81p52k87M40J25N46k78m48n60K94M95K01j10o12
1601c89k60j05M87P00j68l08r33M34N42J42K36l54j115N63N56M77j24r46n4N9
$$ y = [282, -205, -552, -675, 45, 548, 489, -376, -654, -465, 18, 551, 496, -351, -1160, -362, 253, 608, 433, -303, -673, -447, 202, 490, 597, -109, -263, -397, 118, 391, 593, 9, -358, -738, -52, 447, 973, -93, -635, -315, 84, 955, 618, 129, -455, -288, -90, 497, 553, 141, -154, -635, 377, 609, 486, 240, -119, -452, -257, 486, 508, 450, -18, -938, -161, 815, 738, 207, -165, -404, -32, 767, 680, 50, -595, -443, 155, 808, 408, -171, -266, -135, -102, 243, 690, 339, -51, -151, -98, 316, 742, 656, -44, -589, -276, 474, 552, 187, -129, -617, 153, 483, 856, 31, -246, -177, -239, 291, 693, 25, -363, -466, -54, 0, 261, 507, -56, -449, -523, 53, 612, 729, 134, -338, -452, 264, 767, 422, -460, -800, -373, 319, 838, 557, -195, -482, -42, 83, 629, 351, -97, -657, -363, 132, 333, 223, -389, -649, -754, -267, 433, 265, -43, -976, -542, 0, 142, 378, 24, -1091, -528, 28, 505, 381, -565, -619, -560]
1621e60O44L87k70k11m14N7K60M04Q2l5p85M2M77J44K30l84q21M27K69M97O3k40
1643B63q59L9L47L71J87l85o67J04L68L28L83l34l82n26J68N62L39l67j10k51
1663d22J08M30L37o94j8k44J1R68J86m85m28o8J57M53L51l29m90ln5M97J07K28
1685E97o98j39L80J06J8K20n16m57M7N69L42n0o89l49L27Q3N48r5k54m77L00J62
1707b5O20k83l12j64L4J66K38o1j16l96P8M96K91J05l38n66n9M26N78J32o02n42
1729c00J88N58K5p1j76m08J59L3O47l09j25k69k11K61O72k48m45k09K9O9N57n7
1751C70j67k35j38M62M63l89j4m12j17L13K98N2j30l96j98K80N60J43k29l29k56
1772f9O8O73j25k90j65k38J88K05J86k32n62L32L5K80K54k66o44M9j11N62K56
$$ y = [-560, 84, 471, 201, -10, -424, -367, -107, 297, 379, 344, -441, -399, 78, 222, 452, 68, -753, -326, -57, 440, 503, 263, -596, -557, -210, 161, 348, -37, -704, -600, -232, 96, 479, 145, -237, -763, -595, -33, 306, -61, -171, -422, -314, 116, 453, -241, -259, -503, -492, 476, 662, 177, -251, -319, -162, 291, 642, 313, -177, -180, -235, 262, 369, 597, -101, -240, 140, 246, 264, 484, -32, -489, -442, 127, 469, 419, -270, -619, -292, -209, 339, 244, -10, -487, -187, -25, 595, 312, 0, -164, -130, 36, 274, 213, 97, -299, -221, 275, 566, 671, 333, -233, -292, 134, 712, 844, 242, -300, -112, 446, 471, 400, 224, -184, -25, 8, 655, 346, 221, -48, -259, 2, 674, 426, -19, -228, -199, -130, 427, 370, 203, -32, -170, 292, 755, 366, 352, -60, -177, 136, 434, 486, 356, -40, -238, 42, 602, 745, 516, 187, -69, -1, 672, 547, 257, 92, -146, 42, 247, 433, 201, -361, -29, 6, 286, 540, 274, -370, -321, -432, 130, 386]
1793C86j7m12o29J80N83J43L7m49J39k01M00L97k90l38m89L73M16M06m89k65j86
1814c05p8O61L68k68j98m97K9M75Q8M1k90m74o0N56P4j15J5o35M59O8K43N5n23
1837c11q4j07L13M68j48l30j76K88l55M43J18j15l97K48J09J43L14k51n43p9R4
1858c58O72J32n45n55K49L33k08O26q35J36j8K6M86k66k47j75pK06K08O7l30k76
1880f79J52L09K89Ol05j34l49M69K9K30p7l02L2K06M67j49j17k83j95J7O61p5
1902B02qo56P5J4O69n6k38n46O0K92K36R2M9l20k23Q3J90M17k3k88m48L52m7N16
1926C94m18j40k22O7L79J37j69j02j80J35J91L42L8k71n28K62N91j58j06l16k71
1947c45K06L27J02o9j38l92J18K27M20K22o23k14r4K73O61k24p37K0J7M60J58
$$ y = [386, 369, -43, -672, -492, 91, 234, 271, -178, -39, -240, 160, 557, 267, -71, -560, -187, 229, 635, 146, -119, -305, -383, 278, 646, 378, 180, -317, -288, 187, 275, 316, 26, -448, -508, 48, 122, 7, 22, -613, -154, -86, 157, 212, -311, -395, -502, -189, 279, 131, -199, -375, -87, -442, 1, 119, 4, -393, -145, -36, 107, 421, 170, -373, -452, -358, 314, 446, -99, -654, -405, -72, -280, 346, -489, -353, -371, -345, 141, -125, -372, -547, -554, -348, -140, -73, -403, -679, -527, -218, 71, 77, -228, -362, -711, -242, -213, 17, -60, -362, -330, -124, 343, 194, 77, -206, -401, -384, 277, 202, 194, -462, -387, -373, 296, 240, 2, -544, -484, -192, 44, 136, 185, -135, -358, -275, -85, 332, 309, 21, -427, -75, -122, 394, -24, -164, -386, -319, 60, 197, 28, -74, -254, -119, 72, 414, 452, 181, -347, -85, 506, 348, 242, -74, -345, -139, 188, 290, 221, 83, -309, -191, 36, 456, 678, 55, -159, -253, 20, 681, 457, -280, -260, -243, 217, 375]
1968C75p4k13n08M64J19J48L6q4m81k29O42r8N96l43k18l72M39J24N7P5n61k46
1990c52L21M90k0j12m67k2J66L33o8Mj31k4j1Q6Q9L19q20J10nL60K40j3n18m52
2014d97K93O34M1m56j86j54L26J83J63j05n36J05J67K67r0O1l00k57J89N17J1
2035C76M0n22n6k7L99J69p1j76n73J03L66M60m63nl28J15M14J81j64n53J11q2
2057b86N10k33p3j11k80M36k61M18k8K79o71R1j99M00J83J14n17j89M18P6K08
2078B85k36n04M3N64q8L19m21r9o7M83k70m9j85K3n9K29l70O88l16j15k38L0M20
2101F7j1M3m53l45K96O58N8m08l28L64J19K27j31n49OL2pM36r5J3l53K08k07K58
2125a02q1K01j48k27m2K86P27r6o79p7J43P1M42j90l71l9M19L44l09l79j92L3
$$ y = [375, 301, 88, -420, 44, 163, 311, 347, 263, -218, -447, 195, 97, 693, 350, 132, -240, 199, 323, 380, 455, -106, -352, -31, 459, 439, 327, -140, -162, 4, 337, 269, 273, 142, 118, 107, 193, 282, 601, -219, -109, -114, 246, 486, 473, -45, -497, -204, 430, 471, 15, -171, -325, 1, 184, 347, 242, -294, -189, -22, 245, 155, 216, -84, -341, -152, 365, 376, 416, -106, -162, -189, 210, 379, 308, 132, -441, -338, 28, 488, 25, 20, -308, -193, 221, 402, 238, -315, -204, -286, 224, -9, -82, -193, -473, -37, -298, 120, 92, 371, -300, -209, -408, -8, 175, 289, -228, -417, 1, 77, 285, 49, -455, -412, 152, 64, 383, -38, -137, -204, 279, 9, -40, -225, -202, -261, -32, -402, 286, -30, -145, -383, -353, 67, 56, 99, -354, -699, -403, 255, 313, -95, -423, -59, 60, 287, 156, -393, -387, -355, -362, 74, -21, -8, -361, -153, -360, -102, -183, 18, -130, -357, -399, -113, 614, 518, -161, -238, -95, -24, 418, 228, -143, -182, 237, 581, 272, -107, -299, -266]
2147b66J09m0J25r7J55k47p1K24J26K16m72M2l65L31N61k9n50q2M0K97K20k4m42
2170b39k31P47j37L6j96j37J81L43m45K8J07K11j75m05M02J49L84p3m46m08K79
2191b5N93Mk09q21M47J73L86k36m52n47N90N76l15j35k43M12K0j85j01q2L43k09
2213a6m1k95P8O95k01l32m87L00L26P65k40o70n51P86N23k09m21l14Q6L07J75
2234B64p16K58K26K83j78k90K1M79J98o10l41K69K93M36n51p78k10J178K07M5
2254D83p79j75K34N49J99n91l40L47Q9J11o02J44J61L53J00k55j55N4M86o10j37
2275c34m0M98K37j40q32K34J73P59j96o30l88J80R45k06j99n32K31M30k56j87
2295b53j2Q9L29k51k98r2O81k34K29o99L4O30M38m65m58l46O39O00m84k16m26
$$ y = [-266, -157, -197, -72, -169, -14, -261, -332, -108, 18, 234, -238, -196, -561, -230, 331, 302, -248, -330, -290, 7, 227, 203, -239, -470, 277, 140, 176, -20, -157, 24, 367, -78, -50, 57, 268, 93, -312, 90, 239, 623, 550, 104, -304, -25, 568, 572, 363, -458, -11, 162, 548, 312, -140, -687, -97, 479, 164, 29, -214, 198, 218, 33, -68, -150, 193, -16, -57, -352, -274, 421, 220, -112, -599, -299, 27, 792, 552, -118, -669, 117, 640, 431, 10, -304, -218, 89, 264, -452, -194, 32, 315, 137, -153, -132, 347, 545, -65, -406, -137, 156, 592, 41, -737, -947, 231, 438, 483, -296, -471, -237, 312, 511, -80, -420, -73, 16, 127, -475, -331, -170, 183, 283, 28, -127, -73, 413, -197, -334, -374, 124, 361, 221, -611, -377, -204, 555, 359, -271, -659, -479, 466, 260, 61, -471, -240, 190, -66, -253, -265, -176, 153, -98, -396, -488, 193, -41, 188, -511, -477, 153, 591, 126, -332, -678, -39, 561, 77, -139, -565]
2316e65M05L97P5m26k71L09Q79n18n62lJ00K53J65n94J2L72K22j01n22k78P41
2337I0N68l61q43k2K39P82P9p58n89N95M14L49r77J03J34O09q8l23k78N86P2j84
2359A97l85l99Q10L27j52q18k28Q12M73p5o02o32K80J270k59q28o76O40P22l4
2379D43m23l89L9O93l09k14k04J7N08K9l93k90O21L69M4j118j52Q13O57p1o62
2400Hq37Q44P20j27m79n62M07L87J63l55q20O61M18K24o79l66L44M86k35n23m7
2421c68J33R55k38p75m94M37R00K55j149m74L17J066J2o42o21K80Q16o4j94n62
2441d10K91J51N22n32k17L97M02J01p63k68J92O37K50p28q22P38O47L25j053m29
2461e69K35M41N14l61q16J91R30J43n41n41j47P34N84j104k09L05L15M09n96p13
$$ y = [-565, -160, 237, 312, -114, -385, -76, 803, 285, -277, -280, -180, 73, 238, -356, -344, 28, 250, 149, -373, -651, 90, 658, 297, -546, -568, -329, 453, 532, -226, -815, -220, 194, 543, -434, -331, -197, 412, 324, 1, -277, 309, 381, 197, -188, -587, 223, 550, 398, -420, -648, 164, 637, 562, -40, -672, -392, 878, 619, -209, -885, -245, 477, 443, 20, -369, -330, 363, 54, -160, -364, -347, 161, 190, -203, -493, 128, 497, 541, -577, -729, 84, 741, 670, 8, -829, 15, 735, 608, 129, -433, -26, 361, 524, 169, -651, 10, 428, 652, -27, -393, -49, 437, 202, -321, -368, -235, 720, 482, -293, -787, -350, 550, 805, -344, -818, -501, 565, 577, -65, -686, -406, 410, 346, 152, -410, -119, 32, 554, 22, -195, 202, 604, 705, -58, -326, -134, 503, 753, 25, -797, -59, 588, 913, -140, -569, -334, 107, 621, 260, -556, -365, 565, 708, 167, -374, -521, 213, 797, -307, -516, -211, 104, 513, -83, -796]
2481g96J64J165O7n99n67j78J255J88j79j051J35J126j05l43p07J08N89K77m19
2500A30p01K39O86L78p05n65K03P69J24o59m47K41P74L72q00q68K63M32P67m89
2520A44r70K18M80O99n39o07L47K48O09l48j005N21M78J92n25l66K04N14L56p09
2540e9p06J20J126K32n02j131K26J129N50r51p06N3N60N01j75n87J2N84J74l30
2560A20q17P17K67M44q33j65K3L95K53r4q99j08P20P70m44r39K6R85L88o46k75
2581a12k70L43N83k10p29p1M38O48m38o92N9O89Q6j24o42j73O76M72m08n33l50
2602g58O78J047n34j042j39Q90K78N1p17m68R76P49m65j109r5O68M98m86p66L89
2622c55N21M70m31n08j15O52O43n97q67k36Q35Q31l80o26o51P54O88n4q32m84
$$ y = [-796, -632, 533, 600, 1, -566, -744, 511, 699, 520, -531, -396, 730, 625, 282, -425, -317, 272, 549, 130, -571, -332, 354, 732, 27, -538, -335, 434, 558, -101, -548, -307, 467, 839, 39, -829, -566, -134, 633, 144, -826, -608, -128, 571, 32, -575, -228, 20, 629, 281, -724, -203, 275, 467, -58, -424, -220, 294, 650, -59, -765, -645, 481, 713, 211, -920, -694, 435, 985, 34, -672, -619, -59, 442, 267, -320, -308, 276, 450, 120, -697, 20, 287, 731, -102, -267, -244, 151, 404, 310, -589, -697, 23, 793, 349, -590, -564, 421, 809, 163, -112, -382, -39, 544, 334, -395, -466, -28, 620, 182, -510, -451, 238, 324, 200, -442, -615, 61, 533, 125, -408, -758, -80, 967, 433, -609, -748, 142, 420, 471, -246, -714, 262, 1011, 546, -563, -658, 10, 508, 22, -744, -355, 166, 636, 205, -303, -418, 234, 877, 280, -587, -823, 12, 843, 463, -163, -814, -60, 628, 574, -258, -742]
2642g42M39J009o4r60l35N44J003p57n17k38N76Q28m35p57j53O61P60p54o77j94
2662g63N18P48K5p38n19M03O10K18n38q95Q89M50r0n95j40L68M04J53r81j95P25
2683E7N10k48p22k66N29O93n2r26k92P69L43J45o96j63q0P91J87m80q72M40O84
2704C51M12q14n70M66O52Nr33k59O37N35K22j020k74N15N66k44n86m62L42J364
2724I05k20q60n81N53P26l2o04k43K15O21p9l59q02Q60L36mo01o63N06J057k43
2745D88p52n48N65J154k67o94o99N30N28k59j11n38K39P78K5n51n20M50L41L13
2765D72n60m95K45Q28L18r52o48L88R09n0o45n52L65R51P3q21l94K83K99N92o20
2786a4n16J67P46J48j27o47qP79j80k83q23N90M10K16l65q70L96Q87L16j093n19
$$ y = [-742, -303, 706, 642, -318, -653, -109, 894, 137, -380, -618, -42, 786, 351, -406, -559, 102, 862, 108, -569, -763, -245, 503, 528, -210, -729, -326, 284, 502, -36, -931, -42, 408, 318, -277, -417, -49, 355, 508, -473, -668, 57, 567, 319, -403, -669, -140, 553, 501, -425, -717, 52, 395, 540, -156, -319, -399, 392, 579, 99, -773, -333, 351, 763, -51, -621, -155, 497, 502, -431, -690, -53, 482, 704, -316, -590, -75, 491, 247, -339, -801, -459, 905, 685, -175, -756, -203, 523, 491, -113, -356, -141, 480, 401, 42, -760, 100, 436, 432, -169, -832, -326, 731, 488, -264, -812, -247, 907, 640, -54, -753, -223, 305, 46, -65, -603, -364, 414, 439, -112, -632, -182, 159, 472, -88, -583, -338, 490, 808, -144, -792, -404, 505, 455, -190, -742, -377, 574, 647, -174, -568, -285, 14, 606, -14, -530, -363, 383, 531, 404, -243, -251, 528, 348, 65, -758, -168, 242, 458, 93, -777, -381, 506, 822, -271, -790]
2807g90L76P93n8l04q96L42Q39J73m62n84J68Q01L02n26m03R0L87N5k12o38M00
2828a47N46K15q42k49J19R31M1n08p08O1N25M99j98o47J32R9Q34l86r56%J007
2849C68K06m39m22k68O76K52j47o98OQ46p8k31n38MN52N32m87r62N18L60P50o47
2871A53m92l73P37P49m65o77MM28J9j87k36K62K30K59l36p31j02Q16K53m13n34
2892f36k4N59N22k64o08j33Q15K71l96l72j64N67J76k71k16J0J41M16k91l20l30
2913e48N82M01l88m70L03K24L11M1q83O2M07M65m30m71j53N69M59l54l77j77L38
2934h9O02l33m98K25k9P53o69l26J35P9P32o22m75r4J092J32l49n14j99N68M58
2955E79l64n87J37K50N52j74o14p1L03L30J2n94j51L39M63M9r47J15O10J72j69
$$ y = [-790, -414, 379, 321, 17, -879, -537, 302, 475, 13, -571, -403, 398, 700, 174, -229, -139, 248, 303, 91, -547, -147, 399, 614, -228, -477, -358, 573, 614, 106, -602, -541, -16, 483, 285, -362, -230, -131, 703, 317, -639, -639, 368, 574, 135, -287, -555, 121, 373, 226, -472, -466, 380, 302, 71, -467, -463, 89, 621, 134, -828, -310, 50, 800, 153, -339, -712, 25, 774, 309, -368, -364, 64, 83, -104, -340, -78, 152, 411, 75, -656, -758, 58, 311, -102, -636, -660, -101, 421, 157, -451, -584, 231, 502, 106, -266, -430, 137, 313, 42, -174, -164, -23, 393, 102, -218, -548, 34, 435, 47, -423, -120, 104, 415, 456, -427, -365, 42, 507, 77, -394, -547, 22, 481, 127, -250, -427, -89, 513, 180, -318, -93, -122, 631, -38, -364, -229, -150, 582, -40, -515, -609, 483, 615, 266, -248, -447, 121, 579, 215, -372, -235, 15, 567, 393, -221, -292, 11, 341, 353, -241, -392, -53, 410, 459, -488, -373, 237, 409, 240]
2976B40m04j90M04M37k99q53J71O68k8L27r63J99J08O95l29m55j97L76N60k41
2996B26j67l04K02N9p2L4j41J85M45j35l17m66N04J99L6m31l62N49L45p3k42o16
3018e42J99Q42l04j62k59o5O23r8j96l91K82O7q1K8k24K03K02j10k38j18K83K61
3040B02k90k5k48J37Q56k46k67m18r0N71L66l80o2m4P6M1k47K12m07O08l53q8
3062i6R2p4L94p1m98j88L63R3M69p23J43p1oM23j84m97N8N22k8k30k26N5K68L71
3086C59k68m02L66J86jl75k79N32L5q1j34m39N0M64K58r0q56M63M23K93p16r0
3108c02L52J9K19m23n1M9K82K1l29KMK93J6Q4j82j48QK96m22k62L62N29l22K15
3132C10q63K69N59k39o7p0K87rr8L0m25K96J7J00j26l04L46J48l6j39k46R1L35
$$ y = [240, -164, -354, 50, 487, 188, -665, -494, 174, 146, 473, -490, -291, -183, 512, 183, -272, -469, -93, 467, 226, 59, -245, -43, 16, -56, -22, -163, 22, 467, 332, 15, -451, 53, 252, 288, -143, -505, 44, 389, 316, 74, -542, -343, 499, 195, 33, -226, -291, 332, 234, 38, -353, -71, -4, -85, -57, -281, -78, 124, 14, -224, -342, -59, 202, -88, -113, -361, -224, 632, 386, 119, -299, -389, 182, 548, 168, 106, 62, 138, 179, -68, 144, -263, 345, -8, -96, -4, -78, 316, 245, -253, -441, -78, 15, 484, -239, -96, -167, -173, 250, 66, -431, -373, 149, 121, -109, -335, -280, -12, 359, 91, -311, 55, 241, 240, -135, -414, 118, 153, 72, -62, -501, -451, 13, 271, 181, -675, -212, 211, 504, -212, -302, 50, 69, 288, -135, -186, -137, 145, 166, -163, -161, -157, 136, 152, 236, 54, -94, -86, 210, -212, -474, -112, 417, 95, 310, -553, -284, 275, 36, -31, -101, 186, 177, 79, 109, -316, -20, -3, 97, -29, -333, 13, 161, 125, -14, -260, -169, 166]
3155A66Ll69j85J91N82j06l16Q6m26O32j67K3m44J40P7K17n6K27L8m24J10k10
3177b11J07o4J75J45l7q7k53M57J64m65Q4l17L68K52j10l52q4M36J50k92j08j51
3199a93J7J77R0m4k82N18l59l3Q5K6j6K00O1k54j29J0K07j98l69N73J55jj16l96
3223b71L49K7R3k06n5r2M53n05L20q7K25j55l1J7l76R9K24o2Q7k20r1L71j32L20
3247C02k83k82K97q8K29j62Kk94M72Q6m92J63L56j19n2l40J36j0LK74k58k77K76
3270f1M0K33j92j05N80k45r2r0k55M33j93n3k77J68m3J19J64j29k12R1O3K52j65
3293C1mQ5l14K72k61j68M95J28j99l27L33p4P1qj68n35P54m5j90j0J6M27j56R2
3317B45Q2k11r4j53K34j18j34L43k21Kk20k0L22K73m11r5J69j47J00M5k08K58
$$ y = [166, 169, -200, -385, -194, 388, 282, -34, 52, -374, 258, 91, 114, -330, -190, -113, 104, 48, 275, 313, -111, -1, -211, -104, -168, 7, 152, 115, 28, -225, 232, 396, -69, 15, -302, 66, 318, 208, -144, -228, 208, 358, 66, -42, -193, -176, 1, 91, 47, -235, 283, -76, -109, -24, 2, -14, 186, 247, -7, -136, -126, 81, -117, -486, 87, 242, 241, 125, -271, 78, 105, 198, -8, -63, -155, 298, -207, 113, 26, 251, 96, 65, 82, -294, -195, 29, -33, 54, -166, -257, 114, -18, 302, 19, -263, 34, -54, 175, 13, 15, -279, 193, 279, -213, -50, 306, 187, 135, -205, -69, -79, -76, 198, -60, -337, -61, -21, 212, 20, -85, 495, 250, 158, 68, -187, 246, 53, 0, -277, -109, -152, -33, 131, 2, -210, -119, -56, 196, 31, 27, 112, -202, 70, -191, -359, 136, 264, 65, -262, 71, -3, 68, 60, -108, -643, 111, 66, -124, -134, -118, 309, 153, 245, 327, 116, 22, -131, 103, -15, -149, 194, -27, -25, -245, -265, 57, 330, -81, -176, -7, -154, -54, -9, -217, 41]
3339D1l78M60M07n60l62L39J64L4j35J84j06p4jk1m7P9M28k58l47l3RL08J58m9
3363B40p3j03N5rk21K38j09l02L06k2K97n11J62j17Q7L22m81L45j85P3j18m2L17
3386A49j18j47j34J85R7R5k17L2J80J05l07K22k70Q1j60K22K18k10n9J86l50J30
3408g0J78j1j47j67K69j6m6N8J79j43j88P7r8J41J9l29K91j17L68k22r7K17k28
3431h2M5J60j86K36j88j49K50l1k17K14J20j04J61J7k65J18j93l9M6J21R2k85
3453a59mL08m36M58L2m8j33N1k4o2P3J64j29j28J57j47L26l51jK38k37l2L90L7
3477C43l42k3p6L53j77M0J46j20j38K43l19q6J03K30r5m4m5j99j18M65J65o27
3499c21M14j13o2n9N63n31J73O1J54k39m5K40k91R7j29l6J32PK09l88J47j15Q4
$$ y = [41, -337, 123, 530, -30, -392, -53, 111, 145, 10, 194, 88, 14, 13, -8, -55, 24, 452, 194, -153, -186, -177, 131, 289, 240, 167, 64, 119, 110, -111, 127, 18, -284, 22, 0, 297, -214, -52, -169, -82, 240, -241, 104, -81, -8, -126, -168, 149, 31, -116, -250, -65, 32, 127, -90, -58, 122, 227, -80, 142, -128, -47, -207, 15, 233, 23, -36, 150, -200, -70, 108, 97, -50, -217, 52, 36, -10, 48, 227, 84, -104, -27, -125, 16, 35, -294, -3, -120, 248, 26, -71, 146, -82, -37, 123, -63, 173, -15, -164, 86, 55, -162, 52, 172, 68, 229, 246, -19, 99, -94, -133, -87, 34, 126, -159, -163, 145, -291, 167, 199, 151, 18, 69, 45, -17, 56, 220, 91, -37, 120, -27, 299, -52, -53, 185, -52, -84, 306, 343, 1, -22, -98, 255, 78, 118, 264, 144, 6, 249, -70, -156, -53, 177, 82, 38, -7, -206, -324, 141, 306, -321, 93, -20, -82, -141, 422, -109, 64, 125, 279, 40, -5, 235, -56, 41, -88, -124, 8, 15, 224, -164, -17, -132, -48]
3522d8r2J17Q4K29n76L83j08j07R8l36K56p4K9J38p3K62j43k81J71J32J52k41
3544b8k6J38K3k31M06m14J20J6K79m39M08J19n63k7K63k36J8L17k2j16K05j90
3566B0J57k4j70k05K56j28J12m0q7R0M0q6J6j29O0o7L73O3n54L79k13P8J78k58
3590a39J29j89K91j19p4R4Lj21o4L24l49L36M7l15P3j16J03N7o4R4p8k8L4o7P7
3615f1j69K58j90J66j74KJ41J12j58J15p0Q6j6J4k2P6j08j2n9o9j2J78j97K82
3639A13n6q9J19j81P3K77k92K57j77l88K09l01L71K53j90o3k12M40l3k2k5p7j27
3662a21m1L29j68J26j49N2Nj07m1j82L25k19K38j04L32m6r6l85N3L11k12J35j54
3685a19N08k74k22M74j32m15J18M18j95k80K61j10rm8K93l72R6k4j98L47j42J25
$$ y = [-48, -140, -23, 61, 290, -286, 97, -11, -118, -20, -356, -100, -174, -145, -7, -80, 182, 39, -242, -71, 61, 213, -28, -54, 84, 107, -124, 282, -132, -12, 4, 283, -156, 252, 371, -192, -219, 44, -192, -174, 143, 121, 5, 210, 20, 177, 153, -17, -222, 34, -94, 18, -22, -109, -19, 21, -65, -49, -178, -118, -185, 188, 251, -303, 76, -137, -59, 119, -139, -10, -199, 92, -27, -101, -7, -4, -125, -189, 135, -214, 122, 169, -146, -73, -189, -86, -29, -93, 1, -77, -105, -71, -138, -61, -230, 28, -162, 4, -170, -168, -27, 85, -73, 42, -28, 58, 42, 56, 34, 110, 2, -10, -69, -138, -150, 28, -169, 113, 57, -32, 87, -94, -21, 256, -36, 221, 44, -344, -135, -436, -65, 188, -2, -65, -277, 163, 130, 108, 83, 6, -121, -162, 167, -1, 125, -24, 28, 33, -74, -115, -297, 28, -191, 47, -57, 275, 229, 133, -252, -199, 112, -100, 35, -119, 389, 115, -107, 367, 235, -180, -62, 356, 161, -119, 142, 32, 23, -25, 268, -104, -8, -32, -230, 117, -25, 100]
3707A00j05J22J7L4R9j6n63M71k82j28N8J90j75M3K85p4k37R5Kk85M40q0L53j15
3731B49m00L81m1j61K75m43L21p8M3r0j09K31j10k54L24J44Ll91m7L60k51k34
3753b78L23PJ10J52l64N3J53k25J76j99p8j01L40r5k65K22J16l0p2J37J14j78
3775A8q0p1L32j7l65K06K8j5p1q1L5K72k60J56q7j2J15l76M12M5l4k73K11rK5
3800A04l63L05M1k11k02J56K20J81m46K25J05J05j72j8j72K67k91L76j42M9k67
3821a50O3j13J01J22j04n0L9K3K53P1k63n7j8J49l76K67j3N7K40m61K33J89l64
3844a62M95k15k12R1J85m17L70R5k85P4L9k34Q1nP6Q1j88J00j19J43k12MJ80P5
3868D0Q9m20r2K61J04K2M6O2k22M3j70J33Jn9M11l73R5j53Q4L77n88L05J51K7
$$ y = [100, -5, 117, 134, 168, 267, 251, -312, 159, -123, -251, -193, -3, -178, -135, 150, 76, -161, -66, -64, -349, 91, 11, 364, 249, -151, 230, 189, 28, 303, -140, 181, 103, 146, 56, -53, 178, 68, -186, 138, 282, 285, -106, -153, 207, -44, -278, 45, 52, 162, 314, -50, 3, 156, -69, 107, -92, -170, -271, 69, -26, -291, -69, 47, 17, -55, 82, 196, 18, -62, -133, 199, 182, -183, 23, 51, 36, -35, -116, -81, 191, -69, 87, 0, -12, 103, -273, 139, 184, 150, -123, 88, 79, 104, -259, 46, 87, -124, -326, -170, 50, 231, -215, 10, 115, 220, 48, 30, -142, 125, -166, 210, 68, 117, -150, -87, -200, -99, 23, -81, -131, -92, -69, 184, 255, -8, -65, -83, 66, -310, -43, -56, 1, 241, -220, 13, 202, -162, 333, 118, -94, -3, 182, -235, 135, 230, -55, 19, 58, -176, -95, -100, -24, 57, -131, -31, -150, -7, -219, -215, -35, 40, 129, -291, -383, -122, -18, 4, 50, 112, -110, -67, -237, -104, -103, -162, 249, -124, -29, -182, -98, 279, -309, -4, 147, 174]
3892A74P9k76J35m28J53P3J49J11J05k99j5P4J9L3k05J46LR6k16k09M66r4N7j97
3916f6L23n76m6J92M0PJ76QK0l25K21o6J8O6k28J91M00n81N45n02J50Q5o1j18
3940a27K31KM4k59L34k80J49p8K58m04j0M64j77j49K6j86J3L08j0k53J92N3n9
3963H2o5OJ82k01J40l2n0K6q8OL4J75l48R7M48l62J3N4n6l8J3Q3m8j76j04J24
3989h5K7L12j61l65K43K89l50J87k24P2m3J77P5M4r8m0j93J08j32N14k79O5n9
4012H4k61J87k7J37j70P3P6K60m17K69J1m31K0J33J07p8l6J70j62J04q1O1J4L6
4036G9o4k62K20MJ23j99K58j24R5k43J35J09l45J60J62j88J94k82K83O4l16j50
4058b87K25J73j31K01k15Q1j32J88L3J6j82L30m25K69j19P8j56Q3N9j65J35k27
$$ y = [174, 253, -23, 112, -316, -163, -90, 59, 170, 275, -24, -39, 35, 54, 87, -118, 28, 31, 127, -89, -298, 168, 74, 131, -66, 257, -319, -365, -173, -133, -126, 50, 58, 78, -247, -26, -92, -74, -8, -236, -45, 355, -226, 319, -183, -33, 52, -9, -127, 104, 106, 150, -109, 225, -55, 94, 16, 274, -130, -140, 324, 147, -2, 24, -162, -149, 159, 149, -104, 88, 141, 82, 17, 23, 205, 4, 144, 112, 62, 88, 0, 6, 40, 215, -133, -36, 412, 50, 63, 117, 61, 23, 36, 119, 71, -105, -209, -85, -58, 254, 93, -272, -29, 260, -90, 97, -127, -55, -98, 79, 154, 198, 100, 60, -133, -25, -157, 357, 78, 143, 84, -177, 10, -17, 120, -50, 23, 99, 359, -58, 211, 222, -209, -189, -56, 51, -27, -63, 107, -55, 49, -32, 29, 43, 79, 15, -247, -27, -23, 100, -99, 159, 35, 130, -113, 22, 131, -214, -54, 108, -80, 114, -168, 115, 179, -137, -287, -62, 111, -20, 181, -34, 47, -85, 103, 136, 152, -30, 300, -125, 144, 25, 103, -53, 30, 89, -76, 59, -168]
4080a68K68j7k1k71K96n6K11m32L25kJ25J33m73J75pj43K33j55J20k53L0Jq0P3
4104h8L4j54J21L9K72k72n8j69K22O4l12K19L53m01R6P2K13l20Nk1O5j68J59j58
4128a87N88j65m91K03l07M44q5j05j01o0L90j91rJ10m78L63R8J34l76L29j4p3
4150A7j82L84K2o37L25J83Q9J7k58J71n8kl61L33M7k64O6L6k87J51L12l71L96
4173A29k83l0kK60k76L95l70o5M03k63k61Q90n69j25j35L38K79m56M21p2j79P4
4195A03l5j00k67J74L9K8J00j10M9K09j17l62R0J30l4q0N4Q7J91Q4j85m86K96
4218a42J52k29L49j87r9J69j69J89RJ96K2m77K18j44M0j6J20j85J37L6L6J07J15
4241B47j92J30j44kr8RN1l8n5J66k60J08q0J47r3J00Ok88J51L0p4p4L9J15J71
$$ y = [-168, 100, 83, 62, -209, 87, 31, 242, -190, 135, 133, 258, 391, -82, 93, 86, -57, 176, 21, 141, -112, -82, -81, -161, -88, -54, -208, -87, -48, 224, -48, -106, -275, -53, 11, -301, -82, 271, -130, -34, 38, 251, -69, -64, -85, -20, -188, -29, -187, 401, 236, -255, -52, -359, 85, 0, -105, -206, -266, 124, -67, -76, 34, -444, -81, 17, 151, -225, 104, 90, 17, -165, 219, 241, -396, -71, 112, 201, 218, -40, 131, 73, 71, -290, 43, 90, -174, -108, -72, -359, -208, 104, -267, 129, -154, -184, -186, 74, -202, 193, -177, -242, 161, -102, -363, 527, -42, -167, -302, 36, 315, -141, 280, 208, 29, 103, 68, -32, -299, -125, -86, -58, 42, -68, -19, 190, 73, -289, -199, -69, -103, -183, -129, -42, 149, 233, 48, -438, -142, 10, -219, 130, -57, -156, 13, -156, 33, 42, 238, 260, -217, 1, -143, -103, -119, 1, -184, -47, -11, 25, 132, 247, 55, 185, 41, 39, -59, -50, 1, -37, -92, 74, -186, -78, -158, -11, -104, -4, 2, -286, -135, -105, -179, -253, -214, -99, 72]
4266G2j72J23R2j43J18K43m32o0L89m30K86r0J38o5j97J29L50m70J47K3j0j03
4288f2Q7O4O8l12J99k96L55k81j05J98Q3K08k53K62l74M2q1J95P0L34o78K62k63
4311b78R2K29j27R2P2N2j11j2k65K40k12M48j19l6j53j63K76l2J35m48n1P33k81
4334H1K0L5k28L34j98K6l2j56k4J86o9j24K30r2j81L42k85j29J16j84l9R4L53
4357G6l14L33O5m30O7pJ5J76j6j14J09L87m72n1K05j4l68L52J69j72k39J25K22
4380A04r6j9J20j5k21Q6J21k89K86J06l70K25L6j25J45k1j50r0q3K74k6p1N2J
4404b0l6r1K8L31j80j27J24p8N0N3n0j10N6P4q3J18j14K57k23K27j4ml50Q3q3
4429a62L1M49o36Q4K08j10O5L3J95j39j27P0K83l11J68j24Nk39L37m4J07j48q0
$$ y = [72, -100, 23, 115, -28, 90, 333, -99, -159, 230, -200, 86, -4, 134, 69, -128, 1, 351, -119, 28, 51, 41, -62, 25, 89, 157, -155, 44, -252, 103, -178, -283, -85, -2, 206, -47, 215, -159, -117, -198, -3, 67, 401, -277, -15, -278, -186, 43, -84, 8, 80, 132, 21, 9, -256, -16, -228, 220, 101, 65, -88, -251, 25, -7, 128, -320, -371, 362, 81, 101, 136, -92, 242, 44, 70, 38, -118, -142, 44, -25, -149, 81, -11, -192, 150, -135, -264, -148, -332, -371, -277, 76, -238, 95, 160, -270, -203, -210, -195, -19, -35, -149, -40, 347, -125, -176, 29, 15, -353, -1, 168, -4, -243, -118, 104, 8, -11, 109, 94, -127, -41, 80, -209, 77, 183, -187, 38, 74, -51, 94, 73, -77, -167, -250, 24, -2, -73, -21, -20, -56, -147, -119, 212, 32, -95, 29, -49, 1, 54, 4, -106, -50, 24, -59, 59, -55, 202, -21, 206, 192, 188, -162, -79, -162, -131, 318, -318, -234, -26, -136, -71, -38, 157, 18, -109, -39, 244, -67, 101, -23, -18, -257, 80, 36, 143, -5, -85]
4452h5n4J60l38M80m6j25j85J95J18j53k0K62q5k10K39l9j37k38j70M01K58J9
4474B47m81L73r5K9O6j99oj40K61j36l8K67j82MJ8K58j82j3j89O1j41J76nK39
4498A92k10j06J07n5J05K61m96J03J35J16m12J70K62k43j6J72J1q1L7j11k4K62
4520A79K73o98K28O9Q7M2K2l09j93M88l0k10K51k66J23k66O7M50k4j55J34l60
4542i8j95K47r6Q5J25R3l89L78k21Q8k8N6r1K59l02J1p9N9j62L49o0M8P6j06l58
4567c11L13%p2L01l46J14K13l70j36N90Qj82k87O9K22q1J40n8J7l6l74J79J75
4590H8j4mJ05J08j63j81J56j35K3K07j56mk09M52Q2l92J83J5k05L79l00k30J15
4613h0M9J61O3m42M36k73o8K04M7k64K30j21J10j61j21k68L86J73k16%Q5K09J64
$$ y = [-85, -139, 21, -317, 163, 117, -8, -193, 2, 120, -33, -53, 209, 124, -86, 153, 114, -23, -261, -431, -30, 228, 247, -234, 139, 44, 73, 139, -60, -66, -206, 55, -81, -119, 148, -34, -30, -12, 246, 64, 51, -138, -77, -218, -42, -47, 192, -18, -124, -17, -72, 33, 294, -202, -99, 36, 152, -260, -90, 172, -71, -87, 85, 96, 15, 52, -59, -83, 179, 452, -246, -18, 51, 138, 180, 202, -107, -300, 188, 158, -52, 199, -67, 56, -210, -143, 307, 283, 128, 262, -98, -293, -46, -142, -57, 68, 161, -228, 150, -71, 17, -11, 45, -46, 213, -89, -78, -157, -98, -260, 89, 29, 77, 153, 47, -311, 2, 2, -70, 231, -115, -1, 212, -158, -294, 296, 304, 122, -165, -96, 126, 45, 185, 127, 144, 108, -266, -87, 88, 74, 70, 175, 283, 120, -61, 95, -40, -17, 190, 34, 30, -179, 273, 355, -37, 146, 161, -44, 335, 35, -195, -80, -31, 130, 193, -249, 187, -86, -154, 50, 97, -167, 63, -58, 52, -109, -230, -498, -112, 61, -155, -155, -70, 139, 303]
4636C03K1k05k0j07M6j40O0pl9P8k57J50J73k05r8L17j79O28l72j71k21K56L68
4659C79m26j79L40p4k7o5J79j92q0J70j05k31N3L92l12L35n79L33L41k68J62k
4681A44rl76J04L3j6J87o1L55n34N55j17l64K96j03r5N4j09l3J55k76m0K02O2
4704A4p7K51n22M91j01l1p7R6J85l63j91L93j21J94K4OR3k43K2n6K37k96k8L61
4728B61j38j86K19l64M40k48J61J37m84j30K85j27n6L98k88J42l14M5L02m8j52
4749a45J28O5O5K4j61j37J03K12l57L17l94N33m10J85j25K43%j29J9j04j0J40
4771F2j9j98K26Q5j17K9q9k31N8qN48m01J40j62J72q7J12k77j99M24l50J58J07
4794a7j5L43o7j41K5k66J79q2l20M84L8j58J53j5j56Q0K05k21p9K75l70o6K21
$$ y = [303, 324, 119, 99, -8, 38, -102, -42, -49, -88, -10, -267, -117, 56, -149, -247, 70, -109, 519, 147, -24, -245, 11, 379, -47, -226, 114, 40, 13, -52, 127, -65, -145, 25, -80, -311, -258, 134, -178, 157, -422, -89, 252, -16, 146, 144, 135, -241, -137, -104, -120, 67, 6, 361, -173, 382, 265, -99, 197, 94, -1, 53, -56, -89, 66, -210, -250, -48, 14, -63, 188, -334, 157, 56, 25, -52, 44, 229, -134, -325, 68, -53, 141, 165, 171, 264, 21, 43, -13, 224, -72, -100, 261, 123, -63, 156, -208, 232, -16, 145, 282, -202, -332, -47, -174, -230, 168, -120, 22, -292, -247, 55, 7, -145, -17, 48, 113, 137, -24, -161, -58, 154, -203, 114, -280, 253, -157, 28, -97, 146, 146, 17, 36, -68, -78, 62, 43, -155, 71, 156, 39, 68, -21, -252, -194, -202, 346, -55, 85, -77, 95, 8, 120, -157, -356, 68, -282, -124, -17, -32, 311, 244, 103, 128, -138, 41, -41, -361, 123, 161, 3, 156, 141, -15, 65, 270, 49, -30, 245, -125, -191, 30]
4817C0k54L60j02K2N8l24O4L07j32P4j69p7L9J34%O7J84Mm0k54J24k22J32k33
4841b08j1J67L72k39k95jJ59K15r3l10L59m2k3j05mkR1j17P5Q5l5Q6k05J22m9
4866hJ46j08m54M34R4j63n8K72l59m8M68k67J08Q6J19l68j03L10n97L00L54j44
4888A4%j3J28p3m8N7L3j29J5J30q9l23M33K9j24K51m75J72L8J53o5qj6n8L56m42
4914e4J31j23r0K13l97M39j67L13l69J77J35Q7k65pR0M5N7j74J30l10K5K30k92
4937a76Q1J08nj7n5P1J25l2jR7k89J5K04l28K69J29j16k45K72p9KK6p6K82k42
4962B0P1p4N6p8k03L9J76K4j6J41j86J97o2j23l0J05j71K12j69j15J37J41L26
4985D18m14j91L62j18J1j48R8kj76K41k0P3k18K91j82P4L9j36Q9j47Q0K9j38J59
$$ y = [30, -224, 136, 34, 56, 114, -210, -146, 161, 29, 103, -66, -143, -104, 30, 30, 97, 281, 285, 245, -9, 115, -107, 25, -208, -219, -52, 320, 81, -214, -215, -56, 159, 66, -244, 115, 73, 50, -55, -59, -61, 30, -87, -12, 73, 38, 124, -81, 41, -8, 138, 30, -424, 10, 104, -59, -117, 155, -204, -252, 216, -51, 57, 143, 262, -106, -209, 101, -496, -196, 158, 14, 14, 1, 129, 56, 8, 65, 98, -31, -16, 114, 25, -298, 135, 164, 40, 291, -184, -12, 26, 179, 114, 106, 90, 32, 388, -54, 77, -46, -136, 77, -320, 119, -48, 265, -104, 73, 208, 295, 30, 23, 113, 158, 215, 41, 171, -139, -114, 116, -176, -95, 13, 8, -9, -64, 7, 132, 100, 99, 196, -93, -78, 126, -202, 67, 196, 80, -165, 107, 28, 30, 56, -20, 262, 20, 91, 17, 73, -5, -208, -169, 7, 31, 15, 156, -30, 167, 105, -18, -48, 57, -114, 98, -71, -186, -49, 92, 418, 4, -187, 175, 57, 68, -80, 18, 16, -160, 81, 61, 134, -84, 207, 25, 99, 138, 2, 91, -56, 24, 53, -85, 74]
5009G4m2P1k60L28o6LLR1l5m7J8r6J11j60O3J7J64j51k48n5J2J01Q6k9j09J77
5035B1R1J01l02j9J26N7K70k39n5P6J47l27lj69Q5K48j86J89l30K4M31n45M25
5058A16j96j1L16P9j97k20O2k6K82m3j31k18K32p8J51P2k71K74l12q4n0K92k4
5081A5O3j1O2K41l81K84k07R4k55K8L62m64J47j59K39k53L26k07J86Q2l31J14
5103b5o0L5j50N29l13N1M8k22r1L16P3k73L33l33J56j26L6K96O2l79M9l42O77
5126C47k67k37M9J7J48J17q2j41J24J42l18L08j90J72l01J18K19l38j00j2J19
5147a06J00P1Jo4J43k04k9n2K31r3L17N5k6l02K02k07k19L53k81J24j15K5R6L9
5171E9J2p5l3jJ99k21j08P3j28K20k35J36M8J0J77j37j83p8L56k00K93J29m07
$$ y = [74, 32, 103, -157, 171, 105, 108, 111, 202, 167, 120, 138, 42, 153, -7, 56, 73, 237, 86, -162, -217, -205, -104, -18, -47, -156, 21, 112, 213, -89, -108, 18, 75, 345, 106, 51, 127, 274, -53, -56, -225, -140, 108, -78, 111, -219, -195, 236, -309, 116, -80, -91, 225, 304, 107, -113, -51, -77, 205, 162, 31, -187, 45, -33, 118, 190, -81, 193, -119, -203, -253, 39, 15, 78, 67, 129, 370, -11, 273, 66, 160, -95, -67, 295, -169, -22, -181, 58, -195, 131, -76, 110, 192, -139, -25, -85, -50, -200, 329, 16, 67, 115, -107, -198, 118, 191, -82, 251, -82, 74, -52, -16, 280, 342, -37, 12, -330, 347, 80, -157, -108, -91, 57, 174, 92, -49, 75, 217, -101, 207, 17, 189, -112, 6, 225, -113, -213, -225, -106, -6, 65, 66, 2, 145, -59, -88, -140, 91, -2, 315, 370, 344, 42, 244, 37, -182, 171, -110, 14, -101, -76, 20, 59, 71, -4, -37, -38, 161, -60, -168, -95, -223, -3, -238, -102, -54, -44, 133, -4, -187, -265, 91, -109, 184, 313, -94]
5194i4r1O6P5k5O7n8K6K18j03J50j75n4K66p6l91P4J37j17O7K17k12j06K14q0
5218eK00k68j04J80o9N1j41k60Q57l55L9k16K35Jj8p7j89J66J75n08J6N08j88
5241C0M0j71m82N20m3J40j2j51j36L56k31q1L42k16J74j45K89m10J1M29j53j41
5263d1K9j53K43J69n96N51J79k57r3j06J69l04J79j8J38P0J75l85J24M24m28p3
5285do1J45k37rN3R0K62q2k47j20J9K11J25j95J8J20K9j32O7K9j03L42o3r3j94
5310c0J11k65M0J53RR1j68J42l36K20J4%j6j5j64J71j64K67j21k50K99j01k8Q9
5334e2m0K04J13j22k98J98j70J59J40m89L1r1L51qJ78k33K30J09n9m07L03k7M
5357B4J85k11j36m4K26l94L61k38k0n2L95k06j24lR1L36j90o2J26o8l1q1K00k83
$$ y = [-94, -185, -119, -44, -69, -2, -60, -34, 184, 81, 231, 56, 2, 268, 192, -199, -125, 12, -105, -38, 179, -33, -139, 75, -5, 195, -73, -177, 3, -66, -15, -156, -416, 441, 86, 125, -91, 144, 145, 127, 50, -139, 27, 202, -306, -290, 218, 30, 70, -101, -583, -63, -106, 34, 22, -129, -265, 91, -140, -221, 121, -95, 79, -66, 223, -187, -176, 253, 100, -41, -12, -165, 78, 247, -349, 202, 381, 124, 31, -75, 94, -210, -31, -49, 89, 159, 334, -51, 73, 497, 69, -4, -65, 80, -157, -166, -113, -23, 239, 157, -90, -210, -191, 20, 145, -50, -32, 88, 117, -15, 52, 81, -22, 320, 257, 164, -30, 81, -184, -144, 9, 18, 109, -59, 83, -253, -33, -19, -19, -35, -50, -214, -43, -207, 60, -61, -311, -12, -113, -141, -52, -92, 112, 225, 103, -195, 3, -167, -8, 132, -357, -326, -417, -66, -74, 104, -129, 101, 210, 151, -256, 47, 20, 24, 209, -2, -138, -182, 44, -350, 11, -227, -247, -299, 96, -110, -234, -237, -146, 190, 0, -62, 64, -4, -35, -116, 84, -199]
5381a99M39k05K26j57J73j29j83m8J07K06k50k49K43l12L01J35l41K74j3P8j73
5402g7K27j48ON8j65K23o8l00N38l60J45k59l21N69P8p5o6o2n1M38l48j69K31
5425D4l13K83%l5M1j12J04L13j69L0k29J59p5l8K71o82M48Q1j1J62n34J50K30
5448A18k39J22o3o7M12k09J46m44L28N4l96P1J44l4N9m6J46j86K14M4m9m02R6
5471a81M34j54j42L6j45K48j57j27k8L52j61P4J30No1N0J19n65L21N1k3k59R5
5494h8J12P6r8o1j44J93%K74j12j23j52J9K01j43o0J39J64o11K99P8J64m52M00
5517G5j0j50KJ55K7o8j80o7N9J57j5p5L47n11M44j10j13NJ62k32J82l9k7J11Q7
5542B16k54k49M08m38L46K40n3n25M15m90L25K4j82JM56m01j3P0M4M60n07K6j0
$$ y = [-199, 240, 35, 261, 104, 277, 148, -35, -83, 24, 230, -20, -269, -26, -338, -37, 98, -243, 31, 18, 96, -77, 150, 2, 8, 66, -99, 124, 56, -244, 294, -66, 79, -180, -501, 68, 146, 71, 5, -57, -108, 330, -18, -187, 44, -269, 14, 14, -21, 20, -92, 12, 325, 156, 186, -43, 116, 41, 3, 274, -408, 40, 121, 110, 272, -262, -112, 118, -121, 1, -62, -129, 283, 74, 220, -224, 104, 158, -238, -167, -23, -57, 2, -44, 102, -84, 130, 174, 125, -277, -181, 253, 99, -43, -7, -152, 96, -61, -188, -216, 136, -25, 49, 179, 184, 123, 173, 292, -273, 48, 99, 76, -183, -88, 24, 100, 2, -59, -203, -10, -10, 264, 152, 29, -123, -104, 97, -46, -106, 33, 197, -414, -115, -37, 127, -325, 75, 65, -85, -83, 72, 99, 31, -149, -216, -157, 0, -15, -90, 257, -254, 190, 80, -33, -28, 134, -98, 84, 45, 18, 129, 216, -38, -287, 121, -317, 29, 269, 216, -309, 106, -384, -59, -35, -217, -216, 240, -161, -174, -104, -60, 400, -107, -81, -91]
5565i1K03j9k41K32o3q2K95Pj23j11j25o0J41p4J72Qo0l82N26l32q6J82M5K8J94
5590A84k19M2m6q1r5M0l6J58j78J70J25%m35M41l52K13J00K12j32j06m6K31m3
5613A47J22n31K42J9j1p0K04p9q6r3K69m30L40j21K06N2q5k77J39L16n3l69Q2
5636f7p5j24J80J77J52l55L65k57R3J64j35O3R7l40J91o3M12l63k18K18R1j44
5658F2j69j21K58K16Pj56j47j35J4J3K67m7l19J15M04m52J17L51j25o5J13J14
5680C15l61J63j37mr4k09L52l7k17K11J58k72J37m2K17j47j70M30k65l47K36L0
5702e3R7j61J33O1O6L9j27J26l90P6K41l76K70o5l55M91k77K16r0L46j75k23J88
5725E8k5j36L31l64K5P4L4K17k95o1L71k85p0O1l31K83J25O6j79k4N2L51l23P0
$$ y = [-91, 112, 93, -148, 84, 21, -61, 234, 241, 118, 7, -118, -178, -37, -111, 61, 69, 9, -373, 153, -179, -265, -83, -38, -10, 184, -35, 7, -39, -120, -215, -175, -211, -53, -231, -61, 64, 64, -371, 70, -282, -69, 31, 243, 111, 5, -41, 190, 147, 269, -262, -20, -1, -12, -82, 122, 43, -43, -136, 133, -297, 43, -78, 128, 180, 95, -182, -43, 273, 220, -149, -67, -142, -266, -86, 91, 243, -112, 253, -4, 89, 253, 118, 181, 278, -62, 129, 66, 478, 115, -103, 115, 206, 62, -107, -228, 30, 246, 253, 97, -50, -185, -171, -158, 109, 62, -257, -142, 262, -190, -73, 278, 153, 88, 201, 315, -46, 117, -20, -24, -118, -327, 25, -12, -229, -18, 140, -132, 5, -37, 180, 33, -137, 293, 28, -319, -83, -53, 44, -117, 16, 77, 143, 182, 55, 181, -209, -133, 108, -268, 2, -63, -418, 73, -204, 12, -78, 268, 93, -130, 58, 33, -103, 228, -136, -111, -37, -3, 214, -81, -142, 229, -56, -126, -65, -396, -113, 12, 78, -101, -125, -73, 278, -45, 25]
5749B5j74J8k7j03J48M9L5rJ54j56N7J41m21J26n2J28L9j7L7p9J00r5L9K28j67
5774B4K01r5k49K8J11J90j68J63k16j38J60J17j15j5j91K92kJ17m3l84L87j85
5796a1O4o4l42N94k14p1J58j59R0l19K54J13QK9r4J80l32j2O1k28M56m1k68j88
5820c36M27j40j92p4M43k57J29j6K21j36j01K71o02K13L46j52Jp6m6J08l17J83
5842a03P4K95l96m5J27p2r0P0q9J70r8j93M80m79N76n29M49m21M60j16j86Q6J53
5865A23rj0q3p0M8k64J05J4J72mk28J22J08J5k36J84j12R3J64l41L50j59K7K9
5889C8j24J22J05l02J72m5K8p8N6J76l74K14O1r2PJ97j89K8K34j23n22L62Q7J72
$$ y = [25, -149, -131, -158, -261, -113, -64, -29, -38, 116, -40, 17, 158, -263, -137, -189, -61, -22, -39, -2, -81, 19, -76, -37, 191, 24, 225, 130, -119, -91, 20, 210, 42, 205, -11, -149, 11, 128, 13, -2, -193, 99, 97, 214, 171, -213, 174, -11, 53, -11, -353, 241, 27, -44, 114, -45, 45, -274, -20, 93, 101, 130, 36, 216, -116, -128, -67, -295, 161, 120, -148, -336, 91, -49, -241, -315, 128, -129, 0, -16, 205, 69, -32, 239, -363, -150, 196, 44, 45, -31, -77, 31, -286, -103, -29, 266, -130, -175, -48, -120, -210, -140, -229, -59, -157, -350, 130, -349, 227, -302, 147, -274, 186, 70, -116, -30, 123, 114, 104, 21, -49, -1, -265, -160, -146, 26, 22, -206, -84, 24, 39, -197, -13, -125, -32, 132, -209, 141, -18, 9, 38, -86, 36, 141, -161, 11, -34, -6, -84, -28, 148, -226, -12, 49, -43, -36, 161, -28, 0, 234, 111, -411, -49, 38, 210]
$$ [...]
8191D4
##END NTUPLES=NMR FID
##END=
