##TITLE=1H_DVF-035
 d6-DMSO, 8 sc, 
 6.3.2020
##JCAMPDX= 6.0         $$ Bruker NMR JCAMP-DX V2.0
##DATA TYPE= NMR FID
##DATA CLASS= NTUPLES
##ORIGIN= UXNMR, Bruker Analytische Messtechnik GmbH
##OWNER= root
$$ XWIN-NMR		Version 3.5
$$ Fri Mar  6 17:55:39 2020 Russian Standard Time (UT+4h)  she@DPX200
##.OBSERVE FREQUENCY= 200.1315
##.OBSERVE NUCLEUS= ^1H
##.DELAY= (6, 6)
##.ACQUISITION MODE= SIMULTANEOUS
##.ACQUISITION SCHEME= undefined
##.AVERAGES= 8
##.DIGITISER RES= 18
##SPECTROMETER/DATA SYSTEM= spect
##.PULSE SEQUENCE= zg30
##.SOLVENT NAME= DMSO
##.SHIFT REFERENCE= (INTERNAL, DMSO, 0, 15.7039)
##AUDIT TRAIL= $$ (NUMBER, WHEN, WHO, WHERE, WHAT)
$$ ##TITLE= Audit trail, XWIN-NMR		Version 3.5
$$ ##JCAMPDX= 5.01
$$ ##ORIGIN= Bruker BioSpin GmbH
$$ ##OWNER= she
$$ F:/spectra/data/she/nmr/H-F/1/audita.txt
$$ ##AUDIT TRAIL=  $$ (NUMBER, WHEN, WHO, WHERE, WHAT)
(   1,<2020-03-06 17:54:28.92 +0400>,<she>,<DPX200>,
      <created by zg, POWCHK disabled, PULCHK disabled
       configuration hash MD5:
       00 E9 B6 7A A2 85 ED C7 34 08 36 98 17 FE 4E 26
       data hash MD5: 16K
       73 0F 09 E8 01 F4 F7 72 75 57 85 3D 7D BD 5B 10>)
$$ ##END=
$$ 
$$ hash MD5
$$ A6 E9 BC 43 C3 C1 0F A7 41 FC 51 A5 A9 9B 0B C8
##$RELAX= 
##$RELAX= 
##$RELAX= 
##$RELAX= 
##$RELAX= 
##$RELAX= 
$$ Bruker specific parameters
$$ --------------------------
##$DU= <F:/spectra>
##$EXPNO= 1
##$NAME= <H-F>
##$PROCNO= 1
##$TYPE= <nmr>
##$USER= <she>
##$AMP= (0..31)
100 100 100 100 100 100 100 100 100 100 100 100 100 100 100 100 100 100 
100 100 100 100 100 100 100 100 100 100 100 100 100 100 
##$AQSEQ= 0
##$AQ_mod= 1
##$AUNM= <au_zg>
##$AUTOPOS= <>
##$BF1= 200.13
##$BF2= 200.13
##$BF3= 200.13
##$BF4= 200.13
##$BF5= 200.13
##$BF6= 200.13
##$BF7= 200.13
##$BF8= 200.13
##$BYTORDA= 1
##$CFDGTYP= 0
##$CFRGTYP= 5
##$CHEMSTR= <none>
##$CNST= (0..31)
1 1 145 1 1 1 1 1 1 1 1 1 1 1 1 1 1 1 1 1 1 1 1 1 1 1 1 1 1 1 1 1 
##$CPDPRG= <>
##$CPDPRG1= <>
##$CPDPRG2= <>
##$CPDPRG3= <>
##$CPDPRG4= <mlev>
##$CPDPRG5= <mlev>
##$CPDPRG6= <mlev>
##$CPDPRG7= <mlev>
##$CPDPRG8= <mlev>
##$CPDPRGB= <>
##$CPDPRGT= <>
##$D= (0..31)
0 1.2 0 0 0 0 0 0 0 0.06 0 0.03 0 0 0 0 0.0002 0 0 0 0 0 0 0 0 0 0 0 0 
0 0 0 
##$DATE= 1583502868
##$DBL= (0..7)
120 120 120 120 120 120 120 120 
##$DBP= (0..7)
150 150 150 150 150 150 150 150 
##$DBP07= 0
##$DBPNAM0= <>
##$DBPNAM1= <>
##$DBPNAM2= <>
##$DBPNAM3= <>
##$DBPNAM4= <>
##$DBPNAM5= <>
##$DBPNAM6= <>
##$DBPNAM7= <>
##$DBPOAL= (0..7)
0.5 0.5 0.5 0.5 0.5 0.5 0.5 0.5 
##$DBPOFFS= (0..7)
0 0 0 0 0 0 0 0 
##$DE= 6
##$DECBNUC= <off>
##$DECIM= 24
##$DECNUC= <off>
##$DECSTAT= 4
##$DIGMOD= 1
##$DIGTYP= 9
##$DL= (0..7)
0 120 120 120 120 120 120 120 
##$DP= (0..7)
150 150 150 150 150 150 150 150 
##$DP07= 0
##$DPNAME0= <>
##$DPNAME1= <>
##$DPNAME2= <>
##$DPNAME3= <>
##$DPNAME4= <>
##$DPNAME5= <>
##$DPNAME6= <>
##$DPNAME7= <>
##$DPOAL= (0..7)
0.5 0.5 0.5 0.5 0.5 0.5 0.5 0.5 
##$DPOFFS= (0..7)
0 0 0 0 0 0 0 0 
##$DQDMODE= 0
##$DR= 18
##$DS= 0
##$DSLIST= <SSSSSSSSSSSSSSS>
$$ [...]
##$SUBNAM2= <"">
##$SUBNAM3= <"">
##$SUBNAM4= <"">
##$SUBNAM5= <"">
##$SUBNAM6= <"">
##$SUBNAM7= <"">
##$SUBNAM8= <"">
##$SUBNAM9= <"">
##$SW= 24.9337058887773
##$SWIBOX= (0..15)
0 0 2 0 0 0 0 0 0 0 0 0 0 0 0 0 
##$SW_h= 4990.01996007984
##$TD= 16384
##$TD0= 1
##$TE= 0
##$TE2= 300
##$TE3= 300
##$TEG= 300
##$TL= (0..7)
0 120 120 120 120 120 120 120 
##$TP= (0..7)
150 150 150 150 150 150 150 150 
##$TP07= 0
##$TPNAME0= <>
##$TPNAME1= <>
##$TPNAME2= <>
##$TPNAME3= <>
##$TPNAME4= <>
##$TPNAME5= <>
##$TPNAME6= <>
##$TPNAME7= <>
##$TPOAL= (0..7)
0.5 0.5 0.5 0.5 0.5 0.5 0.5 0.5 
##$TPOFFS= (0..7)
0 0 0 0 0 0 0 0 
##$TUNHIN= 0
##$TUNHOUT= 0
##$TUNXOUT= 0
##$USERA1= <user>
##$USERA2= <user>
##$USERA3= <user>
##$USERA4= <user>
##$USERA5= <user>
##$V9= 5
##$VALIST= <valist>
##$VCLIST= <CCCCCCCCCCCCCCC>
##$VD= 0
##$VDLIST= <DDDDDDDDDDDDDDD>
##$VPLIST= <PPPPPPPPPPPPPPP>
##$VTLIST= <TTTTTTTTTTTTTTT>
##$WBST= 1024
##$WBSW= 4
##$XGAIN= (0..3)
0 0 0 0 
##$XL= 0
##$YL= 0
##$YMAX_a= 48867
##$YMIN_a= -35944
##$ZGOPTNS= <>
##$ZL1= 120
##$ZL2= 120
##$ZL3= 120
##$ZL4= 120
##$ABSF1= 10
##$ABSF2= 0
##$ABSG= 5
##$ABSL= 3
##$ALPHA= 0
##$AQORDER= 0
##$ASSFAC= 0
##$ASSFACI= 0
##$ASSFACX= 0
##$ASSWID= 0
##$AUNMP= <proc_1d>
##$AZFE= 0.1
##$AZFW= 0.1
##$BCFW= 1
##$BC_mod= 2
##$BYTORDP= 1
##$COROFFS= 0
##$CY= 11.3945322036743
##$DATMOD= 1
##$DC= 2
##$DFILT= <>
##$DTYPP= 0
##$F1P= 16.9975609425685
##$F2P= -3.02152046262296
##$FCOR= 0.5
##$FTSIZE= 0
##$FT_mod= 4
##$GAMMA= 1
##$GB= 0.15
##$INTBC= 1
##$INTSCL= 1
##$ISEN= 128
##$LB= 0.24
##$LEV0= 0
##$LPBIN= 0
##$MAXI= 10000
##$MC2= 0
##$MEAN= 0
##$ME_mod= 0
##$MI= 1.114404
##$NCOEF= 0
##$NC_proc= 0
##$NLEV= 6
##$NOISF1= 3.799351
##$NOISF2= 2.8
##$NSP= 1
##$NTH_PI= 0
##$NZP= 0
##$OFFSET= 15.70392
##$PC= 1
##$PHC0= -9791.827
##$PHC1= 17.60082
##$PH_mod= 1
##$PKNL= yes
##$PPARMOD= 0
##$PSCAL= 0
##$PSIGN= 0
##$REVERSE= no
##$SF= 200.130013532006
##$SI= 16384
##$SIGF1= 3
##$SIGF2= 2
##$SINO= 400
##$SIOLD= 16384
##$SREGLST= <1H.CDCl3>
##$SSB= 0
##$STSI= 0
##$STSR= 0
##$SW_p= 3612.71676300578
##$SYMM= 0
##$S_DEV= 0
##$TDeff= 0
##$TDoff= 0
##$TI= <>
##$TILT= no
##$TM1= 0
##$TM2= 0
##$TOPLEV= 0
##$USERP1= <user>
##$USERP2= <user>
##$USERP3= <user>
##$USERP4= <user>
##$USERP5= <user>
##$WDW= 1
##$XDIM= 8192
##$YMAX_p= 0
##$YMIN_p= 0
$$ End of Bruker specific parameters
$$ ---------------------------------
##NTUPLES= NMR FID
##VAR_NAME=  TIME,          FID/REAL,        FID/IMAG
##SYMBOL=    X,             R,               I
##VAR_TYPE=  INDEPENDENT,   DEPENDENT,       DEPENDENT
##VAR_FORM=  AFFN,          ASDF,            ASDF
##VAR_DIM=   8192,          8192,            8192
##UNITS=     SECONDS,       ARBITRARY UNITS, ARBITRARY UNITS
##FACTOR=    0.0002004,     1,               1
##FIRST=     0,             0,               0
##LAST=      1.6414764,     0,               0
##MIN=       0,             -35944,          0
##MAX=       1.6414764,     48867,           0
$$ Real data points
##PAGE= N=1
##DATA TABLE= (X++(R..R)), XYDATA
$$ [...]
2097D85l31l42j31OO38O08m16q17n16M86N58N31n87p75m33O98M09L26n59r8N5
2118b05J1M43j88L1l45k24l78K78R32K1m10o79K72L90L12L98p57o99N1Q07P23
2139G84m78o10o22O56L99K18m21j24J4j22M42J6q8R4k69l97Q4N92O44o62n34k24
2161f08K74P84L46q11l95m45R84N05j14o11l77J97K56M23k31o3l17N77l94j12
2181a32O77j21l20m16m81O82J025o2p64p82J25R74N04k23j153n00N24R34R5k04
2201C82n73N9L2K20J5J80R7l50l01k25O17K79Q7n87r96L62R79P80m91j296k32
2222i62N12J073K75p80o55j64O50J49K04m81O9j76O5L57L0j4N6o36k74K33R56
2243D87K99m00j210n1P37Q15J85j284j90K38N69P35p52k84k61J60K16m0j02L64
$$ y = [485, 154, -188, -319, -313, 325, 933, 517, -300, -816, -330, 228, 759, 172, -603, -1036, -338, 71, 397, -162, -260, -205, -194, 249, 61, 92, -253, -477, -855, -577, 355, 376, -34, -713, -441, -51, 261, 659, -98, -797, -746, 61, 784, 306, -304, -926, -270, 129, 347, -74, -198, -184, -306, 136, 152, 64, 158, -111, -508, -424, 168, 812, 150, -384, -608, -334, 450, 796, -15, -410, -855, 129, 634, 520, -91, -468, -271, -15, 408, 177, 114, -203, 374, -20, -132, 545, 424, 104, -312, -793, -111, 914, 852, 88, -694, -569, 405, 909, 686, -467, -967, -443, 491, 586, 382, -191, -132, -100, 120, 135, 315, 412, 62, -239, -464, 153, 432, 519, -68, -1064, -702, 277, 1057, 566, -730, -962, -450, 623, 898, 118, -537, -701, -51, 98, 302, -179, -110, -286, -221, 136, 166, 152, 208, -428, -702, -469, 487, 786, 386, -824, -875, -138, 677, 862, -422, -612, -374, 195, 930, 178, -106, -367, -207, 9, -31, -133, 231]
2263B31k32P7m81Q0N05K32k23q42J32L42J082n72q12m00N41Q80J32j115l75L38
2283d80M21P70k42n41k31L77p5j09J18jL12k77n09p7Q81L12m10m86n53N43Q32
2304E75P8j090n56O07Q48M42p23n83J37K35M78k52o55M09J09j99k29L01K29L31
2324D92n48n62J04R46O21l09j294n58Q66Q88K59o06j070J75P69N14l04q83K3N43
2344F6M33k93n0K76J18o72m07L01L99P21n06q02p60J137R05L61j441r79J80J497
2364D84l3k54o38k43P10M26j52p19M23J13K19m39k33J82Q12l23q18l34J137O97
2384A017l55q02q20J91J378N19j152q48j8J229J82j48r74P5N45K94n49k4O1O08
2404D09l59m48k42N13P05P3j149k37L95J014L88j085j153L70J212P88j185q33
$$ y = [231, -1, 76, -405, -325, 180, 412, 189, -653, -521, -179, 903, 331, -481, -881, -340, 540, 672, -443, -818, -480, -59, 711, 469, -72, -303, 74, -1, -110, 8, 7, 319, 42, -467, -544, 337, 649, 239, -247, -800, -257, 575, 653, -437, -993, -386, 462, 904, 181, -402, -265, -30, 448, 196, -459, -50, 59, -140, -369, -68, 161, 492, -56, -618, -514, 432, 1053, 744, -550, -1108, -242, 646, 905, 299, -771, -596, 173, 687, 383, -500, -477, 66, 499, 206, 156, 432, 550, -122, -529, -228, 171, 892, 386, -416, -1176, -39, 866, 1227, -214, -1193, -1013, 484, 451, 197, -441, -684, 26, 452, 300, -419, 4, 117, 336, -103, -336, -154, 658, 335, -483, -817, 320, 1017, 662, -140, -960, -769, 609, 1128, -24, -872, -890, 339, 521, 373, -601, -526, 19, 313, -236, -260, -199, 409, 50, -398, -640, -127, 578, 651, -498, -735, -340, 674, 1062, -23, -1176, -806, 406, 1194, 9, -824]
2422h24M00L42Q24l61j000L08N46K03k70o31L10O49J02q57m91N04Q82j89m24j106
2442a083O33J243J72r73q52L5J273O26o65p10l66P12L91k93l32j20M53K97l34
2461A07n13M31K94N4p54n63Q73N42N55r02r97M15J071K99m32j295j02J289M78
2480H50l46p28l80O55M37l13l72p9M37L10n75m49J21R73l0q20o71Q2J379P58j081
2501A58j177l4J073J095m35r50n05M29Q46j00m43k84K78J89k80l52K33P38N3p69
2521b37n92K74J080L18n28j073j94J218R17p00r77k13K60J177l05r16%P38j0k03
2541C4j09j43L51M08o10n09K83O40N12o05q06l90Q41J008o67j121k1R45R47n78
2561D10p99k89O64N34J58j041m89R14L40k07m35k59R50J82o45m06J18N80N31q69
$$ y = [-824, -424, -82, 742, 381, -619, -311, 235, 438, 168, -463, -153, 496, 598, -259, -750, -246, 636, 447, 23, -1083, -450, 793, 965, -8, -860, -825, 448, 1074, 409, -301, -667, 45, 436, 143, -189, -309, 144, 441, 107, -406, 25, 319, 373, -381, -944, -71, 471, 1026, 124, -873, -458, 613, 912, 480, -815, -917, 372, 850, 504, -224, -604, 51, 488, 175, -197, -276, 161, 471, -104, -553, -432, 541, 511, -309, -980, -898, 481, 1239, 158, -1019, -1053, 20, 1115, 680, -270, -775, -346, 500, 400, -43, -327, -49, 140, -140, -492, -259, 479, 532, -237, -829, -555, 525, 843, 315, -758, -952, 266, 1183, 483, -494, -707, -447, 730, 425, -491, -491, 247, 237, 34, -75, -218, 133, 541, -69, -578, -295, 345, 857, 252, -554, -944, -103, 905, 238, -883, -904, 41, 988, 410, -389, -678, -14, 520, 678, -363, -852, 62, 402, 195, -240, -499, 451, 633, -12, -418, -300, 280, 811, -58]
2581e8n76j77R33Q41n07j037o46J121Q43J36j132n02M54P58L00q75k53L26M18
2600C67l34n28oP99K95o81q85N5J235N64l52j586j55J177J090o3j504p2RJ250
2620F75l5p41m62M30N22j36n87j38O61J19l20o10l0J041O31o27j188j77J329N97
2640I54k07j153m38M31J277j70o91o34L88M12L98m32p75K72Q47o35j02j77N88
2659A53N64m68j096J23O65J271l89j237o26Q56Q70R6q31q77N78P08L49q08n23
2678f22L97O07k6j79o51O76N9m0n88m42O86Q77l19q75l43M63J254j76p83p60K07
2699e78J045M65p96p90L17R65Q7n02j044M68J170o71k44j52M51K24K21j022o94
2718a080R37Q28j78q99n68M87J226j3j002n90K69J000O90p45p81j77R25M23n29
$$ y = [-58, -634, -811, 122, 963, 456, -581, -1227, -106, 737, 873, -259, -761, -307, 451, 751, -124, -377, -51, 367, 33, -495, -501, 298, 593, -88, -973, -918, 317, 881, 529, -1057, -1212, -35, 1055, 992, -512, -584, -575, 675, 640, -101, -563, -133, 389, 253, -334, -472, 189, 308, -12, -622, -652, 389, 1020, 393, -795, -972, 357, 954, 747, -406, -844, -413, 864, 694, 3, -631, -243, 169, 567, 135, -640, -368, 479, -156, -258, -435, 153, 717, 249, -847, -724, -59, 1212, 823, -414, -1040, -184, 686, 782, -49, -926, -348, 360, 709, -99, -622, -225, 382, 356, 177, -474, 202, 261, 221, -367, -809, -123, 754, 435, -440, -783, -320, 934, 758, -25, -785, -578, 467, 932, 136, -654, -337, 628, 715, 213, -831, -363, 807, 136, -108, -260, 191, 415, 636, -386, -1080, -143, 685, 507, -392, -960, -473, 753, 740, -262, -852, -583, 417, 1107, 362, -419, -596, 329, 752, 223]
2737B23m63k01P21J94o85l50O68P69J05j510k59O02J170oj039p72K67J040N67
2756A041j002o00R3O02L67k59n32l23O37N85k80n50n1O16o5n27j62L57P24J40
2776H11j121o81L37J375j03m54j240K54R06O47l51r42J75L69O28k12r72N09M30
2795C65K2m59j33l4P52Ko41n33L51P65K35n82j074K89J111L97n87r12L4O37N08
2816E13k93l94n15R00L31m47l19p3O22J71m82n44L8P26O48r78q37K32R89L90o64
2837A4q36L59P26M38j71q52k82Q87K73o8n51n22O08M10p8o90k21Q55R4l63l50
2858c20r8J060r1o03n15Q0P16N53n16o88m24P60N04oo86m13M74P44k62m29k70
2879d30L22M14k79j41j10K42N93n82j42n47J128K14o55q58k0J131N14m96m14o18
$$ y = [223, -240, -441, 280, 474, -211, -561, 107, 876, 981, -529, -788, -186, 984, 978, -61, -833, -566, 474, 1041, 39, -561, -468, 134, 501, 242, -290, -613, 24, 609, 329, -221, -272, 344, 279, -248, -410, -53, 671, 811, -310, -991, -654, 721, 618, 164, -1076, -822, 84, 731, 380, -562, -387, -18, 610, 398, -574, -65, 365, 387, -72, -205, -239, 513, 515, -126, -659, -308, 457, 692, 110, -964, -675, 436, 833, 246, -666, -632, 5, 513, 220, -174, -689, 211, 542, 95, -224, -297, 325, 496, 14, -530, -492, 234, 882, -96, -933, -701, 288, 678, 14, -822, -463, 263, 701, 530, -322, -604, 283, 556, 488, -63, -585, 23, 433, 355, -335, -556, 299, 393, 30, -320, -418, 642, 551, -52, -567, -487, 229, 782, 266, -422, -846, -86, 418, 412, -274, -687, -213, 531, 269, -160, -430, -108, 306, 27, -114, -224, 18, 611, 29, -113, -660, 468, 682, 27, -831, -851, 280, 794, 298, -116, -734]
2899g34N78Q10k33m68l24K03L96L90o99R8k7J84k56m44N9R23K51n97q75K7Q27
2920H9N92m24q09k29R36M42J50p79n91L51M59M3o46K02K95Q5r9k89K1K93J94o1
2942B25n90j67O77N45m91q62M0M00Q53k8q24m94N52M47J45o02j15J01O17l36n4
2963C9l00J22K68r2o33L90J87N09l12m59l97O61O58n0q65l16M31N74J98p82l62
2984e31L48M63q1J03m95J95K84k30l48L85J12R5j62l77m6M77L57k35p44k4M52
3005bM98P8q82q9J93K04P59p36m57L41M89n7l99l50M07M90l08m38K52K17J17k60
3027F7l86j49O27K89k50o16j56K81L82L97k58o75L8O85K89n10j63J11j74K25J1
3048F5k75Q7J90j0k7m68M76L28J3o95k97O68N07k05n53o16M24L62O63l52n57j00
$$ y = [-734, -156, 654, 421, -47, -371, -168, 228, 618, -81, 17, -10, 174, -82, -526, -467, 456, 707, 110, -765, -738, 89, 681, 257, -552, -781, 155, 597, 747, -32, -623, -272, 187, 230, -416, -214, 81, 166, 67, -222, -201, 92, 286, 225, -365, -532, 145, 690, 199, -663, -623, -223, 630, 602, -222, -716, -164, 283, 428, -174, -289, -188, 429, 93, 39, -261, -139, 129, 37, -596, -206, -19, 490, 178, -281, -678, -17, 641, 591, -274, -590, -159, 415, 613, -169, -531, -183, 280, 199, 302, -193, 2, 286, 56, -292, 93, 205, 300, 138, -239, -285, 192, 549, 314, -430, -454, -2, 496, 574, -308, -397, -204, 0, 759, 23, -434, -93, 396, 339, -60, -410, -3, 487, 179, -259, -7, 210, 327, 67, -319, -468, 159, 448, 198, -418, -574, -293, 89, 486, 228, -447, -409, 276, 565, 55, -108, 3, -171, 54, 65, -210, -123, 67, 57, 30, -438, 38, 366, 379, -316, -613, 55, 562, 357, -196, -812, -388, -26, 637, 285, -272, -372]
3070c72N08j33K32j3l22J11j58J39L2L93J%o98l17N78L78K08n99o91N19L27K90
3092D13l06m26j03N29K10j95k27j12M08O4k50K61l92L44n6j46l62M50K70K05q20
3113b41k34K53P74m45R9n78l3K40O73n20k86r0K21O52k19j06k02K34l30J98k84
3134b24K29K98j91k29k86L97j58L57j87m62J18M48J15j65m32N0L49M09M4o22j04
3155b46j59P92k81k48j8K33J81k32k61K59M55L1n59l30K14J68M78l71l51j2L73
3176A16L19l12n10m2N83m2K21k54j10Q1P6j31J49k67K82m5j99k58K67j60L16J4
3198I4p78M15P03K26m94m33k91P23L28k35l49q7j75M85r5k54J35J05j67J49Q3
3219H8J44j67p8l04m11P54J56p7j92k49K79j80O64k91j58l07kO71l11p9N3j98
$$ y = [-372, 136, 3, 235, 222, -100, 11, -147, -8, 24, 417, 418, 418, -280, -597, -19, 359, 567, -32, -723, -204, 123, 413, 107, -319, -422, 107, 317, 122, -105, -217, 191, 255, 5, 266, -126, 218, 162, 16, -346, 104, 374, 579, -241, -475, -222, 552, 107, 206, -372, -405, -165, 508, -12, -298, -388, -167, 485, 266, 160, -42, 192, -138, 60, -224, 5, 303, 112, -117, -403, -6, -164, 193, 6, -456, -338, 110, 225, 60, -372, -322, 27, 436, 480, -142, -246, -405, 387, 106, -142, -160, 73, 254, 22, -239, 20, 475, 506, -53, -383, -169, -1, 477, 106, -245, -257, 116, 435, 123, -387, -429, 154, 112, 333, 79, -31, 50, 126, -5, 144, -123, 159, 114, -85, -343, -76, -236, 80, 94, -684, -269, 434, 660, 166, -267, -558, 165, 493, 258, -91, -178, -353, 132, 37, -217, -82, 23, -144, 5, 88, 232, 65, -13, -317, -728, 26, 182, 105, -87, -336, -57, -237, 427, 136, -22, -329, -331, 340, 29, -50, 3, -195]
3241a95k1j75L65P1j16K77l78L21k91M16q0k37l12J78L13J72j52k52l52M04M24
3262C80j40j53k08k26L56J63k03j97L39k15JJ17K37k69K51m0l55K06L00n7l70
3283h3k28j34O13Po9l64k2K27P6J77j84J96j62o3K17k92J0k89L31j90K43J19l0
3306A06J80l70j69L41k7M19k72l05n43N63K63J54n35l1J37L0J28K37j65j39Q4
3327H6K07k76L4pj83J50m78N70O2j90j76j37J79L20J69k01l08Mj88L11M13O6m23
3350Dk55J46j0Nj15K56m37N02k47j27M26j08k30O0n0J94L33k80j34l75j10O05
3372E3J08j04k99J9J99Q5K87m16O5k58L18k8J88o5k85K09m3P6Q4p1j80l30K21
3395a67L35k17K55l55K0j32N05P2j37j11k77J41op7K18P6l18K33N1k39N7n6J45
$$ y = [-195, -216, -391, -26, 45, -71, 206, -172, 149, -142, 274, 194, -43, -355, -177, 136, 308, 156, -96, -448, -44, 380, 240, 87, -121, -347, 9, 172, -31, -228, 111, -104, -103, 14, 251, -18, 233, 193, -162, 44, 344, 287, -83, -311, -445, 168, 175, 106, -258, -280, -53, 23, 200, 16, 212, 50, -13, 204, -88, -78, -367, -36, -226, 17, 136, 106, 286, -84, -253, 88, 61, 480, 208, -97, -640, -77, 186, 340, -195, -226, -89, -59, 69, 306, 141, 2, 86, 293, 17, 51, 44, -139, 11, -467, 103, 165, -25, -201, -338, -159, 161, 330, 129, -179, -175, -363, -52, 361, 427, 4, -251, -105, -115, -110, -225, 31, -406, 96, -151, -278, 148, 40, -190, -130, -180, 14, 347, 67, -67, -442, -552, 53, 161, 57, -242, -223, -24, 61, 348, -68, -3, -261, 57, 29, 217, 152, -133, 76, 33, 109, 193, 122, -58, -388, -167, 168, -49, 206, -149, -129, -261, 244, 316, 179, 68, -209, -68, -74, -151, 67, 143, -175, 58, 109, -130, -73, -129, 16]
3418A6o7n2K13j27R5j52L3m1J44q7P5l70L93j95K62p3j92K8J43l1L4o1M6m1Op5
3444g6R4K60m90L86k74k18L73l7J28m34k68L12L22l7J45p8l86K36K11J11j86J08
3466B02k95R2K03j57J95m68Ll7L90K49l51J19k7j12k89L33m9j23N3k4J18K49j12
3489A62k10L1l59M76mJ53k67J35l03J95kP4m01J98p1K05K58k08j67J2J81m54M54
3512H8J75r9l10J51l5L07l95J1j35L21j16J09J8l4j29J4k13L88j79L73m56J41
3534ek32J82j17M37o4k44J91j34j34Q6Q6k57J79k88N97J30k37k73K20p9k4%M59
3557D79n23J21k15K47r9j2K49k88L7K4n2Q6K04l91K68K18l56O0l8r6J05J8r8k7
3581g9k9P1m5p6J88K43q3l75J97j56J95l3k73n4O53l2n58M71k77j30K17k23j30
$$ y = [16, -51, -103, 110, -17, 78, -74, -41, -82, 62, -25, 50, -320, 73, -122, 140, 67, -125, -97, 46, 15, 49, -12, 34, -7, -1, -76, 18, 278, -212, 174, -100, -318, 55, 18, 146, -288, -556, -244, 78, 41, 186, 108, -278, -42, 169, 280, 94, 202, -93, -1, 202, 45, 240, -228, -225, -262, 128, 377, 26, 145, 118, 6, -283, 50, 1, -122, -69, -93, 25, 274, 162, -48, -17, -376, 100, 96, 249, -18, 117, -186, 9, 7, 81, -320, -122, -193, 12, 270, 62, -105, -93, 88, -366, 88, 263, 164, -146, 5, -30, 277, -118, -107, -242, 79, -37, 72, 90, 56, -73, -59, -272, 116, -63, 310, -146, -5, -237, -55, -172, 265, 201, -43, 148, 14, -120, -34, 52, -205, -26, -314, 283, 413, 176, -97, 123, 44, 20, 20, 479, -44, 77, -138, 109, 10, -2, 247, -41, -4, 20, -32, 54, 258, -133, 135, 353, -3, 57, 19, -77, 28, 46, -52, -79, -108, -37, -82, -158, 30, 273, 190, -185, 12, -144, 51, 18, -255, -309, 344, 312, -246, 225, -52, -182, 35, -188, -318]
3604c18M17J9k98K21L1L9n8R5k06j84O6L24M8o18K76K09j30J14%K17l46P5n12
3627e19O56Q2Q7m30k10J00K64N5j40j75O5J18l4J24L9j59P0J95l14K11k5j4Q4
3650A30k41K89k27K23L4J65l65k10M9J04K22k35n5j42J38M36m13j68J13J52L97
3671C96m15M24l04l38m9J38J99QM7m18O36j25j36J95n2q5n15L49J33K81m80q0
3693a91K15j13K17J80l65p0M98j36j60r3J11ol26M6K95K28j98p6P4j73K87k54
3715a0l55O03l34J08j66J59j51N9J53N0m4L43j25m00J3j9K96k58n2k7J41n9P6
3738AK53k70J21j45o6K01j25K00k37j36J14oK29j20j61n7k4L34K36k25j98K2k61
3761c20N10j12Jl67K47j49K7J92K27j21k78K0j07K91M1J16j61j19r5M4K99l11
$$ y = [-318, 99, 118, -180, 41, 72, 111, 53, 148, -58, -242, -176, 148, 196, -422, -146, 63, -67, 47, 47, 264, -82, -7, -519, 137, 219, 306, -124, -334, -234, 30, 85, -55, -230, -165, -47, -81, 43, 82, -77, -7, 188, -126, 85, 60, 46, 130, -111, 178, -49, 174, 208, 373, 8, -202, -153, -49, 173, -62, -117, -259, -121, 315, -98, -266, -153, -1, 396, -19, 405, 101, -237, -286, -148, 51, 59, 106, -312, 324, 199, 63, 258, 206, 121, -394, -45, 88, 369, -111, -191, 24, -89, 128, 308, -57, -127, 371, 235, 75, -18, 93, 87, -239, -193, 102, 330, 132, 56, 130, -43, 244, -10, -365, 238, -96, 12, -154, 5, -146, -87, 66, 116, 72, 415, 290, -110, -97, -116, 180, -78, -130, -157, -16, -75, 1, 254, -16, 105, -40, -106, 95, -30, 170, -67, -203, -89, -95, 134, 14, -147, -204, -228, 106, 342, 117, -81, -59, -320, 190, 78, 79, -288, -41, -190, -163, 29, 256, 135, -143, -123, -230, 61, 102, 218, 57, -62, -157, -113, 186, -125]
3783a25p2K16K73K7k79J50l07L70m44K39J25m5m04j68M04Lj62M54k28k59J17M30
3805C15k53Kj32J81k50O33m34P4J95m28K06p3R0k45N0j85K14J15Q0l89K94JL4
3828I5j7k0j03L35k18k63L55l69K91J04l07k17L24J84p0j39j84K49r2j01L24p2
3850H9k63N5j67J66J79j06J50J07j59j40J93kk31L7Q2q4K20j40j44R7j04L40j10
3873F5J54k49o7j00J33R2j2q0P4K19j19n0L4K04k76k8j0k66M99K1o34M78m25L21
3897b2J14K07l12j41K09l02K81Q8j97mk6J06J49p3j60k62K30Q4p5L99j74p0Q4
3920A33j42j41J37p4qQJ28L25n00m1J88k22K42Q7N7Qj98M8Q5l6k55k16J85n6J00
3945a58K21m0j32J8J97k92K16k22J68p2K6PlJ79j16k3j18K70kJ11m02p9J02O3
$$ y = [-125, -197, 19, 292, 319, 40, 190, -117, 253, -191, 48, 173, 128, -276, -444, -40, -37, -199, 255, 27, -232, -115, 315, 62, 64, -68, 113, -137, 496, 62, 136, 331, -97, 109, 36, 126, -119, -69, -254, -40, 75, 155, -234, 60, 61, 95, 78, 58, -45, 290, 72, -191, 164, -205, 86, 190, -117, -334, -10, 174, 104, -35, -219, 30, -62, -163, 161, 89, -174, -119, -286, -120, 59, -47, 103, 210, 51, -89, 104, 102, -129, -92, -10, -94, 126, -14, -158, -61, -165, 175, 65, 219, -30, -97, -197, -64, 28, 16, -64, 10, 229, 110, 60, 94, 298, 22, -6, -16, -282, 217, 238, -396, 82, -343, -22, 92, 299, -13, -154, 55, -247, 34, 122, -75, -79, -105, 1, 150, 77, -83, -345, -115, -31, -106, 293, 119, 49, 133, -9, -150, -13, -87, -95, -87, 41, 366, -134, -175, 13, -209, 33, 120, 177, 185, -13, 35, 120, 84, -171, -387, -202, -258, -158, 63, 23, -109, -91, 106, -186, 30, -192, -24, -96, -70, -63, -66, 113, -3, -26, -144, 126, 124, 235, -167, -246, -144, -81]
3969h1k61J57P00o60J11K25l10o3M19j91j72j40Q9K4l5K84k9L8p8K54l03L6k69
3992b55L21j49J84r6J91k95Q7J06N6j23j94K2J81k27L00JP2j70l4lM5M1j45J80
4016I6k13K47r9K27l20j71J33L9J79j21j37n6K63k99J70K71J05m75P1R7j58K70
4038A19o9j86qJ64l2K88k10Ml1j80K9K02m8KL9k7L7np8R8j25l13L67l1J02k27
4064a19M1j0L05k43M46l65o2J31o2q2r1J64q2KK2j69L2K48j7l7j25K9N9P4P2j99
4090c8J07k64L06k91R6L50l07j85K51J48k10k47J83K27j16k18L8K58l41M46j52
4111D1K1J90l89J61o0K09o4j27j95N1K73j62K9J75k30J8J90j34L2P7J0l62K58
4134A2K5J31k07K57l82K56J14k04k93L55r5k04J80K54p1l26M24l32P0J23M1o9
$$ y = [-81, -342, -185, 515, -145, -34, 191, -119, -182, 237, 46, -126, -266, -177, -153, -188, 96, 67, 105, 27, 281, -22, 14, -255, 66, -83, 101, 5, 196, -99, -12, 94, 150, 27, -167, -145, 36, -191, 109, 110, 182, 12, -22, -25, 20, 61, -84, 96, -117, 130, 31, 258, -62, -233, -100, -61, 118, -3, -140, -196, 67, -232, -62, 209, 314, -161, -90, 7, -151, 119, 50, -136, -144, 20, -12, 276, 66, 70, 39, -141, -112, 90, 42, 44, 83, 56, 93, 88, 10, 108, -17, -330, 37, 6, 108, -119, -78, -88, 217, -26, 420, 55, -7, 124, 62, -20, -111, 53, -29, -27, -5, -174, -142, 106, 89, 52, -73, -44, 15, 89, 161, -38, 69, -195, 111, -180, -84, 266, -41, -226, 25, 173, -37, -284, -101, 126, 10, -208, -170, 88, -253, 193, 41, 62, 252, -137, 24, -36, 173, 109, -18, -213, -162, 111, -51, -22, 153, -77, -59, 131, -3, 29, 106, 116, -246, 12, 37, 168, -39, 218, -164, 92, 206, 2, -291, 64, -31, -235, -55, 199, 128, -198, 226, -106, -36, 87, 128, 59]
4156E9j20j3K0L13l50J2l39L57n3K3J31j81K02j4m9R5L2q2l79L62J42k8L1k46
4180g5l68M64j54l4J14J47k81O1J43K41k39n6j70Q7m1J4j4J20M1q4J88j09Kl6
4204c9J23k49J58o6L54k83j06J60j90M7J18R8j13J42l46K3L78N8m72K10p6L3j79
4227b17M5M48l24J89n9%k07K23k62NK12K46l66K55Q8n02J80OL25l40K36rj83K5
4251A4NR6n0k34O1J31p6K26r3k09K4j30K23K63q2m4K49l25Q9J56m10K15j85J74
4275H8k15k6K9L8K14k97K83m3j57j5o8J42Q4j13N2p4J22k39K84p3M3j34j37K57
4299D5j2k75K54M01p93L06J22K39J4k24k7k94L35L3j08K5j99J36J2L48k29k80
4321a71j81J65q5L85l5M9k69q9J19J28K06j90R6P6j17K12j71J12m33J9K31J01
$$ y = [59, -61, -74, -54, 259, -91, -79, -418, -61, -114, -91, 40, -141, 61, 47, -2, 93, 125, 43, -336, 26, 168, 140, 171, -75, -443, 21, -133, -167, -53, 94, -187, -126, 17, 258, 19, -37, -207, -120, -161, -147, -161, -41, 0, -84, 104, -5, -3, -39, 84, -165, -7, -73, 281, -2, -108, 52, -138, -91, 27, 125, 12, 154, -192, -169, 209, 267, -205, 5, -71, -38, -217, -172, 276, -48, 141, 82, 82, -125, 98, -164, -159, 53, 299, -67, 188, 276, -226, -46, -40, 285, -55, 181, 172, -11, 14, 19, 115, 65, -169, -108, 23, -53, 173, 80, -129, -105, -235, -12, 251, 169, 125, 374, 49, 138, 294, -116, 99, -86, 88, -127, -153, -124, -86, 128, -169, 114, 71, -86, -101, -169, -27, 57, -56, -4, -78, 44, -195, 89, 16, 59, -75, -212, 45, 33, -242, 12, 413, -380, -74, 48, 287, 301, 77, 50, -244, 91, 124, 16, 41, -158, -22, -10, 338, 109, -171, -352, -187, -272, 113, 78, 127, -142, -231, -112, 16, 222, 32, 128, 204, 87, 299, 128, 240, -193, -174, 57, 158]
4343A58m89K24rQ6j00J06j13L66m43M04k94K1K89j13k94J52J41j15J00qo0p1J46
4366H4k25L00o6n4K3j44j91L09m0L11l81N0R7N9J7j97j18K93J14j38J54j91o1
4389Eo2j5Q2M5L6Jj22j38K34J75l70K45j70J02j09K47lk50lj29J59Kl6K24j52
4414bQ8m25L68m9r1J59j61K84q7k33QL10Q0j54l20K92k45M23j20m91L44j29J82
4437C1K91o12N4K04P1k11l7K21l4J15J06q7m6l31K13J73O2k58M3k71K02O0k5q0
4461a46j56L03k74J58m4j51M36l27L08j02O5j97J26O8J20J09n09L55O3l79K30
4482E6m7K52k47j5L0krJ05k06p4L7K13j1L7k57n0M6M28l46N3M1N7N4k98M38l35
4508e0J09r3j18J17M1K72l15j08K51j77j1K71r0l15L67j75o6L20j92o9j28J95
$$ y = [158, -331, -107, -116, -30, -130, -24, -137, 229, -214, 190, -104, -83, 206, 93, -201, -49, 92, -23, 77, 69, 9, -62, 84, -141, 159, 93, 39, 62, -82, -273, 36, -4, 307, -74, -24, 73, 132, 149, -48, -166, 127, 241, 103, 257, 66, 5, -57, -72, 10, 55, 91, 92, -30, -168, 66, 241, -129, 116, -54, 48, -61, 186, 183, -67, -70, -199, -40, -38, -74, 150, -2, 86, -339, 29, -20, -111, 48, -113, 171, 84, -149, -141, 169, 249, 95, -225, 67, -178, 245, 125, -366, -22, -151, 31, 322, -290, -236, -32, 39, -172, -209, 12, -22, 93, 199, 112, 66, -265, -52, 121, 183, -75, -32, -303, -101, -41, -66, -146, -302, 1, -273, -115, -159, -310, 126, -201, 107, 5, 70, -127, -1, 67, 187, 296, -213, 142, 205, -174, 56, 9, 261, 14, -1, 29, 27, 18, 123, -83, -157, -120, 93, 82, 119, -138, -188, -142, 286, -60, -7, 34, 91, 145, -153, 285, -50, 59, -34, -152, -35, 6, 278, -37, -145, 106, -71, -82, 189, 99, -216, 151, -24, -90, 230, 38, -31, -159, 36]
4530C6p2J87l0j07J54m23J50j55J99L16J23m82k04N86q3j29Q1k48O6n6J55j4j44
4553i4j18K14J06k90L6R5J9o3p6M8L81j79p5j22J27n3kL7K72k67k16K05j7n6R2
4578DK09j37j83J11m4j46K46N7K7j42k80K99j18k09K72O6K59j09r5r4q4L7J55
4601A01N2l64R0J50k07K38O3n6k4r8K9k02N08k54k67L59o9Q1n8o3O9J60l08J43
4625G3j23l6J06K8J47J61p71L67m3R9J20j00M3j38R8K1j0O4k47q6O1J31oL9r1
4650i3q4L36k04J74l22L49j45N8j55n3N52l54k21pK79k73M05r7p6k22O0L57j99
4673F5L6J05k00J50l47L89j12n1J69r2j19L5L32l78Q4P1o1O7q2J38m17L45n8j57
4697h8P7mq8O4P3m2p2j29J61K32j35n0J23q2j19K74l27J80l15L32j99rK51l86
$$ y = [36, -36, 151, 121, 14, 168, -255, -105, -260, -61, 255, 378, -104, -308, 278, 195, 66, 147, -101, -35, -91, 64, 50, -94, -212, 2, 108, -182, -146, -51, -32, -95, -171, -123, 258, 79, 4, -118, 9, -44, -46, -9, 263, -4, -220, -15, -32, -88, 4, 213, 76, -107, 4, -40, -186, 60, 117, 144, 2, -278, 21, -97, -306, -34, 32, 291, 182, 87, -7, -91, -54, 101, 153, -211, -121, 29, -178, 60, 123, 67, 43, -55, -26, -228, 280, 26, -241, 118, 49, 130, 72, 9, 78, 238, -70, 73, -50, -86, 20, 48, 195, 356, -415, -48, -91, 8, 128, 28, 71, -67, 31, 52, 42, 106, -141, -227, -166, -35, -41, -2, -93, -177, 159, -45, 129, -193, 156, 11, 69, -86, -139, 413, 59, -162, -169, 110, -163, 242, 145, 69, -153, -93, 264, 65, 101, 206, 6, 156, -191, 198, 86, 35, 204, 112, -7, 28, 360, -18, 66, 137, 76, 143, 61, 199, -218, 127, 69, -88, -11, -15, -103, -39, 34, -8, -80, -209, -48, 184, 49, -1, 122, 40, -79, 195, -132, 48, -267, 65, -134, -143, 108, -278]
4721b78M59j35k00Q9K01j41K67k24N1k15L7k5j67L61j0J25k6l43L03j50J33m86
4743c74L46j24K58k6o2K1l5o6N6J08O4k52Q3k45J58p9r4L55l1l7Oq7O1j12J08
4768@M4k44K88l0j26O6j79O7M1j07K84j69K32p6jj38J30l71J37R3jo8k5J42k20
4793b31M8K92K32l05K32m74j22M41J48k17q5K19L8m31L93j57n71O86J5k09L94
4814C36m86L2N49m31oRM39k91j85J03q3j77L4M65l46L9O3j68J56k7N3N0j41k31
4838b44J86J69q3J44l62KP2K48k97q2K57k5J87j20kO1j22J81k30k16K34N4k8M8
4862C2j50j07O37o30M36m99J85L12l61o0J08J45J74l24K23k61J92K45k60k10M78
4883C05m01k28L20j4Nj42J53K91k10j22j09k7J44j8Q9j42J05L07j81j11Q8m7q2
$$ y = [-278, 181, 46, -154, -65, 136, -5, 262, 38, 89, -126, -89, -114, -281, 80, 70, 195, 169, -174, 129, -21, 112, -374, -28, -152, 106, 80, 18, 39, 4, -62, -6, 102, 166, -86, -3, -248, -90, -169, -263, 92, 61, 24, 30, -57, 4, -108, 0, 44, -200, 88, 58, -68, -2, -181, -114, -73, -180, 104, -65, 167, 91, 90, -48, 82, -289, -152, -59, -60, -128, -153, -11, -231, -183, 109, 341, 36, 268, -206, -328, 113, 261, 44, -41, 178, 216, -215, 178, 21, -550, 136, 151, -58, 336, -150, -118, 431, 0, -6, 3, 442, 151, -34, 69, -14, -191, -157, 308, -38, 1, 64, -104, 52, 25, 78, 128, -13, -244, -58, 111, 28, 172, -190, -188, -116, 132, -165, -247, 10, -15, 172, 52, 50, 111, -11, 170, -60, -276, -42, 12, -16, 32, -118, -225, 412, -218, 218, -281, -96, 216, -145, -205, -97, 48, 222, -102, 121, -140, 52, 297, 37, -173, 305, -96, -324, -4, -18, -13, -155, -2, 289, 79, -43, -152, -179, -35, -53, 36, -106, -1, 306, 125, 14, 102, 55, -27]
4906b7L7j82M8J31J33j57j14K39j2k03J87J8m73L31j63J03m0L26P2l38J63j95
4928a16j52J97M79k43r1k27K87l7J97l43j59J08J12j18Q0K8k84L86j78J5m6K92
4950A87k83K28j35j05j7J62J9j02J6j10Q8j78J17J3K2J32J10l7l59j0L11r9J16
4973H6R9k76o2J58k69M82k78j3K92m71L49k34j87Q5O30m72K5J18k80J78oP1m57
4996d32N02j36j04Q4j17j70M04K8K49m05O1j0k56J17K78L8j14j88K28L26l08J11
5018A86k18k9K53k79J22l33K16P9jQJ1k2j0j40J38p4J8l7K54j05M2k32K16O1o2
5043F2p2K09o2k75K23N5k05K8q3J2P9j62K63k0p4j36J78q8K70j23j72K58l99O17
5067C83o56K32N39m42K37k14K5l21O9J53p1r0p6J6O66n17J19k1j11K34J71k05
$$ y = [-27, 10, -172, -124, 7, 140, -17, -131, 108, 96, -107, 80, 98, -375, -44, -207, -104, -144, 182, 254, -84, 79, -116, -268, -71, 408, 165, 74, -153, 134, 97, 294, -49, -208, -100, 12, -106, -26, 2, -282, 104, -74, -59, -105, 187, -96, 132, -3, -108, -125, 37, 56, -46, -30, -140, -52, -230, -113, -100, -78, 54, 164, 127, -232, -242, 69, -30, 86, 185, -91, -153, 5, -264, 218, -60, -73, 219, -252, 97, -137, -324, -239, 391, -81, -56, 62, -218, -40, -46, 25, -432, 70, -66, -170, -86, -203, -373, 31, 59, 308, -97, -36, -46, -302, -185, 93, 131, 17, -171, 57, 383, 75, 186, -32, -61, 192, -87, 35, -298, -82, -3, -4, 4, 15, -7, -17, -157, -19, -93, -75, -112, 142, 37, 79, -153, 63, 124, 62, -10, 199, 137, -138, 85, 140, -65, -37, -120, -108, -29, -191, 72, 52, -22, -158, 20, -68, 202, 79, -93, 165, -234, 383, -273, -41, 498, 56, 293, 79, 104, -217, -148, 5, -66, -156, -232, -216, 450, -67, 52, 31, -80, 154, 325, 120]
5089A20K9J42k69j46K53R4j96r4NK7J39J5j55J70n79M60q6L16l00L86k09k22K37
5112A37m4n1Q3j30j81K51m59L67n5j27J42J2m0K25j0J47j19k51k2M7j23K60l3
5135B6k6o0M87o29K06j59M94j68j90J44k69M9K10j92R1o9L06k96O7j25n1J12J28
5158H6l22L6K92r5J25j90R3p5M9m3P9k95l7L79J49k40k28p9Q9Q1N3J00J4lJ42
5183A60j71r1M42m53J32J31l15L37m5k51p4L15m40J40N53j61r3j25r3L64m00J50
5205A2J15k7k45L8j49K75L88k09m32J04K25P8l05K8O6j27J16q8K60k00j61L59
5227A21O5R0j25m01Q7K70j73J34j0j58P0LJ38N0l54L73j54O1n0j9m7o0m8J64K7
5252E4Nj54P9j38NK75k01k16N12M8l61P5L6J27k52M02j13m40K40m6J88k87K07
$$ y = [120, 149, 291, 22, -124, 129, 223, 27, -67, -62, -35, 104, 119, -36, 134, -445, 15, -71, 245, -55, 331, 122, -100, 137, 93, 42, 125, -5, -186, 65, -394, -27, -82, -209, -67, -55, -95, 130, 120, 267, 148, -103, -125, -78, -201, 59, 26, 0, -60, 427, -202, 4, -155, 339, 171, -19, 125, -144, -95, 115, -77, 14, -55, 251, -45, 22, -103, -154, -42, 86, -236, -200, 92, -3, 122, -68, 25, -50, -1, -44, 35, -260, -297, 82, 231, -9, -237, -316, -227, -146, -93, 7, 21, 18, 160, -11, -102, 340, -113, 19, 150, -165, 172, 127, -124, -198, 117, -323, -183, 370, 209, 116, -9, -102, 262, -138, 12, 127, 100, -145, -107, -256, 19, 407, 198, -234, -130, 95, 173, -132, -104, -38, -165, -49, -137, 123, -77, -238, 121, 186, 276, 151, -250, -163, 107, -66, 68, 58, -100, -30, -27, 111, 161, -193, 180, 26, 87, 37, 18, -29, -89, -137, 27, 54, 59, -95, -16, -154, -149, 126, -75, -291, 221, 269, -92, -17, 19, 146, -106, 296, 183, -257, -17, -63, 125, -162, 45]
5275D5q9J30m3j03J71k34L59m01K98k54J11r5J49k04M25m59J67K3j68K41k54%
5297a85OK61l02L84q5K46j07m24J60N0L8l1Jj88L5K99J03L1j77j14J39Q7m14Q4
5321a03m6%K4K56j24J92m38J28J54j49K61j15q6p3j26K31J4k6K00l8J67m26k58
5344c81M18l0j58L5O4L15k45p9J78k69L45j11K45j39k87J37J64k5r4k18J29K2
5366A6o4K14k01J7K25k57n5K51o3m32P12m80K49j74ML8j37J06K17k74p6J13Q0
5389B9k35J60J7j31J54%Q2k91L37k04K62k18j19M7J43o5R4J7J04J07o54M55j76
5412h5m1L3O8j71K68L90l35P4k94N01k30j23l79Q2J76K44j82R1k51o9K56J82j94
5435A1j56J22J68j62O6M1q9j3J3J41l70K47kM5o2m20N05l48N95n62NM7PM28m77
$$ y = [45, -44, 86, 43, -60, 111, -123, 236, -165, 133, -121, -10, -105, 44, -160, 265, -194, -27, -4, -172, 69, -185, -185, -179, 82, -220, 164, 79, 325, 218, -206, -46, 4, 42, 11, 12, -176, -141, 158, 261, 292, 115, 1, 140, 227, -187, -103, -149, -149, -125, 131, 7, 199, -239, -111, 43, -106, 155, 40, -46, -119, -245, -14, 0, -26, 174, 136, 303, -123, -381, 37, 7, -151, -116, -52, 263, 18, -61, 117, -152, 193, 82, 327, 188, -99, 38, 202, 177, 83, -135, -6, 16, -48, 166, -35, -18, 207, -50, -105, 146, 83, -349, 363, -117, 132, -42, -38, 0, -137, -31, 186, -88, -164, -51, 29, -206, -46, -29, -160, -6, -6, 76, -215, 122, -82, 180, -38, -157, -110, 33, -32, 62, 79, 183, 290, -364, 91, -85, -126, -93, -25, -196, 72, 462, 127, 201, -93, 408, 178, 55, -324, -242, -66, 178, -4, 87, -164, -233, 23, 205, 11, -145, -23, 145, -17, 49, 90, 1, -12, 1, 142, -228, 19, 17, 62, 0, -420, 85, -263, 332, -230, -225, -178, -171, 257, -220]
5460b20J80j26K84j99J62k25L7K8k78N01k30J15J54l3k25j63M40j50j88P2J04
5481D0r9j3K29l81K01j07J92o8l9J73j38k7PJ47k45J38k08J17j1J24K56m5k37
5504Fl1K86k72l9R2k57L20%r0O0pr0R2k04O3k2ML8n1L0M1p6Q3K5k31J48N7j53
5532a78J91J03J68n68J75J5N7K1j22J77j22j05L07r1L00k98J37j73l31L38n7L51
5554B95n5r7j8k13J56J10j66j51K6p3K72L7l26K52r6K23k93N7j22K82k99L3q5
5577b51K21M3p8K18r8Q7n3l54O9J16J20rj6KN2N6J18m5k98J12j39J93Ol24M21
5602A69k68J27j14J3j02K57l22O5M18j78q6J61k28l5K06p5J4j42J43j82OL34j03
5625G8l49L90l31q4N15k47j03l04M72j73L21k72J22k47M04j31p8N5K15k6k03k25
$$ y = [-220, -40, -166, 118, -81, 81, -144, -107, -79, -357, 144, -86, 29, 183, 150, -75, -238, 202, 52, -136, -64, 40, -59, -72, 157, -224, -23, -130, 62, -6, -45, 128, -10, -37, -30, 117, -128, 10, -198, -81, -92, 32, 288, 243, 6, -25, 261, -11, -50, 42, -215, 105, 105, 15, 75, 68, -22, 70, -134, -71, -93, -89, -51, -102, -72, -31, -107, -24, 1, -230, -82, -25, -178, 13, 116, 284, -284, -109, -94, -37, -16, -138, 39, -83, -188, 119, 28, 328, 30, 167, -6, -337, 1, -56, 295, 240, 143, 125, -88, 68, 178, 12, -139, -113, -186, 86, 123, -203, 49, -47, 176, -117, -60, -182, 100, -199, -166, -251, -30, 13, -65, 153, 55, 142, 89, -265, -196, -80, 40, 31, 15, 17, 69, 125, 243, 198, -100, 12, -127, 66, 72, -252, 169, -99, 28, -86, -73, -175, 82, -240, -175, 243, 65, -21, 140, -88, -123, 83, 8, 22, -120, 23, -159, -153, 181, 78, -271, 119, -212, -296, 219, -28, -131, -435, 37, -136, 185, -87, 35, -212, 192, 61, -17, 38, 253, 227, 24, -201]
5647b01L97j98j56M06l23J15j02J86k3k19R5L4p7j73K54K5j28R3k67J91K43k49
5669g7J22q9l45K86K94j28p3m4P7O9r7N7Q0M3l67J82R3j53K96k46r1J52m8P2R3
5694A58qj45M2p6L76l63k07k1K51P7j77K23l78j84K87N6k1K35m20K73q0L14l19
5717a07J24J18N8n0J73j98J8N4j34K5k42J77l4j48p9K19k06K5j3K39qj99K79k89
5741a98Q4K99k52K98O8j65j69J91l40M68m49J31l9J93k45K70K2k32K93m95K26
5762d1k7p4q2L55j16j37J36K2J55k76o9L29k06j30J47J17k35j36J27L47j70k7
5784IL4l92J03L16J84J7n9j9k33n9m8O1J46k03J92j63K17J88j79o5m10M0l2L89
5808C4J10k42J76m4q3m0J99j11j07J51o2J14k28J66M4k6j66K46K89l97j44R3j4
$$ y = [-201, 196, -2, -158, 248, -75, 40, -62, 124, 101, -118, -23, 11, -66, -239, 15, 40, -88, 5, -262, -71, 172, -77, 45, -44, -389, -103, 191, 63, -10, -54, 23, 92, -5, 52, 132, 175, -192, -10, 83, -70, 226, -20, -111, 41, -7, 65, 158, 150, 5, 47, -29, 347, -16, -223, -244, 7, 84, -93, 130, -248, -432, -145, -89, -110, 125, -295, -22, -102, 212, -107, 17, 135, 193, 143, 316, 118, 136, 190, 56, 81, -161, 16, -18, -166, -245, -26, -232, -207, -220, 19, 11, -188, 91, -198, -114, 185, -67, 231, 299, 134, -35, 156, -184, 284, -165, -34, -73, 120, -125, 145, 167, -65, 228, -267, -41, -68, -142, -224, 131, 15, -122, 14, 36, 191, -85, -154, 175, -31, -161, -14, 103, -132, -268, -141, 206, 36, 9, 43, -349, -246, 70, 254, 271, 212, 193, -40, -99, -147, -86, 60, -143, 49, -114, 103, 291, 112, 47, -363, -323, -355, 34, 144, -98, 78, 34, -49, -89, 110, -1, -108, 43, -19, 95, -133, 33, 77, 51, -115, 131, 420, 23, -121, -28, -42]
5831d2m7K3jM5m10M37j78j18J33K06P6r6j10M70k61j79K81q3l72P5J58L1j69O8
5855f3K34k21J37j50j57J1J97N3k42N0o5L10j60j20J71k29L69j94J1K9r9m12M14
5878a26J23J57k09nJ43j48pM9N0L21o36l5J48J12O3Q0J04k14J30k5J53k6l15M18
5902C05m35q8M33j08J50j55j04J10j79J44J88k74M4R6k65P0K56l09J41J58j41
5923C7K57j56m81J26L93j92J36j46M1J59j42m2j52j43L89k01m2MK21l5j59j29
5945b57K6J44l9O0K76k02j2n3L9j9J04j87J36k4k78K04qJ72L7l84L13J43k37o9
5969a15q1K99k68M25k88j13j97M34nk02Q9k23J3M45j36K7k76o1J6J22J15J02j48
5992b6J47n2K3l22j2M30l7l7r8J7q0j3lJ52j52j27P0K02Pk08%K31O9k98J88N0
$$ y = [-42, -89, -66, -67, -22, -432, 5, -173, -291, -158, 48, 124, 28, -82, 388, 127, -52, 229, 146, -226, -151, 7, 38, -131, -63, 171, -50, 87, -63, -220, -209, -12, 41, -201, -151, -216, 94, -66, -186, -15, -244, 125, -69, -58, -29, -128, -540, -126, -3, 154, -55, -60, 83, -65, -72, -23, 27, 348, -288, -323, -175, -63, 0, 80, 184, -30, 100, 75, 228, 202, -113, 305, -130, -218, 215, 107, 257, 102, -2, 108, -71, 73, 261, -13, 31, 127, -138, -68, 188, -121, 20, 178, 37, 294, 138, -343, -217, 176, -16, 120, -26, 15, 174, 32, -10, -162, -305, 84, -117, -159, -155, 66, 31, -128, -257, -231, -87, -126, -66, 210, 8, -4, -57, -18, -37, 67, -120, 16, -8, -286, -82, -90, 82, 119, -265, 48, 191, -46, -115, -196, 103, -165, 260, -28, -141, -338, 96, 91, -111, -22, -245, -232, 213, 77, 104, -172, -233, -217, -95, 20, 122, -26, 121, 69, 92, -230, -242, 188, 151, 114, 16, 33, -47, -60, -63, 89, -63, -190, -120, 82, 89, -119, -119, 112, 181, -117, 71, 121]
6018A21J49n00K00l34K73L50J02o15M79k92K00k14J51m0N3r0j71J22o6L5K59k17
6040d5L4j73J06r6R3k8L89j47k10L27j54l11L29kp7J19J33M6l22j32J12k5k14
6063b48K13j28K06m3J04Jn2l4j01p5L55o1m8j67K15m3k23J58k12J78l9m4K8L81
6087C21j43l36J07KL0K93k27n0P1J29k56J46Rj68K85m05K92j74L51kl72j26P6
6110a47K14j70K66k07J05J47j23k19K43m3K55k95j71J87j1j56L75m19M20l32j78
6131b59J80O4J11m53K82n2N1O5pJ94j34P2j36J4K67k42n9j87K52M8K3N8k67K77
6155A62k53p9N5J05j79O7r8J56j92L66l20J6K08l75K67J24j79R1K00j49kM7m80
6178d42M87m5O3Q3l1o6j80L2r4L73m02J86j30N11m07L83j98j99j72O11n03K5M62
$$ y = [121, 270, -230, -30, -364, -91, 259, 361, -254, 225, -67, 133, -81, 70, 30, 83, -7, -178, -56, -122, -87, 172, -45, -11, -184, -78, -174, -81, -109, 280, 133, -77, 250, 96, -215, 114, 112, 35, 154, 287, 333, 11, -121, -9, -34, -248, -35, -163, 43, 0, 104, 105, 53, 19, -82, -157, 198, 137, 89, -78, 137, 94, -129, 29, -183, -5, -44, -88, -60, 321, 178, -158, -51, -49, -19, 274, 47, -3, 68, 197, -59, 87, 96, -72, 213, -192, 100, -74, 277, 275, -97, -223, -147, 67, -103, 163, -44, 61, 208, 85, -134, 109, 66, 321, 26, -145, 42, 31, -125, 250, -169, 251, -81, -259, -79, -15, 96, -357, -75, -127, -76, -11, -18, 176, 42, 114, -22, -8, 259, 17, -42, -229, 23, 71, 94, 152, -115, 162, -91, -170, -115, -10, -189, -122, -220, -64, -256, 110, -210, -194, 14, -361, -94, 30, -149, -58, 142, -7, -9, 38, -442, 45, 0, 63, 146, 115, 49, -131, -99, -193, 180, -222, -36, -166, 345, -62, 321, 123, -76, -248, 363, -140, -115, 347]
6201C47k78j61J38j4r7J43l63N57k01r3K12l59P5j35K65JP5j91j29J08Q5J66k47
6224i6J15j42k11K11K60k29N10k29j49%j51L6J72j83L30jj79Pj17M2m8J73k17
6247i6J6J30m7K9j32L85j62j14k76J04K14J65l41Pr3J11L5j60L16m3J49l41K65
6270A21n6lk73O6L70l30J94J16j00k18N42n14K54k87j7K4J11O3o9m3l9M0J70l34
6294b12L44O5j06l8j96J25J74qk60Q3q9k22L11k03L02J01r1k62J47l0J79Q4k49
6317e1k4J02j77j6PP2K2j07K51p9K1J75n4R6k30k49L02j66L23m84J60K6L04k88
6341f4Q3j4k62J34Q0l1J59l91L07j49K61K52m36J08n7j14K78j09k07o2L42M2m08
6364b58J17j32J33M69m52J14M28n41J83j10q3N5J65J0j08J74k66M05o07M69l40
$$ y = [347, 69, -92, 46, 32, -65, 78, -285, 272, 71, -22, 190, -169, -94, -229, 36, 37, 112, -79, -208, -100, -15, 151, -96, 19, -123, -334, -123, 137, -92, 418, 189, 40, 40, -111, -75, 97, -86, 244, 243, 64, 71, -46, -4, -52, 121, -96, -80, 50, 3, 32, -100, 285, 123, 9, -267, -163, 51, 216, -125, -118, -211, -100, -65, -225, 91, 48, 197, -144, 121, 65, 62, -211, -145, 225, -105, 89, 205, 105, -113, 429, -85, 169, -118, -135, -111, 0, 63, -6, -49, -88, -48, 122, -212, 132, 197, 91, 53, -143, -18, 156, 148, -112, -29, -118, -340, -29, -232, 70, 171, 80, -182, -35, -65, 114, 198, -51, -75, 27, -150, -166, -159, -87, -65, -172, 79, 0, 21, 196, 142, 238, 8, -241, 61, -105, 218, -266, -106, -80, 224, -64, 19, 5, -257, -123, -43, -74, 85, -306, 1, -148, 113, 365, -71, 37, -20, -134, 144, 35, -172, -234, 108, 150, -258, -141, -273, -140, 329, -123, -9, 419, -122, 61, -49, -132, -77, 88, 98, -10, 164, -102, 303, -304, 165, -175]
6385a75K43N3Jk40Q2O6k96J50O2K49k94k25J86J15J8q6k9K11q8k54J86L91l32
6408fk61l5K91L41l83j10J60J6J8j5J5l17J4L63j97L2l5K49K3k33O8k85K23l9
6432a03l8M3K16r0k10K49j33K19p5P2l88M59O2j69j79J01k63O32m96J80j26J39
6454A02j04j39K85m4N1m20M20N0j37j54R1o9r9J22J61q5J28r3J15k02K8l6K80
6477B51l12K23l12L03J33l10j71m5K40Nj46L2j88K39J28K59l89k22Q6K57J4j76
6499a01j00M42j7l13J41k73R7L51l15J51O9N2k12m4K13k57K40l73J30J49Q3J78
6521B91k01j58o4J17k44K63k53P2K47O0j5k78Q4P7K0Q2l20J79J26k36J03l8J44
6544E8k79J22m9J62k70J51J48q9j4k08L0L57J08k22j93Q4J58N7m47L26L2k44J41
$$ y = [-175, 68, 121, 122, -118, -36, 30, -266, -116, -54, 195, -99, -324, -138, -23, -5, -91, -120, 91, 3, -251, -65, 326, -6, -267, -302, -11, 330, -53, -163, -3, 13, 31, 16, 31, -286, -272, 91, -106, -74, -109, 140, 163, -70, -2, -287, -64, -103, -141, -98, 118, 28, -182, 67, -66, 153, 78, 150, -238, 221, 283, 114, -65, 36, -227, 405, -91, 89, -37, 102, -2, -141, 144, 100, 151, -269, 151, 201, 64, -90, 1, -68, -167, -45, 116, 31, 159, 66, 181, -21, 7, -29, 251, -61, 162, -150, 153, 286, -24, -195, -240, 0, 5, -141, -109, -297, -58, 70, 329, -60, -282, -196, 61, 75, -101, -201, 241, 224, -89, 52, -221, -124, 227, -88, 63, 132, 184, -28, -72, 141, -116, 124, -249, -119, 30, 113, 291, 90, -68, -132, -15, -259, 4, -249, -177, 70, 130, 115, -163, -79, -2, 18, 100, -220, -41, 85, -151, -48, -86, 58, -221, -99, -148, 14, -256, -105, 43, -46, -60, -268, -238, 119, 227, 5, -188, -104, 54, 111, -336, -10, 22, -222, -81]
6567h1p4K20N7j17j19J44o1j01J24k29J48m5J40L10l71P9O1K17j43k75P4O3j00
6590g9O7j54K03j38M6LO7k39L06j6k23K45j6j46J17J86m24J96Q5K47l36j79K3
6613a59K01k17K43k84L17Nj71J06K63m18J03o6O5p2K82j57Q1j76k06J21o6M89
6635B84m01L71R7m74J17Q7J9j17nq7K52k4j93k1N42n65O85m07j56p9j0N0j82P3
6659a44o9L66j85j33L65K6j77j9l19L32l48L50j8J31k79K5J25k8K01k66J01m6
6681ij90J33J44k55J44k55J50J06R0l35K16P7m9ln0L63j10k88M9L66k67k65J98
6704d0j36J82J74r6j32j14L75j46q5j0q0J52k26K13Q2k00oK3j05L20l35L76j18
6727F8J82l10K82j87QL55k41l59K85k62p3L68j19J12k10J20K13J60k19l86M12
$$ y = [-81, -155, 65, 122, 5, -114, 30, -31, -132, -8, -237, -89, -134, 6, 316, -55, 24, 85, 302, 159, -116, -42, 21, -79, -12, -166, 37, -101, -55, -52, 15, -224, 82, 66, -157, 88, 72, -74, 43, 229, -195, 1, 86, 333, -3, -182, -159, 42, -175, 68, -216, 101, 106, -65, 41, 304, -114, -11, -77, -12, -84, 198, 41, 122, -54, -260, -139, -205, 284, -117, 254, 351, -123, -6, 81, 100, -17, -22, -109, 143, 119, -74, -95, 447, -118, 567, 160, 4, -75, -85, -35, -217, -144, -213, 153, -32, -165, 200, 226, 49, 30, -289, 43, -305, 45, 27, 158, -121, -96, 29, 1, 202, -64, 37, -9, -199, -66, 78, -177, -33, -288, -138, -32, 58, -277, -61, 16, -33, -36, -86, 277, 167, -121, -72, 294, 27, -238, -40, -176, 6, 180, 84, -48, -162, 213, 67, -18, -28, -108, 44, -182, 31, 113, -87, -93, -70, -175, 145, -190, 186, 68, 250, -60, 222, 35, 43, 398, 157, -202, 83, -179, -252, 116, -3, 109, -101, 19, 232, 392, 173, -213, 199]
6748A99k70O8j42o4L09k35J78Nr5K64j89l4k58J78J20Q9K1l95L42j64q8J67j44
6771a38K20j57M7O8q4L67l05k5k88L28R1r2j7K22k50q3L22l28K15k44L6j25M79
6794B59j13l86K49j58K22n5j71L45l87l8J95O8j08L7K37j72o3j76N10l09n0R9
6816C5J51k58M07j42j3j18k49J04jQ0J38r4j61J77J4p4j30J93l69J52J83k37K24
6839A2Q8l29J22J43n3N5n8j20K15k77J03J06J13j25J44j18p1q4K97j27j07j36
6861b07L15k89K42Lm93M48j33K79o4j91P3Kj5l2L67k88n5J16m22K93J67l04J30
6884e8P8J79k05l9k59O04m13N0m4L64m21K77J72m50L7l48K80K24r4j6l06K96J07
6907A5k65K88Oj09j1N5N1J15l4k2p9P0j83Q6J31l52K63r0K38J6mk20p7J09j18
$$ y = [199, -71, -3, -145, -209, 100, -135, 43, 48, -47, 217, 28, -6, -264, -86, 34, 123, 144, -251, 91, -73, -161, 6, -138, 82, -75, -28, 40, -44, 323, 18, -7, -295, 33, 124, 32, 15, 237, -13, -96, 226, -102, 113, -131, -95, -220, 259, 146, -240, 9, -149, 73, 18, -153, 192, -195, -233, -38, 30, -78, -41, 196, 24, -39, -215, 295, -14, -64, 35, 186, -72, 335, 193, 180, 62, -187, -83, -84, -4, 134, 40, -121, 56, 70, -4, -134, 59, -310, -158, 25, -212, 12, 100, -229, -107, 36, -17, 38, -20, -140, 75, -202, -99, 7, 120, -5, 139, 21, -50, -134, 163, 36, -71, -207, 108, -181, 61, 64, -429, 19, -114, 165, 101, -90, -17, -15, -30, -62, 305, 17, -38, 78, -344, -51, 116, -188, -58, 20, 199, -6, -45, -304, 300, -113, -63, -107, 257, -164, 113, 285, -165, -128, -476, -196, 28, -66, -82, -388, -92, 15, -250, 38, 44, -65, -76, -21, 30, 145, 111, 89, 10, 80, -103, -17, 114, -238, 25, -65, 173, 189, 185, -35, -112, -3, -121]
6932a21L59r5l0k73J73P1rk06K05J35n71K83o1J15j23K94k37O7M9o91O39j18K15
6955G0o22O49k93L01j94r0M14j17j4k16j16J58j81J1Q1k8K30J51j24k52J37J63
6977A18J57l55J55J01j82MJ27J74k05j12L5l0k27M68k82K88k53nJ54j77J32%j03
7000a8k48N20k38l5mJ8n6M57k20n55L24pJ42j42k1l9j18K46p2K46J35N5l52Nk34
7025b11J8K79J2l09L81m02R7K69J29l54OL11k96J03q1K09l57M00m36L01n8l68
7047c57K95J57j21M9j42J7l10L22k4k34L76K35l85K55l87J98L03k09l9N2q3kK99
7070B65k37p3J16o0m1J10kk97K99J04k62j06Q4K83j70Jr6j7L32p4k96K26k67J99
7094B1L8J2J07j80o6RJ80jlN2j37k70J83J59j11J17j82L44n32K71J77m89J15J58
$$ y = [-121, 238, 143, 113, -160, 13, 84, 75, -131, 74, 209, -362, -79, -140, -25, -148, 146, -91, -24, 25, -666, -27, -145, 70, -552, 97, -196, 105, -89, -179, 235, 118, 104, -112, -228, -70, -251, -240, -159, -187, 43, 194, 70, -182, -45, 118, 275, -80, 75, 176, -6, -2, 125, 299, 94, -18, 17, -13, -240, 228, -54, 234, -19, -24, 130, -47, 85, 85, -18, -266, 254, 16, -19, -23, -5, -61, 396, 176, -379, -55, -62, 80, -62, -83, -122, -240, 6, -66, 180, 315, 370, 18, 23, -211, -193, 86, 98, -211, 170, -232, -135, 134, 263, -91, -85, 226, -70, 33, -48, 161, -196, 204, -232, 69, 11, -357, -62, 95, -26, 23, -119, -102, -412, -90, -114, -348, 28, 263, -122, 133, -254, -56, 247, 38, -1, 51, -32, -34, 265, 28, -45, 71, 11, -30, 80, 78, -219, 80, 184, -78, -184, -100, 183, 13, 14, -82, -99, 233, 159, -137, 89, -178, 21, 59, 71, 178, -2, -68, -59, 121, 120, 117, 169, 32, -238, -55, 104, -7, 110, -72, 272, -260, 11, 188, -301, -186, -28]
7118b8n7J73k39M02k93j45r6K57J59q7K89k40k35lQ3L11k64P8L4K11m29J61M7
7141H9n3R9r9j04J97j71O0O9K7j38j10M9nj37N09l34J9Q5j33j97J30J28l27L06
7165d1j28K40N0K46k80J10j24j10Q1q4L17k14J74n51K92J91k70M79l47j30L77
7186B78m41O9k01L82p1l6k7K92p6j77Ql4J68O5j13j47L16j89P7k59L28p7k02J15
7210D8K21k19J66l73Q4J33J60k67R2r5k4O5Q7J65k81l37K68P5J06J8J9l48J59
7233g8J00J69j34j22K13J56j02J34l32k82k8K21O2J99o6k74Q0l1J41j00q5J00
7255e9K33j93j12K08m1l94N48l11N3j05j5J70k89K41L46j79j81J71k64J77K43
7276B47j16k30Q3j96R0r5K33j36K99p0M16l24m92L51m19M90j64J99j60j69J94
$$ y = [-28, -85, 88, -151, 251, -42, -187, -283, -26, 133, 46, 335, 95, -140, -143, -60, 251, -13, 65, 99, 310, -119, 42, 89, 36, 135, 36, -68, 129, -42, 18, 87, 114, -24, -134, -85, -90, -227, 282, -52, -33, 52, -81, -278, -148, -20, -347, -41, -169, 71, 121, 367, 87, 197, 73, -37, 44, -40, 277, 63, 237, -314, -22, 169, -101, 378, 31, -99, 278, -163, -94, -295, 87, 16, -20, -47, 245, 169, -8, 0, -34, 134, 199, 86, -61, 255, 66, 143, -116, 212, 135, -67, 48, 269, 50, 216, -157, -73, 60, 220, -47, 45, -50, -74, -9, 78, 243, -38, -375, -107, -32, 74, 92, 111, -237, -78, 22, 191, 57, -65, 148, 304, 202, 336, 4, -278, -306, -85, -23, 176, 110, -164, -84, -115, 26, -74, -159, -59, 174, -19, -131, 77, 36, -358, 190, -121, -68, -173, -188, -18, -307, -66, 280, 101, -80, 91, -173, 4, 247, 131, -99, -16, -212, -122, -217, 16, -120, 179, 109, 525, 201, -291, 60, -359, 131, -33, 166, 6, -163, 31]
7297C1l5m82N15j60k05K42K36J26j53R9l20L67j85j72K25n9l7K0o1m4l2K0L66
7320C02j47l53k3K77K7Q6k89Q1j21J73J5j39M6R3J84l56J83p6Q8k14O8J28jq3
7344e1k08l0L38r7K26k11O5j62K85j57J10J3M2j29J03p2j93j7l7J07O0o6N4j14
7368a41R1p4Mj49L44k07K89m52L27J19j79l9J38L2L6J09k95l46M84j8j64k8N32
7391D13n34K40j48J2O1M8J29q1m3Q8N6j95L2j6N1k11j9O5J85m34M49k62L22l04
7415i6K12k72j64K23q4L74j57J97l21J69j4j92K65j45J31l1j9O3r2L9O3j21l89
7438c61L03M9L3p1j89K55M11m65J46j54K02l38N2L22l92n3L70k15K33N6k48J85
7460A31l55L44j11j56K16J56j95J40j27j03K47j41k14L0L14m42M68o24L57J9R8
$$ y = [31, -4, -486, 29, -131, -336, -94, 142, 268, 115, 214, -106, 261, 76, -96, 129, 70, 33, 53, -8, -52, -84, -64, 302, 155, -198, -221, 56, 83, 169, -120, -39, -160, 13, 28, -111, -65, 28, 212, -144, 39, -37, 51, -163, -95, 33, 32, -51, -259, -289, 49, -48, 178, -33, 32, -130, 155, -2, 108, 121, 163, 34, 137, 65, -128, -145, -182, -75, -15, -81, -27, -141, -50, -124, -120, -269, 75, -132, 157, -295, 32, 151, -28, -67, 71, 103, 139, 248, -47, -393, 91, 73, -91, -119, 413, -121, 119, -29, -17, 44, 92, 221, 140, 97, 185, 241, 46, 78, 62, 113, -98, -117, -52, 133, -301, 148, -114, 208, -96, 116, -156, -320, -97, -181, 193, 36, 233, -88, 81, 67, -125, 140, -5, 126, 95, 76, 139, 47, 86, 149, 28, -361, -58, -9, 24, -47, -236, 19, 430, -35, 111, -43, 159, -179, -127, 195, -197, -250, 120, -95, 138, 194, -54, 131, -224, 120, 9, -147, 69, 225, 30, 170, 43, -60, 187, 46, -168, -138, 176, -266, 202, -422, -65, -46, 52]
7481E2j12J70o2KO2j53j2l8J64j17K3K48k19j90J53L90m65L05k61L98j66j59j16
7504a03O4K61k78K13k82J27p2k7N2j29R1N01k63j95J2J54k63k3MJ10j11L50O4
7527B57j36Pk95J50J1p6J8K78j21j58K6q5K94m8j33J27j96J90j65R6k7l7j05K65
7551A37j47Qj11K19L4k35n3L94k57r8J51k22K81j67nL6J27n2j62J81n5j38OQ2
7575d6O2k38J94rp8J30p6p2j9K98k41M9J07M5j61J63l56L18n4j35K91J79m81q9
7599b19K82k86K20k2L9o7K95l00k4J81k69j38N39j63lk90M05K1j82Q4j3p5kn8
7623d5J53Nj20n5O9j89L13o0M7JK6j74p3N1j37K70ok31J81j91J37q8J62P4o8o0
7649hm46N95j58J32j95J01QRk6N5l42L97l0j96L8l5j16M66k2j84k09k5K88j42
$$ y = [52, -60, 110, 48, 50, 112, -41, -53, -91, 73, -44, -21, 227, 8, -182, -29, 361, -104, 201, -60, 338, 172, 13, -103, -39, 222, -56, 157, -125, 2, -70, -97, -45, -174, -83, 418, 155, -40, -28, 126, -137, -160, -156, -46, -157, 193, 257, 121, 128, -167, -17, -6, -82, -64, 214, 93, -65, -39, -124, 170, 122, -11, 116, -80, 110, -55, 41, 14, -23, -128, 137, -10, -2, -113, 106, 140, -95, -148, 246, -11, -109, 42, -180, 101, -66, -71, -35, 92, 40, -122, 59, 4, -134, -128, -46, 16, -222, -28, -37, -115, 15, -61, -133, -152, 146, -95, -46, 61, 106, -55, 108, -248, 70, 16, -119, 172, 351, -130, -219, 63, -223, -3, -25, 14, -53, 242, -58, -82, 99, -170, -308, 231, 68, 65, -225, 180, 201, 19, 103, 90, 15, 13, -45, 108, 113, -7, -62, 7, -182, 131, 71, 118, 119, 145, -29, -102, -51, -188, 82, 76, -155, 26, -165, -28, -116, 46, 120, 52, -8, -454, 141, -17, 115, -80, 21, 29, 38, 12, 67, -275, 122, 92, -104, -66, -101, -217, 249, 227, 43, -166, -191, 97, -45]
7673d5J64j5J61l60K99on22L71rj0m0K2K42l82J5N70m69j63J48j38J8J79j85Q8
7697f7J37l22L41L1L2k31K60j9l03L78l07J39l18P0K48k21K67q8m8j4n1p2N29
7720C71n58K78m33M34K03j75J07k89M4j10L26k65K57n31M31K55n48K02j74J59
7740a6J49j55k64N2L10j78L83k5l05N0j55M52l74Q7j30Q9j81n9M68k50K8j14J19
7763a9j39k9L34k91J80j19J3K28k05j05L12j30m3K69l37J58k04K16k9j09J09N9
7785A19J52k54j45J25j72j75Q26l64l50K81Q3l78N3M60j12k52k15L29o6J07j14
7806f2J50p8J10j43K9K60m13pM64l21K00j86n9J20k47Q2l0L17l55L89j59Lo5M2
7830D1k88J33M1l1J56k79M69J64k95J95n8m86K07K14j43P9l86L19J4j16J75M36
$$ y = [-45, 119, 104, 265, -95, 204, 198, -324, 47, 38, 28, -12, 10, 252, -130, -115, 455, -14, -177, -29, -167, -149, 30, -155, -67, 70, -252, 89, 120, 152, -79, 181, 162, -141, 237, -70, 69, -249, -179, 69, -152, 115, 27, -21, -35, -86, -158, 371, -187, 91, -342, 92, 295, 120, 227, -62, -18, -128, 198, -67, 190, -341, 90, 345, -203, -1, -175, -16, 133, -22, -286, -234, 76, -102, 281, 256, -49, 1, -154, 298, -76, 11, -119, -30, -211, -270, 198, -52, -24, -138, -19, -158, -187, 147, -144, 36, -83, -70, 158, -47, -152, 160, 30, -13, 256, -81, 77, -127, 89, 60, -49, 60, 119, 271, 17, -128, -3, -175, -350, 476, 112, -238, 43, 126, -252, -199, 261, 149, -103, -318, 11, -55, 52, -62, 88, 10, 120, -23, 6, 266, -147, -154, 310, -11, 189, 3, -56, 64, -183, -101, -131, 186, -169, 220, 61, 64, -1, 41, -247, -114, -73, -104, 52, -227, 242, 406, 111, 306, 248, -238, -31, 183, 40, 119, -267, 52, 66, -50, 125, 561]
7852E61o22l2r5K9K21N5R1l42L10p7m1J00R0N9k63mJ0j88K66j80rK56j88J34j43
7877bj52K88l53N97l73j64L19k67OJ25R3Rk80K83N4k70k59L09K30n8k38k53L83
7900B7j69L44k73K53l64K52k85p4L12L29k50N7j51M7n0J60j70m3K30l15J14r8
7922a17K13mk63L84l37K79l3j24K2L4j4j00L66l07L00j90j80M47k16j44L4P1k6
7945I5k40K63K52m12j7q5J87J36j42k17K85q6K66l60K26r0J02n63L48K8J73m70
7967c21O0L69j35J08j43J07J1n01M24L11j90r2j81j80L90J85j03j62O5k5k05K51
7989D3QQ3m34M80j5j06J21l82M81j00j56k36K87m5o4k14L48l77L70j06j12j5N4
8012h7k08J64J49jk6j63K18j07j3k59K84J96k58j32J00J49k6J36l28J17j8J38
$$ y = [561, -61, -93, -188, -159, 62, 117, 208, -134, 176, 99, 58, 158, 248, 307, 44, 40, 50, -138, 128, -52, -61, 195, 7, 141, -2, -154, 134, -219, 378, 5, -159, 160, -107, -101, 24, 117, 126, -154, 129, 183, -87, -346, -37, 193, 135, -103, -356, 27, -142, 202, -71, 182, -182, 70, -215, -289, 23, 352, 102, 159, 8, 55, 5, 165, -5, -48, 182, -133, -19, -117, 96, 92, -171, 213, -124, 155, 122, -2, 20, 54, 40, -60, 306, -1, 299, 109, -71, 376, 160, 16, 50, 121, 95, -145, 118, 370, -42, -59, -144, 43, 179, 37, -180, 105, 19, 285, -75, 151, 61, 163, -400, -52, -24, 149, -321, -261, 108, -27, 81, -62, 45, 56, -445, -21, 290, 100, 8, -173, -353, 37, 222, 119, -43, 22, -3, -208, 43, 51, 134, -300, 180, 165, 59, 180, -202, 279, 179, 23, -213, 74, 29, -35, -249, 99, -278, 92, -14, -126, -141, -87, -295, -131, 18, 17, -9, -172, 46, -61, -74, -333, -49, 147, -111, -243, -143, 6, -20, 116, -212, -95, -113, 25]
8034B5m8R9j06k12K65M6j65K2K76m02L06m36M77k38J2K19j40J05j97J30J64J8
8056B20k0j51j61N21l14k0k5q3K46m52K33l07m5M62K1k29R2J72m40M96l01k47
8078c32M41j64L33l48Q4P1k19J08K63l59M40l88K93k57r8Q2m0R5L2m7l0J09j81
8101a12pM5K48j60R2M7J31m02L5n4M35k65r1J47K39k75l8n0M4k62M32k70M3J78
8125A30o2O1k06l2R5J69n06O10p0m49M10j93k53K14R6p5j98L6J18mK09q6l33L15
8149dn8L17j44k01R7Jj09L62J1j62j54J26Q6l86M45J31o30L43N7j13n1K03j64
8172Ck52K57J72k06j17L28l92M26j88J68m40J06Q8O0J95l30J75J4K04
$$ y = [25, -23, 76, -30, -242, 23, 69, -96, -74, 202, -200, 106, -330, 147, -91, -79, 140, 0, 105, -92, 38, 202, 220, 200, 49, -112, 409, 95, 75, 50, -33, 213, -239, -6, -313, -358, 104, 125, -104, -12, 160, -280, 216, -85, -332, 109, -55, 278, -70, 14, 85, -134, -26, 237, -122, 318, -70, 223, -34, -132, -50, -90, 5, 37, -10, -40, 69, -112, -119, -74, 174, 14, 106, 153, 284, -118, -83, -137, 298, 33, -58, 89, 328, 53, 15, -35, 9, -253, 179, -91, -48, 130, 68, 129, -77, -109, -14, 155, -351, 259, 189, -260, 150, -43, -296, -82, 14, -61, -259, -223, -105, -109, 100, 14, -319, -4, -62, 255, 111, -90, 7, 8, -101, 261, 272, 110, -44, 82, 168, -218, 227, 358, -272, 71, 128, 15, -36, 167, 3, -249, 8, 180, -26, -143, 185, -207, 219, 31, 199, -241, -135, -47, 13, 208, -122, 53, 67, 271]
8191B71
$$ Imaginary data points
##PAGE= N=2
##DATA TABLE= (X++(I..I)), XYDATA
0@%%%%%%%%%%%%Nj3J6j6J6j7K3l0L3l8M6n2N9o9P7q7J01j16J31j46J63j82K03
35A07k26K52k82L14l47L83m23M68n18N75o39P08p88Q79r83J109j257J436j664
54h96J956k346K907l784N358r071L5625J9118n7356k7394J6540M5421P561k9233
68D406k9282J2061K8345Q075k3503j7111J1882K3523k304k4375j1893K2605K4887
81B7316r156l4759j3093K7590L4498l931l7707k5174K0108L7882Q555l0956k8222
94b7049R371L2388J1071k2646k3447P771K5215N908k0237j6095J2440K2912j371
107A6231k5605j4257J9451K9369j011l3353k2283J8885L6613O303l1894k7847
119b9398J2116L4507J0467k5320k5231P730K7851R349j9526j9515P359K1553M222
$$ y = [0, 0, 0, 0, 0, 0, 0, 0, 0, 0, 0, 0, 0, 5, -8, 8, -8, 8, -9, 14, -16, 17, -21, 25, -27, 32, -37, 40, -47, 54, -62, 69, -77, 86, -96, 107, -119, 133, -149, 165, -182, 201, -222, 246, -272, 303, -336, 372, -416, 463, -520, 589, -668, 768, -896, 1060, -1286, 1621, -2163, 3195, -5876, 29749, 48867, -8489, -35883, -19343, 26078, 33639, 4406, -24876, -12815, 15530, 23605, 102, -17009, -5127, 18396, 16092, -8283, -20176, 2429, 27316, 18160, -16599, -29692, -2102, 32396, 28465, -9242, -34416, -14308, 23574, 32129, 1173, -27049, -17678, 14710, 25781, 3135, -20312, -12541, 12674, 18582, -1655, -17750, -5310, 17602, 16231, -9374, -23631, -4180, 25189, 24178, -9175, -31458, -12573, 24040, 30343, -1551, -29398, -17282, 17225, 27692, 2372, -22859, -15129, 12722, 22071, 2545, -16970, -9611, 11942, 16164]
132A6164j9420j4283J3802K3136p82k7063j7331J8075L0689K650k9231k3960J2797
145a4757L2386J0382k4450k6623N031K8687J4026j6827k4077P66K1638J1268j3300
158D150j6406M742J7945L666j7974j3820J1629K3242K904k4045k0236J1854K9237
171A6888R054k4292k6234N896L0354J5173j8691k7164n88K3642J5948j0831k0370
184a1215j189J6412Q777j1701j3859N983J8159M075j8475j6826R432K5379O861
197B1813k1568k3459O493K8510J3487j8424k6713n93K4315J8181j1146k2729m848
210a6681J7050J3414p459j5663j87J5476O759j2686j4904N672K0201P072j7376
223F88j9864N075K4453J1800j6742k4523n10K3854J7975j0752k4215n720J7030
$$ y = [16164, -3256, -17539, -3737, 19399, 18617, -8446, -25777, -7702, 22987, 25637, -3594, -27554, -14757, 17629, 28011, 3561, -23062, -18031, 10656, 24682, 7855, -16222, -15456, 6182, 17450, 4150, -12256, -7514, 10431, 14097, -3877, -17697, -6068, 17174, 20078, -3967, -24203, -12349, 16888, 25942, 1650, -24584, -18688, 11666, 26839, 8148, -19016, -19604, 4038, 19986, 9155, -11215, -12404, 4008, 12785, 1084, -12775, -6792, 11367, 15442, -3033, -19859, -10427, 14952, 21813, 245, -23214, -16721, 11789, 25276, 6852, -19861, -20454, 3861, 22042, 10896, -11833, -16681, 369, 13783, 6324, -9339, -9526, 5950, 12709, 23, -14881, -9209, 10992, 18064, 688, -19176, -14101, 10352, 22152, 5410, -19113, -19623, 4231, 22206, 11454, -12761, -18481, -1451]
236a451J6687n643j7276m742J3092J0414p512j3777P06J5289P534j1748j6338
249a4765K510J9432J0771j4057k1081j7K2386J5653j1575k3560n758J9280J7485
262A6704n894j9182p359J3173J3904m322j4536m259J2288R929o904j4209m61J5475
276D347R317j1091j7222Q38J9033J2187j1413k0931l535J8897J6713o072k0787
289i719q111J3729J6526j792j6199q194J0401J2590k423j2659m042J0096Q941
302I144n868j2799l48J3841R755r144j7191k713J7181J5152o530k0528p844J4471
316c421J7768j437j7668j0095R342J4849L23j2258p401P029R948j863j0450k488
330g822R616Q420o821j3961j374J4937J2689p480j9145n992J4780J6763k040j7995
$$ y = [-1451, 15236, 9593, -7683, -12425, 667, 11081, 3569, -10208, -9502, 5787, 13321, 1573, -14765, -12255, 7177, 17948, 3891, -17190, -17207, 5179, 20832, 9257, -14303, -20061, -781, 16704, 10810, -8372, -15731, -2558, 11346, 7024, -7512, -11771, 517, 10446, 3542, -10667, -11128, 4347, 13664, 2573, -14649, -13811, 5222, 17409, 5996, -14935, -18470, 427, 17140, 11068, -9719, -17830, -4101, 12425, 10633, -5566, -13760, -3359, 9231, 6808, -5851, -9893, 203, 9144, 3276, -9523, -9871, 3970, 13725, 4581, -12610, -15323, 1858, 17010, 10480, -10048, -17892, -3421, 14347, 12910, -4758, -14853, -5511, 9338, 9661, -2597, -9998, -2969, 6979, 5116, -5334, -7822, 1794, 10214, 3393, -10568, -11942, 2995, 15684, 8204, -10941, -16933, -2153, 14610, 12570, -5425]
344e425j0248Q748J6315K380j2882j0058M886J1643J781r074n702O195P867l376
358C050j0477k063J1269R633o297j5373m503J2932J5186k666j7157r973R808J6387
372I756K466j4120j1495N331J3368L804r426q005L308Q657O41q016l714O977P811
387G343l513j1526l688J0865J1828l212j4993p517R982J4727J56j3667r980N950
401g245J3935L709j0067j0232K821R901L929o716o397L344P095k81p697m088P299
416f90Q454k321j0818n528Q184J1916l64j2552q879O451J3749L468j1197j1272
430a1399K914J2130N881p744q960J090Q014K857n677m827L571O764r85p725l808
445g904O647Q875j088j1362o546P335J2213J519j1562j0013M369J2629N404q114
$$ y = [-5425, -15673, -6925, 9390, 11770, -1112, -11170, -6284, 5359, 7140, -1934, -7636, -1441, 6426, 3050, -7427, -9490, 1779, 11412, 5115, -10258, -14761, -1829, 13357, 10691, -6466, -16439, -6631, 9756, 12222, -1898, -13393, -8062, 5306, 9110, -316, -8321, -5013, 3644, 4285, -3731, -7445, -468, 7343, 3830, -7696, -11384, -519, 11309, 8097, -6896, -14413, -4431, 10296, 10452, -3215, -13195, -7245, 6690, 10399, 332, -9900, -7079, 2822, 6751, 35, -6362, -3018, 4077, 3796, -3901, -7989, -690, 7764, 5443, -5375, -10903, -2719, 9197, 8833, -3719, -12598, -6147, 7602, 11070, -127, -11399, -8485, 3645, 9526, 1782, -7178, -6088, 1926, 4783, -894, -5721, -2150, 4614, 3629, -4096, -7904, -1257, 7618, 6530, -4832, -11378, -4043, 8170, 9689, -1873, -11886, -7517, 5112, 10516, 2402]
459B402j0003m40Q659N122l299o197jM790J148l790l299M381N541j503q017l843
475h349O368R855j67j0354q754M804J2688M541q379j1226l67R870P537l618q442
490c993k141N455M459k509m281Q56M364N18n428l021M685P248j029q750n810N391
506c986J0592K723q667j0077J245J0257O387m443q975k185O137N286j460m889
520b055j356L182J835k019k493J599M392j56n613l918M081P687J614p827p700
535h747K620R256M823n254q766j551O819O259j518o589l089L877M569r32l397
550a620q64K728J301k938k363K385M616L91n796m680K935P837L055n996p906J56
566f759P625N691k455p955k787N147N691n87m831k634K376K755j28j738k81J668
$$ y = [2402, -7601, -8041, 618, 5740, 2441, -3756, -3757, 1033, 2181, -1609, -4908, -527, 5014, 3511, -4506, -8349, -1981, 7874, 7707, -2647, -11401, -6597, 6091, 10632, 2253, -8973, -9340, 530, 8067, 4449, -3993, -6134, -679, 3780, 1271, -3010, -2154, 2210, 2728, -2700, -5721, -1036, 6212, 5183, -3567, -9377, -3986, 6606, 9329, 662, -9415, -8170, 2087, 8474, 4031, -4944, -7129, -992, 4294, 2834, -2055, -3411, -229, 1606, -413, -2906, -1307, 3085, 2929, -2684, -6602, -2521, 5166, 6780, -1047, -8747, -6127, 3129, 7952, 2698, -6068, -7619, -800, 5459, 3941, -2648, -5737, -1860, 2709, 1777, -1620, -2484, 244, 1545, -1393, -3756, -1371, 3245, 3636, -2160, -6840, -3905, 3932, 6987, 991, -6915, -6759, 866, 6557, 4102, -3853, -6640, -1493, 4198, 3611, -1220, -3854, -1478, 1277, 1149, -589, -870, 798]
582G98O56k690k235K014N249J299n538n542J241P385M435m007p680j827O148N921
598E627o61o209l714K274M815J593k679k250N4J377m15r08J580K192l3m026l217
615d600K333N888K009m238o154r31O210N661j582o854m006L295O361J455l832
630A015m185K02K507J441j82k29Qn07j810j143K073M023Q34m462m431P09N720
647A583M442l228o494k221M163N540J302m993m016L33L772K415q02j943r20L3
663a034M3L43J325J754q04k800k592J629M300J968k575n015j372M690M571m25
679D006m548l802J852M474J729j912l090r66J605J591P4m32n1l11j053q64J383
696c15K465M76k433l130L54L996K792j800m334k229K796M479Q73l342l512n5L185
$$ y = [798, 1454, -1236, -3471, -1457, 3792, 5091, -447, -5989, -4748, 2637, 7072, 3065, -4615, -6442, -294, 5627, 4966, -1243, -4957, -2683, 2132, 3725, 1046, -1204, -1150, 227, -188, -1096, 484, 2676, 2643, -1383, -4600, -2267, 3621, 5630, 1392, -4762, -5693, 517, 6178, 4596, -2258, -6264, -2969, 3392, 4847, 1015, -3170, -2968, -461, 980, 798, 569, 577, 70, -1740, -2883, -810, 3213, 4047, -415, -4846, -4137, 1583, 6025, 2797, -3697, -5918, -1755, 3785, 5087, 94, -3922, -3589, 183, 2598, 1796, -147, -1067, -1034, -991, -648, 677, 2431, 1627, -1173, -3765, -2136, 2164, 4132, 1557, -3458, -4830, -140, 4431, 4006, -542, -4344, -2492, 1982, 3711, 1799, -1291, -2257, -652, 939, 1013, 581, 530, 219, -834, -1698, -315, 2150, 2626, 193, -2937, -2583, 1413, 4205, 2405, -1929, -4158, -1362, 3117, 3990, 648, -2864, -2919, 266]
713B66K275m00k629j075P52N75R04N50j46o52j461q59J439K548P90k465l253m3
731b884L134L755n78m186l014J387L525K723j590l312j673J639K162J040p29j714
747c15q40oJ064J105J585j047k619j973J438L561J930k113l970j607K396M074
763B663J462k616l907j059K767L226M89k339k047m90J494J750N66m10j739j592
779a782k5K338K372j40k331k989k66K834L196Q6l443k829K92L397K299l66k869
796b26k151M82K360J733j40j944j664l72J611J546J058r62k411j413R09K498K043
813B957j144k850j812J417L119J050j309l252q52J564K638Q63j459k278n88J106
829h30J618J112o27j538j425j08K010J774j03j732k096J00J793J958K40k081k362
$$ y = [266, 2541, 2141, -488, -1563, -811, -236, 668, 1218, 1072, 420, -1041, -1900, -461, 2087, 2877, 412, -2841, -2884, 250, 4005, 3427, -759, -3773, -2386, 1139, 3862, 2272, -1040, -2713, -1074, 1088, 2128, 1399, -315, -1155, -1161, -97, 1008, 2593, 1546, -1073, -3046, -1608, 1953, 3883, 1770, -2200, -3807, -1411, 2663, 4125, 1509, -2398, -3457, -690, 2536, 3025, 686, -1361, -1851, -357, 1393, 1959, 1549, -190, -1782, -1807, 531, 2903, 2763, 432, -2557, -2823, 11, 3207, 3293, -150, -2979, -2687, 710, 3009, 2643, -226, -2377, -1895, 465, 2198, 2058, 114, -1550, -1922, -311, 1235, 2293, 1331, -1080, -2493, -1584, 914, 2957, 1813, -1037, -2849, -1432, 1687, 2737, 1428, -1824, -2676, -1112, 1526, 2389, 930, -1348, -1936, -830, 788, 1900, 1273, -265, -1690, -1798, 212, 1986, 1883, 151, -1945, -1845, -52, 1906, 2146, 65, -2297]
846b297J18K578K123p51k479j347P00K232J176n29j359j916K43J630J605M0j026
863G41j841m42R75K463N87j602k094j037J880K384M97j774k261n17J578K474O67
880B678j858k281q06J909K009P62j314k098j039R36K086J579r40k128j683N76
896a612K346J866n10k437j878M58K680K054q46k382k169O89K053K106L9k236k121
913a900j31J532K413Pj547k096n00J662J881Q49j349k131j032J648K414J048j737
930A031k443q58J339K404Q90j074k394j266J309J897J368p13k134j108M07J835
946D90J596m35k133j737P47J992J410K2k197j527J88J854J562n3j356k086m71
963b134J735K186K41j416j831k97J273J592P10j713j819J2J028J906M19j108k115
$$ y = [-2297, -2179, 399, 2522, 1771, -708, -2055, -1355, 877, 2053, 1524, 165, -1751, -1508, 122, 1727, 1767, 741, -1100, -1542, -567, 1896, 2483, 881, -1213, -2250, -370, 2014, 2511, 737, -1524, -2041, -463, 2011, 2678, 820, -1461, -2267, -358, 1651, 2413, 1099, -999, -2038, -1102, 984, 2563, 1623, -505, -2188, -1612, 734, 2600, 2090, -347, -2225, -1767, 913, 2967, 2121, -261, -2430, -1741, 312, 2418, 2457, 221, -1900, -2031, -499, 1914, 1921, 374, -1722, -2222, -560, 1321, 2170, 821, -1310, -2342, -694, 1720, 2768, 1031, -1412, -2270, -931, 1473, 2363, 1289, -1105, -2371, -1062, 835, 2203, 1490, -644, -1752, -1345, 490, 2086, 1651, -482, -2219, -1472, 520, 1930, 1952, -245, -1772, -1584, 270, 1832, 1779, 423, -1663, -2134, -399, 1787, 2028, 612, -1219, -1516, -243, 1349, 2059, 346, -1473, -1461, -433, 1473, 1892, 784, -1331]
980a331m76J104J788J023j514j789l14J061J607R98j538j231j347J463J319R85
996A808q69j788o02N49J616J412j000j780r27O75J628J121p61j631j113O15J880
1013H33Q77k78j669j668K95K036J236l68j199j697K31J558J565j85j696j518j55
1030a802J722J701J69j492j655n05J653J854L31j525j917o68J705J920L16j491
1046C16j479n72Q33J814J030j040k080n18O39J987J043q17j916j044K37K045J503
1063A981l01k215j537N97J605J698l36j699j439o1J903J671J08k018j617j83K088
1080B45J621o1j701j351o01J586J404N33j272j738p56J704J368P46j158j503n88
1097a522O12K237N57q21k047q03P18K012N85n80j335j308M92J748J073n24j713
$$ y = [-1331, -1807, -703, 1085, 2108, 594, -1195, -1509, -448, 1159, 2157, 619, -612, -1959, -496, 823, 1808, 939, -849, -1451, -902, 714, 2126, 1126, -654, -1581, -906, 722, 1843, 1082, -549, -1662, -1047, 833, 1710, 1432, -237, -1905, -1610, 426, 1662, 1294, 95, -1602, -1371, 187, 1752, 1567, -129, -1647, -1802, -80, 1621, 1790, 298, -1357, -1862, -209, 1645, 1976, 451, -1466, -2134, -429, 1491, 1807, 316, -1163, -1735, -902, 912, 1942, 902, -1178, -1696, -1057, 930, 1973, 1156, -760, -1804, -1567, 478, 1981, 1680, -535, -2072, -1475, 130, 1828, 1492, -207, -1646, -1707, 196, 1867, 1975, -43, -1660, -1843, 245, 1866, 1805, 104, -1247, -1848, -262, 1142, 1675, 403, -1335, -2091, -387, 981, 1727, 569, -934, -1522, -910, 1327, 1884, 1063, -984, -1787, -1069, 943, 1528, 948, -387, -1695, -1203, 545, 1618, 1094, -619]
1114f19j039P60P25J696m09j309j056J23J321J263l06j208j604M67J354J332p5
1131A416j767r19m3J579R46K07j274j227k41J212J471l01o33j624k69J332J404
1148A269M11j476j151n74R84J667K06q40j473n32J018J636M26j169j760l28J380
1165c06J499M75q23j690n77P59J495N62o85j350j216R40J280J292p93j531j352
1182b021O63J987J138m37j923j245L16K011J047j94j657j016j91J874J046j15
1198A283j028j547n28J203J890L15j104j478p09R84J966P45j548j802n70J045
1214h83J825Q88j045j980o16J293J409K91n94j075n10M7J421J063m59j196j593
1231a714M82J334J134L21j961j015J2J715J361o56j112j526M08J383J132l34j140
$$ y = [-619, -1658, -898, -173, 1523, 1114, -195, -1251, -1128, 193, 1456, 1150, -58, -1662, -1195, 159, 1491, 1416, -351, -1270, -1313, 266, 1212, 1419, 145, -1082, -1323, -111, 1360, 1059, 426, -1198, -1467, -135, 1269, 1680, 204, -947, -1521, -537, 1130, 1336, 496, -977, -1509, -491, 1145, 1571, 402, -1358, -1686, -306, 1193, 1668, 845, -845, -1422, -663, 832, 1394, 709, -641, -1857, -917, 363, 1655, 862, -669, -2021, -1358, 629, 1767, 1330, -593, -1838, -1522, 489, 1536, 1342, -315, -1331, -1522, 352, 1398, 1283, 255, -1292, -1820, -617, 1273, 1588, 484, -994, -1703, -719, 1247, 1992, 444, -1358, -1928, -883, 942, 1830, 785, -1195, -1811, -518, 891, 1182, 588, -487, -997, -950, 471, 1534, 1075, -121, -1714, -1232, 102, 1236, 1557, -404, -1419, -1407, 308, 1669, 1013, -99, -1625, -1217, 166, 1298, 964, -176]
1248a76j015P8J081Q30N16j027r98n57Q21J101M87o99j205l65O80J161J030j200
1266E43j318l69O80J627K94q88j804j63J131J150M51r76j053r6J65J044O85l52
1284G51j288o57K38J549M95j33j252j046J62J516J307p51j283j296P61J330R17
1301A320o07j359o31K86J670N41p63o05p61r4P06J394j55p79j175m52J065J472
1319A073L05j096j577l69J414J711j17j268j677K27J304J287j64r30j107j54M79
1336f59J376O62p38j321q89P25J172J078l55j450j253O90J278J212l29j478j572
1353a851P21J520J114k25j753r18K69J479Q58l70p91p83l66Q87R78L41o38r75
1371e03r86R67J538N36o60j943p58J233J624L64p58j574l94J017J114K98n16j345
$$ y = [-176, -1191, -1113, -32, 798, 1314, 287, -711, -1268, -447, 654, 1141, 442, -763, -1128, -448, 713, 1743, 543, -775, -1144, -464, 1163, 1457, 569, -1235, -1398, -267, 883, 1334, 358, -695, -791, -626, 418, 1103, 751, -537, -1194, -956, 593, 1088, 955, -297, -1343, -1181, 335, 1642, 891, -392, -1688, -927, 403, 1320, 713, -646, -1277, -991, 679, 1220, 457, -148, -909, -1003, -297, 1097, 942, 163, -1012, -1464, -399, 1073, 1378, 282, -1295, -1664, -250, 1461, 1344, 76, -1601, -1374, -70, 1217, 1053, 123, -984, -1138, -659, 717, 1379, 641, -680, -1569, -844, 328, 1406, 1051, -399, -1652, -962, 316, 1528, 1199, -279, -1851, -1130, 390, 1504, 1279, -474, -1392, -1123, 356, 1214, 844, 53, -730, -1096, -209, 769, 1110, 472, -503, -1489, -522, 1016, 1552, 892, -1051, -1809, -576, 1048, 1412, 654, -920, -1314, -297, 817, 1115, 599, -746]
1389g46j25K94R48N44o8q03r40K29R62P29O7q68j309J69J065J167l82j223r77
1408a267K10J549Q93q83p37o20P2J241J86j48o86n91J42M85Q85j18m22p73n16
1427a098P92J151J46p17j227p64J544J168j6p62j441K17R87P99K27j249o99j13
1445a055R01O15M68p95q99l46N95P32M46K91j391p12O22P62J313o12j750l72L37
1464h50J485Q83p54j482p68Q54J297N22m15r78p08J64Q36Q52J44j036q85l80J043
1483a76J084K18j022r96n52R17J723j46q73j489k57J390J065O41j379j158k5M40
1501e95J459M5m45j092o41O62J016O05l65j141o35N1J269J139n58q32j368M39
1519i87J306J177o20j342o82L07R26Q92l49n56o98l2L81J256m0p49q63k26P92
$$ y = [-746, -871, -577, 371, 915, 847, 44, -896, -667, 295, 1024, 1091, 223, -1086, -917, 148, 1315, 933, -290, -1267, -1057, 492, 1385, 502, -235, -855, -783, 458, 644, 496, -190, -781, -639, -154, 731, 613, 191, -582, -1098, -306, 845, 991, 274, -953, -1717, -173, 995, 979, 217, -1224, -1007, -20, 779, 1006, -243, -942, -1055, -154, 461, 929, 134, -765, -1111, -516, 216, 662, 953, -438, -1150, -528, 234, 1547, 935, -815, -1187, -850, 635, 1518, 764, -718, -1486, -632, 665, 1187, 772, -206, -914, -750, 86, 938, 1082, 46, -839, -1219, -176, 908, 1126, 104, -892, -1444, -527, 1196, 1050, 177, -1312, -1569, -179, 886, 1527, 148, -1010, -1035, -595, 864, 909, 464, -628, -1269, -607, 409, 1014, 649, -492, -1127, -1076, 193, 1332, 774, -58, -1426, -987, 319, 1496, 876, -466, -1148, -841, 85, 977, 628, 72, -626, -658, -277, 979, 939, 190, -673, -899, -107]
1538a07P14J79l03j201l17R44P45L03q20o44k53N57P73L31o82q59jL69Q83J78
1558G89l52p91j59K28N20N53k72p26o91L53M57J085m40j043q43P67R78N51n54
1577D10q02n95M14P87N37k55r44o78N36J006K90p6j166j10N5M34P53j48n66q13
1597i31k52J116P62J8q78q11p4R23J150k45o26j060j35R21R59o2m09j312o9P87
1617b28O37N68o29j222k01N79O01Q02l28q58r93N27R88Q63l11j201o61L78J276
1636E87N31o49j013o31L65Q48R24j00j039o80P9P57R64l20l10r40m86N37J208
1655F32M34r49j052K56M57J004J06n61j211j16J158O16K32m25q09n73M71O24N34
1674H28j92q80q30M61R28M73l78q26o18P28K78P78k14p44j011N93Q53N55k88r74
$$ y = [-107, 607, 786, 483, -718, -1035, -91, 654, 957, 137, -507, -760, -203, 570, 901, 219, -640, -641, -272, 611, 789, 437, -354, -513, -285, 235, 788, 516, -210, -901, -548, -91, 994, 554, -489, -1332, -565, 413, 964, 410, -392, -987, -573, 214, 751, 496, -448, -1126, -590, 416, 706, 630, -536, -646, -591, -157, 596, 448, -118, -931, -1183, -67, 695, 713, -165, -976, -1050, -127, 1023, 778, 152, -908, -1043, -122, 837, 775, 366, -946, -1015, -228, 409, 977, 348, -874, -1075, -496, 105, 907, 579, -279, -1272, -745, 243, 1106, 795, -406, -1067, -689, 587, 1118, 469, -544, -1175, -810, 38, 962, 862, -177, -857, -778, -21, 943, 623, 313, -627, -1113, -576, 632, 1066, 117, -935, -679, -222, 782, 888, 327, -884, -1000, 158, 774, 1006, 581, -228, -801, -330, 294, 828, 636, -244, -1074, -613, 315, 788, 410, -416, -1034, -306, -28, 750, 536, -208, -1219, -626, 227, 782, 494, -480]
1694d80j99KR25L12j42n91o90L33P03M56k19o81o95K07O00P82P8o61n69o5M91
1715a03P06O8n70o94O9M52M65K22n83n80j16L55P39P23r67q04n9M64N59N63p65
1736A44o29l86M86P87M18k83r87l00M37Q50K57m56p01n33L29O53O92m20q67k59
1756g68l20J338M94k48o54q30J86O59Q33q8o70n92k42Q17O80J73p37q79j55N81
1776d22Q01L40l67q77m32M90J218K72o88q10l68O02M36P12n48l99j021N22P21
1795A82P03n40m52m63N1M97Q65p8q38p99N84P33J02J61r73l95l8R12O06Mq47o99
1817g22k8Q34N42j45m04n70j94O42O48Q0m17n56p13J045M21K61m68p51j5M18P02
1838F10L7l11p08k56N28N63J68l02o19l24L51N03L83k84p53k37K78O87J3K59j092
$$ y = [-480, -679, -677, 248, 560, 418, -173, -863, -530, 173, 629, 410, -271, -966, -759, -159, 623, 701, 40, -529, -594, -103, 603, 671, 101, -593, -524, -72, 393, 615, 32, -548, -664, -309, 430, 1153, 186, -618, -677, -213, 346, 909, 144, -485, -871, -385, 402, 820, 537, -450, -750, -313, 537, 794, 338, -363, -896, -567, 86, 778, 358, -509, -768, -1088, 250, 744, 496, -158, -988, -802, -143, 690, 602, -68, -660, -902, -85, 595, 768, 31, -848, -1003, -422, 379, 719, 352, -525, -957, -467, 751, 1023, 335, -475, -843, -241, 195, 907, 359, -40, -1061, -539, 182, 885, 345, -107, -570, -519, -22, 843, 765, -73, -872, -288, 445, 547, 708, -265, -660, -698, 214, 820, 824, -23, -722, -750, 84, 626, 481, 77, -493, -687, -45, 603, 683, 266, -290, -1003, 42, 463, 724, 256, -495, -510, -92, 610, 647, 336, -372, -628, -100, 463, 631, 329, -290, -614, -263, 240, 623, 339, -414, -651, -373, 314, 327, 586, -506]
1859e06k85O64K90L07m36m15m60L24M16N08q2n15k70j32N88O31k94n74o38L52
1879e27P19K58Lm86p50J58N11R09j94p72k39o37J168N90J45q48p36q5Q31M15J54
1900E87n21o54n15Q89P44M96p51j089K39M36P68K03m82q50k72K74J174L43m54
1919E65q61m33N0R74L06j13p00m24K31N38Q38l99m45p68j09P29R30k00m37r70
1939f98l8N66J021m3p63m96j26M56P43o1l71o55j36r2J338L73m66j017l20M83
1959c02M76K96n4q30j64J34M80N48r6n38m43mN18N79k16o23l97r3Q11L52m9m78
1981i3n27Q0L53M25K61o99l13q6L46P76K4l85m63q1K25N52k86r9l73q1L44M84
2003C84n2k43n51j55N24N15N1l88m24J61L14K77k03k7p36j04M47Q63r5l45o10
$$ y = [-506, -791, -127, 163, 470, 34, -381, -841, -517, -101, 407, 325, -190, -460, -592, -4, 627, 333, -241, -879, -527, 192, 450, 453, -33, -783, -625, -114, 795, 601, -171, -410, -1047, 121, 711, 856, 8, -728, -813, 18, 433, 587, 66, -588, -1103, -214, 530, 1026, 275, -814, -575, -139, 629, 832, 350, -500, -772, -498, 676, 1019, 565, -296, -729, -679, 295, 601, 488, -212, -636, -405, 133, 971, 572, 127, -641, -750, -21, 909, 709, 272, -698, -736, -170, 851, 808, 45, -451, -577, -121, 622, 561, 190, -465, -601, -693, 645, 1018, 552, -465, -785, -302, 174, 470, 416, -414, -578, -444, 36, 584, 488, -50, -493, -497, 21, 600, 384, -239, -636, -729, 82, 434, 385, -93, -620, -540, -187, 238, 499, -200, -513, -599, -253, 523, 547, 162, -301, -382, -157, 395, 109, 10, -363, -444, -100, 384, 332, 89, -462, -617, -93, 422, 473, 85, -339, -178, 136, 413, 210, 183, -553, -657, -210, 653, 558, 213, -397]
2024c97k21M18Q20N7n63l11p24M14R78o8k09n88j83M69J05Q95m16o51n08J97O06
2045A20M77j39n25l84M1N77M82j71o25o81K69P23O26r4q22o13L78N48M07k94j52
2066A48m74K7J37L51L23Q3q03l47L6P12P51m86r54j26Q9R92M61m39j010k27P87
2087C1L64J64j86p19k20N52pL28j68j3m92O3J48N06L32l32o50k51N63O09L41r61
2109Bn72j76R72K79Jp11k02N11j14Q7j9j43j43J4J16mK17L15m11m31j01N48K83
2132C18J1n70q15N36R52L10m54p48k27Q06K37R5o88j32k26N91K67k95j50J03J08
2153B9l80R9N74J24k57r25Q7P50N70q4p37m60j27J306K85p22n70o03O87P03j26
2174B23j46l29o4M82j05j7J50N0r9o01J57M84N16l65n63p85O09P29O70r40n59
$$ y = [-397, -618, -200, 620, 677, 114, -197, -921, -507, 471, 403, 194, -394, -577, -108, -3, 892, 476, -175, -683, -486, 120, 597, 458, -67, -451, -410, 167, 649, 478, -147, -828, -559, 164, 790, 696, -126, -739, -361, 187, 594, 300, 148, -326, -299, -162, 189, 512, 595, -208, -555, -519, 193, 944, 458, -496, -622, -533, 459, 920, 481, -529, -756, 31, 395, 559, 373, -346, -566, -14, -21, 307, 139, 126, -366, -303, -155, 351, 683, 351, -299, -550, 13, 622, 963, 2, -570, -746, 226, 505, 506, -205, -407, 104, -10, 77, 58, -85, -228, -214, -98, -102, 115, 430, 19, -412, -513, 35, 318, 329, -241, -1056, -520, 432, 742, 288, -460, -687, 119, 356, 451, -237, -369, -595, -4, 263, -32, -182, -79, 29, -351, -252, 322, 446, 189, -736, -649, 101, 671, 587, -150, -610, -737, 569, 854, 132, -438, -1041, -354, 349, 223, 77, -252, -316, 166, 61, 44, 194, 244, 145, -456, -299, 185, 701, 336, -227, -1012, -403, 326, 996, 56, -503]
2195e03j66O78N99j85o74k58%J85O37M35m83k43l99J11L05J20N62l61o47l63L45
2216c05R18L52q16r72n6Q14P21j13r17m24N96O04P9l97k39k12N02m5r9PK70J80
2238D48p66k04O97M53M6r95o59M38J108J17l83q53n04J032P05l02m82j94O9M91
2258B62n2k24n0k79L82k95pM13K4On20m00N11Q14L82p14r53J9R29O17n80n88n10
2281h13L41J015J3k99n81ML52L67l63l19L68J52m09k30L74L27M48j079l34K10
2301d56Q75R8l36q45q1P63J082m17j086k54L21O64J86k08m91j47L53K3l19J97
2321g8L48R1p38k84J91R69M16q60j063K01R85N03R2j317q39R96Q61L93r84n62
2341f79M75K58J20q5o7p5J72j09m80L6Q18M69q19r44q8J201R02o40j071k20Q54
$$ y = [-503, -669, 9, 608, 423, -251, -509, -509, -324, 313, 748, 265, 22, -377, -266, 39, 159, 721, 360, -287, -650, -305, 613, 965, 149, -823, -879, -65, 656, 543, -374, -798, -202, 402, 481, 84, -155, -367, 135, 90, -9, -2, 268, 448, -318, -522, 175, 628, 674, -321, -980, -542, 566, 683, 300, -553, -1057, -25, 680, 378, -104, -298, -229, 262, 210, -14, -64, -343, 39, -256, -263, 150, 174, 180, -340, -740, -229, 585, 967, 253, -700, -681, 248, 865, 285, -303, -813, -472, 543, 556, 257, -324, -320, 32, 399, 36, -283, 85, 237, -172, -402, -28, 299, 747, -332, -666, -456, 419, 517, 181, -664, -745, 18, 1100, 683, -403, -657, -336, 328, 514, 306, -185, -332, 21, 44, -275, -78, 270, 361, -377, -661, -470, 499, 915, 55, -1008, -807, 178, 681, 773, -544, -1383, -387, 474, 867, -117, -679, -204, 54, 174, 89, 22, -53, 119, 10, -470, -434, 384, 853, 34, -910, -998, 203, 1105, 465, -606, -826, 28]
2362B8P48M2o64q77L78R23J2k52m25j8J63J39p3k06M86J46m31o26k38R00O82M0
2384H77j322m93P46J142k13j213q40J137R35o9l30j026L12N70j91k14r9J51L33
2403A93o1k71k16M08O70l96r60J12N74Q57k08j194m65Q54Q32k7p84p19K99P85
2423B83J22k79o63K5P95L8m50k63k1O46k44k21l95R35M72k81r90o18J134R94l86
2444F33r41q27Q25Q83K57q83n06l31R31Q25p81n52L3N41Kl31k67L99N65j26o42
2465b93m39M04J166J24j297n26L30J346M87j221j207K82J094O19r0j615R7J020
2483B81K32l43n57L88J95lo48J03P42K77k03j014l80P81R74K16j320q04N73J018
2503E08K91n69q17j85Q02O33k64o81J77k72P95m13j49N2O51k22o17p16P52R89
$$ y = [28, 776, 818, 154, -723, -345, 578, 590, 338, -87, -105, 58, 197, 124, -82, 404, 550, 119, -507, -745, 155, 837, 877, -445, -938, -192, 950, 737, -476, -1316, -179, 756, 687, 357, -669, -357, 213, 22, -192, -291, -140, 193, 132, -139, -355, 53, 723, 327, -633, -521, 53, 910, 702, -492, -957, -103, 729, 702, -82, -801, -502, 283, 405, 126, -537, -512, 283, 321, -129, -392, -413, 233, -11, -232, -627, 308, 780, 499, -491, -1109, 25, 1019, 633, -308, -1135, -310, 573, 830, -53, -559, -890, 41, 866, 85, -467, -434, 107, 109, -222, -489, -90, 475, 349, -293, -732, -328, 838, 962, -335, -861, -531, 815, 1302, 81, -1126, -844, 250, 869, 779, -836, -739, 281, 513, 170, -387, 1, 196, 193, -455, -352, 390, 667, 464, -550, -930, -149, 825, 1041, -279, -1083, -510, 508, 799, 230, -587, -772, 30, 663, 399, -282, -105, -377, 418, 5, -144, -92, 559, 337, -280, -996, -244, 745]
2523G45J75j273p46N09J058N04m97j252j94J196P83n66p83l4M82L52n04l25mN58
2543A84L60q79j84K47R09J5p18q74M85R70M71r82j040Q5J145J010r73q29k58J031
2563A75M25j03r35j50N53O11o28p39M28Q23j98l38n97L62R08j19n46q16M72J015
2583F03N71j083j175P0J135Q72o76q94j01K74J046k76p93P8J66L01l26k78L88
2602i8N41p2k59l27l07J166L57j069r92M57R08Q66r11q95k06Q68Q71m44q70l40
2622g56P09O25j21m56j14J57N23n16n63J36Q77p0m11o70Q3J082M49n69j151l84
2642a140J129J023l95j160j94J40J487k95p64k12J76L52J51n03q4P87r3n03r13
2661a011O91Q73M23p45j165K3J082Q01k61j212n76P42R26k2n28p35N55N47j77
$$ y = [745, 920, -353, -1099, -590, 468, 972, 475, -777, -971, 225, 1008, 442, -341, -375, 107, 459, -45, -370, -374, 184, 544, -335, -519, -272, 637, 652, -66, -940, -455, 515, 986, 4, -1036, -951, 194, 1204, 231, -598, -856, 175, 600, 497, -438, -588, -35, 576, -52, -791, -363, 460, 262, -76, -673, -311, 597, 478, -68, -884, -412, 603, 1174, 91, -1084, -1014, 121, 993, 317, -577, -678, -404, 642, 366, -427, -349, -183, 118, -208, -486, -98, 443, 371, 112, -215, -522, 644, 1001, -68, -1060, -603, 305, 1171, 260, -635, -841, 27, 898, 454, -416, -756, -47, 578, 457, 1, -113, 44, 567, 51, -512, -376, 501, 431, 20, -650, -567, 515, 964, 395, -756, -1140, -11, 1012, 617, -543, -737, -597, 890, 595, -169, -381, -205, 147, 298, -205, -289, 498, 405, -98, -1011, -320, 553, 976, 231, -934, -911, 171, 972, 711, -501, -1077, -335, 591, 569, 41, -694, -139, 408, 231]
2680B31k17k51K56K18R4q68J56O85N33n43j067j02R98P13j89j373MO35P27K6q69
2701b03n62N21Q50J0q09l60N14K29K73q55m47Q46M71l80n11k48P64M33nq42l92
2722g03P23P24q1r72o66J096O23k9q05q10L04J137M8o00m69K14O52k28o50j79
2742f71P45L17k54p74L53N39L18J0j334k27O29J240r7j097p56O68O14N61q97n81
2762f94N26O94k51k35m15L39J52L43p78l24R29L83m61n98m54R73Q01l69r31q63
2782a233R58N32P96j123n23O5P55K77k80j049N88N29M8n18j30O06J81l65m16l03
2802f05P89N28P5j092m83L45J121O2r12q41P12N84M98q36p36L56M85M43j72n58
2822b37j02O81k09n91J21K70L26M06r58n53M82P42J64o59o67J46J182J60n00p64
$$ y = [231, 14, -237, 19, 237, 331, -537, -381, 304, 837, 294, -773, -875, 123, 836, 647, -726, -722, -87, 640, 666, -203, -765, -244, 606, 616, -193, -553, -39, 190, 463, -392, -839, 7, 478, 98, -413, -661, 103, 536, 531, -311, -703, 20, 744, 663, -309, -975, 121, 744, 715, -90, -900, -596, 541, 589, -11, -480, -266, 386, 158, -492, -671, 74, 391, 137, -637, -284, 255, 573, 583, -751, -978, -349, 891, 794, -303, -1059, -391, 223, 784, -113, -694, -168, 526, 275, 40, -375, -36, 116, 459, -319, -643, 286, 669, 208, -390, -844, 129, 930, 561, -370, -1233, -275, 257, 1053, -70, -593, -528, 227, 504, 224, -825, -237, 292, 340, -178, -308, 298, 479, 114, -302, -605, 184, 712, 787, -305, -788, -443, 678, 740, -172, -1013, -301, 283, 781, -55, -791, -435, 50, 493, 321, -237, -339, 342, 133, -458, -337, -67, 259, 665, -293, -846, -364, 378, 542, -117, -784, -638, 544, 704, 204, -560]
2842e60K22M86L66n9q57K2O47M7k38n00R8M13M08o63m43L38N96J61n50n84L81
2863b69R30M8n04q17J30P47L73k03p91j74O67M15m89j85j38N63k27J0l90K85L52
2884C33R5o48k75J84Q64Pn38p39K81O76Q04p98q31K1N40O46j54q58JN25K80N5
2906D71q26K57K91J34l37n16N43M30j23l02n97K57R22on35p99L12O91R7K8p64
2927c72k12N19M53j78l24j82N18m4m7l67P1M09J29n81l29K66N94K35m65r51R3
2948g65J103N04l73p76m27Q61J50J78n11J0j60M20L5l22PO7L48l19n24M58M63
2969D27L2k95l35l08R98k28q9r42M75Q4R00m11p63j7L21O68n57k31o7K88M12J11
2991D73m80k10K42L15k47j90j99N07j7R7m80q9N50L68p29k45j05M66N32J6j055
$$ y = [-560, -338, 148, 514, 455, -402, -380, 267, 314, 76, -424, -326, 87, 495, -168, -611, -273, 323, 484, -66, -650, -269, 661, 709, 205, -612, -482, 265, 638, 435, -356, -530, 137, 552, 63, -122, -260, 303, 76, 86, -304, -19, 333, 428, -220, -495, -311, 553, 560, 22, -717, -436, 240, 1044, 246, -585, -564, -24, 622, 468, -390, -389, 136, 416, 471, -355, -98, 193, 327, -10, -526, 17, 447, 324, 22, -575, -318, 604, 598, 63, -736, -424, 267, 364, 392, -372, -584, -65, 388, 210, -114, -296, 222, 178, 131, -236, -165, 244, 373, -208, -537, -271, 323, 558, 93, -858, -765, 338, 842, 469, -307, -734, 127, 277, 455, -56, -46, -206, 214, 249, -73, -66, 1, 349, 30, -494, -36, 427, 459, 164, -171, -479, 519, 291, 202, -740, -265, -181, 719, 308, -455, -472, -151, 517, -40, -271, -338, -50, 362, 473, -7, -217, 25, 340, 93, -97, -296, 211, 194, 291, -189, -278, 272, 640, -89, -334, -439, 27, 559, 575, -480]
3012d80l4K79Q20k06j75l23J11M10m14J76j98K17K78k42n44J20O51l03J59p92
3032d90R8L35R46k88j014o8L42N25r5l1n34L2M58o4K92n20J94r5j39k0j68N93
3054B89L13l23m87l25O12M85m48k86l61L53N09L76r81o3J84L62K95o50N3J69J90
3075B66q3k79m6P2K42l9m94n5O85M88o39j58l62M16M43R9m84n54L27M57j14q8
3097A00j0m23L89n6L33k52l97J71L2j83J86N70l82J60k96n00L72L42Q7k36n59
3118e52M42J44J50k66l48M44J68J69k88k20n0K10n3j15p5M17J13k32k45m33N84
3139c6N31m74Q0n22M48K18L1l75l27L89P8L66l90j04j90L73N1R4l77j49M94o3
3161A46k06j9O4K94m58Pj64M38J61m6n01k15M69K92K32o80k75J99K56M25k63k7
$$ y = [-480, -514, -235, 585, 379, 204, -119, -8, 402, -12, 164, -34, 183, 461, 219, -325, -205, 446, 143, 302, -490, -392, -57, 889, 601, -413, -481, -139, 386, 291, 260, -274, -242, 216, 152, 444, -76, 118, 23, -116, -136, -304, 289, 602, 279, -208, -533, 79, 564, 116, -170, -531, -178, 331, 707, -274, -337, -153, 209, 504, -146, -93, 76, 266, 183, -96, -142, -70, 172, 133, -361, -416, 269, 757, 118, -40, -402, 14, 457, 556, 72, -482, -155, 302, 188, 100, 90, -333, 56, 0, 333, 81, -316, -145, -113, -296, -110, 460, 78, 238, -58, -558, -186, 156, 243, 7, -552, -110, 34, 184, -82, -430, 14, 182, 351, 63, -157, -207, 3, -50, -165, -240, 177, 290, 58, -187, -620, -36, 495, 21, 101, -421, 27, 245, 276, -99, -426, -37, 41, 407, 17, -87, -277, 96, 147, 241, -136, -285, 209, 146, -60, -79, -15, 279, -179, -172, -336, 102, 263, 217, -284, -499, -30, 262, 494, -186, -461, -262, -6, 419, 156, 129]
3183A29l55P0K14k43j8L50l53J20j25K09K9M6K29j21m58q3O31L14p61o7PM82J75
3206D21j95n67N0L26K10N6m36j35J26L60r6p2o6L73n70K29k11L11P5j9l01k52
3228c83L26M26ml67K6l96L29M96l50m5r7J25J51k31K74K09m23j75q4j13K36M9
3250b1q0m10M36o3L05k07J99l21J9J02N23m75Kk00K84K8r2N7M4j12R6m4j71J44
3274D3J73L9n85NL86j10N76p16o5%K72M11q7n67N7K15j16M65l68k22J3Q7J83l33
3298b44K11k2j01m9L12p9l3R6n26K02J81M98j01m58j18K41J42Q2l72j26Q5J37
3320d2K47J60l35n6j56L2N66j62m04Q9j15j94M92j34L50l52q8m48L38O45j64m03
3342a34J36j63J0K28L63o38J39k42K63L0J58l49L14k08r5J11M19k14J93o18J53
$$ y = [129, -226, -156, 58, -185, -203, 147, -206, -86, -211, -2, 27, 73, 302, 181, -277, -360, 271, 585, -176, -243, -236, 246, 421, 226, -341, -291, 35, 245, 301, -135, -270, -144, 216, 120, 48, -18, 355, -215, 14, -197, 114, 189, 170, -131, -383, -57, 369, 365, -2, 24, -372, -43, 453, 103, 58, -39, 86, 237, 6, 280, 489, 66, -109, -193, -306, -70, -21, -101, -511, -75, -138, 167, -40, 159, -162, -143, -41, 482, 7, 9, -191, 93, 121, 29, 86, 130, 18, 114, 70, -101, 43, 216, 255, -330, -325, 61, -49, 527, -189, -254, -254, 18, 429, 342, -225, -168, 47, -69, 396, 28, -194, -181, -94, 89, -244, -33, -55, -156, -205, 107, 28, -5, 91, -435, -233, -52, 446, 345, -113, -231, 10, 152, 234, -138, -264, -179, -42, 205, 365, 30, -26, -182, -150, 416, 254, -150, -61, -176, -370, 122, -12, 338, -14, -102, -550, -212, 433, 269, -134, 2, -161, -151, 77, 440, -198, -59, -301, -38, -8, 150, -199, 115, -93, -188, -77, 342, 128, 321, -297, -144]
3363a44L28M7M7k83l23N3L86K78k43m52Q8o6L46J2P2m01J97o9J40N0N5k22M0K1
3387d3j40J57q8M36n53o3K12l1K33J68m57O7j67J62K34k49k7j86M42k1J6J58l25
3410f5n2J38j82L27L3j55o9J43j61J00J82k48j56J99r0Q0J70m00K1O5L19j16K7
3433A10m0N6k2r0K69k85O4k16K19j57o5M79l20k57r1J01M14k55K64l22k7k0L31
3456A40j76L25r36K62J78J58P5j17j02K8P9j06N06l54J41l82j0L10m1O4J33m40
3478b65M1K53J50J15n40J08J80j45J74k3q4n3k8P1j4J06O0j67K4K96k20J44j4
3501A69k35L7J29J8j03L20m95n0j2J25M61n22q3N09j62jP5j56l41M45m04M09N5
3524A88k54O6p3jr1P3K32J41m54K05K0L3q6k41K26p6r9N19l91J66m35M97l82R2
$$ y = [-144, 184, 231, 278, -5, -328, -275, 111, 389, 146, -306, -218, -284, 62, 74, 146, -255, -58, -127, 13, 63, 118, -104, -64, -43, -183, -26, -114, 322, -231, -294, -82, -113, 120, 288, -169, -102, -269, -107, 127, -122, -149, -335, 107, 86, 102, 260, -65, -117, 21, -161, 166, 199, 44, -25, 118, -43, 57, 239, -9, -165, 34, -56, 24, 194, -206, -185, -120, 199, 83, 110, 70, 126, 104, 14, 283, -2, 62, -154, 65, -92, -157, 322, 2, -255, -346, -245, 169, -86, 178, -144, -171, -191, 140, -36, 289, -647, -385, -207, -49, 26, -91, -193, -165, -86, -192, 314, -40, 101, -281, -291, 19, -22, 42, 175, -265, -224, 29, 179, 294, -246, -138, 42, -103, 71, 48, -36, -89, -117, -46, -60, 46, 106, -61, -37, 259, 39, 183, 169, -66, -29, 100, 118, 15, 335, -160, -210, -222, -97, 364, -158, -241, 268, 106, 105, 180, 24, -317, 128, -276, 133, 188, -66, 0, -73, -74, -165, -92, 140, 281, -173, 32, 52, 85, -1, -242, -16, -92, -191, 328, -63, 103, -332, 165, -217, -125]
3548a25L24j33l41M8J54J20Q0K6j25k98L24o6l6n0ml7P2J93J38k53j91K03q8J17
3572E2K0l44P1J2K9J00P4k28j63o0M80N4o3j47J08j48J7L55k02L80m63j40K06
3595@Q6K15l68N9j4K2l3M33l26J12l07L14l81M44j42K98p40K87K94l60J95j8j81
3618a11K01j45J00j08k86J05j14M86j1L9l51K66m0J92mj48J57n63J14M98j81L9
3640A35l06J99j24J73K93p8l7l16j69J49J00L09j91q4l84K50L2nR5r1J35k27K64
3663A22l47J81R2k44J55J05q9L70j95k12o7J5J14K04r8k78j8J40L64m03L12k44
3685b1J24j46K7J39j71J32j04r7J96J85j42K1j14j59J18j59K65j32Q1K89Mj67
3707A69l89J93P2l02M10j29p7J3p2J59M2j38K18k95L13l1j93K48l06j36K16O8
$$ y = [-125, 199, 66, -275, -227, -73, 47, 127, 153, 28, -270, 54, -12, -48, -98, -102, -139, -67, 126, 264, 11, -180, 23, -65, 52, 72, -272, -201, -189, -160, -60, 14, -214, -377, -437, 43, 97, 34, -113, -5, -153, -136, 219, 17, 397, -66, -206, 0, 86, 301, -67, -8, -22, 0, -33, 400, 74, 186, -121, 193, -188, 256, 114, 412, -328, -41, 253, -107, 88, 70, -111, 90, -55, 45, -63, -349, -244, -358, 128, 117, 156, -195, 71, 31, 223, 219, 71, 228, -335, -221, 277, 96, 135, -171, 28, -96, 77, 370, 292, 255, -61, -230, -81, 19, 328, 137, 53, -331, -81, -49, -54, 41, -50, 85, -142, 122, -225, -44, 48, -196, -41, 64, -25, 345, 150, -62, -129, -114, 0, 204, 106, -172, -190, -50, 314, -89, 223, -21, 103, -43, -16, 123, -48, 84, -20, -117, 79, 264, 122, 143, 29, -130, -12, -171, 94, -38, 43, 332, 336, 169, -220, -27, 45, -257, 153, 24, -53, -40, -112, 47, 89, -49, 169, -126, 187, 156, -37, 211, -95, -231, -15, 53]
3729E3Q0j98r0K36j97L09k74J18j04pj12k05P19l41P9j47k56M48k35K40O5k82
3751a01j82N15n75K30L55k87R1j36J7K33j73k84J71q2o7L56K81k90k53k28M76
3772F7o5j3J42m24O4J1R4M58n01L15p5q7K40j53j41J6k42J13K75l4o2K03m56K97
3796D2j89P3J58j31j80J01Q3J22m2n1j22n8L82m24K95j88K69J9m22K28K31o2l2
3819A02l13J47O5J43m11JK64k85J67M19l40n2j1k50M07N7q4N9L3K14j78J16M3
3842C13p4q6l20K02j4k11L81j84M9R3q0P8j89J21L26n10J64K26k68k72K15L0J59
3865A49n1j62M8k4j7l2O6K52o6j49n9K2J9j07mM29m09j50K61qo0k46K91j40N5
3890i2K56j98o8K71j61L29l57j24J46o7L95j12j47j48j77j00N25k34L0P0k30L35
$$ y = [53, 133, -65, -155, 81, -116, 193, -81, 37, -67, -74, -186, -391, 328, -13, 66, -81, -337, 111, -124, 116, 181, -101, -283, 232, -343, -113, 242, -45, 46, -90, -73, 160, -13, -297, -126, -208, -275, 81, 362, 72, -181, -409, 67, 2, -11, 131, -293, -229, -218, -124, 334, -167, 148, 73, -14, 226, 73, -68, -52, -294, -181, 94, 60, -2, 201, -255, 42, -147, -74, 84, -47, -227, -126, -43, 79, 37, -14, -136, -194, 188, -236, 59, -129, 140, 159, -263, -35, 196, 134, 102, -211, -64, 1, 144, -267, -266, -2, -287, -120, 299, -41, -93, -104, -354, 53, 110, 26, 85, 118, 332, 154, 270, 313, 239, 153, -167, 35, 21, -190, 191, 7, 56, 149, 69, 147, -42, 79, 405, -105, 59, 285, 17, -255, -40, -10, 149, 98, -64, -16, -40, -57, -89, -23, 229, 163, 14, -45, -23, -4, -111, -115, 314, -95, -245, 16, 8, -52, -298, -7, -147, -92, 164, -34, -102, 169, 8, 337, -20, -144, 2, -65, 330, 218, 71, -77, -254, -354, 171, -63, -33, 37, -193, 142]
3912A42l23L81j83r7M5q8j54L29r0m8J24j16j01J65L10m22k1Q0K24l15K69m43
3934c32J66Q9k93K96J17N3k53J67l06L00J05l54L54qj93R3J63k3k66P6k71L07
3956a3N9K98n03K32l07J62J21N7j29J4O0Rj43J12q5l4J83j51J78n2K01l96j57
3979b84J84O8K29o0Mk64L35l80K39j25%m2o8K04J00J42k58R0m04J95L22J5j4m67
4003b39R1J88k01P2M7K00k57J44N2J13k55r4O8K8J23Pj25L4J28K0k02K5J8l86
4027d01M25K66n1K0k9m70J33ML22k99lm4J27m88O80j80J77j52k79K09o3M74l50
4050B8l07K06J3L00L6n17L68r1j50k18M92K70l62k65J80L9j6j33K52k8n8j44K29
4073A24K5J1l07J70J48J57j28qm81L98K86n35K57j77J40m9p6R2K8k05J46j94J84
$$ y = [142, -181, 200, 17, -80, -35, -123, -277, 52, -38, -86, 38, -78, -179, -14, 296, -126, -147, -67, 157, -158, 111, -332, -166, -77, -370, -74, 43, 96, -157, 10, -296, 4, 109, -245, 109, 101, -92, 1, 164, 141, -125, -49, -320, -13, 46, 344, -159, 73, -234, -72, 49, 106, -23, -9, 51, 60, -83, 29, -56, -90, 93, -58, 120, 68, 269, -127, -284, -100, -32, 197, 137, 141, -123, 212, -168, 71, -54, -54, -96, -164, 40, 140, 282, 24, 114, -290, -95, 227, 242, 228, -239, -148, 40, -161, -89, -42, 158, -99, 45, 97, 210, -45, -139, -71, -43, 80, 87, -38, -4, 124, 144, -58, -33, -15, -401, 24, 290, 239, 259, 230, -240, -107, -103, 219, -80, -83, -127, 0, -488, 192, 12, 189, 37, -242, -33, -96, 378, 28, -279, -73, -60, 240, 276, -241, 127, 36, -114, -332, 160, 430, 68, -197, -17, 22, 6, -127, 125, 97, 39, -105, 124, 149, 160, -147, 23, 171, 328, 200, 192, -289, 109, 395, -140, 117, -60, 80, 31, -45, 47, 75, -130, 16, -178, 6]
4096Fn6K05J45m62J89l46K74J19J4k94R2K91l51J42K74j62j46K75l82K12o3J9
4118eK50j76J61j70P9%j07j6o9J67k01O4K92m37L29J74k73o5j4RK11n0j08pj31
4143i3j04J51J42k27J5K90l65J01L19Q0k43j0l07J64N5K32j93k44L52j10q6K01
4165A20j53J93k17J67K1j87K06l25J05J33L2l5j98m2J94k37Q1N5j63M14k01p9
4187a16J87o1O6Q5j26k09J6J88J28l34L26j0m1j63L7J26J72m14K84j7m0k30J56
4210A0j84n6J71L18j46l20J61J53q9j98N8M6j99M65J6j98m9j48J77M5j60M2Q3
4233bJ13K71o14J64J02l6q2p5K87l52L49K7j52nj57K23J27N6l15J6K19N9q7j21
4257A5J40k96J71O9P6J43k48K23k61o3L42m03K54j87p8J2L16j26j03L5k61J40
$$ y = [6, -50, 155, 300, -162, 27, -319, -45, 74, 88, -206, -114, 177, -174, -32, 242, 80, -66, 209, -173, 39, -24, -5, 245, 69, 230, 60, 139, 139, 32, 16, -53, 114, -87, -23, 269, -168, 161, 335, 62, -3, -17, -8, 203, 153, 45, 38, -93, -197, -46, 96, -131, -116, 174, -191, -90, 229, 309, 66, 56, -251, -87, -32, 200, 7, -237, 115, 5, -81, 120, -33, 160, -57, 110, 131, -56, 150, -175, -70, 63, 95, 60, -138, -180, 14, -223, -142, -87, -250, 164, -37, -116, 71, 10, 76, 161, 35, -174, -158, 30, 158, -176, 150, 140, 99, -64, -27, 99, 271, -143, 141, 124, 84, -146, 10, -174, -230, -59, 259, 113, -207, -46, 107, 18, -180, -122, -76, -275, 190, 206, 8, -41, -189, -12, 33, -127, -85, -2, 111, 382, -232, -68, 34, -2, -84, -159, 128, -224, 125, 152, 0, -5, -162, 61, 188, 244, -71, -55, 164, 223, 136, 15, 155, -141, 30, 99, 175, 318, 70, 293, 32, -31, 311, -92, 162, -25, -103, -91, 225, 99, -4, 31, -230, -90]
4279i0r6L67j2j20k09M34l62L44m16L41m00n7M37l58L70j17l72M51l08K43j31
4300f1J1K1OR8l7m5J27m3r6J07m2j94O8p8L35n8j55m6j68M0L55k72R3J60n1j54
4326g9J7j92L49k48P0L95p1j75K18j60j83m52K35M43N4J59l17J6m9k51L92j48
4348B3J9J46k17J30j66J47Jk65J39p2O5J03k8r1m1Q6j91K01L31k11K00l96K75
4371A88j82m7L8j85K6J36K70l68J32j37j45K50j70J33J65j42k17J84kQ6o3j27
4393a77O9L9o8Q3J53j54j01J93j05J18r5M1L3l80K27j0K33l78j04M13Q6j56J40
4416A00j07O1o3LJ95J7P0k66l88L42Q7j16o0L33j20n1j71K43j79j8J9J96j09J28
4440A46j31l58L69M6j62j34J81K59p8l13J16k19K78l12K79K23M9Rk93J33ok09
$$ y = [-90, -186, 181, 169, 49, -160, 274, -88, 256, -160, 181, -219, -276, 161, -197, 173, 56, -316, 135, -173, 70, -61, -50, -29, -23, 75, 38, -7, 120, 77, -19, 88, 46, -148, -80, -158, 177, 119, -36, -82, -250, -210, 145, -127, -34, 126, 75, -79, -62, -254, 95, -153, -83, 312, 241, 66, 284, 124, -59, -511, -276, 167, 221, 380, 63, 79, 30, -221, 171, 23, 42, 188, -29, 101, -65, 82, 83, -182, -43, -115, -50, 53, 25, -66, -107, -21, -212, -11, 320, 109, 309, -87, 188, 6, -41, -3, -188, -162, -26, 244, -124, 8, -129, -274, -24, -194, -61, 104, -38, -255, -71, -73, 13, -50, -177, -108, -69, -137, -54, 99, -55, -156, 37, -68, 50, -45, -4, 29, -351, -124, -134, 99, -279, -383, 30, 116, -40, 100, -7, 54, -9, -6, 189, 206, 276, 10, -378, -36, 51, -65, -125, 208, 88, 37, -134, 109, -70, -88, -69, 127, 18, 146, 15, -343, 26, 72, -90, -224, -43, 216, 138, -175, -59, -278, 0, -312, -33, 190, 239, 248, -45, 88, 82, -127]
4462a27L40k01L1j99J89j45K00j45N3M1j28k1L58o9p0k6k35j22L09l6R8l53J10
4485a48m2M5K82l84K03q2J79jK9j86K0R0J00j57P4Q4r1l1k3R0p1K19k41p5L2J66
4511H1j72jJ38r8j02J02K64k02J81P9l07JN5L19l25J7J5j52K45k26K3L97m84M0
4535a12R2j80R9J97l31K41j93J37L9j03K7J06n8lJ07l57l3K33J28J05n2o6lj06
4559h6k03L65k49J41m3J55k03L7K99m55J22J60M0j79J11j24O4k23M02j43M8r2
4581e6j60R5J67J53j61k9l71M05M8NL53m85K7j10l8J44J60j02r6o2m1lK9j5K77
4606A34j5l04J84p4J06k21j2J63K32j03J60j65k10J26J94o24O41j68l40J77M2
4627g7k15K08K2mp4j8J83J42j51P9k68n8J00J92J0o7j22Q1K04nJ52n47K78j57
$$ y = [-127, 213, 12, 43, -156, 33, -112, 88, -57, -4, 37, -91, -112, 246, 177, 107, 81, -154, -276, 33, -3, 95, -258, -148, -190, -145, 137, -247, -44, -126, 53, 52, 81, -105, -85, 5, 105, -52, 22, 106, 15, -16, -39, 51, -20, 199, -42, -117, -85, 81, -91, -92, 46, -52, -154, -52, 212, 10, 191, 270, -37, -36, 19, 338, 13, 30, 45, -107, 138, -88, -65, 332, -152, -112, -20, -200, -101, 96, -235, 6, -187, -50, -11, -114, -87, 19, -39, -42, 65, -292, -325, -92, 36, 141, 89, 23, 20, -86, -289, 76, -173, -32, -75, 80, -123, -86, 213, -242, -120, 40, 80, -99, 12, -112, -48, -271, 131, -12, 36, -56, -216, -121, 46, 199, 38, 9, -362, 43, 91, 96, 449, -36, -9, -119, -157, -13, 147, 45, -51, -113, -154, -157, -128, -143, 134, 119, -185, -1, -75, 31, -190, -202, -39, 193, 90, 250, 85, -125, 1, 195, -429, 212, 44, -296, -119, -77, -292, -84, -62, -66, -140, -158, 25, 167, 16, 95, -173, -231, -131, 61, 71, 4, -118, -37, 167, 162, 314, -233, 45, -112]
4651a12J52J39k30K58j52j04R1L31m10P0o4k99K20l5J14k8J38pj37M5K11j74m7
4674c0j7Jl21M59R4m7j40J60k69j1K78o5j77j09K19J12m93J37R6K10K80n59L69
4697A77j02K1o9j80K98n1N5k17J31q8O5J93l23J44o5k09J84n0J8l86K97oR8j93
4721b58L02J03k31J3j8J44l04l43M34J80K38p1j67J48j0n28K95O92o28r6K96k18
4743b7J52L9j76O6J55l16Q2J93k51J3J37j40P6O4k80J53j4K7M9p9K26M5l15j42
4767b63J79J73J35j92J5nj87K34k04J18N2J08m5L1m30J21j65J01L06O3m1j47k0
4790f3Q2m8L2O7k8J50l19P3q8L91l27J67k54MJ33J12R6k98%J81K0P8M4l56J56
4815EJ3O0Q3j19K4O3j88j92Q7K94P5j48r0j2K4K18j57N6p3l77M78m93M77R9Rj47
$$ y = [-112, 40, 179, -51, 207, 55, -49, 42, 373, -37, 33, -31, -330, -110, -145, -31, -59, 79, 72, -65, -20, 191, 17, -30, -47, -46, -367, 92, 186, 139, -1, 159, -110, -121, 157, 92, -85, -194, 25, 137, -356, -219, -123, 87, 367, -192, 177, 75, 96, 27, -153, 145, 94, 149, -68, 63, -25, 40, 233, -90, 54, -11, -220, -36, -86, -68, -454, -157, -163, -65, -258, 44, 147, -84, -71, -89, 55, -249, -592, -158, 22, 260, 189, 22, 170, 160, -368, -73, 619, -9, -105, 191, -27, 125, 164, -12, 54, 209, -107, -25, 168, -83, -70, 67, -73, 3, 67, -213, -60, -74, -47, 2, -77, 149, 194, -121, -263, -84, 89, 224, 32, 47, 42, -145, 89, -115, 3, 55, 163, 118, 149, -281, -160, -325, -224, 82, 145, 104, -43, -63, 19, -29, 3, 70, 42, 192, -127, -54, -142, 249, -78, 89, -165, -161, -28, 84, 180, -118, -118, 63, 83, 161, 205, -151, 5, 18, 78, 161, 42, 66, 129, -59, -251, -164, 130, 205, 57, -33, -45, -21, 197, 40, 96, 23, -354, 124, -369, 108, 207, 216, 69]
4841F9O8k35J40R5j98Q5j10l74N21K3n4j93J1k0J16m1K00p2J52Jr2j1j29N1K80
4866B83j19qk22M3M1J5M18m01K26k06j22J8J36k69K19p1J75p2J40j26j76j39O6
4889a51R5J85j21M6l60L12J30j41N3L1k71oL52l79L49P2J53m36L30j29j53K06
4911A67j96j36KK48J04k76j3k14P3M80j45m4J00P6j97k04K33J58j60k84K55N1
4933G8r4J13n9k62M2P1N6m8J00k34L35L8Rq6j83j4J77j93j29J06K48l20K96n0
4957ck73K49j44L64p7P9l63J42j52L02J05k72J62LJ17k37k23J22K33j00j57K28
4979A05r8K17r9ml52K56M9r4L7j75J78K83j64k37K49n37N93k4j83K45l16R4J4
5002C7k94J85l3K9J5K16k47q9K22L43m60J62j86o6Q0l5L04j65q7J38m9j28K96
$$ y = [69, 137, -98, 42, 137, -61, 24, -86, -460, 61, 84, 30, -163, -152, -172, -56, -97, 103, 31, 183, 184, 92, 81, -48, 3, 283, 164, 156, -66, -23, 18, 33, 451, 50, 276, 70, -52, -34, 102, -167, 52, -19, 156, 84, 224, 98, -78, -217, -151, -56, 129, 8, 54, -306, 6, 136, -5, 48, 79, -192, -198, 154, -225, 124, 196, 349, -87, 243, 114, -39, 167, -29, -165, -163, 85, 189, -87, -100, -314, -241, 239, 94, 50, 150, 226, 29, -175, 58, 216, 56, -228, 27, 78, -16, 97, 38, -224, -182, -111, -55, -103, -3, -237, 98, 136, 145, 59, -124, -138, 39, -154, -283, -177, 71, -249, 47, -3, -276, -27, -171, 193, 116, 195, -168, -26, -178, 124, 229, -43, 119, 122, 239, 2, -221, -99, 134, 34, -123, 105, 7, 224, 125, 121, -231, 25, 74, -20, 17, -158, 20, 303, 139, -98, 151, -386, 207, 183, 0, 245, -71, 23, 37, -257, -72, -105, -76, -61, 155, -92, -181, 41, 384, -76, 86, -100, -166, -86, -121, 183, 18, -69, 69, 20, -108, 188]
5025A88l29l8L9M61l17K15l25P9j93K83j37Rm1k1r2K80M1N14o22M9J48j34m79
5048d22J30L16l81K03J75j53K61J7Q2k43m4k5J49j3o7J11J82l98l0p8K61j4j72
5071a53j44M4K57J77q7j2k90K22J4J24m9j54j76K04J14J44l03J7L06j79J5j02
5093a1q1J00o7K7q6j99M25l8O5j41M43l88Q7j77J23j18kO3J08M2k96J30J14o3
5117F0m39K87J82p8M0k69K14J60J23l22j03o2K36L7j18N1j51j0M48q9k72LJ96
5140A24j31j90L63pj90l8K02m78M78k64L15j97K43n1p9n3O1k83L8K95j02M30m87
5163aj81K57J26P1j33l63K3J05K38k23J96n0L27n17J58L6l36J56R5j46J29L71
5185C38o29N6K26m1L98j99J45p1m79N75k83K70j40o12K11K85L40k19k91L7L91
$$ y = [188, -141, -179, -140, 321, 4, 219, -106, -27, -220, 63, -74, -65, -106, -127, -219, 61, 102, 616, -6, 43, 191, 57, -422, -292, 24, -357, -154, 21, -132, 129, 146, 228, -15, -59, -84, 65, 52, -15, 96, 278, -120, -150, -228, 33, 19, -153, -297, -253, 4, 181, 94, 82, -208, 14, 28, 152, 103, -51, -227, -23, 91, 235, -68, -51, 255, 76, 91, -11, -92, 8, -59, -32, -118, -317, 108, 70, 135, -6, 437, 49, 136, -41, 82, -36, -38, 25, 133, 175, -121, 9, 123, 60, -379, -92, 90, 12, 52, -217, -3, 157, 280, -42, -145, -207, 29, 66, -52, -1, -152, -162, 286, 197, -75, -72, 124, -7, -197, 166, 159, -31, -69, 133, -345, 133, -131, 184, -13, 230, 179, 100, 47, 108, -175, -137, 158, 56, 486, -1, -182, 75, 201, 272, 139, -224, -201, -96, 142, -81, 115, 65, 392, -125, 33, 69, -267, -111, -16, -162, -33, 338, -291, -235, -9, -50, 348, 149, 294, 223, -256, 319, 36, 306, 166, -446, -235, 50, 390, 171, -120, -83, 308]
5206C08j65q5l1k68K97J17M5l6qJ1l52J24j18J89Rl73J29L80k62K98j24r8K73
5229B60m06k9L26l13J95k38L11m9kp6r4L79j16p2k94N42j91J30j64k82L14k14
5251h3K1J2K18j81j32L49o5j5j99o1o0N8k4K84j95j20J61J09R0k01q5J60l09K20
5275d8M1J58R0kr6l16O9J04k22P7J52p0K29j3j11o4L38l81o8K10KK53m43j28P1
5300a68L52k70J08L20j67lj53Nj44j35M17l52K27Q9k4O8j99j86L74k42J72r6k26
5323b33K34J85J34m09N6O1k63J12K39k35N4j71K64M7K47l72K40j04J34j08J17
5344B29k3l28KK15k6J86k82K2O0k92O8L81j73j11J99l25L37K19j64n59K15J50
5366@p3K17k67J88k7K16J0p9k27J98m7K36l71J8O3J64j97J73j91M52j81j73l0
$$ y = [308, 143, 58, 27, -241, 56, 173, 218, 182, 174, 185, -167, -43, -161, 28, 37, -336, -207, 173, -89, 209, 85, -13, 260, -146, -175, 151, -162, 33, -205, 106, 57, 55, -21, -115, 264, 148, 76, -218, 324, 133, 263, 99, -183, 131, -83, -62, -50, 168, -13, -145, 204, 139, 124, -75, -136, -196, -138, -162, 122, -73, -193, -32, 77, 167, -34, -119, 41, -268, -48, -7, 151, 241, 239, 143, -173, -104, 0, -222, -145, 7, -63, 166, 153, 42, -22, 316, -65, -133, 77, 79, 332, -111, -239, -168, 184, -86, 22, 342, 175, 172, 19, 24, -120, -255, 162, -190, 37, 126, 102, 170, -29, -215, 159, -83, 89, -7, -233, 1, 186, 320, -89, -33, 28, -235, -123, 116, -119, -65, -236, 28, 75, 322, -50, 190, 86, 220, 112, 229, 206, -122, -120, 95, 69, 255, -27, -5, 55, -237, -169, 212, 39, -72, 127, -198, 139, 358, 194, -365, -150, 0, -73, 144, -123, 65, 38, 254, 264, 185, -42, 156, 109, 345, -26, -8, 55, 219, 22, 195, 4, 456, 275, 102, 72]
5389G2j9j15K03J7l55J72O4k35M37l43j12J67K92l35K4K30j00k07n4k25K81n6
5411a97K47n4nM1j56O5q4N04m08J07q8m3J91r0j50O1j80J96L07k0k37j15Q0m5
5435g3n7K04K4k75L92m7l8k72J24k5J94j26L9q8k5J26R0lj6k05n8J81R1q1l06
5460b30L68N1l22l2R2K1K27k29j7J4q3M51j82j08o3r2N73l84m12Q4L74j88o5j72
5484c24L49J01k51M8K80n52O90l03K33k33l05K07j45M26j45l13J24J47J10j12
5504C2J19l4N11n32L3j63kM6j04r9J70L43m61L13j80rK9j59K53j40j5K31j94M41
5528D29n37N0l63O43J53m93K3K73k74j34M98j06k48r5j5M70j86m13M15J49k03
5549C6n3J3k47K95lk70N8L64K6k38k27L07K6q4o1k45Q8L36M9k89k7K29j96P3J52
$$ y = [72, 53, -62, 141, 158, -197, -25, 39, -196, 241, -102, -214, -47, 245, -90, -66, 164, 64, -143, -197, -422, -141, -197, 50, -4, -9, 32, -124, -59, -143, 361, -47, 60, -28, -71, 120, 30, -120, -59, -239, -43, 264, 244, 7, -108, -28, -73, -130, 74, 98, -177, 215, 168, 130, -142, -18, -43, 151, 25, 64, -24, -49, 77, 167, 164, 148, -57, -115, 66, 157, 76, -230, 138, 189, -133, -165, -73, -52, 175, -54, -71, -57, -140, 311, 129, 21, -42, -134, 439, 55, -357, -273, 101, -87, -152, -324, 25, 126, -125, -77, 203, -349, 341, 38, 271, 38, -267, -60, -205, 221, 76, -237, -113, 34, 144, 32, 151, 117, 628, 96, 129, -34, -36, 10, -94, -193, -23, 320, -141, 172, -8, -17, 12, -147, 106, -34, -49, 182, -12, 429, -108, -58, -421, 222, 375, -118, -95, 178, -96, -230, 268, 162, -86, -181, -196, 274, 88, -325, 90, 239, 36, -17, -4, -251, 44, 41, -229, -171, 193, 219, -19, -246, 61, 87, 3, -58, -303, -215, 121, 170, -119, -146, 83, -113, -40, 112]
5574A12r4j97J71o1r0K28k22K17m8q4J62lJ64k66j07K55p2j13N6k9j2J93j80p6
5598i6jN74o18K03k68K50j25j06j16L18J30j58K53l94K48k53L97l26L48k79k0
5619c9L26l23K69m14r4K93J56m37J62K39j52N48l92j66k1J21j31K65q1ok26L9
5641f4N2k42J46K0J95P4k74L17J03l81J69k85K45J6l3j08m49O41R5j32p7o1q7
5664a20j39L71K4K48m89l6j59N19j57j52K98k37q5K09j85O8M2J70j58J30k64O7
5686c5R3J07k07N0J32m5m7j09l3R7q1j95N47j42k82L49k56j42K87j41P2j50Q5
5709d6J05k3j17J14k0k29O9M8M13k20j82l7L55J6m27K17n4j23J66K6j7o7M5j6
5733dQ2l4M6lk85M90k04j12L85n76L10J35j0j09j96j08P2J72J68j80M1m6J76m75
$$ y = [112, 18, -179, -8, -69, -159, 69, -153, 64, 16, -68, 94, 91, 255, -11, -118, 137, 65, -48, 8, -21, -33, 160, -20, -96, -97, 477, -141, 62, -206, 44, -81, -187, -303, 15, 145, -13, 240, -154, 94, -159, 238, -88, 260, -19, -39, 287, -36, 233, -181, -275, 18, 174, -263, -101, 138, -14, 534, 142, -24, -45, 76, -55, 210, 129, 123, -103, -64, -12, -254, -108, -88, 107, 181, -93, 224, 327, -54, 115, -170, 75, 91, 58, -50, -499, 142, 237, 105, 28, -33, -120, -259, 112, 136, 384, -105, -141, -300, 219, 62, -90, 208, -29, -114, 95, -90, -22, 20, 190, 32, 162, -102, -35, 58, 165, -42, 8, 140, 95, 48, -61, -94, 3, -78, -273, 274, 132, -150, 199, -57, -199, 88, -53, 19, -131, -46, 59, 36, -81, 33, 13, -216, -147, -99, 314, 94, -88, -125, 230, 246, -181, 36, -18, -141, 25, 51, 34, -33, 12, -4, 78, 44, 90, 87, -198, 292, 88, -24, 361, -215, 95, 230, 220, 111, -85, -193, -121, 51, 219, 39, 80, 34, 210, -265]
5757b65K32J76Rk34K57k55j23L69m65K20N3o4J70r0K14j58j68q6L78K5j84R0K8
5780A29q2J40k48M1M4j10J18Q7l15K09K41n13L52o9q7j49K39q7J81k41j77L10
5802A3q3Q5n2J48j02J23l2r4j73L15J44l96J03p8%L84l90Q8J32k5k04L47l17j03
$$ y = [-265, -33, 143, 152, -82, 175, -80, -203, 166, -299, -79, -26, -90, 80, -10, 204, 46, -122, -208, 170, 195, 11, 101, 129, 47, 187, -61, -20, 24, -86, 32, 119, -196, 13, 254, -259, 93, 24, -63, -212, 27, -60, 121, -120, -297, 13, -70, 15, -37, 111, 9, 132, 100, 6, -167, 148, 292, -104, -1, -79, -79, 305, -85, 3, 135, 110, -94, 253, -64, -167]
$$ [...]
8191a46
##END NTUPLES=NMR FID
##END=
