##TITLE=1H_DVF-033
 d6-DMSO, 8 sc, 
 6.3.2020
##JCAMPDX= 6.0         $$ Bruker NMR JCAMP-DX V2.0
##DATA TYPE= NMR FID
##DATA CLASS= NTUPLES
##ORIGIN= UXNMR, Bruker Analytische Messtechnik GmbH
##OWNER= root
$$ XWIN-NMR		Version 3.5
$$ Fri Mar  6 17:50:30 2020 Russian Standard Time (UT+4h)  she@DPX200
##.OBSERVE FREQUENCY= 200.1315
##.OBSERVE NUCLEUS= ^1H
##.DELAY= (6, 6)
##.ACQUISITION MODE= SIMULTANEOUS
##.ACQUISITION SCHEME= undefined
##.AVERAGES= 8
##.DIGITISER RES= 18
##SPECTROMETER/DATA SYSTEM= spect
##.PULSE SEQUENCE= zg30
##.SOLVENT NAME= DMSO
##.SHIFT REFERENCE= (INTERNAL, DMSO, 0, 15.7039)
##AUDIT TRAIL= $$ (NUMBER, WHEN, WHO, WHERE, WHAT)
$$ ##TITLE= Audit trail, XWIN-NMR		Version 3.5
$$ ##JCAMPDX= 5.01
$$ ##ORIGIN= Bruker BioSpin GmbH
$$ ##OWNER= she
$$ F:/spectra/data/she/nmr/H-F/1/audita.txt
$$ ##AUDIT TRAIL=  $$ (NUMBER, WHEN, WHO, WHERE, WHAT)
(   1,<2020-03-06 17:49:21.28 +0400>,<she>,<DPX200>,
      <created by zg, POWCHK disabled, PULCHK disabled
       configuration hash MD5:
       00 E9 B6 7A A2 85 ED C7 34 08 36 98 17 FE 4E 26
       data hash MD5: 16K
       29 E3 6F D2 2B 02 83 18 99 B4 76 4A 7B 76 0C 69>)
$$ ##END=
$$ 
$$ hash MD5
$$ B0 04 5F 5D 20 E4 2D B3 1A 5A 81 1E 35 48 78 AD
##$RELAX= 
##$RELAX= 
##$RELAX= 
##$RELAX= 
##$RELAX= 
##$RELAX= 
$$ Bruker specific parameters
$$ --------------------------
##$DU= <F:/spectra>
##$EXPNO= 1
##$NAME= <H-F>
##$PROCNO= 1
##$TYPE= <nmr>
##$USER= <she>
##$AMP= (0..31)
100 100 100 100 100 100 100 100 100 100 100 100 100 100 100 100 100 100 
100 100 100 100 100 100 100 100 100 100 100 100 100 100 
##$AQSEQ= 0
##$AQ_mod= 1
##$AUNM= <au_zg>
##$AUTOPOS= <>
##$BF1= 200.13
##$BF2= 200.13
##$BF3= 200.13
##$BF4= 200.13
##$BF5= 200.13
##$BF6= 200.13
##$BF7= 200.13
##$BF8= 200.13
##$BYTORDA= 1
##$CFDGTYP= 0
##$CFRGTYP= 5
##$CHEMSTR= <none>
##$CNST= (0..31)
1 1 145 1 1 1 1 1 1 1 1 1 1 1 1 1 1 1 1 1 1 1 1 1 1 1 1 1 1 1 1 1 
##$CPDPRG= <>
##$CPDPRG1= <>
##$CPDPRG2= <>
##$CPDPRG3= <>
##$CPDPRG4= <mlev>
##$CPDPRG5= <mlev>
##$CPDPRG6= <mlev>
##$CPDPRG7= <mlev>
##$CPDPRG8= <mlev>
##$CPDPRGB= <>
##$CPDPRGT= <>
##$D= (0..31)
0 1.2 0 0 0 0 0 0 0 0.06 0 0.03 0 0 0 0 0.0002 0 0 0 0 0 0 0 0 0 0 0 0 
0 0 0 
##$DATE= 1583502560
##$DBL= (0..7)
120 120 120 120 120 120 120 120 
##$DBP= (0..7)
150 150 150 150 150 150 150 150 
##$DBP07= 0
##$DBPNAM0= <>
##$DBPNAM1= <>
##$DBPNAM2= <>
##$DBPNAM3= <>
##$DBPNAM4= <>
##$DBPNAM5= <>
##$DBPNAM6= <>
##$DBPNAM7= <>
##$DBPOAL= (0..7)
0.5 0.5 0.5 0.5 0.5 0.5 0.5 0.5 
##$DBPOFFS= (0..7)
0 0 0 0 0 0 0 0 
##$DE= 6
##$DECBNUC= <off>
##$DECIM= 24
##$DECNUC= <off>
##$DECSTAT= 4
##$DIGMOD= 1
##$DIGTYP= 9
##$DL= (0..7)
0 120 120 120 120 120 120 120 
##$DP= (0..7)
150 150 150 150 150 150 150 150 
##$DP07= 0
##$DPNAME0= <>
##$DPNAME1= <>
##$DPNAME2= <>
##$DPNAME3= <>
##$DPNAME4= <>
##$DPNAME5= <>
##$DPNAME6= <>
##$DPNAME7= <>
##$DPOAL= (0..7)
0.5 0.5 0.5 0.5 0.5 0.5 0.5 0.5 
##$DPOFFS= (0..7)
0 0 0 0 0 0 0 0 
##$DQDMODE= 0
##$DR= 18
##$DS= 0
##$DSLIST= <SSSSSSSSSSSSSSS>
$$ [...]
##$SUBNAM2= <"">
##$SUBNAM3= <"">
##$SUBNAM4= <"">
##$SUBNAM5= <"">
##$SUBNAM6= <"">
##$SUBNAM7= <"">
##$SUBNAM8= <"">
##$SUBNAM9= <"">
##$SW= 24.9337058887773
##$SWIBOX= (0..15)
0 0 2 0 0 0 0 0 0 0 0 0 0 0 0 0 
##$SW_h= 4990.01996007984
##$TD= 16384
##$TD0= 1
##$TE= 0
##$TE2= 300
##$TE3= 300
##$TEG= 300
##$TL= (0..7)
0 120 120 120 120 120 120 120 
##$TP= (0..7)
150 150 150 150 150 150 150 150 
##$TP07= 0
##$TPNAME0= <>
##$TPNAME1= <>
##$TPNAME2= <>
##$TPNAME3= <>
##$TPNAME4= <>
##$TPNAME5= <>
##$TPNAME6= <>
##$TPNAME7= <>
##$TPOAL= (0..7)
0.5 0.5 0.5 0.5 0.5 0.5 0.5 0.5 
##$TPOFFS= (0..7)
0 0 0 0 0 0 0 0 
##$TUNHIN= 0
##$TUNHOUT= 0
##$TUNXOUT= 0
##$USERA1= <user>
##$USERA2= <user>
##$USERA3= <user>
##$USERA4= <user>
##$USERA5= <user>
##$V9= 5
##$VALIST= <valist>
##$VCLIST= <CCCCCCCCCCCCCCC>
##$VD= 0
##$VDLIST= <DDDDDDDDDDDDDDD>
##$VPLIST= <PPPPPPPPPPPPPPP>
##$VTLIST= <TTTTTTTTTTTTTTT>
##$WBST= 1024
##$WBSW= 4
##$XGAIN= (0..3)
0 0 0 0 
##$XL= 0
##$YL= 0
##$YMAX_a= 61164
##$YMIN_a= -50150
##$ZGOPTNS= <>
##$ZL1= 120
##$ZL2= 120
##$ZL3= 120
##$ZL4= 120
##$ABSF1= 10
##$ABSF2= 0
##$ABSG= 5
##$ABSL= 3
##$ALPHA= 0
##$AQORDER= 0
##$ASSFAC= 0
##$ASSFACI= 0
##$ASSFACX= 0
##$ASSWID= 0
##$AUNMP= <proc_1d>
##$AZFE= 0.1
##$AZFW= 0.1
##$BCFW= 1
##$BC_mod= 2
##$BYTORDP= 1
##$COROFFS= 0
##$CY= 11.3945322036743
##$DATMOD= 1
##$DC= 2
##$DFILT= <>
##$DTYPP= 0
##$F1P= 16.9975609425685
##$F2P= -3.02152046262296
##$FCOR= 0.5
##$FTSIZE= 0
##$FT_mod= 4
##$GAMMA= 1
##$GB= 0.15
##$INTBC= 1
##$INTSCL= 1
##$ISEN= 128
##$LB= 0.24
##$LEV0= 0
##$LPBIN= 0
##$MAXI= 10000
##$MC2= 0
##$MEAN= 0
##$ME_mod= 0
##$MI= 1.114404
##$NCOEF= 0
##$NC_proc= 0
##$NLEV= 6
##$NOISF1= 3.799351
##$NOISF2= 2.8
##$NSP= 1
##$NTH_PI= 0
##$NZP= 0
##$OFFSET= 15.70392
##$PC= 1
##$PHC0= -9790.949
##$PHC1= 17.60082
##$PH_mod= 1
##$PKNL= yes
##$PPARMOD= 0
##$PSCAL= 0
##$PSIGN= 0
##$REVERSE= no
##$SF= 200.130013532006
##$SI= 16384
##$SIGF1= 3
##$SIGF2= 2
##$SINO= 400
##$SIOLD= 16384
##$SREGLST= <1H.CDCl3>
##$SSB= 0
##$STSI= 0
##$STSR= 0
##$SW_p= 3612.71676300578
##$SYMM= 0
##$S_DEV= 0
##$TDeff= 0
##$TDoff= 0
##$TI= <>
##$TILT= no
##$TM1= 0
##$TM2= 0
##$TOPLEV= 0
##$USERP1= <user>
##$USERP2= <user>
##$USERP3= <user>
##$USERP4= <user>
##$USERP5= <user>
##$WDW= 1
##$XDIM= 8192
##$YMAX_p= 0
##$YMIN_p= 0
$$ End of Bruker specific parameters
$$ ---------------------------------
##NTUPLES= NMR FID
##VAR_NAME=  TIME,          FID/REAL,        FID/IMAG
##SYMBOL=    X,             R,               I
##VAR_TYPE=  INDEPENDENT,   DEPENDENT,       DEPENDENT
##VAR_FORM=  AFFN,          ASDF,            ASDF
##VAR_DIM=   8192,          8192,            8192
##UNITS=     SECONDS,       ARBITRARY UNITS, ARBITRARY UNITS
##FACTOR=    0.0002004,     1,               1
##FIRST=     0,             0,               0
##LAST=      1.6414764,     0,               0
##MIN=       0,             -50150,          0
##MAX=       1.6414764,     61164,           0
$$ Real data points
##PAGE= N=1
##DATA TABLE= (X++(R..R)), XYDATA
$$ [...]
2081d67J74N89J99J90j137j10J71O24K8p8n10M53k07M94Lk94jk89q5N2O81l0r0
2104C60p80J0L10K99M53l86o22j39O91L58j19o09m20N63J90K07k34k19l66M60
2124GM4j43L12K31n91r5O6J59P04m93m07l15P3N90K97o27k59m02L75R79n35k52
2146b82k67R9J04M40j83m41n7N78j16k59M32k99N4l04k40L84M59M4o62l17j20
2167i53R27L08k58q64J73J46Q95j19n64l12k12P77M5j99q2j8K81l64p5N62l9J57
2189B12l75o18L53N91M05o99o21j13Q48O41o5r15m09N27O06L86n86n67M37K08
2209B46J83m07l9L02p9Q7m56N05K82J83k52o43l31J019M06j65r84n55J244O80
2229A226l86n10n68L31M37K32k84o04K18L60M63n05n7J0K16j33o54K96P15J16
$$ plain form
2081 -467 -293 296 495 685 -452 -562 -391 233 261 183 -327 126 -81 413 416 122 121 -168 -253 -201 480 450 360
2104 360 -420 -410 -100 199 652 266 -356 -495 196 554 435 -174 -594 -31 159 366 132 -87 -453 7
2124 7 51 -92 220 451 -140 -235 -169 -10 694 201 -206 -521 -448 142 439 -188 -447 -849 -474 505 -30 -282
2146 -282 -549 -450 -346 94 -89 -530 -587 -9 -125 -384 48 -251 -197 -501 -741 -357 102 146 -516 -833 -953
2167 -953 -26 282 24 -840 -667 -521 374 255 -309 -621 -833 -56 -11 -210 -292 -310 -29 -393 -468 94 55 212
2189 212 -163 -781 -428 163 568 -131 -752 -865 -17 624 559 -356 -765 -238 368 754 168 -399 38 246
2209 246 429 22 -17 285 206 293 -163 342 624 807 555 -88 -419 600 1006 841 -143 -698 546 1226
2229 1226 840 330 -238 93 530 762 478 -126 92 452 915 410 353 363 579 446 -208 88 803 919
2249I19k00p74j05O39N19m13o21m95L09J203Pr02q00O16P68n7j99p03K65M67r6
2270C47k49k39K07N7n4k36j88N49N67p83m72l31R47L70r1p52n37J56J117K40q99
2291b74o82P85mO88o78o06M22M78K7k93o07L77M07k23k95k76N80N65j98j060l14
2312a181N58J306m39o77o42L75P29M85n21q73J14O23Rl05k98K65P17j21o92k60
2332h28O28M37r9o07m25Q10M52M26r71q00M93J132K49j130p94L20J222J78r54
2351b61m29K76Q85R1n08k21k2M39N6m62j63M99L89q5o41l94N59P59j65o20p79
2372g97K68J311N3p67q43M37R04M62p34r87L78P66L97p06l47J06O61j84r9p37
2392d58J13J021J00p33p83N11R42j17k44j183L94J092M48p45j399M68P79N63n98
$$ plain form
2249 919 719 -55 -160 479 998 585 -36 -531 -222 981 988 86 -714 -98 670 613 414 -289 -24 443 347
2270 347 98 -141 66 123 69 -167 -355 194 761 -22 -494 -825 122 492 401 -351 -888 -732 385 625 -274
2291 -274 -956 -171 -175 513 -165 -771 -349 129 156 -137 -744 -367 40 -183 -478 -754 -174 391 193 -867 -1181
2312 -1181 -623 683 244 -433 -1075 -700 29 514 -7 -880 -766 -143 -134 -439 -737 -472 245 124 -568 -828
2332 -828 -200 237 138 -469 -894 -84 368 794 -177 -977 -484 648 897 -233 -1027 -707 515 693 -261
2351 -261 -690 -414 471 562 54 -167 -189 250 306 -156 -319 180 569 484 -157 -551 8 767 602 -18 -797
2372 -797 -529 782 835 68 -775 -338 566 1028 294 -693 -315 451 848 142 -205 -99 562 378 279 -458
2392 -458 -345 676 776 43 -740 -229 713 596 352 -831 -437 655 1103 358 -1041 -573 206 769 171
2411A71p06L74L29M91m74m52n9Q08q3l01q42L67Q32L44p42p88K88P41O24q64j129
2432a071L87J258K96n03r94l23J250K89l15q93l08J210K20k52j188M89J200O5
2450H17p39m90o0R91L81j079o45K4R85O02n58r48k08J154P63n47j143K20O27P50
2470H97o74m15k66O88M65j22r45m7Q56J18l88q35J15R88N30q18p74l4Q71M62l14
2491C58q99l86R03J078o51q24j10N16Q30n55n67m8L20Q20n64o05j15P98N93o88
2511B04r30k5Q25J001o81j314k10J207N90l74r35j52O20R68l23j208j55Q31N06
2530D45m56m51l52P61M43j32p10m01J461J62n89j077K52N49P02m03q92n63J026
2549b25Q79o7j108n61Q56O92j48q96j08Q11N32n6r39n52J035O23n47q38j31N58
$$ plain form
2411 171 -535 -161 168 659 185 -267 -326 482 399 98 -744 -377 455 799 57 -731 -443 298 922 58 -1071
2432 -1071 -684 574 870 367 -627 -950 300 589 274 -619 -927 283 503 251 -937 -448 752 817
2450 817 78 -412 -472 519 900 -179 -824 -800 185 787 229 -719 -927 227 990 443 -700 -480 147 897
2470 897 223 -192 -458 230 695 573 -372 -419 437 555 167 -668 -553 435 965 147 -627 -661 210 672 358
2491 358 -541 -927 -24 1054 403 -421 -531 -15 815 260 -307 -355 -35 785 221 -384 -499 299 892 204
2511 204 -726 -751 74 1075 394 -920 -1130 77 667 293 -642 -794 -174 794 471 -737 -892 -61 445
2530 445 -11 -462 -814 -53 390 258 -452 -853 608 770 181 -896 -644 -95 607 204 -688 -1251 -225
2549 -225 654 587 -521 -1082 -226 466 318 -578 -686 125 657 601 -338 -890 145 768 221 -617 -748 -190
2569a90R88k29j299m70J115N34k82r53J04N31J089n51j097j98Q60O86K22j106
2587b46n33Q70P60j92j096l72M96J186k78j098l35R70P33j78j129l56Q64J082
2605A148k95j358l55O39R97K0q92l74N58P33J2j289j49L77J281k25j016k67M67
2624A2P33m4q49k75L26J101j81j150k75Q01O28J16q36j168R91J044j9j144p27
2643i16Q08Q90N0q71p35M09J141J5r96o07N58P59j15p22l38O32O87Q3r26r05P32
2664c67J012l5r05n14P07N79L04j124m20L91R13K80p23j050O83N27L32r69m79
2683h58K46J086o9p82k50J34O83L61q74p60O57O54M16j301l28l4J243N11q91q02
2703i58N20P28K66p71o04J29J011R1o86l50K01Q66M0m44j046M26J051J02o46o78
$$ plain form
2569 -190 798 569 -730 -1200 -85 449 167 -786 -682 -151 938 387 -710 -908 -48 638 860 -246
2587 -246 -779 91 851 659 -437 -809 -313 873 595 -503 -838 132 865 687 -442 -798 66 1148
2605 1148 853 -505 -860 -221 776 796 -96 -470 88 821 833 -456 -605 -228 1053 828 -188 -455 12
2624 12 745 701 -148 -423 -97 1004 823 -327 -602 199 827 943 107 -1061 -70 974 955 -189 -916
2643 -916 -108 782 832 -39 -774 -365 776 791 -205 -812 -254 505 390 -332 -670 -38 649 732 -194 -1099 -367
2664 -367 645 610 -295 -809 -102 477 781 -343 -763 -372 541 821 98 -952 -269 258 590 -379 -858
2683 -858 -612 474 405 -377 -627 -493 190 551 -323 -1083 -426 228 644 -657 -985 -1019 224 735 -156 -958
2703 -958 -438 290 556 -215 -819 -690 321 412 -274 -624 -423 443 483 39 -1007 -581 470 572 -74 -752
2723g52K44J170K61j120n60J76Q92N12o24r83J81R30L93q22l24K12O22K18o99
2742g3n15J14J105K79q57p04J29J165J78n69r79J95Q72N26l84j169J78P88P70
2761A049o03j023O2R05M67p96n02o9J082J85n54o25j05P72Q97j197o57M80N64
2780C32M51o33q36J46O60R35r11p54L11O83O73p41q31l0R54J17n52q30J80J062
2800C86J74k94r69J68J038K73n32q10j48J279L19r51n65j2P06P70l58r56O2M64
2820D4N57k86q92r5N05P24l14q28K01M85N13l11p21j58Q11L19l08j144M37Q97
2840D36L01o22m68l73O42Q49n83m41p75J172P36m73q00l71O35P89n2j380J63Q56
2860B41J53J11j023k6Q45J34j5r00l30Q68Q83o96n67l72O95N31j9o44p17P88R04
$$ plain form
2723 -752 -508 662 923 -197 -757 -581 311 823 199 -784 -603 327 720 -102 -426 -214 408 626 -73
2742 -73 -588 -474 631 910 53 -651 -522 643 821 252 -727 -532 340 866 482 -687 -509 279 1049
2761 1049 446 -577 -515 390 857 61 -441 -510 572 757 203 -422 -527 245 1142 -55 -712 -232 332
2780 332 783 150 -686 -540 120 1055 144 -610 -299 384 1057 316 -515 -545 409 526 -26 -856 -676 386
2800 386 560 266 -703 -535 503 776 244 -566 -714 565 884 -67 -632 -644 62 832 474 -482 -420 44
2820 44 601 315 -577 -672 -167 557 243 -585 -384 101 614 303 -418 -576 235 554 246 -898 -461 436
2840 436 737 115 -353 -726 -84 765 182 -259 -1034 138 874 401 -399 -770 -135 654 602 -778 -615 241
2860 241 394 505 -518 -544 301 435 420 -480 -810 58 941 245 -322 -694 1 532 513 -131 -848 -60 844
2881H44m72q31m95Q56N81p0p61R5L73O60m14q43J98L43N59l87p34R1K18Q18k67
2902C62j090R1N20P21P9j047m6L56L89J17o36l13N92L68k01m19o70P73M19m2p78
2923d55k59N09P26l09q29M7N78L75q1q07j18M85O22o0o70k72K83N76K26r24l50
2944g07N19N95o9o61k8l8Q57j18o30j94L66Q14k09m66p05O38N60N2q36j64L49
2965g5N74J21n81o37N31K31L36o31j69J88N70l9p30L84j69N37p8m42l32K60R11
2986G60k99o47n19N05O36J11o76m17P17j08K63k78l41K65K99J00m43m42N39L25
3006C50K69m65n41K68M94J06m45n42J75P95k7n11o71O15M06L02l88q35M12P79
3026E46j57j03q08L08M41J74l71n32O41J41J67n18m23L67O28K5n65m75L38M72
$$ plain form
2881 844 372 -459 -954 -98 483 413 -348 -253 120 780 366 -477 -279 64 623 236 -498 -407 -189 629 362
2902 362 -728 -637 -117 604 683 -364 -410 -54 335 452 -184 -497 95 463 262 -157 -827 -54 365 323 -455
2923 -455 -714 -205 521 212 -617 -570 8 383 302 -505 -623 -138 484 424 -246 -518 -235 341 567 -357 -707
2944 -707 -188 407 338 -323 -351 -389 468 350 -280 -474 -108 706 497 31 -674 -36 524 576 -260 -424 -75
2965 -75 499 620 39 -598 -67 164 500 -131 -300 -112 458 419 -311 73 -96 441 363 -79 -411 -151 760
2986 760 461 -186 -705 -200 436 547 -129 -546 171 63 326 48 -293 -28 271 371 -72 -514 25 350
3006 350 619 154 -387 -119 375 481 36 -506 -331 464 437 -74 -745 -130 276 578 190 -645 -233 546
3026 546 389 286 -522 -214 227 401 30 -502 139 280 447 -71 -494 -127 501 526 -39 -514 -176 296
3046B96m3k48k71r4N96L16n26m62j30Q17J08j96m69q5N54J01m50K14j91K47l0
3067E4p0n71P22M43l65l24j39R7N17j01k26m64J95K70K75m05k33Q3K32K61k23
3088B8k78J05M43l9j77m73L46N01j77l29k95j5Q26o1m07n77K42O85J73m59m90
3109d28K04K62J32k21l37J36L78M09l23l92N7K79J33j19l33j99O68k04O8n12J26
3130b16M38K88k21o82N5O47J05j07p35J72L19K41j45k11p7J06K13L5l20j3p1L77
3152A98k46nQ0Q9O3l53j63J49Q4L19n4m51J95O30P0m52r3j73K13L50k59j79k36
3175b24K09M0J89m78J81L73j93N9j20k52J97N25n19k7n6J05J13j08m39J43L46
3196F4O5j42j06l06P19l86K36l49j08K57K18p0j94j88L42J27j18m45J42L60K33
$$ plain form
3046 296 253 5 -266 -360 236 552 26 -436 -566 251 359 163 -306 -391 163 264 -186 28 -163 84 54
3067 54 -16 -587 135 578 213 -111 -250 -153 364 263 37 -427 -232 38 313 -92 -325 -242 -10 251 28
3088 28 -250 -145 298 259 82 -391 -45 456 279 -50 -345 -360 466 405 -2 -579 -337 348 521 62 -428
3109 -428 -224 38 170 -51 -388 -252 126 535 212 -180 -123 156 289 170 -163 -362 306 102 170 -342 -216
3130 -216 222 510 289 -393 -338 309 414 307 -428 -256 63 304 159 -52 -129 -23 190 225 -95 -108 -179 198
3152 198 -48 -53 27 116 179 -174 -337 -188 -104 215 161 -290 -95 535 605 153 60 -113 100 450 191 12 -224
3175 -224 -15 25 214 -264 -83 290 97 156 36 -216 -19 506 -13 -40 -96 9 122 14 -425 -282 64
3196 64 129 -13 -119 -425 294 -92 144 -205 -313 -56 162 92 -102 -290 52 179 61 -384 -242 118 351
3217C51k98j15k45K70J86L03n51j35J93Q8l1l34J48j72Q45m30L8o82O77j48K63
3238B21k63j81K76k0k7n00J09L77J51p2l78L06P0m8K41l49M4m8Q7L47n09J01k04
3261b69M42k3k71Q5k98N03J40l25j98K65k91M66n67L83j58m0M07l63l23L78L65
3282C08k88J01n16O9O27j23l3q7j44J34J54l45J25k54L82O8l83J10J36K63l64
3303f0j57m3M92k06K78k81l9k14O18Rm35K60Q1l11K6Om04L14L47L5j85j37J31
3326A25j72K35k29o7L46j57R3m44L78Q1j45q2R0l67j63N67K54l57j81L07J53r7
3348A68m6k26R1j69L74k70n6J30J73k4M4l35m9J59J02P7j62K2M4k42k3L69j85
3371c4LM19m15p4K1R6N1K26m46K09n2j43k13N45l51L14l06lJ37J82l09J69q7k08
$$ plain form
3217 351 53 -62 -307 -37 149 452 -99 -234 -41 47 16 -318 -170 -342 503 73 111 -571 106 -42 221
3238 221 -42 -223 53 33 6 -494 -385 -8 143 71 -307 -1 69 21 262 -87 -43 -91 -4 343 -166 -65 -269
3261 -269 173 150 -121 -36 -334 169 309 -16 -214 51 -240 226 -341 42 -116 -156 251 -112 -435 -57 308
3282 308 20 121 -395 -326 301 178 145 58 -86 48 202 -143 -18 -272 110 178 -205 -95 41 304 -60
3303 -60 -217 -260 232 26 304 23 -16 -230 388 397 -38 222 303 -8 18 24 -380 -66 281 316 131 -6 125
3326 125 -47 188 -41 -108 238 81 174 -270 108 189 44 -38 52 -315 -478 89 343 -14 -195 112 265 168
3348 168 122 -104 -13 -182 192 -78 -134 -4 169 145 189 -146 -195 -36 66 143 -19 3 47 -195 -218 151 -34
3371 -34 -31 388 -27 -101 -80 16 67 293 -153 56 4 -139 -352 193 -158 156 -150 -153 -16 166 -143 26 -61 -269
3395b69R3J74J64l78J07J5L47j68J72k79r6N8J65l48J50K1l2J24m6J40m9l17M10
3418A58m27L34j16K2j3j75J17k50L33j86K7O1K02k48K70j91P8k8N1J33K4k82K12
3441A06k09J56K10m84L08n12L23K32l27J65K76k58J23k85L37l26N62m65qP3k50
3462b53L70k14K62j61J64o3L7J47l00O9K7l9k11K23J50J19n37k9K51J08j28j31
3484a39K55q4q0J4J48j43j14lJ80O3k46K00j06Q8k5K31ON7m31o8L28l94K13J8
3508c2J13j64Q3N3j39j57J12J09k23Q3J59r3J71l42L67m75M63k86J59k8k46M60
3530A47j87N5k02j55K15K95m06K20J39n0j49J19j3kJ98k28J2M04l25L6k57K75
3552A41k23J33L2L1j4j78O8j48K79K16m36M20k00k49K99j37j26J16N3k79L74p9
$$ plain form
3395 -269 -176 -2 162 -216 -109 -94 253 85 257 -22 -118 -60 105 -243 -93 -72 -104 20 -26 114 65 -252 158
3418 158 -269 65 -51 -29 -42 -217 -100 -350 -17 -203 -176 -115 87 -161 109 -82 -4 -32 19 152 176 -106 106
3441 106 -103 53 263 -221 87 -425 -102 130 -197 -32 244 -14 109 -176 161 -165 397 -68 -76 -3 -253
3462 -253 117 -97 165 4 168 105 142 289 -11 58 85 46 -165 58 208 327 -210 -239 12 120 -8 -139
3484 -139 116 32 -48 -34 114 -29 -143 -146 34 97 -149 51 -55 33 8 239 245 302 -129 -197 131 -263 -50 -32
3508 -32 81 -83 0 53 -86 -243 -131 -22 -245 -162 -3 -96 75 -267 100 -375 88 -198 -39 -67 -313 147
3530 147 -40 15 -187 -342 -127 168 -238 -18 121 71 -78 41 28 26 224 -4 8 412 87 123 -134 141
3552 141 -82 51 83 114 100 -78 -10 -158 121 337 -99 321 121 -128 171 34 -92 24 77 -202 172 93
3574I3j08j80L19P0j32q2m9o5K54M2l89K95m17K94K5l2Q9J85m90L82j55J53k15
3597a13J00O9k98J67k4J68k41J99J5j11L33m27J16k96K91k3o1K9J64l36J45q0
3619b14O1N7N7k02K16L59l54rJ89j74J96k59j34JJ93l9J5K10k6l12M47l58M8J25
3643I3K6Ok62m9m7O1K58L9J6j99l1J86k28Mm5K88J71n21M33j38oj28k85K78J46
3668F6l01K53p6K07r0j61M16k07l62J78k66M10j48K99J63l65j25R2L23k51M7k8
3690G4J85r7l06j5J16K27Q0r7j69K56p5o4k88k17N71j14j12J05J04j78k2L06r6
3713A74K0j24L35m29R4k99N05l11j3J6N8K09l86L66j99j08J30J21j06L5j91l2
3735a35L20L1l01k32M25k46o2K38j35L9J10k07J33J64m1J5j43NK19m37L4K4j06
$$ plain form
3574 93 -15 -195 124 194 62 -20 -69 -134 120 162 -227 68 -349 -55 -30 -62 27 212 -278 104 -51 102 -113
3597 -113 -13 56 -242 -75 -99 69 -172 27 42 -69 264 -163 -47 -343 -52 -75 -136 -107 57 -279 -134 -214
3619 -214 -153 -96 -39 -241 -25 334 -20 -29 160 -14 182 -77 -211 -210 -17 -56 -41 169 143 -169 278 -80 -32 93
3643 93 119 125 -137 -186 -233 -172 86 125 141 -58 -89 97 -131 -127 -172 116 287 -234 199 61 55 -73 -358 -80 66
3668 66 -235 18 -58 149 59 -102 314 107 -255 -77 -343 67 -81 218 381 16 -109 -17 306 55 102 74
3690 74 259 162 -144 -159 -43 184 264 167 -2 254 179 115 -173 -390 181 67 -45 60 164 -14 -36 270 174
3713 174 194 70 405 -24 70 -229 276 -35 -48 -32 26 235 -151 215 16 -92 38 159 53 88 -103 -135
3735 -135 185 216 -85 -317 108 -138 -200 38 -97 -58 52 -155 -22 142 101 116 -27 -22 197 -240 -206 -182 -288
3758b88K79l40M76j13n8j85M17j71J00j1l26K10o55N41j99M0R9j68M01J19J00
3779B68k92k2k79oK15j15K9J41J80l77J80pJ86P0R2k37j0Nk39r5K86p3l6J2J09
3804a5J56n18N20r0k80K42J61m10oL62Nk44K38l06N83j39j75k71J39L6J47M%j45
3828fn6O9K6o8j60L41k29o7L6R4Q1j58J32m8J61M4m87L83M7l9k97K54P3l21O3
3853a32n9L36p1k52N48l11m8L8j04k20L27L24l03J8r9l5P1J21m97J38R6J22j60
3876a52L7K34k48j29j27P16m83J64j20J91K79k77k72K60k40j48K78K70k21k8j35
3897a51L2R9Q6o9j41L22l14K68M6j26J14J05j49k02L30m91L54j70J24P3j00m4
3919dn1L7k15M41j94J86k95J45O5j96j42J92j68L80r8J37k94r9K45j32J69j6O2
$$ plain form
3758 -288 -9 -349 127 14 -44 -229 188 17 117 106 -220 -10 -665 -124 -323 -283 -184 -352 49 168 268
3779 268 -24 -46 -325 -331 -116 -231 -202 -61 119 -258 -78 -85 101 171 263 26 16 21 -218 -313 -27 -100 -136 -124 -15
3804 -15 141 -377 143 53 -227 15 176 -234 -240 122 127 -117 121 -185 398 259 84 -187 -48 -12 135 139 139 -6
3828 -6 -62 7 33 -35 -195 146 -83 -150 -114 -20 61 -97 35 -13 148 192 -295 88 135 96 -201 53 126 -195 -132
3853 -132 -191 145 74 -178 370 59 11 49 -55 -275 52 376 73 91 -8 -43 28 149 -348 -210 -114 8 -152
3876 -152 -115 119 -129 -258 -385 331 -152 12 -108 83 362 85 -187 73 -167 -315 -37 233 12 -16 -151
3897 -151 -119 -20 66 -3 -144 178 -136 132 178 52 166 271 122 -80 250 -241 113 -57 67 140 40 -4
3919 -4 -55 -18 -233 208 14 200 -95 50 115 -81 -223 -31 -199 181 83 220 -74 -173 72 -60 109 93 155
3942A55J2o2p9O9j41M72m65L7K30k62O6l6K2J16j86J59m7k0j93J65Q8j05K40m68
3966b33K47N7J46m78M68j54k16K12k24k6L38N9j98j36k94K35J71m32O15j88K2
3987iq7j41M91Q9l72j0J79qk31J07o0n3Q8l45L18k22J73J2K99j17p2j87q4J64
4011g8J12k26Q6n6K86k61N0j04R3J43K36p03J92J40J37K9k95M57l92K60J2mn20
4034d06L47M1N0j02J57j98r1J07j63L93k37rN21l39m5K94j74k50p1N2j80L48J99
4057B44l3l16J32j6j86J55q6K43L0l14m8M24j58Jn9K4k03K60k46M55j21j45L56
4080C93J1k64q6j89J70J01J17l80L27j63k4K02l5N6l67M39l29L89k57J72o3j07
4102A13k21L61pm22p4M27J14j65j20j28J11Q1k13J18J79j41k3K34l23k5K23m15
$$ plain form
3942 155 167 105 26 95 -46 426 -39 -2 228 -34 32 -4 18 134 -52 107 60 40 -153 12 100 -5 235 -233
3966 -233 14 71 217 -261 207 53 -163 49 -175 -201 137 196 -2 -138 -432 -197 -26 -458 157 -31 -9
3987 -9 -96 -237 254 343 -29 -39 140 132 -99 8 -52 -105 -17 -362 -44 -266 -93 -81 218 101 29 -158 -242 -78
4011 -78 34 -192 -106 -162 124 -137 -87 -191 -98 45 281 -422 -230 -90 47 76 -219 238 -154 106 118 114 -406
4034 -406 -59 -18 32 -70 87 -111 -202 -95 -258 135 -102 -111 410 71 26 320 146 -104 -175 -123 -303 45 244
4057 244 211 -105 27 11 -175 -20 -106 137 167 -147 -195 229 71 72 13 37 -166 94 -152 303 182 37 393
4080 393 404 140 54 -135 35 136 253 -127 200 37 13 215 180 236 -131 308 -21 368 111 283 220 113
4102 113 -108 253 246 -176 -250 177 291 126 6 -122 -11 70 -143 -25 154 13 -10 224 -99 -124 99 -316
4124c16K77K94m86q9L38k79J71Q3r6N5LJ95j36n1j48K27J9pQk81qK18Q1NK7l62
4150b58K45j31Q8N5Q8r9j32l7L70j40j70N5L4j52KK07L0m4J63j38OK18l67M9J12
4175E4j96L62l47n4RM23j29L4k80L0K4R2j4N3nj37q1J61j92J00J74QPK7p7j46
4201a00J58O1j26r4L41k07m9J28q7J8J79m23L92J6j42j95j65N03N6k59j65Q1J7
4224f2J44k50L06J27l37j39J87QK88k76L8L1O5Q2l74J68J66k53J5M5j29L42k46
4247e4J02L59m18J26L6l8L9k22p4Q0p6J75J87k08J07j13m5J6J97k52j34J96J23
4270A09l49n6J08L24J9l39K04j29L03k01j87L34q9q9k55J64J04K65j80M4Q0M6
4292B30k78O0j39K44J28k72K25k54L1l48O29k20J2j59Q6J49j80N0j61r7L36q1
$$ plain form
4124 -316 -39 255 -231 -320 18 -261 -90 -7 -103 -48 -45 150 14 -37 -185 42 61 54 62 -219 -227 -9 72 77 104 -258
4150 -258 -13 -144 -56 -1 87 -12 -144 -181 189 49 -121 -66 -32 -184 -182 25 55 11 174 36 42 260 -107 -58 54
4175 54 -142 220 -127 -181 -172 251 122 156 -124 -94 -70 22 8 61 56 -81 -162 -1 -193 -93 81 89 96 123 46 -100
4201 -100 58 119 -7 -101 240 33 -16 112 25 43 222 -201 191 207 65 -130 -295 208 264 5 -160 -79 -62
4224 -62 82 -168 138 265 -72 -211 -24 -16 272 -4 34 65 130 212 -162 6 172 -81 -66 -21 -150 192 -54
4247 -54 48 407 -11 115 151 113 152 -70 -144 -64 -140 35 222 14 121 8 -37 -21 176 -76 -210 -14 109
4270 109 -240 -296 -188 136 155 -184 20 -109 194 -7 -194 140 51 -38 -293 -129 -25 240 60 104 184 230
4292 230 -48 12 -127 117 245 -27 198 -56 -25 -373 256 36 48 -111 -25 124 -56 -6 -167 -264 72 -9
4314iK75k05J57j78k16J50K4J73J99m73J73j13J59M1l8j56J46k18K60j28n4j17
4336a48r7L90j66n1J19j5j86j50K03j20J40K21j84J73j46L4J51m70K78j08K34
4357A02j90M26m41M5J17k04q2J89J04k8j23L3P0rK3j76K09j31K14j85N2J97k84
4380g2r3L96j60J30j86j39oK44m78N53l19K67l69J59J77k21N8n6L2j0K45l60K78
4403G0q5k89K96J3n46J80L33l58L95J14p5J37l6j94j33L03k0J54k90N4q3p5J11
4426b4J89j62J41j04k23J54o5j61M93r7j52K90k41j1j91L54k07K26q3k58K73r8
4448D3j5j72L37j39j73L00J36J3l63J12k08L90k79Q3Q1r2K9K0R1l10O8J20M02
4471D74m47K11j88n7K94k10k48J54k21K31J91l2j64j57J80j78L64R0m20K36l04
$$ plain form
4314 -9 266 61 218 40 -176 -26 -2 171 370 -103 70 -43 116 157 119 -37 109 -109 151 23 -31 -148
4336 -148 -245 145 -21 -72 47 32 -154 -304 -101 -221 -81 140 -44 129 -17 17 168 -302 -24 -132 102
4357 102 -88 338 -103 -58 59 -145 -227 -38 66 38 -85 -52 18 9 32 -144 65 -66 148 -37 15 212 -72
4380 -72 -165 231 71 201 15 -124 -130 114 -364 189 -130 137 -232 -73 104 -117 -59 -115 -83 -93 152 -208 70
4403 70 -15 -304 -8 5 -541 -361 -28 -386 9 123 48 185 149 -45 -178 125 105 259 -31 23 -60 -135 -24
4426 -24 165 3 144 40 -183 -29 -94 -255 238 141 -11 279 38 27 -164 190 -17 209 126 -132 141 43
4448 43 28 -144 193 54 -119 181 317 330 -33 79 -129 261 -18 65 146 54 83 103 194 -116 -48 72 474
4471 474 27 238 50 -7 287 77 -171 -17 -238 -7 184 152 -12 -169 11 -167 197 287 -133 103 -201
4492b01M35j5q8l39J36r0L17j43k33K32J57k27R2M3j24j66p6K05p9L04l86P7L47
4515A78k76J62j34j86J14K25j93J30m9j12O0K43j05j47N4p6J3j35J81K95k64K7
4537Em41K12K74k0J15k63J54p5R7r0K7J89j86l4j48N3j2K88k2J67j91Q4l92L66
4561A57k08l7L74l61L9K37m05M31j61k50K2N5r0l7O49n75N5M25n53q9L81m3Q2
4584I8j87J60k38L2L32J2k38K36l78j21L80j39J70k66K51r7P0J05k42n9K00j00
4606a9J76k18N1l5K4r7Q3J35k49K14r5k71L77j76K68j10m7K45j70q4J2L3m2k6
4630b1n8M53l10j30r2m3qL13L7J21p4m78J78K84m7J44j43R4n84K87m3L59m53J65
4654d9RK81r0n50L60j91j27L94l3J54m66K45R5q4J29k16J91m8k83N34k24k78K23
$$ plain form
4492 -201 234 219 131 -208 -72 -162 155 12 -221 11 168 -59 33 76 -48 -214 -290 -85 -164 140 -246 -169 178
4515 178 -98 64 -70 -256 -142 83 -110 20 -29 -141 -81 162 57 -90 -36 -112 -99 -234 -53 242 -22 5
4537 5 -436 -224 50 30 145 -118 36 -39 58 -32 -5 184 -2 -36 -184 -131 -143 145 123 290 99 183 -209 157
4561 157 -51 -88 286 -75 -36 201 -204 227 66 -184 -162 -107 -197 -234 415 -160 -105 320 -233 -322 59 16 98
4584 98 -89 71 -167 -135 197 209 -29 207 -171 -292 88 -51 119 -147 104 7 77 182 -60 -119 81 -19
4606 -19 157 -61 -10 -45 -21 -118 -35 100 -149 65 -30 -301 76 -100 168 58 11 256 86 2 14 47 5 -21
4630 -21 -79 374 64 -66 -158 -201 -209 104 141 262 188 -290 -112 172 125 269 126 220 -364 -77 -120 239 -214 -49
4654 -49 -40 241 151 -399 -39 -230 -357 37 4 158 -308 -63 32 -52 77 -139 52 4 -279 255 31 -247 -24
4677b4P0j42L16m05K19K01j99k86J60L64m71K37o7k83J85K3P9j67L73l3j23J18
4699A45m8m2M6m97K13L43j08j05n4L82m20K23j3J75M6l82J65k93k2N24n96K68
4721e0K12l25J36L5k61J2J93p4l8j4J10J0n1N4Q3l1l2j84J35M0o6J04k8k7r5J10
4747d2K10j47p3K0J02M6n4n2k4J94j72L35k46J19q1k92L42j75k21j94P51p6p2
4770A98k80L12l33J46L0m11N73N6n56L24k8l0n3J52m5l3K9j19L3N1k75L42k70
4793a87L21r3j18j0K6K65n79K88r5J61O3l7J35p5j65K48m05R4J81R4K1l33J06
4816i4J35j88J99n3k40M69m10K22j00k1J7K24l07J28p4J84k67l0j16M55N5J68
4838C56o6l41K77o1k43q1K04M1R6j40J57j16j06p7K95j37j68K19l2l40L82k72
$$ plain form
4677 -24 46 -96 220 -185 34 235 36 -250 -90 274 -197 40 -27 -310 -125 -102 -23 -190 183 150 27 145
4699 145 97 55 101 -396 -183 160 52 -53 -107 275 -145 78 65 240 286 -96 69 -224 -246 278 -318 -50
4721 -50 162 -163 -27 8 -253 -241 -48 -122 -160 -174 -64 -54 -105 -51 32 1 -31 -215 -80 -40 -106 -2 -30 -57 -152 -42
4747 -42 168 21 -52 -32 70 116 62 10 -14 180 8 343 97 216 135 -157 185 10 -211 -405 346 270 198
4770 198 -82 230 -103 43 73 -338 235 291 -265 59 31 1 -52 100 55 22 51 -68 -35 16 -259 83 -187
4793 -187 134 41 -77 -87 -61 204 -375 -87 -182 -21 42 5 140 65 -100 148 -257 -163 18 112 133 -200 -94
4816 -94 41 -147 52 -1 -241 228 -182 40 -60 -81 -64 160 -147 -19 -93 91 -176 -206 -322 133 188 356
4838 356 290 -51 226 165 -78 -159 45 86 182 42 199 83 -23 -100 195 58 -110 109 77 -263 119 -153
4860a53R7K82j69o6j55K27K04j40q7j30J51k43J78M8l21M40l18K57k29J48J48
4881A69m7Q6m6j82k83J28L09k17n9O7J66l49J41M33j75K18j85j41J51j67q0K5
4903c8K21m55L92l24J72Q5l0j19o5J43l2J24k83l08P00j71j19k67M03n4l87m4
4925d56O92L4l72J62l13J84%m9j88L20K0J51k91K74j98L25k08J75l11J13J66l15
4947h5J02p4j75j5L58Rj27r5J13L20l43O2Mo4J38j66k00K8K25j69pP2k69J42K90
4972G4J35l76M4J80K25m52J62K23l99jL55n03N45L8k92J4J67J84j40k44K86L0
4994B55j65j5k21R4j82K81j00K62j39j04J01p3j42K47r4Jj40K08Lk86K90k79M35
5017B37k10K47l65J73p6K17k47J00q0J9L16m67K94k17M06j74j97m7J23N03o67
$$ plain form
4860 -153 -56 226 57 -9 -164 63 267 127 40 -90 61 -182 -4 44 -277 163 -155 102 -127 21 169
4881 169 122 208 162 -20 -303 -175 134 -83 -142 -75 91 -258 -117 316 141 359 174 33 184 17 -63 -38
4903 -38 183 -272 120 -204 -32 53 23 -96 -161 -18 -50 74 -209 -517 183 12 -107 -374 29 -25 -412 -456
4925 -456 236 270 -102 60 -253 -69 -69 -118 -306 14 34 185 -106 168 -30 295 87 262 -49 64 230 -85
4947 -85 17 -57 -232 -247 111 120 -7 -102 11 331 -12 50 54 -10 128 -38 -238 -210 15 -154 -161 -89 -358 -216 74
4972 74 209 -167 -123 57 282 -170 -8 215 -184 -185 170 -333 212 250 -42 -28 139 323 183 -61 225 255
4994 255 90 75 -146 -52 -234 47 -53 209 70 -34 67 -6 -148 99 5 6 -134 74 77 -209 81 -198 237
5017 237 27 274 -91 82 6 223 -24 76 -4 15 331 -136 158 -59 347 173 -24 -71 52 555 -112
5038a12K28O4k54qJ25k10L8J13J95P4j37N8J27k69q2o5L06l54L44l13k8J13K1
5061b6J01KK92l45q8Lk06k1M30j4J33p2N9k76RK33r6j97r0L18j32K43l55r2N99
5086D12m28k14J43k61K24K29j86J67l36J98J48k9m26K64j25L77j52rl3n0j74K17
5108d4M2K1J93j51o6j22p4K04L3K22l15J76j37p9L4j60N51m86J42l9P6p7J90J38
5132B72l7k10L43l92K57k98m7k53K23J87L6Jj47mL9J41MJ1k80L45n6l16K31n8
5156hJ60J57k67o0j82K55N4k23n9k39N93R7j86k42n5K15o5j94L4J72J23j1p5j72
5180a78m8J55J99rl16O11n45K26k31J49j43K29j97J13Nl3p8J88j41j4J38k43O
5203a57J96j26j45K88Nq1o4o5L15n8j41r3O9J60j54Pp4J56J28l02L97p2l48K16
$$ plain form
5038 -112 116 180 -74 -82 43 -167 -129 -16 179 253 116 174 301 32 -50 -115 191 -163 181 -132 -160 -47 -26
5061 -26 75 77 369 24 -64 -61 -267 -288 142 128 261 189 248 -28 -19 214 118 -79 -169 149 17 260 -95 -187 412
5086 412 -16 -230 -87 -348 -124 105 -81 86 -250 -52 96 67 -359 -95 -220 157 5 -4 -37 -87 -261 -44
5108 -44 -2 19 212 61 -5 -127 -201 3 36 258 -57 119 -18 -97 -63 -223 328 -158 -16 -55 21 -56 134 272
5132 272 235 25 368 -24 233 -65 -112 -365 -142 45 81 82 -65 -69 -30 111 115 126 -154 191 135 -181 50 -8
5156 -8 152 309 42 -18 -200 55 109 -114 -173 -412 181 278 92 -150 -205 10 -55 -249 -215 -43 80 69 -6 -178
5180 -178 -226 -71 128 119 -197 414 -131 95 -136 13 -130 99 -98 15 20 -13 -91 97 -44 -58 80 -163 -157
5203 -157 39 -87 -232 56 61 -20 -84 -149 166 108 -33 -126 -57 103 -51 -44 -118 38 166 -136 261 189 -159 57
5227E7J7Pl44K08o5J50k71O2J82J11k05J13mM4m23O96n02L35l64L2K83J6L4m43
5251b74J21Q0j30K82m22K33K90o4k24r3M13j42J62n13J40O8J94l23Q3q9R9K66
5273A57m04K61K46k44N3o3K49m28K32p2j63L39j58k99M84j12p6M8K11k78R7k67
5295a87K99k57L16k64J46j84rJ42M7P7k38J70k00L63j52J59j62j05k94L01J20
5316H8m21M95Nk46m0j32J15k83K10M54k86k6J08K0k75k6J91J54r0m2Mk22K89j84
5340a40K38j86k9N72l14k20j63L72O4J12m80J82O5P5m02k0j07K4K88J8p5N88m73
5363a1J7j24m2K77j71J14K6m50N44j30l47K83j59P4O5K30m04L78j57r2L8N6n2
5386c7Q3l28K87Q7j99j3N6K51j82R4mj17j39J36rQ3j32N06m44J02r2K53j25j68
$$ plain form
5227 57 74 81 -263 -55 -120 30 -241 -179 3 114 -91 22 18 62 -361 335 -167 168 -196 -164 119 135 169 -274
5251 -274 -153 -73 -203 79 -343 -110 180 116 -108 -201 212 70 232 -281 -141 -73 121 -202 -119 -208 -109 157
5273 157 -247 14 260 16 69 6 255 -173 59 -13 -176 163 5 -294 190 78 2 50 261 -17 80 -187
5295 -187 112 -145 171 -93 53 -131 -140 2 49 126 -112 58 -142 221 69 228 66 -39 -333 -32 88
5316 88 -333 162 167 -79 -119 -251 -136 -419 -209 245 -41 -67 41 61 -214 -240 -49 105 15 -27 -23 -245 44 -140
5340 -140 98 -88 -117 455 141 -79 -242 130 194 306 -174 8 73 148 -254 -274 -381 -357 -69 -51 -126 462 -11
5363 -11 6 -118 -160 117 -54 60 86 -364 180 50 -297 -14 -173 -99 -34 196 -208 170 13 -79 -41 15 -37
5386 -37 46 -282 5 92 -107 -120 -64 187 5 99 95 -22 -161 -25 -34 49 -83 423 -21 81 -11 242 117 -51
5410e1J78JJ02l5p4j89R3k62N09O7k18k00K91j55K14r6j5j09j31P5j90L70j17
5433E8l90K34j04O4K38o3k75j55L43N8k70K49k3Q5R0k38Q8K00k20j64K67j56J49
5456F5j08K48j35j1m05J25P7M80m76K46k62J56K05N3k61nn4K11p4j51j93O5K43
5479C9l1K14q5k01J52K36l40j90K80k46M00m03K60Q6J40k79k35J7j82K29K98l02
5501a43J63K31j31n9r9J46k60J1L74k89j12L32j51O9M9L1k24qK74l25l74L99R5
5524aK23j82j93J82k7j19Q9j73K68j44J49j45J16k88K45J18j88N7K3L17k86o6
5546b5K82m25K32j8O3k76J77k87L99k16J24l89J91L71O8l59k0K48JJ25K3l67J33
5569E5Nl07j5L75lKl13J01k60L85J23l26J46P4J8j27R0J43j93J19j3n2k02K0M22
$$ plain form
5410 -51 127 128 230 195 121 -68 25 -237 272 339 121 -79 212 57 271 175 160 51 -80 -5 -195 175 58
5433 58 -332 -98 -202 -138 100 37 -238 -393 -50 8 -262 -13 -36 49 139 -99 -11 189 -31 -195 72 -84 65
5456 65 -43 205 70 59 -346 -221 -144 336 -140 106 -156 0 205 258 -3 -8 -62 149 75 -76 -269 -204 39
5479 39 8 222 137 -64 88 324 -16 -206 74 -172 228 -175 85 171 311 32 -203 -186 -368 -139 159 -143
5501 -143 20 251 120 61 -38 108 -152 -141 233 -56 -168 164 13 82 131 162 -62 -70 204 -121 -495 -96 -1
5524 -1 222 40 -153 29 2 -117 -28 -201 67 -77 72 -73 43 -245 0 118 -70 -13 10 327 41 -25
5546 -25 257 -168 64 46 109 -167 10 -277 122 -94 30 -359 -168 203 271 -88 -108 140 141 266 289 -78 55
5569 55 60 -247 -262 113 110 112 -201 -100 -360 25 148 -178 -32 42 60 -67 23 166 -27 92 79 27 -175 -155 267
5594B67m27L59j94j78MJ44K29l67J26n0p3j91K52K43n8J2j74J56N9k1J51j91j71
5617i3L77j98j9k31P4J39j16J91J10o6j70L35m84K05k20L5n0N1J10J56r4j6k16
5640a90M54m69P8L28N0m00J26J13j44L31l08K30k58k75K84m0k33K45R7j97K26
5661D8l67K48K20k98J68L2k36J73k3m2n7L57k19q4N7l52K78L14l29J40m75M63
5683A6J45j29j0j24o6J42L9j5K84n00M39j41Q1j86l25L31J78n5j67J15j87O4K05
5706A34l59J08M05j45l49K78l21L94J28m21K03r6LQ7p0k68K01J75J1j04o3M2J6
5729a1J18k43J51J84k68L11l98J69m8J45J51k24N0j20Q4l35M74o3q9L19l26Qj80
5752a41m0Q7K8p1j88L89m9j35K40k04L7j07K68op5m4m7L24n04K50p5R1k31J9J70
$$ plain form
5594 267 -160 199 5 -173 -169 -25 204 -163 -37 -87 -160 -351 -99 144 86 98 -76 80 139 118 269 78 -93
5617 -93 284 86 67 -164 -90 49 -67 124 234 168 -2 333 -151 54 -166 -131 -181 -130 -20 136 42 26 -190
5640 -190 264 -205 -127 201 251 -149 -23 90 -54 277 -31 199 -59 -334 -50 -90 -323 -78 19 -178 48
5661 48 -319 -71 149 -149 19 51 -185 -12 -35 -77 -134 223 4 -80 -23 -375 -97 217 -112 28 -447 16
5683 16 161 32 22 -102 -168 -26 13 -2 282 -218 221 80 161 -25 -350 -19 159 104 -63 52 -135 -71 134
5706 134 -225 -117 288 143 -206 72 -249 145 273 -148 55 -41 -38 49 -21 -289 -88 87 98 -6 -69 -27 -11
5729 -11 107 -136 15 199 -69 242 -156 13 -35 110 261 37 87 -33 51 -284 190 127 38 357 31 39 -141
5752 -141 -181 -94 -66 -137 -325 64 15 -120 120 -84 -47 -154 114 108 33 -11 -58 266 -238 12 -63 28 -203 -184 -14
5777a4J42q9j65K8q9J50RJ53k58L0p7K27q0j37k3K18O9k89K93o8J97l47J70K46
5801B96k67o4J49M6n20M73k94J65j22K29l66L48J09m59J61O5k39L25K26l82Q2
5822c9J73q9m29N81j49J2k06J25J8n8K35m38M14k65J88p8k69K29j3R7j5k51QJ60
5846e9L24p4k69L3J49o53K48J17L20l07K75k67K03j6p5P4J1P6O8K40o84J35J51
5869B0M5j55K00l56J67J06N0l7P0j11J29k30p6M57m44k9J33OK78m2k35M87m07
5892B6m07P78k37k30R8n4J87n5Q7k77L8j95J09p5L05k46L17m42l8K90j19K57r8
5915A9K39l71J49k7L84p17J36J60N0N7P3M5n17Q6M3K54J39m25L46p0j74K64j24
5938A9P4J7K23k53J73J38n20L64j87K37j22j73L05l01l5o9J54kj98J39l48M68
$$ plain form
5777 -14 128 39 -126 -98 -187 -37 -28 125 -133 -103 -180 47 -33 -170 -193 25 94 -195 98 30 227 -120 50 296
5801 296 29 -35 114 160 -360 113 -181 -16 -138 91 -275 73 182 -277 -116 -51 -290 35 261 -121 -39
5822 -39 134 45 -384 197 48 60 -146 -21 -3 -61 174 -264 150 -115 73 -5 -274 -45 -58 39 24 -227 -219 -59
5846 -59 265 191 -78 -45 104 -549 -301 -184 136 -171 104 -163 40 24 -51 23 34 110 178 418 -266 -131 20
5869 20 65 -90 110 -246 -79 27 77 40 110 -1 128 -102 -178 279 -165 -194 -61 -55 223 181 -54 433 26
5892 26 -381 397 160 -70 28 -26 161 106 193 -84 -46 -241 -132 -207 98 -148 169 -273 -311 -21 -140 117 19
5915 19 258 -113 36 9 393 -324 -188 -28 22 79 152 197 -320 -234 -191 63 202 -223 123 53 -121 143 19
5938 19 93 110 333 80 253 391 -129 235 48 285 163 -10 295 -6 -41 -110 44 42 -156 -17 -365 103
5960A03j69J72j5j81J86J39j48m68L46p8n3K76J02k35O5j4k86L37k72m8L9K59
5982E7J39o3J41k98J19J34j57N3p3O2k14K58l27N2j10K9K60j17J98l45K77o9J76
6005A82j30Q2j16m0j46J26j29M78j76j84q9J34Pj79J54N0k24M91m29M9K05kl9
6028G5p3l75N48l13J55J5j6k29K79k6N1L80o14L07l32L12J11J18k92j45J95j63
6050c2J69j84q7L58p7k57M38m57J70J19l37K23L5R9j27k44J12j23K33k4j18R6
6072a5r3L38j43j01j43J4M9L0R4j58J62j17P8L00k37j31j0K04Mk04L40j35k45
6095a19n6J61r7K52J55l30J36N3k80J49K84k78j61K7O6L02l25M2l4j37K39k90
6117b41K85j47J1L03n28J64J04K3J0L78m57J47L8j61J35P7k63J42k9L5j64R9L6
$$ plain form
5960 103 -66 106 91 -90 96 235 87 -381 -35 -113 -166 110 212 -23 42 28 -258 79 -193 -241 -202 57
5982 57 196 133 274 -24 95 229 72 125 52 114 -100 158 -169 -117 -227 -198 62 -55 143 -202 75 6 182
6005 182 52 134 18 -22 -168 -42 -171 307 131 -53 -142 -8 -1 -180 -26 24 -200 291 -138 -89 116 114 75
6028 75 2 -373 175 -138 17 32 16 -213 66 40 91 471 -143 164 -168 144 255 373 81 -64 131 -32
6050 -32 137 -47 -134 224 147 -110 328 -129 41 160 -177 46 81 180 53 -191 -79 -202 31 7 -111 -15
6072 -15 -108 230 87 -14 -157 -143 -94 -64 30 -128 34 -83 -5 295 58 -73 -83 121 125 -79 261 126 -119
6095 -119 -175 -14 -111 141 296 -34 102 155 -125 24 308 30 -131 -104 -38 264 -61 -19 -53 -190 49 -241
6117 -241 44 -103 -92 211 -317 -153 -49 -26 -16 362 -95 52 90 -71 64 141 -122 20 -9 26 -138 -39 -3
6140cl42M70r3rM5q6m2j8K66p0o1n6J24M1J3L9m62N02m88p4M23J32l48j58M5L41
6166A31j40J03K14j24M7m43J26K52J63m10RJ01O9q7j8k41K60k62K42J54l99L27
6188G4j71J48J19nm60L96nr7n3k68N43k47k64L52j99L92K5m67L40r4j95j88K86
6211c8K85l57K82M7k83J56j82K18p0n6j40L08j17Mq7j39j88J17N33j07l09q9n8
6234b70L95k14r1L10k71J32K19k83J33j27L09k55J20k35Q5N8J42j70k4J31j44
6255e0O5m03L90K62m13j5R9K49p3m43J01j6L76N5l3j48L2l8j24J78K24k15j68
6278a08m6M02j31m2k27j02J11L1L18j42O1q7J25Pq6j19j20K06k0k40J56j52L05
6301A00j75P3L45l58K4J37j75L17j66j85J76j18O7m2k51L76l2L5l47L09J05k45
$$ plain form
6140 -3 -345 125 32 23 68 -18 -60 -78 188 118 57 1 125 166 179 218 -244 258 -230 -304 119 251 -97 -255 -210 131
6166 131 -9 94 308 184 231 -212 -86 166 329 -81 -72 29 98 11 -7 -248 12 -250 -8 146 -253 74
6188 74 -97 51 170 165 -295 101 96 -1 -54 -322 221 -26 -290 62 -137 255 280 -187 153 59 -136 -324 -38
6211 -38 247 -110 172 219 -64 92 -90 128 58 2 -138 170 53 57 -30 -169 -357 -240 293 186 -123 -212 -270
6234 -270 125 -89 -180 130 -141 -9 210 -73 60 -67 242 -13 107 -128 -43 15 157 -13 -37 94 -50
6255 -50 15 -388 2 264 -149 -164 -65 184 111 -332 -231 -247 129 184 151 3 35 -3 -127 51 275 60 -108
6278 -108 -154 248 117 75 -152 -254 -143 -112 206 64 125 38 163 170 84 -35 -155 51 31 -209 -53 -205 100
6301 100 -75 -2 343 -15 9 146 -29 288 122 -63 113 -5 62 20 -231 145 113 148 -199 110 215 -30
6323c0j2l06K76J00J58l68m0L06p6O9j93L23k42j4J94q7j46P2M7j31L10j57l4
6346A9j36K68k86j42K36K84l66K49k26J32J34K0k97n0P4J06j20J44k6L3k43N16
6368C23m46L15k3l55j11L08J69m37M34M9J7m79K09J47j79J31K34j74k82J38J33
6389A21K00J03o03J26J7j78L14Q1P0k69l2N8k09K16r8K92l63J18k27K18r1M2J59
6412F5l20L03j19K54Rj43l59M04k38K76jL06m76m2q2N36n11nL21m23P2J2L94m47
6436b14L55J29m90P1q2P0kO9j09L39k74K73r5j19K69k18O9k3K09k66N3l5J70j40
6460IKj88K10l33O84j84l03J53l1p7O8J4J69k66J32J18k52j05K03OP7q1n3l74
6484d02P08l61J04K9LK67n54L31k30J15K12n14M62k78o1q0M33k86P9l6K95j78
$$ plain form
6323 -30 -42 -348 -72 28 186 -182 -222 84 8 77 -116 207 -35 -49 145 58 -88 -16 31 -100 210 53 19
6346 19 -117 151 -135 -277 -41 243 -123 126 -100 32 166 186 -111 -161 -87 19 -101 43 17 50 -193 323
6368 323 -123 192 169 -186 -297 11 180 -257 177 226 243 -236 -27 120 -59 72 306 132 -150 -12 121
6389 121 321 424 -179 -53 -36 -214 100 181 251 -18 -50 8 -201 15 -83 209 -154 -36 -263 -45 -136 -94 65
6412 65 -255 48 -71 183 192 49 -310 94 -144 132 131 437 -39 -81 -163 373 -138 -143 178 -245 -173 -161 233 -214
6436 -214 141 270 -220 -149 -231 -161 -163 -94 -203 136 -138 135 40 -79 190 -28 41 18 227 -39 14 -21 149 9
6460 9 11 -177 33 -300 384 200 -103 50 19 -58 10 24 193 -73 59 177 -75 -180 23 29 106 25 -28 -402
6484 -402 306 -55 49 78 81 348 -206 125 -105 10 222 -292 170 -108 -169 -249 184 -102 -23 -59 236 58
6506E8l3k8l25M62k36M34k21j9o6M04j64m90L76K17k48q5J08q6K2j47L07l79j40
6529b79L07k45Q5L11k88R1j5l9r9L26j68P5j13q1M15m51O4K51j52l08L68j58m2
6552a45O3L0O7L9j7j1o8o1K53k5j38K70l10J49j78mM9R2j07K36J28l98N5L41k58
6577E2K33k24j17p6K91j11p3M8M5j73K31m45M33j58l32L36o6P9L20k53Q3l88N6
6600b09J81K67j79j78O2K11j88J1j7O2r8J73RJ4K3J13m22K02l00L77k50K13K1
6623I8q3R0J47l61N4r8O4l53M12l02O66l73r6M59j33j26q8J14n6J4j92J42O1k30
6647a70J81k79J74M14m28J84N8k84N4J27r5O0p2j43L00j56K44r9j51l3K49P2j15
6670I2J32k45j1L0k59L88j2k14M50l27j9k0N1p9L84k06j03k5J16k83N4J40Q2j42
$$ plain form
6506 58 25 -3 -328 134 -102 332 111 92 26 430 266 -224 152 369 121 36 144 58 80 -67 240 -139 -279
6529 -279 28 -217 -132 179 -109 -18 -33 -72 -171 155 -13 62 -51 -132 283 -168 -104 147 -5 -313 55 -103 -145
6552 -145 -82 -52 15 54 37 26 -42 -103 150 125 -13 257 -53 96 -82 -86 -37 55 -52 184 312 -86 -31 310 52
6577 52 285 61 -56 -132 159 48 -25 23 68 -105 126 -319 114 -44 -376 -40 -106 -27 293 40 123 -265 -209
6600 -209 -28 239 60 -118 -56 155 -33 -22 -39 23 -75 98 107 121 144 257 -165 37 -263 114 -136 77 98
6623 98 15 105 252 -109 -55 -153 -89 -442 -30 -332 334 -39 -135 324 191 65 -23 91 35 49 -143 -1 60 -170
6647 -170 11 -268 -94 320 -108 76 134 -150 -96 31 -64 -4 -76 -219 81 -75 169 70 -81 -114 135 207 92
6670 92 224 -21 -32 -2 -261 127 115 -99 351 24 5 -15 36 -43 341 135 32 7 123 -160 -106 34 116 -26
6694b6l12P4K19J18k2l32L79j98nK37j07k77N18k20J19k80J96J7J26l23N3N5M57
6717D66k62j82j97J88J01j52k09K78J34k64J75K2J38j32Q3l05j4r9K85m1r6K55
6739A72nj14J42k74J10N5k01r9K98j06o3p3J46nj98R8N74m01j88J31k84K17r7
6762a65L09j17R2j57J65o8k9k29J75j49J82J65j53J22k13m9J47k55K68PJ53k23
6784b2j41Q0J34O0M6k17K49j06j07K03l14J63JnK97j21K9l56K75Jk12J54m29M24
6808H6j66J97n45N11j52j4j1L95p6j40k66K16J82k01P8J2rj85L20k58j0J43q4
6831B3l56K47L73n14J28L75j99j84L22J3o35L99J08j81j28O8rJ1L53m4K7n93J95
6854b01J43m6K86j46k09L95l07O7k5O8J83m27M84j07j61r8K87l88L95j51l34N71
$$ plain form
6694 -26 -338 -264 -45 73 51 -281 98 -100 -105 132 25 -252 266 46 165 -115 81 98 224 -99 -46 9 466
6717 466 204 22 -175 13 114 -38 -247 31 165 -99 76 98 236 104 187 -118 -132 -231 54 13 -83 172
6739 172 167 53 195 -79 31 86 -115 -214 84 -22 -85 -158 -12 -17 -215 -117 457 56 -132 -1 -285 -68 -165
6762 -165 144 27 119 -38 127 59 30 -199 -24 -173 9 174 21 143 -70 -119 28 -227 41 48 201 -22
6784 -22 -163 -83 51 111 157 -60 189 83 -24 179 -135 28 29 24 321 200 229 -127 148 149 -63 91 -338 86
6808 86 -80 117 -428 83 -69 -83 -94 301 225 85 -181 35 217 16 94 106 97 -88 232 -26 -36 107 23
6831 23 -333 -86 287 -227 -99 276 77 -107 215 228 -407 -8 100 -81 -209 -141 -150 -139 214 170 197 -396 -201
6854 -201 -58 -104 182 36 -173 222 -85 -18 -43 25 208 -219 265 158 -3 -101 186 -202 193 42 -292 279
6876B79l48M0J18k01M28l61P7j80R1m5L11J39o96M03j21L3j59L21k52J19j22K3
6898a03J63m36J75K43l74M06p7J1J17j29P9o0l7j08M70n2j42L0l29K39J97j59
6920A24l61j04M7K74j35J84L4k28J68K7j46kL41k53J74J31k30O1n2K53m03L9M56
6943C99j55k20K46k14J59j75j2l63M08k9Q6j05M4m6j25K81K6j84K80l67q3k6J98
6966B3R9k41J42Q9k17J00j31J23j4R3K79k73k63J72j14L5n7K94N0l91L9k3J46
6989d0J84K14j57k10J77n8m20K81L77k54j45M4n1p2J35M5O3k21j87K65j3J3K9
7012aJ97k6r9P5k96K28j54J80m04L41K55j74k0r1j04K28k16o9L81L0l77j20K51
7035A5N6j27K3J38j99J64j94L04j71K06Jn8j16J43k2p0j67nl0L79k21j53L09k49
$$ plain form
6876 279 -69 -29 89 -112 316 -45 32 -148 -57 -102 209 348 -348 55 -66 -33 -192 129 -123 -4 -126 -103
6898 -103 60 -376 -201 42 -332 74 -3 8 125 -4 75 15 -22 -130 340 288 146 176 -153 86 283 124
6920 124 -237 -341 -294 -20 -155 29 63 -165 3 30 -116 -118 223 -30 144 275 45 106 54 307 -96 -57 399
6943 399 244 24 270 56 215 40 28 -335 73 44 130 25 69 23 -102 179 205 21 301 -66 -149 -175 23
6966 23 122 -119 23 112 -105 -5 -136 -13 -27 66 345 72 -191 -19 -133 -98 -155 139 189 -202 -163 -186 -40
6989 -40 144 358 201 -9 168 110 -310 -29 348 94 -51 -7 -58 -130 5 50 113 -108 -295 -30 -43 -30 -1
7012 -1 196 170 71 146 -150 78 -76 104 -300 41 296 122 102 11 -93 135 -81 -150 231 261 -116 -236 15
7035 15 71 -56 -33 105 -94 70 -124 180 9 215 216 158 42 185 163 93 -74 -79 -109 270 49 -104 205 -44
7059d4P6r9J24r5K07k18L0j96L68j09m8j90K22J8K4j12L34j98q3K32k16J11k90
7082a52O2R6m8J75l86M41j42K40j92j45J79K5k88K57l2j03J1l7M1J14q1o5q6M04
7106B88m27M44j47j63q9J21P9k33K99m25O05o50N56l81k1K57N3k37J11J25l13
7127a48Q1K95k2l30J47M7l7L6l04M50l26J37k27q0K19J20J23l86N06l38j43K68
7149H8l2j12Q4l2j84M53j49m33M23j37l63N37j59j53K87n1Q3l26J81O6l14K91
7171D8j4j78R6P2P7l7K3nq9J2K25l59K30p0j65K96j91j89J91l42N24k38q6K78
7195A09j89Q9j37M6L63l54k03L56j69j58j34N72J31m40L29p2j82j39L70N0l16
7216g8R7k99K0M41n1k29j24K39Q8m88M85P8k01P6k46J76M5OJ93o3l2j33N0k0J13
$$ plain form
7059 -44 32 -67 57 -38 169 -49 -19 -215 153 44 -4 -194 28 46 70 -42 292 94 11 243 27 138 -152
7082 -152 -90 6 -42 133 -253 188 46 286 94 -51 128 153 -135 122 90 -13 -2 -39 2 116 35 -30 -116 288
7106 288 -139 305 158 -5 -94 27 106 -127 172 -253 352 -298 258 -123 -144 113 166 -71 40 165 -148
7127 -148 -67 228 206 -124 23 70 33 69 -235 215 -111 26 -201 -281 -62 58 181 -205 301 -37 -180 88
7149 88 56 -56 28 -4 -188 265 116 -317 106 -31 -394 143 -16 -169 118 67 150 -176 5 71 -243 48
7171 48 34 -144 -48 24 101 64 87 82 -7 5 230 -129 101 31 -134 162 -29 -218 -27 -369 155 -83 -169 109
7195 109 -80 9 -128 -82 281 -73 -276 80 -89 -247 -381 191 322 -118 211 139 -43 -182 188 238 -78
7216 -78 19 -280 -260 181 130 -99 -223 16 104 -384 101 179 -22 54 -192 -16 29 35 228 165 133 0 50 30 143
7241A43j02J8m08L64r3j39M60j66o7Pj12L88k90J98j45J4k93M28j85j81K77j89
7263g3N9R4j57J25M1R0n33K34J46J58l88R2R5J9k32K79K9p7Q2%j93J92J33k57
7287d2j01P5J86J28o42O77k60j70oJ35j85P2K10m0j43L81l16K8J16J40k36R3l17
7310b17K47L5j44l5J29j57L0L29j70K7j19R7n6P9j74K13J80n0j30J31k89k3p8
7333a45J43J05k2O7j7j50N9l29K03K13l68L91l71N8J4p4K75j53J79r0L05o29K87
7356d9J11k8n5j66m1j49J06N28k57Q8J2k67N2J61M7m01Q69m53n2j77k3L40j38
7379E8J2k43j14M2L94k81LJ42J5J0k73K59K06l4j33L1L62m71Q8j87L4r9K15o9
7403c3L31m82k3L24k41m5j22O7KK04k22M23n6l43k50P10k35J18n1L4J98l93L22
$$ plain form
7241 143 41 59 -349 15 -78 -217 243 77 10 17 -95 293 3 201 56 70 -223 205 20 -161 116 -73
7263 -73 -14 80 -77 48 89 179 -354 -120 26 184 -204 -112 -17 2 -230 49 78 1 83 83 -110 82 215 -42
7287 -42 -143 -68 118 246 -396 281 21 -149 -155 -20 -205 -133 77 37 -106 275 -41 -13 103 243 7 100 -217
7310 -217 30 65 -79 -114 15 -142 -112 217 47 74 -45 52 -4 75 -99 114 294 244 114 245 -44 -67 -145
7333 -145 -2 103 81 148 131 -19 40 -289 -86 127 -241 150 -221 -163 -149 -223 52 -101 78 -12 293 -336 -49
7356 -49 62 34 -21 -187 -228 -377 -271 257 0 88 100 -167 -115 46 93 -308 561 108 56 -121 -144 196 58
7379 58 70 -173 -287 -245 149 -132 -129 13 28 38 -235 24 230 196 63 94 456 -15 73 -114 -80 -179 36 -33
7403 -33 298 -184 -207 117 -124 -169 -291 -224 -222 -18 -240 183 127 -216 -466 244 9 127 76 110 308 -85 237
7426B37k99j69O2k7K18k29J88r5J89j71K2K87j37N9M2l42L01j34M8L49n60L37
7448A76l70J15J74k06jK29r3r1n1P9k79L47J6q4j4K67l15LJ31j10J76R9mm51L74
7473A17o5L1l60J86J69K5q4o3J19J6J1k68K58q8K53l46K81k91k5L4K2nO3j82O8
7498a24J15j15R2O0j30K43L9m97L20J27l20KK36l03L62j43k0R1j39O6J33j28j32
7521a65q1k3J45J73M0m57L10p2J74k41K11O7j65J31j74L69J14l04R8k63M9n5l0
7544a49L84l53r0q1M8M20n36N02K7m32P1L32r3k43K11Q4n9k63K05j29K83j9k35
7567a15OJ41l48N75o5l31j92N46l34L66q7Jj88J84M2k87L87l28k90k4M91p3K98
7590C75m07r1L90n14J71j81K84k93M56j81J35k26LN4O6j82L37k36o6j63O1P4K34
$$ plain form
7426 237 -62 -231 -169 -196 22 -207 -19 -114 75 -96 -74 213 76 135 177 -165 136 2 50 399 -161 176
7448 176 -194 -79 95 -111 -112 117 24 -67 -118 -39 -318 29 45 -39 -53 214 -101 -98 33 -77 99 198 194 -257 117
7473 117 52 83 -277 -91 78 103 19 -44 75 91 102 -166 92 4 257 -89 192 -99 -124 -90 -68 -73 -10 -192 -124
7498 -124 -9 -124 -32 28 -102 141 180 -317 3 130 -190 -188 48 -255 107 -36 -56 35 -104 -38 95 -33 -165
7521 -165 -246 -269 -124 49 89 -368 -58 -130 44 -197 14 81 -84 47 -127 242 356 52 150 -113 -64 -119 -149
7544 -149 235 -118 -208 -289 -241 179 -357 145 172 -260 -189 143 50 -193 18 102 43 -220 -15 -144 139 120 -115
7567 -115 -109 32 -316 259 194 -137 -329 217 -117 249 162 163 -25 159 201 -86 301 -27 -317 -341 150 77 375
7590 375 -32 -123 267 -247 -76 -257 27 -266 190 9 144 -82 -79 -25 41 -141 196 -40 -106 -269 -208 -134 100
7613A00j86J71k66K09K62o7l5j81M0K1K26k40N0j96M78j32m67J70J6j8J61l25
7635b09J39K12O4p1j66k00L57j4J05k81Q6l6M4o1K8j45L04n6l7J69o0j59M2J79
7659B34n07K45O8j64K39N5j49j5k28J97j2L12k02J02j59j9J79k01K49l28K11l61
7681b54J10L13l8J09m74J97R9j13J05K20l23J7j43L66m32J78J48k37mL39j61K4
7703D6q7j93M39l51l8K57k87L66k79J37p0o9j05J36N6J08J25l33j25K73l84K40
7725a38k7J68J22l00J7J31N1J71K6k61K79j63k40K65l7J14m79K37j4l1M11n62
7747b60K35j09J63n7K1Pj01o6J82o0j32N61k59J03l47P4m2M09l76R3O4l32L10
7770H1j59N23k28o13K87Q1J6K50j71J72k0j26L2J24L1k02Qj11J3k44J50R3J12
$$ plain form
7613 100 -86 85 -181 28 290 223 188 7 47 68 294 54 104 -92 386 254 -213 -43 -27 -45 116 -209
7635 -209 -70 142 206 135 -31 -231 126 112 217 -64 22 -14 30 -31 -3 -148 156 100 63 232 172 13 55 234
7659 234 -273 -28 40 -124 115 170 21 6 -222 -25 -37 275 73 175 16 -3 176 -25 224 -104 107 -254
7681 -254 -144 169 131 240 -234 -37 62 -51 54 274 -49 -32 -175 191 -241 -63 85 -152 -156 183 22 46
7703 46 -41 -234 205 -146 -184 73 -214 152 -127 10 -60 -129 -234 -98 -42 66 191 -142 -267 6 -378 -138
7725 -138 -165 3 125 -175 -158 -27 24 195 221 -40 239 76 -164 101 64 178 -301 -64 -78 -109 302 -260
7747 -260 -25 -134 29 -28 -7 0 -101 -167 15 -45 -177 384 125 228 -119 -45 -87 322 -54 39 103 -229 81
7770 81 -78 445 217 -396 -109 -28 -12 238 67 239 219 93 125 249 280 78 86 -25 -12 -256 -106 -13 99
7793I9R4l14Q1O7O8j06K60l40L55j45n8q7j53PQ9J77j44K98J0m06J65J61k08J19
7817H9k7O3q4M8p7K03l25R4J58j55m8J30k04K02j12j65K7M7Q8J4O2j07M13n14
7841a80L77P4k40j10L87k0k23O2J60m26r8J37k36J28Q3j4K42N5k99K11r3k95K15
7864a03K26k21J59k94K06j47K41J09L0j67R7q2j73%L47l13J1J68K27j08j21J12
7886B04m50K34j95K38J42p0o8R8n2K08l16j02P7k4M2K80j01j11j11K6j42L31m10
7909b72L18J28j22j07M11k84j11L44k72J06k07J27r6j9J84j56j6P5J31j67nk40
7931b50K18M8M3Kk4ok94K44J11n4k27J31L5r0K13K47l44k04M83l78J34j57K44
7954A25j71j81P4k42L54j46J41K71o7k41j17L15K11k95m7J6k65N1J33j26K98l11
$$ plain form
7793 99 193 -121 -40 27 95 -11 249 -91 264 119 61 -26 -179 -172 -83 94 -50 248 258 -148 17 178 -30 89
7817 89 62 125 41 89 12 215 -110 -16 142 -13 -61 69 -135 67 -45 -210 -183 -136 -48 -34 28 -79 334 -180
7841 -180 197 271 31 -79 308 288 65 127 287 -139 -237 -100 -336 -208 -125 -139 103 158 -141 70 -23 -318 -103
7864 -103 123 -98 61 -233 -27 -174 67 176 206 39 136 54 -119 -119 228 -85 -74 94 321 213 92 204
7886 204 -246 -12 -207 31 173 103 35 133 81 289 -27 -129 -52 -76 -34 246 145 34 -77 -51 -193 138 -272
7909 -272 46 174 52 -55 356 72 -39 305 33 139 -68 59 -37 -56 128 -28 -44 31 162 -5 -10 -250
7931 -250 -32 16 59 61 37 31 -263 -19 92 38 -189 -58 -23 -113 100 347 3 -201 282 -96 38 -119 125
7954 125 -46 -227 -153 -395 -41 -187 -46 225 158 -83 -200 115 326 31 -16 0 -265 -214 -81 -207 91 -220
7976b20Q7J44n8P3M8k3J73l72J29J9J08l19J31J61j7l31L06J34j21J53k73r6K44
7999H0J31k64R3J29p5Lj63J05K25k42O5J48j64j72MK45k1l03M89l58R5Qj82J42
8023A8L93k19j52o3N8r0L84n23M5K07k51J12j82K05j45L37q4j5j9k14J77O6q1
8046c6o0j62J56J72R9l94J84O4r2k5M3J43l11M8L21N9j10m80P22k83k91K22J3
8069BK35j81k67M82m25M44m02K15R9l33J90n1j52j64N42j48Q3m75J83R5M8j14
8091i4j50J04kJ92N9J25m8k58L6R4p1J13j63K64l29K04k3k84J38J74j9P6J7j58
8115cl92L11J13J03J47o65K29K3m7M19k84K18j53k04J31j0J6j16o6M07l64j1J86
8138a2N7K2M7q8Q6j34j68J60O5r0J41K23m11K70l06L21k38K65k50R3k51J13J62
$$ plain form
7976 -220 -133 11 -47 26 74 51 224 -148 -19 0 108 -211 -80 81 64 -267 39 173 52 205 -68 -164 80
7999 80 211 -53 40 169 94 97 -66 39 264 22 87 235 71 -101 -97 148 127 -176 313 -45 50 58 -124 18
8023 18 411 192 40 -23 35 -55 329 -194 -149 58 -193 -81 -263 -58 -203 134 50 35 16 -198 -21 45 -36
8046 -36 -96 -258 -102 70 169 -225 -41 23 -69 -94 -51 92 -219 -171 150 209 99 -381 341 58 -233 -11 2
8069 2 237 56 -211 271 -154 290 -112 103 202 -131 59 8 -144 -308 234 86 169 -306 -123 -28 20 -94
8091 -94 -244 -140 -142 50 109 234 186 -72 -36 58 -13 100 -63 201 -128 76 53 -231 -93 81 62 138 155 -3
8115 -3 -395 -84 29 132 279 -386 -157 -134 -181 238 -46 172 19 -185 -54 -64 -48 -164 -230 177 -187 -198 -12
8138 -12 45 67 114 26 112 -22 -190 -30 35 -55 86 309 -102 168 -138 183 -55 210 -40 53 -198 -85 77
8161G7k8J68l90K56n7q0K01P7p3Q5j70J79l18L22k02k63o5M32k45J45q7N9l2j26
8185a35K79k32J68r8M6k6
$$ plain form
8161 77 49 217 -173 83 26 -54 147 224 151 236 66 245 -73 249 47 -216 -281 151 -94 51 -36 23 -9 -135
8185 -135 144 -88 80 -18 28 2
8191B
$$ Imaginary data points
##PAGE= N=2
##DATA TABLE= (X++(I..I)), XYDATA
0@%%%%%%%%%%JrJ6j6J6j7K0k7L3l5M3n1N9o9P7q8J00j14J31j48J67j89K12k37
34a25K64k95L30l67M08m52M99n53O13o80P54q34R26j031J151j291J455j648J883
53A007k178K559l071L802m945O994j1815M5189K3622q3804k6185M1741N1475j8302
67B6089m0425q523K6860J1582q053j1377J217K784M533J192n548j0203N620J8326
81A4074N058k5121k1780J6333L7784M363l8434l2296K0600M5853R706l9555l3362
94c6777J4948L9900J0742k8881k5574J0018K5860N894j9450j4880R852J9555M22
107A1629k2165j3915J7491K8221l600l4818j7802K6991L5587n017l7137j9758
119c4293K1317L0185K925k2243k0170K702K0666J6056p732k3850q476K0398J9572
$$ plain form
0 0 0 0 0 0 0 0 0 0 0 0 1 -8 8 -8 8 -9 11 -16 17 -18 25 -26 33 -36 41 -47 53 -61 70 -78 89 -100 112 -125
34 -125 139 -156 174 -193 215 -237 262 -291 322 -358 396 -438 488 -543 608 -683 772 -876 1007
53 1007 -1171 1388 -1683 2119 -2826 4168 -7647 37542 61164 -22640 -48825 -7084 44391 26089
67 26089 -14336 -22859 4001 15583 7530 -3847 -2630 154 4687 5879 331 -9872 -4252 14074
81 14074 19132 -5989 -27769 -11436 26348 30711 -7723 -40019 -19419 26434 36140 -3415 -36777
94 -36777 -21829 18071 28813 -68 -25642 -15624 10236 16130 -3320 -18200 -8348 11207 11629
107 11629 -10536 -24451 -6960 21261 17661 -17157 -34959 -7968 27619 22602 -14535 -34293
119 -34293 -12976 17209 20134 -2109 -22279 -19577 1089 17145 9413 -14437 -22913 -2515 17057
132A7057j0962k4685J251K7431R835k6284k3246J8523L4825j56l7365k2234K4662
145a1348L7449J55l5463k2830J6924L2293O101k2800k0316M953J9841J0153q472
158F640j5102l238J1537J0416n351j3982j129J6556R052j4981k0051P623K9120
171A7110R338k7912k7302J2245L6662J0929k9053k9281Q567L2444J3115k0211
183F651k4124J892K1312J1583j0527j5848m3J4083P151r804j1772L822J5907M440
197A4723j6039j5515P769K3585Q238k1322k2993M951K8309J4882j7996k8011j657
210b1076K5403J9679j0765k5470o459J9351J6893q356j9139k008J6744Q717j2506
223A008j4345O324J8585M223j8706j5873R137K2852O643j8532k0156L031K2821
$$ plain form
132 17057 6095 -18590 -17339 10092 19927 -6357 -29603 -11080 23745 23589 -13776 -36010 -11348
145 -11348 26101 26256 -9207 -32037 -15113 17180 23281 481 -19835 -14882 4959 15112 6640
158 6640 -8462 -11700 -163 10253 4902 -9080 -10209 6347 15399 418 -19633 -12010 17110
171 17110 26448 -1464 -28766 -16521 20141 31070 2017 -27264 -18697 13747 26862 6651
183 6651 -17473 -15581 5731 17314 6787 -9061 -9104 4979 12130 2326 -9446 -5624 10283 14723
197 14723 -1316 -16831 -9062 14523 22761 1439 -21554 -16603 11706 26588 8592 -19419 -21076
210 -21076 4327 24006 13241 -12229 -18688 663 17556 9200 -9939 -11947 4797 13514 1008
223 1008 -13337 -7013 11572 15795 -2911 -18784 -9647 13205 19848 1316 -18840 -15809 7012
236G012J4196j1781k2798o288J7874J9155l852k0342r974J3040J6688k459j6593
249f122n851J3349J1603r321j6215K308J9524Q364j6993j9791N631K4331J0562
262B1379j7140k1967Q18K1729J5155r122k1149o740J4712J6438j474j6521q910
275a2792Q775J3807j300j2251n097J0033R706o454j3863k10J5982J0207j1547
288D996j9248n11K0633J5284j1221k3383n445J9692J8397n877k1461q622J3588
301c178J6368j644j4707p096Q122R939j898r722k480Q234O646o444j0859o1J2621
316C841R396q042j6907l374J5999J5852n738k0513r332J4213J9102l79j9151j2064
330a7097R593J7219J337j4468q261P550J0871k600j1000j491J0372O311p419j1721
$$ plain form
236 7012 21208 9427 -13371 -19659 -1785 17370 13518 -6824 -16798 -3758 12930 10471 -6122
249 -6122 -11973 1376 12979 3658 -12557 -10249 9275 17639 646 -19145 -13514 10817 21379
262 21379 4239 -17728 -16910 4819 19974 10852 -10297 -17037 -2325 14113 12639 -3882 -12792
275 -12792 -4017 9790 8490 -3761 -8858 1175 10881 4427 -9436 -9646 6336 16543 4996
288 4996 -14252 -14763 5870 21154 9933 -13450 -18895 797 19194 13317 -8144 -16766 -3178
301 -3178 13190 11546 -3161 -10257 -2135 7804 5906 -3816 -6296 1938 8584 2140 -8719 -8780 3841
316 3841 13237 5195 -11712 -15086 913 16765 11027 -9486 -18818 -4605 14497 14118 -5033 -17097
330 -17097 -7504 9715 11052 -3416 -11677 -4127 6744 4144 -6856 -8347 2025 8336 917 -10804
344a0804R75J2693Q789p438j5452l877J2923J4440k006j6960j1072R119J7997
357I327L838j4926j3066N251J5103M309j1176r296N179J0690r35j0025l626R387
371C4Q593n777j3101j535J3626J0956o721j5840m688J2292J3750j313j4378r415
385a3517O128J4574M310j0015j1458J928J1064N379o804p600K420P784J006p410
399b211l700O470Q335l111j1314m711R903J3160j855j6059q927J0545J6586J107
413A4218j5387j1175O661J4527L470j0056q741K809Q165K306m734m111J562M712
427D226O1m685k952M305P246p14j0082n322P089J2256N77j2933j0697O092J5129
442I596M698j1632j2687K448J2759O709p968r898N58Q859L500n800m700L378N353
$$ plain form
344 -10804 -9829 2864 11653 4215 -11237 -15114 -2191 12249 10243 -6717 -17789 -8670 9327
357 9327 13165 -1761 -14827 -9576 5527 9836 -1340 -10636 -5457 5233 4298 -5727 -9353 34
371 34 8627 2850 -10251 -11786 1840 12796 6075 -9765 -14453 -2161 11589 10276 -4102 -13517
385 -13517 -7389 7185 11495 1480 -9978 -8050 3014 8393 1589 -6011 -3591 4193 5199 -2211
399 -2211 -5911 559 8894 5783 -5531 -10242 -339 12821 10966 -5093 -14020 -3475 13111 14218
413 14218 -1169 -12344 -5683 8844 12314 2258 -6483 -3674 4491 6797 2063 -2048 -486 4226
427 4226 4287 -398 -3350 955 8201 7487 -2595 -7917 -828 11428 12005 -928 -11625 -5533 9596
442 9596 14294 2662 -10025 -7577 5182 11891 3923 -5975 -5417 3442 6942 1142 -3558 -180 5173
457E173j674o775j901O278O599k823q998m323O472R973R79r850q878K845J1523
472D620O057p405j1396j045J0120O801l442r352k083O298N099l612m972Q97O342
487B927K28p024m113O168Q532j612r820n978O467J0411J606r166q484J921J0275
502B338N337n054r163k208P128O825j949o531k421M182L430j792l679R62M192
517A597N05m858l731M166O921Q05p811p008L452J0381M012p015r763R9R653O459
533G864m030q787k180N636N610r81m461j743K187K476j336k061J061L538o2m445
549a714l288L038O984J271o496o763J734Q525N355n196r067j911P757O708j302
564E635p435l771M104N330K8m121j759K449J753j831k126J763L309l47m126l603
$$ plain form
457 5173 3499 -3276 -5177 1101 7700 4877 -4121 -8444 -1972 8001 8980 -870 -9748 -6903 4620
472 4620 10677 3272 -8124 -9169 951 7752 4310 -5042 -7125 -827 4272 660 -4312 -3415 2927
487 2927 3155 -3869 -7982 -1814 6718 5106 -4714 -10692 -4225 6186 7792 -1374 -9858 -7937 2338
502 2338 7675 2621 -6542 -8750 -1622 5203 3254 -3277 -5698 -1516 1914 122 -3557 -2595 1597
517 1597 2102 -2756 -6487 -2321 4600 5405 -2406 -9414 -5962 4419 8431 1416 -8347 -8248 1405 7864
533 7864 3834 -4953 -7133 -1497 4113 3132 -1329 -3072 -885 1591 255 -1806 -745 2793 2731 -1714
549 -1714 -5002 -1964 5020 6291 -205 -6968 -5234 3291 8646 3450 -5617 -7528 229 6937 5635
564 5635 -1800 -5571 -1467 3863 3891 -230 -1989 460 2213 382 -1744 19 3328 2981 -1145 -4748
580d748K975O249K027n687o089L71P226N151l163p783l018N405O450P9o050l494
596d099J982M179J087k491j845Q58J186j058j361J407L096K28m058l832K094N987
612C360K588m594o591k72O229N531k249o153l625L626N864R11l896m135P47L211
628E52J476j593p74L63L07j138j078J764K503M46l774l347J336N371L191l403
644B202n849j817N009N348j54n589l921K009M918K194k830l208o10K080J410l50
660H42m28P9q5j284j145J464L207N69l205l744Q27M789L058k174n518j752L300
677a200N058O46l898l828N3M226K375j244k945r48P92J313K91j09L99o95j435
694a149q66J740K795O55k674l849J15L980L352j149m532l074K309N030J441l128
$$ plain form
580 -4748 -1773 4476 6503 816 -5273 -4902 2324 7475 4312 -3471 -6489 -1084 5366 5445 -605 -4099
596 -4099 -2117 2062 3149 658 -1187 -329 857 -201 -1562 -155 2941 3169 -889 -4721 -2627 3360
612 3360 5948 1354 -5237 -5509 720 6251 4002 -2151 -5776 -2150 3714 4625 729 -3406 -2659 552
628 552 2028 435 -339 24 331 -807 -1885 -121 2382 2828 -946 -4293 -2957 2414 5605 2202
644 2202 -3647 -5464 -455 4893 4739 -850 -4771 -2762 2156 4350 1520 -1688 -2298 -218 1192 842
660 842 414 493 408 -876 -2021 -557 2650 3219 14 -3730 -2903 1886 4944 2770 -2748 -4500 -1200
677 -1200 3858 4504 606 -3222 -3169 1057 3432 2188 -757 -1705 -913 400 691 582 981 286 -1149
694 -1149 -2015 -275 2520 3175 501 -3348 -3233 747 4099 2950 -1582 -4656 -2347 2683 4124 996
710I96l923m02L113K158k09j842j571K44O09R19M60L14m72k058r94J323K553J358
728B576k091m049m68L460L657l73l881l201J373M128J967j707l688j078J602K710
744I37M00r64j443r64K64J138J300O59j240j856j003J377K547J343j649l480r47
761c581K434L800L70k769l890L31L307K713n87l267j513J109J658J636l27j470
777d6j256j36Q38J674J018q91j934j966J466K817J517j670l040j377J994L456
793B464J103k350l220o10K582K998J69k556k328K59K102J163L78j221j298p75
809a140P97J670J265j78k548k015Q19K668J788n16l172k216J578L136J617j791
825A762k580j204J458K272J047j120k278j032R10K193R99j008j963j138P83J591
$$ plain form
710 996 -2927 -3329 -216 1942 1733 -109 -1680 -1436 -827 92 552 866 394 -1664 -2658 -1335 1218 2576
728 2576 485 -3564 -4032 -572 3085 2712 -1169 -4370 -2997 1131 3098 1391 -2297 -3375 -1773 937
744 937 1337 373 -1070 -2034 -1770 -632 668 1327 87 -1769 -2772 -1395 1152 2495 846 -2634 -3581
761 -3581 -1147 2653 3023 254 -3636 -3305 2 2715 2128 -1139 -2652 -1543 115 1751 1424 -46
777 -46 -1302 -1438 -600 1074 2092 1201 -733 -2699 -1233 1584 3101 1431 -1609 -2986 -992 2464
793 2464 3567 1217 -2003 -2613 -31 2967 3136 580 -1748 -1489 613 1776 2154 933 -365 -1140
809 -1140 -343 1327 2592 2414 -134 -2149 -1330 1338 3126 2610 -562 -2778 -1200 1936 3553 1762
825 1762 -818 -2022 -564 1708 2755 1635 -643 -1675 -765 1428 2427 1419 -544 -1682 -899 692
841F92J512n1j854k156k60K505K496n24k718k537Q18K655J717l04k942j756J116
858a591K185J416l71k509j185K67J811J497K24j952k158K72J828J766K5j993j770
875b238O1J390K174M37k081k347j32K207K626L5k619k001J12J872J765j02j318
892a59j710n72J971J477Q21j779j895m93J459K403P12j577k730m83J504K318R37
909B204j774k336m20J160K065J392j606k139j115J552K374P78j631j984n03J160
925h23J933O81n78k252j246Q03K077J901j340k198j068J032K190J421r63k346
941g76j514J586J880Q65n98k003j194M51K098J299j41k730j424R17K292J225p57
958A476j621j428M66J662J582l27k023j880O06K027J712m87j875j668J48K093
$$ plain form
841 692 2204 2153 299 -1857 -2117 388 2884 2360 -358 -2895 -2077 578 2295 1991 -951 -2707 -1591
858 -1591 594 2010 1639 -870 -2055 -1788 23 1520 1744 -208 -2366 -2094 -266 1500 1525 -468 -2238
875 -2238 -2177 -787 1387 1824 -257 -2604 -2736 -529 2097 2132 -487 -2488 -2376 -504 1261 1159 -159
892 -159 -1869 -2441 -470 1007 1828 49 -1846 -2339 -880 1523 2235 658 -2072 -2555 -1051 1267 2204
909 2204 430 -1906 -2326 -1166 899 2291 685 -1454 -2569 -1017 1357 2135 504 -1480 -1983 -823
925 -823 1110 1791 1213 -1039 -2285 -1482 595 2496 1156 -1042 -2110 -1078 1112 2533 1570 -776
941 -776 -2290 -704 1176 2041 1443 -560 -1754 -1303 795 2094 1953 -777 -2201 -1284 1008 2233 1476
958 1476 -145 -1573 -1107 555 2137 1810 -213 -2093 -1487 540 2252 1765 -110 -1778 -1630 463
974D63J685n10j622j470J84J751J229N06k147j609l54K194J577J43j927j538j09
991a554J453K086j97j517j517r81K200J747L96j794k117L60J431J527K93j290
1007E26k206l04J338K146N53j729j667m59J446J769N82j498k155o45J697J850
1023A244P28j460k045m09J148J920P69j318j775r96R16K434Q41j092k227q01J093
1040a030J807Q86p14j994j081M27K357J247j044j778j125O85K060R43o09j989
1056i52j144Q11J913J158p07j383j695R06J736J347q35j720j355L49J967J583
1072A979q07j661j111N20J576R35P3j819j659K05K129J653k90j945j485J70J869
1089C32J245j78j553j412R6J370J521R5j211j830o5J473J987k5j670j773J56J094
$$ plain form
974 463 2148 1638 16 -1454 -1270 481 1710 2216 69 -1540 -1894 300 1877 2020 93 -1445 -1554
991 -1554 -101 1985 1788 271 -1246 -2227 -27 1720 2116 322 -1795 -1435 -4 1523 1816 526
1007 526 -1680 -1984 -646 1500 2053 324 -1343 -1802 -356 1413 1995 497 -1658 -2303 -606 1244
1023 1244 1972 512 -1533 -1942 -794 1126 1895 577 -1198 -2194 -1278 1156 1997 905 -1322 -2123 -1030
1040 -1030 777 1663 949 -1045 -2126 -1699 658 1905 861 -917 -2042 -1357 703 1646 1037 -952
1056 -952 -2096 -1285 628 1786 1079 -304 -1999 -1093 643 1990 1155 -565 -1920 -1571 396 1979
1072 1979 1172 -489 -1600 -1080 496 1431 1504 -315 -1974 -1769 360 2013 1723 -222 -1707 -1537 332
1089 332 1577 1399 -154 -1566 -1470 -100 1421 1516 305 -1525 -1590 -117 1870 1845 175 -1598 -1442 -348
1107c48J718M60j705j401o94J636J917L11j782j533k24J772J401J67j078j682
1123a065l57P61K128K78j227j366q32J208J577L87r78j313q43J163J303J021p26
1140A119k287p88J273J662R71j256j589p39J054J425M50l93j881n45O19J766O68
1157A529m34j723o01N15J150J107n06j575r95L23J752J091n79j795o97J09J948
1174F19J070m25j796j046J64J674J185l55j646j134N57J632Q58n96r23j158L91
1191i29J033R49j37j090j164k96J343J680P0j920j200M38J217J297l74j049j208
1208a340j6J489J096o9j104j558K43J107J490l01p05j308l22R96J258M38r58j143
1226g07q50Q32J642N72q93j818m42J069J782M14j657j142m18J500J065Q5n67j299
$$ plain form
1107 -348 1370 1830 125 -1276 -1970 -334 1583 1894 112 -1421 -1645 127 1528 1695 617 -1065
1123 -1065 -1422 -661 1467 1745 518 -848 -1680 -472 1105 1492 514 -799 -1642 -479 824 1845 1119
1140 1119 -1168 -1956 -683 979 1950 694 -895 -1634 -580 845 1295 902 -979 -1524 -905 861 1529
1157 1529 1095 -628 -1229 -714 436 1543 1037 -538 -1533 -1210 542 1633 1054 -741 -1438 -1329 619
1174 619 1689 1264 -532 -1578 -1414 260 1445 1090 -556 -1690 -1133 499 1357 761 -162 -1320 -929
1191 -929 104 1053 916 -174 -1338 -1634 -291 1389 1459 -461 -1661 -1223 -6 1291 917 -132 -1340
1208 -1340 -1356 133 1229 1160 56 -1502 -1259 -152 1338 1037 332 -976 -1298 -302 956 1394 436 -707
1226 -707 -1557 -725 917 1489 596 -1222 -1664 -595 1187 1601 -56 -1198 -1616 -116 949 1034 467 -832
1244h32k28O68J031P61o27j468k76K31J599Q49p31j564o66N16J550O93n55j912
1262i61p32J008J473P47p62j395n53Q20Q37P77p11j427j57O10M55R97m09q14j043
1281a240K77J367Q51l15j419j131L13J599J080P4k007r31P26R27J300o69j202
1298d00o48J87J249Q81l89q05r18j59J186O45M8q10q84k67Q06J177J08q85j340
1317a218n72J664J404L22j730j379Q22P96J179l11j080q92L22R68M95j27j82r29
1335d48m99Q97P04N59q45j310k34R06J277M13q98j242n94P37J702K87p75j895
1353a258M23O08J387j90p52o64k34O17O63K25o0r24j99k94R39R76j43j200q34
1372i14M53Q74Q35m39j206o69K35J621N58q05j046m30O11R66P06q71r32l76L31
$$ plain form
1244 -832 -1060 -392 639 1400 773 -695 -971 -740 859 1708 977 -587 -1253 -737 813 1506 951 -961
1262 -961 -1693 -685 788 1535 773 -622 -1175 -355 482 1259 548 -879 -1036 -426 29 1026 617 -197 -1240
1281 -1240 -963 404 1255 940 -479 -1610 -1297 302 1382 1456 -551 -1482 -756 171 1471 802 -400
1298 -400 -1048 -861 388 1269 880 75 -843 -1002 184 829 877 67 -817 -1084 -278 899 1007 122 -1218
1317 -1218 -1790 -126 1278 1600 -130 -1509 -687 109 1288 977 -103 -995 -673 295 790 663 481 -448
1335 -448 -947 -50 654 1213 368 -942 -1176 -270 1007 1420 522 -720 -1314 -577 1125 1412 637 -1258
1353 -1258 -835 -227 1160 970 218 -446 -680 -63 600 825 765 -159 -358 -652 287 1263 1120 -80 -914
1372 -914 -461 413 1248 809 -397 -1066 -831 790 1348 543 -503 -933 -322 644 1350 479 -453 -829 -498
1391d98P92L17j4p64o74l28J103Q92m5q49j068o4J162J071n5j504j001N15J187
1410A75N59m72r24l23J37R84L71l36m43p24J07N34O91K17j076m71j40P44P12M68
1430G90o25j093p13J050J353J42j160j065K88Q63J285m65j117m71K09O58M42k25
1448A46j39r66J43J54Q57P2n6q95k61L06J101L23l02j037n21L02J608K7p11q24
1468f73n03R19J019K02p03r44J28O55M30R4l93l25m22J78O16Q52k94q91n08J50
1488d13J123M80l47q69o33L53J164N75q96m09n48M37R19J61l18j004R2m0Q02L09
1508I38J12r44m19M51L06O28K67r39n93J62K23R44m18m28p67K53N77Q11m01j013
1528b50m51P61N61J98l00n57l53N1O05O52k00k81q82K75J59L24L41m33p10k99
$$ plain form
1391 -498 294 611 597 -167 -841 -1169 -66 826 781 -68 -1136 -1200 -38 1033 978 -526 -1527 -1012 175
1410 175 734 262 -662 -985 -848 136 507 171 -272 -996 -889 -355 336 553 -523 -994 -1134 -390 322 790
1430 790 165 -928 -1641 -591 762 904 -256 -1321 -1033 -170 1115 650 -467 -938 -729 -71 371 146
1448 146 7 -959 -816 -662 195 267 211 -684 -945 -639 462 785 483 -554 -1075 -773 835 862 151 -673
1468 -673 -1176 -257 762 964 261 -683 -555 100 530 624 231 -94 -516 -338 278 1130 836 -55 -563 -413
1488 -413 710 1190 843 -26 -659 -306 858 1433 537 128 -420 17 936 1097 779 -225 -133 -173 629 938
1508 938 1050 106 -313 138 444 1072 1339 400 -193 -31 192 1136 718 290 -477 -224 353 1164 763 -250
1528 -250 -701 60 621 819 519 -38 -391 -340 265 917 717 436 -446 -171 -12 312 653 220 -490 -789
1548g89L85J223l24n75r60K38P08Q24m32o44n10K9P24M21j1o92m05O7M74L41J75
1569B67n54l36j98K29M60M81k86q82m55P78M28L55m84o88r3N32N68Q7k82n33j48
1590g54M38N67j68n90j87j7M16J02M06k23m43n26N01N97J58j74p36l48N84O64
1610B67J27j51l72m62L51L48N60m81p83j31N80N59K81n76j04o6k73O88Q0k86k46
1631i0k3j12J95M20L50o37p40K29O08N65k92m97l99K65O41K58j50m11m22QP89
1652E55j23j95k46j86J11J66M00L6k93n64j59N27N12Q8n96m36n5K80J007k81m05
1673A43p23r4R79J03J23o37k97J3L39M31J93l81o51j17M05P34l31l54j19m33O07
1694f7M05K47n05n65K3K74N12K6k29o38L20K6M18K33n46m64N1M93J39J88j40n22
$$ plain form
1548 -789 -404 819 495 -80 -1040 -802 -94 730 298 -346 -856 -827 -103 318 307 -385 -790 -723 -249 92 267
1569 267 -287 -623 -821 -592 -132 349 63 -819 -1274 -496 -68 287 -197 -885 -978 -446 122 209 -73 -606 -754
1590 -754 -316 251 83 -507 -694 -711 -295 -193 213 -10 -453 -979 -478 119 277 103 -633 -981 -397 267
1610 267 394 243 -129 -591 -240 108 668 187 -596 -727 -147 412 693 117 13 -53 -326 362 442 156 -90
1631 -90 -113 -225 -30 390 740 103 -637 -408 200 765 473 -24 -423 -158 483 741 591 180 -242 -234 555
1652 555 432 237 -9 -195 -84 82 482 518 225 -339 -498 29 541 629 33 -403 -458 -178 829 548 143
1673 143 -580 -674 305 408 531 -106 -403 -390 -51 380 573 192 -459 -576 -171 563 232 -122 -241 -674 -67
1694 -67 338 585 80 -485 -462 -188 324 350 121 -517 -197 -171 247 480 -66 -530 -479 14 153 341 201 -321
1716c21N3M39j98L56k2n39j73M85L76J62o68l78J86J2N75L74n07l67L0J26L34
1737C35O40r08j16j82M10L52J80l71l35j63k9O86L72l89l88m38J60P47J31l21
1757C73k75l46J2O58M74p51l49j9J95J40J29Rk93k26j00O98k6J78n47j54J25q6
1779a81L93L7m64k18k18P81L07k37m26l32j09N13N89m65j28l51k82P07J56k29
1799a57k28o01K48N40P2R4l44n8l90O03L05m4m35m30j49P79J16K57o09j94k10
1820h35L91L68J66m20l62m9M84N55J40q77j85rP4M92J86l36o45M80J68L82J80
1841C48l84o84J32K79M96K06m67k78k33n1R93O8r7o30l5L60Q4L62N6j003R1J55
1863b32P16L17m27n05q4M24J41L37j58m45j8Q0M59L29l62o68J13K02N82M0k87
$$ plain form
1716 -321 -268 171 -27 329 307 -232 -405 80 456 618 -50 -428 -242 -230 345 719 212 -155 -125 1 335
1737 335 975 67 -49 -231 179 531 711 340 5 -158 -187 499 871 482 94 -344 -184 563 694 373
1757 373 98 -248 -236 422 896 145 -204 -223 -28 112 241 250 -43 -269 -369 329 303 481 -66 -220 -95 -181
1779 -181 212 249 -215 -433 -651 130 437 200 -226 -558 -667 -154 435 -30 -158 -509 -791 -84 72 -157
1799 -157 -385 -986 -738 -198 -126 -32 -376 -434 -824 -221 84 40 -395 -825 -974 -195 -79 178 -431 -625 -835
1820 -835 -444 -76 90 -330 -692 -741 -257 298 438 -439 -624 -633 -559 -67 119 -217 -862 -382 -214 168 348
1841 348 -36 -720 -588 -309 187 393 -74 -352 -585 -636 357 425 328 -302 -337 23 107 469 525 -478 -387 -232
1863 -232 484 801 374 -131 -215 209 350 687 529 84 66 146 605 934 572 -96 17 219 801 841 554
1884E54k20k08L76mJ36M0l55o17N98L88L58m44j43o28M08J91J16J11k25n67J50
1905A5N58K29m14j37k04K3K92L36M8p96Nj67O48K69l41l05j77J73q0L83K4j51
1927B31p62K17L12M45m94n7m34O9N83j37L00k85m87l39P74K16M66j161k66J83
1947f26K78N31j22k42l07k50P6L15L16k20l62mM7L36Lj35k28j93R3O50%l65l72
1970g81j1M35K18K22m73k16j15L50M24n1j82l21j99L35M78J55j32l36o07K59N37
1991a1J63j09m53l14K49P71L45l20n11l05J98P69r0J9l40n46j8N39K6J99n7p16
2013e12L64L65J07J83l36m38J67M47L30k52m22l95R6N92L39m46l25j07L12K56
2033C25j8L4n50J11j68L05M49K1l07o8m74J18N80J4o2n91k22P26M06m11k46m14
$$ plain form
1884 554 334 126 502 498 634 674 319 -298 300 688 1046 602 459 -169 239 430 546 657 432 -135 15
1905 15 573 802 388 251 47 70 362 698 746 -50 -45 -212 436 705 364 59 -118 55 -25 358 382 231
1927 231 -531 -314 -2 443 -51 -108 -542 -473 110 -27 273 -12 -499 -838 -64 152 618 -543 -809 -626
1947 -626 -348 183 61 -181 -488 -738 -662 -347 -31 -251 -613 -617 -570 -234 -231 -366 -594 -787 -694 -44 -44 -409 -781
1970 -781 -792 -357 -139 83 -390 -606 -721 -371 53 2 -180 -501 -700 -365 113 268 136 -200 -807 -548 -11
1991 -11 152 43 -410 -724 -475 296 641 321 -190 -495 -297 472 382 401 61 -485 -503 36 62 261 204 -512
2013 -512 -148 217 324 507 171 -267 -100 347 677 425 3 -392 -296 296 635 189 -136 -243 69 325
2033 325 307 341 -209 -98 -266 39 488 509 202 134 -340 -222 358 372 310 -281 -503 223 629 218 -28 -442
2055d42L57K94M7J16o29j75R1O09K00j61j46l17K43k01J33K51J4m55l47J27N87
2076A96K70j23o68k29P07K18L05l75n07j55N77r4Q1l80k4K1o3N74k00p1K76m60
2098a24r5K88j11M33k83o43lP14O86m33m53l47N0Q27J90l68l57o5l2L04M04k96
2120B86l51K40q5N00j69k32J7p8p5j34N69N7p1o35p1K82O64m4l91o46K21R02j10
2143F46k94l53j45K83J96j18l80K67j34J62j6m70L44J91l0n09K33K48L16J41p51
2164a73l72J17P93K42m85p65K82J86M66J50n12o96M38O05k85k45l43K19L44ml47
2185c85J52j02J79l17K6K00L38J41k64p77N4Q57L87o86o46Q3K02Q29l82k08l29
2206f48J38N89j81l89J00J19J48k45M5O6K21K40o81l17N93M95L72p76o24K04J84
$$ plain form
2055 -442 -85 209 256 372 -257 -432 -341 268 468 307 161 -156 87 -114 19 270 284 -171 -518 -391 196
2076 196 466 343 -325 -554 153 371 676 301 -206 -361 216 122 203 -177 -201 -180 -243 331 131 60 336 -124
2098 -124 -219 69 -42 391 108 -535 -538 176 862 429 -24 -371 -321 506 696 328 -29 -94 -126 178 582 286
2120 286 -65 175 90 590 421 189 206 128 53 -81 488 545 474 -161 -232 50 714 670 279 -367 -146 756 646
2143 646 352 -1 -146 137 333 215 -165 102 -32 130 114 -356 -12 179 149 -360 -127 121 437 578 -173
2164 -173 -545 -428 365 607 122 -643 -361 -175 291 441 -71 -767 -329 276 -9 -254 -597 -378 -34 -38 -385
2185 -385 -233 -335 -156 -473 -447 -247 91 232 -32 -809 -755 102 489 -197 -843 -760 -558 271 -111 -319 -648
2206 -648 -510 79 -102 -491 -391 -272 -124 -369 -324 -258 -37 203 -478 -795 -202 293 665 -111 -735 -531 -347
2227c47J244j008m52k24P50M79Q6n92o55M60P57j93n88L37M13k12m33J7K62L30
2247D31J65l43p05M05N11N40o01q50j84P94J135n61n34o19O28M62J48n11p52O57
2267B16L30K95m22l52N48K1j58n08R6M04M89n22p90o2J213J59j89j147j25O95
2287A91N93L6r80m07O64P33j76l89l70PO63k68l81j5O68K19p56J23l68N40L54
2308F81k30j157J09N07R27n12q60l01Q57Q13l15q93n64N86N07L72q25m83L31N94
2328A44K5m40l21O12K54j43r82k5J111K46m20o55k03N58R12n37o53o82L59J120
2348B80J09n52o95k1R94L19p90m12K80O33l19l89k30O78O08k99q62p0M63R36Q2
2369G43j192q02P97J103J12j201m97N91R15K68j066l43J41P38K1p75R5j4Q09P0
$$ plain form
2227 -347 897 -111 -563 -787 -37 442 528 -64 -719 -259 498 305 -283 54 467 255 -178 -161 101 431
2247 431 596 253 -452 -47 464 1004 403 -447 -631 163 1298 737 203 -416 212 674 822 311 -441 216
2267 216 546 841 419 67 615 636 478 -30 66 470 959 437 -353 -415 798 957 768 -379 -504 191
2287 191 784 820 -160 -567 97 830 654 265 -105 -98 565 297 -84 -99 569 788 32 155 -213 327 681
2308 681 451 -706 -597 -90 837 325 -535 -836 21 834 519 -374 -938 -352 155 527 -298 -781 -450 144
2328 144 169 -271 -592 20 274 131 -851 -876 235 481 61 -594 -797 -239 673 136 -517 -1199 -840 280
2348 280 389 -163 -858 -879 115 434 -356 -768 -488 145 -174 -563 -793 -115 493 194 -668 -738 -275 661 743
2369 743 -449 -1251 -454 649 761 -440 -937 -346 569 837 -229 -572 -431 307 328 -447 -352 -366 443 513
2389E13p62l89O06L67K28r78k39M52R71L0j170m78L66J582k72q99r42L79J246
2408F11K69j068m00J93N55N45n86o79M72O63K3o10l54N66L41J46q19m71N27P22
2428F46O9o54r06N79R28L13r26p83l6J458K57n35j025K25P03J24n65n28K81O86
2448C11K12p80l12J72J285l64o37q65R46N91M46j293m99J95J145M09j051p20N1
2467g58J005N40q50q46Q19N17K3m45q22M61N81K48n34p49M33J020P9q80o44M15
2487c87J045K78o86q02j38J059N04o77p28l5R02M37l81p25j09J047K32p96n22
2506d82K97Q93M05r07q42M40Q89P4m40q77l1J307M66j089p74k86J117O45p82n28
2526e05l62J116P94q47o67K10M89N48n80q53M66P58L59j114m24L49Q03O46j375
$$ plain form
2389 513 -249 -638 -32 335 563 -415 -654 -202 769 799 -371 -849 -483 1099 827 -72 -1014 -635 611
2408 611 880 -188 -588 -395 160 705 119 -560 -88 575 598 -12 -366 200 541 687 -132 -603 -76 646
2428 646 715 61 -845 -266 662 975 49 -734 -770 688 945 410 -615 -390 313 437 -128 -656 -375 311
2448 311 523 -257 -569 -397 888 524 -113 -978 -32 559 1005 -288 -787 -592 553 962 -89 -809 -758
2467 -758 247 787 -63 -909 -90 427 450 5 -817 -356 225 473 -61 -810 -377 643 722 -158 -802 -387
2487 -387 658 936 250 -552 -690 369 873 196 -532 -567 335 772 391 -334 -443 604 836 40 -482
2506 -482 -185 708 1113 206 -636 -196 693 767 327 -550 -581 726 1192 103 -671 -957 160 805 23 -505
2526 -505 -867 249 1043 196 -471 -261 228 776 196 -657 -191 567 926 -188 -612 -263 540 1186 -189
2545a89o36j18J366P65q22j143k02R81O71k33j011n8O22Q04m80j008k62J135L09
2564D91m39r02K6J051N11p54q87p7R14J131j052j038J99P46N53m41j185P8J135
2583F0Q65q82o27l53P80N14j49p63k75O22R66p45j000L20P94N95l85j212j30J378
2603C73N97r19j247K33J194O23m64o14q58R10J015m60r10o00R38O15K6r42p1P42
2623A81O37l86r47k26Q99O48l53r08m28R80P96j77j305J8P46N49L1j236j37M12
2643b06J506n46r13o43P92J126m84r08k48P13O98k56q25m16J043K67Np93n84P54
2663H2J348p18j279J29N56P24j34r75m22N96Q41K99j187n54O42R31l85m50m77
2682d33K87Q82J09j383j06P03R68l15j184n50J013O22q8r01m75R22P47j15n93
$$ plain form
2545 -189 -825 -943 423 1188 366 -777 -979 2 673 440 -571 -629 -7 797 317 -691 -953 182 491
2564 491 52 -850 -824 227 738 -16 -903 -980 -66 1065 13 -1025 -826 -80 473 32 -1153 -1075 60
2583 60 925 43 -584 -937 -157 357 208 -555 -830 -208 758 13 -987 -667 127 722 337 -875 -1005 373
2603 373 970 51 -1196 -963 231 854 390 -224 -1082 -172 843 383 -527 -1127 -189 426 452 -490 -561 181
2623 181 818 432 -515 -741 158 806 453 -455 -883 97 893 716 -589 -571 175 724 755 -481 -618 -206
2643 -206 1300 754 -159 -802 -10 1116 632 -276 -524 189 887 631 -194 -610 433 700 705 -88 -672 82
2663 82 1430 712 -567 -438 118 842 708 -267 -689 -93 748 1047 -140 -694 -52 879 494 44 -433
2682 -433 -146 736 845 -538 -644 59 1027 712 -472 -1022 -9 613 525 -376 -851 71 818 703 110
2701A10p62L90J110k64r72n28O36R94k79p05o43P75R37l69p49m31N53P96qj142
2721e51p84R36Q01L43j361l80P72P10J17r31p53N41R67o4l68j006L68Q02L83n85
2741d3p19M10R41j78p72m78M11R31L0j121m13N44R81J83p67l91J3R05k8m14m87
2762d62k13J093L27p62o76M26M81M71q11m96N20P48J77r18q45M83P77O44r00q00
2782g36M12O16N14o78r13L12Q24L84q86n23M73M98N82q57n09J62J008Q2p09o60
2802f04L81P06j00m91n39J85J284J32j007l68j4Q01L05m90p02R7P44P5k27n88
2822d20q4P66L18j95j139K29P05L59n10r45N80Q77K43o04q10j07J189J51j80j133
2842g10L22Q23O40j147n80P4N51O99m22o54J77M23N16n80n06M7O86L84p00p78
$$ plain form
2701 110 -652 -262 848 584 -388 -916 -280 714 435 -270 -913 -138 799 430 -319 -750 -197 599 591 -551
2721 -551 -1335 -399 402 745 -616 -996 -224 486 603 -328 -1081 -540 427 363 -5 -1011 -643 159 542 -43
2741 -43 -762 -352 589 411 -361 -839 -428 503 533 -588 -1001 -457 524 707 -60 -451 -438 467 439 25 -462
2762 -462 -675 418 745 -17 -693 -267 214 685 -126 -622 -102 646 823 -95 -940 -457 320 964 64 -736
2782 -736 -324 292 806 128 -785 -473 351 735 -151 -674 -201 297 879 22 -487 -325 683 765 56 -604
2802 -604 -223 483 383 -108 -647 -462 822 954 -53 -421 -435 366 671 181 -521 -424 320 395 168 -420
2822 -420 -504 262 580 385 -754 -525 180 539 29 -916 -336 541 784 180 -630 -737 452 603 423 -710
2842 -710 -388 435 1075 -72 -652 -578 -27 672 250 -404 -227 196 712 132 -374 -327 359 743 43 -735
2862g35K63J068K44p43n06j35P49P19p20j092O90N55L51n72m12k33O80N62l67
2881C66r33K78M28O01n23o47k1N09O65q38j16k62Q57M85m81q48J74M40N94n27
2901B01o75j26O48N32l31o55l3N78N30l81j040L03Q00ok25n75J1N46M42l47n90
2922c93k87Q87K69l16p03m0O34N86l86o10k62P04O43l23q02O0M26Q7L6o11p7M29
2944d9P39l05n19p93R32O05j46q23K9N19L82m85p52J40M79K95J60o77n98Q24O66
2965F23k09p52j89L07O51M8j014L81J08N32j27m92J8K36L02l49p56K74L98K70
2985B60k73j38k88M76M53n3r55K2N73K26K28q09l10O18J22J1k74l42M42M12jr64
3007e64J89L61M74j84n79o2L86M19j70o98k30N72M51j46m26l26N14Q8L58p32p6
$$ plain form
2862 -735 -472 596 840 97 -409 -544 205 924 204 -888 -198 357 708 136 -276 -509 171 733 366
2881 366 -567 -289 139 740 217 -430 -451 58 723 -115 -231 -493 364 849 368 -480 -306 134 728 201
2901 201 -474 -600 48 580 249 -406 -439 139 669 288 -752 -449 351 345 120 -455 -444 102 544 197 -393
2922 -393 -680 207 476 160 -543 -583 51 637 251 -359 -621 83 726 403 -399 -339 87 174 210 -401 -478 -49
2944 -49 690 385 -134 -927 5 610 464 -359 -330 189 571 86 -666 -526 -47 248 408 -269 -867 -43 623
2965 623 414 -338 -527 -220 431 479 -535 -154 -46 486 359 -133 -115 121 423 74 -682 -408 -10 260
2985 260 -13 -151 -439 37 490 437 -518 -496 77 303 531 -278 -588 30 152 163 -111 -453 -11 401 400 -564
3007 -564 -375 -14 460 276 -303 -365 21 440 270 -428 -658 -86 365 219 -207 -533 -19 69 427 -305 -381
3028c81N80k5J24l70m88L09R28m54l05j10K20M64l28j87l51M66M23k21n29m68
3048g03L40O94K81p00q03Q45K10K72m51l06L83N67l35r1n39N28L26k97l24k76
3068c79K43O72j63o56R6j53P07j71j35p41N91J41L74l60k84J14l2O06l48l30n
3089b13L52mk31j14J46K95Jl25j17l0P58N6q86j89N01J79J00l81Pj38N91L54o56
3112E6l70J55L12j05k61l08N62p2j4r1j56P2M26nk32j81J91L25K8n59k14M42L30
3135C31kl46l11K41M18Q9k11k97k03K33L24j40j75JK47o1m1k35J07N1L68l33k84
3158b29J79K72K37l60l26k2M07K11m99Q5k69N01M82l66n08m2M92k21J43l50j29
3179c12M67N6m96r0L27K23j0j78l75O3N96Np5k97k77N87P1j22l69j23L82J67k64
$$ plain form
3028 -381 199 174 298 -72 -560 -251 677 223 -82 -192 28 492 164 -23 -374 92 515 294 -235 -703
3048 -703 -363 331 612 -88 -891 -46 164 436 -15 -321 62 629 294 203 -336 192 518 221 -103 -379
3068 -379 -136 536 373 -283 -187 -340 367 196 61 -680 -89 52 426 66 -218 -104 -136 470 122 -208 -213
3089 -213 139 135 -96 -210 -64 231 232 -93 -210 -240 518 574 -312 -501 0 179 279 -102 -95 -233 358 712 56
3112 56 -314 -159 153 48 -213 -521 41 -31 -45 -136 -292 -220 206 201 -31 -212 -21 304 332 -227 -441 1 331
3135 331 329 -17 -328 -87 331 420 209 -88 -291 -58 266 126 -49 -48 199 138 97 -138 -31 20 388 55 -229
3158 -229 -50 222 459 99 -227 -249 158 369 -130 -45 -314 187 669 303 -205 -247 245 24 167 -183 -312
3179 -312 155 211 -285 -375 -48 175 165 -13 -388 -325 271 276 201 -96 -373 214 285 163 -206 -329 53 220 -44
3202d4J23J51m22O12l21k76P4K48L1j42k60K00J20N7k21k29N0N57j93n4j10k47
3224b96N28O1L7l05j30K63K28l58j02j99M81m4J9l22OJ74K13m19O3n9J20J0J11
3247H0j60j05P3J49L22q55J52M76l3n8m4l50N21Q0j73j97q2J45N5n3j80J62K6
3270d9k09L59n73Q6M54M5j37j60RJ96K53k93On20N23n1L94m19k23K35K46n29N81
3293B24n08J04K05j14r8N5J18J34n0l80j76O29K12m78J0r1M2K63R3N0m14j81N45
3316A94j33rJ98l96K73j14j5l0K7J08j38k61n2L00K66k16k91K95M34q2m45M8n8
3339i7J86L73l96p3j86k2L21lq8k52j3M74j48j20j8Q1jM1j62m1N47l84J8K08k23
3364B2k91L25j10L85k52j99J6L97m97j48L46K71k07n4p8o5K76K0M4m62L52l99
$$ plain form
3202 -44 79 230 -192 420 99 -177 -103 145 176 34 -226 -26 94 151 -70 -299 -249 308 115 61 -49 -296
3224 -296 232 293 330 25 -105 158 386 28 -74 -273 208 164 183 -139 -133 41 254 -165 -102 -161 -41 -31 80
3247 80 -80 -185 -112 37 359 -496 -344 132 99 41 -3 -353 168 248 75 -122 -204 -59 -4 -57 -237 -75 -49
3270 -49 -258 101 -472 -386 68 113 -24 -184 -175 21 274 -19 -13 -533 -10 -61 333 -86 -309 -74 172 -357 224
3293 224 -284 -180 25 -89 -187 -132 -14 120 70 -310 -486 143 355 -123 -113 -204 -162 101 194 244 -170 -351 194
3316 194 61 52 250 -146 127 13 -2 -32 -5 103 -35 -296 -348 -48 218 2 -289 6 440 358 -87 -39 -97
3339 -97 89 462 66 -7 -193 -215 106 103 15 -237 -250 224 76 -44 -62 19 18 59 -103 -144 403 19 37 245 22
3364 22 -269 56 -54 331 79 -120 -104 293 -204 -352 -6 265 58 4 -74 -139 137 157 201 -261 91 -308
3386c08O84l48P6K9j28J19n21K75K3L88l11p3j20M7K68j23Q6r6j54j15M73j06
3408F5k55J04J00k28L11J52m30O2P7j77k00L79j69L58R9l51j6K59m2o6k03K04
3430C3k94J78m7L7kj93M65m48J41O18o41k7J57j3J5Q7J04m95J09J85L57j91j82
3453d7JN7J79l18K7J91l62L10q9k70N71j23j10k4J70l68K85J7K27k35N9J57k51
3476E4l77J81j89M60k62L6J33l95M55l8K44j87j01j71N7MJ49j50J84p9j69K25
3498F4k2m3L48o72K26K13K5k7k74n2K28o1j3J50j13k4J38k22L63n13L90j82k25
3521b98L99l38L96l88K15O4j38O4J96k87L42R5k24j31q4M2kN5j16N12l62L31j56
3544A87l06M02n53M96l56K95j68J00j30L7j89J14J52J0P1K43l27j02j5k05K81
$$ plain form
3386 -308 376 28 104 133 5 124 -397 -122 -99 289 -22 -95 -215 -168 100 -23 63 -33 -187 -302 171 65
3408 65 -190 -86 14 -214 97 249 -181 -119 -42 -219 -419 -40 -209 149 248 -103 -119 140 98 32 -171 33
3430 33 -261 -83 -130 -93 -95 -288 177 -271 -130 488 -153 -180 -23 -36 -21 66 170 -325 -216 -31 326 135 -47
3453 -47 -46 11 190 -128 -101 90 -272 38 -51 -321 250 127 17 -7 163 -205 80 97 324 89 148 305 54
3476 54 -323 -142 -331 129 -133 -97 36 -359 96 58 302 115 14 -157 -100 -96 53 -97 87 8 -161 64
3498 64 42 -1 347 -325 -99 114 139 112 -162 -214 14 -47 -60 90 -23 -47 91 -131 232 -281 109 -73 -298
3521 -298 101 -237 159 -229 -14 50 -88 -24 172 -115 227 322 98 -33 -117 -75 -77 -22 -138 374 12 343 187
3544 187 -119 283 -270 226 -130 165 -3 97 -33 4 -185 -71 81 91 162 405 78 -24 -39 -244 37
3565C7J32l4P9k01j63J86j77K84l32L9L85n6j53j21K54j88k14M83p4L3j61k2L17
3588C33P2j22j70n9k89L06J52l0J05p1j33L8j90L69j11r6k19n1M06k48K7j33j91
3611c05J82m3J69J21r5K02M1m91J54J36r4K2K4l64L19j36J98j96K12L29k71J2
3633A26r0J00j98K28l16J75l24K33j80L19mk69M7N1m9J70J07k78M02k34j44j49
3655b77L19r6l3M3l0j12J97nk3j56j66M24k21K50j22m3n4K97k94m6K13o3j36l
3679a37N9J87o7j94O0O7K3k9k79NK21j71J30j44k8J13M6j37M23o1l12L66n6J82
3703B67l6Ok05r1J08K1jJ44l42K62J52j86j68K80j13r7R0J03p4K8K04m27j71Q2
3727a64L30k38l5J72J78m77K87J7k07J06M1M0j12K89k19M18n27N2Q5RmK07j99
$$ plain form
3565 37 169 135 214 13 -150 36 -141 143 -189 -150 235 179 26 -95 159 -29 -243 240 166 199 38 16 333
3588 333 405 283 113 54 -235 71 223 193 298 227 94 132 -58 311 200 104 -115 -166 240 -8 19 -114 -305
3611 -305 -123 -166 3 124 29 231 272 -219 -65 71 -23 -1 23 -341 -22 -158 40 -156 56 385 114 126
3633 126 36 136 -62 166 -150 25 -299 -66 -246 73 69 -200 -153 -102 -151 19 126 -152 250 16 -128 -277
3655 -277 42 -54 -87 -44 -74 -186 11 6 -17 -173 -339 85 -136 114 -8 -51 -105 192 -102 -148 65 2 -134 -137
3679 -137 -78 109 42 -152 -92 -25 -2 -31 -310 -305 -84 -255 -125 -269 -297 -184 -138 -275 148 87 -225 141 85 267
3703 267 231 237 32 -59 49 70 69 213 -129 133 285 99 -69 211 98 1 91 194 120 148 352 -75 -246 -164
3727 -164 166 -72 -107 65 243 -234 53 70 -137 -31 10 50 -62 227 8 426 -101 -49 36 45 41 248 49
3750D9k07K83L1j79Q8J20jl60O2R1k32M50k4k84J24R8J22j9l33kJ41K06k73K6
3774b3Qo7M6J45l85M67J19k18m02J77J16j86L61j58J21J40k67J1K46l01J56k03
3796i7J20j97j7Q0L19m16J71J22J0q3p9J40N2k46m7K14r3j84K88j47j86K78r8
3819i6j66nJ59J5L12j33l57L4L09J35l00j65K35j46K31j88J26K85n36M38j75k19
3841b07L41k44J2j04K8M6J06J79k36k08J85j4N1j22N86j59j97j3k9K95j7k41n8
3864b0N8k89L24K80l65J55r9o8Lj33L29L0j79J17m02M78k02j6o6N5K24mL9m43
3888a94K19j0j66J50j4M4K8l06N06l26L13k42k7O0kN1j10J37j82J73J40n95K2
3911c31K61J62L19n96J75J01k86J30J36q9k39M1L26j68K93j67j24L82l58n3l7
$$ plain form
3750 49 -158 125 156 -23 65 185 184 -176 -114 -23 -255 195 171 -113 11 109 231 212 -121 -123 18 224 -49 -23
3774 -23 -15 -82 -36 109 -276 191 310 92 -310 -133 -17 -203 158 0 121 261 -6 5 251 -50 106 -97
3796 -97 23 -174 -191 -111 208 -208 -37 85 95 12 -67 73 125 -121 -168 46 -47 -231 57 -90 -276 2 -96
3819 -96 -262 -267 -108 -93 219 86 -271 -237 72 207 -93 -258 -23 -169 62 -126 0 285 -251 187 12 -207
3841 -207 134 -110 -98 -202 -174 -128 -22 157 -79 -287 -102 -116 -65 -187 399 240 43 30 1 296 279 38 -20
3864 -20 38 -251 73 353 -12 143 44 -24 -21 -154 175 205 26 143 -259 219 17 1 -65 -10 214 210 249 -194
3888 -194 25 15 -151 -1 -15 29 57 -249 257 -69 244 2 -25 35 33 84 -26 111 -71 102 242 -353 -331
3911 -331 -70 92 411 -185 -10 91 -195 -65 71 -18 -257 -216 110 -58 235 68 -56 326 -32 -85 -122
3932a22K73n1Q7k8n5j47J70l72L88k27NJ99q3j26J01n5k36K27J44k4k28J63k12
3955b09K61P5k19J08L97k16j28j3O4j21K32k13j47K22j0j85L39j88n4P8K60l24
3977IJ42j3Q3P6m71J49J09k8j94L39j78J21Qk60M1J27k69K43q3O2Q7j34O8q9J81
4002A26p4k33K25K4j55R7nl7J53j3Q6l8k30j04K09J26k96Q4Q5p6RK5m2J38M7j07
4028B4J7Rj50P8m2J61l70J47R6k36L00%j50K90j08q8M8m35N02j11K51n53L16K33
4052B29k58j86P4q6k4P6J61J1Q0o8m00K46k03L09j97K49j02q4K68k15J25Pj36
4075a24L06k83J29j74l4L21j0J65k64J61j38k36n0K07J75n13N24k16L06j07k76
4096a31M15j11q7j63K65k15L94j03l26K84l02J39K11n4Q7K5k58k67L99L0q5L8
$$ plain form
3932 -122 151 100 187 159 104 -43 127 -245 143 -84 -79 120 37 -89 12 -43 -279 -52 92 68 -160 3 -209
3955 -209 52 127 -92 16 413 197 69 56 120 -1 231 18 -129 93 83 -102 237 49 -5 73 333 9
3977 9 151 138 221 297 -174 -25 84 56 -138 201 23 144 152 -108 -67 60 -209 34 -49 13 100 -34 34 -55 126
4002 126 52 -181 44 68 -87 10 5 -32 121 108 194 156 -74 -178 31 157 -139 -55 30 -46 -37 -12 -54 84 131 24
4028 24 41 50 -100 -22 -64 97 -273 -126 -30 -266 34 34 -116 174 66 -22 26 -409 93 -18 233 -320 -4 229
4052 229 -29 -215 -141 -227 -251 -175 -14 -3 77 9 -391 -145 -348 -39 -236 13 -89 -173 95 -120 5 12 -124
4075 -124 182 -101 28 -146 -180 141 131 296 32 193 55 -181 -231 -24 151 -362 162 -54 252 145 -131
4096 -131 284 173 86 -77 188 -27 367 264 -62 222 -80 59 270 216 303 328 70 -197 202 232 147 185
4118A85p6j71m0K77mk8k62K07O4J09o6k23J63j80L37n83M60j72J57lj7j41j36
4141a43K4J92k46L80j26j57o7K90j5m4M5J18j51j07m9L3j75K41n7k7L9J76k8J65
4165C11j14l97J99K9K1J2j71k24J08K19j0k48M80l20l7J99J63j85L9o7Oj86J47
4188b6K6k2j33M20j52k23J02M3J75j83o9q9J72k11K58k39P1N7L6R8N3j62K44l55
4212a09j49M00j79M4J44l85L54k12qK80j10j3N0l69M97n4j28j12j42OP8J52K8
4235F3J02l91M73J1k06J7N7M7L31m83j90j32L40J32l03O7K15l01K54N0l97M07
4257A63j04J14j3j38J4m4K39k01j84L73m7R0r0k49J0J0q1M8J2M6L42k02j14j2
4281a8nk6lJ15J11j75j56j98J64K95J53n87M19m1l17K67N5J87m20L22N1O2j56
$$ plain form
4118 185 109 -62 -102 175 171 143 -119 88 152 261 195 -28 135 -45 292 -291 169 -3 154 151 134 -7 -143
4141 -143 -119 73 -173 207 81 -76 -143 147 132 88 133 251 100 -7 -56 -23 -198 43 -14 -41 -2 174 146 311
4165 311 197 -200 -1 28 49 61 -110 -334 -226 -7 -17 -265 215 -105 -142 57 220 35 74 7 13 -173 -26
4188 -26 0 -22 -155 265 113 -110 -8 35 210 27 -42 -131 41 -170 88 -151 -80 -23 13 111 164 2 246 -109
4212 -109 -258 142 -37 7 151 -234 120 -92 -100 180 70 57 107 -262 235 181 53 -59 -201 -195 -117 35 63
4235 63 165 -226 247 258 52 69 126 173 504 21 -169 -301 39 171 -132 -65 150 -151 103 153 -244 163
4257 163 59 173 160 22 36 -8 231 30 -154 219 172 262 172 -77 -67 -57 -138 -90 -78 -32 310 108 -6 -18
4281 -18 -23 -49 -52 63 174 -1 -157 -355 -191 104 257 -330 89 48 -269 -2 53 240 -180 142 193 255 99
4304I9J44m3k98k87J66M90p8o03L47k6P6K05j54M2K6k3R6j42J76j22L27n89M6
4327a25M9R3L3Q8P4j68K0K25k07j11m6J87p3m8J98J86j91j75J05k17J93P3j40
4350B3K04m80J39J04J2K71N3m69J52j53j84J46M25L7m32j10K16N9k47M71j74J65
4372B28k56n9j68P9J50J34n1n8L2K28k90J75j22LJ76o5J03l15M2k9K39l04J16
4395a2k03L16q6k18m4L24k19K28l4k38K36Oj14r3O1K47k40L25l97K11o2j12rK45
4419A18k46J5j08R6J09Q0QN7k7k02J00k41j4J56k55K68J09j38J45j56N9J74k5
4442H2L2j83J02j49J12o7K84j14k30K91j65j70M6ro0J26L99m26J27K59k94l1m36
4465d74M44p1J65N6j73j1J47k58K49J04j57R7j03l2m1P7j17N7K8k98L13J78j23
$$ plain form
4304 99 243 200 -98 -385 -219 271 193 -410 -63 -89 -13 192 38 80 106 83 179 37 213 91 418 -171 -125
4327 -125 -76 17 50 138 212 44 64 289 82 -29 -75 112 39 -9 189 375 184 9 114 -103 90 163 23
4350 23 227 -253 -114 -10 2 273 326 -143 9 -144 -328 -182 243 280 -152 -262 -46 13 -234 237 63 228
4372 228 -28 -87 -255 -176 -26 108 57 -1 31 259 -31 144 22 25 201 136 239 -76 -34 -63 176 -128 -12
4395 -12 -215 101 15 -203 -247 77 -142 86 52 -186 50 56 -58 -151 -90 157 -83 242 -155 56 -6 -118 -127 118
4419 118 -128 -113 -221 -125 -16 64 72 129 102 -100 0 -241 -255 -99 -354 -86 23 -115 30 -126 -67 107 82
4442 82 114 -69 33 -116 -4 -71 213 99 -131 160 -5 -175 -129 -138 -198 -72 327 -99 28 287 -7 -38 -474
4465 -474 -30 -101 64 120 -53 -64 83 -175 74 178 21 118 15 -17 -58 19 -98 -41 -13 -311 2 180 57
4488E7K5N7n9k19J98l33O06l75j24M09j58J03l03K85j77J2K50l57M98o04K30k82
4510b61L86O9j97J5j24J98P9j32j90J30J52o3k38J97p9Q5K65l56Q8q9l23J60L32
4533A04J04l18J75j08k99N95r5j12k43J1K66k12J40j44J3j22L73j74m8K8J9K27
4555A80k96K53m4j82j18l3m2L85M6j16j73J1K95j81k02K32qk75J65M3Ok58L97
4578H5N8K16l26k31n0O5P3k7J12N9j26Q7J31l26L79J2m37K72j5Lj74J31n5J57
4602G3J85j53m5m9q8K79Qm57K69k93K16J18Lk4j51K05R9o7l13K03o6L45k83K2
4626C6M8J43j38P4j43o4K44k73j13K82M5J0l45K23M0j83R5M6j99LJ91k6O5J53
4650B14k95JP7k8J27m81J95Q0K85l39K52k35K46N7j61j34K45j38J15N2k32P1j3
$$ plain form
4488 57 82 139 80 -139 59 -274 332 -43 -167 242 84 187 -116 169 -8 4 254 -103 395 -209 21 -261
4510 -261 125 194 -3 12 -112 86 165 33 -157 -27 125 62 -176 21 -58 27 292 -64 24 -65 -388 -228 104
4533 104 208 -110 65 -43 -342 253 158 46 -197 -186 80 -132 8 -136 -123 -245 128 -46 -94 -66 -47 180
4555 180 -116 137 93 -89 -207 -240 -282 103 149 33 -140 -129 166 -15 -217 15 7 -268 -103 -60 -54 -312 85
4578 85 143 359 33 -198 -248 -183 -110 -137 -25 34 -92 -5 126 -200 179 191 -246 26 11 14 -160 -29 -84 73
4602 73 258 105 60 11 -77 202 210 -247 22 -271 -55 63 66 42 -109 96 195 128 -185 18 -48 297 14 36
4626 36 84 227 89 163 20 -44 200 -73 -186 96 141 151 -194 29 69 -114 -19 27 -172 -169 22 -4 61 214
4650 214 -81 -80 -3 -31 96 -385 -190 -110 175 -164 88 -147 99 156 -5 -139 106 -32 83 135 -97 -26 -39
4673c9K80l99n2m8O76m09j26K38k66J39N4j28J3N27n92N04k56j00m8o1M76n00
4695a17Q3Q3l58o5M30J35o5l10k34L30l4j24K95l76O0M15N1m00L60j36j34J83
4717G2j35K38p5k30K18r3J34k16K46Kj00l8J2L02l67jMJ70j2k8j00J10j03j09
4741i9j53J96J38MLj23J71l11K61K01l70L99n82K46Q6J29l02J09N5l63J26K63
4763H4J4k30K21k47O15m86k6J17k46L62Pj13j75l7L61k31j11K28k14K69j57J32
4785A37j31j56LL06m94K51L1N2k6J2m30M09J4p8J56J24k04r4j00K21J64J01n31
4808b63J0K01N0j68k2J17J03nO8Q1j36k26K21l9J05J24j34j81k5l6J32K17l39
4831a45k44L13K22k30J85j1k73k4K91r8J45k55K22k29M4M73l51p5Pmj44N6j42
$$ plain form
4673 -39 241 -158 -210 -258 418 9 -117 121 -145 -6 48 -80 -67 460 -132 372 116 16 -32 -93 383 -117
4695 -117 -34 49 -309 -374 56 191 126 -184 -418 -88 -122 -246 49 -327 -267 148 199 -201 159 23 -111 72
4717 72 -63 175 100 -130 88 -5 129 -87 159 161 61 23 35 337 -30 -31 -27 143 131 103 3 113 10 -99
4741 -99 -252 -56 82 86 89 -34 137 -174 87 288 -82 317 -265 -19 67 196 -106 3 58 -305 -179 84
4763 84 98 -132 89 -158 457 -29 -55 62 -184 178 185 72 -103 -140 221 -10 -121 107 -107 162 5 137
4785 137 6 -150 -147 159 -335 -84 -53 -1 -27 -15 -445 -36 -22 -100 56 180 -24 -118 -218 3 167 268 -263
4808 -263 -253 -52 -2 -170 -192 -75 28 23 91 172 36 -190 31 -8 97 221 87 -94 -119 -155 -23 194 -145
4831 -145 -389 -76 146 -84 101 90 -183 -207 84 -14 131 -124 98 -131 -87 386 35 -40 -33 -37 -181 -125 -267
4854b67M42k38r8M09o65K77J88J10l54L67l97N43l91m8j46J52J07J34k03J33N1
4875A06J50l78J63O0k51M8j03K9J90K25l85J43Q3M6m5J37l27J78k5K46j40j3k11
4898g4J79j37K41k89o6n8K8L68k47j05j8K94j67J92k98N3n7L05j36j82J95M5n
4921F1j37M5J07k82o4N31j47j46KK15k73n7m9K42Rn8Q5j53R1nk24M7oJ29J31l4
4947F0P1o3r9K8k43L41m60J28M3K8M5p2O3J99k31M8k48L07J12j7P6j38M2n5J40
4972A05k56K93k85K94l03J60J61k22K14j96J40j73N7k70N14l00j85L03k55R0M4
4993g0J4j14M79k39k22J90j87J90L3j63K34k05J21k54j97K46J76L2j1m20M74k70
5015a63J80N7p0J33R1k11k20J21k7q0K65l9R3j98j06K80k43L62m78L17o0o6r4
$$ plain form
4854 -267 175 -63 -161 248 -417 -140 48 158 -196 171 -226 317 -74 -122 -268 -116 -9 125 -78 55 106
4875 106 256 -122 41 101 -150 -102 -205 -176 14 239 -146 -3 80 126 81 218 -109 69 44 290 150 137 -74
4898 -74 105 -32 209 -80 -146 -204 -176 192 -55 -160 -178 116 -51 141 -157 -104 -161 144 8 -174 21 66 61
4921 61 -76 -31 76 -206 -270 261 114 -32 -30 185 -88 -145 -194 48 57 -1 84 -69 22 17 -207 -160 -166 -37 94 60
4947 60 131 68 -31 -3 -246 95 -365 -237 -194 -166 -121 -193 -130 69 -162 -114 -362 -55 57 40 116 -22 20 -35 105
4972 105 -151 142 -143 151 -152 8 169 -53 161 -35 105 -68 -11 -281 233 -67 -252 51 -204 -114 -70
4993 -70 -56 -170 309 70 -152 38 -149 41 74 -89 145 -60 61 -193 -390 -144 32 64 53 -367 107 -163
5015 -163 17 74 4 137 228 17 -203 -82 -109 -189 76 37 130 -68 -174 106 -137 225 -253 64 4 -62 -156
5038a56M4J79r1o1Pj9K17k46M70l95r7J81Q5j50J65j74qJ25J50k91r8j64L83n3
5062Cl12K69Q9k2lQ8k14o1J99L52n06j72K82K60L04p84K24N1n4p5j40M8J07J37
5086G0J37k15P0J05j06q6K93j91j74M9jj89J90M6O3l88L11p7J54Q1o4r7J3k26
5110b32R3J67l05K16o9l2M70k25k42L5L66j94R1j61r8K52k18L17r2k55K0K05J05
5133B14j74K56l33K45l38J62k12J54J49k71J23k30L35j32J36j85K1L81r3j51j48
5154i1j69K85j24R9k96R7L02k37r8K25m4L62k23j10O6j21L16j84j01o4Q0K66k67
5177c1L4m8J7k5M5o6qK33k84L19k42mj80P0L17j74k8Q7Qpj06j39K28j48K18N9
5203A45l95K57l8J06k42M15l75J11J86k43j24oJ51j49J25j85K04K07j9L3m49J69
$$ plain form
5038 -156 -112 67 -24 -85 -78 -97 120 -126 344 -51 -148 33 118 -32 133 -41 -49 76 226 -65 -163 -327 56 3
5062 3 -309 -40 49 27 24 112 -102 -163 36 388 -118 -290 -8 252 556 -228 -4 47 -7 -82 -222 -174 -67 70
5086 70 207 -8 62 167 61 -25 268 77 -97 -48 -49 -238 -48 -2 61 -327 -16 -93 61 142 78 -19 -6 -232
5110 -232 -139 28 -277 -61 -130 -162 308 83 -159 -124 242 48 139 -22 -120 132 -86 231 139 -116 -96 109 214
5133 214 40 296 -37 208 -130 32 -180 -26 123 -148 -25 -255 80 -52 84 -101 -80 301 208 57 -91
5154 -91 -260 25 -99 0 -296 -199 103 -134 -232 -7 -51 311 88 -22 44 -77 239 55 -46 -110 -30 236 -31
5177 -31 3 -45 -28 -53 -8 -74 -82 151 -133 186 -56 -60 -240 -170 147 -27 -55 32 40 33 -73 -212 16 -132 86 145
5203 145 -250 7 -31 75 -167 248 -127 -16 170 -73 -197 -203 -52 -201 -76 -261 -57 150 131 164 -285 -116
5225a16K90R9l77K94k60n3J5J71j19K75K4k01R5p0l33K51J75j92j84M11r6K9L25
5248D53l74J92M5j16m5oq5o2l79M50m7L4Q3j34J18m11M05J79k40O5k36LK5J00
5272A7J76m22N9K50J14j54l81L60o0j8R0K9j53J82L3j91L31l80K08l54L82j75
5294e7K12K04k11k3k95j34L08n6L34j86L2l45M73p4n2j4j26J36l29N07m48L51
5316B07m0j28Q3l0K3o0k54J78K19n5Lj40Q7k23K08j3j9J55n57J59K23L3o3R5J26
5341B17l89K8j9j70K93N2J58l4L0l64N26q5k91lJ00j73M60l81k2J51J65m75J07
5364a19M9J2M5l43M08k82L52j95q9J54r4j73J90O6k15K08j4J72j45J26rj13L13
5387C04k81l05N6O27k97k70Q8P0K70k75j7O6N8j92O3r8K64m22J39KL49m3O6j03
$$ plain form
5225 -116 174 273 -104 190 -70 -123 -108 63 -56 219 243 42 137 67 -266 -15 160 -32 -216 195 99 128 453
5248 453 79 271 316 200 155 149 64 2 -377 73 26 60 143 9 127 -284 121 300 60 125 -111 -108 -83 17
5272 17 193 -229 -170 80 194 40 -341 19 -41 -59 31 60 -93 89 122 -69 262 -118 90 -264 118 -57
5294 -57 155 359 148 125 -170 -304 4 -52 282 96 128 -217 256 182 130 116 -10 126 -203 304 -144 207
5316 207 167 39 122 92 115 55 -199 -21 198 143 146 6 93 -130 78 65 46 201 -356 -197 26 59 -4 91 217
5341 217 -172 -144 -163 -333 -40 12 170 136 166 -198 328 243 -48 -51 49 -124 336 -45 -67 84 249 -226 -119
5364 -119 -70 -58 -13 -356 52 -230 122 -73 -162 -8 -102 -275 -85 -19 -234 -26 -40 132 -13 113 104 -9 304
5387 304 23 -282 -226 401 104 -166 -78 -8 262 -13 -30 36 94 -98 -35 -133 131 -291 -152 -150 199 156 222 119
5411A19KL2j69p4J54O9j40LK79j79m2m9j24q2N54k96J49j19m0k22L58r8K9j85
5435g1J19k32K82Q3k98J49j08K05J4j12Q2J54r3k42p1j41J58j3%O1r9M04j22k77
5459a68K09k3Q7j18M8j48j01K93m2K71m19j8O8K19k81%o7J74J34M5k90k5L55j84
5483A9J05l06N16k51k34P2L06l74K49K7k67K12l00J61k04L48j28j42K97J35k23
5504A8m07J69L67k04J42N9J29n6k54K40o9k45o8O3O0J4o9K03j59J18P0l45K60
5527C6J11Pk19K70n58M66J56m68J80l73N26l92K57P8k48J54J64k37R1M37l67M08
5549D79n51p5L21j88O6kj08j47M49rl26J50Ko7q1j2q9P7J34P7j10J34N5l08O6
5574f3L1K17J2p5R4k17J9r2j37K35M6L84m35q9r7L16j83J79k28L26m07J24K29
$$ plain form
5411 119 121 153 -16 -90 64 133 -7 -4 275 96 54 5 -119 -201 353 57 206 87 47 -175 183 85 114 -71
5435 -71 48 -184 98 181 -117 32 -76 129 143 31 113 267 174 -68 -139 -280 -122 -135 -135 -74 -173 231 109 -168
5459 -168 41 18 105 -13 35 -113 -214 79 37 308 -111 -129 -61 158 -123 -123 -190 -16 118 163 -127 -152 203 19
5483 19 124 -182 334 83 -151 -79 227 -147 102 129 -138 74 -226 -65 -269 79 -49 -191 106 241 18
5504 18 -389 -220 147 -57 85 144 273 217 -37 203 134 -111 -179 -116 -56 -42 -111 92 -67 51 121 -224 36
5527 36 147 154 -65 205 -353 113 269 -199 -19 -392 134 -258 -1 77 -171 -17 147 -90 1 438 71 479
5549 479 -72 -147 174 -14 52 50 -58 -205 244 235 -91 59 61 -6 -87 -99 -188 -111 23 100 -10 124 179 -129 -63
5574 -63 -32 185 197 122 216 -1 18 -74 -211 24 70 454 19 -70 -167 149 -34 145 -83 243 -164 -40 189
5597A89Q8j82j01P9q2p1K27O9m92K91q6k5K54k48Mk2J09o2N0J24K25m23L46l22
5621f1rm2l7j71N0J95J39N8o4k48K09j31k90M46q9J20j39J69Nj70P5K8J44l58
5645a71k1N15k92J95l14m02O68q6j45M5j7J84P7j90k5J95k52J89j31J25m1J61
5667B67l43j8k71K87J1L68j48l93OL20k72L6K04k11J91j31J61k42J38M2J59k23
5689f2M8K22k01p4Mj33K22N7l65L62K51m14J40k41L03k09L4K4l9J28m8n03M29
5712f5P9oo3M5K95o15L55k44j6J43k3Q7P7R1l26L94j21l0k11K09j48N3K75k97
5736f2L55k68L2j03J7o6K31J47l89K84mP4p4n2k06j85K39J52J21k61n1J01k45
5759b13J02n3J36j12l4P8J62J47l63K11R6m71M26q1k84M47j65K02n9k05m7r3N5
$$ plain form
5597 189 277 95 -6 73 -9 -80 147 216 -276 15 -71 -96 158 -90 -86 -108 1 -61 -11 113 338 -85 261 -61
5621 -61 -70 -112 -149 -320 -270 -75 64 122 58 -190 19 -112 -402 44 -45 75 -64 105 110 -60 15 43 187 -171
5645 -171 -192 323 31 226 -88 -490 178 92 -53 -8 -25 159 236 46 21 216 -36 153 22 147 106 267
5667 267 -76 -94 -365 -78 -67 301 153 -240 -234 86 -186 -150 54 -157 34 -97 64 -178 -40 2 161 -62
5689 -62 -14 208 7 -67 -63 -196 26 83 -282 80 331 -83 57 -184 119 -90 -56 -32 -71 57 9 -494 -65
5712 -65 14 8 -55 -10 285 -330 25 -219 -235 -92 -115 -28 49 140 -186 208 87 57 -154 55 -93 -40 235 -62
5736 -62 293 25 57 -46 -29 -95 136 283 -106 178 174 248 174 122 -84 -269 -30 122 243 -18 -69 32 -213
5759 -213 -111 -164 -28 -140 -174 -96 66 213 -150 61 157 -314 112 31 -253 194 29 231 172 -33 -80 -173 -118
5782a18J77l04P6N74m75L32l21j0J43k14L21j63K52k33P8l81K74o0q4l1K51J06
$$ plain form
5782 -118 59 -245 -169 405 -70 262 -59 -69 74 -140 181 18 270 37 115 -266 8 -52 -136 -167 84 190
$$ [...]
8191A33
##END NTUPLES=NMR FID
##END=
