##TITLE=1H_DHA-Pd-H2(2d)f16
 CDCl3
 8 sc, 
 7.6.2023
##JCAMPDX= 6.0         $$ Bruker NMR JCAMP-DX V2.0
##DATA TYPE= NMR FID
##DATA CLASS= NTUPLES
##ORIGIN= UXNMR, Bruker Analytische Messtechnik GmbH
##OWNER= root
$$ XWIN-NMR		Version 3.5
$$ Wed Jun  7 15:16:35 2023 Russian Standard Time (UT+4h)  she@DPX200
##.OBSERVE FREQUENCY= 200.13135
##.OBSERVE NUCLEUS= ^1H
##.DELAY= (6, 6)
##.ACQUISITION MODE= SIMULTANEOUS
##.ACQUISITION SCHEME= undefined
##.AVERAGES= 8
##.DIGITISER RES= 18
##SPECTROMETER/DATA SYSTEM= spect
##.PULSE SEQUENCE= zg30
##.SOLVENT NAME= CDCl3
##.SHIFT REFERENCE= (INTERNAL, CDCl3, 0, 15.7039)
##AUDIT TRAIL= $$ (NUMBER, WHEN, WHO, WHERE, WHAT)
$$ ##TITLE= Audit trail, XWIN-NMR		Version 3.5
$$ ##JCAMPDX= 5.01
$$ ##ORIGIN= Bruker BioSpin GmbH
$$ ##OWNER= she
$$ F:/spectra/data/she/nmr/H-F/1/audita.txt
$$ ##AUDIT TRAIL=  $$ (NUMBER, WHEN, WHO, WHERE, WHAT)
(   1,<2023-06-07 14:59:08.10 +0400>,<she>,<DPX200>,
      <created by zg, POWCHK disabled, PULCHK disabled
       configuration hash MD5:
       00 E9 B6 7A A2 85 ED C7 34 08 36 98 17 FE 4E 26
       data hash MD5: 16K
       BE CF BE 96 CA 40 E5 93 27 4D 40 6D 28 CD E4 A9>)
$$ ##END=
$$ 
$$ hash MD5
$$ 70 1C 23 30 B6 21 55 FE D1 F5 20 41 60 CE F1 0B
##$RELAX= 
##$RELAX= 
##$RELAX= 
##$RELAX= 
##$RELAX= 
##$RELAX= 
$$ Bruker specific parameters
$$ --------------------------
##$DU= <F:/spectra>
##$EXPNO= 1
##$NAME= <H-F>
##$PROCNO= 1
##$TYPE= <nmr>
##$USER= <she>
##$AMP= (0..31)
100 100 100 100 100 100 100 100 100 100 100 100 100 100 100 100 100 100 
100 100 100 100 100 100 100 100 100 100 100 100 100 100 
##$AQSEQ= 0
##$AQ_mod= 1
##$AUNM= <au_zg>
##$AUTOPOS= <>
##$BF1= 200.13
##$BF2= 200.13
##$BF3= 200.13
##$BF4= 200.13
##$BF5= 200.13
##$BF6= 200.13
##$BF7= 200.13
##$BF8= 200.13
##$BYTORDA= 1
##$CFDGTYP= 0
##$CFRGTYP= 5
##$CHEMSTR= <none>
##$CNST= (0..31)
1 1 145 1 1 1 1 1 1 1 1 1 1 1 1 1 1 1 1 1 1 1 1 1 1 1 1 1 1 1 1 1 
##$CPDPRG= <>
##$CPDPRG1= <>
##$CPDPRG2= <>
##$CPDPRG3= <>
##$CPDPRG4= <mlev>
##$CPDPRG5= <mlev>
##$CPDPRG6= <mlev>
##$CPDPRG7= <mlev>
##$CPDPRG8= <mlev>
##$CPDPRGB= <>
##$CPDPRGT= <>
##$D= (0..31)
0 1.2 0 0 0 0 0 0 0 0.06 0 0.03 0 0 0 0 0.0002 0 0 0 0 0 0 0 0 0 0 0 0 
0 0 0 
##$DATE= 1686135547
##$DBL= (0..7)
120 120 120 120 120 120 120 120 
##$DBP= (0..7)
150 150 150 150 150 150 150 150 
##$DBP07= 0
##$DBPNAM0= <>
##$DBPNAM1= <>
##$DBPNAM2= <>
##$DBPNAM3= <>
##$DBPNAM4= <>
##$DBPNAM5= <>
##$DBPNAM6= <>
##$DBPNAM7= <>
##$DBPOAL= (0..7)
0.5 0.5 0.5 0.5 0.5 0.5 0.5 0.5 
##$DBPOFFS= (0..7)
0 0 0 0 0 0 0 0 
##$DE= 6
##$DECBNUC= <off>
##$DECIM= 32
##$DECNUC= <off>
##$DECSTAT= 4
##$DIGMOD= 1
##$DIGTYP= 9
##$DL= (0..7)
0 120 120 120 120 120 120 120 
##$DP= (0..7)
150 150 150 150 150 150 150 150 
##$DP07= 0
##$DPNAME0= <>
##$DPNAME1= <>
##$DPNAME2= <>
##$DPNAME3= <>
##$DPNAME4= <>
##$DPNAME5= <>
##$DPNAME6= <>
##$DPNAME7= <>
##$DPOAL= (0..7)
0.5 0.5 0.5 0.5 0.5 0.5 0.5 0.5 
##$DPOFFS= (0..7)
0 0 0 0 0 0 0 0 
##$DQDMODE= 0
##$DR= 18
##$DS= 0
##$DSLIST= <SSSSSSSSSSSSSSS>
$$ [...]
##$SUBNAM2= <"">
##$SUBNAM3= <"">
##$SUBNAM4= <"">
##$SUBNAM5= <"">
##$SUBNAM6= <"">
##$SUBNAM7= <"">
##$SUBNAM8= <"">
##$SUBNAM9= <"">
##$SW= 18.05172834244
##$SWIBOX= (0..15)
0 0 2 0 0 0 0 0 0 0 0 0 0 0 0 0 
##$SW_h= 3612.71676300578
##$TD= 16384
##$TD0= 1
##$TE= 0
##$TE2= 300
##$TE3= 300
##$TEG= 300
##$TL= (0..7)
0 120 120 120 120 120 120 120 
##$TP= (0..7)
150 150 150 150 150 150 150 150 
##$TP07= 0
##$TPNAME0= <>
##$TPNAME1= <>
##$TPNAME2= <>
##$TPNAME3= <>
##$TPNAME4= <>
##$TPNAME5= <>
##$TPNAME6= <>
##$TPNAME7= <>
##$TPOAL= (0..7)
0.5 0.5 0.5 0.5 0.5 0.5 0.5 0.5 
##$TPOFFS= (0..7)
0 0 0 0 0 0 0 0 
##$TUNHIN= 0
##$TUNHOUT= 0
##$TUNXOUT= 0
##$USERA1= <user>
##$USERA2= <user>
##$USERA3= <user>
##$USERA4= <user>
##$USERA5= <user>
##$V9= 5
##$VALIST= <valist>
##$VCLIST= <CCCCCCCCCCCCCCC>
##$VD= 0
##$VDLIST= <DDDDDDDDDDDDDDD>
##$VPLIST= <PPPPPPPPPPPPPPP>
##$VTLIST= <TTTTTTTTTTTTTTT>
##$WBST= 1024
##$WBSW= 4
##$XGAIN= (0..3)
0 0 0 0 
##$XL= 0
##$YL= 0
##$YMAX_a= 208129
##$YMIN_a= -205289
##$ZGOPTNS= <>
##$ZL1= 120
##$ZL2= 120
##$ZL3= 120
##$ZL4= 120
##$ABSF1= 10
##$ABSF2= 0
##$ABSG= 5
##$ABSL= 3
##$ALPHA= 0
##$AQORDER= 0
##$ASSFAC= 0
##$ASSFACI= 0
##$ASSFACX= 0
##$ASSWID= 0
##$AUNMP= <proc_1d>
##$AZFE= 0.1
##$AZFW= 0.1
##$BCFW= 1
##$BC_mod= 2
##$BYTORDP= 1
##$COROFFS= 0
##$CY= 11.3945322036743
##$DATMOD= 1
##$DC= 2
##$DFILT= <>
##$DTYPP= 0
##$F1P= 15.7292609196834
##$F2P= 12.9074282941183
##$FCOR= 0.5
##$FTSIZE= 0
##$FT_mod= 4
##$GAMMA= 1
##$GB= 0.15
##$INTBC= 1
##$INTSCL= 1
##$ISEN= 128
##$LB= 0.24
##$LEV0= 0
##$LPBIN= 0
##$MAXI= 10000
##$MC2= 0
##$MEAN= 0
##$ME_mod= 0
##$MI= 1.114404
##$NCOEF= 0
##$NC_proc= 0
##$NLEV= 6
##$NOISF1= 3.799351
##$NOISF2= 2.8
##$NSP= 1
##$NTH_PI= 0
##$NZP= 0
##$OFFSET= 15.70392
##$PC= 1
##$PHC0= -19904.99
##$PHC1= 11.25272
##$PH_mod= 1
##$PKNL= yes
##$PPARMOD= 0
##$PSCAL= 0
##$PSIGN= 0
##$REVERSE= no
##$SF= 200.130013532006
##$SI= 16384
##$SIGF1= 3
##$SIGF2= 2
##$SINO= 400
##$SIOLD= 16384
##$SREGLST= <1H.CDCl3>
##$SSB= 0
##$STSI= 0
##$STSR= 0
##$SW_p= 3612.71676300578
##$SYMM= 0
##$S_DEV= 0
##$TDeff= 0
##$TDoff= 0
##$TI= <>
##$TILT= no
##$TM1= 0
##$TM2= 0
##$TOPLEV= 0
##$USERP1= <user>
##$USERP2= <user>
##$USERP3= <user>
##$USERP4= <user>
##$USERP5= <user>
##$WDW= 1
##$XDIM= 8192
##$YMAX_p= 0
##$YMIN_p= 0
$$ End of Bruker specific parameters
$$ ---------------------------------
##NTUPLES= NMR FID
##VAR_NAME=  TIME,          FID/REAL,        FID/IMAG
##SYMBOL=    X,             R,               I
##VAR_TYPE=  INDEPENDENT,   DEPENDENT,       DEPENDENT
##VAR_FORM=  AFFN,          ASDF,            ASDF
##VAR_DIM=   8192,          8192,            8192
##UNITS=     SECONDS,       ARBITRARY UNITS, ARBITRARY UNITS
##FACTOR=    0.0002768,     1,               1
##FIRST=     0,             0,               0
##LAST=      2.2672688,     0,               0
##MIN=       0,             -205289,         0
##MAX=       2.2672688,     208129,          0
$$ Real data points
##PAGE= N=1
##DATA TABLE= (X++(R..R)), XYDATA
0@%%%%%%%%%%%%%%%%%%%%Mj2J6j6J6j6J6j7K2k8L1l3L7m2M7n3N8o4P2q0Q8r6J06
$$ 0 0 0 0 0 0 0 0 0 0 0 0 0 0 0 0 0 0 0 0 0 4 -8 8 -8 8 -8 8 -9 13 -15 16 -17 20 -22 25 -28 30 -34 38 -42 46 -50 56
43E6j17J28j40J54j70J88k08K28k50K77l08L41l80M27m81N45o27P33q67J048j301
$$ 56 -61 67 -73 81 -89 99 -109 119 -131 146 -162 179 -201 226 -255 290 -337 396 -471 577 -724
64g24J677k278L340n550J1693n4564j58883K72192R9798k57472m035J70043l0749
$$ -724 953 -1325 2015 -3535 8158 -46406 -205289 66903 166701 -90771 -94806 75237 44488
77D4488o5915J5113l37K3334M378n0295L2107M3214p1467j2502P6782k9586m9134
$$ 44488 -21427 -6314 -6651 16683 21061 -29234 2873 46087 -25380 -37882 38900 9314 -39820
90c9820N6360O005o1896K1702M2854k2824j0416K735k1034K7561L7612n0253k6794
$$ -39820 16540 22545 -39351 -17649 25205 2381 -8035 -5300 -26334 1227 38839 -11414 -38208
103c8208O5798l302o5372M2946N1556o5818k3751O3060p133l5577K4920O49j8732
$$ -38208 27590 24288 -41084 1862 53418 -12400 -36151 26909 19776 -15801 9119 9768 -8964
116h964J6361j2200j0062M5467j8488o2485M5349M8646n9212j8496N2657p277
$$ -8964 7397 -4803 -14865 30602 12114 -50371 -5022 43624 -15588 -34084 18573 11296
128A1296l3886J0360J7782R167r663l1461J3599M3362k1786l2590L0944J4490
$$ 11296 -22590 -12230 5552 14719 5056 -26405 -12806 30556 8770 -23820 7124 21614
140B1614l5149P43L6956n131l3357Q06K6226J323j8592k654J1136L022j3685r768
$$ 21614 -13535 -12792 24164 19033 -14324 -13518 12708 14031 -4561 -7215 3921 6943 -6742 -16510
154a6510K2044J8133l6284k2720M4980J5603m3519l96L3229j1562j8672J3062
$$ -16510 5534 23667 -12617 -35337 9643 25246 -18273 -18669 14560 2998 -15674 -2612
166b612J1798n06j3152r813K3183R670k9875O356L0438k6917k1560L6047R895
$$ -2612 9186 8680 -4472 -14285 8898 18568 -11307 -4951 25487 -1430 -22990 13057 22952
179B2952k8931m183Q661O637N020j8039n157K7922j0120l3352K5082L0102l1638
$$ 22952 -5979 -10162 -1501 5136 10156 -7883 -13040 14882 4762 -28590 -3508 26594 -5044
192e044k0419K5024J1069j2438m613M940O746m905j1504J2924J8626j9304k0126
$$ -5044 -25463 -439 10630 -1808 -6421 -1481 5265 360 -11144 1780 20406 1102 -19024
205a9024K3644J6936k4600q642K4304n22k3896M176J9182k348j3539o946P630
$$ -19024 4620 21556 -3044 -11686 12618 12096 -11800 -7624 11558 9210 -4329 -11275 -3645
218c645J6069j0828k1572K1109J7633l5435o946M2848n348l5943J4044K0427j3294
$$ -3645 12424 1596 -19976 1133 18766 -16669 -23615 19233 13885 -22058 -8014 12413 -881
231h81l536O167J127L600j0656p285K7989L650l8334O799L5162j8254k2094K3603
$$ -881 -4417 1750 2877 6477 -4179 -11464 16525 20175 -18159 -11360 23802 5548 -16546 7057
245G057P453k2954k048J3914M977n780j4081Q55K0343l788k2863J1255K1593j9878
$$ 7057 14510 -8444 -10492 3422 8399 2619 -11462 -10607 9736 5948 -16915 -5660 15933 -3945
259c945j7204K5613J3706k5494p051K1392K786j4596J61J1354K452j0133q792
$$ -3945 -21149 4464 18170 -7324 -14375 7017 9803 -4793 -4632 6722 9174 -959 -9751
272i751J2953J5815j8386j6608K2216R167k5419Q07K3668r426k1144R511J5310
$$ -9751 3202 19017 631 -15977 6239 15406 -10013 -9206 14462 5036 -16108 -6597 8713
285H713m148j1602l360J0428P002j3311l776J8668j583k2409Q328K3238r815j8196
$$ 8713 4565 -7037 -10397 31 7033 -6278 -10054 8614 7031 -15378 -7050 16188 6373 -11823
299a1823R519J2787p342p394N637P210m726j0703M249J4213m498j7249N358J5679
$$ -11823 -2304 10483 3141 -4253 1384 8594 3868 -6835 -2586 11627 7129 -10120 -4762 10917
313A0917j0063j3754J3506R971j5833q932J4343R057j1487q572R054Q538q809
$$ 10917 854 -12900 606 10577 -5256 -14188 155 9212 -2275 -10847 -1793 6745 -2064
326b064p418J2527Q121j4987q297J7365Q454j4803o855J2340M601j0384k846J0824
$$ -2064 -9482 3045 11166 -3821 -12118 5247 13701 -1102 -7957 4383 8984 -1400 -4246 6578
340F578J986j3557l503J3929N183j5996n630J5116K665j5563P58J5093l644j4919
$$ 6578 8564 -4993 -8496 5433 10616 -5380 -11010 4106 6771 -8792 -8034 7059 3415 -11504
354a1504M348J3504j676j1867R8J3188o4j3595L085J6427o107j5968Q566J3727
$$ -11504 -7156 6348 4672 -7195 -7097 6091 6027 -7568 -4483 11944 5837 -10131 -1565 12162
368A2162p885j0268O698P671o225q742O004J1431q719j4735Q969J5174j0842j3516
$$ 12162 4277 -5991 707 8378 2153 -6589 -585 10846 2127 -12608 -3639 11535 693 -12823
382a2823J1566R172j2682o637J4458N086j4017m640J2974N229r233m476P005O274
$$ -12823 -1257 7915 -4767 -11404 3054 8140 -5877 -10517 2457 7686 -1547 -6023 982 7256
396G256p400o795J1583P108j5549n264J8232L12j6318M358R721n204o009R91M467
$$ 7256 -144 -6939 4644 11752 -3797 -9061 9171 9483 -6835 -2477 7244 2040 -3969 -2978 1489
411A489M197q970q179J3933N688j7241L60J7109p027j3374J0247R840p643o845
$$ 1489 5686 -3284 -11463 2470 8158 -9083 -8723 8386 1359 -12015 -1768 8072 429 -6416
425f416M139O899j24p045J99Q945k184r671L801J1918n466j3684O287J4299r535
$$ -6416 -2277 4622 4498 -2547 -2348 6597 4413 -5258 -1457 10461 4995 -8689 -2402 11897 2362
440B362j2395J1711O625j2613l407R503J901m930n879J639J1932l661j6043J0838
$$ 2362 -10033 1678 8303 -4310 -7717 1786 3687 -1243 -7122 -5483 6449 2788 -13255 -2417
454b417J5721j7621q861K0940N42j5531N445P750m529j030p2Q75N554o138p839
$$ -2417 13304 -4317 -13178 7762 8304 -7227 -1782 5968 1439 409 337 1212 6766 628 -7211
469g211J1579N886j5583j972J4756l166j3662N593J1462p534j0075O784Q674n261
$$ -7211 4368 10254 -5329 -7301 7455 4289 -9373 -3780 7682 148 -9927 -3143 5531 270
483B70p028K710O609R29q251j285J3244o65j6178O572J6291j1820j0249J3377
$$ 270 -6758 -4048 2561 3490 -4761 -6046 7198 6533 -9645 -3073 13218 1398 -8851 4526
497D526L830r892n29L420K552Q12r315o68J3959n002j5420J1701R517j4993m329
$$ 4526 8356 -1536 -2065 1355 3907 4719 -4596 -5264 8695 3693 -11727 -26 9491 -5502 -9831
512i831J2859J879q596l613N650P528o547p529R689N449j0816j042J0053N86o884
$$ -9831 3028 4907 -3689 -7302 -1652 5876 -671 -8200 1489 6938 -3878 -4920 5133 5719 -1165
527a165k913N785P500q687p990J2593M387j5436P94J2855m720q368L332L288J36
$$ -1165 -4078 1707 9207 520 -7470 5123 9510 -5926 -5132 7723 3003 -5365 -2033 1255 1391
542A391l174m499P202N156j2935k378J4848p66j2998M633Q938m855n931O338N262
$$ 1391 -1783 -6282 920 6076 -6859 -9237 5611 4845 -8153 -3520 5418 563 -5368 970 6232
557F232o309m516O273M528l972l599R10L734P47o803K37J1039o899j3459J4023
$$ 6232 -77 -4593 1680 6208 2236 -1363 -453 3281 4028 -2775 -2538 8501 1602 -11857 2166
572B166R156j8340j502J4597n056o940M509J18K459J432j1665M559J6501j2840
$$ 2166 11322 -7018 -8520 6077 1021 -5919 -1410 -1292 1167 2599 -9066 -4507 11994 -846
586h46j2247K0152K913j9040O075J3295q380n257M215P18J926o51n744L724M146
$$ -846 -13093 7059 9972 -9068 -2993 10302 1922 -3335 880 1598 3524 2873 -2871 853 4999
601D999q262j887J1169j390j3312K837J2313m827r843O765N570q210n05O649j310
$$ 4999 -3263 -5150 6019 4629 -8683 -5846 6467 1640 -8203 -1438 4132 -4078 -4583 2066 756
616G56j410N7l939O141O474j2377j788J6959p051j3789J4383O426j5345J423Q564
$$ 756 -654 -597 -4536 1605 8079 -4298 -6086 10873 3822 -9967 4416 10842 -4503 -3080 5484
631E484n227n4J613n165N187J726j1610N165J1901j1794p609J3030J137j0130
$$ 5484 257 203 1816 -3349 1838 3564 -8046 -2881 9020 -2774 -10383 2647 3784 -6346
645f346L236O961l716m352J303N749K222o628l826P643M689p391l096P833J744
$$ -6346 -3110 3851 135 -4217 -2914 2835 5057 -1571 -5397 2246 6935 -456 -3552 4281 6025
660F025r336K6J0555k739j0272M002O424m395k939K222N37K18l599j572Q095J45
$$ 6025 -3311 -3285 7270 4531 -5741 -1739 4685 290 -2649 -427 110 328 -3271 -4843 3252 3397
676C397j1131L216J0485n949o460P479K905n073j644J901N001K99p940J183R194
$$ 3397 -7734 -4518 5967 18 -6442 1037 3942 -1131 -2775 -874 4127 4426 -3514 -2331 6863
691F863m868n795O791K197p201j385N322K437l742n887L185O325n248n062P139
$$ 6863 1995 -3800 2991 5188 -2013 -3398 1924 4361 619 -5268 -2083 4242 -1006 -6068 1071
706A071K007q165l86P963J92n914j267M939L128m335k204N491J077n463l2N860
$$ 1071 3078 -5087 -5473 2490 2682 -3232 -4499 440 3568 -767 -2971 2520 3597 -1866 -1898 3962
722C962M31o052j82N773m76o433K200O145m823n473M721L248k983k750j90K947
$$ 3962 4393 -1659 -1841 3932 3456 -2977 -777 5368 545 -4928 -207 3041 58 -2692 -2882 65
738F5J702o561Q85R316m852r928Q655Q125q951l212N912M16j382M26o62K576K81
$$ 65 1767 -4794 -3909 5407 555 -9373 -718 7407 -1544 -4756 1156 1572 190 616 -46 2530 2811
755B811o134K706Q270n480p695O607M114o935k08M692k523k952J394J147Q52r28
$$ 2811 -3323 -617 7653 2173 -5522 1085 5199 -1736 -1944 2748 225 -2727 -1333 -186 666 -262
771b62l538J486M543l360l563O331K193q261P94Q531k861n184L885J534k078N10
$$ -262 -3800 -2314 2229 -1131 -4694 1637 3830 -4431 -3637 4894 2033 -3151 734 2268 190 700
787G00L28M40K461m463l929Q383K561j0363Q5Q766m533n512O352J573n697j039
$$ 700 1028 1468 3929 -534 -4463 3920 6481 -3882 -3797 4969 436 -5076 1276 2849 -2848 -3887
803c887K841J945K89m476q07N919J65o115L234N593n198l531N887K366l671j385
$$ -3887 -1046 899 1188 -3288 -4095 1824 1989 -4126 -892 4701 -497 -4028 1859 4225 554 -831
819h31J464J364N8k479J11M464k660n779M244M748n133l459M307J022m430R20
$$ -831 633 1997 2055 -424 -313 4151 1491 -4288 -44 4704 -429 -3888 419 1441 -2989 -2069
835b069L584r69l570o40L608K570l776j993M423O40m583K194N643l342n803L721
$$ -2069 1515 546 -3024 -3664 -56 2514 -1262 -3255 1168 1808 -2775 -581 5062 1720 -4083 -362
851c62N566k697m396J944L149k085l297K184L823k987n190K388N458k955m656
$$ -362 5204 2507 -1889 55 3204 1119 -2178 6 3829 842 -4348 -1960 3498 543 -4113
866d113K529K777k485j529K195J261o63k171k96L739J097m036P90L909k973k055
$$ -4113 -1584 1193 -1292 -2821 -626 635 -28 -2199 -2495 1244 2341 -1695 -905 3004 31 -2024
882b024M990J061n465jL539N11j907j179J186J213l095j520N596L09o950p33O223
$$ -2024 2966 4027 -1438 -1439 2100 2611 704 -475 711 1924 -1171 -2691 2905 3214 -3736 -4469 1754
899A754k75l843O6K272l32j809R40K413m06k976O54K610J182j713j722K046J712
$$ 1754 1479 -2364 -2298 -26 -358 -2167 -1227 1186 780 -2196 -1542 1068 2250 537 -1185 861 2573
916B573l131k06M429j291m745K110L020k272j562J401m4q92j545L43L816j221
$$ 2573 -558 -764 3665 2374 -2371 -261 2759 487 -1075 326 282 -610 -2155 -1812 2004 783
932G83m959J425M642k299k583K970J249l338p4L485J470k882j792K519J745j023
$$ 783 -4176 -2751 1891 -408 -2991 -21 1228 -2110 -2184 1301 2771 -111 -1903 616 2361 1338
948A338q77K29O87n88j841J996L027m206l446N186J428n639J314L461l803r42
$$ 1338 461 690 1377 789 -1052 944 3971 -235 -3681 1505 2933 -2706 -1392 2069 -1734 -2676
964b676K847j087P32O76m072J712M895m247k282O918j734n975M948L739m472o40
$$ -2676 171 -916 -184 492 -3580 -1868 3027 -1220 -3502 3416 1682 -4293 655 4394 -78 -718
980g18K207j162J154M80k050J335P41m010O29M950j714n884K176M357l216k652
$$ -718 1489 327 1481 1961 -89 1246 1987 -2023 -1394 3556 1842 -4042 -1866 2491 -725 -3377
996c377M042L39m376J730K506j516K90K76k846L359K663n004P69N888m853l486
$$ -3377 665 1004 -3372 -1642 864 -652 -362 -86 -2932 427 3090 -1914 -1145 4743 -110 -3596
1012c596P742o50o121L529K016l962J839O37k904K474R31n743K845M970o430j870
$$ -3596 4146 3496 -2625 904 2920 -1042 797 1434 -1470 1004 1935 -3808 -963 4007 -2423 -4293
1028d293O394j913m428M131K421m049r28K619L03L6Oj646J099K471j719j707M048
$$ -4293 2101 188 -4240 -109 2312 -1737 -2665 -46 257 293 299 -1347 -248 2223 504 -1203 2845
1045B845q7n218J976N657m398l545M910n65l479K632L07k991K691q74l307M647
$$ 2845 2758 -2460 -484 5173 775 -2770 2140 1575 -1904 728 1035 -1956 735 -139 -3446 1201
1061A201J12o162L920M351o735j1O381k708l210L587k24n30J677j957J3L459k742
$$ 1201 1313 -4849 -929 3422 -3313 -3324 3057 349 -2861 726 502 -28 1649 -308 -295 3164 422
1078D22k331M733L71m845O22L222o02j904l92Q65K78j469JJ762j468j575J217
$$ 422 -1909 2824 3195 -1650 -1028 2194 1592 -312 -704 161 439 -1030 -1029 733 -735 -2310 -1093
1095a093R59N1j115j081K408P67k568R18K904k070j964K670J071j419n26L48J438
$$ -1093 -134 -83 -1198 -2279 129 896 -1672 -754 2150 80 -1884 786 1857 438 -88 260 1698
1112A698L58k564K3K723j478k182J837L72j417J05J53L7K06j915P06L011k840
$$ 1698 2056 -508 -485 2238 760 -1422 415 787 -630 -525 -372 -335 -129 -2044 -1338 1673 -1167
1129a167k440M090N18k807J298Q76j056J770j015o36K947j228l357L849K002m165
$$ -1167 -3607 483 1001 -1806 -508 368 -688 1082 67 -569 2378 1150 -2207 1642 3644 -521
1145e21j54K747j694p68J354o27n36m7p31R03N37j994j1J839n24j647O80J879
$$ -521 -675 2072 378 -390 964 337 -199 -246 -977 -74 463 -1531 -1542 297 -227 -1874 -1194 685
1163F85n10k446J395K883k171k348L806O47k864J482J075j757J637l11k460K865
$$ 685 175 -2271 -876 2007 -164 -2512 1294 1941 -923 559 1634 -123 1514 1203 -1257 1608
1179A608J009l869Q85K836l478q92L866j632k866K558k92j138J810j036j844K843
$$ 1608 2617 -1252 -367 2469 -1009 -1901 1965 333 -2533 25 -267 -1405 405 -631 -2475 368
1195C68p2k860K246K267l169o50L398l21k100J133J534j289k10R14l73l10K60
$$ 368 296 -2564 -318 1949 -1220 -1870 1528 1207 -893 240 1774 485 275 1189 816 506 766
1212G66q73J73J452j580j699L569n40m120J756K917l484p72K883j284n88J691
$$ 766 -107 66 1518 -62 -1761 1808 1268 -2852 -1096 1821 -1663 -2435 448 -836 -1424 267
1228B67j014j31J848j714j259M022l93l321J860J892k004M43J075j691O57O32
$$ 267 -747 -878 970 -744 -2003 2019 1626 -1695 165 2057 53 496 1571 -120 537 1169
1244A169j221M49Q61k099l5K030q41j975R35J047j120p29J425K26j516j87J883
$$ 1169 -52 397 1258 -841 -876 1154 313 -1662 -727 320 -800 -1529 -104 122 -1394 -1581 302
1261C02l2j676O97J776k80q92k88J352J038j696o53K008j1k440J462J400k065
$$ 302 270 -1406 -709 1067 787 -105 -393 959 1997 301 -352 1656 1645 -795 667 2067 2
1278Bj022J710J24r33l63J25k80j13K78l02M23o00j40J097J90r30PQ77J42o04
$$ 2 -1020 690 814 -119 -482 -357 -637 -750 -472 -774 -351 -951 -1091 6 196 -734 -727 150 292 -312
1298c12K81P92j48l11J36K79J31O4p98M90J197j774j506J864J432k481j193J871
$$ -312 -31 761 613 302 438 717 848 912 114 604 1801 27 -1479 385 1817 -664 -1857 14
1316A4N32r91r66N43P30l18j626J298J833j499j608K027J062j083o8P41l30K75
$$ 14 546 -445 -1411 -868 -138 -456 -2082 -784 1049 -450 -2058 -31 1031 -52 -120 621 291 566
1334E66M56j34m94M75m98J53Q22j298m0J025j040r14J242K35j522M0R82r92j59
$$ 566 1022 888 394 869 371 524 1346 48 8 1033 -7 -921 321 556 -966 -926 56 -936 -1095
1353a095N46p4N06j19j784J310K041j463j638K225R08j916L35K105j180q49O85
$$ -1095 -549 -623 -117 -236 -2020 -710 1331 -132 -1770 455 1363 -553 -218 1887 707 -142 543
1370E43J56N33k98q30K57N76q17n04N19L2j404P83R09j435m17J719r46j041J610
$$ 543 699 1232 934 104 361 937 120 -384 135 167 -1237 -454 455 -980 -1397 322 -624 -1665 -55
1389e5j59q71J128M18j741J388J152j674M43J588j715j38K121p73j230J126k03
$$ -55 -214 -1085 43 461 -1280 108 1260 -414 29 1617 -98 -236 1885 1112 -118 1008 805
1406H05j340K030o20k296J478N08j899Q01J753k194j021K143l58j017J001k76
$$ 805 -535 1495 875 -1421 57 565 -1334 -533 1220 -974 -1995 148 -210 -1227 -226 -502
1422e02p57J183J60n97O52M70j291Q54J090p84j057J699O7j502O02J177j212m98
$$ -502 -1259 -76 84 -513 139 609 -682 172 1262 478 -579 1120 1187 -315 287 1464 252 -246
1440b46J075j317l30J710r34q78J162o09j382K205j68k318J110J247j682J001
$$ -246 829 -488 -818 892 -42 -920 242 -367 -1749 456 288 -2030 -920 327 -1355 -354
1456c54J251j643K6J371m85M46O22j262q8J605n75r65R03j54p72K70L16k27j81
$$ -354 897 -746 -720 651 166 612 1234 -28 -116 1489 914 -51 852 698 -74 196 512 285 104
1475A04o31j04N03j82m77L55j89N8o3j67K96J85l31M77J51o35O86O63n96l71N44
$$ 104 -527 -631 -128 -310 -787 -432 -621 -563 -626 -793 -497 -312 -643 -166 -15 -650 36 699 103 -268 276
1496B76N83j87rk64J45k19r3K78K74q99k60L49k29M67n70j073J030Q41j563k5
$$ 276 859 672 663 399 544 325 232 510 784 -115 -375 -26 -255 212 -358 -1431 -401 440 -1123 -1148
1516a148J523j534j26K012j078n93J726j187n11K205n14j390K022n2k441J846
$$ -1148 375 -1159 -1285 727 -351 -944 782 -405 -916 1289 775 -615 1407 1355 -1086 760
1532G60R46j998L67J425k028J83J540j626k87J572j480j162K111j40j617O75N74
$$ 760 1706 -292 75 1500 -528 -345 1195 -431 -718 854 -626 -1788 323 183 -1434 -759 -185
1549a85q77J90J632j530n63J833K13j091Q69N57j892R51J809j725n73K235j548
$$ -185 -1062 -872 760 -770 -1333 500 713 -378 491 1048 -844 107 1916 191 -382 1853 305
1566C05j174K557l16k856J901N10k233J088J143k326R26J150k506P02J923j624
$$ 305 -869 1688 1372 -1484 417 927 -1306 -218 925 -1401 -475 675 -1831 -1129 794 -830
1582h30j014K989j535j393K680l7j792J077Q85j258M92J351j463l74J170Lo80
$$ -830 -1844 1145 -390 -1783 897 860 -932 145 1030 -228 264 1615 152 -222 948 951 271
1599B71K63j51r90O48P84p42p95J399j407r26J978K44k396R81J247j685Q96J364
$$ 271 534 383 -607 41 825 83 -712 687 -720 -1646 332 576 -1820 -839 408 -1277 -381 983
1617I83k175J76K330j518o30K614j713j146K549p45j514K081J58k396J401J137
$$ 983 -1192 -1016 1314 -204 -834 1780 67 -1079 1470 725 -789 1292 1450 -946 455 1592
1633A592k057L85J278j747q6J030n03k89L67m12p24M61Q11k91n31l4L95n8N39
$$ 1592 -465 -80 1198 -549 -635 395 -108 -397 -30 -442 -1166 -705 106 -185 -716 -750 -355 -413 126
1652A26J78n76j22J178l94l23R77q16m84P66N02q11O88n17q89O88M89j088L78
$$ 126 304 -272 -394 784 390 67 1044 228 -256 510 1012 201 889 372 -517 171 660 -428 -50
1671e0l04m08O18K61q55M72L78j148N61M45j00r9L29l57J05N93r3M48j63q50P24
$$ -50 -354 -762 -144 117 -738 -266 112 -1036 -475 -30 -130 -229 100 -257 -152 441 348 796 633 -217 507
1692E07M85j040P16K53j184o1J572q06m23N32j422K20J402r16r66Q79j95j138
$$ 507 992 -48 668 921 -263 -324 1248 442 19 551 -871 -651 751 -165 -1131 -252 -447 -1585
1710a585J652Q9j171M54O56k06j38P49n17n6M76L15n83K19O07o75m14R28k31o00
$$ -1585 67 156 -1015 -561 95 -111 -249 500 -17 -73 403 718 135 354 961 286 -128 800 569 -31
1730c1N87J22j276P61L39q14n3P94j481J16J697j083r06J306m88p15J374n7j184
$$ -31 556 678 -598 163 502 -312 -365 429 -1052 -936 761 -322 -1228 78 -410 -1125 249 192 -992
1749i92R10K98o83J020N85j232L10R01r07j01J265r78j130J174J19r44M68np21
$$ -992 -82 216 -467 553 1138 -94 216 1117 210 109 1374 396 -734 440 559 -385 83 78 -643
1768f43R1Q60o64q12Q38L0r22Q79L47p23P23j03p90M64J247q95N1R36p12l67J284
$$ -643 -552 308 -356 -1168 -330 -300 -1222 -343 4 -719 4 -99 -889 -425 822 -73 -22 914 202 -165 1119
1789A119l05o19L04Jn09Q92N1j361J47M60n43K1N44o81j63K58oj52N12n46l28
$$ 1119 814 195 499 500 -9 883 934 -427 -280 180 -363 -342 202 -479 -642 -384 -390 -542 -30 -576 -904
1810i04J106k16o31O37L50m60J98K84K2m53M30L82l81j22M23j87j15l36r4J36
$$ -904 202 -14 -645 -8 342 -118 80 364 386 -67 363 745 364 242 665 478 363 27 -67 69
1830F9K39k78k31o7J89o50K43K40l06m54M58L30m7n0j17M61J15R4l23M80k57J37
$$ 69 308 30 -201 -268 -79 -729 -486 -246 -552 -1006 -548 -218 -265 -315 -432 29 144 238 -85 395 138 275
1852B75P4N44l67n15N70k90J74k03p3j45m5l87J70N8k85m12O44l5k89l25O36p5
$$ 275 349 893 526 11 581 291 465 262 189 44 -1 -388 -218 -160 -445 -857 -213 -248 -537 -862 -226 -301
1874c01j5L17l50r9P81j9l51K09Q6n4M50R8o91K22L38k14k85L65j49l28N4J20
$$ -301 -316 1 -349 -448 333 314 -37 172 258 204 654 752 61 283 621 407 122 487 338 10 64 184
1896A84m15m9J75j31OM4k93m0L14m10M9P77l18m18M18P04q12L19L55k34N5O03
$$ 184 -231 -280 -105 -236 -230 -186 -479 -519 -205 -615 -566 211 -107 -525 -107 597 -215 104 459 225 280 883
1918H83n04m57J131m10j008Q50K61j361O98P34r97l39O53o06o7L39n96LQ46k77
$$ 883 379 -78 1053 643 -365 485 746 -615 83 817 -180 -519 134 -472 -539 -200 -796 -793 53 -224
1938b24q89P77N53o51N0Q41m43l61R00r2o65N19L57r50P08P07j273L5J011r97
$$ -224 -1113 -336 217 -434 -384 457 14 -347 553 461 -204 315 672 -278 430 1137 -136 -101 910 -87
1958h7m09J344p00j335J423J18j184Q33J02j310Q71O51j211N79N77j069L84J287
$$ -87 -496 848 148 -1187 236 354 -830 3 105 -1205 -334 317 -894 -315 262 -807 -423 864
1976H64o91p28J180K18q94P02O9o58O9M86n17P8L81l87k28M82l68n16L01K22o87
$$ 864 173 -555 625 843 -51 651 720 62 131 617 100 178 559 172 -56 426 58 -458 -157 65 -622
1997f22P1P60n83n62Q86L9r86Q99M03n74K59J78n33L69Q00o65j48J112p71m32
$$ -622 -551 209 -374 -936 -50 -11 -997 -98 305 -269 -10 168 -365 4 804 139 -9 1103 332 -100
2017a00Q59n9r60M68J95m65M48m14n98O08J20o33J11K71j77k69J21K79N9k57K05
$$ -100 759 700 -260 208 403 -62 386 -28 -626 -18 102 -531 -420 -149 -326 -595 -474 -195 -136 -393 -188
2038a88N64o51k24P82j79J50K26j91p1L99j99l28P30l81m72L75K37q95J79N72
$$ -188 376 -275 -499 283 104 254 480 289 218 617 418 90 820 439 -33 342 579 -316 -137 435
2058D35q18j6M83j69k92n25O51J29j71k47K27M50k37j01n3M34n5j71k17J044l50
$$ 435 -383 -399 84 -85 -377 -902 -251 -122 -293 -540 -313 137 -100 -201 -254 180 125 -46 -263 781 431
2079D31n84J106j69j051L97O84j064N93k6r47Q28M72j156k58J456r89n30R87m82
$$ 431 -153 953 784 -267 130 814 -250 343 317 -630 198 670 -486 -744 712 -277 -807 180 -302
2098c02n13M51M11n55N05J75o17L66P28n66k53O90Mq09P71O79j453j6J321q27
$$ -302 -815 -364 47 -508 -3 172 -445 -79 649 83 -170 520 524 -285 486 1165 -288 -304 1017 190
2118A90n31R85n02r77R54P2q67P10J97j337O82J052j772N05J550j384o56J923
$$ 190 -341 644 142 -835 119 191 -676 34 231 -1106 -424 628 -1144 -639 911 -473 -1129 794
2136G94q81n52J161j44j091J337K00j200J056K29j415L19J514j020j219J588n50
$$ 794 -87 -639 522 378 -713 624 824 -376 680 909 -506 -187 1327 307 -912 676 126
2153A26r10Q39M04r47j9L89k51K26N07q25lN19k59n94R56M60j641P56J007o09
$$ 126 -784 55 459 -488 -507 -118 -369 -143 364 -461 -464 55 -204 -798 158 618 -1023 -267 740 131
2173A31m75J602q74o82J056k35p71P40l06o36R42K47j507O36P27j136j12J034
$$ 131 -344 1258 384 -298 758 523 -248 492 186 -450 492 739 -768 -132 595 -541 -653 381
2191C81m77p83O40l20n6O54R6o58N87j13m31P02M48o42l54Q60N0k29N4K01l33
$$ 381 -96 -879 -239 -559 -615 39 135 -523 64 -49 -480 222 670 28 -326 534 584 355 409 610 277
2212B77j27K29m6k79J2k96J74L1p0n80L39N67j129M33N78n99j16M10J03l10K07
$$ 277 150 379 333 54 66 -230 -56 -25 -95 -675 -336 231 -898 -465 113 -486 -602 -192 -89 -399 -192
2233a92j51Q93m38l32L02J58L22n70M01q8K50n76K62L9k7n18L79J36n11O2J81
$$ -192 -343 550 112 -220 82 240 562 -8 393 305 555 -21 241 280 253 -265 114 250 -261 -199 -18
2254a8j1m70K69N6q7R9l49K09L56k02m44O48L69r86M30M78j31O7j90N06n5k05
$$ -18 -29 -499 -230 -174 -261 -162 -511 -302 54 -148 -592 56 425 -561 -131 347 216 283 93 599 544 339
2276C39l0l22N18l16l24N15j16m29m48M89J90n85K11M3r5J62R4j41J45k88rL95
$$ 339 309 -13 505 189 -135 380 264 -165 -613 -124 66 -519 -308 -265 -360 -198 -104 -245 -100 -388 -397 -2
2298bM35o45O1M14q6k59O42o8k60k24L73k01n0j39o6L36n54j38N29j28j16l65
$$ -2 433 -212 -151 263 177 -82 560 492 232 8 381 180 130 -9 -75 261 -293 -431 98 -30 -146 -511
2320e11J79J58K8j94k1L76j54j45K63K43n08K64J80N9l05K47M26k59l9K93o8m8
$$ -511 -332 -174 -146 -340 -361 15 -139 -284 -21 222 -286 -22 158 217 -88 159 585 326 287 580 512 464
2342D64k46n39M41K44o07p0L19M4m59M00P7k82j49J19r0L14k77j50L23K66m82
$$ 464 218 -321 120 364 -243 -313 6 50 -409 -9 68 -214 -363 -244 -334 -20 -297 -447 -124 142 -340
2363c40L41N51k73l15J30M68m16R2N2K95n80l9L99M9O3q41O3P65l40n46M33P5
$$ -340 1 552 279 -36 94 562 146 238 290 585 5 -34 365 414 477 -364 -301 464 124 -422 11 86
2385H6n65k87Q23L3o18J46L46l05L46P7j8J42R4l42J37P99r52j4P28j07p44M22
$$ 86 -479 -766 57 90 -528 -382 -36 -341 5 82 64 206 300 -42 95 894 -58 -72 656 549 -195 227
2407B27K28k62k16R2j45K18n00K1L14m1m44J32J94j88J17n5J21J69l89L32K26
$$ 227 455 193 -23 69 -76 142 -358 -337 -23 -64 -508 -376 -182 -370 -253 -308 -187 -18 -407 -75 151
2428A51k03O6K26K1j01k86K53K81N6l07l15O38R8p98M98q3n44p0N39k10k2k71
$$ 151 -52 14 240 261 160 -126 127 408 464 157 -158 480 578 -220 278 195 -349 -419 120 -90 -112 -383
2450c83O7J87j28Q4j83L06j51j00J16M83n7m45M52J14l94J2Q48o16m14M98j0J26
$$ -383 -316 -129 -257 -173 -356 -50 -201 -301 -185 298 241 -204 248 362 -32 -20 828 212 -202 296 286 412
2472D12q3J62p82N63l42j45L11J99j178L39Q42m61l18L94Km95P32k2k89PL8k28
$$ 412 329 491 -291 272 -70 -215 96 295 -883 -544 298 -163 -481 -87 -85 -580 152 130 -159 -152 -114 -342
2494c42O80K27p27K05N77l90m48N86K41o19k5L25K3n16N67j97m05J90l32o0N42
$$ -342 338 565 -162 43 620 230 -218 368 609 -10 -35 290 313 -203 364 167 -238 -48 -380 -440 102
2515A02k61q60Q59O38r03J14J043j069l74Q37L87p77N30m46j52J248k79q40M51
$$ 102 -159 -1019 -160 478 -425 -311 732 -337 -711 126 513 -264 266 -180 -332 916 637 -203 248
2534B48J21o65L91P83o63l40L05q2j18o8K34m26Q4n9j68J44K88m80j84Q72j03
$$ 248 369 -296 95 878 215 -125 180 98 -20 -88 146 -280 -196 -255 -423 -279 9 -471 -655 217 114
2555A14r69Q86M86j026K65J127o26l53N07m90l51P66j3n00Q33k96j060P28O94
$$ 114 -855 31 517 -509 -244 883 257 -96 411 -79 -430 336 323 -177 656 360 -700 28 722
2574G22j179J64N34l57l81M76q4k12j7K29j26K35J83q41O45N15o04K15O23m38
$$ 722 -457 -293 241 -116 -497 -21 -105 -317 -334 -105 -231 4 187 -654 -9 506 -98 117 740 302
2594C02q06O20N63m82o9K20j40n28L98r0j1L52o06p9Q49n18n81M66J80p49K32
$$ 302 -504 116 679 197 128 348 208 -320 78 -12 -23 329 -277 -356 493 -25 -606 -140 40 -709 -477
2615d77O71m00l00M52l22K65J50k20J64L29p0k76M21K8k01l28M88J02j43n21L07
$$ -477 194 -206 -506 -54 -376 -111 39 -181 -17 312 242 -34 387 415 214 -114 374 476 333 -188 119
2636A19K15n34J13K85m24k12K57%q7J98l37LO24p24J71N99k72o65N01O51m34J02
$$ 119 334 -200 -87 198 -226 -438 -181 -181 -268 -70 -407 -404 220 -504 -333 266 -6 -671 -170 481 47 149
2658A49L39m69Q3K17j20j9o2k28j62R05n53m03J34L60m81k6L98k5l17kj39P5M60
$$ 149 488 19 102 319 199 180 118 -110 -272 633 80 -323 -189 171 -310 -336 62 37 -280 -282 -421 -346 114
2681A14j38k87K48K31p12N80N13o37n84J325j79q03N71O73j090J14M11m06L53
$$ 114 -24 -311 -63 168 -544 36 549 -88 -672 653 474 -329 242 915 -175 -61 350 -56 297
2700B97n0o90L57M13n15l10P18o43l37N63M34m19m8j23J21J59K03j98j6N26m35
$$ 297 247 -443 -86 327 -188 -498 220 -423 -760 -197 237 -182 -230 -353 -232 -73 130 -68 -84 442 7
2721GL1O03k09m57j06P77l35m61K46K7k33o4K74q5p9K20n66L90O8l36m1M65k92
$$ 7 38 641 432 -25 -131 646 311 -150 96 123 -110 -174 100 15 -64 156 -410 -20 48 -288 -329 136 -156
2744a56m94Q61M3k91j68K12o5J51J88L8l28n4r2N29K86l21o07N40Lk53r3L85j41
$$ -156 -650 211 254 -37 -205 7 -58 93 281 319 -9 -63 -155 374 660 339 -268 272 275 22 -71 314 173
2767A73o21L93J25J28l99p6J90j15j21j32K53J06k34j72Q41J8p52K93L82j85k2
$$ 173 -448 -55 70 198 -201 -277 -87 -202 -323 -455 -202 -96 -330 -502 339 357 -395 -102 280 95 73
2788G3M5L25k86k31L58J06M0m29m9L66k06n7j22K05l68R3l4K40k76o8J25r5O5
$$ 73 118 443 157 -74 284 390 430 1 -48 318 112 55 -67 138 -230 -137 -171 69 -207 -275 -150 -245 -180
2811a80J7K59M8j09j82K92J38m63P8K38J35k22J33K77L9j71l29L74l07k11o9O7
$$ -180 -163 96 144 35 -147 145 283 -180 -102 136 271 49 182 459 498 327 -2 372 65 -146 -215 -148
2833a48L06l33J7M69l51m03K5P88l50k89Q1L88l77j22L09K47L4m38K01L52k83
$$ -148 158 -175 -158 311 -40 -443 -418 370 20 -269 -188 200 -177 -299 10 257 291 -147 54 406 123
2854A23J03m4j01J21J72k03j12P8l04J91L00k99n9k64L65m94K51K30j2k97Q3l8
$$ 123 226 182 81 202 374 171 59 137 -167 24 324 25 -34 -298 67 -427 -176 54 42 -255 -172 -210
2876b10J35J71m34L50M0K0k24P69k71k23j03L06Mk51K22m2k28r7K49J78o1l26
$$ -210 -75 96 -338 12 52 72 -152 617 346 123 20 326 330 79 301 259 31 -66 183 361 300 -26
2898b6m64P32K2m75j04L81m75n8M37J03m23n7K93n5M0L5K27o6K57m34L17Q0l00
$$ -26 -490 242 264 -211 -315 66 -409 -467 -30 73 -350 -407 -114 -169 -129 -94 133 67 324 -110 207 287 -13
2921a3M7J49J87j79k42M13l85J51k95M26l02o2k15M4J89J3m90N57p2N4k04M35
$$ -13 34 183 370 191 -51 362 -23 128 -167 259 -43 -105 -320 -276 -87 -74 -564 -7 -79 -25 -229 206
2943B06r1l45K96M7j2L4j24J23q0L9l12M03L82l58m53K40L47m42K48k27k8k53
$$ 206 115 -230 66 113 101 135 11 134 54 93 -219 184 566 208 -245 -5 342 -100 148 -79 -107 -360
2965c60L78NM3k35j14J77J54rl99O05l30k31L65K29p6k83P7L70k21k50N94k71
$$ -360 18 23 66 -169 -283 -106 48 39 -360 245 -85 -316 49 278 202 -81 -4 366 145 -105 489 218
2987B18k78J69j27K88j19o3k20J86p8o6j75N10n34j05O04k86j65k2L29n9Oj8J04
$$ 218 -60 109 -18 270 151 88 -132 54 -24 -90 -265 245 -289 -394 210 -76 -241 -263 66 7 13 -5 99
3010I9K2M7l05M66Q6l82k34P20l57j34j82P23k93j59Nm3m6J28k34m33N02k06j98
$$ 99 121 168 -137 329 415 33 -201 519 162 28 -154 569 276 117 122 79 33 161 -73 -506 -4 -210 -408
3033d08K53P3l42J21N48l81l27L67M6l71O35j18k58J07N86m34K92R4o75K66L2
$$ -408 -155 -82 -424 -303 245 -136 -463 -96 -50 -421 214 96 -162 -55 531 97 389 483 -192 74 106
3054A06r4l07J35L62j01j96R9j54J62J92l78j63K62qm09L88K06q86Q10L52o72
$$ 106 12 -295 -160 202 101 -95 4 -150 12 204 -174 -337 -75 -83 -492 -104 102 -784 26 378 -294
3075b94J39M44k13m86P35J07n77L77l4l44K90K18n07M06j38o98K95M82n2m78K86
$$ -294 -155 289 76 -410 325 432 -145 232 198 -146 144 362 -145 261 123 -575 -280 202 150 -328 -42
3096d2l8j51k1J72j91J88K71k18K3K72n72K12K59r3l99P04m2k47j88N23k15m06
$$ -42 -80 -231 -252 -80 -271 -83 188 -30 -7 265 -307 -95 164 71 -328 376 334 87 -101 422 207 -199
3118a99P04l71k53K51n0j73M26n19l72N77M5m29K21J98k89n1O37k55k34J34j76
$$ -199 505 134 -119 132 82 -91 335 -184 -556 21 66 -363 -142 56 -233 -284 353 98 -136 -2 -178
3139a78J20M89j79l38J54J03k60L22K53m06j97J85L2k54J04mj9q8J9O8P2M0l83
$$ -178 -58 431 252 -86 68 171 -89 233 486 80 -117 68 100 -154 -50 -54 -73 -161 -142 -74 -2 38 -345
3162c45j57O15o4m19K66L3q0K0J95Q0k02K4k1O0N23m40K40j81O4l06O00l17k7
$$ -345 -502 113 49 -370 -104 -71 -151 -131 64 144 -58 -34 -55 5 528 88 328 147 211 -95 505 188 161
3185A61J0k04J35m40n6K27j86J44J78r6O3l10j7L61JJ97j58M4J09k05j08L08J27
$$ 161 171 -33 102 -338 -394 -167 -353 -209 -31 -127 -64 -374 -391 -30 -29 168 10 54 163 -42 -150 158 285
3208B85l77K66L6j10j86M17o71M60P5r9jk0j93j77L25K11l99K83O1l99k88M05
$$ 285 -92 174 210 100 -86 331 -340 120 195 96 95 75 -118 -295 30 241 -158 125 186 -213 -501 -96
3230i6PJ35rj78J03J74j55J13Q1j13Jj36L37L7l87K45J25l38l3L15l07J65N8L6
$$ -96 -89 46 37 -141 -38 136 -19 94 175 62 63 -73 264 301 -86 159 284 -54 -87 228 -79 86 144 180
3254A80k52R6k26k37P02l28k99K78K1q2O9N7j40K60k66k3N08m42L36k29J90j89
$$ 180 -72 24 -202 -439 263 -65 -364 -86 -65 -147 -78 -21 -161 99 -167 -190 318 -124 212 -17 173 -16
3276a6l8K65k54K1J20K66n1l57OQ4j22j63K03J32l89K8K50Nk7j27N3J8j94J18
$$ -16 -54 211 -43 -22 98 364 313 -44 -38 46 -76 -239 -36 96 -293 -265 -15 -10 -37 -164 -111 -93 -287 -169
3300a69J7N91m70J67Q7k01j41L65O6k24J92j67o1J92j54l9j47J22j87O6J23k73
$$ -169 -152 439 -31 136 223 22 -119 246 312 88 280 113 52 244 90 51 -96 26 -161 -95 28 -245
3322b45J00K8O1J21j33k03J6L12R4Q9q5J93n98K85p9J62r0j00K43J00k55J16o2
$$ -245 -145 -117 -56 65 -68 -271 -255 57 151 240 155 348 -250 35 -44 118 28 -72 171 271 16 132 70
3345G0k14L33j13k14J67j52k7%j06K84j78J09k83Ll1N53o19Q4L34J96m52K57j83
$$ 70 -144 189 76 -138 29 -123 -150 -150 -256 28 -150 -41 -324 -321 -352 201 -418 -334 0 196 -256 1 -182
3368a82K64R4m02N18j30oL5j29q2L1m3l0J37p0k0k17L75m49N3J94J36M6l4j68
$$ -182 82 176 -226 292 162 156 191 62 -20 11 -32 -62 75 5 -15 -232 143 -306 -253 -59 77 123 89 -79
3392g9R6j59k05O06k63Q5p4J40J68j00o4K0p2k47K33P2l28R0O3p3J66q2l26M46
$$ -79 17 -142 -347 259 -4 81 7 147 315 215 151 171 99 -148 85 157 -171 -81 -18 -91 75 -7 -333 113
3416A13l1m00L12K36j86k23n0K78l42J92J74M1k39J08K14j90J57ml66R0L18j34
$$ 113 82 -318 -6 230 44 -179 -229 49 -293 -101 73 114 -125 -17 197 7 164 160 -206 -116 202 68
3438F8j52L40m27L39k39Q6j81J82R3k02m8K50j16K8k98L5m9M28j22j44P4J0l73
$$ 68 -84 256 -171 168 -71 15 -166 16 109 -93 -141 109 -7 21 -277 -242 -291 137 15 -129 -55 -45 -418
3461d18N05r1q6J04j3J49p8P1j80J29n4K16l4J14k90k92K10L62m61L30j08j80
$$ -418 87 -4 -90 14 1 150 72 143 -37 92 38 254 220 334 44 -248 -38 324 -137 193 85 -95
3483i5j57K25O7n45Q2J40J91L73Ml95k7J91q9r6M20j85K5j71k14M52r4J89m67
$$ -95 -252 -27 40 -505 -423 -283 -92 281 285 -110 -137 54 -35 -131 289 104 129 -42 -256 196 102 291 -176
3506a76J02j06L56k83K98K0l04nR6l9l17M22m25J74L81l57r5K93j96L4L54j31
$$ -176 -74 -180 176 -107 191 211 -93 -98 -2 -41 -358 64 -361 -187 194 -163 -258 35 -161 -127 227 96
3528I6p2J05j29J73j42J87J8k68J5O5k75K17J48j38k26K75J33j65J67m11m9L21
$$ 96 24 129 0 173 31 218 236 -32 -17 48 -227 -10 138 0 -226 49 182 17 184 -227 -276 45
3550D5r9m5j48J44k56L48j52J42o3l08L74j02M22l20n8k7J06N7K53k62n6l9J16
$$ 45 -54 -99 -247 -103 -359 -11 -163 -21 -84 -392 -18 -120 302 -18 -76 -103 3 60 313 51 -5 -44 72
3573G2kl45K52L99m78K04k10%K4J44k81N13m81K52j80O7k7oL85k51j47J68j50
$$ 72 70 -275 -23 376 -102 102 -108 -108 -84 60 -221 292 -189 63 -117 -50 -77 -83 302 51 -96 72 -78
3596g8J16q3L90k18O8M3k26Q3j02K70l85K06J4k6j74J53jl04N0J11k00K39j12
$$ -78 38 -45 345 127 195 238 12 95 -7 263 -122 84 98 72 -102 51 50 -254 -204 -93 -293 -54 -166
3619a66m2N5K01p2J03O9o5j89L12J00k61K6L29m46n3K79K06n90J32J8P6l1J11
$$ -166 -208 -153 48 -24 79 148 83 -106 206 306 45 71 400 -46 -99 180 386 -204 -72 -54 22 -9 102
3642A02r4j17J46P7Q8k37j03m6R7l9k21N13k70J0L26k11Q6l0L28l67p3L27n0j23
$$ 102 8 -109 37 114 202 -35 -138 -184 -87 -126 -347 166 -104 -94 232 21 107 77 405 38 -35 292 242 119
3666A19J20l9j86j69L15QKl19m3K14J36m7l15JJ70K15k02Q6j97K2M6L0m0l1L17
$$ 119 239 200 14 -155 160 168 170 -149 -192 22 158 111 -204 -203 -33 182 -20 66 -131 -109 -63 -33 -73 -104 213
3691B13k80K00j13L2L13k07o2K4P9l9j81K50k42r1M95o8j33J29m92P7J9p1Qj33
$$ 213 -67 133 20 52 365 158 96 120 199 160 -21 229 -13 -104 391 323 190 319 -173 -96 -77 -148 -140 -273
3715b73K79l39K56K5k20J38QN53m62m8j09R2P5p7Q3J21Lk03R2J41N1M4j93J60
$$ -273 6 -333 -77 -52 -272 -134 -126 427 -35 -83 -192 -100 -25 -102 -19 102 105 -98 -6 135 186 230 37 197
3739A97j72j32M1J05o6j80K45l05L50oj33j56o5L01J59l3j47j17K02Rj23k5K3
$$ 197 25 -107 -66 39 -27 -207 38 -267 83 77 -56 -212 -277 24 183 150 3 -114 88 97 -26 -51 -28
3762b8qJ8R9n0l51K77Q6j30J75Q2j80j23K55m58J61M6K18k98P3J56k05M21k75
$$ -28 -36 -18 81 31 -320 -43 43 -87 88 170 -10 -133 122 -336 -175 -129 89 -209 -136 20 -185 236 -39
3785c9j50L40j62P2j39M9J11k31J44N1o8L0Q7j41N6N0k49J70n1J19j21o7m8O5
$$ -39 -189 151 -11 61 -78 -29 82 -149 -5 46 -22 8 95 -46 10 60 -189 -19 -70 49 -72 -139 -187 -122
3809a22L41j79O8k00R1r2K00o7k71L70j39l5L74m35J73j48K4J61J9K0j80L0k7
$$ -122 219 40 108 -92 -1 -93 107 40 -231 139 0 -35 339 -96 77 -71 -47 114 133 153 -27 3 -24
3832b4p0j10P7J28K3k72P5J92j84M17l01J92N3k69L9j76J57j1M3p4J06R6rk08
$$ -24 -94 -204 -127 1 24 -248 -173 19 -165 252 -49 143 196 -73 -34 -210 -53 -64 -21 -95 11 107 98 -110
3856a10J40O3p8R0j58J35j96L43m34L00j57O9j25J65k3p7J76j72j56j62L61k2
$$ -110 30 93 15 105 -53 82 -114 229 -205 95 -62 7 -118 47 24 -53 123 -49 -205 -367 -6 -28
3878b8k61L54r3J25j43L79j18j65k74K59J0n1K29J2j62l9k7o5K7O5R6k51K26q1
$$ -28 -289 65 -28 97 -46 333 215 50 -224 35 45 -6 223 235 73 34 7 -58 -31 34 130 -121 105 24
3902B4k8L1m6J15k13o5J64o7L38j46j35j36K4L61k90J66q5P6j06J41K13l47p9
$$ 24 -4 27 -19 96 -117 -182 -18 -85 253 107 -28 -164 -140 221 -69 97 12 88 -18 123 336 -11 -90
3925i0K84k04j4R4L1k43J57J30k43J74p8k93L22j0k21J4K00N5k14K26nn2J7j7
$$ -90 194 -10 -24 70 101 -142 15 145 -98 76 -2 -295 27 17 -204 -190 10 65 -149 77 72 20 37 20
3949B0j41P3K22j17l64M02j28J48O1j66O3j05K13r0j47n0K90k77J24O3Q3l60K52
$$ 20 -121 -48 174 57 -307 95 -33 115 176 10 73 -32 181 91 -56 -106 184 -93 31 94 177 -183 69
3972F9j71k80J4K64j57K66m4J86j21k58J31n7K58k09J84R8l30Q8J9J73NJ18j13
$$ 69 -102 -382 -368 -104 -261 5 -39 147 26 -232 -101 -158 100 -109 75 173 -157 -69 -50 123 128 246 133
3995A33o6k2k34L13l66J65J00j42K28l6o4L6j01j13J77K48m69J54M1K35l19J74
$$ 133 67 45 -189 124 -242 -77 23 -119 109 73 9 45 -56 -169 8 256 -213 -59 -18 217 -102 72
4017G2L31k36k05K74k98Q3J72p7j5j86L10j34J72m67K39j39K93j21j05k41L66
$$ 72 403 167 -38 236 -62 21 193 116 101 -85 225 91 263 -204 35 -104 189 68 -37 -278 88
4038H8J6k99J56k02M40n9j2j68K2J20k29L05r2k31ML83l76qN4j19J1J79p0L32
$$ 88 104 -195 -39 -241 199 140 128 -40 -18 102 -127 178 86 -145 -141 242 -134 -142 -88 -207 -196 -17 -87 245
4062B45j90j28K3R2j57J79k00K30k11p6K71m38M10q1J79k28j21J72k08L75Ql95
$$ 245 55 -73 -50 42 -115 64 -136 94 -117 -193 78 -360 50 -31 148 -80 -201 -29 -237 138 146 -249
4084b49O21m98J00O3l3l0R3k6j58j8K80j90r7J50j4l17M46m4p5q9K34J8r3r8m6
$$ -249 372 -126 -26 37 4 -26 67 41 -117 -135 145 -45 -142 8 -6 -323 123 79 4 -85 149 167 74 -24 -70
4109g0n3p2K70J70k88oJ79m0j03J31J5j77K65j11o2j95K33j65j09K02k05K69l08
$$ -70 -123 -195 75 245 -43 -49 130 90 -13 118 133 -44 221 110 48 -147 86 -79 -188 14 -191 78 -230
4132b30K73l6k63K69J42l25K46k42j20M53j3N5l56M0n1L67k33M6J19r6J80k40
$$ -230 43 7 -256 13 155 -170 76 -166 -286 167 154 209 -147 -107 -158 209 -24 22 141 45 225 -15
4154a5L00Q1k54r4j30n0K7L34j45j20j16K90j58M22q80M08J94j71J19Q4k10m0
$$ -15 285 366 112 18 -112 -162 -135 199 54 -66 -182 108 -50 372 -508 -100 94 -77 42 126 -84 -124
4176a24K94l03K29J47j62j28K54J5Q8k92J72k85J0m9M12k40j34J24K8r4J5m8r6
$$ -124 170 -133 96 243 81 -47 207 222 310 18 190 -95 -85 -134 278 38 -96 28 56 -38 -23 -71 -167
4199a67J5k32M00J6K33k19k7J62j30k5j06r3J30M93k86l6Q6k34qJ55l7Q8j28o
$$ -167 -152 -384 16 32 265 46 19 181 51 26 -80 -173 -43 450 164 128 214 -20 -28 127 90 178 50 44
4223D4J07l72K11j0j05P5J00k89K65k84J18L00l98L49k86J38n5J53R8k36J44P7
$$ 44 151 -221 -10 -20 -125 -50 50 -239 26 -258 -140 160 -238 111 -175 -37 -92 61 159 -77 67 144
4245A44j10K50k79K19j36r1n3qj98K81R1L3j68L45m79L8K08j64M9NJ2M3j32j25
$$ 144 34 284 5 224 88 -3 -56 -64 -262 19 110 143 -25 320 -159 -121 87 -77 -28 -23 -11 32 -100 -225
4269b25J99k17M7K55L1O3r7P0l37J53L02j87oJ1j06K08k62mK71k57J74pl5j32
$$ -225 -26 -243 -196 59 90 153 56 126 -211 -58 244 57 51 62 -44 164 -98 -102 169 -88 86 79 44 -88
4293h8n0j18q0K11R5J47kj92m0K15q0j4k35L76j90m8P8r7J18n1J77R4j21q7j01
$$ -88 -138 -256 -336 -125 -30 117 115 -77 -117 98 18 4 -231 145 -45 -93 -15 -112 6 -45 132 226 105 18 -83
4318h3q2M59l21R2j43L3p3J67l1N9k05J51l11K62q4j12J28j16J58R0Q1n0R5l7
$$ -83 -165 294 -27 65 -78 -45 -118 49 18 77 -128 23 -288 -26 -110 -222 -94 -210 -52 38 119 69 164 127
4342A27j76M1k4j12K76J25j89O5j81n0J29Q7l06L07k46L88l95O5R3l0J91j22k0
$$ 127 -49 -8 -32 -144 132 257 68 133 -48 -98 31 118 -188 119 -127 261 -134 -69 24 -6 185 63 43
4365D3p9jJ38j40j52K64o7j90N7J61J35k68n4q5K16K31j07j29J18j98M8O0K36
$$ 43 -36 -37 101 -39 -191 73 6 -184 -127 34 169 -99 -153 -238 -22 209 102 -27 91 -107 -59 1 237
4388B37k68M2K3j06j06N0K52k03o0j49M18j87J14k11L04k57l7K21p5L20k09q7
$$ 237 -31 11 34 -72 -178 -128 124 -79 -139 -288 130 -57 57 -154 150 -107 -144 77 2 322 113 26
4410B6j8O6m5j35K18L5j9j42n8J49J93J03o41J67n6L97k42M0j18k2K03j78O3o3
$$ 26 8 74 29 -106 112 147 128 -14 -72 77 270 373 -268 -101 -157 240 -2 38 -80 -102 101 -77 -14 -77
4434g7J76k48J40M09m23j01L93k57o3k7J07l08K32l1K28l61L29p1j29J06N1l27
$$ -77 99 -149 -9 400 -23 -124 269 12 -51 -78 29 -279 -47 -78 150 -211 118 47 -82 24 75 -252
4456b52oL11l89K83o1rJ4J25q2J69M1j36k47K77j40Q4J09J99k95j1R6k25L07m43
$$ -252 -258 53 -336 -53 -114 -123 -109 16 -66 103 144 8 -239 38 -102 -18 91 290 -5 -16 80 -145 162 -281
4480b81L95J3j48R0o2l07L61R4k26Q6j32J39J5Lk21J32p6M3mJ40n6J26j78Q1P
$$ -281 114 127 -21 69 7 -300 61 155 -71 15 -117 22 37 40 -181 -49 -125 -82 -86 54 -2 124 -54 27 34
4505C4o5K27k79J9K90K2j55k00L11l43M4J60j2oL2j01J09k17J67l9q2j32K73M9
$$ 34 -31 196 -83 -64 226 248 93 -107 204 -139 -95 65 53 47 79 -22 87 -130 37 -2 -84 -216 57 106
4529A06k3l8J37q0L6M5j03K29m19K23JK9k77L32k35K9J99R4k90Q8l1k85K24J45
$$ 106 83 45 182 102 138 183 80 309 -110 113 114 143 -134 198 -37 -8 191 285 -5 83 52 -233 -9 136
4553A36k8kk1j17L0O4J69j23k87L15r5m1K1K16m62J12M27o52M09J42r6l4l8O6
$$ 136 108 106 85 -32 -2 62 231 108 -179 136 41 0 21 237 -225 -113 314 -338 71 213 117 83 45 111
4577A11K2j27J34k31J67n0P4L7j02j75L96l35J19J7M7k02j85N14n32Q5K42O6l94
$$ 111 133 6 140 -91 76 26 100 137 35 -140 256 -79 40 57 104 -98 -283 231 -301 -216 26 92 -302
4600c02O12m96K11k05L28k19L75o30M23o1l4J33k09L50l44n8K97L3n91K80L3J19
$$ -302 310 -186 25 -180 148 -71 304 -326 97 36 2 135 -74 276 -68 -126 171 204 -387 -107 -74 45
4622D5j73m0k17P9L07Qj09J42J55Q1k28j69R6L35l49LP0m9m8K57j43O1j21n9J83
$$ 45 -128 -168 -385 -306 1 9 -100 42 197 278 50 -119 -23 312 -37 -34 36 -13 -61 196 53 114 -7 -66 117
4647A17j08j73M39k04J27k38j21P2K06n5p2K30k6j76j27j0K35l72K37RO7j01l26
$$ 117 9 -164 275 71 198 -40 -161 -89 117 62 -10 220 194 18 -109 -119 116 -256 -19 -10 57 -44 -370
4670c70M34j24j40K55K9J2j4k29J88J63j31P8k57K76j5j37j13M5P5q1n4K8K25
$$ -370 64 -60 -200 55 84 96 82 -147 41 204 73 151 -106 170 155 18 -95 -50 25 -56 -110 -82 143
4693A43k13j4J16J3k44p8L70j2K98n34j88L87k16M0l7L11n27L00k7m0j6J54m3
$$ 143 -70 -84 32 45 -199 -277 93 81 379 -155 -343 44 -172 -132 -169 142 -385 -85 -112 -152 -168 -14 -57
4716e7o5N5J79k3j89J57n3j7l23K84j05K42n2J75k22R6j18J16k2RJ00k47N3K11
$$ -57 -122 -67 112 89 -100 57 4 -13 -336 -52 -157 85 33 208 -14 82 -36 80 58 67 167 -80 -27 184
4740A84j79N4p3Jm4j23J76j49M06k45M7j02j8l5O1k02J98k2Q2N1k55J61j39K86
$$ 184 5 59 -14 -13 -57 -180 -4 -153 253 8 55 -47 -65 -100 -39 -241 -43 -65 17 68 -187 -26 -165 121
4764A21n0o0m5K3j26K02J5l5Q8m6j86JM00l55OJ63j3j59k29J92j9j22N9J75M2
$$ 121 71 11 -34 -11 -137 65 80 45 133 87 -99 -98 302 -53 -47 116 103 -56 -285 -93 -112 -234 -175 0 42
4789D2P1q2P0j48J96o8k34K43j66M1q8m9K63q7J1q5M5L3L5k26K07Nn5R0n0j07
$$ 42 113 31 101 -47 149 81 -153 90 -76 -35 -123 -172 91 4 15 -70 -25 8 43 -183 24 29 -26 64 14 -93
4815i3NJ03P2n1j18K01j92K3L01k85j18J49q6J06J8j28j84L73j45J60j81J02O6
$$ -93 -88 15 87 36 -82 119 -73 -50 251 -34 -152 -3 -89 17 35 -93 -277 96 -49 111 -70 32 98
4838I8o6K0j06p5M7J60p4P6j31m0L4J81o4M0k42K31Q9j56J87m59K88q8J14k22
$$ 98 32 52 -54 -129 -82 78 4 80 -51 -91 -57 124 60 100 -142 89 178 22 209 -250 38 -50 64 -158
4862a58K39K8k47K74l89M14j29M8j57J49j69o0M5L62p1l06J86j53J44j53J36M3
$$ -158 81 109 -138 136 -253 161 32 80 -77 72 -97 -157 -112 250 179 -127 59 -94 50 -103 33 76
4884G6j8j10p2K02J66l50M6K1l5q4K52k37n3L31n0r7J20L3k09J50J3m1N3m4r8
$$ 76 58 -52 -124 78 244 -106 -60 -39 -74 -158 94 -143 -196 135 85 -12 108 141 -68 82 95 54 107 63 -35
4909c5p5k8J96Q2r9q1qj0O5J67j1l68R9O9o7J18q7J21J27j83L5Q3n3NM4l06N26
$$ -35 -110 -138 58 140 41 -40 -48 -58 7 174 163 -205 -106 -37 -104 14 -73 48 175 -8 27 110 57 62 106 -200 326
4936C26k40j43r5N8l1l8J69j00M9L0K2k53K6n1K18J1P0r5R9J34k23K52k7k42L45
$$ 326 86 -57 -152 -94 -125 -163 6 -94 -45 -15 7 -246 -220 -271 -53 -42 28 -67 32 166 -57 195 168 -74 271
4961B71k13k8P8K0k03p0L83k78j75K90n9p6l34K33J29J23q0j58K39M2n3j77l1
$$ 271 58 30 108 128 -75 -145 238 -40 -215 75 16 -60 -394 -161 -32 91 11 -147 92 134 81 -96 -127
4984a27j77J16L00j64M76n82L25j59K91j53J36l2m23L65j90j71K30q7l3K48k84
$$ -127 -304 -188 112 -52 424 -158 167 8 299 146 282 250 -173 192 2 -169 61 -26 -59 189 -95
5005i5J97j57K7l8J81j9R0k38R5N4m8p3j24O5J81Kq7j42OMJ47J94m6K8k25J36
$$ -95 102 -55 -28 -66 115 96 186 -52 43 97 49 -24 -148 -83 98 100 13 -129 -123 -119 28 222 176 204 -21 115
5031A15j65K55j09k12J03n0K83l47J79KQJ80j18k78lN1J23O0j32J97j82j50J83
$$ 115 -50 205 96 -116 -13 -63 220 -127 52 54 62 242 124 -154 -157 -106 17 77 -55 142 -40 -190 -7
5054gj81K20J52j92m1L29k60J00L4K7k2m4K7On40M77L0%m0J67j05k49p9K77j21
$$ -7 -188 32 184 -8 -49 280 20 120 154 181 159 115 142 148 -392 85 115 115 75 242 137 -112 -191 86 -35
5079c5Q7l4q6j40M25m34Q6J34J09l16K92k41k6L85o9l38L57Jl21L03j24K3m7k66
$$ -35 52 18 -68 -208 217 -217 -131 3 112 -204 88 -153 -179 206 137 -201 156 157 -164 139 15 38 -9 -275
5103b75L45j55P7j06L28l28Q7J65l44K59l19N72m37K15k13j49K88q5j26j29N23
$$ -275 70 -85 -8 -114 214 -114 -27 138 -206 53 -266 306 -131 84 -129 -278 10 -75 -201 -330 193
5124A93k31L3l0J93k07J56k37J71o1j38J07J14r4J36k81J96P6j37o2r2M09o05
$$ 193 -38 -5 -35 158 -49 107 -130 41 -20 -158 -51 63 -31 105 -176 20 96 -41 -103 -195 214 -391
5146c91K82K53K21n61J52p4R2J36j01q0L6N9J30k40R8k93O76m44p1J68j3L4m0
$$ -391 -109 144 365 -196 -44 -118 -26 110 9 -71 -35 24 154 -86 12 -281 395 -49 -120 48 35 69 29
5169B9l2J69k71J03l4J24J72k38J78k81j57K76K25o94M86q1K70k54R9L4j34q6
$$ 29 -3 166 -105 -2 -36 88 260 22 200 -81 -238 38 263 -431 55 -26 244 -10 89 123 -11 -97
5191i7l0K90j60j47O6J3K75j78j9N2k41J69M4j03J08K0l11Q4K36P9k90J11M3j83
$$ -97 -127 163 3 -144 -78 -65 210 32 13 65 -176 -7 37 -66 42 62 -249 -165 71 150 -140 -29 14 -169
5215a69K17Q1l16n7M02j60j12O8Q7J80j6m22K19Q4j26j87J56p2K23k09o4N4Mk8
$$ -169 48 129 -187 -244 158 -2 -114 -46 41 221 205 -217 2 86 -40 -227 -71 -143 80 -129 -193 -139 -135 -163
5239a63KK66r5Pk5k6J2j82PM86j44P6k00Q9j90K94k81J36N4k01r5K38k48M6K44
$$ -163 -161 105 10 17 -8 -34 -22 -204 -197 289 145 221 21 110 -80 214 -67 69 123 -78 -173 65 -183 -137 107
5264A07l29L07k02J30J21k85J55o6k50K44M77o09K00n5K42j05l1k88M13k16m7
$$ 107 -222 85 -117 13 134 -151 4 -62 -312 -68 409 -200 0 -55 187 82 51 -237 176 -40 -87
5285h7O0j92L87R6k19J6Q4O0K0k32O8k54M03k70K76o7J7j25j47j82K81j54k6K67
$$ -87 -27 -219 168 264 45 61 145 205 225 -7 61 -193 210 -60 216 149 166 41 -106 -288 -7 -161 -187 80
5309H0m09m3L31JJ51j68O6lJ17j42J16L2K37l75J01JO5N9l08Pm8m6J85k53K07
$$ 80 -329 -372 -41 -40 111 -57 9 6 123 -19 97 129 366 -9 92 93 158 217 -91 -84 -132 -178 7 -246 -39
5334c9j45P6j78K23j47m1KK36K05j33K5K6j38j2J70j59j54L92M8j41Q8k91J86
$$ -39 -184 -108 -286 -63 -210 -251 -249 -13 192 59 84 110 -28 -40 130 -29 -183 209 257 116 204 -87 99
5357I9j59q7k6O0m8L53j86k54J48L2K25k17Pr1L04j95j26l9J08L93m72Q2M4K7
$$ 99 -60 -147 -173 -113 -161 192 6 -248 -100 -68 157 -60 -53 -144 160 -35 -161 -200 -92 301 -171 -89 -45 -18
5381a8k37J35mK73k2j15j9k82N16m4n5l03K01j62J59l4M3qj74L17j76j75k13L81
$$ -18 -255 -120 -124 149 127 12 -7 -289 227 183 128 -175 26 -136 23 -11 32 24 -150 167 -9 -184 -397 -16
5405a6j18J92k49m7P7K25j89K1J18J13j47OM13m37J14K2k0N8o9j39Q0k1RK19k55
$$ -16 -134 58 -191 -238 -161 64 -125 -104 14 127 -20 -14 399 -38 76 98 78 136 67 -72 8 -13 -4 215 -40
5430d0n2q7l4K33j00qj29J34p2L08j18K22k72K11j16o1pm2J31l49M36j12j1J2
$$ -40 -92 -179 -213 20 -80 -88 -217 -83 -155 153 35 257 -15 196 80 19 12 -30 101 -248 188 76 65 77
5454G7pk3j52R5O0RJ89j01pl56r5J66q7K05R1K38l22Q2j92K18k54q3K36j59K59
$$ 77 70 47 -105 -10 50 59 248 147 140 -216 -311 -145 -232 -27 64 302 -20 62 -130 88 -166 -249 -13 -172 87
5479H7J46l87O1L60k18r1j47K39m5q4J17J05L6j47J14j95J98j35Oj07j13L63j32
$$ 87 233 -154 -93 267 49 -42 -189 50 5 -79 38 143 179 32 146 -49 149 14 20 -87 -200 163 31
5502C1k4k44L29j24r8J51KL14n60J12J76j06j00L34o6j8N9j40j06j9oJ8J36J06
$$ 31 7 -237 92 -32 -130 21 23 337 -223 -111 65 -41 -141 193 127 109 168 28 -78 -97 -103 -85 51 157
5526A57k23m3L1k15L15Q1m44M03j00k20N1R2l1r9M49r3j92K71j89K39k62j93L32
$$ 157 -66 -109 -78 -293 22 103 -341 62 -38 -258 -207 -115 -146 -245 204 111 -81 190 1 240 -22 -215 117
5549A17L1J03n34M23k36k03K19k7J00o6K71k38N0j67K35Pj82L21j07k87J81mM
$$ 117 148 251 -283 140 -96 -299 -80 -107 -7 -73 198 -40 10 -157 78 85 -97 224 117 -170 11 7 11
5572A1K64k82K21r4k38M03k82j9R0J39Q5j86j20L89n95J47p1L06l65K6J61J5j23
$$ 11 275 -7 214 120 -118 285 3 -16 74 213 298 112 -8 381 -214 -67 -138 168 -197 -171 -10 5 -118
5595a18n2K12k72N05n59L00K78l83l4n0J18j00L15J0k53j31N24m73P3K10j32m3
$$ -118 -170 42 -230 275 -284 16 294 -89 -123 -173 -55 -155 160 170 -83 -214 310 -163 -90 120 -12 -55
5617e5m67N13Q4Q9m6r4j33J61Pk67N7R7j53K19j14j08J18j73M99k08j25L61k82
$$ -55 -522 -9 75 164 118 24 -109 52 59 -208 -151 -54 -207 12 -102 -210 -92 -265 234 26 -99 262 -20
5640b0O9J05J4j3k53J91k88K51j15M1m6jJ28j71J42r6n6n1kJ21J96j94n1o0R5
$$ -20 49 154 168 155 -98 93 -195 56 -59 -18 -64 -65 63 -108 34 -62 -118 -169 -171 -50 146 -48 -99 -159 -64
5665f4K65l38K03m7q2R3J32k97K18o5k82L29K5J7l36J46L8R0K06k96k47N31k50
$$ -64 201 -137 66 19 -63 30 162 -135 83 18 -264 65 90 107 -229 -83 -45 45 251 -45 -292 239 -11
5688a1J86l4On48L84k98L95j52j38L16k49K74l24K45j52M2k0J74kl39P5K35l14
$$ -11 175 141 147 -401 -17 -315 80 -72 -210 106 -143 131 -193 52 -100 -58 -78 96 94 -245 -170 65 -249
5711b49K78r9K51n8k57R8J37k0o8J01j05O3j90j78R3J13j36J39k09K03r9L18j9
$$ -249 29 -70 181 123 -134 -36 101 81 13 114 9 72 -118 -296 -203 -90 -226 -87 -296 -93 -192 126 107
5734A07r7r9j94K18K32k6M6M9l26M0j57J20O2J2j70K36l69J74J74j86K2K00k0
$$ 107 10 -89 -283 -65 167 141 187 236 -90 -50 -207 -87 -25 -13 -183 53 -316 -142 32 -154 -132 68 48
5757D8j8m1J4q9Q7j16m8J38K91k03l4k9q2J6K59J5j73n1J37J33l22N3K74k53n7
$$ 48 30 -11 3 -86 1 -115 -163 -25 266 63 29 0 -82 -66 193 208 35 -16 121 254 -68 -15 259 6 -51
5782e1J80K47l62j25j28N49l59r1R3j8P0j25J80j60J28PO6j08N9j07K58J2j89
$$ -51 129 376 14 -111 -239 310 -49 -140 -47 -65 5 -120 60 -100 28 35 101 -7 52 -55 203 215 26
5805B6k00J85P6l12J90k8J22J76k75J0J3J08k69K71j16K10n4m65M02k55K12J02
$$ 26 -174 11 87 -225 -35 -63 59 235 -40 -30 -17 91 -178 93 -23 187 133 -332 70 -185 27 129
5827A29k21J70Ol0N5q2K4J27k7p7P8p1j88j6J16j9j26L48k50J24k01J68N2k18
$$ 129 -92 78 84 54 109 27 51 178 151 74 152 81 -107 -123 -7 -26 -152 196 -54 70 -131 37 89 -129
5851a29M17l48J55k6j00K34m12M40k69P9k38L00l55J83K2k5J1J04rL8p0K48l4
$$ -129 288 -60 95 69 -31 203 -209 231 -38 41 -197 103 -252 -69 -47 -72 -61 43 34 72 2 250 216
5874B16J70l61l9j70J53J04r3j33J94J73k04j3J42K4j04PM7k91J60J30J43j36
$$ 216 386 25 -14 -184 -31 73 -20 -153 41 214 10 -3 139 163 59 66 113 -178 -18 112 255 119
5896A19p6r9L0Q4k38k6N26l24r8K10o0j27j56M03j60j15J23p5J32J09l01J19m3
$$ 119 43 -56 -26 58 -180 -206 320 -4 -102 108 48 -79 -235 168 8 -107 16 -59 73 182 -119 0 -43
5919d3k4J17M5j5M9l81K48j39K60m0j38K22j97l9L99l42n6Q2L52l83K15n03J66
$$ -43 -67 50 95 80 129 -252 -4 -143 117 77 -61 161 -36 -75 324 -18 -74 8 360 -23 192 -311 -145
5942a45L22p7k5P9k27o3L1R5j81J98rL%J38o2l52L16K58l50o5J53q8j36K05J84
$$ -145 177 100 75 154 -73 -136 -105 -10 -191 7 -2 1 1 139 77 -275 41 299 -51 -116 37 -51 -187 18 202
5967B02k65Q6m5J56R3l26J21P2k32K67j40J99j97J75m4R9L6l75K49Nm48M06o1
$$ 202 -63 23 -22 134 227 -99 22 94 -138 129 -11 188 -9 166 122 221 257 -118 131 136 -312 94 33
5990C3K44l33K50j85k9K83l74J28L15l38k7K28r1j6K66k27j87j42J57J1R8Pn6
$$ 33 277 -56 194 9 -20 263 -111 17 332 -6 -33 195 104 88 354 127 -60 -202 -45 -34 64 71 15
6013A5K61m42K14j20P5J89k99J32r7K78k61L19k28r5P1J5q2J65J6l32L74m9j03
$$ 15 276 -166 48 -72 3 192 -107 25 -72 206 -55 264 36 -59 12 27 -55 110 126 -206 168 119 16
6036A6k13L48O5k20j5K01k14r4L5l7P4K50l25R0ML8J97k57n4Q3J79P7k76n6Qn7
$$ 16 -197 151 216 -4 -19 182 -32 -126 -91 -128 -54 196 -129 -39 -35 3 200 -57 -111 -28 151 228 -48 -104 -96 -153
6062a53L6j6J9p2L16l25K97k24K0n5M31k24K3j80p4L04j87K77k40M3j17j33L71
$$ -153 -117 -133 -114 -186 130 -195 102 -122 -102 -157 274 50 73 -107 -181 123 -64 213 -27 16 -101 -234 137
6085A37k21q5J90l05L65M6k75Q0j6K89j59J3r4Q4P0j2l8N4k26K10K0M1j68j62
$$ 137 -84 -169 21 -284 81 127 -148 -68 -84 205 46 59 -35 49 119 107 69 123 -103 107 127 168 0 -162
6109a62K98j06K56m49J59P4J20k13j27R0k18K48Rj30M9K40l16J57j58r3J66qK59
$$ -162 136 30 286 -163 -4 70 190 -23 -150 -60 -278 -30 -21 -151 -102 138 -178 -21 -179 -272 -106 -114 145
6132A45n05M16j18K03m00L23K13k34k56K92J56R6m89J85j18J09k16J48J40K7j07
$$ 145 -360 56 -62 141 -259 64 277 43 -213 79 235 331 -158 27 -91 18 -198 -50 90 117 10
6153A0o7q6J99l30K73K22k09o1m5qJ61q0k10L62k75r3L32J79k76l3p3K48k33J8
$$ 10 -57 -143 56 -274 -1 221 12 -49 -94 -102 59 -21 -231 131 -144 -237 95 274 -2 -35 -108 140 -93 -75
6177g5N8K19j25j18O6M8N9j08j12j8L09l57K34j59J76k20M33q5k06R7l55L11Q0
$$ -75 -17 202 77 -41 25 73 132 24 -88 -106 203 -154 80 -79 97 -123 310 225 19 116 -239 72 152
6200A52o1J25k27q9K19j24mk43P0l4k07M38j9K09l28R7Q5p5j29J34k35m0L81q6
$$ 152 91 216 -11 -100 119 -5 -9 -252 -182 -216 -423 15 -4 205 -123 -26 59 -16 -145 -11 -246 -286 95 9
6224IK26k5k40K5K0Mm1L8J95l50J36O6o4O0K0k9k5p0o2Q8j03J79j51K51k63K8
$$ 9 235 210 -30 -5 15 19 -22 16 211 -139 -3 63 -1 59 79 50 25 -45 -107 -19 -122 57 -94 157 -106 -78
6250g8L01l16kj08K11k23K1L01k9J9m6j2N7J29k54O9l05M38j83m2L6k65K57j32
$$ -78 223 -93 -95 -203 8 -215 -194 107 78 97 51 39 96 225 -29 40 -265 173 -10 -52 -16 -281 -24 -156
6274a56o4J09J87q3m9N8O4l73lK76p7R4o8Or3J08J10j98Q1R4j55K11L2j00k47
$$ -156 -220 -111 76 -7 -56 2 66 -307 -310 -34 -111 -17 -85 -79 -172 -64 46 -152 -71 23 -132 79 111 11 -236
6299b36R1J32K2K8m2K0l1r8R9k03K67m0Pm1Rj84O2L48l41K99k36j37K10J44k2
$$ -236 -145 -13 9 37 -5 15 -16 -114 -15 -218 49 9 16 -25 -16 -200 -138 210 -131 168 -68 -205 5 149 127
6324A27j24J64n08Q5K58R3l12L19k36Q0k0L7k8j17o7J87J11J42j87J64J50l19
$$ 127 3 167 -341 -256 2 95 -217 102 -134 -54 -74 -37 -65 -182 -249 -62 49 191 4 168 318 -1
6346aqqj9J32l0J55l78K08k9R7k31J09J18j21l59K82J7o5L01j45J24O3n52M06
$$ -1 -9 -17 -36 96 66 221 -157 51 22 119 -112 -3 115 -6 -365 -83 -66 -131 170 25 149 212 -340 66
6370F6j6N3j27k02M35k88J05k17K20j63L59k65j40n4K33j87N29m16O7J42n2J92
$$ 66 50 103 -24 -226 209 -79 26 -191 29 -134 225 -40 -180 -234 -1 -188 341 -75 -8 134 82 274
6392B74k53K2J20j41l05L01l0l7j07L62k10J34N7l47K6K97k74M7O5K14J6l62J26
$$ 274 21 43 163 22 -283 18 -12 -49 -156 206 -4 130 187 -160 -134 163 -111 -64 1 215 231 -131 -5
6415eo4O2K1J19k00j65n1L72j74O9Q0o6L6J34j86j21K19k89K46J8N5N1J5p8k83
$$ -5 -69 -7 14 133 -67 -232 -283 89 -85 -16 64 -2 34 168 -18 -139 80 -209 37 55 110 161 176 98 -185
6440a85J70J53k17P8nN4n8J6l07L49L9N4l8j74L59J8j69j53N6j00J54k03J28k33
$$ -185 -15 138 -79 -1 -6 48 -10 6 -301 48 87 141 103 -71 288 306 137 -16 40 -60 94 -109 19 -214
6464b14J07Q2J27j77n0L2l6M9L36k51P8j32q4n4N7O0L5m1m9N37k69Mj05k54N78
$$ -214 -107 -25 102 -75 -125 -93 -129 -80 256 5 83 -49 -133 -187 -130 -70 -35 -76 -125 412 143 147 42 -212 366
6489C66m32J6O4k8J63J15k18j56L36k94N8q0J5J9K03j09M6l47L02j95K71j78o2
$$ 366 -66 -50 14 -14 149 264 46 -110 226 -68 -10 -90 -75 -56 147 38 84 -263 39 -156 115 -63 -125
6512a25K59j83K85j91m3n7J84k30R3J9J2J63l74L2L67o0l63R5qJ30J7J10K6p1
$$ -125 134 -49 236 45 2 -55 129 -101 -8 11 23 186 -188 -156 211 151 -212 -117 -125 5 22 132 158 87
6536H7j76j7q4J52K44k95J51Rq2O6j97K86k1j04p5J59p7n3J05j96L12j21j32o6
$$ 87 -89 -106 -190 -38 206 -89 62 71 -11 55 -142 144 123 19 -56 103 26 -27 78 -118 194 73 -59 -125
6560a25K52r2j01Nj25J29K28j56l08J09R4L9J48K6j79K99k52j07N3L97n39K56
$$ -125 127 35 -66 -61 -186 -57 171 15 -293 -184 -90 -51 97 123 -56 243 -9 -116 -63 334 -205 51
6582E1kr1k28L37N9j43k15L44l14K45j53k1j12J24K05k01j3M1K64k81Q3O1J39
$$ 51 49 -42 -270 67 126 -17 -232 112 -202 43 -110 -131 -243 -119 86 -115 -128 -87 177 -104 -21 40 179
6605A79l09M05l07P4j83J97K59k62J56j94J00k47J98m9K2j17j0j27l6M33j16j90
$$ 179 -130 275 -32 42 -141 56 315 53 209 15 115 -132 66 17 39 -78 -88 -215 -251 182 66 -124
6627a24J23k73M23m45K53o3J11J64m12Q3M8K21k82M93j76l5j22o9j29L45n2j44
$$ -124 -1 -274 149 -296 -43 -106 5 169 -243 -160 -112 109 -173 320 144 109 -13 -82 -211 134 82 -62
6649f2n7Q5j8L45l13j4J13m35L17J3p1J3o4r5L27k44J54Rl03L63k4L1m0j25r4
$$ -62 -119 -34 -52 293 -20 -34 79 -356 -39 -26 -97 -84 -148 -243 84 -160 -6 3 -300 63 39 70 30 -95 -189
6674a89L92m86R3L67jk69o0Q0M4L6P5m6J36J5n01L05j91lJ17J29L47n53L9M3J23
$$ -189 203 -283 -190 177 176 -93 -153 -73 -29 7 82 36 172 187 -314 -9 -200 -203 -86 43 390 -163 -124 -81 42
6699D2j18K88l37J51o0q6O7K73m02L68j25Kl07K71O0l4j67K62j75j9M1l2j16K69
$$ 42 -76 212 -125 26 -34 -120 -53 220 -182 186 61 63 -244 27 87 53 -114 148 -27 -46 -5 -37 -153 116
6723A16l97L17K69k96l1m9N7j6j3K0K81j67j57m9K94k92O4J18J05l22J46K37k10
$$ 116 -281 36 305 9 -22 -71 -14 -30 -43 -23 258 91 -66 -115 179 -113 -49 69 174 -148 -2 235 25
6746B5K3k20L47j43m9J91O9k7j72J38j53P1j00k28K59J63l47K03j91K84j46k14
$$ 25 48 -172 175 32 -17 174 243 216 44 182 29 100 0 -228 31 194 -153 50 -141 143 -3 -217
6768b17M4J69j84J2K84j17J66m72K60R9K59l25k4J48k4r3j47J00J27K8l8J7R7
$$ -217 -173 -4 -188 -176 108 -9 157 -315 -55 44 303 -22 -46 102 78 -15 -162 -62 65 93 55 72 169
6791A69J51m67K2R6J30j17r8P0J02O1j02j08m1J50qq9R0o2q4K76j99K7j37RK75
$$ 169 320 -147 -125 -29 101 -16 -114 -44 58 119 17 -91 -132 18 10 -79 11 -51 -135 141 -58 -31 -168 -159 116
6816A16j10m3K81m88J65K58j97MJ68m5j14J10J44m97J11L27J0j03l30J58qM0J15
$$ 116 6 -37 244 -244 -79 179 -18 -14 154 109 -5 105 249 -248 -137 190 200 97 -233 -75 -83 -43 72
6839G2j22J60k06L7N5K06j22k08J29j33L7J05j67j70L67k17L33j7k44q3R9P6R4
$$ 72 -50 110 -96 -59 -4 202 80 -128 1 -132 -95 10 -157 -327 40 -177 156 139 -105 -188 -89 -13 81
6862H1K3l12L22j8j33N5o3j03K5K45Q0l2l13M39j52j83K57K2l77J69l9o2j32L46
$$ 81 104 -208 114 96 -37 18 -45 -148 -123 122 202 170 -143 296 144 -39 218 240 -137 32 -7 -69 -201 145
6886A45l62J38L30k34j61K7Q9j9j04L67nk78K70P6k13J01j26j29Q4L6j73J53l09
$$ 145 -217 -79 251 17 -144 -117 -28 -47 -151 216 211 -67 203 279 66 167 41 -88 -4 32 -141 12 -297
6909b97R1L32j61j76J26J43JJ82l19M0k4L35l19J7o2j22J61L35l82L76L4m75n0
$$ -297 -206 126 -35 -211 -85 58 59 241 -78 -38 -62 273 -46 -29 -91 -213 -52 283 -99 277 311 -164 -214
6932b14K49K12l84J3L72o04M05j53J54j20L7J11J4j53J53J22j62k31J25m1j67
$$ -214 35 247 -137 -124 248 -356 49 -104 50 -70 -33 78 92 -61 92 214 52 -179 -54 -95 -262
6953b62K40L41j47k52K74j66K5k31K96o4j72k7J96j04K62j23J06Pk80K66j2p3
$$ -262 -22 319 172 -80 194 28 53 -178 118 54 -118 -145 51 -53 209 86 192 199 -81 185 173 100
6975A00M1k18j2J17k65K62j85J02j74Q1M26m59l9K97k11l2L58k64J52J22l70O8
$$ 100 141 -77 -89 28 -237 25 -160 -58 -232 -151 275 -184 -223 74 -137 -169 189 -75 77 199 -171 -103
6997a03L82M3l74K74m32K06l1Q5j15K9R5q2K7MJ7K5J19l24J62K01k14j88J64M6
$$ -103 279 322 -52 222 -210 -4 -35 50 -65 -36 59 -23 4 8 25 50 169 -155 7 208 -6 -194 -30 16
7021A6k6j73O8L27k31J09j06K82m35K94r3O9P2l49l6L18j59pj26O05m00j46L67
$$ 16 -10 -183 -115 212 -19 90 -16 266 -169 125 32 101 173 -176 -212 106 -53 -60 -186 419 19 -127 240
7044B40j00J29j71n3J52j42j74j36k6K51O0j11J01R8p8k2j92K22J29n33N17q1
$$ 240 140 269 98 45 197 55 -119 -255 -281 -30 30 -81 20 118 40 18 -174 48 177 -356 161 80
7066H0k31L07k85O1J41Q6j24J53q7j97j58M31j96J2k4n4J92m5j17l9o1L32l29
$$ 80 -151 156 -129 -68 73 159 35 188 101 -96 -254 177 -19 -7 -31 -85 107 62 -55 -94 -155 177 -152
7089a52J24j03J58j31J14J83k43J11j8O1k49K20o6j35J33O1j71L66j83m8J27k58
$$ -152 -28 -131 27 -104 10 193 -50 61 43 104 -145 75 9 -126 7 68 -103 263 80 32 159 -99
7111i9R2J10j87K01j40R1J5j55N6Q0l06K46J8J95l15J16j2J56k24n8k86M90J59
$$ -99 -7 103 -84 117 -23 68 83 -72 -16 64 -242 4 22 217 -98 18 6 162 -62 -120 -406 84 243
7134B43k71K82l04r7K72J89k42j96J50J31O4j92k00K14p9j37J07q3J60j72J28
$$ 243 -28 254 -50 -147 125 314 72 -124 26 157 221 29 -171 43 -36 -173 -66 -149 11 -161 -33
7155c3N4N3n4l5jK68p7j78K17j93k17J46P3P9j46K71j67J06k05J98k37L0J95k47
$$ -33 21 74 20 -15 -16 252 175 -3 214 21 -196 -50 23 102 -44 227 60 166 -39 159 -78 -48 147 -100
7179a00Q6rj89N5J71l11J02N43k98k89K86j06K28o9j08j08lm9J39j33J0K98j24
$$ -100 -14 -23 -212 -157 14 -297 -195 348 50 -239 47 -59 169 100 -8 -116 -119 -168 -29 -162 -152 146 22
7202B2J06p2l42M06J47l27r9L33M3j96pJ7k71L38l39K90L6l8o2r8m7J32Q4j0j59
$$ 22 128 56 -286 120 267 -60 -159 174 217 21 14 31 -240 98 -241 49 85 47 -15 -113 -160 -28 56 46 -113
7227a13q7L1N2N34l80l34J38K51N7j56JO7k2N0k38Q5n2Q8j60L17l73J65j33K52
$$ -113 -200 -169 -117 417 37 -297 -159 92 149 -7 -6 61 39 89 -149 -64 -116 -28 -188 129 -244 -79 -212 40
7251D0j57J70Q0K4l17K96k89K63k12K15J27k73K04k44K17k24K0j10J26j86K51
$$ 40 -117 53 133 157 -160 136 -153 110 -102 113 240 -33 171 -73 144 -80 -60 -170 -44 -230 21
7272B1J7k69J86j02M4R6l14K06l09L27J64o7l9J13l1R3k11L91k49k20j6K81kj84
$$ 21 38 -231 -45 -147 -103 -7 -321 -115 -424 -97 67 0 -39 74 43 136 -75 316 67 -153 -169 112 110 -74
7296g4K61m04J72O7J47O3l54J98k42K47qJ90l48K21n4j76j0K7J16q0j17L91j74
$$ -74 187 -217 -45 22 169 232 -122 76 -166 81 73 263 -85 136 82 -94 -104 -77 39 -41 -158 233 59
7319E9j36J62p4J18j81K4J4n0N8K10j25q4L1j09J35k50R6L36r0k52J03J79r9l
$$ 59 -77 85 11 129 -52 -28 -14 -64 -6 204 79 -5 26 -83 52 -198 -102 234 144 -108 -5 174 75 72
7343G2N3j65N8l21K23R1j05j61K77mM4J9M3j84M3nj03K91N1k14k99K53J35k03
$$ 72 125 -40 18 -303 -80 11 -94 -255 22 18 62 81 124 -60 -17 -22 -125 166 217 3 -296 -43 92 -111
7367a11L4L13j69j5j06o9L21j29j63L4J34j72M7l7K52j7o5J4k55o5L10J37l69
$$ -111 -77 236 67 52 -54 -123 198 69 -94 -60 74 -98 -51 -88 164 147 82 96 -159 -224 86 223 -146
7390a46j49L63Rj9j88K66k15L46k42M6j73J51l8j69L73r8k05M1N6k90K34K13l42
$$ -146 -295 68 77 58 -130 136 -79 267 25 71 -102 49 11 -158 215 117 -88 -47 9 -281 -47 166 -176
7413a76j56L44l5j05r7J48J29j66J04M9R5J7k24L65k56Q6m05L10j77J7j32K71
$$ -176 -332 12 -23 -128 -225 -77 52 -114 -10 39 134 151 -73 292 36 122 -283 27 -150 -133 -265 6
7435FK74k19j0l2j28o3q5K26J60k60Mj13j4J15K0j62O66k22j65K56j57j20K3K34
$$ 6 280 61 51 19 -109 -172 -257 -31 129 -131 -127 -240 -254 -139 -119 -281 385 163 -2 254 97 -23 0 234
7459B34q2q8j63l9K14j07l6K05k09R3j91j6K29j7p4N1qk9L9k2M9J0Q8j64K04R1
$$ 234 152 64 -99 -138 76 -31 -67 138 -71 22 -169 -185 44 27 -47 4 -4 -33 6 -16 33 43 131 -33 171 262
7485B62l41J63jq6n1J54j58L0J21l14K06Q0k33K17k59L31o1n0M3j44q3L04P7l21
$$ 262 -79 84 83 -3 -54 100 -58 -28 93 -221 -15 65 -168 49 -210 121 60 10 53 -91 -174 130 207 -114
7509a14Q5Q0p9Oj37L56j55Mr5j5L69l94N3K31k01j46R2R0LP9mr0j1O8Jqkn1j11
$$ -114 -29 51 -28 -22 -159 197 42 46 -49 -64 305 -89 -36 195 -6 -152 -60 30 33 112 108 18 7 75 76 68 66 15 -96
7538i6o4K70l35K63j07Oj60K33m6K60n3o0l5l0Qk8P4l45M12J23j23j33J02j61
$$ -96 -160 110 -225 38 -69 -63 -223 10 -36 224 171 111 76 46 54 26 100 -245 167 290 167 34 136 -25
7562b5l7J13o8j07K34K0j84p0J75k2o1j03nP7j36K5J92k35K60K64m20l6J80mk6
$$ -25 -62 51 -17 -124 110 130 -54 -124 51 29 -32 -135 -140 -63 -199 -174 18 -217 43 307 -113 -149 31 27 1
7587AJ7J09k54k4K06jJ07k23N7j09OK14k42M0K70k72pK30o5J22n1k24j1J51m7
$$ 1 18 127 -127 -151 55 54 161 -62 -5 -114 -108 106 -136 -96 174 -98 -105 125 60 182 131 -93 -104 47 0
7612@j00L48l66J20M9m5r3J14J83l14k54K75L8K6k88K57n8K56L1k4j45r0lj31
$$ 0 -100 248 -118 2 51 6 -87 27 210 -104 -358 -83 -45 -19 -307 -50 -108 148 179 155 10 -80 -83 -214
7636b14K66k41J80m4j5K06J49l08L65l55j07rK09l4k65K80LMn9P3L5k11j84J78
$$ -214 52 -189 -9 -53 -68 138 287 -21 344 -11 -118 -127 82 48 -217 63 66 70 11 84 119 -92 -276 -98
7660i8n2M51n36L33j65J99j10j21N3k6J89r8jm3j5k33M15R0l19O0M44m24J2k6
$$ -98 -150 301 -235 98 -67 132 22 -99 -46 -72 117 19 18 -25 -40 -273 142 232 -87 -27 417 -7 5 -21
7684b1l88L70q6P2oK77n65L24j01j24L02k45J59R3l19K75k74K28l0N5R4j2q4M2
$$ -21 -409 -39 -125 -53 -59 218 -347 -23 -124 -248 54 -191 -32 61 -258 17 -257 -29 -59 -4 90 78 -6 36
7708C6PPj29J03L06m33l1J57O7m06K39k3j70L68L1k14K41lK32k61qj28r2K5N0
$$ 36 43 50 -79 24 330 -103 -134 23 90 -316 -77 -100 -270 98 129 -85 156 153 385 124 116 -12 -104 -79 -29
7733b9J20j41Q1j76K13j1j9k52J78J74j27Jk28o7L85j0r9Q5j85o8J72J47p1k26
$$ -29 91 -50 31 -145 68 57 38 -214 -36 138 11 12 -216 -283 102 92 -7 78 -107 -175 -3 144 73 -153
7757a53j05K19l2M3j7%j76J70P7J39n2j19j03O9J88k34L98k52m3l7p5K55q4J37
$$ -153 -258 -39 -71 -28 -45 -45 -221 -51 26 165 113 -6 -109 -40 148 -86 312 60 17 -20 -95 160 76 213
7781B13j18j91J89l07L37J15j27k44K28k35J89J2K52o9m37K15l3j36J28K33j33
$$ 213 95 -96 93 -214 123 238 111 -133 95 -140 49 61 313 244 -193 22 -11 -147 -19 214 81
7802H1L8O3k78J90r3K3J17J45l95j88M10K82n00M6K36m09M69l89j0K14P2M4m13
$$ 81 119 182 -96 94 1 24 141 286 -109 -297 113 395 -105 -59 177 -232 237 -152 -162 52 124 168 -245
7825b45P7M45n22K21J33j87M2j2p0J50k4M0m1K36L1k78m7kk72M37K13k41J90l55
$$ -245 -168 277 -245 -24 109 -78 -36 -48 -118 32 8 48 7 243 274 -4 -51 -53 -325 112 325 84 274 -81
7849h1O8J79o5j36K32J8j29j24J12Np3J64j85J51k99L21k9k80n8M7K23N9k53n6
$$ -81 -13 166 101 -35 197 215 86 -38 74 79 6 170 -15 136 -163 158 129 -151 -209 -162 61 120 -133 -189
7873a89K71Q3k05j7J99K0j86M3jl34K67K96j49l3j75k9J58J86O0j74K3k28J95
$$ -189 82 165 -40 -57 142 162 -24 19 18 -316 -49 247 98 65 -110 -139 19 205 265 91 114 -114 81
7896H1l04M67l13J12J75k39K11J3N0l14J62O4k68J4N1Q1j40J21l80M04J58k66
$$ 81 -223 244 -69 43 218 -21 190 203 253 -61 101 165 -103 -89 -38 43 -97 24 -356 48 206 -60
7918f0J33p4k6M0L0J30m06K50M5J89j74j50l5R7P8j30J50k63K07j11M3K00l55
$$ -60 73 -1 -27 13 43 173 -233 17 62 251 77 -73 -108 -11 67 -63 87 -176 31 -80 -37 163 -192
7941a92J26K58k60K3j0J26P6j68j27J61K1j25%J55k4j88j1J24K97k97k68K43Q5
$$ -192 -66 192 -68 -45 -55 71 147 -21 -148 13 34 -91 -91 64 40 -148 -159 -35 262 -35 -303 -60 25
7964B5O5K11n66L59k2n7R6p1p4j39J20r5K45m8n1Q1j97K83j55J53n0l82J26L65
$$ 25 90 301 -265 94 72 15 111 40 -34 -173 -53 -148 97 49 -2 79 -118 165 10 163 113 -269 -143 222
7988B22j28Rr6j53j00P8K62J9m6j29L4J43k35J84K43j91N7k4j74j3K01n3j68O9
$$ 222 94 103 7 -146 -246 -168 94 113 67 -62 -28 115 -120 64 307 116 173 149 -25 -38 163 110 -58 11
8012A1M0P5k90r5N45l69j14J99nk00J15j02P7L39j77Mo6k12O72m19j68J82J03
$$ 11 51 126 -164 -259 286 -83 -197 2 -3 -203 -88 -190 -113 226 49 53 -13 -225 447 28 -140 42 145
8035A45k57j56L16l47L79R0k25k08J56m2M11k55J8J09p4Q3l36L79j61J22j79J70
$$ 145 -112 -268 48 -299 80 170 -55 -263 -107 -149 262 7 25 134 60 143 -193 186 25 147 -32 138
8057A38j62M0o2K13l74L53J77m50K69l41Q7L4Rj27J97j23o4K51j98L69l0m00J57
$$ 138 -24 16 -46 167 -207 146 323 -127 142 -199 -112 -78 -69 -196 1 -122 -186 65 -133 236 206 -194 -37
8080c7K15k99J07j66J15J43L16k37j58Q8q6J69nj6l75P0J59K23j63M6n3Jl4K54
$$ -37 178 -121 -14 -180 -65 78 394 157 -1 87 1 170 165 149 -226 -156 3 226 63 109 56 57 23 277
8104B77k45j7k56M83K5l93J20p1Q2j3J53l10q4K17o7m2J65m5j07Q3J39k85j31
$$ 277 32 15 -241 242 267 -126 -6 -77 5 -8 145 -165 -249 -32 -99 -141 24 -21 -128 -45 94 -191 -322
8127c22M39q7K17k41J20l77L39k99J42J59o0p1J06j31J49q1J52l81K66p8j08Q1
$$ -322 117 30 247 6 126 -251 88 -211 -69 90 30 -41 65 -66 83 2 154 -227 39 -39 -147 -66
8149f6n9o5o4L64m2LJ47m75K86j0k14J93Q3k1O1J08l22Q1oMr2O2KJ02K0k60J78
$$ -66 -125 -190 -254 110 68 71 218 -257 29 19 -195 -2 81 60 121 229 -93 -12 -18 -14 -106 -44 -42 60 80 -180 -2
8176bKN2j56M2N9P7P6j78L8J57l7l11L15r2l3
$$ -2 0 52 -104 -62 -3 74 150 -28 10 167 130 -181 134 42 9
8191I
$$ Imaginary data points
##PAGE= N=2
##DATA TABLE= (X++(I..I)), XYDATA
0@%%%%%%%%%%%qJ6j6J6j6K4l2M0m8N6o5P3q8J05j26J49j71J96k26K59k98L39l82
$$ 0 0 0 0 0 0 0 0 0 0 0 0 -8 8 -8 8 -8 16 -16 24 -24 32 -33 40 -48 57 -69 80 -91 105 -121 138 -160 179 -203
34b03M34m90N50o18O93p73Q61r58J064j178J303j441J591j755J934k131K348k586
$$ -203 231 -259 291 -327 366 -407 454 -504 560 -618 685 -756 835 -920 1014 -1117 1231 -1355
52a355K849l143L471l839M257m734N284n926O691p621Q774j0252J2223j5000J9227
$$ -1355 1494 -1649 1822 -2017 2240 -2494 2790 -3136 3555 -4066 4708 -5544 6679 -8321 10906
67A0906k6505M2407j38071J09365K10027k93866l1355J88301j6081j19587N3178
$$ 10906 -15599 26808 -111263 -1898 208129 -85737 -117092 71209 55128 -64459 -11281
78a1281K7607M569j0406m2074J3798P0780n0139l3930O1030j3456o1726O2169
$$ -11281 16326 20895 10489 -31585 -17787 52993 2854 -31076 29954 16498 -45228 16941
90A6941L1255o9251n629M9587k0455j3294J8565j3791l198K6757l2709k1292O3984
$$ 16941 48196 -21055 -26684 22903 2448 -10846 7719 -6072 -9270 17487 -15222 -36514 27470
103B7470O034q0834J9622O9260m3226l4168O0524m381n4258K8058L0539k1174
$$ 27470 33504 -47330 -27708 41552 -1674 -35842 24682 20301 -33957 -5899 24640 3466
115C466K651o405j9640L8537R203n4802K3261M7304n7954k6432O8535M790n3426
$$ 3466 6117 -288 -19928 18609 27812 -26990 -3729 43575 -14379 -40811 27724 32514 -20912
128b0912N31K2748N294k215k0047K224K9412j9080l0446L6685K5679m2620j4567
$$ -20912 -20381 2367 7661 5446 -14601 -12377 17035 -2045 -32491 4194 29873 -12747 -27314
141b7314L7156N184k5592M795K1708p730k2042O938K2757K596k0566j3952J6776
$$ -27314 9842 15026 -10566 -5771 15937 8207 -13835 -6897 15860 18456 -2110 -16062 714
154G14K2276k1181k3035L2090J2480m5373r90M6313p930l4976O172J5614P61m300
$$ 714 22990 1809 -21226 10864 23344 -22029 -23019 23294 15364 -19612 -13440 2174 2935 -1365
168a365p152R578N915k4898N572L8277j8414l4425K8563J8567k6177k04J7032
$$ -1365 -8517 1061 6976 -17922 -12350 25927 7513 -26912 1651 20218 -5959 -6163 10869
181A0869l096n914r233R69K7699m455m0147J3197L5125k3125k1761K5937P404
$$ 10869 7773 1859 -7374 -6405 21294 16839 -23308 -10111 25014 1889 -19872 6065 13469
194A3469k3412m168J4576Q711p261j6211M839J9199r019j6139J8972J2540k6720
$$ 13469 -9943 -14111 465 9176 1915 -14296 -9457 9742 723 -15416 3556 16096 -10624
207a0624q584L1888O891k7674l191J9959P4j0070N76N956N328j1067j5768K0792
$$ -10624 -19208 12680 19571 -8103 -11294 8665 8739 -1331 -755 5201 10529 -538 -16306 4486
221D486K2202l3435j9413L8147M165l5461J1985K3950k0737j2380J4497O248J33
$$ 4486 26688 -6747 -26160 11987 16152 -19309 -7324 16626 -4111 -16491 -1994 4254 4387
234D387q182j1686J8868J1437k8594K443L4367j7537k9790K7307J9681k3585q421
$$ 4387 -3795 -15481 3387 14824 -13770 -11327 23040 5503 -24287 3020 22701 -884 -9305
247i305J4098K204m951m930K090J2835o262k3057J1135K6622j6541k4808J8976
$$ -9305 4793 6997 2046 -2884 -794 12041 5779 -17278 -6143 20479 3938 -20870 -1894
260a894J5561k1743o570K3005O20k1992J70J7878M281j0579r498Q104J3926j0529
$$ -1894 13667 -8076 -14646 8359 8979 -13013 -12843 5035 9316 -1263 -10761 -2657 11269 740
274G40j2983J9909R888k7603l058K9773k897k4190N897J4944o322r326K837Q297
$$ 740 -12243 7666 17554 -10049 -13107 16666 13769 -10421 -4524 10420 4098 -5228 -2391 5906
288E906Q24j4503m441J9188L714k2892J024K0721p718j6706J2586J4022j2412
$$ 5906 6730 -7773 -12214 6974 10688 -12204 -11180 9541 1823 -14883 -2297 11725 -687
301f87j1614Q827J1613k983r999R49J0744j732j1634O754J4728j1824j6380J3674
$$ -687 -12301 -3474 8139 5156 -4843 -3894 6850 5118 -6516 238 14966 3142 -13238 436
315D36J5673j4044j2372J2104O288j0965n386J0787N920j2400r769J2670J1470
$$ 436 16109 2065 -10307 1797 8085 -2880 -8266 2521 8441 -3959 -13728 -1058 10412
328A0412j2906j0496J2962P972j3285m269J4663M001j4082l629J3188N576j0906
$$ 10412 -2494 -12990 -28 7944 -5341 -9610 5053 9054 -5028 -8657 4531 10107 -799
341g99m912J0675M499j3134k663J5465K045j8315k041J7996o84j5115J690J0905
$$ -799 -5711 4964 9463 -3671 -6334 9131 11176 -7139 -9180 8816 8132 -6983 -5293 5612
355E612l981j0297L343J2176k241j6080J270J7957k044j5973N172J3187p878r352
$$ 5612 1631 -8666 -5323 6853 4612 -11468 -10198 7759 5715 -10258 -5086 8101 223 -9129
369i129J0112Q860p991r968O488J2506m828j3633O412J3580j0353j2410J2787
$$ -9129 983 9843 1852 -8116 -1628 10878 6050 -7583 -1171 12409 2056 -10354 2433
382B433J0728j4651j0110J3584P347j3179n487J1621K656j0863k494R774M788
$$ 2433 13161 -1490 -11600 1984 9331 -3848 -9335 2286 4942 -5921 -8415 1359 6147
395F147q842p743R554R973j1742o846J6265J479j6897M826J4576n011r862K200
$$ 6147 -2695 -10438 -884 9089 -2653 -9499 6766 8245 -8652 -3826 10750 5739 -4123 -1923
409a923N243L511n279p182R253N806j5953j618J8728m949j7752P612J1822p678
$$ -1923 3320 6831 1552 -5630 3623 9429 -6524 -8142 10586 5637 -12115 -4503 7319 -359
423c59p466N393N173l100o096K142R028j371j0667K789J1668l011j1433N427J3318
$$ -359 -7825 -2432 2741 -359 -6455 -4313 4715 3344 -7323 -4534 7134 4123 -7310 -1883 11435
438A1435q460j3103J2090J1194j3261o795J0502K562n963l478J927P334l061j4513
$$ 11435 2975 -10128 1962 13156 -105 -6900 3602 6164 201 -3277 -1350 5984 2923 -11590
452a1590P692J7358j5542j3626J8964N137j7697L615J1483o265m289L210J659
$$ -11590 -3898 13460 -2082 -15708 3256 8393 -9304 -5689 5794 -471 -4760 -1550 109
465A09M063k797q262Q833Q139j3084l331J5415j278j5247M740J3066o277j1250
$$ 109 4172 1375 -6887 1946 10085 -2999 -6330 9085 7807 -7440 -2700 10366 4089 -7161
479g161O106Q250o360p428M628N793j502q085j645J1487J043j5085L252J6147
$$ -7161 -1055 7195 835 -6593 -1965 3828 2326 -5759 -7404 4083 5126 -9959 -6707 9440
493I440r188j2750J4088P508j2456j862P143J637K32n457k071J1998k281j4904
$$ 9440 252 -12498 1590 9098 -3358 -5220 1923 3560 3792 -1665 -3736 8262 5981 -8923
507h923R074J3103j4918p209J3424K911j0925k010O403L977o207p406Q484O893
$$ -8923 151 13254 -1664 -8873 4551 7462 -3463 -5473 930 4907 -1300 -8706 -222 6671
521F671j0665m293J0322J309p351o66N600M893p147p288J1781P247j4267k457
$$ 6671 -3994 -8287 2035 3344 -4007 -4673 927 5820 -1327 -8615 3166 10413 -3854 -6311
535f311J4391l312r472N411M952l054l536k569N822N642j0815n657J3451N76j3344
$$ -6311 8080 4768 -4704 707 5659 2605 -931 -3500 2322 7964 -2851 -8508 4943 5519 -7825
550g825K975J0773o285p986O539O336n529n199N535M180m563k479L578L169n07
$$ -7825 -4850 5923 -362 -8348 -1809 4527 -1002 -6201 -666 3514 -1049 -3528 50 3219 2712
565B712n428n77J0824k514j2872R463J0896j6746m465J8259k878j3013M563L047
$$ 2712 -2716 -3293 7531 5017 -7855 1608 12504 -4242 -8707 9552 6674 -6339 -1776 1271
579A271k75K314q045j002J3873q602j3961J8049P293k1647J321J7510o294p646
$$ 1271 996 3310 -4735 -5737 8136 -466 -14427 3622 10915 -10732 -9411 8099 1805 -5841
593e841O090J319j120K74k644L499N104p752m100J0841J263j1172J483J0931n248
$$ -5841 249 1568 448 722 -1922 1577 6681 -1071 -5171 5670 6933 -4239 -2756 8175 2927
608B927j0693O893R068q961n140O580j75l014K279k492R92M995q471l002J6567
$$ 2927 -7766 -873 8195 -766 -5906 674 499 -2515 -236 -2728 -1736 3259 -5212 -8214 8353
623H353l223j7363J0755J1613j3964j387J2209n267m461M509j248K316L420j0488
$$ 8353 5130 -12233 -1478 10135 -3829 -5216 6993 1726 -2735 1774 526 2842 6262 -4226
637d226L19J3407p768r612J1793K132j2965K220R688l331o472J270L812J513m210
$$ -4226 -3907 9500 1732 -7880 3913 6045 -6920 -4700 4988 1657 -4815 -3545 267 1780 -2430
652b430k933O485K716p879k564R633L292r348k425J0298l4r306M159P713o511
$$ -2430 -5363 1122 3838 -4041 -6605 3028 6320 -3028 -5453 4845 4811 -4495 -336 7377 866
667H66m750M967K931r64l056l076M988K449q770J212R730o648q731P953O075o429
$$ 866 -3884 1083 4014 3050 -6 -3082 1906 4355 -4415 -3203 6527 -121 -8852 -899 5176 -1253
683a253l291J856L089Q69m792M02P591l361p614P139O312o980l152N196J851k556
$$ -1253 -4544 -2688 401 1270 -3522 -3120 4471 1110 -6504 635 6947 -33 -3185 2011 3862 1306
699A306l236L036M906n434n932P519M401q581k658P015r8n519J51M636O11n834
$$ 1306 -1930 1106 6012 578 -5354 2165 6566 -2015 -4673 2342 2244 -3275 -3124 1512 2123 -3711
715c711j875N922K785n751j381M811O33l687O09N257j072o707K199P823k292o558
$$ -3711 -5586 336 3121 -2630 -4011 800 1433 -2254 -1645 3612 2540 -4167 -1968 5855 3563 -2995
731b995L308L900l709j342K001J696p35n926J92R470k439j1135N135Q532q060
$$ -2995 313 4213 504 -838 1163 2859 2124 -3802 -3610 5860 3421 -7714 -2579 5953 -2107
746b107m599Q368K61m931L23R83K655J224n281L66P332l170o406O813M952q021
$$ -2107 -6706 1662 1923 -3008 -2685 -1702 953 2177 -3104 -2738 4594 1424 -4982 1831 6783 -1238
762a238k255P103r5l459P40M74j194N19j057Q13K726m108m298N761M305q034j766
$$ -1238 -3493 3610 3515 56 796 1270 76 595 -462 351 3077 -1031 -5329 432 4737 -3297 -5063
779e063P194j733n830M895L572m500j776K483J242K229j846m524M964L989q099
$$ -5063 2131 398 -5432 -537 3035 -1465 -3241 -758 484 2713 867 -3657 1307 5296 -2803
794b803L39R291l757q043N683M977n754j459K637j44q42j911n8M468p22p506K108
$$ -2803 -2464 6827 3070 -4973 710 5687 -67 -1526 1111 967 125 -1786 -1844 2624 1902 -5604 -3496
811c496O924l317m735M228J835m339M85L513N41j532k569J031N029j1n747J547
$$ -3496 3428 111 -4624 -396 1439 -2900 -2415 1098 1639 107 -2462 -1431 3598 3587 -2160 -613
827f13M962m017k745N719J017o215n34M917L5l157r97J721Q08k802j066M359M88
$$ -613 4349 332 -2413 3306 4323 -1892 -2426 2491 2526 -631 -1628 93 901 -1901 -2967 1392 1880
844A880o173K12O470j299n020K662M013l051l627L970M471k875m253J511M731
$$ 1880 -4293 -4081 2389 1090 -3930 -1268 2745 -306 -3933 37 4508 1633 -2620 -1109 3622
859C622j096m004K027L666l239m183L899L992m164l703J944K458k18j822j427
$$ 3622 2526 -1478 549 4215 976 -3207 692 4684 520 -3183 -1239 1219 1001 -821 -2248
874b248J741O62l155J340M492l357m200M410K917l770n19L704j064k341P22K820
$$ -2248 -507 155 -3000 -1660 2832 -525 -4725 -315 2602 -1168 -1687 2017 953 -1388 -666 2154
890B154J159k975k936M562K322n258p32N006r31n347J371M183p77l824l60K005
$$ 2154 3313 338 -2598 1964 4286 -972 -1704 3302 2371 -2976 -1605 2578 1801 -2023 -2383 -378
906c78Q98j833k78J370l73j852J40K969J533l779j703M670J030l347R49L022l117
$$ -378 520 -1313 -1591 -221 -594 -2446 -2306 663 2196 -1583 -3286 1384 2414 -933 16 3038 -79
923g9j673L669J338j661k180o12L017Q50l997O8L754k579l743L973K470m230j579
$$ -79 -1752 1917 3255 1594 -586 -1198 1819 2669 -1328 -1260 2494 -85 -3828 145 2615 -1615 -3194
940c194K443J340j683q36J991O96k574j20K314J320p70k725J323K945j183k983
$$ -3194 -751 589 -1094 -1930 61 757 -1817 -1937 377 1697 927 -1798 -475 2470 1287 -1696
956a696L933J694o237P87N760k072l554K165r55l40K172k393q23L712l663l454
$$ -1696 2237 3931 -2306 -1519 4241 2169 -1385 780 -175 -515 1657 -736 -1559 2153 -1510 -4964
972d964P263J09p184K586M457m038o37M032j409j258P69l47J777J716l387j076
$$ -4964 2299 2408 -4776 -2190 2267 -1771 -2408 1624 215 -1043 -274 -621 1156 2872 -515 -1591
988a591M291J2m487J992M070l419l895M138K205m367J9K090j874o85J823j544
$$ -1591 2700 2712 -1775 217 4287 868 -3027 1111 3316 -1051 -1032 1058 -816 -1501 322 -1222
1004a222L30J830m026o67P101k951n345O114J515o435L730M323n234k77L085k158
$$ -1222 -892 938 -3088 -3755 3346 395 -4950 1164 2679 -3756 -26 4297 -937 -1214 1871 -287
1020b87J681K524n597M86N805m406k752N993r85o418L066M148l826j534K082m37
$$ -287 1394 3918 -1679 -1193 4612 206 -2546 3447 2462 -3956 -890 3258 -568 -2102 -20 -457
1036d57j000N67l53K01J555j840k007M079J679m834L08N586k822m024N539J732
$$ -457 -1457 -890 -1243 -1042 513 -1327 -3334 745 2424 -2410 -2102 3484 662 -3362 2177 3909
1052C909n538J503K234k442J875J175m163K138K001n419J919M949n947k767P095
$$ 3909 -1629 -126 2108 -334 1541 2716 -1447 691 2692 -2727 -808 4141 -1806 -4573 2522
1067B522j543m345K793N80k057J712o57k91K743j887l166M618K213m808N14L156
$$ 2522 979 -3366 -573 7 -2050 -338 -995 -1286 1457 -430 -3596 1022 3235 -1573 -1059 2097
1083B097p78j671P53J417m9j531k97J844n62j994J038Q00j268n95j43J088O51
$$ 2097 1319 -352 401 1818 1769 238 -59 1785 1223 -771 267 1067 -201 -796 -939 149 800
1100H00k786m93L339p39k774K071J180j900k12J310J200j49k021N9L326o42k347
$$ 800 -1986 -2479 860 121 -2653 -582 598 -1302 -1514 -204 996 847 -1174 -1115 2211 1569 -778
1117g78J727P88j809P05Q84l52m14j560J86L027j948l110L105R09l781Q87K402
$$ -778 949 1737 -72 633 1517 1165 751 -809 -623 2404 456 -2654 451 1360 -2421 -1534 868
1134H68j816o9J74q90K391k00l337K388K997l591r07M261r43j985J625J43p70
$$ 868 -948 -1017 -843 -1733 658 458 -2879 -491 2506 -1085 -1992 2269 1326 -659 966 1109 339
1151C39M49k63M60L5j254L8J752l59k526J74J979n11k166M98K298j687k506L209
$$ 339 788 525 985 1020 -234 -196 1556 1197 -1329 -1155 824 313 -1853 -1355 943 -744 -3250 -41
1169d1J617l667J11K503j301O76Q93k284J244K697l402J82M202k787k492M160
$$ -41 1576 -2091 -1980 523 -778 -102 791 -1493 -249 2448 -954 -772 3430 643 -1849 2311
1185B311k43l642K598L75k368J338K24j869J885M07l214R20K749k708j349L347
$$ 2311 2068 -1574 1024 1399 -969 369 593 -1276 609 1016 -2198 -1278 1471 -1237 -2586 761
1201G61n85k669J494K009j162q86P98J14O7R26j61o13J402q65j567L288J74m207
$$ 761 176 -2493 -999 1010 -152 -1038 -240 -126 -59 867 706 93 1495 630 -937 2351 2525 -1682
1219a682J186L511l082j617L337j314k273K009j58j169J784j035k409L304N90
$$ -1682 -496 3015 -67 -1684 1653 339 -1934 75 -83 -1252 532 -503 -2912 392 982
1234I82l586J512K485k368n52K223n62k53J032r83K11J380r64o90K127q66j817
$$ 982 -2604 -1092 1393 -975 -1527 696 134 -119 913 -70 141 1521 557 -133 1994 1128 -689
1251f89P71J528j053j126N59O83j353k48J435l08j869N83J482l25j436j68J282
$$ -689 82 1610 557 -569 -10 673 -680 -928 507 199 -1670 -1087 395 70 -1366 -1534 -252
1268b52L71j004m47K162j2k116Q42K664j749j376J975L52j015JM87j95qk23k09
$$ -252 119 -885 -1332 830 818 -1298 -456 2208 459 -917 1058 1410 395 396 883 688 680 457 248
1287B48o0k09q3O4K33j442K08R80M2j224k10Q79K21n03L77J98Ql6k88J397Q34
$$ 248 188 -21 -104 -40 193 -1249 -1041 -61 -19 -1243 -1453 -574 -353 -856 -479 -281 -273 -309 -597 800 1634
1308A634j049j633J549K035j941j638K134O13j373j001R81O41p38j647N80J703
$$ 1634 585 -1048 501 2536 595 -1043 1091 1704 331 -670 311 952 214 -1433 -853 850
1324H50j183j654J462J245k153q0J201o8l70N51l57r1P44L14k20L52l92k79J316
$$ 850 -333 -1987 -525 720 -1433 -1513 -312 -380 -750 -199 -556 -647 97 411 191 543 151 -128 1188
1343A188j64r59M23J060j386Q5J433r27j215K59L54J5k57j164L30J676j150j943
$$ 1188 1024 65 488 1548 162 247 1680 753 -462 -203 151 166 -91 -1255 -925 751 -399 -2342
1361b342K037J417k510r9K069m92j121O09P42j17R2l71M80J061p44p81R70M80
$$ -2342 -305 1112 -1398 -1497 572 80 -1041 -432 310 193 285 -86 394 1455 711 -70 900 1380
1379A380j295O35M31j238n34J595K2j903N85J33p42N57P44j468m31J500q09l82
$$ 1380 85 720 1151 -87 -621 974 996 -907 -322 -189 -931 -374 370 -1098 -1529 -29 -838 -1220
1397a220K031j090j430K242M20j622R95N18r55R00M71j510Q92J258k155J24K085
$$ -1220 811 -279 -1709 533 953 -669 326 844 -111 789 1260 -250 642 1900 -255 -131 1954
1414A954j313j459J584l5j849N46O17o50M26l05q42P50Q09j010M8P68q02l56J524
$$ 1954 641 -818 766 731 -1118 -572 45 -605 -179 -484 -1326 -576 233 -777 -729 39 -763 -1119 405
1433D05Q69j768l02J643m42p60J658n11j330J593J91j388J260O6k173J051J366
$$ 405 1274 -494 -796 847 405 -355 1303 792 -538 1055 1246 -142 1118 1184 -989 62 1428
1450A428k195J96J432j472p52J664n58j086J573p82q06J218l17m54J177j00j283
$$ 1428 -767 -571 861 -611 -1363 301 -257 -1343 230 -552 -1358 -140 -457 -911 266 166 -1117
1467a117J405P65o85P7J58n07M77P0L81j24m31o32M88K96m70r2o43N8L96P5m05
$$ -1117 288 1053 368 445 603 96 573 643 1024 900 469 -163 325 621 151 59 -584 -526 -130 -55 -460
1488d60K39p97p2J179q9r41J91M66l53M45N74l33RJ1L66N34n04J14M03p02L77
$$ -460 -221 -1018 -1090 89 0 -941 -750 -284 -637 -192 382 49 58 69 435 969 465 579 982 280 657
1509F57Q4q36O40P68j671l86J688p25j356J643q46j503J996N7j805J689k62j661
$$ 657 741 -95 545 1313 -358 -744 944 219 -1137 506 -340 -1843 153 210 -1595 94 -168 -1829
1527a829J875J143k643Q92J761j960N29K181j859p92K048q18p03J694o86j617
$$ -1829 46 1189 -1454 -562 1199 -761 -232 1949 90 -702 1346 528 -175 1519 833 -784
1543g84J338O83j741O43N73j181m80J203o41q77J267Q9j646J079J007j461l13
$$ -784 554 1237 -504 139 712 -469 -949 254 -387 -1264 3 92 -1554 -475 532 -929 -1242
1560a242K161j143j212K621l22k060K122N59k989K008J968k817j7J945k035R4
$$ -1242 919 -224 -1436 1185 863 -1197 925 1484 -1505 503 2471 -346 -363 1582 -453 -359
1576c59K406k113j291K378r23j693K648n64k889J799J159j733N12Q98j414J73
$$ -359 2047 -66 -1357 1021 98 -1595 1053 489 -2400 -601 558 -1175 -663 235 -1179 -1006
1592a006J803j058n05R48L47q50Q09M94r04Q1Q85p48m26J202Mj879J316Q32k160
$$ -1006 797 -261 -766 182 529 -321 488 982 78 159 1044 296 -130 1072 1076 -803 513 1345 -815
1611h15N72J559j854m66J753j496m77K287j540j620K421j11j685J638J53j877
$$ -815 -243 1316 -538 -1004 749 -747 -1224 1063 -477 -2097 324 213 -1472 166 319 -1558
1627a558J507J575k104P75J259j882P4J957r76p48R71n07k68O35M0p91l84L84
$$ -1558 -51 1524 -580 195 1454 -428 -354 1603 627 -121 850 343 75 710 750 -41 -425 -41
1645d1P6m48l3J92n3l64K48k29n7Q47n77o82J223o6m98R63J04j044Q62M87q84
$$ -41 35 -413 -446 -254 -307 -671 -423 -652 -709 138 -439 -1121 102 36 -462 501 605 -439 423 910 26
1666B6N96K90r92L35N83n86L61K9j316N67J106j140k92J78k94M6N34o12k52K61
$$ 26 622 912 -80 255 838 252 613 642 -674 -107 999 -141 -433 -255 -549 -503 31 -581 -833 -572
1686e72m28Q95K43o10L3P89r24L59J151o61k05R01o87o1Q49m97l62N42j51j283
$$ -572 -1000 -105 138 -472 -439 350 -574 -215 936 275 70 971 284 223 1072 575 213 755 604 -679
1706f79J380L5j329J60N75q64L30N54p75m40N36K8m68R77j26q22J36J056r9o23
$$ -679 701 736 -593 -433 142 -722 -392 162 -613 -1053 -517 -489 -957 20 -106 -928 -792 264 165 -458
1726d58R20j53j009J110P57j105J47P47j001M42R41j199o73J354o97q56J392k89
$$ -458 462 309 -700 410 1167 62 209 956 -45 397 1338 139 -534 820 123 -733 659 370
1744C70j997J240O22r99L74N30j126k2J394j185J78J381q91o81J393k01o28R22
$$ 370 -1627 -387 235 -764 -390 140 -986 -1008 386 -799 -621 760 -131 -812 581 380 -248 674
1762F74L29j010J71R56o57m63Q24n83o21O86M39j090J92J24n26L17O64j280l31
$$ 674 1003 -7 164 1120 463 0 824 241 -380 306 745 -345 -153 -29 -555 -238 426 -854 -1185
1781a185J138n06n53J194l76j149J243M43n88L84L61p60N59N43p74L01J012q81
$$ -1185 -47 -553 -1106 88 -288 -1437 -194 249 -339 45 406 -354 205 748 -26 275 1287 406
1799D06o21P03q0%j22k27l54L77J8m37O08m81p70K69R67m96p14M72L21n25L59
$$ 406 -215 488 408 408 286 59 -295 82 100 -337 271 -210 -980 -711 256 -240 -954 -482 -161 -686 -327
1820c27P12m40M7J87M8n0J97K5j85L03J31jL1l07l22K80q2l44l05J87K40m70l
$$ -327 385 -55 -8 179 227 177 374 399 214 517 648 647 678 371 49 329 247 -97 -402 -215 25 -445 -448
1843d48lj8J03k02K6J17N5o9L64L39m03q5M79K07j97k99L68l7M24k84j47L33k09
$$ -448 -451 -469 -366 -568 -542 -425 -370 -439 -75 264 -139 -224 255 462 265 -34 334 297 721 437 290 623 414
1866D14o44P07K47q46l25N92n63J9K37k56j82J85rl50M28j34k39M27N41o07N8
$$ 414 -230 477 724 -122 -447 145 -418 -399 -162 -418 -600 -415 -424 -774 -346 -480 -719 -292 249 -358 -300
1887c00N42k29j58M96j16r3K01K75k21LK76n96L09J20m88k82K63j44m10J62K8
$$ -300 242 13 -145 351 235 142 343 618 397 400 676 80 389 509 21 -261 2 -142 -552 -390 -362
1908c62m78M13M40j92o66Q58o79J13R54l70n95J082L5r47O53M81j093P39N63q55
$$ -362 -840 -427 13 -179 -845 13 -666 -553 401 31 -564 518 553 -394 259 740 -353 386 949 94
1928I4jM36j83m11M27j82m58P20k15r38M26M93r00j01R43l18o88N91M09q77N20
$$ 94 93 529 346 -65 362 180 -278 442 227 -711 -285 208 -692 -793 150 -168 -856 -265 144 -733 -213
1949b13P27r98K45J232j068l53J218m73q06J348J9j502J213N51j600M13J097j242
$$ -213 514 -484 -239 993 -75 -428 790 317 -489 859 878 -624 589 1140 -460 -47 1050 -192
1967a92J25J106j318n87J472q92q37J604n37j452J346N35j111J13R51r29M18O17
$$ -192 -67 1039 -279 -866 606 -286 -1123 481 -56 -1508 -162 373 -738 -625 326 -603 -185 432
1985D32k08j80J65K75p9J82k82k33K02L73o22n0K96L15r94M96M07r35m6N78o53
$$ 432 224 44 209 484 405 587 305 72 274 647 25 -25 271 586 -408 88 495 -440 -486 92 -561
2006e61k75Q47r16J27R78p00j93P16o6n82R29m6o26N11P22n58l9K80k85O7M43
$$ -561 -836 11 -905 -778 200 -500 -693 23 -43 -625 304 258 -368 143 865 307 268 548 263 330 773
2027G73n91l51M96l93l3J53O1l23k49K37J89l16k48L14J7l82O69k12l82L52M67
$$ 773 182 -169 327 -66 -99 54 115 -208 -457 -220 -31 -347 -595 -281 -264 -646 23 -189 -571 -219 248
2048B48j89J80J21n01M50N14p42J55P62n59n62P13L9m65k51K80l9N7o60J45L28
$$ 248 59 239 360 -141 309 823 81 236 998 439 -123 590 629 164 -87 193 154 211 -449 -304 24
2069B4l71n02L91L35o7k71n09J040n6p71J071L37j212M42R50p97Q2P51r68K04
$$ 24 -347 -849 -458 -123 -190 -461 -970 70 14 -757 314 651 -561 -119 831 34 116 867 -101 103
2089A03N88m62n52J422q66r26J108K00j077L46M13n52l12L63l00L0L72k54k98
$$ 103 691 229 -323 1099 233 -693 415 615 -462 -116 297 -255 -567 -204 -504 -474 -102 -356 -654
2108f54O59J27r76R43L81q72Q4J243o02j156J360M20j332R18J41q78J62J011j223
$$ -654 5 132 -844 99 480 -392 -308 935 333 -823 537 957 -375 543 684 -194 -32 979 -244
2127b44L76J001j636m54J559m38j224J358l35j430J526J94j102O70N15j123O92
$$ -244 132 1133 -503 -957 602 164 -1060 298 -37 -1467 59 253 -849 -179 336 -787 -95
2144i5Q14j118m7J517p23q71J106L37j176O38N92r23j9N85k32o21N48k03n20Q69
$$ -95 719 -399 -446 1071 348 -523 583 920 -256 382 974 51 32 617 385 -236 312 109 -411 458
2164D58j94j334Q55P67j627M16J051q84p06J432J32r78P70r0m82O47N35j093L10
$$ 458 264 -1070 -215 552 -1075 -659 392 -492 -1198 234 366 -612 158 68 -414 233 768 -325 -15
2183a5R29j155K73J053j037m90Q35k59n38N49L6m19K60k59k92J58O17q75j96P29
$$ -15 914 -241 32 1085 48 -442 393 134 -404 145 181 -238 22 -237 -529 -371 246 -629 -825 -96
2203i6l04l20Q49k8k96j47L94J12l95M69O7j9m8O3j35K65k60k32M07N67r24o2
$$ -96 -400 -720 129 101 -195 -342 52 164 -231 238 305 286 238 301 166 431 171 -61 346 913 -11 -73
2225g3L81j87m43L24Nm74n9K18O0J09m20k5O23k77r2J83L82m87L2K28L83k5l55
$$ -73 308 121 -322 2 7 -467 -526 -308 -248 -139 -559 -584 39 -238 -330 -147 235 -252 -220 8 391 366 11
2248A1K31K29k56j37L88J99m80j38r1L2K80m27j44K63q9l92O71K2o76j98O68r2
$$ 11 242 471 215 78 466 665 185 47 -44 -12 268 -159 -303 -40 -129 -521 150 172 -504 -702 -34 -126
2270a26k24O1J79K0Q9J59L3K93l36n46Q56J97m94J55J44m0m48O4J68l08m31N84
$$ -126 -350 -289 -110 -90 -1 158 191 484 148 -398 458 655 161 316 460 420 -28 36 204 -104 -535 49
2292D9j57j42n3J75O8k25l28J5P64l17m56M47M72m25K8L03j07k30J43J82L03l06
$$ 49 -108 -250 -303 -128 -60 -285 -613 -598 166 -151 -607 -160 312 -113 -85 218 111 -119 24 206 509 203
2314B03j08r9P48l16m91L30j7m48p6L26m0j54o11P14J64k38l72M71l32K13j50
$$ 203 95 -4 744 428 -63 267 250 -198 -274 52 12 -142 -753 -39 125 -113 -485 -14 -346 -133 -283
2335b83J60N5k84M07j21L31k03j62N75m9l11j15N44j17l56N7K52l03l09M41k23
$$ -283 -123 -68 -352 55 -66 265 62 -100 475 426 115 0 544 427 71 128 380 77 -232 209 -14
2356a4j51N0k04K59J81n04o1L60Q9n55N57L56p45j08P10K71l53k73N80j73J27
$$ -14 -165 -115 -319 -60 121 -383 -444 -84 5 -550 7 363 -382 -490 220 491 138 -135 445 272 399
2377C99j58o0K90l80k75O79Mo41J32L68m00l97R7N96k28m31j69J80M29Nn69L23
$$ 399 241 181 471 91 -184 495 499 -142 -10 358 -42 -439 -342 254 26 -405 -574 -394 35 40 -529 -206
2399b06Ml45L37N64k30o89M88O75n60K06K8J01J2m7j46J16l42k6qL77M0q91N97
$$ -206 -202 -547 -210 354 124 -565 -77 598 38 244 272 373 385 338 192 308 -34 -60 -68 309 349 -542 55
2422E5k01n32J58K38K89m42q0L93J67k39K52l21K00M9k91K85M58j79n25P68O5
$$ 55 -146 -678 -520 -282 7 -435 -515 -122 45 -194 58 -263 -63 -14 -305 -20 438 259 -266 502 567
2443E67n83N4L11j13l05j2M56L26m81q29N40J92k34l43K96O2k83j14N28J26q98
$$ 567 -16 38 349 236 -69 -81 375 701 220 -609 -69 123 -111 -454 -158 -96 -379 -493 35 161 -737
2464g37L00P15k75p00Q08K50n54K54K87j24J22L2l41K07L73p15q3N41m12m22O19
$$ -737 -437 278 3 -697 111 361 -193 61 348 224 346 378 37 244 617 -98 -181 360 -52 -474 145
2485A45L89j043L86q7j88K89r3N0K6J27p70N00O69l58l94J56P50o40J14O25l00
$$ 145 534 -509 -123 -210 -398 -109 -202 -152 -126 1 -769 -269 400 42 -352 -196 554 -86 28 653 353
2506C53p48M99N83n76L12m56n7K59J15o70L58N97j127oR80o86n42R95n0q60M45
$$ 353 -395 104 687 111 423 -33 -90 169 284 -386 -28 569 -558 -564 416 -270 -812 183 133 -727 -282
2527b82M55p18M37R1m43L20Q81j175R2J072m00o64R13J47p46J94L08j82k34L37
$$ -282 173 -545 -108 -17 -460 -140 741 -434 -342 730 330 -334 579 726 -20 174 482 300 66 403
2547D03m69k62O42m46j11N29k78j090Q78N07n79l37P18k85l45P57k30k44L42O3
$$ 403 -66 -328 314 -132 -243 286 8 -1082 -204 303 -276 -613 105 -180 -525 232 2 -242 100 163
2567A63l42R25j50q40M09M90o20j86P94j61q74M54L2R9q3k56j34K51J3n62J89
$$ 163 -179 746 596 -244 165 655 35 -151 643 482 -392 62 94 193 110 -146 -280 -29 -16 -578 -389
2588c89M62m81n29J045K08o60j63O96l22k15O90K61o10J57l4N8O04n92l06M03
$$ -389 73 -408 -937 108 316 -344 -507 189 -133 -348 342 603 -7 150 116 174 778 186 -120 283
2608B83J69m82J84O38q87l86O77j00n39K82J49l42J89m9j79L05N9l54J89N67k23
$$ 283 452 -30 154 792 -95 -481 196 96 -443 -161 -12 -354 -165 -214 -393 -88 -29 -383 -194 373 150
2629A50l43K04J88k20j22O61Q8n53j23M31k0j84K38k63j44j86j95M58L03q45j32
$$ 150 -193 11 199 -21 -143 518 606 53 -70 361 341 157 395 132 -12 -198 -393 65 368 -477 -609
2650f09R54k5o57J25N99q81q8P25k50j04n0p2K60M68k65k88M98j44l91O65L73
$$ -609 345 320 -337 -212 387 -494 -582 143 -107 -211 -261 -333 -73 395 130 -158 340 196 -195 470 843
2671H43o40n68O05K51m94K35r3n81L1L91k87p1M89r00L87M92j27k88L90k1q26
$$ 843 203 -365 240 491 -3 232 139 -442 -411 -20 -307 -378 111 -789 -402 90 -37 -325 65 44 -782
2692g82P12M57j0l43J26k94L32L50l53k39L79k48p1O32K39j147J23M50m88J02
$$ -782 -70 387 377 34 160 -134 198 548 195 -44 335 87 16 648 887 -260 -137 313 -175 -73
2712g3K43m11j11J70M7J94j16l28Q0k9J67r8K54J19k7o21P17L39l04p8K19k82
$$ -73 170 -241 -352 -182 -135 59 -57 -385 -305 -334 -167 -265 -11 108 81 -540 177 516 212 134 353 71
2734G1K61J67j87p8J15m81J10O58o55m81L24J79p4j44P7M8k60L0N94k40j82l99
$$ 71 332 499 312 234 349 -132 -22 636 -19 -500 -176 3 -71 -215 -138 -90 -350 -320 274 34 -148 -547
2756e47L88K15k66J14K36L09n44j1M85J28m44K75k34K70l59J52L17k76k62K01
$$ -547 -159 56 -210 -96 140 449 -95 -106 379 507 63 338 104 374 15 167 484 208 -54 147
2776A47k10L26m04k23L61k15l23M07M14o19j12K73N33k88j85r9M74j07p5R9K76
$$ 147 -63 263 -141 -364 -3 -218 -541 -134 280 -339 -451 -178 355 67 -118 -217 257 150 75 174 450
2797D50l42k07O57Ok37j88j92L71l19j65J55J35m4n59N58j97R7m53M1M61l50q0
$$ 450 108 -99 558 564 327 139 -53 318 -1 -166 -11 124 80 -479 79 -118 -21 -474 -433 28 -322 -402
2819d02K90N52n35r2M9J57j7j50L31j87n2Q7J86l0k43j34O26k82m0o5k28L45l42
$$ -402 -112 440 -95 -187 -138 19 2 -148 183 -4 -56 31 217 187 -56 -190 436 154 114 49 -179 166 -176
2842a76L37q9k91j92J24K58j75j51M32l4j96l61L04K80O3o0l76O51j74K38m10
$$ -176 161 72 -219 -411 -287 -29 -204 -355 77 43 -153 -514 -210 70 133 73 -303 348 174 412 2
2863BM46q1m10Q7L99j97m55M10Q5k56m3J54m26L37j71K0M57m08m20J15K36j04
$$ 2 448 367 -43 44 443 246 -209 201 286 30 -13 141 -285 52 -119 -99 358 -50 -470 -355 -119 -223
2885b23j23M4P2j09K08K01j39j80L36J63k49O5r7J97J33k32j97M93k09m03M10
$$ -223 -346 -302 -230 -339 -131 70 -69 -249 87 250 1 66 -31 166 299 67 -130 363 154 -249 161
2906A61n5l07j67L66N0j1j01k54K7K85l43J3N18J14o26L76J77j15n3j08J99N3
$$ 161 106 -201 -368 -2 48 37 -64 -318 -291 -6 -349 -336 182 296 -330 46 223 108 55 -53 146 199
2928A99J9j28L68l37M3N9j97P8m57P96j55j47n70J73L25k63j2K63k06j64L18Q
$$ 199 218 90 458 121 164 223 26 104 -353 443 288 141 -429 -256 69 -194 -206 57 -149 -313 5 13
2950A3N6Ol27J60K26k67J20L13J9o49M63L41k59k24L26k5p4o8j13J05j82j25j02
$$ 13 69 75 -252 -92 134 -133 -13 300 319 -330 133 474 215 -9 317 292 218 150 37 142 -40 -165 -267
2973b67K30m4J53l40K95k50J08J06n5n6n5R5J61M4m2j76M67l52K86r1j22K6o06
$$ -267 -37 -81 72 -268 27 -223 -115 -9 -64 -120 -175 -80 81 125 83 -93 374 22 308 217 95 121 -485
2996d85O71J69n17j32M75J28n50K47J94m74K75q1J9O5q2m1K09R2m17k24N43N8
$$ -485 186 355 -162 -294 181 309 -241 6 200 -274 1 -80 -61 4 -78 -119 90 182 -235 -459 84 142
3018A42k10k1M86j50l63L86M04o44j35K57k12L60m1m35K23M29m15j23Q0j71l47
$$ 142 -68 -89 397 247 -116 270 674 30 -105 152 -60 300 259 -176 47 476 61 -62 18 -153 -500
3039e00O92p8n68M59o8k5j92K39k09K06K77m31K48K42P5q74P07K16j94l06M39
$$ -500 192 114 -454 5 -63 -88 -280 -41 -250 -44 233 -198 50 292 367 -507 200 416 222 -84 355
3060C55j5m99N9K19l10M0K65n70M34R6l77L83L0o82K01O72k09p79O18M65q90O67
$$ 355 340 -159 -100 119 -191 -151 114 -456 -22 74 -303 80 110 -572 -371 301 92 -687 -69 396 -494 173
3082A73L38o56L1M04m93K76N17o80j5O91m05o44Q58K74p45J32o4l13J38N46n66
$$ 173 511 -145 -114 290 -203 73 590 -90 -105 586 181 -463 395 669 -76 56 -8 -321 -183 363 -203
3103b03m5K16k18k29Q56m42n17N86K36m97J23N55l43K8j59R1m6J86K64n83M31
$$ -203 -248 -32 -250 -479 377 -65 -582 4 240 -257 -134 421 78 106 -53 38 -8 178 442 -141 290
3124B90J24l65L6M03n18%l0K60m26K25pj02j74M76m41K18j74j35K57J80l37K48
$$ 290 414 49 85 488 -30 -30 -60 200 -226 -1 -8 -110 -284 192 -249 -31 -205 -340 -83 97 -240 8
3146HK56l22K41j22J31k78J1J73j51J07kK0J2L10j90m30Q0J69l86M05J09m57q5
$$ 8 264 -58 183 61 192 -86 -75 98 -53 54 52 72 84 394 204 -226 -146 23 -363 42 151 -306 -391
3169c91K62J86q0j36qk6J57o6J13R6J36k31M3Q0j89k2K49j96k84M41j2Q9m51p1
$$ -391 -129 57 -23 -159 -167 -193 -36 -102 11 107 243 12 55 135 -54 -76 173 -23 -307 134 122 211 -240 -311
3193c11M10j61L82n1l09r3r8k1P8K90q7l26K05L20k66k30L96j97K82R3l71M16
$$ -311 99 -62 320 269 -40 -133 -231 -252 -174 116 29 -297 -92 228 -38 -268 128 -69 213 306 -65 351
$$ [...]
8191C1
##END NTUPLES=NMR FID
##END=
