##TITLE=1H_DHA-Pd-H2(2d)-f8
 CDCl3
 8 sc, 
 7.6.2023
##JCAMPDX= 6.0         $$ Bruker NMR JCAMP-DX V2.0
##DATA TYPE= NMR FID
##DATA CLASS= NTUPLES
##ORIGIN= UXNMR, Bruker Analytische Messtechnik GmbH
##OWNER= root
$$ XWIN-NMR		Version 3.5
$$ Wed Jun  7 14:54:23 2023 Russian Standard Time (UT+4h)  she@DPX200
##.OBSERVE FREQUENCY= 200.13135
##.OBSERVE NUCLEUS= ^1H
##.DELAY= (6, 6)
##.ACQUISITION MODE= SIMULTANEOUS
##.ACQUISITION SCHEME= undefined
##.AVERAGES= 8
##.DIGITISER RES= 18
##SPECTROMETER/DATA SYSTEM= spect
##.PULSE SEQUENCE= zg30
##.SOLVENT NAME= CDCl3
##.SHIFT REFERENCE= (INTERNAL, CDCl3, 0, 15.7039)
##AUDIT TRAIL= $$ (NUMBER, WHEN, WHO, WHERE, WHAT)
$$ ##TITLE= Audit trail, XWIN-NMR		Version 3.5
$$ ##JCAMPDX= 5.01
$$ ##ORIGIN= Bruker BioSpin GmbH
$$ ##OWNER= she
$$ F:/spectra/data/she/nmr/H-F/1/audita.txt
$$ ##AUDIT TRAIL=  $$ (NUMBER, WHEN, WHO, WHERE, WHAT)
(   1,<2023-06-07 14:53:06.26 +0400>,<she>,<DPX200>,
      <created by zg, POWCHK disabled, PULCHK disabled
       configuration hash MD5:
       00 E9 B6 7A A2 85 ED C7 34 08 36 98 17 FE 4E 26
       data hash MD5: 16K
       59 12 E3 3D 14 46 17 CC 15 60 26 40 EA 34 14 25>)
$$ ##END=
$$ 
$$ hash MD5
$$ 90 A1 66 CA 48 92 53 87 70 05 0E 34 04 DC 99 FC
##$RELAX= 
##$RELAX= 
##$RELAX= 
##$RELAX= 
##$RELAX= 
##$RELAX= 
$$ Bruker specific parameters
$$ --------------------------
##$DU= <F:/spectra>
##$EXPNO= 1
##$NAME= <H-F>
##$PROCNO= 1
##$TYPE= <nmr>
##$USER= <she>
##$AMP= (0..31)
100 100 100 100 100 100 100 100 100 100 100 100 100 100 100 100 100 100 
100 100 100 100 100 100 100 100 100 100 100 100 100 100 
##$AQSEQ= 0
##$AQ_mod= 1
##$AUNM= <au_zg>
##$AUTOPOS= <>
##$BF1= 200.13
##$BF2= 200.13
##$BF3= 200.13
##$BF4= 200.13
##$BF5= 200.13
##$BF6= 200.13
##$BF7= 200.13
##$BF8= 200.13
##$BYTORDA= 1
##$CFDGTYP= 0
##$CFRGTYP= 5
##$CHEMSTR= <none>
##$CNST= (0..31)
1 1 145 1 1 1 1 1 1 1 1 1 1 1 1 1 1 1 1 1 1 1 1 1 1 1 1 1 1 1 1 1 
##$CPDPRG= <>
##$CPDPRG1= <>
##$CPDPRG2= <>
##$CPDPRG3= <>
##$CPDPRG4= <mlev>
##$CPDPRG5= <mlev>
##$CPDPRG6= <mlev>
##$CPDPRG7= <mlev>
##$CPDPRG8= <mlev>
##$CPDPRGB= <>
##$CPDPRGT= <>
##$D= (0..31)
0 1.2 0 0 0 0 0 0 0 0.06 0 0.03 0 0 0 0 0.0002 0 0 0 0 0 0 0 0 0 0 0 0 
0 0 0 
##$DATE= 1686135185
##$DBL= (0..7)
120 120 120 120 120 120 120 120 
##$DBP= (0..7)
150 150 150 150 150 150 150 150 
##$DBP07= 0
##$DBPNAM0= <>
##$DBPNAM1= <>
##$DBPNAM2= <>
##$DBPNAM3= <>
##$DBPNAM4= <>
##$DBPNAM5= <>
##$DBPNAM6= <>
##$DBPNAM7= <>
##$DBPOAL= (0..7)
0.5 0.5 0.5 0.5 0.5 0.5 0.5 0.5 
##$DBPOFFS= (0..7)
0 0 0 0 0 0 0 0 
##$DE= 6
##$DECBNUC= <off>
##$DECIM= 32
##$DECNUC= <off>
##$DECSTAT= 4
##$DIGMOD= 1
##$DIGTYP= 9
##$DL= (0..7)
0 120 120 120 120 120 120 120 
##$DP= (0..7)
150 150 150 150 150 150 150 150 
##$DP07= 0
##$DPNAME0= <>
##$DPNAME1= <>
##$DPNAME2= <>
##$DPNAME3= <>
##$DPNAME4= <>
##$DPNAME5= <>
##$DPNAME6= <>
##$DPNAME7= <>
##$DPOAL= (0..7)
0.5 0.5 0.5 0.5 0.5 0.5 0.5 0.5 
##$DPOFFS= (0..7)
0 0 0 0 0 0 0 0 
##$DQDMODE= 0
##$DR= 18
##$DS= 0
##$DSLIST= <SSSSSSSSSSSSSSS>
$$ [...]
##$SUBNAM2= <"">
##$SUBNAM3= <"">
##$SUBNAM4= <"">
##$SUBNAM5= <"">
##$SUBNAM6= <"">
##$SUBNAM7= <"">
##$SUBNAM8= <"">
##$SUBNAM9= <"">
##$SW= 18.05172834244
##$SWIBOX= (0..15)
0 0 2 0 0 0 0 0 0 0 0 0 0 0 0 0 
##$SW_h= 3612.71676300578
##$TD= 16384
##$TD0= 1
##$TE= 0
##$TE2= 300
##$TE3= 300
##$TEG= 300
##$TL= (0..7)
0 120 120 120 120 120 120 120 
##$TP= (0..7)
150 150 150 150 150 150 150 150 
##$TP07= 0
##$TPNAME0= <>
##$TPNAME1= <>
##$TPNAME2= <>
##$TPNAME3= <>
##$TPNAME4= <>
##$TPNAME5= <>
##$TPNAME6= <>
##$TPNAME7= <>
##$TPOAL= (0..7)
0.5 0.5 0.5 0.5 0.5 0.5 0.5 0.5 
##$TPOFFS= (0..7)
0 0 0 0 0 0 0 0 
##$TUNHIN= 0
##$TUNHOUT= 0
##$TUNXOUT= 0
##$USERA1= <user>
##$USERA2= <user>
##$USERA3= <user>
##$USERA4= <user>
##$USERA5= <user>
##$V9= 5
##$VALIST= <valist>
##$VCLIST= <CCCCCCCCCCCCCCC>
##$VD= 0
##$VDLIST= <DDDDDDDDDDDDDDD>
##$VPLIST= <PPPPPPPPPPPPPPP>
##$VTLIST= <TTTTTTTTTTTTTTT>
##$WBST= 1024
##$WBSW= 4
##$XGAIN= (0..3)
0 0 0 0 
##$XL= 0
##$YL= 0
##$YMAX_a= 198551
##$YMIN_a= -232404
##$ZGOPTNS= <>
##$ZL1= 120
##$ZL2= 120
##$ZL3= 120
##$ZL4= 120
##$ABSF1= 10
##$ABSF2= 0
##$ABSG= 5
##$ABSL= 3
##$ALPHA= 0
##$AQORDER= 0
##$ASSFAC= 0
##$ASSFACI= 0
##$ASSFACX= 0
##$ASSWID= 0
##$AUNMP= <proc_1d>
##$AZFE= 0.1
##$AZFW= 0.1
##$BCFW= 1
##$BC_mod= 2
##$BYTORDP= 1
##$COROFFS= 0
##$CY= 11.3945322036743
##$DATMOD= 1
##$DC= 2
##$DFILT= <>
##$DTYPP= 0
##$F1P= 15.7292609196834
##$F2P= 12.9074282941183
##$FCOR= 0.5
##$FTSIZE= 0
##$FT_mod= 4
##$GAMMA= 1
##$GB= 0.15
##$INTBC= 1
##$INTSCL= 1
##$ISEN= 128
##$LB= 0.24
##$LEV0= 0
##$LPBIN= 0
##$MAXI= 10000
##$MC2= 0
##$MEAN= 0
##$ME_mod= 0
##$MI= 1.114404
##$NCOEF= 0
##$NC_proc= 0
##$NLEV= 6
##$NOISF1= 3.799351
##$NOISF2= 2.8
##$NSP= 1
##$NTH_PI= 0
##$NZP= 0
##$OFFSET= 15.70392
##$PC= 1
##$PHC0= -19909.82
##$PHC1= 17.25272
##$PH_mod= 1
##$PKNL= yes
##$PPARMOD= 0
##$PSCAL= 0
##$PSIGN= 0
##$REVERSE= no
##$SF= 200.130013532006
##$SI= 16384
##$SIGF1= 3
##$SIGF2= 2
##$SINO= 400
##$SIOLD= 16384
##$SREGLST= <1H.CDCl3>
##$SSB= 0
##$STSI= 0
##$STSR= 0
##$SW_p= 3612.71676300578
##$SYMM= 0
##$S_DEV= 0
##$TDeff= 0
##$TDoff= 0
##$TI= <>
##$TILT= no
##$TM1= 0
##$TM2= 0
##$TOPLEV= 0
##$USERP1= <user>
##$USERP2= <user>
##$USERP3= <user>
##$USERP4= <user>
##$USERP5= <user>
##$WDW= 1
##$XDIM= 8192
##$YMAX_p= 0
##$YMIN_p= 0
$$ End of Bruker specific parameters
$$ ---------------------------------
##NTUPLES= NMR FID
##VAR_NAME=  TIME,          FID/REAL,        FID/IMAG
##SYMBOL=    X,             R,               I
##VAR_TYPE=  INDEPENDENT,   DEPENDENT,       DEPENDENT
##VAR_FORM=  AFFN,          ASDF,            ASDF
##VAR_DIM=   8192,          8192,            8192
##UNITS=     SECONDS,       ARBITRARY UNITS, ARBITRARY UNITS
##FACTOR=    0.0002768,     1,               1
##FIRST=     0,             0,               0
##LAST=      2.2672688,     0,               0
##MIN=       0,             -232404,         0
##MAX=       2.2672688,     198551,          0
$$ Real data points
##PAGE= N=1
##DATA TABLE= (X++(R..R)), XYDATA
0@%%%%%%%%%%%%%%%%%%%mJ1j5J6j6J6j6J7k2K8l1L3l7M3m8N3n9O6p2Q0q9R7j08
42e7J19j31J45j58J71j87K09k31K53k80L09l42L80m24M76n38O14p09Q28r84J194
63F57j489J930k635L887o493J3693o2235j79719L06640M8171k63368J42264J38411
76A39714k16962M597J87289q0004q8073O4848o653q762L2846m0831j0664J3139
88i516m1543O9514Q1330j27706n3408J31309k7409q7103R0951Q133j09278M9271
100b5455P7205n0135j6731J4828j4271M2647K4477n7923j4295R246j8949M3972
112A4616K9299o1397k083L8185k7381J7710L5797o6982j4609O6358k6935k3023
124b0445L8198n9056k2575J20589n844r9097N7907K6067r4186N0040Q2477r6523
$$ y = [0, 0, 0, 0, 0, 0, 0, 0, 0, 0, 0, 0, 0, 0, 0, 0, 0, 0, 0, 0, -4, 7, -8, 8, -8, 8, -8, 9, -13, 15, -16, 17, -20, 23, -25, 28, -31, 35, -37, 43, -46, 51, -57, 62, -69, 76, -82, 89, -98, 111, -120, 133, -147, 162, -180, 200, -224, 252, -286, 328, -381, 447, -537, 657, -832, 1098, -1537, 2350, -4143, 9550, -52685, -232404, 74236, 122407, -140961, 1303, 139714, -77248, -72651, 114638, 34634, -53439, 11409, 4756, -4006, 28840, -11991, -22655, -9516, -51059, 18455, 99785, -27921, -81329, 49980, 22571, -64532, 26419, 34552, -74726, -25455, 51750, 1615, -15116, -288, -14559, 28088, 52565, -5358, -19653, -10407, -29356, 14616, 43915, -17482, -19565, 18620, -8761, 8949, 44746, -22236, -36845, 29513, 2578, -20445, 17753, -41303, -63878, 56711, 50867, -48230, 9677, 35744, -58442, -8402, 74075, -22448]
136b2448l7958Q8617j3392l6165M7501j7243m5760N4398L3436m6182j7984J340
148a1840r632J9390J9186j1354j2717j0281Q280L3354m909l3695M164R121o308
161g241J6898n631m1881J2607M6468l219j1324Q380k0614j9549L3110K4203k8781
174C426k8148J4259K1253o918m940J2755j4367j5744M3938J7541o1691j6530M0912
187E746j4548j2022M8681j2858o1269L3094N3041l4530k3633K7795q491k0910
199a9904K7905J3328m1634j4979M3600K1621k3189k782J0254k7057m497M8250
211C0916n181n6912J1073L6467k0540l386K7248k3617k1383M0106J5139l5150
223e220j4839N282L099J2437R062o199j3368r670K1670K8261k3662k3558K4472
$$ y = [-22448, -60406, 28211, 14819, -21346, 26155, 8912, -36848, 17550, 50986, 4804, -13180, -11840, -21472, -2082, 17104, 5750, -6967, -17248, -8968, 24386, 19477, -14218, -10054, -933, -7241, 9657, 4026, -37855, -25248, 21220, 18001, 6677, 15057, -5557, -25106, 8004, 32207, 3426, -24722, -10463, 10790, 3872, -1068, 11687, -2680, -18424, 25514, 43055, -18636, -35166, 5746, -8802, -20824, 27857, 14999, -46270, -13176, 39865, 5335, -18298, 9497, 1006, -19904, 8001, 21329, -20305, -35284, 8316, 29937, 6748, 3966, 14220, -12837, -17334, 30916, 25735, -31177, -20104, 16363, -4177, -7563, 19685, -3932, -25315, 14791, 29930, -5220, -20059, -14777, -11678, 759, 9821, 3622, -9746, -19416, 2254, 30515, 6853, -16705, 7767]
236G767j085k0288K8166J32n0905K0205N2292k3371j8160K2103k3811j7291M3770
249A9524J813m1196M009J3275p852J5166P359k4899J67K0653K891j343j0481j9734
263b0648P099J9124J901O31j0196j5230K0668K1465j7522n111N504k1572P394
276f493L2141k6465l0323L1122J0980j7229K1449K087m2109O381L8433j1356k0800
289a2182O176l169m730J6353J0561j0621j4103O360K5026j009k6562L80Q590j4656
303a3586J3979K7529k8999k6294L4556J4105k3144Q256M778k9365M622L1577j2310
316E704k6021P766J2999N90N835L913j3769j3907J3905K1728j2947k2330R251
329g283P121q925J8165J2502l1455o646L7051k222k5464R235o73k1357J8083K5771
$$ y = [7767, 6682, -13606, 14560, 14692, -36213, -16008, 36284, 12913, -5247, 16856, -6955, -24246, 19524, 21337, -19859, -15850, -2575, -10427, 4739, 12098, -12801, -12634, 8019, 10910, 9567, -914, -20648, -13549, 5575, 7476, 8107, -2089, -17319, 3349, 24814, 7292, 2181, 7685, -13887, -6493, 25648, -817, -31140, -18, 10962, -6267, 15182, 17269, -24840, -18459, 19974, 8618, -12182, -6006, -9175, -13905, 2448, 13009, 2388, -11715, -5355, 19671, 18662, -7900, -7520, 1070, -13586, 393, 27922, -1077, -27371, 7185, 21290, -1854, 6402, 11180, -18185, -13563, 18014, 5704, -20317, -12551, 448, 1038, 6873, 10786, -2983, -16890, -2985, 18743, 5796, -16534, -7283, -162, -9087, 9078, 21580, -9875, -16521, 20530, 18308, -7156, 2079, 1406, -19951, -1868, 23903]
343B3903k3537k0609J8215J1547o199K331R99j5918p835J9188J2173k1523j4488
356b1753J9625Q878q660J2241K679k8712L137L2280q488k3553P990K803p144J7273
370H596R417k0546p710J3908P502k351p390r840j975O111Q313K868j3078q736
384a4911J5470J0073o736N7o373j4985J4059J8202j7536j0097J3036m316K225
397a832K3125j0995k6276J5996J3944j4462K256L842k0348L350K5823k935j5953
410d465M68K114L563N991l832q498o820k207J5805R552k0928m613K0958l847n477
425b236J9069j2348k9669K3656K3536k5766n846J7833j4712l818L1088l066k9495
438a1774O229J5507p605l693K069q301n115R918J3733l215j9169M39J8622k390
$$ y = [23903, 366, -20243, -2028, 9519, 3320, 5651, 6650, -9268, -17103, 2085, 14258, -7265, -21753, -2128, 6750, -1910, 10331, 13010, -15702, -12565, 19715, 11227, -12326, -4336, -1533, -8677, 8596, 18013, -2533, -10243, 3665, 11167, 8816, 1426, -8414, -10389, -4278, 4035, 6903, -6175, -14911, 559, 10632, 3896, 3953, -2420, -17405, -3346, 14856, -2680, -12777, 259, -4057, -1832, 21293, 10298, -15978, 18, 13962, -500, 1756, 5598, -14750, -11400, 14423, 11488, -4465, -3997, -1883, 1680, 7671, 3839, -4659, -11479, -13686, 2119, 11671, -9257, -13870, 7088, 3241, -2236, 16833, 4485, -25184, -1528, 22008, -3758, -9604, 8229, -6483, -10301, 20787, 17721, -11774, -5545, 9962, 2357, -1336, 733, -7568, -12683, -2765, 10968, 7753, -11416, -10977, 7645, 5255]
452E255r601J1047q465k1764K1868K1717k6067o959K4338q049q595K4517q401
465A0841l1196J5223K1126j5024m530P636j2893q51K0462J583j3168m856J398
478d249N500K796q292l756J746k925J2483J2379j9889j1505K1933J725j1472J4024
492A0498m719k7265J4879K5255j8794q158J7813r306n670K3041o911k6612Q870
505g079J4276p454J630J115j4197R28J4966L849k468p272q002Q689P464r396j194
520d145J074p888J3156J5826j8872j0608J7301k884n328J9474r499k8990J5038
533f345J9239j5491Q32J0866j5750O24K2591r503j8963P388L752k784Q439k235
547B660j2838j27P357R836O149j3663r861J3391J9q580J1123l499j8790J8679
$$ y = [5255, -4346, 6701, -1764, -23528, -1660, 20057, -6010, -12969, 11369, 3320, -5275, 19242, 10841, -20355, -5132, 15994, 970, -3560, 4076, -8817, -9668, 10794, 12377, -791, -5647, -4249, 1251, 4047, -4245, -8001, -6255, -9180, 3303, 15682, -4207, -15712, 6221, 7946, -3526, 10498, 5779, -21486, -6607, 18648, -146, -8304, 9509, 203, -5467, 17574, 10663, -15949, -7079, 7197, -257, 1373, 2488, -11709, -10781, 4185, 8034, 5566, -1706, -9708, -1019, 6445, -2951, -4145, -3071, -10959, 2197, 18023, -849, -11457, 5844, 2960, -2368, 17106, 7607, -21383, -6345, 12894, -2597, -1765, 9101, -6649, -6025, 16566, 7063, -11900, -4512, -760, -3544, 4895, 2660, -10178, -10305, -2948, 6888, 13037, -626, -10487, 2904, 2923, -5657, 5466, 1967, -16823, 1856]
561A856J9481k3892n758J8610j3417m377K9107r834l3381J2786J7533j3327K862
574a751J0387j4310k406J6071o88j0672l892K23O789M913m456j957m782n934J8170
589E705J5557k1446r400J7594o563j0523J9382l073k4531J5093J9249j6606m679
602d241J0130j2159K9K1472n702k1702J410P391L33N086J079n641j160K196N834
617D355K924j1603o976J3443M237o623M102o196j2066J7591J7579j7345p820J1196
631F798j0158n980J9559l202k2242R150J5521q623k110L635r911n17J7248O05
645I773j5062n317L988L535M095M200j550p313j602J1973M835j3977m960R975
659B593n8j932O801q511j3750J4410J5341j0447m161L967j2246l167J9318j476
$$ y = [1856, 21337, -2555, -8313, 10297, -3120, -7497, 21610, 11776, -21605, -8819, 8714, -4613, -1751, 8636, -5674, -8080, 7991, 7303, -3369, -7261, -7038, -249, 4664, 208, -1749, -6531, -12465, 5705, 21262, -184, -9584, 8010, 1447, -9076, 10306, 7233, -17298, -2205, 17044, 438, -4241, 5889, -6270, -6241, 15231, 9529, -12173, -10763, -3372, -3039, 2047, 3126, -2515, -3675, -1479, 4355, 7279, -4324, -11300, 2143, 6380, -243, 3859, -2337, -14403, 3188, 20767, 3422, -4398, 6798, -3360, -9340, 10219, 7017, -15225, -6075, 9446, 823, -1287, 2348, -7563, -8080, 9168, 9773, -5289, -10606, -6618, -3083, 1012, 5212, 3662, -3651, -5253, 6720, 11555, -2422, -7382, 2593, 2535, 603, 7404, -1107, -14857, -447, 14894, 4447, 286, 4253, -7993, -11160, 8158, 6682]
673F682j9408M720J2605m476m64M483r323l671J4748O418j1598q098J356J778
687d248M498P279N88j0414m605J2577O351j3077m972Q242l263k407J1969n588
701B930j9650R405K0038q108o185P134j0872r506J8977O734j9002j950J2688j387
715A246j944O208m574q122P148J1315k998j2831m606O552L437K113O623n645j4374
730a0452Q537J5077j1674j0168J0921k916p773J4344J853k2374K392K0339k493
743E613m926N103q908r082J2470Q538r361n768L847L261K919R76k215m752o11
758b896R041N759j1980r243N290K333J503R772m794j5713O919J2249p257l680
772b697M270q524j187J5246k560j5455L859R272J26M693J948j2226p150R327Q979
$$ y = [6682, -12726, -8006, 4599, 123, -341, 4142, -5181, -8852, 5896, 12314, 716, -7382, -6026, -4248, 250, 7529, 8117, -2297, -6902, 5675, 12026, -1051, -6023, 2219, -1044, -3451, 8518, 2930, -16720, -7315, 12723, 4615, -1570, 5564, -5308, -14814, 4163, 10897, -8105, -10055, 2633, 1246, -698, 5510, 936, -7186, -38, 11277, 8279, -4552, -9158, -2606, 831, 2944, 9567, 3922, -10452, -1915, 13162, 1488, -8680, 2241, -675, -8448, 5896, 7749, -14625, -12233, 8106, 5613, 687, 5790, -3118, -12200, 270, 8808, -553, -6321, -2474, 787, 3706, 4682, 2467, -2285, -2896, 6145, 11904, -76, -9319, -4029, -1696, -193, 9579, 4785, -10928, -4009, 8240, 983, -2697, 1573, -6951, -8138, 7108, 4548, -10907, -7048, 2224, 2350, 7043, 8991, -3235, -10385, -1058, 7921]
787G921m005p486R96L758j024L323M945j0807p827J5996P549j6560m300O315p520
802h726K019J8772n192j9388O871J2809o349k608N337p372n844J2089P286j1893
816b189p910R956P650l008J910j9j3631k214J7929J391j5898J308O697o101M248
831A19R971j1322j0104J3043O879q862l880p06m184M631J1677O51j1404m561R316
846A264N184m602m65O79q798K945J5238o551j6729R474J0317p177M190N651j7428
861f808p070J9669K275j3559J650L313n940N941R105p041r450M289Q918K75p758
876b191l088J903j392N851J1049q891j4072J0449R749q147Q64L716j3018j61J6509
891I130m267j3228N604L878j828Q129o3j4305j687Q449J597J02j506p167J624
$$ y = [7921, 3916, -3570, -2574, 1184, 160, 3483, 8428, -2379, -10206, 5790, 13339, -3221, -7521, -1206, -8726, -6707, 12065, 6873, -12515, -5644, 7165, 816, -1792, 3545, -3827, -9671, 2418, 9704, -2189, -10099, -143, 7507, 4499, 6409, 6390, -7241, -9455, 8474, 9865, -6033, -4725, 1972, -4129, 119, 10090, -1232, -11336, 1707, 8586, -276, -4156, -4862, -9046, -4415, 7262, 7913, -3491, -8052, 1264, 6448, 1846, 1381, 2060, -6738, -3793, 11445, 4894, -11835, -2361, 7956, 779, 4969, 10620, -6808, -13878, 5791, 8066, -5493, -3843, -530, -6470, -529, 8576, 1535, -7915, -3626, 5292, 5567, -2191, -5279, -3376, -4768, 1083, 12132, 3241, -10831, -382, 9367, 1220, 2084, 5800, -7218, -7379, 9130, 4863, -8365, -2761, 1117, -711, 7418, 7355, -6950, -8637, -188, 1409, 1511, 5, -7162, -5538]
906e538P538K335q35m699n117Q044O778p983l195J710p042O742J4944j0755j2137
921i210J1596K216p658J0143L62j9754L827J7760p009r247O991k096l034J0947
935E834K971j2160n047N319O054N28n123k085J274j607O799R261j1833j0275J4433
950D343M732j2260M235K651j5024O108J9401r300j3635R396J845o441R302J826
964G179j5989j146J2308Q97m742j296j368J803M932K991j274q310m063J0527N402
979G851r492j750M352n728M596J3977r551j3964J0571O212q420K999J646j3153
993i854K138J5538l304r133K369K49O5P163j80r764k613M676M641J785m463m341
1009e028L818L977K172K453p448p608Q414O213o962p43J289p069M754J3573q042
$$ y = [-5538, 2000, 4335, 3500, -1199, -6316, 1728, 8506, 523, -2672, -962, -8004, -1262, 13682, 2927, -9210, 2386, 4602, -3056, 7087, 7449, -12305, -8478, 9282, 2273, -6974, 17, -2079, -5113, 5834, 8805, -3355, -8402, -3083, 2971, 3499, -1624, -3709, -2435, -4042, 2757, 12018, 185, -10090, 4343, 9075, -3185, 1050, 3701, -11323, -5215, 14186, 4886, -8749, 647, 2492, -3949, 5353, 7179, -8810, -9956, 2352, 3249, -1493, -2789, -4157, -2354, 2578, 5569, 4295, -4015, -8078, 2449, 7851, -1641, -3391, 961, -4767, -171, 13806, 4255, -9709, 862, 7074, -1346, 1653, 3299, -9854, -7716, 7822, 4518, -4615, -2246, -1997, -1932, 5231, 5051, -4713, -7326, -2650, 1991, 3776, -687, -5028, -1210, 2767, 4939, 7392, -56, -7664, 750, 6963, 1, -742, 547, -6522, -1768, 11805, 3763]
1024C763j1635P293L065n416O590K2j4047J782J3121j469n324K388k496m78P915
1039E074J439p693m462J703N806L602m219l715J493J10M186N833p723r122P131
1054e57N075o136K166M10r928M646J4238o133r754N327K42l944Q801R21j2800
1069g426r92J0336J118k625J325k424j896N257M465l653q287j442Q484K859n433
1084c34M49J7o059N549J1957r006j1500Q703L510p724M681L248j2256J054J5664
1099G953j828r573J770J339k764N498L784p638n322L544O129J591l587k582K371
1114F85R09O52L512n435r491O995Q509n570k732K497n543N21J2188j895j1491
1129e689K410L987l686L421K649q990m65J0534J513n066j81k540j056P089L138
$$ y = [3763, -7872, -579, 2486, -2930, 3660, 3682, -10365, -8583, 4538, 3069, -2255, 133, -2363, -2841, 5074, 6513, -1180, -5642, -3939, 1867, 5469, 1250, -2465, -972, -862, 3324, 9157, 1434, -7688, -557, 4518, -1618, 548, 958, -8970, -4324, 9914, 3781, -5973, -646, -404, -4348, 4453, 5374, -7426, -8418, 1918, 3036, 411, 1736, -688, -2584, 2673, 7138, 3485, -4802, -6244, 2240, 5099, -334, 115, 132, -5927, -378, 11579, 2573, -8927, -224, 3286, -4438, 243, 3491, -8765, -7711, 7953, 6125, -3448, -1678, -339, -3103, 2395, 6179, -1459, -6781, -3237, 2892, 4483, 896, -1686, 685, 1594, 2246, 5758, 323, -9168, -2173, 6336, 766, -1966, 531, -5012, -4491, 7697, 5802, -5689, -3279, 708, -2978, 443, 3092, -5898, -6363, 4171, 5684, 618, 437, -2103, -3159, 3930, 7068]
1144G068o452m662O23K984L730l4l371j166R67K442K734n257o902L754N499j891
1160F6J165o31q006K706J1450k247p351L007r39l370O719K641r766p54Q872Q66
1176D428j777j12m308j631N370L468k302n929l429M341M715k177p8M00m919K053
1192a887Q730o204r589O766L715m249N117K075j1905J105J3097j276o074L166
1206B587k335m899N899M204p239k540M950L051o9k143k768p02N9M021L985p109
1222a048p890O285M326l902L751K028q185J005J0721m630q748N074K359l540N436
1237C042K303r045k083Q244L358k184j944k577j656J512K893M55n002j740O187
1252A763K439m530r94M19l118L825O861n662p856L264L089o09M403L11o577P23
$$ y = [7068, 616, -4046, -3423, -439, 3291, 3257, -114, -1280, -313, 2129, 4863, -394, -7296, -3542, 1957, 66, 1231, 600, -7406, -4700, 6750, 4503, -2848, 159, -780, -4150, 2569, 5210, -4556, -5310, 3562, 4428, 2651, 2539, -1769, -3400, 1970, 5438, 3136, -2793, -6222, -1881, 2834, 657, 579, 979, -3940, -1887, 6843, 639, -8950, -2184, 1531, -2718, 2399, 4474, -7431, -6326, 6771, 5495, -579, 2587, 252, -4647, 1252, 5456, -1783, -4323, 627, 3678, 3609, 1466, -1302, -2004, -1945, 2076, 6061, -1048, -8938, -2653, 1673, -2229, 1522, 3550, -4635, -3630, 7091, 2461, -6287, -1213, 1146, -2394, 3042, 5345, -3700, -5783, 2461, 5819, 3635, 1691, -886, -2542, -1030, 1863, 2318, -2684, -4424, 1763, 4202, -328, -1322, -903, -4021, -196, 6665, 1003, -6853, -3589, -500, -1109, 3294, 3605, -2972, -2249]
1268b249O198j054l528p14n89J392L891L92n040l014K397N080J735k620k985k280
1284b988n07M478J852n589j734N057P54j433J944l348m021O205N285m916m031
1299b992M65q00K163N430K0n485j196M964J450l729j197L74j179J471N247l694
1315A312p865L521O896k418n26K592p113l713Q725K493p085j25M240j772J123
1330B85L219l543m299L614N513p62n175j819J203O64K463M818l915p044M289N906
1346E417n688k252M003l510k248Q521n14j0296J770O707j016M09K512n777m395
1361f357N441M001k339k531N78J587J185K67M71k517k760M848M660n976m334K962
1377h14j186N71O813j750q524K331N267l334m80K306m728n22O837l28n540j17
$$ y = [-2249, 3949, 2895, -633, -1347, -1936, -544, 3347, 3739, -1301, -4315, -1918, 3162, 4897, 2277, -708, -2988, -3495, 983, 2835, -2754, -4488, 569, 1323, -110, 1834, -1514, -5535, 670, 5955, 1039, -2992, -2527, -3327, -1164, 4266, 4286, -1199, -2395, 2569, 4019, 290, -907, -533, -1712, -241, 5006, 1312, -6553, -3032, 3864, 1446, 920, 3512, -3601, -7314, 1411, 3904, -3181, -3306, 934, -838, 285, 3504, -39, -4338, -724, 4789, 4027, -1148, -2967, -1764, -1100, 1363, 6181, 2266, -4778, -489, 5417, -271, -2523, 1480, -2030, -4278, 4243, 3729, -6567, -4797, 1910, 894, 1303, 3815, -1962, -6357, -916, 3085, 746, -1785, -1207, 380, 1565, 1832, 2303, -214, -2974, 1874, 6534, 558, -3776, -814, -2000, -1429, 5384, 3634, -4890, -2559, 2708, -626, -1106, 1200, -3528, -4050, 2787, 2459, -3081, -3198]
1393c198K471J198L327L09m885k545J612L364J472k642k104J745J093j67K417
1408C467k814n613N231N253n251k854J601l341R89Q450j784p747K684L195l393
1423a927K418K838o543j290P322L37m413k48P20N12L551J637l687l909k56L631
1439F93K776k618k350J227j208J051M602k927o957M660N253m563j478K388n126
1454d577k71R264M53p540P35L247k649K303L427n333l737N188L433k957k364K78
1470a100J138J300J475R19m641m295L730N223l213k732K358k336o24O954q60q555
1486e259K698O464l981j030K939m972k434Q272K943n655j086Q13n33K444J981
1501C604l643k203J223K232J221k113k836J728J688N7K363k022p069J930O818
$$ y = [-3198, -727, 471, 3798, 4107, -778, -3323, -1711, 1653, 3125, 483, -1621, 124, 1217, 1050, 3467, 653, -4960, 271, 5524, 273, -2581, -980, -4321, -3332, 5118, 3334, -4413, -1729, 1466, -1927, 491, 3329, -3214, -4504, 2818, 3155, -1258, -1506, -786, -274, 3277, 4914, 1227, -2682, -2938, 693, 3469, 851, -1499, -272, -1480, -429, 4173, 1246, -5711, -1051, 4202, -361, -1839, 549, -4577, -4848, 4416, 4869, -2671, -1936, 1311, -1338, 965, 4392, -941, -4678, 510, 3943, 986, -1378, -1100, 38, 1338, 2813, 3732, -909, -5204, -1474, 3749, 536, -2196, 162, -2174, -2798, 4156, 3296, -5259, -2561, 3903, -78, -1108, 1831, -3141, -5575, 2697, 5640, -15, -1101, -288, -821, 1623, 3604, -39, -2242, -1019, 1213, 2434, 321, -2515, -787, 901, 958, 3321, 1299, -5770, -3840, 2978]
1516B978k381k435K736l524j388P674J17p541K014M075l213J560K982o205k542
1531e093O786K785l006r10j221j187L484J684k081k699j812K178L977k700k667
1546b482K029q17p5N878j972q429K328O086k839mK801n096j940Q159O98n954J275
1563c54J408k323L206K448n576k900M121K276K16j481k587m41K001J187J296k856
1579c59m681K699N379l079j635K386l361m75P978o22q646J785N284l414J095L810
1595D144n596l416P437K963n245j009M62q01J423K260j931l748p08M643K990l388
1611D80k777J809q34J87M492j474p488K185O454k321j472K390l042j921P213J414
1627E295p102l16K514r40J720J888l922k834L697K860q14k061k036M28J289J792
$$ y = [2978, 597, -1838, 898, -2626, -4014, 3660, 3777, -3764, -1750, 2325, -888, 672, 3654, -2551, -5093, 1693, 4478, 1472, 562, -659, -1846, 1638, 3322, 1241, -1458, -3270, -1092, 2885, 185, -2482, -453, -1270, -1345, 4533, 2561, -5868, -3540, 2546, -293, -297, 2504, -2592, -4532, 3627, 4325, -1629, -354, 1054, -1269, 1937, 4385, -1191, -4091, 30, 2306, 2522, 1041, -1546, -1987, 14, 1201, 2497, -359, -5040, -2341, 3038, -41, -1676, 710, -2651, -3126, 4852, 4230, -4416, -2631, 2653, -761, 334, 4144, -1452, -4868, 2569, 5532, 287, -722, -260, -1061, 362, 2622, 691, -3057, -3765, 878, 3868, 480, -2297, -488, -1322, -1135, 3357, 1883, -5605, -3420, 3034, 713, -759, 1631, -1411, -3332, 3881, 5295, -1807, -2123, 391, -549, 1171, 3059, -863, -3697, 0, 2860, 2046, -15, -2051, -1623, -334, 1458]
1643A458j39l017k695K702M393j627k186P25j126M75M831j105o574R00M817j014
1659H18R3K258m788j833O230J902m876j120O87o39J730K637l299l013J243L448
1675A478J065k162j983k03K04J759K796k886m821K818M110j051r37J121k505o93
1691a890N931j43o629n2L581q56J304K416m431l395M635L117k651j952q5n59M21
1708a238K807m40m088o72M188K681k709j749L52j518J322N026j537o157J218M819
1724B305p92m17J431l482j841N091K128n195k171K112N10J083K000k308m350J322
1740b574M599L69k758j315N9j06J945J774l060k677L290L952j733j707m27j587
1756a956R39M821k50n136j012K800Q36M07R09k973k325L171K695k360l387N11
$$ y = [1458, 1319, -1698, -4393, -1691, 2702, 1075, -1111, -386, -1512, -1037, 3794, 2689, -3885, -2985, 1832, 818, 911, 3169, -1619, -3452, 2778, 4680, -196, -1316, -629, -1268, 462, 3099, -200, -3213, -1970, 1478, 2543, 381, -1602, -1805, -1601, 158, 2954, 68, -4753, -1935, 2175, 1124, 187, 1308, -1197, -1890, 4041, 3898, -2731, -2783, 798, -58, 1246, 3662, -769, -4164, 471, 3588, 937, -1015, -1100, -1659, -1238, 1569, 1129, -2959, -3631, 557, 3238, 529, -1220, -868, -2386, -1064, 3962, 2425, -3732, -2514, 2305, 1513, 1096, 2527, -955, -2796, 2295, 4423, -772, -2943, -831, -321, 762, 2762, 454, -3896, -2574, 2025, 2394, -364, -1679, -1620, -1726, 219, 1993, -1067, -3744, -454, 3498, 1765, 58, -369, -1956, -1017, 3804, 3554, -1582, -2594, 206, 1042, 1449, 2358, -615, -2940, 231, 2926, 566, -2821, -2310]
1772b310J353J084J648n28m380l76M438J868k287o64j137n83J998L025k616l244
1788b711K217K961m46m71j166k820Q82L997Q22l658k539J462J605O96J119j573
1804C77l455J626L851j250l517K59J086M7L029J139n135j917M545J714j155M50
1820A694j974k523K573L086j747k810P44J949P43r2j367k204q58L208L200l013
1836F09l764J417J171j16K903j70n062L78N106r63l212J074k64q45L979J710m313
1853c62k945K941K137M17l57j770j980K91K928J194l201j857K545K028j305m73
1869B31m67l224J479N421j602m899J125J016k66L269R84m720n72L566O62j976
1885B7R9j334m62L367J864k982k282j55J894K596l57k305j785n29K083K115j691
$$ y = [-2310, -957, 127, 1775, 1247, -3133, -3509, 929, 2797, 510, -154, -1291, -1874, 124, 3149, 533, -2711, -494, 2467, 2021, 1550, 384, -2436, -1554, 2443, 3265, -393, -2932, -1470, 135, 831, 1950, 377, -3078, -1452, 2399, 1149, -2368, -2109, -1023, -976, 2053, 3192, -1943, -3860, 685, 2399, 1244, 1694, -280, -2803, -230, 2856, 1109, -1701, -957, 992, 1735, 1643, 276, -1928, -2786, 422, 3622, 609, -3155, -1738, -567, -683, 2220, 2050, -3012, -2634, 2472, 1509, -1703, -629, -893, -1738, 2241, 3951, -362, -3307, -366, 1771, 2188, 1831, 61, -1919, -1628, 1300, 2494, -707, -2564, -19, 2009, 704, 231, -236, -3460, -1981, 3440, 1838, -3061, -1936, -920, -1186, 2083, 3067, -1653, -2225, 1341, 2003, 27, 126, -1208, -1670, 1697, 3561, 579, -1703, -1858, 36, 2632, 2275, -30, -1815, -2344, -261, 1854, 163]
1902A63k634J421J684m0N56j482l102J722M332o21k917P8q13L24L736J446m470
1919f17j091K403N12m22N6j346j550K658K056j246l070q37J936J941M00q99k255
1936a371j960J947L422j586k383J368O60j95J807j58m173K27M730L06k585J1j327
1953a260q96L559K415l548k033J549L61M42p1j137j493J052K707j20k537j918
1969b928J584K489O1M4r88l243N69M300L8l219Q78J087j178K181J051m592n66
1986b432M138N62j837K05j575k020K971K867j653k241j71K56J201P45j777j002
2002a763L26J315K131j354l041P09K554K6N49O40m059j357M806Q40k797N32J36
2019A93j563L031J327m082j196K699L77l05Q88k804j881K736K353o05q69j772
$$ y = [163, -2471, -1050, 634, 594, 1150, -332, -3434, -1712, 2620, 1999, -918, -840, -1653, -1329, 2407, 3853, -617, -1708, 695, 1207, 785, 841, -505, -2055, 603, 2659, 1413, -1657, -2494, -558, 1383, 1783, 884, -1371, -3331, -1384, 2038, 452, -1931, -563, 97, -98, 1709, 1551, -2622, -2395, 2335, 2641, 56, 67, -1260, -2156, 1403, 3818, 270, -1763, -214, 147, 589, 518, -619, -2112, -1060, 1647, 1527, -1010, -2928, -1344, 1145, 1206, 1250, 262, -2981, -2412, 1888, 1926, -1293, -415, 672, -506, 1675, 2726, -1866, -2432, 1706, 2268, 431, 636, -939, -2959, 12, 2879, 1226, -1015, -1186, -930, 271, 1016, -761, -1763, -1437, -122, 2009, 655, -2386, -1677, 877, 903, 1452, 2092, -1967, -3324, 1482, 2322, -475, 57, 193, -1370, 1661, 2988, -1094, -2290, 409, 786, 481, 1369, -1435, -3316, -580, 1773, 1168, 299, -1473]
2035a473j07J904O40j193m48p32L11L266p88l157R17J105l70K522M64m944o96
2052b779M225k39j415J584j668j820L344J330l674n64J434k99J195O25k356j749
2068b826J310K056J668j186k612P67J407n66Q27K52k995N44M021o58l240J316
2084H5J69j473L346J252n003j123L346p1n48J005j444j950K385J458r67j677k51
2101a461O59J588R4j286p07r89J915L259j448k869J019P20r26J734Q91l906M5
2118a668L441l50k086R55p27j322L094J056l088j310J140K99R80L00j192r26L84
2135a020J672R66j476j839J052J529k84K5k66k027P10L433o67k137L02j31q08
2152i66K322O90l241q54K258L21n04M54j587n25J761J492j034j759n05P62J410
$$ y = [-1473, -1580, 324, 964, -229, -677, -1409, -1098, 2168, 1380, -1777, -860, 245, -125, 2397, 2861, -2083, -2779, 1446, 1207, -208, 1376, -292, -2112, 1232, 2562, -1112, -1676, -242, -541, 654, 1279, -1077, -2826, -1516, 540, 2208, 1022, -1590, -823, 584, 18, 845, 1097, -1898, -1354, 2667, 2009, -1231, 85, 254, -1219, 2127, 3379, -1624, -2747, 599, 528, -20, 985, -459, -2409, -24, 1434, 467, -1210, -1461, -802, 786, 880, -406, -1113, -2102, -187, 3072, 1624, -1245, -226, 494, -432, 1302, 2193, -1713, -1668, 1773, 1423, -663, 292, -435, -1757, 1337, 2393, -695, -2005, -865, -566, 414, 714, -478, -1404, -1020, 652, 1618, 142, -1697, -645, 884, 600, 625, 359, -1668, -958, 2475, 1808, -329, -27, -158, -966, 1356, 2046, -1195, -2049, 209, 530, 26, 480, -1107, -1632, 129, 1621, 587, -1172, -1677, -915, 495]
2169D95N43n31j182m30J336J514p98j457m4Q06J88J101j048k409Q51K692l34j079
2187B14J06j489o45K588J042k693j393J642N59j6O82r95j676J438J966k1k147
2204h38l82P89K08R75L88j159j829J877K191j080j561M22k37l32J703J31k898
2221a632l06K428N98j122n2p47j013J434J874j184k227P74J260O8M57J00j655
2238i45n63K705J044k025j284Q34L19J50J235r41j728L20K259j28j423l45m01
2255i17j94J645R67k040j515J389J724q49n9n04j109N77K372k58k375O5J231M17
2273E67K87N89j612j242J847J374r71j171j31r4M40J416o15j921j63J508P68m27
2291D49j122l88n03J663J340j150j808O43J039J73K64J72j694J00K246L9j716
$$ y = [495, 1038, 507, -675, -1105, 231, 1745, 947, -510, -554, 252, 440, 1541, 493, -1916, -1065, 1627, 1293, 214, 320, -1169, -1814, 774, 1816, -877, -2270, -628, -69, -85, 597, -398, -2074, -636, 1330, 1309, -838, -1220, -431, -223, 752, 1140, -19, -1848, 29, 2220, 1140, -421, 1, -236, -568, 1135, 1266, -1632, -1938, 490, 1088, -34, -86, -833, -1846, -412, 1462, 278, -1949, -1175, 85, 153, 610, 710, -945, -1508, 1197, 2241, 216, -1068, -234, 85, 235, 1470, 529, -1199, -879, 1380, 1252, -171, -516, -917, -1111, 534, 1501, -539, -2054, -665, 1059, 210, 151, -353, -1462, -885, 1487, 1229, -1146, -1081, 150, 567, 854, 1443, -169, -1411, 436, 1810, 839, -332, -463, -557, -117, 1299, 684, -1237, -1400, 108, 876, 449, -673, -1061, -1564, 99, 1439, 289, -1519, -876, 163, 336, 600, 772, -922, -822, 1424, 1463, -253]
2308b53n27O54k65J391J029k032j485J376J359r47m36q6p79K3J647L06j639j111
2326a775J424Q12k24J63p31j392J007K675o77k161J08J263o96J041R97k341r61
2343a468K294O58j784k56L49r51J125J847r32k566J60J633M12n34k51m52o22J262
2361g6J451j074j887R32J827j42o13N1j527m99L240N30k417p53J107o67R21J419
2379A823j850j718J689J469j253l79n14m59O97J694l88j900p24J099J496l5p08
2396C9m65o29K79J837K16k565O35J496j41j60L47j505j135K610J107j675q31Q3
2414d57n20R18J792j350j528P62N40L79n34p75p59Q82J439J11o91j552L25J546
2432E28O35n98m40j095j84K359L72k183N6R31Q5J07Q41k164j296K090J346j431
$$ y = [-253, -780, -126, -391, 1000, 2029, -3, -1488, -112, 1247, 300, -136, -222, -1001, -978, 669, 975, -664, -1775, -351, 461, 237, 400, -331, -1723, -716, 1959, 1282, -879, -771, 492, -204, 837, 1834, -507, -1468, 826, 1484, -300, -556, -207, -1158, -33, 1814, 882, -1684, -1524, 109, 521, -13, -264, -716, -1338, -76, 1375, 301, -1586, -654, 1173, 1031, 418, 469, -1058, -1557, 1683, 2213, -204, -957, 150, -517, 404, 1823, -27, -1745, -56, 1413, 160, -219, -733, -1192, -495, 1199, 811, -1089, -1813, -714, 782, 747, 39, -426, -1055, -776, 1061, 1277, -1288, -653, 843, 702, 542, 889, -616, -1751, 859, 1966, 291, -540, -457, -977, -59, 1733, 383, -1145, -383, 157, 536, 2, -773, -1532, -650, 789, 900, 209, -1343, -1018, 528, 1163, 565, 125, -970, -1154, 1205, 1577, -606, -550, 381, 466, 573, 1414, -750, -2046, 44, 1390, -41]
2450d1j23m14j134J252J911q63j493Q3O14J93M08o21p13L44J191J023p86j680
2468h49k74J621K97M60j00k039j002K489Q96k308L32N76m08O54J297j943k082
2485b383J612J476l51j92n88j025L19K033J45j081p09K59J358r4o14l11l96K63
2503b79J782M73k854m11J634O1J58Q51j792k017K317J331j265o77N66q36P52J472
2521A266j422j136j1J262J234l59j073p88L10J178J060k39j960m47J618M96p79
2538B10K85q62p27K173N48k115q68P94M1Q78J093k010j469J623Q17k68L87p87
2556b57q64R45J388p56j116k82P98J300K58j111j076j69M04J924N0j869j64R85
2574C88l83J57N59j633o04K427M66k006k79M39o16J354J575j693j790Q62Q97L19
$$ y = [-41, -164, -578, -1712, -460, 1451, 588, -905, -822, -208, -15, 393, -228, -941, -597, 594, 1617, 831, -849, -1123, 498, 795, 1255, 1155, -884, -1886, 603, 1499, -809, -477, 99, -309, 345, 1642, -301, -2383, -771, 705, 354, 162, -426, -1451, -1132, 901, 1046, -35, -744, -485, 873, 779, 165, -146, -542, -279, 1503, 1976, -878, -1289, 345, 406, 564, 1415, -377, -2394, -77, 1254, -11, -688, -122, -958, -206, 1266, -156, -1292, -1303, -41, 1193, 834, -239, -1027, -717, 461, 1521, 1282, -678, -1125, 493, 989, 210, 495, -367, -1094, 1079, 1627, -488, -1356, -562, -521, 357, 1450, -560, -2029, -406, 411, 143, 530, -257, -1121, -176, 1212, 456, -660, -942, -144, 1156, 1414, 303, -773, -942, -538, 1386, 1436, -433, -597, 388, 5, 162, 721, -912, -1516, 911, 1377, -629, -908, -469, -1085, 269, 1844, 151, -1639, -777, 120, 439]
2592D39J26m67r37N51J130L13j022j202L63J594K5n32l24j151j17K358L86j940
2610d07n13N51k48N33J055j408j304J948J007j166l68k12q70J464J468n20j789
2627g79k01N67J398j46n35m44k86N09J067m51j750K23J262J43N5o11r88p36K047
2646C44J254j703m72q3R9N53R41j018r88N77J158K23q46k52p31N72J697K98j486
2665A37j242M47J438P0l93m64o87L05J389k76j381l67P38O85J77p8j536n22J326
2684b34J173l27q09m20k36Q24J174n76j380J23J121M86m88n95q09N73J302N93
2702A495j387j170J77P24N67L98q74q06j43J822m2j485r8J97L56Q38L48j420r73
2721a476J102J662k59o50p55l82M58J498nj417o80J048N20k96q1r65j93J079O85
$$ y = [439, 565, 98, -839, -288, 842, 1155, 133, -1069, -706, 888, 913, 381, 57, -1094, -1211, 1147, 1533, -407, -920, -369, -617, -84, 971, -437, -1741, 207, 1214, 48, -320, -532, -1402, 62, 1530, 1010, -779, -980, -413, 985, 839, 304, -140, -426, 83, 1150, 699, -1051, -828, 434, 577, 632, 21, -967, -1703, 344, 1598, -105, -577, -660, -561, -8, 933, -85, -1073, -496, 662, 885, 39, -213, -944, -372, 1325, 1623, 137, -1105, -658, 780, 850, 457, -7, -694, -389, 1000, 724, -657, -1024, -286, 399, 576, 498, -1038, -1560, -234, 939, 612, -197, -617, -853, -29, 1145, 569, -811, -688, 433, 919, 431, -164, -973, -400, 902, 1495, 108, -1062, -885, -161, 406, 804, -70, -876, -1019, 803, 761, -724, -822, -625, -269, 569, 917, -503, -1476, -374, 1288, 1029, 379, -376, -758, -300, 1198, 1193, -224, -904, 144, 664, 368, 287, -678, -871, 208, 893]
2740H93j63j516m62O04Q58M90k46j321k38J132Q63p53o65J62J24P94N15o01j647
2759a177O33J150O38m28p87o80J83J039N73j249r18M65Q53J34j4j071l35O00J034
2778F43J13r90o61K93L93N98N24j193p93J063J046o59l45l36R1O33O15m23j449
2797h37m9J050O82l23k07r27n19J134P33p33r26K96N57K32O25o77j248L76J274
2816E13J16k38j043j21N82O08O70o43j276K37J487K2n02n04k48j3J260J16j460
2835d37l52P02L31J23j14m52r98P10J517r02j027K23J50O36O68j37j578J98Q60
2854A21P74k34p35n43Q8P92O71k11j228j43J019K28l93L7r22k46J239P03j162
2873a45j114P02N27J72M28p67p80M12J258J01p20o39J25O31N69Om53j306P60J103
$$ y = [893, 730, -786, -1248, -644, 214, 704, 458, -863, -1101, 31, 894, 141, -524, -362, -238, 556, 1071, 470, -1177, -544, 606, 1244, 816, 29, -651, -468, 571, 1144, -105, -1023, -558, 295, 429, 415, -656, -991, -391, 643, 756, -234, -895, -602, -209, 389, 913, -280, -1073, -10, 1036, 377, 32, -304, -213, 420, 1035, 612, -837, -886, 164, 846, 523, 316, -611, -1130, 4, 737, 4, -922, -626, -69, 163, 788, 111, -1137, -761, 513, 629, 391, -652, -773, -191, 417, 1087, 444, -832, -595, 892, 914, 412, -92, -340, -353, 907, 1023, -437, -789, -87, 244, 367, 253, -199, -1197, -487, 1030, 128, -899, -676, -526, 110, 778, 641, -937, -739, 121, 895, 661, -74, -617, -529, 263, 934, 723, -505, -648, 371, 599, 206, 243, -679, -925, 314, 1017, -145, -1259, -557, -30, 142, 570, -197, -977, -565, 693, 794, 74, -565, -440, 191, 760, 766, 313, -993, -233, 870]
2893H70m2q63m08K18o3P06L91j369m56J028L14k58J78q64o80J202R88p59p27J16
2913d78P0N59Q75r53r28M88P74M32m21n44k70N09L29K62j31j240l13J612J05p18
2933A9j45l85l79J147K79q76o87Q95O6K09P35j351j024J311J079p76l30P5n83
2952g21Q58O55l19p27o0J63Q85o7j059j27K31L67P11q9j301m88J352R8o69N97
2972B90o63n22O62J075q41q92O28J55K62N68m71j200O02J003k1k62m25m01N51
2991I8L43Pk62p00o8J080lr06J02j6m2Q36M59j506m22Q27K96k01N97p62o61O92
3013b12R59n15n64M01l1L10L82l20n12l23O98L60j13o63k21J24J94O06j36p86
3033c62k60P60K55n27k30j57j7Q16N70r43m30L75P9K33N02o69p68P23N96j21j24
$$ y = [870, 828, -35, -443, -225, -288, 418, 809, -560, -1016, 12, 326, 68, 246, -618, -1298, -96, 892, 133, -594, -478, -408, 151, 1026, 73, -855, -367, 407, 839, 418, -126, -396, 113, 442, 704, 573, -667, -980, 632, 737, 19, -126, -511, -890, 257, 536, -340, -1027, -132, -66, 143, 878, -473, -1497, -186, 893, 117, -213, -138, -721, 137, 792, 473, -254, -314, -151, 734, 667, -392, -519, -288, 79, 790, 701, -600, -1088, 264, 362, -307, 290, -373, -895, -233, 842, 1, -891, -263, -108, 154, 722, 251, -949, -347, 656, 635, 373, -52, -453, 98, 441, 448, 186, -514, -582, 498, 495, -411, -309, -325, -367, 469, 928, -578, -1000, -173, 123, -78, 519, -243, -904, -212, 747, 232, -332, 69, 38, 348, 730, 410, -102, -425, 273, 633, 520, -143, -364, -240, -46, 560, 424, -362, -622, 138, 393, -134, -364, -521, -538, 278, 848, -95, -525, -150, -71, 162, 664, -5, -773, -50, 546, 425, 301]
3054C01l12l30L53N56j12p25n93M83R98r4n98l07J4k08J024J20o87n09P64K94
3074D32k31Mn63l11Q51N71l22q02L08l00O58N75o87n00k54M17M21Kl46l27J65
3095b39L29M93o07r34J54P46P52o86M7n51l42J149N73j024k35L91M14k51L58p92
3115b55l71O73P65l30l82l41j46J52M57L64k81j123J99Q25J17n61n8N0K3N56l02
3136C1o84LO68M59r8j03n26m84N93R05l43p31L81k21JN06j99m44n15J222N5l36
3158A40p30j26O49K88M10o73n86q7P86M55n70L8j47K00N88K4p29o26Q46o0M85
3179E75q6m95n53L99J070n05l06j6k45K96P9m9m76j36M48L22m23r5k72N2L43L13
3201B40J00n55m14N30L23R5j94k22m61R31J11n12m45N42R9j3L71l54p15k9Q46
$$ y = [301, -11, -341, 12, 568, 456, -269, -862, -379, 619, 525, -73, -380, -366, -574, 450, 570, -117, -626, 138, 432, 201, 205, -358, -669, 182, 753, 431, -371, -63, -363, 295, 870, 183, -317, -571, -154, 267, 269, -77, -404, -239, 90, 583, -24, -958, -804, -58, 694, 8, 55, -496, -838, 311, 884, -140, -375, 16, 430, 179, 537, -255, -626, 47, 812, 482, 100, -241, -387, -235, 222, 586, 305, -818, -619, 206, 323, -238, -296, -246, -223, 333, 31, -653, -650, 18, 477, 379, 276, -250, -734, -141, 764, 421, -310, 71, -150, -149, 357, 158, -286, -801, 421, 476, 140, -590, -716, -67, 221, 631, -42, -628, -715, 71, 526, -44, -6, -153, 47, 635, 659, -70, -696, 150, 90, 575, 489, -6, -559, -160, 910, 405, 99, 83, -162, 134, 213, 164, -312, -448, 0, 322, -101, -196, -468, -416, -73, 240, 340, -215, -629, -99, 224, 319, 125, -97, -558, 373, 484, -28, -473, 69, 168, 155, 526, 172, -543, -572, 274]
3222B74K81l32n05k74K80K68L58l89n22L91M40J4l77j12m16N27O74m0n09n18K05
3243b82O06M9j69m6k53J84K79o1p46L09J53M06K7q6r39l22P21O30k13j46m36o
3265c41K23L95K2o69J15M25J54J8k44m90J0Q59J94j79r42L21K93K18K50n84m20
3286c72m14J053L20o48l34P4j4Q68o0o05o24K30R69qk72l83K0j29P68j0p36J00
3308b07K03P8M14k26o13m7L92N42j53n75j07K38P5L97k18n36n22R44j7P5l35j37
3330c35q6O78N17p63o97K63M77K96N1j96p93J22Q65K01l24k95k11K88M45kp06
3351b05m65N05M27L69q87k62J76K97L25J63p31m20M90P08j64j28l26l38N17N23
3371E74l69p66K64L39Q6M93m47l20k56L73N48l88k35m84M53Q0L45o27J7j68N22
$$ y = [274, 555, 223, -282, -556, -276, -8, 350, -39, -561, -170, 270, 284, -93, -205, -621, -94, 580, 540, 31, -487, -282, 324, 373, 204, 158, -95, 89, 368, 307, -439, -130, 23, 429, 456, 370, -569, -891, -170, 460, 247, 101, -335, -341, -118, 277, 299, -370, -255, 170, 324, 342, 98, -392, -382, 477, 671, 492, -450, -129, 164, 382, 632, 48, -372, -786, 267, 587, -61, -395, -321, -335, 533, 473, -132, -756, -526, 443, 435, 163, -220, -200, -329, 439, 429, -307, -207, -4, 74, 488, 262, -351, -398, -6, 536, 383, -192, -299, -61, 14, 411, 193, -343, -865, 79, 62, 137, -198, -335, -421, 257, 774, 11, -686, -423, 54, 350, 401, 205, -588, -466, 399, 600, 276, -19, -230, 58, 503, 501, -205, -670, -165, 262, 631, -256, -518, -342, -45, 280, 443, -288, -708, -218, 490, 326, 198, -128, -466, 51, 574, 205, -561, -297, 42, 128, 621, 174, -146, -402, -29, 519, 131, -104, -588, -135, -55, 290, -337, -320, -488, 34]
3392C4L39m29l20J44k3L78N59m23o88K51L68Nj80k03k51K97M98M2n04k67K62J01
3414a0O38m10o19k18K30L85N16p60k06J46P9L57J40o27l18O99P98o60l88N1n7
3435b34K32O80n27m61J01M44j67L63j01o48J53M15J95l67m16k2J86O28l33l07
3455a86l34R2L98N22n12o56K98J52N15Ln40j97K78M85oP7m99j23M47N05m75k85
3477d1m7p2L49J88j66o07J03m8L62L06m05m91N05K15J26j4n87l39P88L39l29l07
3499a72J22r4L51J45p2o18J29L49K60p7k03n56K33L97P0m27m21K09K42N10j78
3520A99l96k38L30P6N33n93j51Q5J24J42K19l40o36P98K32k04K16n17k95N28M45
3541E57k94m27o1J54J31M00o13j66n2L18M21j43n24k10L54L62J8j59o00K14O01
$$ y = [34, 373, -56, -376, -232, -255, 123, 682, 259, -429, -178, 190, 195, 15, -188, -439, -142, 356, 398, -106, -373, -111, -10, 628, 218, -401, -619, -389, -4, 512, -248, -454, -308, -229, 128, 268, -359, -677, 22, 820, 160, -228, -177, -234, -2, 678, 151, -310, -209, 235, 68, 431, 330, -318, -165, 250, 445, 78, -338, -360, -174, 454, 121, -186, -520, -428, -30, 492, -20, -676, -378, -226, 289, 292, -248, -445, -167, 318, 312, 389, -110, -233, 214, 719, 244, -41, -88, -160, 189, 377, 211, -396, -293, -341, 21, 327, -78, -569, -64, 151, 277, 263, -324, -663, 125, 464, 135, -172, -50, -144, 207, 352, 280, -338, -209, 140, 400, 323, 120, -436, -203, 194, 264, -163, -584, -375, -133, 377, 199, -197, -435, -105, -29, 504, -89, -240, -155, -31, 111, 330, -10, -646, 152, 384, 180, 396, -121, -416, 112, 557, 263, -164, -225, -71, 60, 460, -153, -319, -371, -53, 368, 225, -299, -509, -155, 207, 225, 66, -534, -320, 281]
3562B81Q8k97P3m29P1M00L08m32k30K34L28o3o3n22j52J85L42K70o31Lm47P44
3584F1M42l15n48Q3J09L4L14k85k60J41M56J05r8p13K39J44L48J32m53j91j17
3605c72N92J75k72l91J23J15L11k6k19m58K9O16Rl51k01L1m2M43J89l80n21K91
3627c09O46j4n3o09K21J66L53j10o27q5L62K58R8j69m10j84J79N93j54l39n02
3648f89N51L46lk81j58l03L22O04L9n13k24r9N74O3p4lo64L94K12R3q7l1l0N0
3672H9K89k83p29M57Q1L16j13k65j41j5K96K95n86J59k06J05L08K99l93l16L79
3693B6K14K28m42l56J71K60L66j03m15l31K55L54j93L34l33l70J43O26m7q01Q6
3714c28n9O12j05j23m34p0L20O20k82n37K39K98J12m3k77j81L05J85Q3l38p8O8
$$ y = [281, 369, 72, 145, -284, -213, 187, 495, 63, -167, 67, 395, 332, 269, -253, -405, -220, 122, 392, -239, -236, -683, 61, 503, 188, -360, -277, -168, -134, 180, -105, -365, -224, 232, 337, 239, -474, -235, -91, 257, 389, -64, -255, -372, 220, 395, 123, -268, -145, -30, 281, 255, 36, -422, -393, 223, 232, -119, -320, -289, -331, 112, 301, -79, -600, -309, 337, 323, 270, -339, -118, 48, 401, 291, -336, -421, -59, 199, 297, 128, -282, -466, -287, 306, 152, -187, -689, -138, 208, 205, -76, -234, -537, -215, 389, 428, -85, -309, -408, 166, 229, 155, 152, -512, -118, 94, 187, 100, 69, 39, 89, 378, 95, -634, -177, -96, 220, 107, -158, -299, -314, -18, 277, -309, -150, -356, -251, 57, 356, -37, -353, 26, 240, 468, 26, -330, -159, 101, 467, 364, -51, -382, -127, 227, 34, 368, 35, -335, -192, 434, 387, -414, -328, -387, 225, 120, -3, -437, -507, -187, 433, 151, -386, -147, 151, 263, 220, -57, -238, 67, 252, 335, -3, -81, -13]
3736a3J55p0L53m80l36L28J66j0k49R5k01K23M37l29k98j00n4M77l1j41j65k29
3758d72L21K67k2N1m91N5L78Q6R4l30k66K41K58L0k14P6k99L72J29r2k51n51P70
3781A40j1N7l67j73J15L90P0l17k46K88J31K57j07q7n63M76K75l15K96n11p3J62
3803a13K97M5l00l17N81k33R6k95J20l85O31J57J71n10l38M04r3K77j63j02k42
3824c12O11nj79k52J77j51K50K96n2n30k88M19M41m1n30O0j24J73J63k25j32L5
3846a96J86J49j88q5j73L31r8L14k85k78L50j52J82R9j14j08O8J32K34j75l72
3867a79j90N54J16q8n72J8O4M45p2rk47K6K26n1O9k26o5K0N71l18O2m87J41N64
3891C72K5m7o94L74k38L15J2L0k86k43L71K58k97N6k96K15J58j30N1l92J63M49
$$ y = [-13, 142, 72, 425, -55, -391, -63, 103, 93, -156, -61, -262, -39, 398, 69, -229, -329, -383, 94, 63, -78, -243, -472, -151, 116, 94, 145, -346, -291, 87, 173, 267, -63, -329, -88, 170, 200, -14, 62, -237, 135, 264, 172, -79, -630, 140, 129, 186, -181, -354, -239, 151, 221, -96, -342, -54, 77, 334, 227, 140, -423, 53, 328, 13, 309, -202, -275, -113, 184, 229, -71, -388, 193, -40, 56, -239, -119, -504, 127, 284, 455, -55, -393, 11, -82, 195, 32, -70, -312, 299, 294, 115, -137, 40, -111, 139, 435, 383, -147, -435, -16, 425, 384, -146, -86, -210, -37, 126, -99, -231, -196, -10, 139, -49, -134, -307, 24, -74, 240, -45, -323, 27, -125, 57, 156, 42, -66, 2, 134, 368, 193, -179, -369, 185, 301, 213, -359, -341, -277, 168, 96, 87, -160, -134, 92, 41, 110, -116, -181, -161, 410, 92, 154, -333, -192, 372, 397, 350, -344, 30, -208, 107, 119, 149, -137, -380, -9, 249, -48, 8, -288, -73, 85, -45, 6, -386, -223, 226]
3913B26j02j11N3r9k15L79K60m14l04N34J11m00Q6k83m3M17M6o4l01N4l1J02M72
3936C73l16k85K99m2j37lL59m82RN57k3o7m49j47J18L82J18L0k00k84K56K14l02
3959b2J00o1j42K0K66k57j61K03K51k39j51P0N9J14L2KLj39k75L69K43j60k46
3982a21J9o5L18J7M4j87NJ12o0K22m07k00L13L57k3l19p3j49j4L52j80j61L9J30
4006c1O6M2k18M0j81Q9N34o3l90OJ88Jm5p5J8j14K06J56m0m70j6K32J62j59k4
4031h6J88k69J35J84k58j74O3K35J79k8q0j94l5J52J44j93J0r6J18L03l02Q4j87
4054a07p4M18Q8ml41J13l4K90k90q3k37L31j17K43j11k00K63k17O6Rj58LJ27J11
4078H9j28j19j75K97J99L08l34r2k71J96L1J45j95p1j16O55l85J86k78Q8r7K34
$$ y = [226, 124, 13, 66, -33, -248, 131, 391, -23, -327, 207, 318, -82, 4, -279, -322, 95, 141, 77, -224, -170, -201, -99, 373, 57, -228, 71, 29, -108, -111, 248, -234, -225, 332, 309, 242, -207, -354, -236, 146, 264, 294, 94, -190, 66, 280, -22, 78, 17, -125, -105, 161, -96, -257, -54, 197, -42, -193, -123, -64, 50, 82, 84, 87, -52, -327, 42, 285, 125, -121, -102, -167, 151, 168, 212, 25, 30, 142, 82, 304, -103, -303, 10, 367, 344, 25, -48, -197, -211, 141, -39, -200, -161, -31, 35, 77, -141, -101, -282, -193, 341, 278, -112, -106, 82, 83, 38, -37, -19, -133, 73, 229, 189, -281, -297, -65, 97, -62, -86, 102, -167, -32, 152, -106, -280, -217, 18, 197, 169, 89, -105, -140, 12, 156, -37, -27, -123, -5, 298, -4, 80, -107, -181, 237, 325, 321, -20, 93, 59, 349, 59, -24, -261, 70, -47, 196, 85, -115, 148, -69, -3, 6, -152, -149, -22, 89, -39, -158, -333, -36, 163, 471, 137, 45, -226, -30, 1, 146, -49, -120, -236, 419, 34, 220, -58, 30, -67, 167]
4100A67Q4j35j34j67K56n7j0j27N4QJ52M0k96O7k22L43l7J47R4l04O3J90M7j40
4124H3l40J42P6K19r4j93J72l35M99k56J74l58J2J87L42k53j86L8Q7q0K59j24
4146G1k73P3K23J6R6l28J4Q3L82k46P0l42m7K66O3j38j55L9n5K44K4j7J46l31
4170a22K25J52l81J59o1oJ18P3k42k81J01L18K34l4l47j13K26J57j33M9l00K96
4192H8j73K98j05k87J62l9m6L60k00l73o8M33J40n3k01J26p1L7K05k51r3l6J60
4215A3K01k39rj12J65J9N0N2m32K89j0j09J31k93j21N56q8J05l63o4J31j81L58
4238D9J40k01m1j00O5L33m80K91j58L25l11K96l95J05k2J25l7J29l43L4J68K88
4260B60m51P3j6p7K26K3j54J49j31j01O17o76K45Q9k72K63J80k40j57K11K08k16
$$ y = [167, 251, 116, -18, -185, 71, 14, 4, -123, -69, -61, 91, 131, -165, -98, -320, 23, -14, 133, 227, -77, -14, 176, 223, 83, -257, -115, -39, 180, 86, -107, 65, -270, 229, -27, 147, -211, -199, -12, 330, 77, -109, -71, 16, -64, 195, 71, -202, -129, 94, 110, 206, -122, -108, -25, 357, 111, 181, -161, -208, 58, 121, -17, -172, -133, -188, 56, 80, 63, 209, -122, 103, 255, -126, 33, -28, -34, 84, 157, -85, -366, -265, 53, 287, 253, -94, -207, 19, 176, 43, 92, -208, 88, -85, 213, 108, -179, -17, -56, -102, 258, 58, -315, -383, 50, 190, 137, -64, 62, -9, 28, 233, -18, -111, -147, 13, 214, -25, -34, -146, 19, 38, 88, 140, -292, -3, -13, -122, 9, -284, -405, 151, 63, 168, -195, -259, -128, -309, 49, 189, -12, -53, -153, -88, 245, -235, 56, -102, 223, -88, 208, -187, -82, -104, 21, -16, 113, -230, -196, -28, 260, -191, -118, -134, -211, 15, 38, -116, 33, -98, -199, 418, -258, -13, 76, -196, 67, 247, 7, -150, 61, 269, 53]
4282E3N6l8k47K56k35K76k99M2J51j40J85J1j40o1K10k53O7J36k16J16L15k32
4304A3j16J50K6N2J35j36p6k22J62j07J0O6L4l00K55O7J05m8k47q9K73J0j13j65
4328b61J18m7J02j11j8Q7J15RRO3j07L9J11l71M01m37J32J34K85m3l55j21J42
4351a24O9J21K4r0k28M93l03O8j22K4j56K01r7J94j75j58J33K94jl40Pm4L39j47
4375a8QPK7j0K50j84Ol61J60M66l24r5N5k6nJ02r1K51l29M9J1K4j27k6Q7p2M11
4402B46j97K7j80PJ50L78j53k34j58P4J55J5q8k46J41m7K80j20l02K85K01j37
4424I7J39l38l30N6L87K68L7k36L1l70L72l51M47l03j9J54j85L33l48J62Q4J31
4446B18M3n27K45j9l33L81J87j02m61L66J6J40m39K82o5l67M72o1l6o4L5J2J12
$$ y = [53, 109, 71, -176, 80, -155, 121, -178, -136, 15, -125, 60, 71, -69, -130, 80, -173, -106, 30, -186, -70, 245, 13, -103, 47, 73, 125, 260, 124, 48, -174, -12, -119, -109, -43, -9, -309, -54, 13, 118, 70, -177, -266, 7, 17, -96, -261, -143, -190, -88, -199, -217, -130, -15, -6, 3, 66, -41, -2, 109, -262, 139, -298, -166, -32, 253, 210, -145, -266, -124, -55, 66, 90, 0, -228, 265, -38, 30, -92, -68, -224, -23, -120, 74, -101, -259, -126, 168, 167, -173, -166, -210, 129, -18, -10, -3, 24, 14, 264, 80, 86, -275, -115, 351, 27, -68, -13, -39, -44, 58, -33, 218, -111, -62, -51, -27, -154, -180, -93, -165, 246, 49, 76, -104, -97, 53, 431, 278, 44, -114, -40, 115, 130, 42, -204, -63, -110, 170, 50, -252, 33, 234, 97, 236, -102, -432, -376, 11, 279, 316, 80, 111, -259, 113, -238, 209, -94, -113, 41, -144, 189, -159, 3, 87, 218, 261, -266, -21, -40, -373, 8, 195, 93, -368, -2, 14, 154, -285, -3, -68, -435, 37, -24, -60, -124, -89, -77, 35]
4469C5k02K18l00M98kj76n3q6j4J62N2m41L29o3J54M9j05j10j65K84QL4j6l76
4493b86K69o4L63o29L30J80l32K18p5J73k29R3J09n9j03j80K16j27K21j16K60
4514B32l19l7J08k76K21K36n45M75q7J4R0%K59k53j92J83m29J61P0LJ76j37O6
4537A9q0J1J65j96O2j48J22j1J71l89M36l92J71K21j88J2l02L88r4j45P0k5L0
4560i2M27m5l92Q8l5L3K38n0l88J80J73p2O2o6k34K48M0r8K17l80J19J2p7O0J52
4585A20j88K50m55L09J03k45O3j0J16j20J34j30N1o2J12j53J32mP9j52N6J73m11
4608b32J99K32k98qM1o3J77k05J24J7q2P5M8j60N58m88k37K46R5L5r4K19k51l0
4632h2K39l1j60p6J51j20L66j90j28J34P2j0l78K54k2l03Q2K74k69m3K87j40N12
$$ y = [35, -167, 51, -249, 249, 247, 71, 18, -68, -82, 80, 132, -309, 20, -43, 111, 160, 55, -55, -220, 64, 72, 106, 90, -286, -17, -81, 282, -347, -17, 163, -169, 49, -26, 147, -82, 11, 120, 61, -42, -222, -6, -133, 88, -28, 232, -87, -124, -16, -292, -71, 165, -380, 95, 8, 22, 112, 112, 371, 118, -74, 109, -320, -159, -89, -86, 90, -47, 19, -61, -50, 115, -81, -19, -167, -45, -56, 115, -274, 162, -230, -59, 162, -26, -14, -316, 72, -22, -167, -97, -122, -92, 335, 290, -102, -14, -49, -16, 222, 172, -216, -36, 137, 65, 127, 61, -173, 75, 115, 17, 234, -146, -27, -15, -92, -32, 120, -68, 182, -273, 36, 139, -106, -43, -53, 63, -57, 77, -53, -2, -64, 48, -105, 27, 23, 102, -50, 6, 179, -232, -33, 199, -99, -107, -66, -129, 48, -157, -33, -16, -98, -23, 25, -135, 423, -65, -302, -56, 39, 74, -20, 199, -52, -82, 157, 126, -34, -110, 41, -79, 287, 97, -31, 103, 175, 165, -213, 41, 19, -284, -202, 72, -197, -240, 47, -93, 419]
4655D19k02k73p5J38L13l69L81l77j00J22k23J62P2K06k81J02J83K3m85L53j87
4676i8kJ19j99J6P5N5j20kJ87l25M05m7l96L55j0M6j39L07k85J25K4L6j81J66
4700A12K11l08o6j6M0K24l71J48mk05p1K27J80l11K97j45o9m1K77k00J00L88m29
4723c2L5j6J27j12p4P0J72k85K83k63j30Q3K34k83L65j21p9J39nk66K84j4l37
4746b25M9J03k7q6M42n16M3L11L9m03K18J27o2J01k99J28j07J31J51m1j4j7O8
4769A14Jk76P8j33L93k91J40J18l19K66j2J84l97K31j63K71j26k28O0K46j68p0
4791h1j21M21l53J41J88j88K34l52N6K28R6r8J37j24j99J55j85l43K99O1m3J2
4813e9J36R8l39K7%M7L26o3l35R8K13l14J36Q1p7k25K32k3J36m56O2K98j18K69
$$ y = [419, 217, -56, -131, 7, 320, -49, 332, -45, -145, -23, -246, -84, -12, 194, -87, 15, 198, 221, -264, 89, -98, -100, 19, -180, -164, -89, -34, -154, -156, 31, -294, 111, 64, -332, 23, 13, 59, -80, 227, -58, 67, 91, 127, -54, 112, 323, 15, -51, -67, -27, 197, -174, -26, -30, -235, -306, -79, 101, -210, 87, -58, -127, -168, 109, -91, 9, 397, -32, 3, -13, 114, 2, -72, -2, 170, -115, 168, -95, -225, -142, 92, -191, 174, 53, -26, 113, 108, -158, 126, 112, -225, -176, -73, -100, -186, 256, -260, -217, 94, 133, -270, -52, 75, 13, 114, -185, -57, -164, -33, 118, 77, 63, 46, 114, 115, -161, -83, -216, 177, -114, 26, 144, -175, 91, 79, 263, -134, 97, -66, 205, 79, -149, -89, 157, -11, -81, -202, 219, -134, 7, 195, 7, 241, -111, -55, 173, 269, 171, 308, 184, -15, 140, -45, -388, -89, -28, -71, -59, 77, 175, -164, -137, -137, -90, 236, 173, -162, -64, 149, -165, -29, 52, -25, -250, -18, -41, 95, -361, -299, -1, -119, 150]
4837A50j81J9P4R4l47J82J60n9J39l11J51j4k10J06N07l72q7R9M4j53j52K63K1
4860A23k18P5q3M43J04m62j52O3O4L01k33J28j62K6j64K44j57J39J6k4M3j84n6
4883a26N7m3L10n26M50P1k38J94q4K2q8k61M5J39J2J65k91J14J5OJ56M7l53L4
4907a73L0p5J07J04MJ78j05j80R7O3k3N7k13K86k01K29l65K28M1p5qLL6j12L3
4932c4K08m71L65k72R2J99n03M8L64K40o02M46N2l2O3J0k52J92j03K8o1Kl20L80
4956C9M9n1j29J01k29J35K35l93L36j57j97K96Kj19n9j08L76n3j18l0J11J36j07
4979F6k5J85m20J78j36J63M0M6L6J18k28l5k00J11J61n9K42l03n1J97M7k03K68
5002A98k01J29j19k37J31K8j56J41J31J9j17k12K91K00j04l03kMJ42L1L6pj61
$$ y = [150, -31, -12, 62, 156, -191, -9, 151, 92, 231, -80, 71, 57, -153, -47, 460, 88, 1, 100, 144, -9, -161, 102, 123, -95, -20, -103, 340, 444, -18, -170, -107, -43, 258, 25, 153, -9, 17, -147, 97, -60, 79, 95, 71, 114, -70, -126, -69, -112, 198, -328, 122, 193, -45, 149, 65, 87, -1, -262, -217, -78, -66, 99, -192, -78, -63, -57, 99, 146, -207, -173, -143, -218, -111, -7, -3, 175, 70, -110, -13, 50, 27, 84, -129, 157, -44, 185, -180, 48, 89, 14, 6, 9, 45, -67, -34, 174, -297, 68, -204, -112, 87, -416, -368, -4, 236, -366, 80, 132, 100, 163, 173, -79, 113, 10, 38, -23, -21, -341, 39, 88, 37, -92, 9, -220, -85, 150, -243, 93, -64, -261, 35, 37, -82, -141, -249, 127, 74, -44, -74, 37, 173, 66, 41, 226, -194, -16, -152, 11, 51, 97, 133, 251, 23, -12, -212, -101, 60, 1, 243, -60, -111, 86, 133, -70, 198, -3, 126, 7, -230, -99, -71, -227, -86, 45, 64, -53, -265, 26, 226, 122, -181, -183, -179, -37, -6, 30, 23, -138]
5025a38p9L37m3J81m73J01J54R6j07k30J90J52o3p8k29N8J04l7J87j95L4J02l71
5048c47L97J57Lj55j5j18j61J47N5k8j6L89k84K25l23k7L55k32J97k37J02j58
5070g4Kj07J74J04j10l6K74k00j22q7J38J18j30j35K93j27j3j94PL07k03j24K26
5093a9l7j34M02j60j95r0J42j25J19K19j14J8j49j14L18o2K1p1k19J46L49kl27
5116h4J37j53N71l33L1j7p5n6k04L30k30J91p2l16N15k28p4J22k43J07k4q7J22
5139g0ll5J20j19O3J20j90kL24j8l87J74o3j78K83j07k13n2K38M49l93J86j16
5162A1R9o7J66j49l95K55R9J11M9o4j75K06m1p9m6P4P3J28k67M6j64K65l0K9Q0
5187B14r1j46P0J52j66j29J36p9j45K52j30J65k51k5L23j24J5k23L48r1j20L11
$$ y = [-138, -217, 120, 77, 258, -215, -114, 40, 136, 29, -201, -11, 141, 78, 0, -229, -171, -67, -104, 83, -112, -78, 24, -347, 50, 207, 210, 55, 40, -78, -239, -92, -37, -65, -81, 308, 24, 249, -74, -101, 254, 22, 219, -18, 84, -74, -72, -179, -5, 99, -11, -47, 227, 27, -95, -182, -44, 74, -56, -191, 102, -25, -38, -232, -225, 82, -121, -245, -19, -56, -190, 212, 52, -143, -233, -91, -216, -97, 122, 8, 26, -123, -237, 81, 19, 40, -31, -250, -104, 245, 243, -84, 53, -100, 471, 138, 169, 152, 77, 21, -183, 147, -83, 108, 36, -280, 235, 7, -67, 55, -188, -81, -105, -192, -70, -73, -108, 12, -107, -44, 76, -114, -116, 208, 190, -197, -23, -86, -264, 19, -88, -301, -353, -115, 334, -59, 127, 11, 110, 43, 209, 60, -335, -80, 19, 130, 179, 115, -60, 146, 105, 26, -20, 54, 127, 255, -12, 34, -130, 135, 105, 134, 214, 123, -23, 47, 199, 33, -96, 40, -39, -184, 68, -62, 103, -148, -173, 150, 26, 41, -182, 166, 75, -45, 266]
5209B66l02nM3pj86J60K30k08L1p6j9K29l65mJ61L04j67j89j6J02k75K01J61M9
5233A18l8R8j63l0J79j12J55q1r2K9j38m2k3J86J99l47r9L4K21J63j83J45%k08
5257b9J11j16J53j09k05L2K28j11R7M9j53j66K34K9q8J19o5N4q5J34k11K04j93
5280h7p7K15p5O0J01L2r6J52j92q7J32n0J6r1r0q7K16N4P2p0k16K56j25j07M52
5305C08k55j8Nk91J65OJ61l0p7J69q0q6M3Q2k42J14L12m30J99j5j61K33j57M5
5329@r2k0L72k01j81K08k0j24L5J92j3m09K05Ok16K52j5n4R0J9M0j54L7N7J50
5354A64j75j78lJ66o0K60l47N8K58j64L8l9R0j64J60J61l06k8N0M13j92j74r6
5377a08O1j53Q8L21m87L21j27j99L39O1l4k87j54K21J40K9J16J33k23N1m9O2l21
$$ y = [266, -36, -41, 2, -5, -191, -31, 199, -9, 22, -54, -73, 156, -209, -213, -52, 252, 85, -104, -120, -18, -293, -92, 69, 118, 80, 178, 15, -15, 164, 52, 207, 126, 34, 63, -75, -117, -140, 46, 245, -102, -201, -167, 54, 217, 34, 179, 179, -29, 82, -34, 119, 10, -195, -163, 65, -46, 51, 100, -53, -219, 15, 44, -44, 75, 10, 64, -21, 113, -98, 106, -87, -164, 51, -24, 36, 137, 169, 73, 225, 33, -54, 78, 28, 44, -47, -137, -224, -8, 46, 118, 48, -168, 88, -37, -144, 308, 53, 35, 40, -251, -86, -80, 81, 51, -26, 143, 63, -23, 20, 102, -140, -26, 286, -144, 55, 40, -121, 112, -45, 0, -92, -112, 260, 59, -122, 86, 66, -58, -23, 169, 156, -253, -48, -42, -258, -6, -21, -75, 15, 34, 74, -80, -43, 14, 164, -11, -189, -192, -26, -86, 174, -173, -115, 143, -21, 17, -22, 68, -96, 64, 225, -81, -109, -59, 354, 162, -12, -108, -47, -200, -112, 209, -278, 43, -84, -283, 56, 117, 83, -204, -358, -137, 3, 32, 148, 281, 58, 109, 60, 122, -199]
5400a99J73k1J23p9j79J62K0M9j08L32k61m3m8j7N1M8q7j02O8k52K81n0j90N31
5424B02l08o5J59K01k30J70j41k13J55K1o5n6K39q0M3m17M24J02J52k26j48q9
5446a70K98k52lK56r0n9J4O7K3j49J15o4j12N1q5NN4K22j31m2R7j57q5J84Q6j38
5472f5J96P0k51J94K9j84j20J70nJ36m49L92k10L23J7m70L53k12J2J36j44jk3
5495a06%K01l3k68K71o5J03o7l7M3K3Mo6J18l1j90j17J81L5J09k81l6K29K1k44
5520b03J15O4L0k2J39o5J91j92M7j44K45n16N38l25L04pj69p3j7N3o0j74K76N3
5544H8j58M6p6J07J37m3k96J59k90N95n07L18N3k75j07L81k38J42m0K07k84J02
5566B1j59J50l8J19j43J90q7J6o4j02N1nK20j76o3K43m09q0J93J90j06L0L6j19
$$ y = [-199, -26, -47, 76, -3, -182, -20, 0, 49, -59, 273, 12, -31, -79, -96, -45, 3, -84, -186, -118, -370, -89, -139, -329, 202, -106, -171, -12, 189, -41, 129, -12, -225, -70, -49, -114, -170, 69, -11, 32, -385, 39, 141, 293, 67, -81, -170, 128, -124, -127, 129, 39, -20, -6, 61, 84, -65, 50, -14, -126, -75, -160, -155, -101, 121, -10, -52, 45, -112, -197, -13, 73, -65, 131, 201, -50, 144, 173, -11, -131, 39, 34, 170, -279, 113, -97, 226, 243, -227, 126, -86, -74, 62, -82, -83, -106, -106, 95, 62, -206, 65, 0, 103, 36, -1, 42, 65, 69, 3, 121, 90, -100, -217, -36, -1, 108, -173, -209, 20, 41, -203, -88, -24, 6, -16, 123, 58, 249, 57, 104, -40, 205, -311, 227, -98, 206, 199, 30, -43, -60, -7, -67, -241, 35, 88, -70, -24, -100, 7, 144, 101, -195, -36, -326, 269, -238, 80, 133, -142, -249, 132, -106, 36, -4, 203, -81, 21, -138, 12, -26, 93, -50, 140, 53, 69, 5, -97, -46, -51, 169, -7, -70, 173, -236, -316, -123, 67, -39, -9, 27, -92]
5590i2K86j84n7K76l67J82P3k18l5J17j98M58q1j36l6r3K71k71j1K39k58m7L41
5613A59j15O1k42K00m8N6Q2RJ93k55j36J02m17M96r9lK06l17k61L78j01J18k12
5636a46J26R1j28L24l28L14m38K26l2J45K24m77K57k58K31Pk24J84k4O7l03J88
5658B6J56k28l07M45l2n2J27j47j5J04j34j10K47r4J10n4q8j57J51J2q4J18J41
5681A35j3j05J1Q6q9l12K34J85j06k06P2J77o2J11j64J90j99k8K28J39k89j96
5703b01K21k15k8K23N2j99N4kJ69j6Oj33j6M56l31%q8JJ96l31J00J01n4j35K91
5728A21k10j05J28J98k0n4l9k24L09j09K9j28J67p7p2L56n52M74k79j20K78k19
5750a48J07J03j86J53o5o6K83k25M5k5J4r9J74j31j20P3K73J7l68Q9J73j17Q4
$$ y = [-92, 194, 10, -47, 229, -138, 44, 117, -101, -136, -19, -217, 241, 160, 24, -12, -105, 166, -105, -116, 123, -135, -182, 159, 44, 105, -137, 63, 15, 71, 153, 162, 355, 100, -36, 66, -351, 145, 46, 43, 249, -68, -329, 49, -52, 66, -146, -20, 71, -57, 267, -61, 253, -185, 41, 9, 154, 378, -99, 158, -100, 131, 138, -86, 98, 74, 141, -162, 26, 182, -46, -353, 92, 60, 8, 135, -12, -27, 77, -57, -167, 80, -14, 96, 42, -46, -203, -52, -40, -124, -6, 135, 122, 17, 28, 114, 25, -287, -53, 132, 26, -180, -108, 69, 7, 118, -46, 144, -55, -83, 145, 284, -5, -201, 20, -195, -223, 0, 52, -147, -93, -95, 74, 58, 64, -69, -85, 371, 40, 40, -48, -47, 149, -182, -82, 19, -35, -170, 121, -89, -194, -66, 132, 112, 58, 19, -205, 104, -5, 24, -104, 63, -14, -86, 270, -282, 192, -87, -207, 71, -148, -41, 62, -124, 29, -36, -102, 181, -44, 1, -24, -10, -109, 65, -66, -186, -113, 160, 177, -191, -102, 71, -46, 38]
5773C8K4k7j69N1J6J81o7J29P2j57lP6j94k8j86K84Q1l09L5J82L03l35J03k39
5797a39p1K77K08k48n1n1r3K04k27L26Q9m23L16J00j53k5k5K40k34m0O8k2jP9
5821A04j52j06J73J81j2j59l76K82p2l8Q2J22k6j42J25j73p9K70O7j7l03N34n
5844B80j12k43L91k04j19k2K84p5j91k9l8O7K4M7l07K39J10q9n3P5m6J09j80m
5868h6J38j1J83k31j7J4j36p6J93n0K59j99j0p7J74j13o1q8K66j33j49J62Q9p7
5892c6J47k10L2J98r3J9l4l6M4J1j97L35k69J30j53K31j49L2k0O9M06k87j49J97
5916B18j66J42l50J63j92J1Q9K2P3J11J35k56L7O0KJ33m38J34J40o9Q3N2j24r5
5940h5K03p7j26j21K83J97k03K3j1j62J2l6K31k0k17K3J05J16LR5l49J36K6O2
$$ y = [38, 62, 35, -134, -83, -67, 114, 47, 176, 248, 91, 88, 164, -30, -58, -244, 40, 121, -188, -153, 29, 332, -3, 100, -139, -210, 67, 275, 27, -24, -75, -168, 36, -191, 135, 224, -199, 117, 217, 64, 39, 14, 254, 20, -20, 48, 26, 25, 104, -48, -154, 19, 200, 188, 29, -347, -65, -137, -175, -93, 29, 3, -139, -14, -187, -266, 4, 71, 54, -249, 285, 280, 168, -75, 316, 112, -7, -29, 255, 180, -11, -40, -78, -11, 13, 60, -247, -8, 102, 13, -40, 35, -11, 98, -82, -86, 52, 41, 224, -7, -24, -10, -146, -222, -29, -79, 180, -19, -29, -106, 68, -45, -106, -194, 72, -61, -210, -48, 41, -36, 111, -99, -67, 131, 38, 57, 23, -13, 31, 42, -155, 180, -89, 41, -112, 119, -30, 2, -18, 51, 457, 170, 21, 218, 52, 194, -156, 7, -185, -174, -85, -63, 10, 121, 256, 0, 37, 97, 99, 232, -206, -72, 68, -1, 82, 134, 10, -85, 118, 41, -85, -206, 77, 274, 71, 94, 83, -79, -67, -103, 128, 108, -109, -86, 19, 135, 138, 233, -116, 20, 46, 108]
5964A08J91n10K79k91K23j5j47J77K9j22j6K48k12K69j71O9k9R8j33K1J17O7k62
5987a2j44J32j89Q1j84J49K1J87j99O6M6J70N3l38R5L25o21L21R2L00k59j7N7
6010A32o3Q9n3j51J56r1Q7q5j05n1Q6%j68n0K08P8Kj12J44k21q0M13j29J5k0m3
6036a2K88k90k92Q7K19R9j45j41J00J65L0k09J33k6J50J6k02K9J4r2J68k36J37
6059a0R4l09J02J64k0J19j97K67j72j31J37k01K57k23L22j18N6Lm6k7j91J16k77
6082b85J61J29j21J83k31M9P1lnQ7j78K26n7O2p2P5k44q2K92j85K72m31M25k90
6106a52K91r6p4J21j49j15K79l31J76J5q5q3K24Mj41n2L94m11r3M00P4j46l3o3
6130d6L3J12l48L17n6J76rm22J88r6K4J32J22p1j41J98L2k38j06L2P5J29j69K27
$$ y = [108, 299, -211, 68, -223, 0, -15, -162, 15, 44, -78, -94, 154, -58, 211, 40, 109, 80, 178, 45, 66, 183, 250, -12, -156, -24, -213, -132, -316, -167, -146, 41, -158, -92, -46, 124, 177, -161, -66, 259, -362, -41, 51, 351, 92, 75, 132, 69, 158, 105, -46, 110, 19, 106, 21, -84, -135, -49, -49, -217, -267, -59, 19, 21, -91, 53, -168, -248, 165, 36, 51, 31, -12, 276, -14, -306, -219, 0, 99, -46, -187, -87, 78, 108, -101, 32, 6, 156, 172, -30, -1, 13, -79, 89, -147, -10, 84, -225, -123, 41, 21, 140, -57, 210, 38, -93, 44, -157, 100, -123, 199, 81, 137, 140, 94, 67, -124, -8, -285, -124, 5, -116, 67, -164, -115, -44, -47, -52, 35, -143, 83, 26, 88, 16, 91, -153, -235, 57, -128, 144, -287, 138, -152, 139, 43, -31, 90, -59, -174, 105, -226, -50, -35, -120, -203, 21, 25, -116, -168, 226, -185, -278, 122, 196, 50, 17, -46, -13, 99, -249, 68, 12, 188, 179, -243, -55, -151, -127, 5, 127, 56, -85, 113, 145, -93, -199, -167, -92, 37, -132, 95]
6154I5k50J67N1Lo7oJ36r2Q0j97O7j34N90n99J49K71o6j63J12j09l12M75j71J88
6178B18l05J75k96K17Q4K1J09l59R1j40L65K1p3l18Q0R0k5l21L52j03J02q9n3
6201a57J2L66k14J59J65l46K9O8O9O3l81j1K03j23JJ08%j13j47J83J1k1j3J06
6225A7J05J03k29N4m9j50J41J98j48l8J51n3j27J5l6pk7J04K5j09M8J90p9j32
6249c3n7J59r1R2k69J22r9N5O2o0J52q5J94j80K7K13k25L78l89j46K50n9K35O
6273B52k25q4J72j13l69L63N4j81L74k80j57J56J78N6r9j15j0j2K16k58O5J37
6295A20j02j16Mj5N8j83J73j58M33j05j34j24J24rJ55k79K68j46m5J09n6n6J15
6318C1N5j66K59m13J77L0k06J67Jj25M10k77j98M53j84m5k64O2L31j60j2N5J56
$$ y = [95, -155, 12, 63, 66, -1, -7, 129, 37, 117, -80, -13, -147, 443, -156, -7, 264, 198, 35, 147, 38, -274, 201, 30, 218, -87, 88, -208, 9, 93, 114, 223, -136, -45, -185, 180, 201, 128, -190, -110, -20, -45, -366, -14, -117, -15, -104, -157, -145, 221, 7, 166, 331, -15, 14, 82, 151, 214, -167, -178, 25, -98, -97, 11, 11, -102, -249, -66, -55, -76, -89, 17, 122, 225, -4, 50, 1, -149, -8, 190, 42, 4, 155, 102, -25, -10, -46, -53, -80, 24, 49, -60, -12, 178, 99, -33, -90, 69, -22, 70, -199, -77, -176, -121, -59, -119, 33, -52, 142, -38, -11, 202, -23, 355, -34, -180, 70, 11, 246, 252, 27, -57, 115, 2, -367, -4, 50, -131, 243, -37, -194, -38, 140, 196, 97, -18, -28, -40, 176, -82, -17, 120, 18, -98, -94, -109, -51, -234, -61, -219, 214, 109, -25, -149, -25, -34, 121, -158, 110, -36, -81, 28, -28, -84, 31, 86, -80, 179, -234, -57, -27, -233, -66, -65, -190, 220, -57, -255, 198, 14, -31, -295, -233, 98, -62, -74, -19, 137]
6341A37n8o9j46j01L22k66L40j10q5J91r3J15j18o7j5m4L9M4N8O0%R7l07N8J82
6366A64j86P2j88Kj04L78k58L08P4k26J20k85J64m3j07J14J28m05K96j49J93R2
6388A54k52R4Q4n9k92J68J26k59M67j71P4l4j41J15q6P4m91M46J3J08k32O1r2
6411a25O4K6K8j7L5OL21m67K34j83K6J45j42o1J44j99J10k29K69J4j18K6K66j48
6435B5P4p9k71J79K0L43l81Jl7J16O8k44j19M15k60J41P9J15l09N3K6n1L39k04
6459C9J47m14N10k10n3M0p9P5L3j64J39Qk82q3K69n6M1j36J51j24K51mj46K90
6483B42l65K95k71L25m91L38N4J1j87R2K46l53j2J52n5J02J04k79l2L11k95N4
6505a4j12J2L78k60j2o2o1N02n24Q7K45j90J13j87L18j83k11J88N2k64K49p9K07
$$ y = [137, 79, 10, -136, -237, 85, -181, 159, 49, -36, 155, 62, 177, 59, -8, -23, -67, -28, 16, 74, 134, 134, 231, -76, -18, 164, -22, 50, -138, -136, -240, 138, -120, 188, 262, 36, 156, -129, 35, -8, -115, -1, 127, -278, 18, -131, 62, 154, -98, -4, 80, 21, -271, -103, 23, -236, 231, 60, 134, 100, -41, 74, -12, 62, -429, 17, 30, 138, -94, -33, -125, -61, -35, -7, -24, 11, 17, 338, -129, 105, -78, -52, 93, -49, -110, 34, -165, -55, -284, -15, -1, -119, -93, 173, 25, 99, 20, -251, -72, -52, 291, -90, -89, -126, -10, 58, -186, -305, 110, -150, -9, 70, 185, -124, -71, -45, -96, 243, 39, 186, -228, 282, 72, 19, 59, -20, 55, 88, -76, 63, 71, -211, -294, -25, -81, -40, -176, -25, -149, 102, 98, -48, 242, -123, 172, -99, 226, -265, 73, 127, 138, -49, 43, 289, -64, -76, 76, 21, 123, 227, -52, -84, 227, -68, -14, -126, -114, 264, 4, -8, -70, -131, 371, -153, -66, 179, -11, 102, -85, 233, 50, -161, 27, 79, -185, 64, -15, 192]
6528A92j33j41K37k44J43m2R4j12l5J93n1k04P7J05j8k60K72j26M4j01k19M21
6550I2o8j92L12po3o2K06j89k27J21M9J38j49l1r6o5L41j70R8j16o9K02r2J2p1
6575i6K62j08N8j64K61k95K61Nk35KP4K79k60J46k32RL1Nj12k3n9J77o4k12K41
6600d9K1j33J50p2Q4J29m4j88J27m3j08J11O3l74L57j23Q7j07Q8K54m30J72k02
6623b30K34j47J89k35J20O4o5k2J10p5k49L01k58L54j76O0Mp6L62j85L5l20J47
6646e8Mp1k2K62l0k59J90j27L46J45m98lK10J75l13J08L0j7j40J44j14k44M75
6669A93l82K08J00k15J2K13k24N8Pj55L41m1j31J43j41q5P1J85j54J0j20J03M6
6692D2j62O5Q1J19m60N20m8k77K08J18k49Q8r7m7j18K64m85L70K6O7nj10L15k54
$$ y = [192, 59, -82, 155, -89, 54, 12, 106, -6, -41, 152, 101, -103, -26, 79, 61, -199, 73, -53, -9, -110, -329, 92, 24, -168, 144, 137, 74, 12, 218, 29, -198, -77, -28, 110, -39, -70, -166, -231, 110, -60, 38, -78, -147, 55, -37, -25, -96, 166, 58, 116, -48, 213, -82, 179, 184, -51, -49, 25, 304, 44, 190, -42, -33, -2, 3, -109, -132, -191, -14, -78, -290, -49, -28, -161, -11, -83, 1, 130, 86, -102, 25, -18, -126, -15, 48, -326, 31, -92, -5, -112, -24, 230, -200, -28, -230, 4, -143, 46, -189, -69, -5, -70, -92, 18, -57, -306, -5, -263, 91, -85, -25, -21, -97, 265, 80, 115, -205, -58, -54, -125, -147, 115, 85, -174, 16, -111, 235, 380, -118, -121, 89, 264, -49, 59, 89, 72, -68, 76, -38, -282, 193, -189, 19, 119, -96, -84, 129, -95, -37, -30, -185, 156, 115, -16, 127, -14, -99, -28, 157, 3, 13, -107, -4, 42, -120, -55, 26, 145, -315, 205, 157, -120, 88, 206, -43, 45, -52, -99, -217, 47, -438, -68, -42, 25, 20, -90, 225, -29]
6716b9j72J07J48j44J41pN1k42J85K20j18k20Q2J8NP9k79M8J82L10l01J03k05
6739c8J5K38k43j64J01L6K01m18J66K1L9J4Pj56R6J08k65K35j30K15rr0K04j27
6763E6mk2K4j2oQ6k3j14Kj00Q5J21j19K5J86j05J44k7m14K06j73J52M3J35j00
6788D6J19k42N2J88R9j87j42J44p6j62j73L28J42k69K69l3j56K8j45R3p7l4K17
6811B9n5J80k07m7J01j4R9j70K15J02k39J49k0k1j04j64J26j85N11n4l26J12k46
6834b28K14r3J38j54J41r7J28j71M49k91K7j00R5K66l14J64k11Q3n2J9j98J57
6856b8M39m32qJ45l04k0K92L1o5rpJ06j75J44R6l78K51J78k57j7J34j76r0M89
6880C39m58L0kQ4j55L10k3k57J01j87J11J20l4Ol2J13j33Q6j48J49j74O0o5J47
$$ y = [-29, -201, -94, 54, -90, 51, 44, 95, -147, 38, 258, 140, -80, 2, 20, 25, 104, -175, -127, 55, 365, 64, 167, -38, -23, 215, -28, -192, -91, -55, 146, -272, -106, -85, -46, -32, -25, -181, -85, 23, -242, -7, -137, 78, 69, -21, 183, 56, 52, 30, 54, 42, 36, 122, 99, -15, -13, -113, -28, 93, -26, -1, 185, 80, 224, 197, -217, -11, -184, -32, 11, 146, 46, 165, -77, -25, 163, 262, 75, -67, 77, 1, -161, -334, -6, 136, -133, 136, 103, -53, -25, -170, -77, -154, -188, 29, -26, 154, -53, -100, 1, -13, 86, -84, 131, 233, -6, 143, 123, 102, -2, -166, -40, -225, 286, 232, -94, 18, -228, -14, -107, 31, -123, 18, -79, 49, -122, 327, 36, 63, -37, 58, 324, 10, 174, -37, 46, -6, 13, -185, -28, 411, -21, -29, 116, -188, -208, 84, 115, 50, 41, 34, 140, -35, 109, 205, -173, 78, 256, -1, -18, 116, -60, -150, 339, -119, -89, -91, -7, -162, 148, 125, -132, -31, -218, -107, 13, -21, -15, -47, 66, -67, 19, -129, 20, -154, -94, -159, -12]
6904a2J86n4o5L1j75O5K6R5R3P5k39k86J97M1K56j50j67K0K39k25J89k21R0o4
6928e5K82k45J32j05K7l2j7k42K92m7J58p4q5o4R4m2p4N6J13q9k35K93j37L95
6952B99m02o5N37m12j00K77m0k46P4J57p4r8K26q9l7Q9q7p2L5J80j83J57n3Q4
6976A57k24JJ43k11J56j50j07R0Q4J28l73J44J61J36J43m28K33j53K93j90K30
6997B63k26Km5j53L61j75K85k94r3Qj5J97n8m1K80k73j71J33K04j96Q4n1l8P1
7021E9m1j05K89k15p6L74m90K24N5k40K14M6K31k04o8l40J5K12J69k7j34J79P5
7044B02p4O8m48J13J09J23o9L0Q6q7K3R4k46j7j08K65l49J64J51kJ18k61L61k65
7068a9J54R8k95J25J4J06k13j79k7K07R3j8j52q9L79k96j40M88j94L19l64NQ9
$$ y = [-12, 174, 120, 55, 86, -89, -24, 2, 97, 190, 265, 26, -260, -63, -22, 234, 84, -83, -63, 176, -49, 140, -81, 9, -55, 227, -18, 114, 9, 36, 4, -13, -255, 37, -10, 148, 74, -11, -75, 19, -23, -97, -41, 72, -17, -252, 41, -96, 299, -103, -168, 369, -43, -143, 134, 94, -152, -78, 79, 5, -93, 133, 44, 7, 96, 9, -63, -28, 152, -31, 126, 73, 157, -67, -66, 77, -134, 22, -128, -235, -145, -61, 67, -306, -162, -1, 135, 278, -150, 83, -70, 223, 33, 263, 37, 39, -6, -159, 202, 27, 312, 18, -75, -67, -82, 115, 57, 16, 296, 23, -148, -15, 189, -7, 77, 26, -12, 59, 18, -87, 202, -13, -89, 285, -205, 19, 74, -166, 48, 94, 325, 121, 53, -287, -272, -60, 109, 82, -52, 127, 202, 128, 196, -252, -139, -30, 93, 24, 54, 140, 53, 76, 170, -76, -93, -201, 64, -285, -121, 30, 28, 146, -115, 246, -19, 135, 233, -62, 63, 77, 183, -30, -209, -236, -29, 64, 46, -106, -195, 184, -112, -252, 236, 42, 361, -3, 2, 91]
7091I1p5J43k74J32P4j36J08Rj52J95l00L94m5j80j05K66m55N17k61l9J29m3k2
7114b9K82n13K58Mp0K00m58J30L43j01m9K3j50J05%J44k59J3J77l45P7Q9L2J76
7138G9j69NJ24j91M00j65K77l12l5rJ17j74no6K48r3k8N5j54j1k8K99j40k02K42
7163F4k71K25p6J20l31K84K7J03j80m9K59l08L46k41j33N2J11P0J94l86L0K0J09
7186C9m9k02K40L6o4r8K1O9j49j01L12j95M41l15j4K21k1k24M9Pn2J24kk69J82
7211a4J9Q1N9j80K45l31K07J77n04J92J90j60mj52L79m41L07l6L1m5K53l97J62
7234C8O4j52J65M2k27k3K8J8q8Kk51L38J78k95j76M24r4k7K88m46K92m9l4l3j24
7259a42L76m65J90Q5Q0o7J61k74N3K4p3J60j87j3J22j43J97j24L13m62J00K09
$$ y = [91, 16, 159, -115, 17, 91, -45, 63, 72, -80, 115, -185, 209, 164, -16, -121, 145, -310, 207, -54, -93, 36, -7, -29, 253, -260, -2, 2, -68, 132, -326, -196, 147, 46, -3, 20, -130, -25, -25, 119, -140, -127, 50, -295, -218, -129, -97, 79, -90, -85, 39, -152, 248, 83, 360, 48, 13, 4, 121, -53, -58, -124, 124, 31, 3, 58, -96, -107, -135, 164, 24, -178, 64, -207, 18, -58, 62, -269, 15, 42, 145, -35, -84, 175, -133, 213, -28, -161, -109, 2, 72, 266, -120, -90, -70, 39, -10, -212, 28, 64, 0, -98, -77, -8, -157, -258, 54, -141, 300, -15, -29, 192, 171, -53, -4, 3, -49, 75, 73, -196, -14, 5, 86, 145, -35, 210, -121, 86, 263, -241, -49, 141, -19, -23, -175, 204, -237, 70, 34, 65, 20, 273, -124, 38, 102, -50, 115, 157, -70, -93, -65, -47, -135, -133, -384, -46, 132, -163, -339, 85, -9, -36, 252, -194, 98, 49, 15, -18, -142, 234, -231, -41, 44, 124, 57, 218, -56, -3, 21, -52, 108, -79, -92, 30, -113, 84, -40, 273, -189, -89, 120]
7281A20k82K56n53K28K17Q5k17L8K23k81K62k36J99n5q9J74l33L69j62j09J75
7302B9j4m0j14q9K94k17L7K20k11J45k25L53kK1l22J2J89j95KJ28j11MO8j22J98
7327C8J48j43p5Q3n3J6P6k10K60r4O9o8J33O6k19K81m96J20K66k99P6N3j52N7
7351f7Q6j11o2P5N7k76K49J11k22J51O6K38n19K48J48k54j7L5K51j21J68k03J87
7374B18j77pL7J62K19n90L26k39K09r6Q8p5r2l4l7J3J00j01R0l9Q2L3M3l02q1
7399b50J26J31j41kJ32j20j32J05L33j30j55j15L57k54K04j29R3J33l04J21m4
7420d1o3j22L43o4n4L3M9P2R1p4j62o4L3R9j26k32L00J54j58J2l8j01J91j15O2
7445B5J86m51L63k40M9j06L53k35l0k3l1J38R7j27K22l31J86Q5J14j42j10P6J06
$$ y = [120, -162, 94, -459, -231, -14, 71, -146, -108, 115, -166, 96, -140, 59, 4, -85, 89, -244, 125, -37, -146, 29, 15, -25, -139, -228, 66, -151, -114, 106, -105, 40, -185, 168, 166, 187, -135, -123, 66, -129, -127, 1, -110, -106, -38, -160, 38, 186, 43, -32, 51, -2, 14, 90, -120, 140, 46, 115, 47, 180, 246, 27, 308, -188, -68, 198, -101, -25, 28, -124, -67, 19, -92, -154, -79, -22, -298, -49, 62, -160, -9, 57, 295, -224, 24, 172, -82, -99, -64, 187, 66, 234, 31, 218, 41, 34, 71, 233, 452, -138, 188, -51, 158, 62, 150, 75, -17, -51, -88, -75, 25, -76, 14, -25, 57, 90, 133, -169, -250, -124, 7, -134, -136, -4, -124, -256, -151, 182, 52, -103, -218, 139, -115, 89, -40, 53, 186, -118, 3, -41, -104, -226, 117, 53, -1, 32, 81, 153, 244, 170, 8, -56, -23, 76, -50, -282, 18, 172, 14, 26, -12, -113, 78, -37, 25, 211, -240, 123, -117, -68, -174, 179, -56, -86, -109, -140, -2, 95, -32, 190, -141, 45, 130, 244, 102, -8, 68, 174]
7468A74k24L1M6O5K15m61J69%L2j47J94n6j51L19o9r8J50l74O9P9Q1J06k28l3
7492a11P6j78K36n7j63K98j90J36O4M9k34J0R7N1j67J37L1j28j6n2M12l06J71
7515A66k15j13J18k5o1j30M77k15K40k72l1K2J53j58J05m4K5j33O0Q8K4l2P7j08
7539A8j31j51L20j50m5J40p2N9J35R8n90M69j02K4q7M4K26k10q7NR0J03j20K52
7563B38k28J19m4k0q9k6J08K88r5j70oK1J02m62L36j20J54j12K68j66K0j20J80
7586A76l04L07j96J99j34q8L6j3J79j65p6R3J00q9j2L51k20Q6m17K6J31P6q1J68
7610A33n4j09k0Q5q7K02j81j85K44L00m82K05j87M3j29K21l7m9J96p2R7L4l82
7633b14q8M30Kol45J41m4N0K90L0j52j45l4J03k78L52j26J15J25k26J60p8j47
$$ y = [174, -50, -19, 27, 92, 307, -154, 15, 15, 47, -100, 94, 38, -113, 206, 137, 39, 189, -185, -116, -37, 44, 150, -78, -111, -35, -213, 23, -34, -197, 101, -89, 47, 111, 160, -74, -64, 33, 84, -83, 54, 85, -43, -59, -111, 301, -5, 166, -49, -162, -44, -69, -130, -260, 217, 2, 242, -30, -61, -39, 114, -44, 61, 17, 42, -91, -31, 57, 81, 49, 126, 18, -113, -264, 56, -94, -139, 1, -71, -12, 123, 221, -369, 100, -2, 22, -65, -21, 205, -5, -92, -87, 3, 106, -14, 238, 10, 129, 85, 65, -24, -50, 58, 346, 251, 81, 75, 96, 198, -264, 72, -48, 106, -6, 262, 96, 116, -4, 176, -128, 179, -17, 182, 48, -40, -4, -17, 162, -3, -79, 14, 114, 25, 13, 364, 144, 230, -187, -161, -30, 46, -35, 133, 79, -30, -50, 35, -52, 150, -31, -216, 28, 328, -154, 51, -136, -93, -222, -1, -38, -87, 109, 37, 134, 168, -214, -302, 128, 130, 124, -221, -80, -124, -74, 216, 246, 94, -51, -85, 18, -260, 92, -34, 81, 206, -20, 140, 62, -85]
7656h5J61oK3K40k35r3l4j41J34J10p8J6P9k2K33m98J66R3j82Q1J11p5K8j30K48
7681A44j13J43j74k4J2p9L9J07j86K57q5r5l2K9R9q4n5MJ31QMl8p7J00j35Q0Q2
7708F2j03K5n9J95J03l26K07j96M58q8k71M2j95J22l1n6M77l25K03j15j54K9J51
7731A55k84NK80p3qk39J51r5R7J03r1R3j14K04n02M23j14j31r2Q4L52j32o8l0
7755b6P5Rn0O0j89m4K8J94j57R5J71m06N18k31r6R6j6j58K43Q0q8k12QJ00ll8
7781c7J02j3JJ67l81K32n5j8m7K07k47N5k4J15J5j06L24m92K41k93L78k21Q4k86
7805b99L62j0k76L18l48J06J64M5j40K18j85k4P8L7J67j78o9q6M1M7j55QJ20K24
7829A65o7o6O3K5m37K05K71K72m99j96L12Kj43J55J88l94J12k32K55K3K21k92
$$ y = [-85, 76, 70, 93, 333, 98, 5, -29, -170, -36, 74, -4, 12, 91, 69, 302, -196, -30, 63, -119, -38, 73, -2, 26, -104, 144, 31, 174, 0, -24, -12, -91, -52, 55, -131, 126, 41, -54, -86, -57, 42, -42, -97, -93, 38, 46, 50, 12, -65, 35, -100, -20, 62, -41, -16, -75, 120, 223, -103, 104, -92, 366, 278, 7, 49, -146, -24, -55, -111, 366, 41, 244, 129, -25, 4, 155, -129, -124, 156, 83, 75, -164, -13, -108, -11, 92, 1, 94, -20, 184, -318, 105, -9, -140, -232, -148, 204, 72, 4, -26, 49, 58, 8, 68, -121, -165, -137, 57, -100, -5, 166, -240, 278, 47, -49, 47, 31, -127, 116, 196, 108, -104, -96, 4, 1, -37, 65, 52, 53, 220, -161, 71, 16, -2, -49, 158, -89, -34, -58, 57, 72, -34, 290, -202, 39, -254, 124, -97, -13, -299, 63, 53, -223, 95, -253, -147, 17, 62, -78, 140, -45, -69, 9, 46, 213, 35, -34, -120, -79, -32, -187, -179, -59, 165, 98, 32, 95, 120, -317, -112, 159, 431, -68, -264, 48, 50, -93, 62, 250, -144, -32, -264, -9, 14, 235, -57]
7851e7J35l67k0P6L34l05L08j67L3J8q2Q3l1o4J15J1%K13j86Oq3M8k09K96P4m05
7877b26L55J16k66p1O4J16j31k76J85J81j17L8J61r3k4k1M1rJ20j40m31N12k05
7900a21L33j03n4q3j22M92k76J3J37l51J13j45L6K74l30J82k7k31j8K96k8P9j57
7923i1J82N7l41Q0p2J59k91K90r5j9K10P2k99L81l97J20M26o47k2R8K20J60J9
7946B00j99j20Q2j42J78l06L66J3q2J10j29P4k05K84o8j49J23j72M19k22l42L32
7968D5j52k3K30r0k03j06K41M16l28k58K91n0K1j43J51J79m29O14n21K48l5j83
7990h5J00j14K7M0J78k42P1L8L6J48k18RJ45j71L4j52J20K69p4k35p6R8j6K0K55
8015B05j39J06k62M6J32k48j38J89r1M13j62K5k37j92K47P8O8L4k2J66m58M46
$$ y = [-57, 78, -289, -309, -233, 101, -204, 104, -63, -30, -12, -94, -11, -42, -106, 9, 20, 20, 233, 47, 53, -30, 18, -191, 105, 179, -226, 129, 245, -21, -92, -28, 88, -43, -319, -134, 47, -70, -32, 129, 36, 12, -9, 32, 23, 143, 3, -428, 84, -121, 212, 109, 55, -28, -150, 342, 66, 79, 216, -135, -22, -167, -131, 143, -187, -5, -32, -263, -281, 15, -13, 66, -91, 91, 148, -193, -113, -185, -26, -317, -27, -122, -141, 69, 141, -158, 223, -174, -54, 372, -275, -297, -199, 21, 181, 200, 1, -119, -37, -179, -1, -307, 59, 72, -10, 100, -29, 45, -160, 124, 56, -93, 30, -142, 277, 55, -287, 45, -107, -130, 100, 10, -193, -299, -58, 358, 30, -228, 63, 13, 34, -109, 42, 221, -208, 406, -115, 133, 98, -85, 15, -99, -72, -32, 146, -96, -25, 13, 49, 197, -21, -12, 133, -38, -4, -156, -36, 233, 159, -76, -152, -54, -70, -50, 205, 66, 172, -90, -44, 88, -160, -298, -109, -200, 213, 51, 76, -161, -353, -106, -28, 40, 74, 52, 218, -240, 206]
8037B06k67O1o6J14N9j35j02M4J34k14M7n8M35l46J02k53J84K11k05J12j61K29
8059A31L3j21Q4p9K24n04M46J08l73J76k03J2N7J46q4j35L39l11j02J99K58k94
8081GK15j33m5M4j00M3N1j30J80m30J99J93OJk97LM3K47k21j0J83j6j44J73n4
8106Hj51m6L24K4n3j67j95L06p6k92L86J32k69K2J38k5j78J15K77j37j60O9l19
8129b67J55J20J08j63N3N3j14P7L6l13L64M1l49J57k04K24j2j21L44k69J11j85
8151a54K51o5K16k30n6L52j97R0m9k93K50q3q7Q4k4N0k34L06j59L19o16M11l08
8174b26K49l7J05k16R4K39l41J2J87P4k22L07k71j48K03J60k05
$$ y = [206, -61, 0, -66, 48, 107, -28, -130, -86, 48, -166, -119, -177, 258, -88, 14, -239, -55, 156, -49, 63, -98, 131, 164, 43, 127, 48, 272, -232, 214, 322, -51, 125, -78, -66, -9, 137, 53, -82, 257, -54, -156, 43, 301, 7, 222, 89, 44, 88, -12, 31, 82, -48, 132, -298, -99, 94, 100, 101, -196, -193, -150, 97, -124, -134, 49, 33, -111, 62, 8, -143, -189, 135, 159, 106, -61, -256, 50, -26, -318, 68, 200, -69, -47, 91, 66, -112, 3, 280, 143, -17, 52, -267, -112, 8, 116, -47, 6, 59, -55, 22, 58, -255, 109, 150, -199, -42, -246, -22, -34, -155, 189, -80, 31, -154, 97, 32, 248, 18, -38, 314, 117, 207, 158, -135, 115, 32, -55, 29, 5, 55, -179, 127, -32, 287, -329, 82, -226, 23, -14, 91, -125, -31, 208, -133, -121, 66, 140, -82, 225, -46, -194, 9, 169, -36]
8191c6
$$ Imaginary data points
##PAGE= N=2
##DATA TABLE= (X++(I..I)), XYDATA
0@%%%%%%%%%%%qJ6j6J6k4L2l2M0n2O0p2Q8j04J20j44J68j92K24k56K94l35L79
33B02m33M90n50O20o98P80q69R69j078J195j326J470j624J792j977K179k400K643
51A385k911L210l540L907m322M790n325N945o669P529q574R871j1530J3743j6856
66i347K1589k9717M7365j52546J25679J95528l29269Q0275J90586j79799p4225
77a13881K24944o2156j33932P5027M1386m3636L3635k5153k2070L4277j0117K2620
89B0944O9548j08449p6617J32499J4902j18038O4357M7155j05560K5279R9974
100F5994n6711m5776L5982k134J4261K1830n9165k1847L9835j30K1990L0758n7097
113a2210j7379N5743j4025j2657L4467m6940k9997P2084p562n0561L6897j6111
$$ y = [0, 0, 0, 0, 0, 0, 0, 0, 0, 0, 0, 0, -8, 8, -8, 8, -16, 16, -16, 24, -28, 32, -40, 48, -56, 64, -80, 88, -104, 120, -136, 158, -177, 202, -231, 259, -291, 329, -369, 411, -458, 511, -567, 628, -698, 772, -852, 940, -1037, 1142, -1258, 1385, -1526, 1684, -1856, 2051, -2271, 2519, -2806, 3139, -3530, 3999, -4575, 5296, -6234, 7509, -9347, 12242, -17475, 29890, -122656, 3023, 198551, -130718, -50443, 140143, -39656, -113881, 111063, 48907, -85025, -9998, 31388, -12248, 21387, -3766, -25836, 8441, -1676, 20944, 90492, -17957, -94574, 37925, 52827, -65211, -854, 46301, -59259, -33980, 65994, 9283, -36493, -511, -2645, 11616, 33446, -25719, -47566, -7731, -7861, 14129, 44887, -12210, -29589, 26154, 12129, -528, 33939, -13001, -42998, 29086, 21524, -29037, 7860, -8251]
125h251l2980R7571J0234j21382K9382O4882q2176J3295R4297p9004o2004J00648
137B4512J2629o4508L5378R184m9170M0166L9999n7323k6959K5353N128J4148
149H537J8083j7819j6174J082R861K2503p845l8143K682K2114o597L322J117l0187
163b7464J0997M9028q238l2173M155q024j4247K9636K2202l1679k5766K2770K7138
176A8335q161j2836J0242l265j4534K8150J5940n7227j9630N4887M138k6415L3068
189B2692j463n8009K4182N8740l6647m1240L0380O178k4966J9751J6224l5437
201a9615j1239M5478K0820l3808j5168J5163j1699p056L9180L84n4796Q974N0774
214B7392j4852j9712K5483j1390k5866L2652J6426m2231j6266K0673R598O362
$$ y = [-8251, -41231, 56340, 66574, -54808, -25426, 39456, -42720, -29425, 64872, -14132, -76136, 24512, 37141, -27367, 8011, 17195, -31975, 8191, 48190, -9133, -36092, -10739, -5611, 8537, 26620, 8801, -7373, -6291, 3570, 26073, 18228, -19915, -17233, 4881, -1716, 1606, 2723, -27464, -16467, 32561, 24323, -7850, -3695, -11719, -25966, 3670, 25872, -5807, -31573, -8803, 18335, 10174, -2662, 7580, 4315, -10219, 17931, 33871, -23356, -42986, 11901, 16039, -10376, 22692, 21229, -36780, -12598, 46142, 9495, -31745, -1365, 4813, -20153, -402, 15822, -19615, -30854, 14624, 35444, 1636, -13532, 1631, -10068, -17124, 22056, 22440, -32356, -23382, 27392, 12540, -7172, 18311, 6921, -18945, 13707, 30133, -12098, -28364, -7691, 1907, 8269]
226H269L329j2025j1238j031J7373J9863k3937k9382K3887J3334k3905J5835J2508
239A2880l9575J2254N7221k2143l8837K3087m518k0662L6415R901m6229J877K9443
252A1114o676K439Q337k2669m402K3514j440j3091q044j0887J0126K2986k735
265H572r660m957q113J6616K0785k0675j5798J2609q156N92K9617j6601l2750
278b7919L2160K3622k5315M426Q346l5535J752M2507j0551l1572Q552Q191m441
291e777J1925P610j5150j2094P963J9310m295k7701o99J9590n327M069K3004k1007
305A421k8293L4097K1939l0681l823J3090k0352N65L1974r136k9364J1287K0435
318A3159l300l592j007j1952r587J3959J7697j3793k3994J1617J7056p992O233
$$ y = [8269, 11598, -427, -11665, -12696, 4677, 24540, 603, -28779, -4892, 8442, -15463, 372, 12880, -26695, -14441, 42780, 20637, -18200, 4887, 369, -20293, 16122, 26023, -20206, -18329, 11114, 4438, 6877, 15214, -7455, -11857, 11657, 10217, -2874, -10918, -21805, -11679, 11307, 8572, -1088, -6045, -14158, 2458, 23243, 2568, -13230, -621, -8777, -8185, 21432, 4831, -27919, 4241, 27863, 2548, 6974, 15320, -20215, -18463, 24044, 13493, -18079, -9527, -1336, -5777, 6148, 13758, -1392, -13486, -5523, 13787, 9492, -18209, -18908, 682, -4645, -576, 22428, 1421, -26872, 7225, 29164, -1517, -5340, 7750, -12602, -12037, 19937, 10801, -18563, -7276, 13159, 9859, 6267, 5260, -6692, -16279, -2320, 15377, 1584, -22410, -10793, 6263, -1729, 4504]
331D504J2005k6223j0485L5712K128l3553N541J3668j5052J1837K5677k1952k3575
344a9768K2021J6544j2576n644J193j0444m088J7618J0249k0650j3674K1555J3382
357A5718j4674M48M431k2184k23L2113o340k9122R033J4700o255R533Q722k0392
371d492q518J8277P474r050q077m900L470J0037N712j881j0748o354J4946R489
385A5385j3185o931n67q859J0428J8336j6800j4897J7280M058n921J4637p284
398E680k6710J3780K1664j6239n806J0497j1088J194K5809l371k1932J909Q612
411C999R84K068m869r735j175M055J2012O350j9274p964K1686O46j5020J0753
425D516m314k5997J9106K8722k5268j4922K4191m076j0571K5058K54l2352M566
$$ y = [4504, 16509, -9714, -20199, 15513, 17641, -15912, -10371, 3297, -11755, 82, 25759, 3807, -19768, 2253, 18797, 6221, 577, 1770, -8674, -12762, 4856, 15105, -5545, -19219, 2336, 15718, 1044, 1492, 5923, -16261, -16484, 15629, 9289, -19833, -10800, 3900, -2355, 7178, 15900, -4492, -13010, 5267, 12741, 3691, -4386, -9286, -5816, 4221, 9933, 8052, -2696, -9050, 5896, 15385, 2200, -4731, -5298, -14157, -3729, 14607, -2193, -17090, 190, 4248, -1673, 12964, 5680, -21030, -7250, 14414, -1825, -7631, 2866, -8222, -7028, 18781, 15410, -6522, -4613, 3999, 4983, 7051, 2182, -7553, -8728, -4673, 7339, 13689, -5585, -13549, 8137, 8783, -6237, 4516, 202, -25795, -6689, 22033, -3235, -18157, 6034, 1958, -8613, 16445, 16699, -15653, -11087]
438a1087K3257p388r646N414k540k554J0559R283p534j7302K45J9084j358j5945
452g512N281M46j7379J6725K3739k4678j5238K6941l94j7140J6406n60k9504J3352
466i515K8663j5863j2643J2394m057l025J8539N22j8637l803O191M558J367q033
480c342l823O253Q27N379P578j7380j3538K1743P366j8381N294L787k1839J1135
494h941K9328j6744j6632J9549o08j2347J6644j307k6516R027K1882q700n792
507a157M278q644P61J5955N76r741o716m663P388Q419r487m960O274k708O311
522A886J3138j7030j4943J8917N122j2452J1484k079k6139J3882K6900j5045q691
535e050J3930r244n710K0739o786k2904R273J1970n383L093l55j2049K109J1229
$$ y = [-11087, 12170, 4782, -4864, 550, -1990, -4544, 6015, 15298, 7764, -9538, -9293, 9791, 8433, -7512, -2231, -1785, -19164, -2439, 21300, -3378, -18616, 8325, 7931, -9209, 7197, 6637, -22867, -9515, 19148, 3285, -9358, 3036, -1021, -4046, 14493, 15015, -3622, -7425, -1234, 3324, 4691, -3342, -7165, -912, -85, 5294, 12872, -4508, -18046, 3697, 11063, -7318, -2024, 1763, -20076, -8941, 20387, 3643, -12989, 6560, 5952, -6395, 10249, 8942, -17574, -8547, 13335, 4635, -1157, 3121, -5523, -4762, 11193, 11769, 2028, -4688, -9351, -1963, 6456, -3031, -7991, -1717, -4425, 1886, 15024, -2006, -16949, 1968, 7090, -5362, 6122, 4043, -22096, -8214, 18686, 3641, -5050, 8880, -364, -6074, 14665, 7879, -15025, -5752, 6218, 835, 3928, 3573, -8476, -6367, 4862]
549D862M552q08j2887j0529J3424O095j1641N456M209j5261J2049K0737k1938
562a680j3719K2405l416j2043K2459l740l3624J2762K7797j2954o479J2182j0064
575a14o766J5451l4j5129j504N035N303L140o646m146P64k013J2209J2077k1353
590c726j4661K0224J597j4352J4708M662k2645J0534K3888j6834j2551J3981l873
603I52n193J7546m307k3489L930J5475q1O3R6p235j224L670K179L22r511n547
619a2354J3395O385j0377o91J268p258J2881J6734j8774j4079J4169r93q654J6349
633H001J743k1145P140J9673r492r648O004m625k225J3761m63j8107l440R808
647c015N483J495M5l461o203q7R515L146j3265n310J2819L546n744L894l327r596
$$ y = [4862, 9414, 8606, -4281, -14810, -1386, 4709, -6932, -1476, 2733, -12528, -479, 20258, -1680, -15399, 7006, 3590, -8453, 14006, 10266, -23358, -10596, 17201, 4247, -2232, 9950, -114, -6880, 8571, 8537, -6592, -8096, -3061, 2242, 5382, -1264, -5410, -4646, -6659, 5550, 17627, -3726, -18387, 1837, 3434, -10918, 3790, 8452, -14193, -3659, 20229, 3395, -9156, 4825, 952, -4241, 13305, 8998, -14491, -10561, 4914, 4833, 4896, 4992, -2243, -3467, 203, 2382, 2704, -6807, -12354, 1041, 7426, -2951, -3642, -2374, -9632, 3249, 19983, 1209, -12870, 1299, 306, -8348, 8001, 9744, -11401, -4261, 15412, 5920, -3728, 2276, -2349, -4574, 9187, 8724, -9383, -12823, -3015, 2468, 3963, 4008, 547, -5656, -5743, 3772, 6918, -6347, -11657, 1162, 4708, -1036, 2858, -469, -10065]
663a0065J2773J5846j3112j1438O738m631l884J6864J090k0042L172J6567n273
676D605p036M310n085m644J2292N100j4993p863P034N930L621L372k369r248k465
691g439J1307O025j3192o222J1531J522n463Q073j486j6308Q616K1084r418j5232
705f602P091l483q974J6086Q749k0091m508J6940j46p337L665j764p415O897R632
720H740o419j3029j80J0941N856j243J246l560j1151O896J5360j0530j3606J1639
734I60L948r533Q899M568j9427J032K3145l092j4058K696l174p941J1936R657
748I616j2089o069O818M417J31j022k751k838J126P308L009j1565p823R622P852
763E742j494M019l391j4050O000J4308p633r007N915l180k991J2759j120j6075
$$ y = [-10065, 2708, 18554, 5442, -5996, 742, -3889, -7773, 9091, 10181, -9861, -6689, 9878, 4605, -2431, 1879, -3206, -7850, 4442, 9542, -5451, -13314, -6280, -350, 3271, 6643, 4274, -4974, -7439, 3868, 9893, -3299, -9521, 2010, 3532, -1931, 6142, 4656, -11652, -3036, 18048, 8630, -6602, 489, -2994, -11968, 4118, 12867, -7224, -11732, 5208, 5062, -2275, 1390, -374, -7789, -892, 8740, 2321, -10708, -10888, 53, 5909, 4666, 5912, 2352, -8799, -1903, 13457, 2927, -10679, 960, 4908, -4625, 4274, 8842, -10585, -9553, 13592, 10500, -3558, -862, -4036, -11977, -41, 9616, -2473, -8542, -1724, 2693, 2824, 1802, -949, -3787, -2661, 4647, 7656, -3909, -11732, -2110, 5742, 4248, 8267, 4876, -9174, -3174, 11134, 3501, -5506, 409, -2771, -5762, 6997, 5877, -10198]
777a0198L797J3206j795l315J68r777m949J2041Q769o089p959K269O579k45N9
792B561K785p050o437J3595Q046j7569o752J2116n43k095J4198m382k0585N646
806f466J6521p196q245N186l157n357J0252O867j2349p349J2077Q562o634l699
820i87J009q049q42J7364K530j7547K4J1927l250n62P715q222j1155J2167Q659
835A0781j2065o295M291j56L824Q713l122j2414k596J0092M912p002l312K736
849a613l823J232J3057l992j6632Q752J5093q356l975O527j2248o597J9893N225
863A2543j7364l81Q463l890K389P111p590j0168N812Q514j930r074k330N538K264
878i3J916O578p670j3246R793J3309r746n301O597p677j631J6725k193j5333N478
$$ y = [-10198, -6401, 6805, 5010, 1695, 1863, -7914, -12863, -822, 7947, 1858, -6101, -3832, 2747, 2502, 2561, 5346, -1704, -8141, 5454, 13500, -4069, -10821, 1295, 752, -1343, 12855, 8473, -12112, -6466, 10055, 2859, -5386, -200, -3357, -8714, 1538, 8405, -3944, -11293, 784, 9346, 2712, -987, 22, -8027, -8869, 8495, 11025, -6522, -6498, 5429, 2179, 1617, 9332, 1110, -10045, 2122, 10781, -1284, -7579, -3288, -3444, 380, 9093, 5971, -6443, -9039, 1053, 5965, -1037, -4349, -1613, -5436, -4204, 8853, 4861, -11771, -3019, 12074, 3718, -257, 6270, -5978, -12575, 7318, 12543, -4821, -5202, 3261, -629, 1760, 8871, 1281, -8887, -3075, 5439, 3509, -5565, -7895, -2357, -93, 1823, 8401, 731, -12515, -2722, 10587, 841, -4460, 2137, -5540, -7171, 9554, 7361, -7972, -2494]
893b494R514m232K516K04j3260p31J1941J625m211j847m157K111Q267j64m684
908C98l907k850O314O352q675n495N547j104L411J2048q939j4613J1637Q140j0287
923b023M053L753j6160K602K0047n599j3827P418L397n222P107J989j3146m392
937a0003Q923N826k070o188j801L891J035K739N680r762j0711J3591Q208j3891
951d533l61P830r230K247J8965p856j7524R601Q212q457L471M068j3800j692J4957
966E898J188q925j119J111J881L873P0m757n844j768R786N629j0281l852P745
981F35j380Q28J0136p250j4931J0530J0849j0047j611N282q294P48J5776l130
995H141j3418K653M791k064L646p79r728j205P469M157j007m647l644M446M842
$$ y = [-2494, 7020, 2788, 5304, 5508, -7752, -8483, 3458, 5083, 872, -975, -5132, -3021, 5246, 5082, 398, -3509, -6359, -45, 6307, -2368, -7863, -2316, -3420, -9, 12039, 3100, -11513, 124, 8264, -2023, 2030, 5783, -10377, -7775, 12272, 6673, -7154, 264, 3661, -1561, 5546, 7535, -5611, -10003, -1080, 4746, 2676, -3512, -5313, -1422, -387, 2352, 8032, -1730, -12441, 1150, 9358, -4533, -4894, 2936, -6294, -4047, 14918, 7062, -10462, -861, 7351, -1106, 2365, 6433, -7367, -9059, 5898, 7086, -1839, -2958, -1847, 34, 3907, 3977, -780, -6624, -8392, 1394, 7023, -3258, -7110, 635, -745, 83, 10219, 2969, -11962, -1432, 9417, -630, -2241, 3041, -5253, -4505, 11271, 8141, -5277, -2624, 2167, 103, 3749, 2970, -6758, -7963, -494, 3663, 2656, -1991, -5635, -1189, 3653]
1010C653q58j310m982n456Q148Q250p627l790N053k728K133J1221p063j3914P781
1025a489P589o696J738K343j1345J222J4874j710r955J851Q43j553N432N15r175
1040e516k978N314O043J880n245m026L525K882J053L018o537q398P990P963p112
1055a44j426L876n994K308J2738o073j3232N468N044n063M427K235j1854q68J2972
1070D414R24o317J88p49j113L945K665m593o283J438Q946L216o995j916L220k888
1086a898L134R468q032j3036Q656Q023q521P59N591q684o11J4556j941j3424J343
1101d617N049k344K556K981p035m828O540O131m68m563k581L192K217j252J343
1116B321l683o430O683J0095o053o231M227j565j025R496j676j3197J667P798
$$ y = [3653, 2795, 1485, -3497, -8953, -805, 7445, -182, -3972, 1081, -1647, 486, 11707, 4644, -9270, -1489, 6100, -596, 1142, 3485, -7860, -6638, 8236, 6526, -3429, -1578, -735, -2288, 3144, 3659, -5516, -8494, -3180, 2863, 4743, -502, -4528, -1003, 1879, 2932, 5950, -587, -8985, -995, 6968, -144, -1570, 2306, -3688, -1380, 11358, 5285, -7947, -2479, 2565, -2498, 1929, 4164, -7690, -8558, 4414, 5338, -979, -791, -1540, -2653, 1292, 3957, -636, -6919, -5481, 3465, 6681, -314, -2230, 990, -1898, 1236, 10704, 2672, -10364, -1708, 6315, -2206, -1447, 4144, -4540, -5151, 9405, 7464, -5960, -4617, 432, -1912, 644, 3625, -3410, -8238, -1698, 4433, 3965, -598, -3179, 13, 2230, 978, 2321, -1362, -7792, -1109, 8986, 2933, -3298, 929, -636, -1661, 7835, 6159, -7038, -5371, 2427]
1130B427k706o32L589o531j415J0153J211q725q67R33n21N559K220p461l720M222
1146b264M240K460j317l730n40K334J582J009m744n271M759P127k885k607L30
1161D83m875J390J0579k774j0610K352K843l539M517L260q367j015R669J215n421
1176b93p10j532n12N388K727m475m398j03N103M641k226l198R15k629N02O507
1192E707m725r806O614P168n590N93L142r254n38J3733j197j0305J899J322l899
1207e136N189N012o822l026O381L349k020k887j924P77J729K377J760o388o126
1222g755O906O732m794m13K303o630j100J0149l585j0452N600N898m088J645L144
1237C560p951j699R622K782n239k945p83L19K279K807l66l684j073N885K168n645
$$ y = [2427, -279, -911, 2678, -3853, -5268, 4885, 6096, -2629, -3496, -2563, -3084, 2475, 4695, -2766, -6486, -2264, 1976, 4436, 3119, -611, -1151, 1183, 2765, 3774, -970, -6241, -1482, 5645, 2760, 153, 483, -4392, -3002, 7577, 4803, -5807, -3455, -612, -4151, 366, 3626, -4741, -5756, 3913, 5128, -293, -1003, -2535, -3047, 2341, 5068, 593, -3805, -3908, 1195, 5836, 3610, 412, 1327, -1302, -800, 5707, 982, -8824, -2210, 4958, -632, -39, 3103, -6151, -6689, 7044, 5847, -4458, -2559, -1237, -5136, 53, 5065, -1757, -4783, 1598, 4947, 2927, 40, -1884, -1107, 622, 2999, 4759, -1629, -7755, -849, 5883, 1089, 676, 2979, -3651, -4751, 5398, 1813, -8639, -3039, 2859, -1229, 416, 3560, -4391, -6090, 3532, 6314, 1075, -1870, -2653, -2334, -55, 2752, 2386, -1298, -2371, 3514, 5682, 37]
1253C7k514K335j023J409N136n363q206M905N987j476J037J91o408J51O695j300
1269A593m894N95J374J605K725p18m473j361M182M392j06n005k528L60J089L759
1285B589J099n183j710N588J144l703M44j552l255N387M684o183n476K890K420
1300h17J118L729j055o145l68N298J105m122j416K272N86L70L719k615p136M226
1316a251Q183l371m216J622l720l081P940L476q140j251N996j328j676K472k793
1331a138m027M216N264k815n621l93L564K038J169K083k926o424L877O985n151
1346G01m077M663k52l283O421L53r828J607Q874j910l799J761l939l713N668M857
1362D104m386k648J545J868J016j036p14j127j340M003L634n577m857N090K389
$$ y = [37, -2477, -142, -1165, 244, 5380, 17, -8189, -3284, 2703, 1227, 2264, 2455, -3953, -3802, 2893, 1593, -3301, -2706, -1332, 273, 2998, 2280, -2193, -3554, 628, 5020, 4914, -91, -2619, -2259, -1170, 2589, 3688, -1495, -3205, 2383, 3527, -176, 268, -1284, -4539, 848, 5532, -651, -6127, -3237, -817, 301, 4030, 2975, -3170, -3538, 1760, 2865, -1257, -2673, -401, 185, 555, 4274, 1659, -5477, -1251, 6932, 3561, -655, 967, -2753, -5834, 2106, 5582, -2558, -3809, 2187, 859, -817, 1655, -1138, -5165, -949, 4315, 1500, -4121, -4514, -950, 1088, 2257, 4340, 1414, -5010, -1133, 5852, 701, -3376, 1287, 1035, -2248, 4173, 4526, -5302, -3695, 5179, 3269, -530, 1231, -2708, -6421, -753, 4104, -282, -2930, -1385, 483, 1499, 463, -251, -1378, -2718, 1285, 4919, -658, -5515, -425, 1964]
1377A964o71L989j115q563J892P146l085l422K930k044k100O084K56p006K21M514
1393I90O74L41r86m775j222L358L234N56k635k181K629J938p84O96j433l968M030
1410D62N579n528m550L773m69J87O342j722q778J880N537l311j92K600m614k274
1426e078P316J002n892l80L067L74J933L39m316k831J868M468J596k788k340J844
1442A82L24M30K967k323o257L836O398n125m004L448j457j351P550O39r232m73
1458d448N823j707n16L113l990l635N854L921m218k593J394K156J079k89q94k965
1474a915k477M356N183l396m512L078L07j734M803j68q412J913P370l653l911
1489c168L316j836k950P248K814p014k272L212k10J616J497l498k367K736K859
$$ y = [1964, 1293, 5282, 4167, -4396, -2504, 4642, 1557, -1865, 1065, -979, -3079, 3005, 3261, -3745, -3524, 990, 1664, 2005, 1019, -3756, -4978, -1620, 1614, 2170, -465, -2646, -17, 1921, 1137, 1833, 400, -3568, 462, 6041, 513, -4037, -264, -733, -546, 5796, 4074, -4704, -2824, 2713, -598, -790, 1810, -2804, -5078, 2238, 3240, -2652, -3032, 35, 409, 2342, 2681, -1635, -4466, -2598, 1870, 3466, 678, -1662, 182, 506, 936, 3903, 1580, -4677, -841, 5557, 432, -3572, -124, -1581, -2932, 4618, 5257, -3975, -4448, 1375, -332, -848, 2265, -1725, -5360, 494, 4415, 197, -2396, -1002, 1154, 2233, 1944, 1050, -1915, -4392, -36, 5147, 1751, -2761, 317, 624, -1110, 3693, 3525, -4887, -2974, 4396, 743, -3168, 148, -1688, -4638, 2610, 5424, -1590, -3862, -650, -860, 756, 2253, -1245, -3612, -876, 1983]
1504A983O69k417k092J731L078j199M07j398n479K323P341k429n075K969q25k138
1520b551N818N84q496P20O152k487r96K856m158k635P378K577m746j681N42K86
1536h37K527J353k571k492K76K393L178k379l646K349J229j293L073j455p676
1551e971J925Q156k668l482K929k728k507P264J297p459J01M071j732R90K509
1566B695m222k527N511K747j651k188j986O68K180Q01m02k402l174K847N733l440
1582A190l996L152r43j613N704n56q850J505P439k829j596L687l570l401P181
1597B504L090o139k189K643J51P81J788k071l016J067L857K006l971l614K474
1612f39J522j211K489j014o161J729P205k309m167K691j031k199N659J779p340
$$ y = [1983, 2652, 235, -1857, -126, 2952, 1753, 2160, 762, -4717, -2394, 4947, 2518, -2557, 412, -413, -2551, 3267, 3851, -4645, -3925, 2227, -260, -1256, 1600, -2558, -5193, 2185, 4762, 16, -1665, -1123, -837, 1690, 3043, 472, -2020, -1744, 649, 3827, 1448, -2198, 151, 1380, 87, 3160, 1705, -5971, -4046, 4110, 1442, -2040, 889, -1839, -4346, 2918, 4215, -3244, -3143, 928, -804, 186, 2695, -1527, -4054, 1457, 4204, 2553, 365, -1621, -953, 1227, 2028, 1626, -776, -3950, -1103, 4630, 1190, -2806, 346, -597, -2210, 3494, 2938, -5912, -4407, 3032, 203, -1393, 2294, -1276, -4677, 2504, 5594, -545, -2734, -91, 60, 841, 2629, 558, -2458, -1391, 2466, 4472, 501, -3113, -639, 883, -328, 2161, 1147, -5014, -3285, 3920, 1611, -2556, 135, -896, -3095, 2564, 4343, -2997]
1627b997j380N152K37o99J731k852k227M129L024k325k622o73M51K204J108j297
1643I64k256j796L133M007k482m152J334P54m43L204p03o433J152O263r98j968
1659d20J425k231k026N533K456o032j452K566N05R72J381k037l408K356L556l24
1675B820l145j890J093J421N64J218k526l819K519N184j949l208J362j026j114
1690b496M842N73p082J38N798m4j035J531k901l071M975L413l429l449J201Q04
1706b32R78J474p08l448n77M158J972l566l099J101P19N24K925r95n871J373N936
1723B664q63k656J574j735j703M448K239n624j896M175J173k28P50j993l203K071
1739h07M447r27l788j223J421N79J015R62k516k857L385L718k630l255M57L70
$$ y = [-2997, -4377, 775, 1012, 313, 2044, -808, -3035, 1094, 4118, 1793, -829, -1502, -1051, 1153, 2261, 964, -1292, -3088, 45, 4052, 1570, -2582, -1248, -494, -937, 2267, 1564, -4869, -3717, 2546, 1548, -420, 1005, -1226, -3252, 2281, 4737, -1295, -2747, -181, 324, 1296, 2677, 640, -2768, -412, 3144, 2820, -325, -2215, -1122, 299, 863, 2081, -445, -4264, -1745, 3439, 1490, -1718, -356, -1382, -2496, 2346, 2919, -4163, -4025, 1773, 1729, 694, 2225, -676, -3747, 1228, 4641, 1212, -2237, -1036, -232, 746, 2220, 1512, -1936, -2513, 1645, 3617, 51, -3048, -1947, -1228, -704, 2221, 1226, -4645, -3272, 2664, 1801, -855, 719, -1016, -2719, 1729, 3968, -1656, -3552, 623, 1796, 1568, 2318, 325, -2878, -807, 3640, 2713, -1075, -2298, -877, -298, 717, 1679, -837, -3694, -309, 3409, 779, -2476, -2019, -1649]
1755a649Q74L413m06n079l23M631O45o47k09j889j466L350K668l821k783J658
1771a033K289P67J11j486l629M49M401J185l807j511N62j38K014K101k763k726
1787c214K685L413j557k072m55q20J426L578j64m148j244K665K155k81l60j279
1803C28k468J035M332k122m175J173K575k99J157K27m700j387N355J855k749r80
1819h43m70j535K625L117k224l129J718K400L14j261j331r49L17K866K307l543
1835C79l717J739L060m97J054l37m463N5M698n82m257J251J636o46J738J483m401
1852a807j930L762K719j350j357j214q34J447K397M56k649j438K790K037k136
1867H93j266J61j546J289M515j858n513P45L146j74R58P65m149j487M483N55k732
$$ y = [-1649, -775, 2638, 2232, -2847, -3170, 1461, 2106, 1459, 1250, -639, -2105, 1245, 3913, 92, -2691, -1033, 1256, 2023, 2134, 648, -2981, -2532, 1869, 3054, -753, -2264, -1702, -1840, 174, 2275, -488, -3214, -529, 2884, 1327, -745, -1200, -2020, -594, 2984, 2820, -1328, -2572, 93, 2248, 1967, 1607, 328, -2140, -1105, 3227, 1105, -3070, -1897, 678, 379, 1536, 1763, -2937, -4324, 1031, 2886, 137, -843, -1313, -2848, -223, 2894, 670, -2459, -741, 1659, 1973, 712, -619, -1568, -1251, 1615, 3922, 379, -3338, -1599, 1461, 964, 2018, 1681, -2782, -2727, 1971, 1389, -2868, -1617, 19, -627, 1111, 2594, -1807, -3737, 25, 2744, 1394, 37, -1177, -2011, -564, 1833, 2289, -360, -1798, 992, 3029, 893, -373, -212, -1758, -469, 4046, 2188, -3325, -2580, 566, 392, 1350, 2115, -2034, -3521, 962, 1517, -1215]
1884a215J08J8K75K628P65l277j859J623K437J130q84k969p36J399J706J352j858
1901F43k269J340K187r67r52m62k351J478M208j107m379N59R52J43L299M38m367
1918a607j435L377P55j130J07o46n43K261J712j786k988L72K706J398j011j858
1934c16j055q47K375K551j697l300J393J802j087M99k80l003O09M738j14m216
1950a948K31Q56l28L068J700l408k534K507J073m76j47o99j124J719J906q55k684
1967a143r90J822K506r41j161j025j689Q21L783J77m042M60K220j080Q22Q77l505
1984b088r98M932J072l420k77L83j155K636K805k571l005N50J486O37L82j865
2000d96r46J289R91O00j285k839J126L226l96j541K10k449r85N160J249m205J83
$$ y = [-1215, -1107, -1089, -814, 1814, 2579, -698, -2557, -934, 1503, 2633, 1749, -1220, -1956, -557, 1149, 2501, 643, -1626, -286, 1901, 934, -18, -480, -2831, -1353, 2855, 1748, -2631, -2072, -1120, -977, 2322, 2760, -1607, -3042, 335, 1090, -40, 67, -579, -1122, 1139, 2851, 1065, -1923, -1551, 1155, 2553, 1542, -316, -1371, -2218, 157, 2708, 1011, -2289, -896, 906, -181, 318, 38, -2965, -2356, 2382, 2268, -1948, -1717, -861, -1189, 1879, 3579, 171, -2363, 144, 1217, 741, 594, -105, -1229, 490, 2396, 1541, -1143, -2133, -311, 2195, 1254, 93, -932, -2621, -1800, 1983, 2160, -1882, -1422, 798, -282, 540, 1417, -2088, -3086, 1846, 2918, -502, -779, -396, -1551, 1085, 3890, 1319, -1686, -1136, 350, 987, 1369, -496, -1442, -153, 838, 1438, 153, -2686, -1560, 1666, 1270, -271, -61, -2510, -3495, 1665, 2914, -1291, -1108]
2017a108J788j392J267K036l663j283L795O37j916M08j217j691L198K203j826
2032A236j847r30K86J961O96k172o50O88M77J863n99l334N56K752m31JN33l636
2050b550o21M936N26k706R55j12j802K403J878l882r66K439M87j29O39k639j039
2067b183K133J763J92j974k397R40K267l00p43P0j395m3L787m13l810J519J523
2084I36j283K136Q12m370j348M427P09j546L98q14j736K214J763k082j663L02
2100a145J146Q65m59j414n21J75J333K361j789l473J366K092q68R19O97l012L4
2117a693L899j05k836N90Q98j293K231J003l530j644K098J517k97J22j398j100
2133a538J084J263J55j644j248R33J744q94n12K56j236R63L008n59l184L71J453
$$ y = [-1108, 680, -712, 555, 2591, -1072, -2355, 1440, 2077, 161, 569, -648, -2339, 859, 3062, 1236, -611, -1541, -1255, 706, 1402, -770, -1420, -732, -255, 1608, 1009, -2325, -1769, 983, 552, 553, 1086, -2550, -3171, 1765, 2291, -415, 540, 428, -1374, 1029, 2907, -975, -1941, 498, 985, 856, 1495, -1144, -2183, -50, 1713, 1905, -69, -2466, -1526, 741, 441, -302, -232, -1627, -1670, 2117, 1704, -2106, -587, 936, -347, 1789, 2601, -1769, -3117, 1310, 2019, 473, 871, 57, -1679, 535, 2298, 216, -1447, -1145, 1, 866, 407, -1007, -1528, -1353, -20, 2341, 552, -2921, -1555, 537, -331, 588, 1285, -1727, -1693, 2206, 2101, -735, -145, 753, -540, 1691, 2694, -836, -2480, -382, 1135, 838, 960, -438, -1538, -454, 809, 964, -680, -1928, -995, 749, -145, -657, -401, -1637, -674, 2334, 1775, -1409, -1038, 415]
2150D15n40Q14J336k998o42K736O43j537j16l29o88J532J033j688k082O02J399
2167a10J023n2j276q78J1J197J172j147j565O26J385J72K6k61j772P33K720o5
2185A939k023j32j23k35J660Q63k881q32J952Q83o83q8n92j312J189J955q85k445
2203a790K00J451N97J5K54j361n86J104K464j697j992R35L96o0J119K47k255n04
2221a463K947O16j993l01k29p68J572J524j792k044J048J770l29n89j2j566L72
2238a237K291J67j848j378J557Q02J26N18n26j677Q03K377m03j995j61N45LJ047
2256A011N55k008j124J683J631j272j094J93n04J36J619Jk499j55J949K64k29
2273A57J51r97r34J605J841j553j480P14N29O13N99m73j637J89J854L31j188j053
$$ y = [415, -125, 689, 2025, -973, -1615, 1121, 1764, 227, 111, -218, -906, 626, 1659, -29, -2111, -1509, -110, 913, 861, -415, -1293, -1282, -85, 1087, -60, -1625, -999, 386, 558, 584, 323, -1449, -716, 2004, 1939, -84, -216, -339, -574, 1086, 1949, -932, -1764, 188, 1071, 388, 300, -292, -1604, -415, 1540, 655, -1790, -1590, -139, 458, 473, 727, -634, -1220, -116, 2348, 651, -1341, -406, -10, -70, 1049, 1296, -959, -1463, 1484, 2100, 107, -194, -423, -1191, 381, 1905, 113, -1931, -883, 887, 558, -31, -43, -1609, -1237, 1054, 1221, -627, -2005, -448, 354, 480, 998, 472, -1205, -402, 1975, 1572, -423, -584, -39, -36, 1011, 1566, -442, -1566, 117, 1748, 476, -618, -425, -929, -793, 826, 827, -1672, -1827, 122, 386, 157, 308, -689, -1623, -18, 1823, 270, -1210, -496, 33, 646, 1245, 772, -865, -676, 1178, 1509, 321, -732]
2291g32l8K50J042P55j334j507L36J984k35n86k85o03k32J973L54k307m6J303
2309I2L13M76N71j514j590J650J725q29j058j56l02N09J443l84j714n18J706J037
2327A457j105j018j96l64N97K069q39k430N26J642l61Q1R21j599r99K348J278
2344B008k493m91J110JN97J262j541j832O61K004l64r87m90k74k1J087Q99j230
2362i4j738J175K259j209j191M53r00R0K452M99k958k64J876j95K62O34j023j797
2380a669J661J895j551r30J2K96N45J086o07j839l98J191J513o41j150j19K3Q5
2398e97J569k48j924K13J771k19j010J56o86l29K260J143k245p96Q25J13L58J451
2416A805j616j547R71J512m84p76o45l4R30Q35l81r40j363M99J958K96j307k68
$$ y = [-732, -770, -520, 522, 1277, -57, -1564, -1228, 756, 521, -65, -350, -953, -1185, 788, 1142, -1165, -1211, 92, 405, 881, 1452, -62, -1652, -2, 1723, 894, -164, -320, -622, -113, 1330, 946, -768, -1286, 420, 1457, 352, -666, -862, -1226, -629, 1440, 601, -1829, -1303, 339, -22, 59, 980, -619, -1618, 730, 2008, -485, -976, 134, 135, 732, 1994, 453, -1379, -718, 1286, 922, -65, -555, -829, -850, 237, 1136, -94, -1832, -657, 1602, 393, -798, -345, -1245, -1155, 1297, 1796, -1162, -1426, 450, 255, 517, 1151, 128, -1669, -8, 1887, 336, -594, -582, -286, 259, 1345, 738, -1101, -1499, -308, 1205, 564, -586, -705, -682, -597, 972, 724, -1200, -987, 784, 565, -445, -289, -975, -1304, 956, 2099, -146, -942, -117, -4, 354, 1805, 189, -1358, -387, 1125, 641, -135, -780, -814, 116, 951, 570, -370, -1733, -1234, 724, 1020, -287, -555]
$$ [...]
8191A85
##END NTUPLES=NMR FID
##END=
