##TITLE=1H_DHA-Pd-H2(2d)-f6-f5
 CDCl3
 8 sc, 
 7.6.2023
##JCAMPDX= 6.0         $$ Bruker NMR JCAMP-DX V2.0
##DATA TYPE= NMR FID
##DATA CLASS= NTUPLES
##ORIGIN= UXNMR, Bruker Analytische Messtechnik GmbH
##OWNER= root
$$ XWIN-NMR		Version 3.5
$$ Wed Jun  7 14:49:21 2023 Russian Standard Time (UT+4h)  she@DPX200
##.OBSERVE FREQUENCY= 200.13135
##.OBSERVE NUCLEUS= ^1H
##.DELAY= (6, 6)
##.ACQUISITION MODE= SIMULTANEOUS
##.ACQUISITION SCHEME= undefined
##.AVERAGES= 8
##.DIGITISER RES= 18
##SPECTROMETER/DATA SYSTEM= spect
##.PULSE SEQUENCE= zg30
##.SOLVENT NAME= CDCl3
##.SHIFT REFERENCE= (INTERNAL, CDCl3, 0, 15.7039)
##AUDIT TRAIL= $$ (NUMBER, WHEN, WHO, WHERE, WHAT)
$$ ##TITLE= Audit trail, XWIN-NMR		Version 3.5
$$ ##JCAMPDX= 5.01
$$ ##ORIGIN= Bruker BioSpin GmbH
$$ ##OWNER= she
$$ F:/spectra/data/she/nmr/H-F/1/audita.txt
$$ ##AUDIT TRAIL=  $$ (NUMBER, WHEN, WHO, WHERE, WHAT)
(   1,<2023-06-07 14:47:58.62 +0400>,<she>,<DPX200>,
      <created by zg, POWCHK disabled, PULCHK disabled
       configuration hash MD5:
       00 E9 B6 7A A2 85 ED C7 34 08 36 98 17 FE 4E 26
       data hash MD5: 16K
       84 D8 CF 9B 10 8A 56 20 2B AD E9 38 B8 1E 3C 02>)
$$ ##END=
$$ 
$$ hash MD5
$$ BA 70 69 72 4C 26 80 53 20 88 43 44 07 6F D3 78
##$RELAX= 
##$RELAX= 
##$RELAX= 
##$RELAX= 
##$RELAX= 
##$RELAX= 
$$ Bruker specific parameters
$$ --------------------------
##$DU= <F:/spectra>
##$EXPNO= 1
##$NAME= <H-F>
##$PROCNO= 1
##$TYPE= <nmr>
##$USER= <she>
##$AMP= (0..31)
100 100 100 100 100 100 100 100 100 100 100 100 100 100 100 100 100 100 
100 100 100 100 100 100 100 100 100 100 100 100 100 100 
##$AQSEQ= 0
##$AQ_mod= 1
##$AUNM= <au_zg>
##$AUTOPOS= <>
##$BF1= 200.13
##$BF2= 200.13
##$BF3= 200.13
##$BF4= 200.13
##$BF5= 200.13
##$BF6= 200.13
##$BF7= 200.13
##$BF8= 200.13
##$BYTORDA= 1
##$CFDGTYP= 0
##$CFRGTYP= 5
##$CHEMSTR= <none>
##$CNST= (0..31)
1 1 145 1 1 1 1 1 1 1 1 1 1 1 1 1 1 1 1 1 1 1 1 1 1 1 1 1 1 1 1 1 
##$CPDPRG= <>
##$CPDPRG1= <>
##$CPDPRG2= <>
##$CPDPRG3= <>
##$CPDPRG4= <mlev>
##$CPDPRG5= <mlev>
##$CPDPRG6= <mlev>
##$CPDPRG7= <mlev>
##$CPDPRG8= <mlev>
##$CPDPRGB= <>
##$CPDPRGT= <>
##$D= (0..31)
0 1.2 0 0 0 0 0 0 0 0.06 0 0.03 0 0 0 0 0.0002 0 0 0 0 0 0 0 0 0 0 0 0 
0 0 0 
##$DATE= 1686134877
##$DBL= (0..7)
120 120 120 120 120 120 120 120 
##$DBP= (0..7)
150 150 150 150 150 150 150 150 
##$DBP07= 0
##$DBPNAM0= <>
##$DBPNAM1= <>
##$DBPNAM2= <>
##$DBPNAM3= <>
##$DBPNAM4= <>
##$DBPNAM5= <>
##$DBPNAM6= <>
##$DBPNAM7= <>
##$DBPOAL= (0..7)
0.5 0.5 0.5 0.5 0.5 0.5 0.5 0.5 
##$DBPOFFS= (0..7)
0 0 0 0 0 0 0 0 
##$DE= 6
##$DECBNUC= <off>
##$DECIM= 32
##$DECNUC= <off>
##$DECSTAT= 4
##$DIGMOD= 1
##$DIGTYP= 9
##$DL= (0..7)
0 120 120 120 120 120 120 120 
##$DP= (0..7)
150 150 150 150 150 150 150 150 
##$DP07= 0
##$DPNAME0= <>
##$DPNAME1= <>
##$DPNAME2= <>
##$DPNAME3= <>
##$DPNAME4= <>
##$DPNAME5= <>
##$DPNAME6= <>
##$DPNAME7= <>
##$DPOAL= (0..7)
0.5 0.5 0.5 0.5 0.5 0.5 0.5 0.5 
##$DPOFFS= (0..7)
0 0 0 0 0 0 0 0 
##$DQDMODE= 0
##$DR= 18
##$DS= 0
$$ [...]
##$SUBNAM2= <"">
##$SUBNAM3= <"">
##$SUBNAM4= <"">
##$SUBNAM5= <"">
##$SUBNAM6= <"">
##$SUBNAM7= <"">
##$SUBNAM8= <"">
##$SUBNAM9= <"">
##$SW= 18.05172834244
##$SWIBOX= (0..15)
0 0 2 0 0 0 0 0 0 0 0 0 0 0 0 0 
##$SW_h= 3612.71676300578
##$TD= 16384
##$TD0= 1
##$TE= 0
##$TE2= 300
##$TE3= 300
##$TEG= 300
##$TL= (0..7)
0 120 120 120 120 120 120 120 
##$TP= (0..7)
150 150 150 150 150 150 150 150 
##$TP07= 0
##$TPNAME0= <>
##$TPNAME1= <>
##$TPNAME2= <>
##$TPNAME3= <>
##$TPNAME4= <>
##$TPNAME5= <>
##$TPNAME6= <>
##$TPNAME7= <>
##$TPOAL= (0..7)
0.5 0.5 0.5 0.5 0.5 0.5 0.5 0.5 
##$TPOFFS= (0..7)
0 0 0 0 0 0 0 0 
##$TUNHIN= 0
##$TUNHOUT= 0
##$TUNXOUT= 0
##$USERA1= <user>
##$USERA2= <user>
##$USERA3= <user>
##$USERA4= <user>
##$USERA5= <user>
##$V9= 5
##$VALIST= <valist>
##$VCLIST= <CCCCCCCCCCCCCCC>
##$VD= 0
##$VDLIST= <DDDDDDDDDDDDDDD>
##$VPLIST= <PPPPPPPPPPPPPPP>
##$VTLIST= <TTTTTTTTTTTTTTT>
##$WBST= 1024
##$WBSW= 4
##$XGAIN= (0..3)
0 0 0 0 
##$XL= 0
##$YL= 0
##$YMAX_a= 419997
##$YMIN_a= -493870
##$ZGOPTNS= <>
##$ZL1= 120
##$ZL2= 120
##$ZL3= 120
##$ZL4= 120
##$ABSF1= 10
##$ABSF2= 0
##$ABSG= 5
##$ABSL= 3
##$ALPHA= 0
##$AQORDER= 0
##$ASSFAC= 0
##$ASSFACI= 0
##$ASSFACX= 0
##$ASSWID= 0
##$AUNMP= <proc_1d>
##$AZFE= 0.1
##$AZFW= 0.1
##$BCFW= 1
##$BC_mod= 2
##$BYTORDP= 1
##$COROFFS= 0
##$CY= 11.3945322036743
##$DATMOD= 1
##$DC= 2
##$DFILT= <>
##$DTYPP= 0
##$F1P= 15.7292609196834
##$F2P= 12.9074282941183
##$FCOR= 0.5
##$FTSIZE= 0
##$FT_mod= 4
##$GAMMA= 1
##$GB= 0.15
##$INTBC= 1
##$INTSCL= 1
##$ISEN= 128
##$LB= 0.24
##$LEV0= 0
##$LPBIN= 0
##$MAXI= 10000
##$MC2= 0
##$MEAN= 0
##$ME_mod= 0
##$MI= 1.114404
##$NCOEF= 0
##$NC_proc= 0
##$NLEV= 6
##$NOISF1= 3.799351
##$NOISF2= 2.8
##$NSP= 1
##$NTH_PI= 0
##$NZP= 0
##$OFFSET= 15.70392
##$PC= 1
##$PHC0= -19907.83
##$PHC1= 13.85272
##$PH_mod= 1
##$PKNL= yes
##$PPARMOD= 0
##$PSCAL= 0
##$PSIGN= 0
##$REVERSE= no
##$SF= 200.130013532006
##$SI= 16384
##$SIGF1= 3
##$SIGF2= 2
##$SINO= 400
##$SIOLD= 16384
##$SREGLST= <1H.CDCl3>
##$SSB= 0
##$STSI= 0
##$STSR= 0
##$SW_p= 3612.71676300578
##$SYMM= 0
##$S_DEV= 0
##$TDeff= 0
##$TDoff= 0
##$TI= <>
##$TILT= no
##$TM1= 0
##$TM2= 0
##$TOPLEV= 0
##$USERP1= <user>
##$USERP2= <user>
##$USERP3= <user>
##$USERP4= <user>
##$USERP5= <user>
##$WDW= 1
##$XDIM= 8192
##$YMAX_p= 0
##$YMIN_p= 0
$$ End of Bruker specific parameters
$$ ---------------------------------
##NTUPLES= NMR FID
##VAR_NAME=  TIME,          FID/REAL,        FID/IMAG
##SYMBOL=    X,             R,               I
##VAR_TYPE=  INDEPENDENT,   DEPENDENT,       DEPENDENT
##VAR_FORM=  AFFN,          ASDF,            ASDF
##VAR_DIM=   8192,          8192,            8192
##UNITS=     SECONDS,       ARBITRARY UNITS, ARBITRARY UNITS
##FACTOR=    0.0002768,     1,               1
##FIRST=     0,             0,               0
##LAST=      2.2672688,     0,               0
##MIN=       0,             -493870,         0
##MAX=       2.2672688,     419997,          0
$$ Real data points
##PAGE= N=1
##DATA TABLE= (X++(R..R)), XYDATA
$$ [...]
2231b176k157L929L871j725l747J42J387Q20K277m80m995l42N647J483l003j918
2247i87k58p20K765K952l130m397K110M090k21j700j573j624N80M201P57m121
2263a276k469K349K617J00j47j730k442K024M906j030n012m22J934J513J355M50
2279B720l823k201M646K557l158k387j32MK212K534k352m443Q17L922J119j629
2295D06j520r28O37L091J515l478l859K432L763J07j055o01k565N53M940q3m819
2312a464j376K898N26J289J59l781k221L765L363k013k856k20P55J557J487q17
2328A051m223o18M752L029k841k270K63l91J602L254k493n021K691L880p62j455
2344D48L2l137M42M928O45m232k021K281J298N89o45k004j855K155L972N6m427
$$ plain form
2231 -2176 -4333 -404 3467 1742 -2005 -1863 -476 344 2621 2141 -2854 -3196 2451 3934 931 -987
2247 -987 -1245 -1965 800 3752 622 -3775 -1665 2425 2204 504 -1069 -2693 -2113 2088 2845 -1276
2263 -1276 -3745 -1396 1221 1321 1174 -556 -2998 -974 3932 2902 -2110 -2532 -598 915 2270 2720
2279 2720 -1103 -3304 1342 3899 741 -1646 -1778 -1774 438 2972 620 -3823 -3006 916 2035 406
2295 406 -1114 -2042 -1405 1686 3201 -277 -4136 -1704 2059 2166 1111 510 -2055 -1502 3438 3355 -1464
2312 -1464 -2840 58 584 1873 2032 -1749 -3970 -205 3158 1145 -1711 -1931 -1176 381 1868 1051
2328 1051 -3172 -3790 962 3991 1150 -1120 -857 -1248 354 3608 1115 -3906 -1215 2665 1903 448
2344 448 480 -2657 -2215 2713 3358 -874 -2895 -614 684 1273 628 -1376 -3231 -1076 2896 2952 -1475
2361a475j157K204J092N89P24l061k543M267L505k839k642K06j51J446L279k076
2377A368m255O41L348N30o43j839j361P43L345J233l202k913P73L026O92j064
2393D22j177j433P37M013P77m777j269K241R32J223Q75l505k810L590L742k486
2409A095k209L5J80J800K127j702l702q14L467K155j314k244m14K32J583K419
2425B694j896m730J357M318J86j637n5k182n74M873J413m692j240K016R76Q33
2441A660L68l049k202K670L190j04k727j797Q77J880P03n61k475j867L026L524
2457C116j850k783K55n65J535L734j688n213J635L843n35m96r08k313M85M282
2473B534J055l573j501L18J539J608p77k132j360P00L348J226m223j772K204J082
$$ plain form
2361 -1475 -2632 -428 664 1253 1977 -1084 -3627 640 4145 1306 -1336 -1130 -1281 165 3444 1368
2377 1368 -2887 -2246 1102 1632 989 -850 -2211 -1468 1877 3110 -92 -3005 -2232 794 1486 422
2393 422 -755 -2188 -1451 2562 3339 -1438 -2707 -466 466 1689 2564 -941 -3751 -161 3581 1095
2409 1095 -1114 -1079 -899 901 3028 1326 -2376 -3190 277 2432 1118 -1126 -1540 -1308 275 2694
2425 2694 798 -3932 -2575 1743 1929 292 237 -1945 -2519 2354 3767 -925 -2165 -149 827 1660
2441 1660 2028 -1021 -3223 -553 2637 2533 -194 -1991 -1114 766 1469 908 -1567 -3434 -408 3116
2457 3116 1266 -1517 -1262 -1827 -292 3442 1754 -3459 -1824 2019 1484 988 80 -2233 -1748 2534
2473 2534 3589 16 -1485 -1167 372 1980 1203 -929 -2289 -1589 1759 2985 -1238 -3010 -806 276
2489B76K00J999k983l292L108L634k159k095N82o24J511L472j432m098k96K863
2505F66J331n70k016j003N53J854J688j272m332J97M053M99j608Q5j995j174M443
2522A399J481m132j440K649P93P87Q38k720k567K402K603p7j786j634L29K323
2538A248O28q42j664j928J157M270r36l645N57K54N7K672l6m459J64M031K92j114
2556G06o36k113j17L730Q63k159j361j47J287K079p08k585q67J270J959J583k939
2573a55k579J367K109l5R61j733l067K482L287j563k299L37j264J690L396j369
2589A565l359J39J831J033J42j752j711J536J636J053p45l174n17L513J027k062
2605A55O3j522o98L508J380l773j751K079N64P17J299k544k449K253K331m04j602
$$ plain form
2489 276 476 2475 -508 -3800 -692 2942 783 -1312 -730 -1354 157 3629 2197 -1901 -2197 666
2505 666 1997 1427 -589 -1592 -1039 815 2503 1231 -3101 -2904 1149 1648 40 125 -1870 -3044 1399
2522 1399 2880 -1252 -2692 -43 750 1537 2375 -345 -2912 -510 2093 2016 230 -1404 -1075 1248
2538 1248 1876 1034 -630 -2558 -1401 2869 1933 -1712 -1155 -901 -844 1828 1792 -2667 -2503 1528 1820 706
2556 706 70 -2043 -2160 1570 2433 274 -1087 -1234 53 2132 1424 -1161 -2028 -758 1201 2784 -155
2573 -155 -2734 -1367 742 707 1668 -65 -3132 -650 2637 1074 -1225 -888 -2152 -462 2934 1565
2589 1565 -1794 -1655 176 1209 1351 -401 -2112 -576 1060 2113 1368 -1806 -2323 1190 2217 155
2605 155 218 -1304 -2002 1506 2886 -887 -2638 -559 5 722 2021 -523 -2972 -719 1612 1208 -394
2622c94j188J01K256Q42o72j553j771J642L328p48k631L7M1N71K449k26m378L1
2640b263L427N53q34o53k053m31L231J307k584j643L42J614J348m42j641j012
2656a734O64K194J435k253k303J211J656k03R95j589k876K257L267j165k362k62
2672a068l80J208K455r16l002n34K031J473j88j519j758N21K136J526p06l177
2688a898k07K505J298q01n99j449n34L284J235k515j992Q29J028R75O71k053k564
2705b787J720K936p18j401j353j5J499J590k63k284j482K014K431o34j507n81
2721h35k16J177K004n31l219k50K621R35r07k84j542j60J969J741k209k023L77
2738a352J601O44P2j246j986N36L014P85k457j141L82J349R64N47k088j986J832
$$ plain form
2622 -394 -1582 -1481 775 1617 945 -608 -2379 -737 2591 1843 -788 -751 -710 -139 2310 2084 -2294 -2263
2640 -2263 1164 1717 883 230 -1823 -2254 977 2284 -300 -1943 -1601 13 1361 919 -722 -1734
2656 -1734 -1070 1124 2559 306 -1997 -786 870 667 1662 73 -2803 -546 2721 1556 -806 -1068
2672 -1068 -1448 -240 2215 1299 -1703 -2237 -206 1267 1079 -440 -2198 -1677 459 1985 1279 -1898
2688 -1898 -2105 400 1698 897 298 -1151 -1685 1599 2834 319 -1673 -844 184 1159 1830 -223 -2787
2705 -2787 -1067 1869 1151 -250 -1603 -1618 -119 1471 1208 -1076 -2558 -544 1887 1253 -254 -835
2721 -835 -1051 126 2130 1599 -1620 -1870 751 1686 779 495 -1047 -1207 762 2503 294 -1729 -1352
2738 -1352 249 893 965 -281 -2267 -1731 1283 2068 -389 -1530 -1148 201 1165 1712 -376 -2362 -530
2755e30K947n83j989p31MJ023J671l25k613j111K455J557o86j063j054q52K124
2772B44K198j747k279K06J478Q95r8p90j771K9K866R24j829j842K52J286J393
2789A415Kj264k183R72K634J80k019j015M85O48K001Q2k661j668K067J467k30
2806I13p51j319m83J830J531r27k080k60J160J550n6j317p10n57K097J612j447
2823G86k431N60J208Q44N33j103k124K68L113L02k074p36q7P34J827k14k153j267
2841b014J211J803M93j584j237J36J096J349K34k287j523K130J879q61m50q65
2857d90r83J690K271j411k362K51J194Q57M44q24k147L29J704J283j356j795k89
2874a634J536O28mm48j814P4K812N10k009o37M14K49J501Q57k586j462J797J810
$$ plain form
2755 -530 2417 1834 -155 -886 -882 141 1812 1487 -1126 -2237 218 1775 1089 26 -1028 -1880 244
2772 244 2442 695 -1584 -1378 100 995 897 107 -1664 -1635 1231 2155 326 -1516 -1264 22 1415
2789 1415 1417 153 -2030 -1058 1576 1756 -263 -1278 -793 -145 1856 1938 -723 -2391 -324 1143 913
2806 913 162 -1157 -1640 190 1721 794 -1286 -1546 -386 1164 1108 -209 -919 -1476 621 2233 786
2823 786 -1645 -1085 123 967 1500 397 -1727 -1459 1654 1956 -118 -854 -941 -207 1620 1406 -747 -2014
2841 -2014 -803 1000 1493 -91 -1328 -1192 -96 1253 1487 -800 -2323 -193 1686 825 375 -490
2857 -490 -1473 217 2488 1077 -1285 -1034 160 1017 1461 637 -1510 -1181 523 1806 450 -1345 -1634
2874 -1634 -98 530 526 78 -1736 -1662 1150 1660 -349 -986 -572 -323 1178 2035 -551 -2013 -216 1594
2892A594m26p60j060p88J289J891o62j983q09J013J871j94j332p54m71J387J990
2909A796r59k462L69J600J20O92p72j910J91K731L87j570r56j52N82J689L96k015
2927b43j396Q57J505P06j537r92O8Q59Q06N52j551k121J957J851p03p32n65o76
2945a355J136K369j122k209K27J023O87P04j012j518P6J800Q76r48j664q91J944
2962A23J080k94j156j165l90K236Q98j428j417O19N10J083N93j968j045J279J432
2979I90Jo04j110p81J728J572p38j894n20J175J269L64j114j370q0J044J877q75
2997I34k326J37J313N81L5k15j859k42K214J198j827j066K12L88J661L94j907
3014c75j251R67J633L81j107j328J21R64J312J31j389j916J417J939k94j108o95
$$ plain form
2892 1594 1168 408 -652 -1440 -151 1740 1078 -905 -1714 -701 1170 976 -356 -1110 -1581 -194 1796
2909 1796 837 -1625 -1256 344 464 1156 384 -1526 -1335 1396 1783 213 -743 -895 -313 1376 1772 -243
2927 -243 -1639 -782 723 1429 -108 -1100 -1032 -173 633 1185 -366 -2487 -530 1321 618 -114 -679 -1355
2945 -1355 -219 2150 1028 -1181 -954 69 756 1460 448 -1070 -994 806 1682 734 -930 -1821 123
2962 123 1203 909 -247 -1412 -1802 434 1332 -96 -1513 -894 -384 699 1292 -676 -1721 -442 990
2979 990 991 387 -723 -1504 224 1796 1058 -836 -1356 -181 1088 1452 338 -1032 -1112 -68 1809 934
2997 934 -1392 -1255 58 639 674 459 -1400 -1642 572 1770 -57 -1123 -911 -523 1138 1532 -375
3014 -375 -1626 -659 974 1355 248 -1080 -959 5 1317 1448 59 -1857 -440 1499 1205 97 -598
3031e98o90O74K274n28k341j82J221M66M95l12j778j46K069J003j244j417j86
3048a220R19J418n5j036j198J26J783Q00j208j169O5O36J082O93k010j596J343
3065f27J507k18p20q44n90J019J958o98j782k93J036P89O22n83j716L9J533J006
3083A438j90k106l85J418N07N77j010j160o28K312R07j520j128K38J0J308R22
3100A510j825j532J008J420L14n79p40r72R35J471K71j502r34R06J339J08p94
3117D04j113j79P91J495l34k104j66J377L63K75k77k047Q8J689J021j092j087
3134h96m71P50J198M38j124j283N53J424J125r11j529m0O13J194O25j559j777
3151a670R21J717M8j061l67p75P16J469R4j711p87J028Q29M54o76j147j30Q74
$$ plain form
3031 -598 -1288 -614 1660 1132 -1209 -1391 -170 296 791 479 -1299 -1445 624 1627 383 -1034 -1220
3048 -1220 -301 1117 1062 26 -1172 -1046 737 1537 329 -840 -775 -139 943 1636 -374 -1970 -627
3065 -627 880 662 -58 -902 -1492 -473 1485 787 -995 -1288 -252 537 1159 576 -1140 -1101 432 1438
3083 1438 1248 -858 -1243 175 682 1259 249 -911 -1539 773 1680 160 -968 -730 -720 588 1510
3100 1510 -315 -1847 -839 581 895 316 -424 -1396 -461 1010 1281 -221 -1155 -249 1090 1198 404
3117 404 -709 -888 -97 1398 1064 -1040 -1206 171 534 809 532 -1515 -1427 262 1283 191 -896
3134 -896 -1367 -617 581 1019 -105 -1388 -835 589 1714 803 -726 -766 -153 1041 1666 107 -1670
3151 -1670 -749 968 1016 -45 -412 -1187 -471 998 1092 -619 -1406 -378 451 905 229 -918 -1048 -174
3169a74J141o8j705o22J061J094L31n79j367l11J628J275j106j028m02M17R91
3186E76P38j497j193M55J371N26n42p02q43P67J142N3j054r49L40J543L91r00
3204B22p41m45O68J494l50j584j97O85J045Q2m91j314j40J333J188p50j210n12
3222a017O64P78O17r85j282J89J312N71m03j027j52K3J082Q47j276j341M34J556
3240E90L84m96q34o96N85J887k81j506n97O66Q21K02j65j085n35J161J183m47
3258H37j457n22M08J259K68p82r30k12J082J307j096r22k44P84O87O34p11j595
3276a205N50J154M64k99r13l12L62J237J05j322j025P77P95M72m82q76o28R07
3294b39O76K44j044o14O04O26N27k59j209n51R35J655n51j415J48L76Q07N61q87
$$ plain form
3169 -174 967 899 -806 -1428 -367 727 1058 479 -888 -1199 429 1704 598 -430 -832 -415 576
3186 576 1314 -183 -1376 -921 450 976 434 -268 -1111 -344 798 851 -203 -1152 -812 731 1122 222
3204 222 -519 -964 -296 1198 848 -736 -933 -248 797 879 388 -926 -1066 267 1455 705 -505 -1017
3222 -1017 -353 425 1042 57 -1225 -1036 276 847 444 -583 -735 -712 370 1217 -59 -1400 -966 590
3240 590 974 478 -356 -1052 -467 1420 1139 -367 -964 -298 523 725 560 -525 -1060 101 1284 837
3258 837 -620 -1142 -734 525 793 11 -919 -1131 -49 1258 162 -760 -1004 -220 467 1101 390 -1205
3276 -1205 -655 499 963 664 -249 -561 -199 1038 1143 -179 -1204 -427 368 840 358 -518 -1146 -239
3294 -239 437 681 -363 -977 -373 253 780 521 -688 -1239 -304 1351 800 -615 -467 -91 716 1277 390
3313C90j321R2J217N87l86q98n07N25R95M9j046n73L53O63P46p38q51l90L90J437
3333G34K60j049r33Q09Q19l5r8n88q39R63J138k65j347j35J28P25Q42o54j345
3352h70j17J175N61m34p85m98O33Q10K68m40j349q9J432O32n83m71l40N2R20N94
3372A101j007j221N22Q34L41o0r65o45J054J005k22j027p66N24R51K86o57o20
3390e72n27P11J371q8j342m18N01P16O43m44j373n6J489R6m29l22p37N68R13L38
3410A038r28q15J67Q90L47m36o03l85L95J013K08p59j246J74J216J99j76q45m81
3429a027P71J307m31o70o52L77N47Q21n24j256O4Q29O28j33o40j095O74R61K60
3448H11m16j116j25Q78Q25m14p50k87J37R08M82q94r69M19L80P00K58q90p73O80
$$ plain form
3313 390 -931 -839 378 965 579 -319 -826 -301 694 743 -303 -876 -523 140 886 148 -703 -1093 -703 734
3333 734 994 -55 -988 -179 640 605 507 -81 -920 43 1181 916 -431 -566 -438 287 1129 475 -870
3352 -870 -987 188 749 315 -470 -968 -335 475 743 303 -1046 -1135 297 929 346 -125 -465 -413 507 1101
3372 1101 94 -1127 -605 229 570 510 -455 -1100 -46 959 737 -290 -1056 -532 419 705 48 -572
3390 -572 -1099 -388 983 895 -447 -865 -364 352 995 551 -822 -878 611 707 278 -44 -781 -213 700 1038
3410 1038 110 -705 -538 352 699 263 -340 -725 -330 683 891 132 -1114 -940 276 475 299 -546 -1027
3429 -1027 -256 1051 620 -50 -702 -325 222 1043 519 -737 -673 156 784 651 11 -1084 -410 551 811
3448 811 395 -721 -846 32 857 443 -307 -594 -457 451 933 39 -930 -511 -131 569 827 -63 -836 -156
3468a56Q81j4n65m56l01J013O28m39j096j64N29J025j14r42o20K37R00N12o32
3487B26j228j05J178L93j40l81p75J20J230N32p14o93q0O09P52k56p63p25N76
3506b44Q96M53r22r82L55Q59L06j11r87n40N38J096k03q77l95K72M01Q55m72j020
3526g22q0Q02R23l72q15k99L43O50L17m89n81m47J141N72m53p01m55j5R80O94
3546I93r01p88q4Q97K06K43q73p27P56Q64J93q29o05j36J337K5j50o03n28P56
3566D6P18k0r24m08K47N71M65l50r03n89J343L16j44m26n94r6J086M36p35q34
3586g95J84N73M81j09l99o45K97O65N95o44p73j3Q46L47q1n80n46L26O64M74q38
3607B9m60l35R20K99j88q52k86M48Q67J00n98m63l0Q17M64l18r64j71O68N57L67
$$ plain form
3468 -156 725 711 146 -310 -611 402 1030 591 -505 -669 -140 885 771 -171 -791 -554 346 858 226
3487 226 -1002 -1107 71 464 324 -57 -832 -712 518 1050 336 -357 -437 172 924 668 -95 -820 -244
3506 -244 652 1105 183 -799 -444 415 721 610 -377 -917 -379 717 514 -363 -758 -486 -85 770 298 -722
3526 -722 -802 0 923 551 -264 -563 -220 430 747 258 -323 -770 371 943 490 -211 -666 -681 299 993
3546 993 92 -696 -780 117 323 566 -307 -1034 -278 586 779 -50 -655 -791 546 571 421 -182 -710 46
3566 46 764 744 -180 -588 -341 230 695 345 -558 -1147 196 512 368 -58 -652 -748 338 774 39 -795
3586 -795 -611 -38 443 334 -65 -710 -413 252 847 203 -570 -583 263 610 529 -51 -597 -271 393 867 29
3607 29 -431 -766 154 453 265 -587 -873 -425 442 542 -56 -519 -549 268 732 414 -550 -721 -53 504 871
3628H71r77m64K43P96K62o88p27K41Q28P5M0l86r79O36P14L00q54n95K29J65P53
3649D83k08n75m63O89N35j61k52o12m6P46M17j49r78m6P03N70j68l68k97l5J92
3670b3R06n28q76Q2O17L70l17l13m55Q4O08O23q82n96j12O09Q93l35o85l62L95
3691b97P23M2m36p86L38N34O42k12q61k70P42O34n37q5n48k37Q26L98m83q28J09
3712e92M65P04k04o43p42N30P87K17m23l47m33N53N42k08m03n25N82O23J96o53
3732B6k78K7K37N27j07o37o86K64R88k6l60m72j5M69N40n2r80M6L72P91j07r20
3754c53q9M5O82M34m15o91k64Q04M97k77k59l82nO90K10n51n38j40M95O32k03
3775C22n17m21l5Q75N31o11p10J78O77K13k41l43m97M20P18K91q92k33k14P55
$$ plain form
3628 871 -106 -570 -327 469 731 43 -684 -443 385 460 500 114 -865 -229 485 785 -69 -664 -435 -270 483
3649 483 275 -300 -763 -74 461 300 48 -564 -610 136 553 404 -574 -620 83 653 485 117 -180 -215 -23
3670 -23 883 355 -521 -439 178 548 231 -82 -537 -453 155 778 -104 -700 -812 -203 690 355 -330 -692 -297
3691 -297 426 468 32 -754 -416 118 760 548 -313 -583 159 793 256 171 -377 -614 212 610 127 -701 -592
3712 -592 -127 577 373 -270 -1012 -482 305 522 99 -248 -681 -128 414 206 -197 -722 -140 483 679 26
3732 26 -252 -225 12 539 432 -205 -891 -627 361 335 -25 -497 -512 -43 497 445 -535 -489 -117 674 567 -353
3754 -353 -442 -397 285 719 304 -387 -651 153 650 373 114 -268 -273 417 627 76 -462 -602 -107 525 322
3775 322 -195 -616 -651 224 755 144 -566 -388 289 502 261 -82 -579 -159 559 850 -42 -275 -489 266
3795B66L92l10o80p6K51N90Mm06q01N45N24L64m75o44k12N79N71p4q04r6j56R59
3817C11K42j88p02j57N10O25j08p87k89M71N17j83k10j14m09M66N97l89m96j22
3837d15K20P45l8n07m96L0O92K30l51n45k07P61K15j15r0l77k22O84M52o20j65
3858a19k77M5N99K32o02l77K89M73J72j45o41l87O91M16j2o87k79R5N93J17o0
3879A36n61J49J99O28m47l67j19K27M35R6j95o49M40R5L44P3p78k20M81O20J81
3900G68j049k67J24O61J68j79o03j84L64L29K64k75o96K41P08j68k29J4l58K92
3920g5P04j99o53k01M50L70j2j94n44k26P36K73j20o73j20L39L29R7k68k76l07
3941e70N70M95m01n26J20K5N57L19m19m02k1O29K6k93l74j32M33M07O3o04l48
$$ plain form
3795 266 658 348 -332 -408 -157 433 437 31 -770 -225 299 663 188 -456 -668 -89 482 408 -396 -492 -648 311
3817 311 553 365 -337 -494 16 641 533 -254 -543 -72 445 262 52 -62 -471 -5 592 203 -293 -415
3837 -415 -195 550 512 5 -491 -461 231 461 110 -435 -642 119 334 219 129 -248 -470 214 666 46 -119
3858 -119 -396 -351 248 480 -122 -499 -210 263 435 290 -351 -738 -47 369 357 -330 -609 -514 79 196 136
3879 136 -425 -276 -77 551 104 -263 -382 -155 280 376 181 -468 -28 67 411 484 -294 -514 -33 587 768
3900 768 -281 -548 -424 237 405 226 -377 -561 -197 132 396 121 -575 -334 374 206 -23 -9 -367 -75
3920 -75 629 430 -223 -424 26 396 384 190 -354 -580 156 429 309 -364 -484 -145 184 281 13 -263 -570
3941 -570 0 495 94 -432 -312 -287 270 589 170 -232 -253 376 402 109 -265 -397 36 443 506 -98 -446
3962d46K22N09K75l55n83Q8M57J87J11p73k37M91L03J08l35n60J98M27M05j38
3982C54j94m60N4N54km64r6O1K42L60k65m53j45J50N99J13m54l23R1M42J58k59
4004F3l88j6K08N21o8m10k76J14K31M90k59n39j8L89K34P3l63n10N41L23k9k90
4026B1l00o0M16M73l17n05k69M68M32j10l23l77L56J78M05l42m73k29N16J97K35
4047C92m05k90K4P27J89m84k95K6R1M19J0n41m13K66N57L8j81l83o2K46L33Q5
4069C49n98j54J67N63Pn39j90LP59k53J10o70J88K35L63m6j89m67K4O48L13l88
4091B35o67L57k85Q08r3o20k72K55M40L17n00m46J16K77O30l59k50l02J36L52
4111A29J55k71n10K00K71N44l24l33m1K59J54pQ2o19Q8L52J47j18n18m6J18N83
$$ plain form
3962 -446 -224 285 560 205 -378 -290 167 354 465 -308 -545 -54 249 357 22 -538 -340 87 492 354
3982 354 160 -300 -246 308 306 -158 -254 -193 49 409 144 -309 -454 -304 295 408 -46 -369 -278 164 322 63
4004 63 -325 -341 -133 388 320 -90 -366 -252 -21 469 210 -329 -347 42 276 349 -14 -524 17 340 311 21
4026 21 -279 -339 77 550 233 -272 -541 -73 359 249 -74 -451 -95 83 488 146 -327 -556 -40 157 392
4047 392 -13 -303 -279 448 637 153 -142 -116 -25 394 404 -137 -550 -284 273 311 130 -253 -315 -69 264 349
4069 349 -249 -403 -236 327 334 -205 -395 -392 367 114 224 -446 -258 -23 340 294 105 -362 -338 310 623 235
4091 235 -432 -75 -360 448 355 -265 -537 -282 158 475 -25 -471 -355 -78 552 193 -57 -359 -223 129
4111 129 284 13 -497 -297 -26 518 194 -139 -180 79 233 226 308 -311 -223 129 276 158 -360 -406 -288 295
4133B95n8k57l42J04K85K38j20m40m0K75K57L03l57m63J86L54K74l66k19j84K64
4154a1K77k17l3m59l6N31J95q2m99jL74K84j85j18l14J39K42N2j73j61k08N93
4176A90K31j66o18K33L7M34M0k48l97M49j03L96k43m30j47J58L99J1m13r4J20
4197a61L12P2J8l74j96J89L44L16n43m23L34J71N22n30k18O6L1L14M7l92k3lJ94
4220F7K82m19j44k18O32J30j42L6m85o4N62N3j86k11l13M94K31m10j44J21J71
4241D3K48N03n25n86p3M09L91m34n0m69P85KL51l21m44QL50n4j15j54l93M05L4
4264h9M78m33k73j34P74q6l71N0k9J8J25N4l57J76J35L91j21k72j11J27J10P7
4286B39k30jk16L50K32m14J7m69K15K77K90q6m02j60L84J88k8m20O0n2L27K20
$$ plain form
4133 295 237 -20 -362 -258 27 265 145 -295 -335 -60 197 500 143 -320 -134 220 494 128 -91 -275 -11
4154 -11 266 49 16 -443 -479 52 247 165 -334 -335 39 323 138 20 -294 -155 87 139 -34 -195 -403 190
4176 190 421 255 -363 -130 -93 341 381 133 -264 185 82 478 235 -195 -342 -184 215 226 -187 -281 -161
4197 -161 151 223 241 -133 -329 -140 204 520 -23 -446 -112 59 581 51 -167 -101 -70 244 291 -101 -124 -127 67
4220 67 349 -70 -214 -432 200 330 188 224 -261 -325 237 290 104 -107 -420 74 305 -105 -249 -128 43
4241 43 291 794 269 -317 -390 19 410 -24 -74 -543 242 244 595 274 -170 -162 188 134 19 -135 -528 -123 -89
4264 -89 389 -44 -317 -451 323 237 -134 -84 -113 -95 30 84 -273 -97 38 429 308 36 -75 52 162 239
4286 239 9 8 -208 142 374 -40 -23 -492 -277 0 290 204 -198 -358 26 214 186 -234 -174 -226 101 321
4308C21j85k03n07R13j60m1l75P2p5M95j65k68j54J31J57M32k61l57J0K57j42
4329a05J94j28l09K61Q9Q9M5k36p2K70Q0l20K84m03L64J31m5j10k3l64L29L32
4351C53k2m22j18L27k22M40l77l11J46J81K26O3k87M4k85N71m6k89n9P4J88K99
4373D74j98n34L0J83P5K91k24k52p7K65R8J9m02J73r8J50J23q8l28K16K21jo1
4396E5l29K32J55Q5p3j72J34k14L25J43j58o12J34K55K68M2m21K35M2M3P2j38
4418A03m67J00K68J05O0m44O4K13M1J38k25J73k38J40l4Q9l12P2K27J40j49k64
4440b00O4N2K57K96j60k74j56M8L93j77k67K7j86L83J47l37k25K1K50J65j59K
4462c6k61K48J58j05qp9j07L14J32j18m67J93j94K23K77M0l35P9j10O24k60l91
$$ plain form
4308 321 136 -67 -574 339 179 138 -237 -165 -240 255 90 -178 -332 -201 -44 388 127 -230 -220 37 -105
4329 -105 89 -39 -348 -87 2 91 136 -100 -172 98 178 -142 142 -261 103 234 189 79 56 -308 21 353
4351 353 331 -91 -209 118 -104 336 -41 -352 -206 -25 201 264 -23 21 -264 307 261 -28 -87 -13 175 474
4373 474 276 -258 -228 -45 30 321 97 -155 -232 33 131 150 -252 -79 -177 -27 96 8 -320 -104 117 116 55
4396 55 -274 -42 113 198 125 -47 87 -127 198 341 183 -429 -295 -40 228 270 -151 84 126 169 241 103
4418 103 -364 -264 4 109 169 -275 -211 2 43 181 -44 129 -109 31 -3 86 -226 -154 73 213 64 -200
4440 -200 -136 -84 173 469 309 35 -121 -73 320 143 -124 -97 -283 100 247 -90 -315 -294 -44 121 -38 -36
4462 -36 -297 -49 109 4 -4 -83 -190 124 256 138 -329 -136 -330 -107 170 210 -125 -46 -156 468 208 -183
4484a83%K84o0J07l35j3j81M83J73l30r1o1J83N8L23m40j90K43J19M3o5k93J04
4507a22K0J48k00K45l44K48L58o43K00R5j55J68Mk8r9L0j11J31K63j77k63k39
4529d71O44k4k85J14k07L62O9J2k04k84J8M91L7l17J24k15K05R1k9j98q2NQ6Q4
4553B6j39K8j20K26J23Rq9k30J36K02J51k84r2l11N31l26L65m16J01M0K80m4j84
4576a7k61pL29Rq5J49k61K10K02k03j25l67K03L77J98k28j62l38N03Q3j52m3J9
4599C3l93L27L14k95L3k29R7R1K41n42Q3J58L71o03K82L1j97K47Q2j37l0j82K16
4622bQ4J62l07k60K22j91O74l17l8j36P5J18r3J13k61l64O00L86k03l43k02K10
4644g3J41K0p8n5r6K81j15n8k50L18m1K3L94l49j27N2k1L86m48L3J82j60J9L2
$$ plain form
4484 -183 -183 101 41 148 -187 -200 -381 102 275 -55 -146 -207 -24 34 357 -83 -273 -30 89 132 67 -226 -122
4507 -122 -102 46 -154 91 -253 -5 353 -290 -90 5 -150 18 22 -6 -105 -75 -186 -55 208 31 -232 -471
4529 -471 173 149 -136 -22 -229 133 202 214 10 -274 -256 235 272 -45 79 -136 69 160 131 -67 -149 -144 -58 26
4553 26 -113 -85 -205 21 144 153 64 -166 -30 172 323 39 -53 -364 167 -159 206 -210 -109 -69 211 167 -17
4576 -17 -278 -285 44 53 -32 117 -144 66 268 65 -60 -427 -224 153 351 123 -39 -377 126 209 57 14 33
4599 33 -360 -33 281 -14 19 -210 -113 -22 219 -323 -240 -82 289 -314 -32 -1 -198 49 131 -6 -36 -218 -2
4622 -2 82 244 -63 -323 -101 -292 382 65 27 -109 -34 84 -9 104 -157 -521 79 465 262 -81 -283 -73
4644 -73 68 88 10 -45 -141 140 25 -33 -283 35 -6 17 411 62 -65 -13 -34 352 -96 -63 119 -41 -22 10
4668A0l53Q3Q3K72J31k15p8j37N08j61O0j65k85J75J66R9k84j92J88K70J66k36
4690A05l35J51J92R1p9j55j59Q5K68l5Lm03J25k4K08J14l49L4N2j5J16j55jl0
4714a96m2M71l57J33l83L48OJ92J2k67M2j42J24K70k16l3J21O6j6J87m04o8K90
4737A38n5J38k66Q7j8P6J79k06n99N34k74K37q2LoK05K66o7n77K42l8L46j76k43
4761a56J70l5K49j71Q3k30J29r2J36j77k18P7K61ON3m6j69J12l06N45k4k27l1
4784f1J38j20J91j39p7k83K45M42m60k0O1j39L39k7J38l54r8M61k65J46j88m1
4806a11K11m9J07L9l91o4P3K82jl21m5J02J99K01k03j53Q4K52o9k66J66j99L34
4829A78j46m7o1K39k71L3J22K94m47Q3k44M40j22j35Q5j96K45m2K15l80j04K94
$$ plain form
4668 10 -343 -260 -177 95 226 11 -67 -204 304 143 203 38 -247 -72 94 193 -91 -283 -95 175 341 105
4690 105 -230 -79 113 204 125 -30 -189 -104 164 129 132 -271 -146 -170 38 152 -197 -163 -111 -126 -10 -165 -166 -196
4714 -196 -238 233 -124 9 -374 -26 -20 172 184 -83 -41 -183 -59 211 -5 -38 83 149 133 320 -84 -152 138
4737 138 83 221 -45 42 24 100 279 73 -526 8 -266 -29 -111 -108 -114 91 357 290 -287 -45 -83 263 87 -156
4761 -156 14 -21 228 57 140 -90 39 -53 83 -94 -312 -235 26 32 85 39 -130 -18 -324 221 197 -30 -61
4784 -61 77 -43 148 9 -68 -351 -106 336 -124 -144 -83 -222 117 90 228 -126 -224 237 -28 118 -70 -111
4806 -111 100 51 158 197 -194 -258 -185 97 96 -225 -270 -168 31 232 29 -124 -40 212 143 -123 43 -156 178
4829 178 32 -15 -76 163 -108 -75 47 341 -106 -23 -267 173 51 -84 1 -195 50 8 223 -157 -261 33
4851C3N4j96k3l82L68L17P4j68O5j49J40J61j71L8k43k4OK50K3l55K16Rj65K14
4875I2q5k21J34J21L0k60J22q5r7L58m74J43J93j21N92l97r3J16k75J90K80k77
4897a4q4J81q3K02k49j66P2J38k63N39k35l1l3P2j25K66j14m35M56n7rk36J5K12
4921A9q3J80j80P4J1N1q5m6J68k37J80k4M7l93N01m12p6K70m7Oj40K35n6j22J85
4946B6m1K1j32N1J94k0j17k27M32j52J06R5n34M38j84J87m9l39K02P8J3p5j10
4969a37jJ65J23k65k48J44J18K34j02K00l37m1L46j49J42k93R4L4J3k25K83J0
4991A08k73K02J19n4l50L08j88K75j95J51l13j4M37J43m29J48j10n9L8J30P9l78
5013b25L39j67j78oJ38m8R2J51N8l74NJ92k7J71j04k03L10p4Q9l48M55j54n0J34
$$ plain form
4851 33 87 -109 -132 -514 -146 171 245 77 142 -7 133 294 123 161 -82 -106 -100 150 173 -182 34 43 -122 92
4875 92 7 -214 -80 41 71 -189 -67 -152 -249 109 -365 -222 -29 -150 442 45 -48 68 -207 -17 263 -14
4897 -14 -98 83 0 202 -47 -213 -141 -3 -266 273 38 7 -26 46 -79 187 73 -362 94 37 28 -208 -193 19
4921 19 -64 116 -64 10 21 72 -13 -59 109 -128 52 28 75 -318 183 -229 -305 -35 -82 -76 -216 19 -37 -159 26
4946 26 -15 6 -126 -75 119 99 -18 -245 187 35 141 236 -298 140 -44 143 94 -245 -43 35 48 -27 -137
4969 -137 -138 27 150 -115 -363 -219 -101 133 31 231 -106 -147 199 50 192 -101 -7 27 40 -185 98 108
4991 108 -165 37 156 102 -248 60 -128 147 -48 103 -210 -224 213 356 -73 75 -35 -94 -56 74 153 -225
5013 -225 114 -53 -231 -237 -99 -147 -55 96 154 -220 -215 -23 -50 121 17 -186 124 50 139 -209 246 92 42 176
5037A76q0Q1l55O6P4P1J19k36j15M09k29J92l18J60K0j55J27r0K12o4Q3R0qj68
5061F2m9o5K25k63K15k47j16L40qJ12k55j21J26N9K4Q4j43p8lJ12K41J6k60l9
5085c1Q3j28J38J6l88N41p3k9k53K87p5M3j11K0k83K86j2n8J9J55K5m70L79mJ25
5110B02k19l33L54L35j99o8kj05n4K06K0k61k2J42K7j96J90j45K65Q7j13j88k40
5133c17L27N0k12M06n45J55L01k16J75l39j3J93O55n44l00Q7n9j1R3J18p7n5J49
5156B1K10j33k73pJ90K8J37Lk56K00j06J53k14K29j87o3P1o0J92k36o6L62p5K37
5180C57m18q1J00k14K98k66M6l2K82J44q8j32j84J98o6K72o9p7k3J90l64J8J8
5203i1j33R4K52k73J64j10J49j4R1j88K4J1J65Mk70L96l13nj20M22j1m50M44m40
$$ plain form
5037 176 96 177 -178 -112 -38 33 152 -84 -199 210 -19 173 -145 15 35 -120 7 -83 129 65 148 238 230 62
5061 62 13 -52 173 -90 125 -122 -238 102 94 206 -49 -170 -44 15 39 123 -20 -98 -101 11 252 268 8 -31
5085 -31 52 -76 62 78 -310 231 158 129 -124 163 88 131 20 40 -243 43 31 -27 -8 147 172 -298 81 77 202
5110 202 -17 -350 4 339 140 72 70 -35 -89 117 137 -124 -146 -4 23 -173 17 -128 137 224 111 -77 -317
5133 -317 10 60 -152 254 -291 -136 165 -51 124 -215 -228 -35 620 76 -224 -137 -196 -207 -114 4 -73 -128 21
5156 21 231 98 -175 -182 8 36 173 176 -80 120 14 167 -47 182 -5 -68 3 -57 135 -101 -167 195 120 357
5180 357 -61 -142 -42 -256 42 -224 -178 -210 72 216 128 -4 -188 10 -56 216 147 70 47 237 -127 -109 -91
5203 -91 -224 -130 122 -151 13 -97 52 38 129 -59 -35 -24 141 145 -125 271 -42 -47 -167 255 244 -206 238 -202
5227b02M3K69j41k96L59J47k33Q6o3J83j05J78j72j49K8pNK01j84J4J44o4P6k28
5251a11J03n6k4J49l54L81j40K06j05K4J30k74J35J52j65M4k55Pk4lK53j20j10
5274a57K40j2K49k10k21K19P7k18K12k4j72j29R9J82N9M0l10p8L12k01Q9N7l48
5297b45K07L45l42j66L51p6Q2n7k16oK20p6L07k97k07J76K97n10L25j42n8J11
5319B3J95J0k75N2j80k3K30J28j58o3k5J52j16L15l02j27L51j96N5J27k75J6O6
5342b0P6q8Q8j30J3L59l46j5L6j17K62k23m4l7N8M21k96k2p5j58L27j37P3j6O6
5367E5Q0j42L2k3j48LJ08N8oK24j86k98M67j10j11l6j32J55kO6o0R4j27J47n1
5392E7l5j79J48m1O2o2K42r0k31K61j06J54j63r9l7J68J36k52Q1m08L68J51O0
$$ plain form
5227 -202 -159 110 -31 -327 32 179 -54 32 -31 152 47 225 53 -96 -68 -75 -70 131 -53 -39 105 41 117 -111
5251 -111 -8 -64 -88 61 -293 88 -52 154 49 73 203 -71 64 216 51 95 -160 -153 -177 -180 73 -47 -157
5274 -157 83 71 320 110 -111 108 185 -33 179 155 -17 -146 -47 135 194 234 -76 -154 158 -43 46 103 -245
5297 -245 -38 307 -35 -201 150 74 156 99 -117 -123 97 21 328 31 -176 0 297 -213 112 -30 -88 23
5319 23 218 228 -47 5 -175 -198 32 160 2 -61 -86 66 -50 265 -37 -164 187 -9 46 173 -102 -86 -20
5342 -20 56 -32 56 -74 -61 298 -48 -63 -27 -144 118 -105 -149 -186 -128 293 -3 -25 -100 -258 69 -68 5 -11 55
5367 55 135 -7 25 2 -146 -143 -35 23 17 241 55 -243 224 114 3 -33 -165 -10 -12 54 -6 88 -39 108 57
5392 57 22 -157 -9 -50 12 -50 192 102 -129 132 26 180 17 -82 -119 49 185 -67 14 -394 -26 125 185
5415A85j53k69L91j08j57K9J29l8J13j93J38k07J80j67J3K98j38J09k26O4J38
5436A31k1o1J06l26J92l4R6k85K08Q2RN3j98J93j02r1K28j29o6k07K20J78l14
5459a38rK85r6m4p1J05q9M4m7L28j09k76J24j28K17k84j35J99J40j46P8k49K55
5482d6J15K68l94J05k44J03Q6pK41m38J39R0j72N25l92N6j76K05n5K9p0r6K09
5505H1j83J94r4J7j87K03Q0L5l54J22j96M93k26Qj6m6L88k40j29Lj28J49Q5j87
5529a28M21n67L15R1l2j17p2pJ73Q7l23q4K07M6o3L34q4l13L0L69j76l5m06N2
5553b82M04J94j95M1j04j30KK34j23K43l55m0o5K61j62r0J66m2J43l49K31M9O3
5576I4j24j17J96j05r1N9J59J7k96J37K60l6o9r0kq2K81k83J78j94L33k25K78
$$ plain form
5415 185 32 -237 154 46 -111 -82 47 9 122 -71 67 -140 40 -127 -114 184 46 155 -71 -7 131
5436 131 110 49 155 -171 21 -13 83 -202 6 88 97 150 -48 145 43 -48 180 51 -15 -222 -2 176 -138
5459 -138 -147 138 42 -2 -73 32 -57 -13 -60 268 159 -117 7 -121 96 -188 -323 -124 16 -130 -52 -301 -46
5482 -46 69 337 -57 48 -196 -93 -7 -14 227 -211 -72 18 -154 371 -21 35 -141 64 9 38 -32 -128 81
5505 81 -102 92 -2 15 -172 31 111 146 -208 -86 -282 211 -15 -7 -23 -69 319 79 -50 -47 -175 -26 59 -128
5529 -128 293 -274 41 132 100 -17 -89 -96 77 164 -159 -243 -36 10 -53 281 197 -116 -86 283 107 72 -334 -282
5553 -282 122 316 121 162 58 -72 -70 164 41 284 -71 -111 -176 85 -77 -167 -1 -43 100 -249 -18 31 94
5576 94 -30 -147 49 -56 -147 -88 71 88 -208 -71 189 153 84 -6 -8 -90 191 -92 86 -108 225 0 278
5599B78j84j89O5m0J12J33j87l45L63K34j89k7l47K18q1J28l0J6Q4j84J60k8K29
5622A89n49m8N10j8J09l10K44k6J23m11M13p2k69J14m7p4K14k04R6J78n4J42j74
5645G6j18O2Q4k2j74J10Q2j40J30j93Q5L5j40R9J64k82J91M7N8k96P5L0o7K15
5669A11j5J80l31q9J93J4l7k93L05J12M6j57o6r3j27R3K33jL9l11J97o4lQ3L5
5694E4O6r6j51L09j70q8N6l8J63j39k06K39L7j7j40J3K66n3l21J31L8j10j40K91
5718fJ96j48K7k1J2J3jl24J13M27k28J1J98m19J01J73j95l5J59k21o5J86J13o
5742F0j11r3K89j48P6q9j68Q9M24k39o9j16j43O9K26j2j17k39k01M67K02m98K66
5765g5L6K66k63q3K5Q8J99l79J70O5l4m0P2J13P4l27K26k25K30l48J25R0q6J47
$$ plain form
5599 278 94 -95 -30 -70 42 175 -12 -357 6 240 51 24 -323 -105 -186 -58 -88 -72 12 -172 -12 -40 189
5622 189 -360 -408 102 84 193 -117 127 101 224 -187 226 154 -115 -1 -48 -122 92 -112 -16 162 108 250 76
5645 76 -42 20 104 82 -92 18 100 -40 90 -103 -18 17 -123 -24 140 -142 49 96 154 -142 -67 -37 -104 111
5669 111 96 276 -55 -144 49 63 26 -267 38 150 196 39 -27 -120 -247 -154 79 78 117 -194 3 -61 -64 19 54
5694 54 120 24 -127 182 12 -76 -20 -58 105 -34 -240 -1 36 19 -121 -108 158 105 -216 -85 -47 -157 -297 -6
5718 -6 190 42 69 48 60 73 72 -252 -139 288 60 71 269 -150 -49 124 -71 -106 53 -168 -233 -47 66 60
5742 60 -51 -144 145 -3 73 -16 -184 -95 329 90 21 -95 -238 -169 57 45 -72 -311 -512 -45 157 -341 -75
5765 -75 -39 227 -36 -119 -94 -6 193 -186 -16 49 15 -25 47 160 234 -93 133 -92 138 -210 -85 5 -81 66
5789F6J76p9k47J06m6K29k44K65n20L32Q8r1O8m32M86j22Q6j16j24Q5P0n7P1M6
5813I6r4J53k30J31O4m93L08J85j29M3P7J8n5l22M93n2j17Mj68J69j17m9j00J34
5837e1L11j28k64p0K3J63k4qo2k07L37k1J58k88J49k7Lj22O4Q2l39K69K69j79
5861C8j89P2o6J07J72j94n9j28L77K2n5l4k85J40K32k18J87J29l39L75k35J58
5883B07k13N5Q6j52j08j01J63K51j5m5r9k14J92k2J13j47k73M9J53j9K41j38J48
5906A12k50n4K53R5l62M8Q3K75J31N6n60K04l8o5j34J99J08j11L11j95K65o04
5928b33K64M1P3j21k80l8K62j04K08Lk25J17K29J2o5k87o7K80J3P1j02n0J6lk3
5953iN1j92J1K32K50l90N2r2n9J52P9j14Q9m64M97%l63M81k40j24M17j91l26K00
$$ plain form
5789 66 242 163 -84 22 -24 205 -39 226 -294 38 126 35 103 -329 157 35 121 5 -119 -34 36 -21 50 96
5813 96 2 155 -75 56 120 -373 -65 120 -9 34 111 129 74 -248 245 193 76 80 -88 81 -36 -85 -185 -51
5837 -51 260 132 -132 -202 -179 -16 -40 -48 -110 -317 20 -1 157 -131 18 -9 -6 -128 -64 18 -321 -52 217 38
5861 38 -151 -79 -145 -38 134 -60 -119 -247 130 152 97 63 -222 -82 150 -68 119 248 -91 284 49 207
5883 207 -6 49 135 -17 -125 -226 -63 188 173 128 29 -185 7 -15 98 -49 -322 -273 -120 -139 102 -36 112
5906 112 -138 -192 61 156 -206 -158 -75 200 331 387 -173 31 -7 -72 -206 -7 101 -10 301 106 371 -233
5928 -233 31 72 145 24 -256 -294 -32 -136 72 75 -150 -33 196 208 143 -144 -211 69 82 153 51 1 17 14 -9
5953 -9 42 -150 -139 93 343 -47 5 -87 -146 6 85 -29 60 -404 93 93 -270 211 -29 -153 264 73 -253 -53
5977e3j77P13l76N0k0k25P4P3j16K13j89j39J15J49j77r9J21k3OJ50k84M9j3K36
6001E8l06K51k41O6L11k16K12k65q1j71P22j41k49N5j8J25j58J5o6O2k50K36J4
6024c5o2k63K3O16j63l97J93R9q1p4L93l13J6J4J57m0m6j34O2j60M21j73k31r8
6048b76M20J17m06O1l6L33l14J6J43K31l03M6k6K11k80j25Q5L48j09j00j48NO5
6071d2K07k78J75k3k17L93O9k04q8l6R6k2j61L87j32O0j92K76k87N8O3j17J13
6094I8q1k7o2J82J76m81L25k21r3M69k04n0N4k10j64K82K15j33j07K4J95j8P3
6117B42l17r2j12M55k91K69j83p9J15o8J95k70M14m56K40K95m06R2p8j51J96Q
6139A8j1j69L52r3K18m89L2K29K02l20L5N2j0k13K01n7pk40K77r7M32m24R4j2
$$ plain form
5977 -53 -230 483 107 157 137 -88 -14 59 -57 156 -33 -172 -57 92 -85 -184 -63 -86 -80 70 -214 -165 -178 58
6001 58 -248 3 -238 -172 139 -77 135 -130 -211 -382 340 199 -50 5 -13 112 -46 -31 -97 -35 -285 -49 -35
6024 -35 -97 -360 -337 279 116 -281 -88 11 -70 -144 249 -64 -48 -34 123 83 37 -97 -35 -195 226 53 -178 -276
6048 -276 144 261 -145 -84 -120 213 -101 -85 58 289 -14 32 6 217 -63 -188 -103 245 136 36 -112 -107 -42
6071 -42 165 -113 62 39 -178 215 284 80 -8 -44 52 30 -131 256 124 184 -8 268 -19 39 102 -15 98
6094 98 17 -10 -72 110 286 -195 130 -91 -184 285 81 31 85 -125 -289 -7 208 75 -32 -8 187 169 242
6117 242 -75 -167 -279 176 -115 154 -29 -108 7 -61 134 -136 278 -178 62 357 -49 43 -35 -186 10 18
6139 18 7 -162 190 97 315 -174 -142 87 289 -31 4 56 46 -167 34 -23 -30 -270 7 -90 342 -82 12 0
6163@l36O73j48j49j00oJ90q5n5q4Q7k0M12j86j42j41K1L12j20N1l03qK44N2J03
6188B62l04k35K22k3RN7l4p1K55J20k18P0q0q9j3J25k29J56j2L0K19k86p4O3J15
6213C5o0K93k77k03L60j3j01r4k20Q1L17K50o5k85J80k20O2L7j70l8O0L6J55P8
6237A98j24k2P4J89l16J03k86M48k08J50k46p2K29k01K81p2j79Q7K0J23j16J97
6259B57j61m58J13J33L64k45mK68j9j26R0p8m4j48J84J40m07j03K01J16j99K63
6281A37m31O16m94o1J57k36J89J93j77K67k36m5J90J69j31qj84rJ18o2K98k58
6303Bk24M2J41K76p9j02J28Ok08K35o5k69K98n4j76q5N8j93oM08l3k12j0Q5K04
6328A67j69k01m1K63o9jk30M50k25k2J11L7l01J45P4Q3L3j1K8k01Q3lQ0k67q9
$$ plain form
6163 0 -336 337 189 40 -60 -66 124 39 -16 -100 -13 -33 379 193 51 -90 -69 243 123 174 -129 -137 107 159 262
6188 262 -42 -277 -55 -78 -69 -12 -46 -117 138 258 40 110 30 -59 -72 53 -176 -20 -32 -2 217 -69 -143 -80 35
6213 35 -25 268 -9 -212 148 135 34 -60 -280 -199 118 368 303 18 198 -22 40 77 -93 -131 -71 -35 120 198
6237 198 74 52 126 315 -1 102 -184 264 56 206 -40 -112 117 -84 197 125 -54 33 53 176 60 257
6259 257 96 -362 -249 -116 248 3 -1 267 248 122 212 134 90 -58 126 266 -141 -244 -43 73 -126 137
6281 137 -294 322 -172 -233 -76 -312 -123 70 -107 160 -76 -121 69 238 107 99 -85 -94 24 -38 260 2
6303 2 -222 -180 -39 237 158 56 184 190 -18 217 152 -117 181 127 -49 -134 -76 -269 -275 133 100 -112 -122 -37 167
6328 167 -2 -203 -244 19 -50 -51 -281 169 -56 -78 33 70 -231 -86 -12 71 104 93 121 -80 3 0 80 -187 -276
6353b76L26l4K0o4k53L27j86M34k98k08J77m5L55l22j50J83j9J0J14j39Q8m0K25
6376B25j09k3M4l02N74m30K43l26j56J56oJ16L4M2p1P7J01N4j85j05J46j90J07
6399A6J78L3k98l0J41N5q3k05Q5M8r0J92j46J95m4k1M0k78n7L94M3l70J99p5j61
6424b39K51J4p2N5n3R5j24J3MP8j6O1J42J16l48O7N2J07j10j79j15Q9Q7J92O5
6449B32k51k17K87j01J95O9l90J42P8R2m9k13Q0j25J00K28k70R2j66J90p1K14
6471A46j99P1Kj14J77k87L07j12j1J78K46n09J04J31l38L93j83r5J85P7k40J56
6493H5j70P3J38r5R8l93K10J72j57J9J58l91K22K26K33k28l97j39K16J70P6j89
6515f3k81J26J55J19J23r1j85k3M75n04R8J26l53L10QJ61m39K81j30J93l34J96
$$ plain form
6353 -276 50 16 36 -28 -281 46 -140 294 -4 -212 -35 -80 275 -47 -197 -14 -33 -23 91 -48 40 0 225
6376 225 116 93 137 -165 409 -21 222 -104 -260 -104 -110 6 40 82 11 88 189 243 58 -47 99 -91 16
6399 16 194 227 -71 -101 40 95 12 -193 -108 -60 -150 42 -104 91 47 26 66 -212 -269 125 168 -202 -3 -78 -239
6424 -239 12 26 -46 9 -44 51 -73 -60 -56 22 6 67 209 325 -23 44 96 203 93 -86 -201 -112 -25 167 232
6449 232 -19 -236 51 -50 145 214 -176 -34 44 136 87 -126 -46 -171 -71 157 -113 -21 -187 3 -68 146
6471 146 -53 18 20 -94 83 -204 103 -9 -20 158 404 -105 -1 130 -208 185 2 -93 92 169 -71 85
6493 85 -85 -12 126 31 129 -264 -54 118 -39 -20 138 -253 -31 195 428 200 -197 -336 -120 50 126 -63
6515 -63 -344 -218 -63 56 179 88 -97 -120 355 -149 -51 75 -278 32 40 201 -238 43 -87 106 -228 -32
6537c2j09K22q1K6j1jm9J70Jp3j40n6J97k19J80j8j47K59j07l38M50j31J66n91
6561d32M33Q9Q8k65j46J44N2O2j78M02j71j02J45k24L03k84q5J83J77j77j8J40
6583A36J7l8N5l51L96k09J69r0j72q5N7K08Jl17K77l9J1J18l35J22o9J87J42n2
6607A39k22O3q3K15oJ96k98O7J14J01l59n6K0J00K24l69Q5k42K75k3J18k21j05
6630b67J80k76N74k83J23m83N74J4K8m55J0J50K2J49K33l79j4j30OK04n4K54k82
6653a02K24j81K50k54l1LM34l08J69k86j64L38J37k49K5n24M09J37J5k7j03j42
6675b30M0L49p3k6p5j16L32k78J30q7j43lQ9K39l87L22j1J02K0l35o0K89%P1j57
6700BM7j30r7J81J69j91nK0j93K51N8K2j37K26j12j57k7Q5Q1J20p6j55j92M6K75
$$ plain form
6537 -32 -141 81 0 26 15 14 -35 135 136 63 -77 -133 64 -155 25 7 -140 119 12 -326 124 -7 159 -432
6561 -432 1 90 178 -87 -233 -89 -37 25 -153 249 78 -24 121 -103 200 -84 -169 14 191 14 -4 136
6583 136 153 115 170 -181 215 6 175 85 -87 -172 -115 93 94 -223 54 15 26 144 -191 -69 -138 49 191 139
6607 139 -83 -20 -103 112 106 302 4 71 185 286 -73 -129 -109 -9 215 -154 -69 -311 -36 -59 59 -162 -267
6630 -267 -87 -363 211 -72 51 -432 142 156 184 -271 -261 -111 -89 60 293 -86 -100 -230 -224 -20 -74 180 -102
6653 -102 122 -59 191 -63 -94 -91 343 35 204 -82 -246 92 229 -20 5 -519 -110 27 42 15 -88 -230
6675 -230 -190 159 86 60 -15 -131 201 -77 53 -34 -177 -180 -91 148 -239 83 72 174 194 -141 -201 88 88 159 2
6700 2 49 -81 -178 3 172 -19 -24 -4 -197 54 112 134 -3 223 111 -46 -73 12 93 213 137 -18 -210 -164 111
6725A11J67l63K46k64jK86l49J60m5O3j53J40P0R2l49j12K93N9j73k42M25J23
6747A84k73J10Kj80K92R2k41k4k3Pj3Q3J4m33O0M57N1O5l32j49L07o3K88l50n7
6772a26Q7R7q1R2N5r3l6K28j23j99j01N5J93M9j84j74R1M12N0k46r3p7J97j5J59
6797B17j85l22L01j23J05n5q3k54L15L02J28l85L8J21l9M4l45N0J54N6n2j79R4
6820i7L0j19J76K71l14pj63J43M56l43o7j99J45L47k49M4j80L5L13j4p1k52L15
6843B00m23L14j93K41j59N9k2K22j57Q5o0k51K48j47K9K39m62J7M84p4j59k38
6865b07K01J77j47m4k11M1R6Q1j42j63K65M7L0p8j59L26k7J20l1k28k54L52j3
6888C2O3Mn8k91J43L19j79k06J08m2K22q7q0j31R0O2Q5R9l82n4J18J88j36r2K2
$$ plain form
6725 111 278 -85 161 -103 -104 182 -167 -7 -52 11 -142 -2 68 160 -189 -301 -8 51 -122 -364 61 184
6747 184 -89 21 23 -157 135 227 -14 -38 -61 -54 -67 16 30 -403 -343 114 165 230 -102 -251 56 -7 281 -69 -126
6772 -126 -39 58 -23 69 124 31 -5 223 100 -99 -200 -145 48 97 -87 -261 -170 242 292 46 -47 -124 73 58 217
6797 217 32 -290 11 -112 -7 -62 -145 -399 -84 218 346 -39 -1 120 81 125 -220 -170 -16 40 -12 -191 -97
6820 -97 -67 -186 -10 261 -53 -60 -223 -80 376 33 -34 -233 -88 259 10 54 -126 -91 222 208 137 -115 200
6843 200 -223 91 -102 139 -20 39 17 239 82 167 107 -144 104 -43 -14 225 -237 -220 264 190 31 -207
6865 -207 -6 171 24 -20 -231 -190 -94 -13 -155 -318 -53 -6 24 -54 -213 113 86 206 175 -53 -307 45 32
6888 32 95 99 41 -250 -107 212 33 -173 -65 -107 115 28 -52 -183 -93 -31 54 153 -229 -283 -165 23 -113 -205 -183
6913a83K40k03L28j11mj4j62L85k08j2j40L2j9K39p0k34j99K91J88l22L83k38
6935c3N0k31K02n2M06m21Q9K44j70k84J7K80j52j3K6j82K14J00l4j04k6P8o0K74
6959B18n5ql27J44K23j93O9k55J01j09O8J42Lj72N3O4q5J62j69k7J19j55J94K20
6983B25l89J93N6j78K35m95K76l6K76j69J66M7l19J41k4j19J4J72j19m9J62j59
7005i3J66l35K55K91j38l97K69jJ08p9Q9l39j1N5L90k08n3j20L30j28O9j6j46
7028d2P2K16m2j28j64p9L15j8n6j99R0K8p8N3k6R2j20L07k73l3j27P27m46J07
7052A76k07j41O6On5J98P6m6j11J39R2j46k20L8J54K93j67N4k06m4J05O6k7j4
7076G9K2l09L29j23k36K64P5J60j31R0k89k1P2J90k23j13R8j48L22J95j95j81
$$ plain form
6913 -183 57 -146 182 71 67 53 -109 276 68 56 -84 -52 -71 168 98 -136 -335 -44 144 -178 205 -33
6935 -33 17 -214 -12 -64 342 -79 10 254 84 -200 -183 97 -55 -68 -42 -224 -10 90 56 -48 -74 4 -56 218
6959 218 163 155 -172 -28 195 2 71 -184 -83 -192 -124 18 21 -151 -98 -34 -119 43 -126 -153 -34 -189 5 225
6983 225 -164 29 85 -93 142 -353 -77 -113 163 -6 160 207 -112 29 5 -114 -100 72 -47 -96 66 -93
7005 -93 73 -262 -7 284 146 -251 18 17 125 46 135 -204 -215 -160 230 22 -31 -151 179 51 120 104 -42
7028 -42 30 246 204 76 -88 -167 148 130 74 -125 -35 -7 -85 -32 -58 34 -86 221 -52 -85 -212 515 69 176
7052 176 -31 -172 -106 -100 -155 43 119 73 -38 101 193 47 -173 -135 19 312 145 199 -7 -51 54 120 93 79
7076 79 101 -208 121 -2 -238 26 101 261 130 220 -69 -90 -18 172 -51 -164 -66 -214 108 303 108 -73
7098g3J2J56k5m4k21q8M51kj70j7K46l92J32J2J53k78l9K81m1K5P6m0n65M37J9
7123EJ4j70L72l2r6j54p6j4J47M6j24K14k04j4L1J23k56K39k71K14K55j65r0j52
7147a58N6K03K4J03k35K2J34Q4r4k48j74J51M1J88n8l65Q7L50j44j99M46k16j03
7170a05J82L23m74j00K40j20K83J2l79J13r3J56n6J14l1l04R1K53o3j06m7j02
7192b13N21l87l3M61m74Q1J58k57R3J18K77n17N40n91K45m3J38O4%k65J03j6k0
7215a7m8j04K31J75l70M45l54j39K02k81J60J23j10J50j48k4J20J94j30l97M55
7236A33L2n8o9j42K03j35J47j74j03P0L77K6k79n1p4K13L7k79l7J63k19J34L33
7259B48j67l06M0O8M88j32k87Pj78K87pL8l4k85J65J79k00K46k81J0L82j55n2
$$ plain form
7098 -73 -61 95 70 26 -195 -283 168 166 -4 -21 225 -167 -35 -23 130 -148 -187 94 53 78 154 114 -451 -14 5
7123 5 19 -151 221 189 93 -61 -137 -151 -4 42 -82 132 -72 -86 -55 68 -188 51 -220 -6 249 84 -6 -158
7147 -158 -102 101 125 228 -7 15 149 233 139 -109 -283 -132 -91 97 39 -326 -239 111 -33 -232 214 -2 -105
7170 -105 77 400 -74 -174 66 -54 229 241 -138 -25 -118 38 -18 96 65 -239 -148 105 42 -64 -111 -213
7192 -213 308 -79 -112 349 -125 -44 114 -143 -50 68 345 -172 368 -223 22 -21 117 181 181 -84 19 3 -17
7215 -17 -65 -169 62 237 -133 312 -42 -181 21 -260 -100 23 -87 63 -85 -109 11 205 75 -322 133
7236 133 165 107 38 -104 99 -36 111 -63 -166 -96 281 307 28 -23 -97 116 153 -126 -163 0 -219 -85 248
7259 248 81 -225 -185 -117 371 239 -48 -41 -219 68 61 99 65 -220 -55 124 -76 170 -111 -101 281 126 74
7282G4k72J54ML71k50l45K62l1J43j34j33P0J40j44K2k6R2k95K11J30J39q4rj17
7306b8K83k30k32K44j95L87k40J22k14R8p5J33j51j36J56k80L17J96J65j77m07
7327b64J44K81j51j50O2N7K99m3Ol55K77j19J70j71q0J07M2j53J08P3k04J35j97
7350a26J5K36K9k99N7J31k1j60j45K89j78N59j50k87J36K04n3l23K47n71K49J94
7372C3K71l78q8J23j64J94K41l51J03j78J41Q3K1j21j87J70q5K48j16n9l23J79
7394b43L94m92L20k5j91K15L15l91P8K2j2J06j66r3J17J24k0J19l48J97N5k16
7416a35M78m10J22j4q4P3Lq1j00M92m71J14N4J02l32J83j33K27N5j97k6P0K57
7439B47k17Q0J08l69K25R0k80j27J36J51J0n2j15J85J47K6m21M03j13k46R5J6
$$ plain form
7282 74 -198 -44 -40 331 81 -264 -2 -33 110 -24 -157 -87 53 -91 -69 -95 -3 -298 -87 43 182 98 89 -28
7306 -28 255 25 -207 37 -158 229 -11 111 -103 -5 -80 53 -98 -234 -78 -358 -41 155 320 143 -264
7327 -264 -120 161 10 -140 -78 -21 278 235 241 -114 163 44 214 43 -37 70 112 -41 67 140 -64 71 -126
7350 -126 -111 125 154 -145 -88 43 22 -138 -283 6 -172 387 237 -50 86 290 237 -86 161 -410 -161 33
7372 33 304 -74 -162 -39 -203 -9 232 -119 -16 -194 -53 30 51 -70 -257 -87 -172 76 -40 -99 -422 -243
7394 -243 151 -341 -21 -46 -237 -22 293 -98 -20 2 -10 96 -70 -163 -46 78 58 177 -171 26 81 -135
7416 -135 343 -67 55 41 -43 30 33 -48 -148 344 -127 -13 41 143 -189 -6 -139 88 143 -54 -80 -10 247
7439 247 30 110 218 -151 74 164 -116 -243 -107 44 54 2 -113 72 219 245 -176 227 114 -132 -37 -21
7461b1n9jK1J47j6j65J57J83m75K57j89J66k74K27J97j77K68m90J93J96L0k07
7483c2J9l38M90jpk50J35M3J26p6j70J0j39J67L13l16l4M7n3K51M0l46QJ56J18
7508A61r3J80l26J85k61L56q0j83oj01K90o7M9j90j73J87J76j18k0J09k37L6J66
7531D0j28K12m06K35K83j19j13k66K2L20J47M1l52K38q1K28p8k48k35J65K01J62
7553B68l42o2q7J47M08j94L1l44J22N0P8l6J25m26J00N13k01J39m31L80m08M20
7575B50p1l01J73j13k0J72j28k28P4J46L41n14J33J96J82l28M60n10l4O4L20n0
7597B14r5j68J36k04L43l09k82L17o3n1J11j57p7J20J57R0M6j74M4J91k12N26
7619E03m89r0j87M29J6m08K13J18k43L17n1p5j33J91j91L6J43J24j56L2j80K69
$$ plain form
7461 -21 -80 -81 -60 87 71 -94 63 246 -229 28 -161 5 -269 -42 155 -22 246 -244 -51 145 175 -32
7483 -32 -13 -351 139 138 131 -119 16 59 185 109 -61 -51 -190 -23 290 -26 -60 -13 -66 185 225 -121 -113 43 161
7508 161 68 248 -78 107 -154 202 122 -61 -67 -168 122 55 104 -86 -259 -72 104 -14 -34 75 -162 -126 40
7531 40 -88 124 -282 -47 236 117 4 -262 -240 80 227 268 -84 154 73 301 223 -25 -260 -95 106 268
7553 268 -74 -136 -223 -76 332 138 169 -175 -53 -3 75 39 164 -262 -162 351 150 289 -142 238 -170 250
7575 250 179 -122 51 -62 -82 90 -38 -266 -192 -46 295 -219 -86 110 292 -36 424 -86 -120 -56 264 214
7597 214 119 -49 87 -117 226 -83 -365 -48 -111 -162 -51 -208 -285 -165 -8 82 128 -46 -2 189 -23 503
7619 503 14 -76 -263 166 182 -226 -13 105 -138 179 128 53 -80 111 -80 -44 99 223 67 99 -81 188
7641A88k64k78K18n5J83L19m57NK97M6l79K98k20J89J26j45r9N1N0m0m6J21L7
7664A45k88J87l4j02l2J40j73J74k39L13k38J31m1J46j42j93J63j38M94l53K36
7685A56l72L4P9M86l37J23k98K36j57O2J47k35l6M99l63p5K19j39qK7qr8L9J65
7709A46l85M33k52N5j18n6P7K10l59L88N6k03K52l74J74k7L02k50j44L2J25J14
7731A96j79k1O5q9N1n3Kl1l3J49l0j28K31k54J41J63K1j65J53j89N4P9k27K5L39
7756B70p8j67J38j6j63j16J15l2Lj0j32K26R4k44J92k4q2r1J93j30L4L24o17L33
7780B0J20P8l12k33O3J92k7K51j81J62l9L5j14J53j48j98q7K05J1p6K4K18l2k90
7804b05J11k46M43Q8p6j61j75K32k9k7j88M38l44K20j71J79q5j24K90k92L29j28
$$ plain form
7641 188 -76 -354 -136 -191 -8 311 -146 -141 156 202 -177 121 -99 90 216 71 -28 23 73 33 -13 108 145
7664 145 -143 44 10 -92 -124 16 -157 17 -222 91 -147 -16 -57 89 -53 -246 -83 -221 273 -80 156
7685 156 -216 -182 -103 383 46 169 -129 107 -50 12 159 -76 -112 387 24 -51 168 29 21 48 40 -58 -19 146
7709 146 -239 194 -58 -3 -121 -177 -100 110 -249 139 195 -8 244 -130 44 17 319 69 -75 -43 82 196
7731 196 17 -4 61 -28 23 -30 -28 -59 -92 57 27 -101 130 -124 17 180 201 36 189 0 54 133 -94 -69 270
7756 270 192 25 163 147 -16 -132 -17 -49 -46 -56 -188 38 132 -112 80 56 -26 -117 76 -54 -20 304 -313 20
7780 20 140 218 -94 -327 -264 -72 -99 152 -29 133 94 129 15 168 20 -178 -265 -60 -49 -125 -101 117 85 -205
7804 -205 -94 -340 103 191 115 -46 -221 11 -18 -45 -233 205 -139 81 -90 89 4 -120 170 -122 207 79
7826G9p6j28L53k68O2J65l30L4J61m5l7n6J29p6R7J31j74M2k19L93j50%k75K49
7850F1J04n2O4j0k02K43j88k4k1K6j6o6K47l89K75j2mr9k5L65l31J50j08k5J54
7875A17j10j73R1J57j92J47J94r2j13N0p8K6k77L76N4m73L47j77R7J38j85o8m3
7898a87J19Q2K3m0l77K99%J20P7k41J1j98L89K38j97m2K5k32J36J66k00L08j31
7921A48k68L08k88J78j34J16J9k72K53j12n2J79k47j0P5r4L01J97k30l6j16K49
7943A64l70J86K13k91J36Q6k01K23j71m0ON5N6P8j18j62J15K68j78O7J49m19J69
7966B1K2K1K9N2k10L07k18j02J50m5l7m3J41LJ25l50J17OLM7J63j98K41j08m17
7991b80M64k65J07k95L31m01K77Qj0j3J9K23k16J86O5N2l92K5K21r8k36K68j10
$$ plain form
7826 79 3 -125 228 -40 22 187 -143 -109 52 7 -30 -86 43 -33 64 195 21 63 -156 237 87 87 -188 61
7850 61 165 113 177 167 -35 208 20 -4 -25 1 -15 -81 166 -223 52 40 36 -63 -88 277 -54 96 -12 -37 117
7875 117 7 -166 -75 82 -110 37 231 139 26 76 -2 24 -253 123 177 -296 51 -126 -29 109 -76 -144 -187
7898 -187 -68 14 37 -3 -380 -81 -81 39 116 -125 -114 -312 77 315 118 76 101 -131 5 171 -29 279 148
7921 148 -120 188 -100 78 -56 60 79 -193 60 -52 -104 75 -172 -182 -107 -201 100 297 67 31 -85 164
7943 164 -206 -20 193 -98 38 124 -77 146 -25 -65 -59 -4 52 130 12 -150 -35 233 55 122 271 -148 21
7966 21 43 64 93 145 -65 242 24 -78 72 27 -10 -53 88 91 216 -134 -17 -11 -8 39 202 4 245 137 -280
7991 -280 184 -81 26 -269 62 -339 -62 -54 -64 -77 -58 165 -51 135 200 252 -140 -115 106 8 -228 40 -70
8014g0O2o3jJ06J00Q5k33j9l08M84r9J26L5l32KJ70qpk67Q9Q9J51j1rk61J86Q7
8041H4j44K22l75M04J3l15K84j62j52j30L77j97K25j91j46K74J2J4n3k38J10p9
8063a63J49J66m25K07P8J77l94L13%q7K51p8j70j9p5J9N1k5J02k64L59j78K63
8086B57k42o8n9J07P1n0K7P9m85M03j23o9P7K29N6k74k82K50J40j09m9O1M2J16
8110A05j68J10n4J27N4l08J1K8M32n12L00j04l5l6n7m5J15M6J81m28P90j80l35
8133C7n3J82R5l06K69j50j2j93K29k68J47O4l1j72j12L10o9n0r4J8q7N9J45L40
8157B98k25R6J71m07R2j96J4K23K18l40K66k21k29L72k15j33M15j71n8K77j16
8178A31k14L2M5l21M34j3j14K2k27J32K80O9k25
$$ plain form
8014 -70 -8 -71 -72 34 134 219 -14 -33 -341 143 44 170 205 -127 -125 45 37 30 -237 -148 -59 92 81 72 -189 -3 84
8041 84 -60 162 -213 191 204 -111 173 11 -141 -271 106 -91 134 -57 -203 71 83 97 44 -194 -84 -163
8063 -163 -14 152 -273 -66 12 189 -205 108 108 21 272 194 24 5 -70 -51 0 -25 77 -187 172 -6 257
8086 257 15 -53 -112 -5 66 16 43 122 -363 40 -83 -152 -75 154 210 -64 -346 -96 44 -65 -114 -53 -11 105
8110 105 -63 47 -7 120 174 -134 -123 -95 337 -175 125 21 -14 -50 -107 -152 -37 9 190 -238 552 372 37
8133 37 -16 166 261 -45 224 74 62 -131 98 -170 -23 41 10 -162 -274 36 -33 -83 -177 -159 -246 -187 -42 298
8157 298 73 169 340 -67 25 -171 -157 66 284 -56 210 -11 -240 132 -83 -216 199 28 -30 247 131
8178 131 -83 -51 -6 -327 107 94 -20 2 -225 -93 187 256 31
8191C1
$$ Imaginary data points
##PAGE= N=2
##DATA TABLE= (X++(I..I)), XYDATA
0@%%%%%%%%Qj6J6j6K4l2M0m8N6p2Q8j04J28j53J78k17K56k96L45m01M65n37O17
31C29p02P98r05J022j153J297j453J627j818K024k250K499k771L066l389L742
47A963m128M551n013N521o084O706p394Q163r026J0004j1124J2416j3928J5724
61H351j7901K0608k4072K8686l5174M5019o1892R8397l10919K68466M00428p08530
73b88533J83269M10724l72648j52493M41701j35586k59983J31015R7028l5678
83A8816K8608q4205K6752L4579j09180J22962J74713l00632q5705L39409p5876
94I0241k58726J79746K7229j87392J52252J34562j44954o120J4975n8602J07945
105E1156O827j65129P0338P4417q7526J07405M1834k24156N8694J89810j21386
$$ plain form
0 0 0 0 0 0 0 0 0 0 8 -8 8 -8 16 -16 24 -24 32 -40 48 -56 72 -81 97 -120 136 -160 185 -216 249 -288 329
31 329 -373 425 -480 542 -611 686 -767 860 -958 1066 -1184 1315 -1456 1610 -1779 1963
47 1963 -2165 2386 -2627 2894 -3190 3516 -3878 4285 -4741 5263 -5861 6555 -7373 8351
61 8351 -9550 11058 -13014 15672 -19502 25517 -36375 62022 -248897 19569 419997 -288533
73 -288533 -105264 305460 -67188 -219681 222020 86434 -173549 -42534 54494 18816
83 18816 47424 -36781 -10029 24550 -84630 38332 213045 -87587 -173292 166117 90241
94 90241 -168485 11261 38490 -148902 3350 137912 -7042 -13162 1813 -56789 51156
105 51156 57983 -107146 -36808 37609 -49917 57488 99322 -124834 -66140 123670 2284
116B284j6541J11879j54529k5170J80969j05505p9632J40305j02751m3746K67623
127A75186p6759k57643J65856Q1737j90946R7123R7645j96865L0737J78433q2139
138B2365m9214N5939p2742R877J03824m3229l2610M101p3667O7143J02815j38370
150d3768m0019J51172m5576m5568J32351q2356j56550J24815N8410j04328N7245
161E828K8518j08097O7933J04349r0289n0132L4302r962L8434K7369o8187j0205
173c0139J2592k5679P3436K7048j18860L4684J08819q0542r624Q5556j32461p1432
185a26602J86907Q145j38280P2457M8535r0690N3554O6738j03246l8626O5342
196D234J3414J163j3800m6421J2373K2240j44N3365j7103r5138O4243Q8271r7129
$$ plain form
116 2284 -14257 97622 -56907 -82077 98892 -6613 -86245 54060 -48691 -92437 175186
127 175186 98427 -159216 6640 88377 -102569 -5446 92199 -104666 -73929 104504 22365
138 22365 -26849 29090 -43652 -33775 70049 26820 -5790 -1689 -75356 -8213 94602 -43768
150 -43768 -83787 67385 21809 -23759 108592 26236 -130314 -5499 52911 -51417 5828
161 5828 34346 -73751 -5818 98531 8242 -41890 -7588 -17550 20884 48253 -19934 -30139
173 -30139 -17547 -43226 30210 57258 -61602 -26918 81901 1359 -8265 77291 -55170 -126602
185 -126602 60305 68450 -69830 2627 51162 -39528 14026 80764 -22482 -61108 4234
196 4234 17648 18811 5011 -41410 -29037 -6797 -6941 46424 29321 -65817 -1574 86697 -10432
209a0432l6445O7663o4610k1025J35834j1176j13010M6740N0702m7000J5286J5732
221B8259o5748l994O0959J5029k4853l9358j0510M6435J4941j4704J9567k8843
233b820m6735O6841L3462r1653j0618N5647k4733K2303P2364o1272o6615O5870
245A2041K6027m3955P557n152l4831L4159M5464k2088l4576j0659J9435L5398
257B8820k129k2469q140k5486N037N6045k3437o9287L6614N0621k3485K2062K2433
270D7199p7213k1409Q1280r8n7062J2159J4379j4782L0690L1125m0144m3391K6347
283a0920N0055p431m0266j486O06k5137L1888M3993n9836m0865P8915L0005n1711
296b190J0790O832o4069J4120P6894k5331o0951K5427L6779p325K398P938k6743
$$ plain form
209 -10432 -46877 20786 -43824 -64849 70985 59809 -53201 -6461 44241 -2759 12527 28259
221 28259 -37489 -41483 19476 34505 9652 -29706 -40216 6219 21160 6456 26023 -2820
233 -2820 -49555 17286 50748 -40905 -51523 4124 -20609 1694 74058 12786 -53829 12041
245 12041 38068 -5887 1670 -3482 -38313 -4154 41310 19222 -15354 -26013 -6578 28820
257 28820 26691 4222 -3918 -29404 -24367 31678 8241 -61046 -24432 26189 2704 24766 47199
270 47199 -30014 -51423 29857 29759 -27303 -15144 -765 -15547 15143 46268 6124 -37267 -10920
283 -10920 39135 31704 -8562 -10048 -9442 -34579 -2691 41302 -18534 -59399 19516 49521 -2190
296 -2190 8600 15432 -48637 -34517 42377 17046 -43905 -18478 18301 10976 13374 21312 -5431
309e431k5432L4236M7641l4019o1192K2343L3576k3739J4502L2936n2421k2978
321c9978Q1079J3049p6289p126K6577k3336J3421M8148k9307n0070L3068M9704
333C8940j6095l1151K033j279q469K9815K2146n1351l4652M9911K7364k4283R902
346A2831J709l9562K2247N0785l9983m9753K2845J3068r85L1420m453m5153P697
359a7287L9271J157j9158j7638j0027J3356K0511M170j4654k8800M754M8903R454
372C4012l3912p77J532j9217K8889K4331n7181k7390N4350J7179j7063J7081j1701
385A0133m0086K5971M3133k8161m0445P080J7839M390P375M913k2651k1281L7233
398E443M3689l7456m1847K8663L831k4836L7229R835o9574J1422Q0480j6626m2369
$$ plain form
309 -5431 -30863 3373 51014 16995 -44197 -21854 11722 -12017 2485 35421 -17000 -39978
321 -39978 41101 54150 -22139 -29265 -2688 -26024 -12603 35545 6238 -43832 -10764 38940
333 38940 22845 -8306 -6273 -7552 -16021 13794 35940 -15411 -50063 -152 27212 2929 12831
346 12831 14540 -25022 -2775 48010 8027 -41726 -18881 -5813 -6798 24622 20169 -24984 -17287
359 -17287 21984 23141 3983 -13655 -23682 -10326 10185 14355 -299 -29099 -24345 24558 34012
372 34012 100 -677 855 -18362 10527 34858 -22323 -49713 4637 21816 4753 21834 10133
385 10133 -29953 -3982 39151 10990 -29455 -22375 -4536 -146 7229 12142 -10509 -31790 5443
398 5443 49132 11676 -30171 -1508 2323 -22513 14716 24551 -45023 -33601 46879 30253 -12116
411a2116K6058j0273l3920M3893K5465n7005k2953L6581J7620l303l794j0634
423d381p346M553K4339J6192m2937l7801M2259K4717l2396J2015J4482m6033J9294
436a3043P2684l6122n9929L5020J2247k9994L2426J2303n8250J645N6322J799
448B7108k4181l683o552J073J5254O606j3100l2104n997M8539J4074m1309N975
461h297J9752k9057K0047M8254n6484m8831O0260J6541l9078K5518P085n0288
473c4578K7276N7883l0683l7156J1871K382K629J3474j1696j8845m914J3319L6621
486B7583j076m8939O265L4319k1266J010K7581m9812k7065P1032J0778n1079J8991
499a678J3440l1808L3969L3561n3234k4336L0301J667J445P947k3985n933K5497
$$ plain form
411 -12116 13942 3669 -30251 13642 39107 -17898 -40851 -4270 13350 10047 6253 -4381
423 -4381 -11727 -7174 17165 33357 -9580 -47381 -5122 19595 -12801 -786 13696 -32337 -13043
436 -13043 59641 23519 -36410 -1390 10857 -19137 13289 25592 -32658 -31013 25309 27108
448 27108 2927 -756 -7308 -6235 9019 15625 2525 -29579 -35576 12963 27037 -14272 -8297
461 -8297 11455 -17602 2445 50699 -5785 -54616 5644 22185 -16893 8625 15710 -34578
473 -34578 -7302 50581 19898 -17258 -5387 -3005 -376 13098 1402 -17443 -22357 -9038 27583
486 27583 26507 -22432 -16167 18152 -3114 -2104 25477 -24335 -51400 19632 30410 -20669 -1678
499 -1678 11762 -20046 13923 47484 -5750 -30086 215 1882 3327 11274 -12711 -18644 6853
512F853P486P483r501m0561J2801M1207k4776j5302J9854l3321k185O9615j6257
525B3396n9759L7849J8720l6742L4245J6160p1335J661N9434j5131j6474J8878
537A0902j9923l824L8794j367k5580r814j0170K2333K4630l3493j1761K4548k1641
550a6366Q477N3930l9959n2631N8045J7072m8132K5591P072o1216K9637O1825
562D3345l8209k3332K8773j2291n12K9279k1185k6347P554K238K3671J4024m6157
575a9149m338M4103j7792n201L8312m5793l6972P2765M745o6261K9098J7966m9755
588c8272L9652N2699n9024k5196M3049p120q895J5890k6218j3285K8190P000N627
601A4097j493l6831J3210M3621k7448j3177K8880l9166j6557P0464j4208o4998
$$ plain form
512 6853 14339 21822 12321 -28240 -15439 25768 992 -14310 5544 -27777 -29962 39653 23396
525 23396 -36363 1486 20206 -16536 17709 33869 -37466 -35805 23629 8498 -7976 10902
537 10902 -9021 -12845 25949 24582 -998 -10812 -20982 1351 25981 -7512 -19273 5275 -16366
550 -16366 -7889 46041 6082 -46549 11496 28568 -19564 6027 13099 -48117 -18480 43345
562 43345 5136 -18196 10577 -1714 -2226 27053 5868 -20479 -12925 -10687 12984 27008 -19149
575 -19149 -23487 20616 2824 -2377 35935 -9858 -46830 25935 30680 -35581 -6483 11483 -38272
588 -38272 1380 54079 -4945 -30141 12908 5788 -3107 12783 -13435 -26720 1470 8470 14097
601 14097 12604 -24227 -11017 32604 5156 -8021 20859 -18307 -34864 35600 21392 -43606
613d3606L6944K4392l3067L5944J6915o5332L330M6177k3072r336J5902k7456
625b2265N101M1608j0761j5315L465k1261J7493L7920l3906k3418K6300j6494
637a1533l46M5738l2843m1608N5386J3047l8683L0930j239o3700K8096N0634m0289
650f410j6229K7123j3490N596L1344k0097k5197P176L982J9872O184l8976J916
663a7206K9024k1494Q458L6725m7924k4323P2420Q6n8191K3805N615m5487L5819
676b673M1854m8950j6307L6646j612n221Q405k0412j1733J2028R529J5753j1989
689E318l8336K2113L5980k6999m01K5627l9344l744O2628k5063n6084L4736R928
702F359l1109M0650K0622n6595R49M3891j4759j5811O625j8246r81K8005K716
$$ plain form
613 -43606 -6662 17730 -15337 20607 37522 -27810 -24480 21697 -1375 -10711 5191 -22265
625 -22265 -17164 24444 13683 -1632 1833 -19428 -1935 35985 2079 -21339 4961 -11533
637 -11533 -11879 33859 1016 -40592 14794 27841 -10842 20088 18849 -44851 -16755 33879 -6410
650 -6410 -22639 4484 -9006 -3410 27934 7837 -17360 -10184 -6202 13670 19854 -19122 -17206
663 -17206 11818 -9676 -1218 35507 -12417 -36740 35680 35766 -22425 1380 6995 -38492 -2673
676 -2673 39181 -9769 -26076 10570 8958 3737 12142 -8270 -20003 -7975 1554 17307 5318
689 5318 -33018 -10905 25075 -1924 -2325 23302 -16042 -19786 42842 17779 -38305 -3569 6359
702 6359 -24750 15900 36522 -20073 -19124 24767 10008 -5803 822 -17424 -18405 9600 12316
715A2316j1445j2004q820K4059J8675k3446l322J0317k1074J2587L3431l8470
727g196l2239M1644J2898j7994K3476l392m0330J7643L1021k2833j7495N742j388
740a0443J1543J5009j0129j2698p365M956K7830P0l2227M129J4113j4335J1647
753B100J3686l8014n599M8285R51k2255J2297j1517k2884K8118J6216l0447r406
766a8469J5905P736P496j671j4711o551K206J4013J6800k1001k6713K0782J2753
779H575j7087J0899M827l0807J4248M5574j9401l3991J2838J681j2626K0943R323
792A4996k6792o068K5950J3459j3695j6043J785L980k41J5472N319l4036q743
805b4657L5658J503k1824J2203J173j8724K4530K1113l6664k1470K0096M947j217
$$ plain form
715 12316 871 -11133 -19953 4106 22781 -665 -3987 6330 -14744 -2157 31274 -7196
727 -7196 -39435 2209 15107 -2887 20589 17197 -23133 -5490 25531 2698 -14797 -9055 -10443
740 -10443 1100 16109 5980 -6718 -14083 -9127 18703 18773 -13454 -9325 4788 -9547 2100
753 2100 15786 -22228 -27827 20458 21409 -846 11451 -66 -22950 5168 21384 -9063 -18469
766 -18469 -2564 5172 12668 10997 -3714 -10265 -8059 5954 22754 1753 -24960 -4178 8575
779 8575 -8512 2387 7214 -23593 -9345 36229 16828 -17163 -4325 -2644 -15270 5673 14996
792 14996 -11796 -17864 8086 21545 7850 -8193 -6408 -2428 -2669 12803 18122 -15914 -24657
805 -24657 11001 12504 -9320 2883 4056 -14668 9862 30975 -5689 -27159 -7063 -2116 -3333
818c333J1904n626j4530Q026J8546K050k1065j5493J5535J3085p682O717j082
831G052l0020R474M0384j4859k7516J9720M623j5936J8793M124l8472m974L1222
844C615O617p591q51m443j791P101P178l851k1321o124K9193J0352k1689L36M017
859G48j5315J6345K6521k5052j8788K2213L34r279J1593j4333k2902K4267K2766
872A9118j2115m680j953j0588R365J1631j1262j1238k008R341J8224l680j9503
885i348L391L614l598K2560M508l7742J567L2675j3375j4753J6558j1375j4399
898a9717L4455J5030l0556j0657R897r30J853K895o182p185O75J7472J4480k4762
912c232j9960K5567P658j5201J6224Q78l6629J2786L5968k2906j7633K2146n100
$$ plain form
818 -3333 8571 2945 -11585 -3559 14987 17037 -4028 -19521 -3986 9099 1417 8134 7052
831 7052 -22968 -13494 26890 12031 -15485 4235 8858 -7078 11715 15839 -22633 -27607 3615
844 3615 10232 2641 1790 -2653 -4444 2657 9835 5984 -15337 -21461 7732 18084 -3605 -3269 748
859 748 -14567 1778 28299 3247 -15541 6672 7006 -2273 9320 -5013 -27915 -3648 19118
872 19118 7003 2323 370 -10218 -853 10778 -484 -11722 -13730 -4389 13835 10155 -9348
885 -9348 -5957 -2343 -5941 16619 21127 -16615 -15048 17627 4252 -10501 6057 -5318 -19717
898 -19717 14738 29768 -788 -11445 -1548 -2478 -625 2270 -3912 -11097 -10422 7050 21530 -3232
912 -3232 -23192 2375 10033 -5168 11056 11934 -24695 -11909 24059 1153 -16480 5666 566
925E66o087K9773n069l7225L523J8650k367m40j762q100N113R090M655k407j8992
940a1079o544K5508M781j7182O131m329k0816K4948K4104l3814j0007L1314l807
953I208j0549J7708j4279k8553J8304K1533r780n833J665k658O972O537l461j0228
967c414j3021R231K6641j0920k4534J2114L860j3389K2356J1388l5461R54L3384
980A9189j1915j4738J3839j6848j5339L4088J3850k6005l155J0281j933N041K107
993H462j3673m370M370R091J1076j2928j9387J2405J1549o692J0156q56k7353
1006a8150J0939K8872k0081j9804J5969l828n258K7997J072k9763L226J6069n053
1019B207O05p23j3139J780J5643O109o170j5136l737J9588O418j2966L253k735
$$ plain form
925 566 -5521 24252 19183 -18042 -14519 4131 1764 1324 -438 -8538 -3425 5665 10320 7913 -11079
940 -11079 -17623 7885 12666 -4516 1615 -2714 -23530 1418 25522 -8292 -18299 13015 9208
953 9208 -1341 16367 2088 -26465 -8161 13372 3592 -2241 -576 -3234 3738 10275 6814 -3414
967 -3414 -16435 -7204 19437 8517 -16017 -3903 -43 -13432 8924 20312 -15149 -14195 19189
980 19189 7274 -7464 6375 -10473 -25812 8276 22126 -3879 -7034 3247 1314 6355 8462
993 8462 -5211 -9581 -5211 3880 14956 2028 -17359 -4954 6595 -97 10059 9203 -18150
1006 -18150 -7211 21661 1580 -18224 -2255 -6083 -11341 16656 17728 -12035 -8809 7260 2207
1019 2207 2812 2089 -11050 -9270 6373 12482 6312 -8824 -12561 7027 13445 479 3732 997
1033I97j7524J6852J9139k8123j2587K4789j32m852J9701j2147k9408J7194K0697
1046A4596j5154o539M642m821O812J2565m649j0485n842M136J8311P31k0141q3
1060e921N707p760J2028J0642k7520m907L1903j355j6534J0782j0110j9599K3317
1073F73J5892k3705n464J3203k522N999Q887j4611j0524J0279Q814M524o988j6264
1087a1807M205J2215l527L883K469j9362M888K8974j1931k2923J1137k692j1072
1100a5543K4270P145l0499J574K2933n362m067N065j2471m948J6401O442p461
1113C479j0324n944J3138J1200r295o04K594j3148R702K1198k2139k0991K0268
1126h66M220r823J8090k066k7879J2541K3436j5052r139N996q881K892J7893n567
$$ plain form
1033 997 -16527 325 19464 -8659 -21246 3543 3411 -1441 18260 6113 -23295 -6101 14596
1046 14596 -558 -7097 -2455 -7276 -464 12101 7452 -3033 -8875 -4739 13572 14303 -5838 -5921
1060 -5921 -214 -7974 4054 14696 -12824 -17731 14172 12817 -3717 7065 -3045 -22644 673
1073 673 16565 -7140 -12604 599 -1923 4076 12963 -1648 -12172 -1893 6921 11445 4457 -11807
1087 -11807 -7602 4613 1086 4969 7438 -11924 -7036 21938 10007 -12916 -1779 -4471 -15543
1100 -15543 8727 15872 -14627 -13053 9880 4518 451 5516 -6955 -11903 4498 10940 3479
1113 3479 -6845 -12789 349 11549 2254 1650 4244 -8904 798 21996 -143 -21134 -866
1126 -866 3354 -6469 11621 9555 -18324 -5783 17653 2601 -6538 -542 -9423 -6531 11362 5795
1140E795j3844m76M084J1375O077j3878m893P648l962N394R272k2131j0345K7483
1154G599L860j4019J0714m838k0109J9327J7332k4411r353J3940l492K500J1767
1167A0817j0982j2849R060R832L858m854j3529K188J0386m524K077L431j8489
1180a3578K181K9661n549k1548J0633O94j3973J8373R031k8551k615K2327j679
1193E407m630M898r846n194J3867O595p274r286o262Q862J0094p052l139J661
1207a299p627R474J8157j5301j7489J3493L167p416J3536k803k2223J1091K0323
1220A5083r672p136L841p305J538J4063l389j2774m305M708J1117J417j0632q17
1234d263L953k876R619O720k2416q055K2194J409j1265R117k956j5486J7223J7121
$$ plain form
1140 5795 -8049 -8525 -4441 6934 13011 -867 -5760 1888 -2074 3320 12592 -9539 -19884 7599
1154 7599 11459 -2560 8154 3316 -16793 2534 19866 -4545 -13898 42 -3450 -950 10817
1167 10817 -165 -13014 -3954 5878 9736 4882 -8647 -6459 3927 -597 1480 4911 -13578
1180 -13578 -11397 18264 12715 -8833 1800 2494 -11479 6894 15925 -12626 -15241 7086 5407
1193 5407 777 5675 -4171 -9365 4502 11097 3823 -5463 -11725 -2863 7231 179 -2960 -1299
1207 -1299 -8926 548 18705 3404 -14085 -592 2575 -4841 8695 5892 -16331 -5240 15083
1220 15083 5411 -1725 2116 -5189 -3651 10412 7023 -5751 -10056 -5348 5769 7186 -3446 -4263
1234 -4263 -310 -3186 6433 13153 -9263 -17318 4876 6285 -4980 4137 1181 -14305 2918 20039
1248B0039j8921j0488R786O8J65O874n759j2125L511J1570N946p903r740M003
1262b974N724j731L873l134j6566M289K0444m770j1464O475k411l725J5916K246
1276A2192k0520j964J2852N79q28N86p261k752J0225Q399l897j2234l123R932
1290B186L120n334R71n496r367J4321J4538j6193r332J2033m69k915J1122n752
1304C433j8551P530J6970m395p645J449n38N45Q187L686j0914j0799P673J2686
1318I317n430q173L025k947j641J5528J405j9339j052J3948j710l339L445r780
1332f743n915J4449Q676q471p074J740M251M441N98m764p855j743J1636P626j1172
1347c20o024N975j04K327R444r746j4754J1032J0865q167k518M15p433M490J4637
$$ plain form
1248 20039 1118 -9370 416 484 649 7523 1764 -10361 -6850 4720 10666 2763 -6977 -2974
1262 -2974 2750 1019 4892 1758 -14808 -10519 9925 5155 -6309 166 -2245 -5970 9946 12192
1276 12192 -8328 -10292 2560 3139 2311 2897 -4364 -7116 3109 11508 7611 -4623 -7746 2186
1290 2186 5306 -28 943 -4553 -13920 401 14939 -1254 -10586 1447 978 -1937 9185 3433
1304 3433 -15118 -7588 9382 4987 -2658 -1209 -1747 -1202 6985 10671 -243 -11042 -3369 9317
1318 9317 3887 -4286 -1261 -4208 -5849 9679 11084 -8255 -9307 4641 2931 -408 3037 -6743
1332 -6743 -12658 1791 10467 1996 -5078 -3338 913 5354 5952 1188 -6667 -8410 3226 10852 -320
1347 -320 -6344 -369 -473 1854 11298 1552 -13202 -2170 8695 528 -1990 -1575 -9008 -4518 10119
1362A0119k149j2702j960O242M963j376m057k678l817L338J4629j169j8683K704
1376f596J4027n149j583Q021j3259j0112K0241O678j7020k236P053k744N158Q535
1390A1014q768j0652K764Q817L461q455o952O253K823L23Q435n635j7017Q852
1404d737J6918r344p036O443q136k160J7790j121j7262L218R076N57K981k707
1418D480j0261j076P026M422o21r347l199J1374L084m954L199p208j0897J6761
1432B783J1084j7745m533J0213o297K245J4913j1713j4110J4936Q064p811J134
1445C163l187r682O332J0410j604o583n068L498J1289k736r446K029l380k970
1459g935J6332R65k0778L169J3938p972K006J0864j5256q145K0780L562j4907
$$ plain form
1362 10119 7970 -4732 -6692 -450 4513 3137 -920 -3598 -7415 -4077 10552 9383 -9300 -6596
1376 -6596 7431 2282 699 8720 -4539 -14651 5590 12268 -4752 -6988 65 -2679 2479 11014
1390 11014 2246 -8406 -5642 3175 6636 -1819 -8771 -2518 305 628 9063 3428 -13589 -4737
1404 -4737 12181 2837 -4199 2244 -5892 -8052 9738 8617 -8645 -5427 3649 4206 7187 4480
1418 4480 -5781 -6857 169 4591 3970 -5377 -8576 2798 5882 928 4127 -3081 -13978 2783
1432 2783 13867 -3878 -8411 1802 -4495 -2250 12663 950 -13160 1776 9840 2029 3163
1445 3163 -24 -9706 -3374 7036 5432 -1151 -6219 -2721 8568 5832 -3614 -1585 -4965 -7935
1459 -7935 8397 9362 -11416 -8247 5691 -2281 -275 10589 -4667 -12812 7968 11530 -3377
1472c377j82M50k897R906N881q667m699J306N209N515p426q958O165N44j357J2345
1488I758n523k0393J1107J7288j2186m234Q877j0900j401J8265m794j6891N461
1501e566O977j582O566R79j0223j899N729N441n18j1877l716J2902K322o107N261
1516D689n747j1711J4476J1413j6027l292R183q062Q26J4750j0588j4718J3118
1529a690R484m529N86l784o787N786N734k422k872m980J391J0842n48p361J226
1544G6l634l519J5410K544j9837R59J3099o034j213Q163j1370n707J7198L649
1558I784j1347J27o30m888P264O880p136n835K450O806N418o996p674M024J547
1573b06NQ134m320j4733P295J1908q156j451N249r264J80J6896l467j6283J922
$$ plain form
1472 -3377 -3559 -3109 -6006 3900 9781 1114 -3585 -2279 2930 8445 1019 -7939 -1774 -1230 -2587 9758
1488 9758 4235 -16158 -5051 12237 51 -4183 4694 -6206 -7607 10658 5864 -11027 -5566
1501 -5566 1411 -171 6395 7374 -2849 -4748 981 6422 5904 -5973 -9689 3213 5535 -572 4689
1516 4689 -1058 -12769 1707 13120 -2907 -6199 2984 -5078 -4252 10498 -90 -14808 -1690
1529 -1690 7794 3265 3851 67 -6720 -934 4800 2378 -494 -5474 -4083 6759 6211 -1150 76
1544 76 -3558 -7077 8333 10877 -8960 -8001 5098 -936 -2149 6014 -5356 -11063 6135 9784
1558 9784 -1563 -1436 -2066 -6954 310 7190 54 -5781 -3331 3475 8893 1897 -5777 -1753 -206
1573 -206 -201 7933 3613 -11120 -3825 8083 -73 -1524 3725 -5539 -5359 11537 8070 -8213 -6291
1588f291N766j322M663J075p914m61O711L516j675p514m025P164L669j241K327
1603D448o635q348J2118R420j2150m035P828l392L82R499q093j2973Q058Q359
1617D486l484J543p26p002K328Q690j857p189l609K863P871J053n658j285j699
1632c675o75R470L276j1934k125R439j303j871L594q314o526J3321P145q388k914
1647a480J058k666L796N009o531o613L011O320K957k792o003q35K651L549M959
1662F390l491j0099L297J0206l907m614K505m243k12J2535J304j2995j449N792
1676A019j009J678J957p535l171Q136M983l285o030k734L893M956P4r74l803n551
1692g396O221Q736o893o639M805J584R12P170m007j2559L225R389k235k310Q23
$$ plain form
1588 -6291 -525 -1847 2816 3891 -4023 -4484 2227 5743 4068 -3446 -7471 -307 3362 2121 4448
1603 4448 -2187 -10535 1583 11003 -1147 -5182 2646 -746 -364 9135 1042 -11931 -3873 4486
1617 4486 1002 2545 1819 -5183 -2855 5835 3978 -3211 -6820 -3957 3914 4967 -691 -1976 -3675
1632 -3675 -4350 5120 8396 -3538 -5663 3776 2473 602 4196 -4118 -10644 2677 9822 1434 -1480
1647 -1480 -422 -3088 708 5717 -814 -7427 -4416 1904 4861 2069 -3934 -4769 -2118 1431 6390
1662 6390 2899 -7200 -3903 6303 2396 -2218 287 -3956 -4168 8367 9671 -3324 -4773 1019
1676 1019 10 1688 3645 -3890 -7061 1075 6058 2773 -3257 -5991 -2098 2858 2932 1958 -1845 -7396
1692 -7396 -1175 7561 668 -5971 -1166 418 1330 8500 4493 -8066 -4841 4548 2313 3 826
1707H26m521O68R020J94q724l505L123M655J980k310l668l316J627P482J667q840
1723c642j931P524J553p87J768o813p172R117Q362o850l652K924j426J720O510
1738G205m832r461K397P672K186l670l595k345Q51M039M645l183q175K727R014
1753E475j666n016m2l265j453J0399L975j0448k976O778L06n68K030n440n093
1768g004O531P615l357o467j227J945L126K139p2n101l526N843N927n433o138
1783e199J659J550J811O611k545r899J639Q366r10l453j25k990j00P877K628p666
1799g46m821L620M667N71r70k363m349K075O859j68q018k098N354K528J031J138
1815D310n851o199O511O587m694m424J855K22J616N487j959q508k73Q152K266
$$ plain form
1707 826 -3695 -3027 5993 6187 -2537 -6042 -2919 1736 3716 1406 -2262 -5578 -3951 3531 5198 -3642
1723 -3642 -5573 1951 3504 2717 4485 -2328 -9500 -383 7979 1129 -2523 401 -1025 695 7205
1738 7205 2373 -7088 -4691 2981 5167 1497 -2098 -4443 -3592 447 5092 1909 -6266 -3539 5475
1753 5475 3809 -1207 -1249 -4514 -5967 4432 8407 -2041 -5017 1761 2067 1499 3529 -1911 -7004
1768 -7004 -473 7142 3785 -2682 -3909 -1964 1162 3301 3229 -1872 -5398 445 6372 939 -5199
1783 -5199 -3540 -1990 -179 6432 3887 -6012 -4373 3993 3083 -370 -495 -3485 -3585 4292 6920 -746
1799 -746 -5567 -1947 2720 3291 2321 -42 -4391 -2316 4543 4375 -3643 -5741 -387 2141 3172 4310
1815 4310 -1541 -7740 -1229 5358 664 -3760 -1905 -1683 -67 5420 3461 -5047 -5320 2832 5098
1830E098l634j782j704j430M367M907m888p124M060O298m95j562j831n078K7Q225
1846C454J197o992k792M122K569P65J49m081m520M209P732j456p134m37K506K19
1862d90L414J527p038k621Q300L619n443k465q95k143M190O014m359o785J880
1877c295N551Q16k379j956k270m55N681M250n987o288M118M513j119J013l98o233
1893d438K242R525k367q907P48K628p7M205J574p033l452O042M056k904m561o27
1909c346J406J621L094M01p058l466Q866M095n834j169J841l669L226P227o227
1924A008q085N153M971o59J014k358m971K061N245L50m201l607Q39N155J320k717
1940E18j772k614N30P427J027q120n51L278o38K791J858p946j540Q397J816l270
$$ plain form
1830 5098 1464 -318 -2022 -3452 915 5822 934 -6190 -2130 4168 3673 2111 280 -4798 -4771 3454
1846 3454 4651 -2341 -5133 -1011 1558 2323 2472 -1609 -6129 -1920 5812 4356 -2778 -3215 -709 -490
1862 -490 2924 4451 -2587 -5208 3092 6711 1268 -1197 -2092 -4235 -45 5969 1610 -5175 -3295
1877 -3295 2256 3072 693 -1263 -3533 -3988 1693 5943 -44 -6332 -2214 2299 1180 2193 1795 -4438
1893 -4438 -2196 7329 4962 -3945 -3197 -569 -646 3559 5133 -1900 -5352 690 4746 1842 -2719 -3346
1909 -3346 -1940 -319 2775 3176 -3882 -7348 1518 5613 -221 -1390 451 -3218 8 7235 1008
1924 1008 -7077 -1924 3047 2388 3402 1044 -3927 -1866 3379 3729 -472 -4079 -3240 1915 3235 518
1940 518 -1254 -3868 -3338 4089 5116 -3004 -3555 -277 -915 1876 3734 -4212 -5752 2645 4461 1191
1956A191j39k928j740N773L162n394l282R25K702L580j149m654n31M37K991M902
1972E846m726p571M310N306l792J368J215p490K035J0244k486p632J749L05q82
1987b201N853K45p160o10N065K265j73l857l156L177K033O05J242m901n063P420
2003G84N202o677j213K262l841L287P238o434p175M867K859p96K557k805n065
2018d950L430M965l01k238m211j26N871J039k932o97k582r51Q015J853r188k9
2034c032M437k276K692L102q168l726Q344J705l261R70l152j699N875K696m798
2049b91k330n99J995M768r08m934j9J332J613M993k907p850L038N456k363N48
2065A542K68p313J688R638k715o070J933n31q59O056r5p621o88M781K275L11k722
$$ plain form
1956 1191 1052 -1876 -3616 2157 5319 -75 -3357 -2432 270 3850 2701 -1953 -2484 -2047 944 5846
1972 5846 1120 -6451 -2141 3165 -627 741 1956 -5534 -3499 6745 4259 -3373 -1624 -1319 -2201
1987 -2201 3652 3897 -3263 -3873 1192 3457 3284 -573 -3729 -552 1481 2086 3328 -1573 -6636 784
2003 784 5986 -691 -1904 358 -3483 -196 7042 608 -6567 -1700 1159 363 2920 115 -4950
2018 -4950 -1520 3445 3144 906 -3305 -3431 2440 3479 547 -150 -2732 -3683 4332 6185 -3003 -3032
2034 -3032 1405 -871 1821 4923 -3245 -6971 1373 3078 -183 787 -2365 -4064 1811 4507 -291
2049 -291 -2621 -3220 -1225 3543 2635 -2299 -2318 -986 627 5620 2713 -5137 -2099 3357 994 1542
2065 1542 1810 -5503 -3815 5823 3108 -2962 -1029 -1560 -2419 3637 3542 -4079 -4767 14 2289 2600 -122
2082a22l107J511K879J932O08n208m147P332L667n662j69P75m048L764P414o265
2098A154o915M737K525j563K207j744n574J823O087M53l601k894Q50L898R47j248
2114A142p66l788l06P831J125p488k39L503j473K422L314o690m479O709L203l758
2130B62p43j298j926L430M598k793m605l28L159L023j395k461j410l36L071M758
2146E006k969o519K594M257q41M38l2n798N37P773n68n669q9P49O25K920J309
2163C723n204k934L448L560m75l505j495J100J707K537P38m923l002N029L575
2178C879k833j710k07k016K613N183l152n822J823L530N11P49j617m248O63M730
2194B076J117l130k646N17K387J920J9k978l324J479N294K35m023j313M74J016
$$ plain form
2082 -122 -3229 -1718 1161 3093 3701 -1507 -5654 1678 5345 -317 -486 289 -3759 5 7419 1154
2098 1154 -5761 -1024 1501 -62 2145 401 -5173 -3350 2737 3190 -411 -3305 -2455 1443 2390 1142
2114 1142 376 -3412 -3718 4113 5238 -2250 -2489 1014 -459 1963 5277 -1413 -5892 817 4020 262
2130 262 -481 -1779 -3705 -275 4323 1530 -3075 -3403 -244 2779 1384 -1077 -2487 -2823 248 5006
2146 5006 2037 -4482 -1888 2369 1528 1966 1934 -3864 -3327 4446 3878 -1791 -1880 -1131 -506 2414 3723
2163 3723 -1481 -4415 -967 2593 2118 -1387 -2882 -1782 -75 2462 3200 -1723 -4725 304 3879
2178 3879 1046 -664 -871 -2887 -274 4909 1757 -4065 -2242 1288 1799 2548 931 -3317 -2654 2076
2194 2076 3193 63 -2583 -2066 321 2241 2260 -718 -4042 -2563 2731 2966 -1057 -2370 -1896 -880
2210h80L182J401n680k563M908K915j941j328j038k049K650M508j972m696K82
2225b301L418J008k22j679k568q96M084L276l207m431J380K732L10K25m25l693
2241b989k91N912J161m950j854J740Q69J816K079l550l295K707M335j260k982
2256e52q61j28J154L285K88m902k288L923K301r14j649j129j094K353L258j765
2272A280m742k1L945J395o59j27l196q06M743K317m051k982K088J320J077J338
2288B919k567l703J506M658q0k890j621K08J039K327J6l439k693K846M546j118
2304A954k452p10q11J372L501l45n438k9M474P89p05l75k861j145L950K877l342
2321G04k895N48J962J015J40j518k903K04M376K349m445k660J768J091N31K235
$$ plain form
2210 -880 2302 3703 -1977 -4540 368 3283 1342 14 -1024 -3073 -423 4085 2113 -2583 -2301
2225 -2301 1117 2125 1903 224 -2344 -3240 844 4120 913 -3518 -2138 594 904 1129 704 -2989
2241 -2989 -3280 2632 3793 -1157 -3011 -1271 -402 1414 3493 -57 -3352 -645 3690 2430 -552
2256 -552 -1413 -1541 -387 2898 3186 -1716 -4004 -81 2220 1306 -343 -1472 -2566 -213 3045 1280
2272 1280 -3462 -3483 462 1857 1198 1071 -2125 -2931 1812 4129 78 -2904 -816 504 1581 2919
2288 2919 352 -3351 -1845 2813 2733 -157 -1778 -1570 -531 1796 1812 -1627 -4320 -1474 3072 1954
2304 1954 -498 -1208 -2019 -647 2854 2509 -2929 -2958 1516 2305 1600 1225 -1636 -2781 1169 4046 704
2321 704 -2191 -1643 319 1334 1474 -44 -2947 -2743 1633 3982 -463 -3123 -1355 -264 267 2502
2337B502k277m275K908M749j615k852K76j175Q07M246K35n151j648L918J482r42
2353A188j121j787l04K463K880j126m871o45L484J490q27o91j409j704L948L079
2369D047l910l258J952J577P18J285j878l736J307M059L66k319j539k42J528K686
2385B643j99l622k503K337L583k0k264j174j62P08L172m54m521p04L842J141r84
2402H19j3k386k083M071L359l017l120J298J262J145R88j990l253O28L685K089
2418C482k501k476L22J373J048Q61j905l867J724M990n53l646J0m58j28L540Q99
2435B715m610j628L817J172k29l77k346j550L642L148j745l092j131K379J643
2450A808j92j023j967o35L012K455k914l255J168J078O54K074j570m595J548M889
$$ plain form
2337 2502 225 -4050 -1142 3607 1992 -860 -584 -1759 -952 3294 3529 -1622 -3270 648 2130 1188
2353 1188 67 -1720 -2024 439 3319 2193 -2678 -3323 161 1651 824 133 -1276 -2980 968 4047
2369 4047 137 -3121 -1169 408 1126 2411 533 -3203 -1896 2163 2529 210 -1329 -1571 -43 2643
2385 2643 2444 -1178 -3681 -1344 2239 2219 -45 -1219 -1381 -673 2499 2045 -2476 -3180 662 1803 819
2402 819 806 -1580 -3663 408 3767 750 -2370 -1072 190 1335 2323 333 -2920 -2292 1393 3482
2418 3482 981 -1495 -1173 200 1248 2109 204 -3663 -1939 3051 2498 -1148 -1138 -1596 -1724 1816 2715
2435 2715 -1895 -3523 294 1466 1237 860 -1486 -3036 606 3754 2009 -1083 -2214 165 1808
2450 1808 1616 593 -1374 -2009 1003 3458 544 -2711 -1543 -465 189 2263 693 -3902 -2354 2535
2466B535j251k250J60j001N67M148J80m043j551J834K291N61j609j660j54J271
2482B8K838m48m017j571L394J423p96J09j892k545K858M055l231l314K045R59
2498a05L88K464j843m153J037L537Q96j293k161q6J667J334O03j945k807O31M228
2515B392K90l122n88or17L327J540m584j899L794J049p99J95k076j819L417K406
2532B600j345j897r09R67K167K03j896q43o73J571L348j469m151O94J997J26J109
2549A599l82l865J51M678n19k290l23j139O04L280P09l569r72J187J375J533j398
2566F59k633L17K068J206R11l090k160K374K225p63l16j170k344K418L868k690
2582H80l262R86J084M49K389j207l894N74L127M73r91j374j218J412K006K24j264
$$ plain form
2466 2535 1284 -966 -806 -1807 -1240 2908 3088 -955 -2506 -672 1619 2180 571 -1089 -1243 28
2482 28 2866 2418 -1599 -3170 224 1647 851 960 -932 -3477 -619 3436 205 -3109 -1064 -105
2498 -105 283 2747 904 -3249 -2212 1325 2221 928 -1233 -1319 348 1682 2285 340 -2467 -1836 2392
2515 2392 2682 -440 -1028 -1034 -1951 1376 2916 -1668 -3567 227 1276 477 672 -1404 -3223 194 2600
2532 2600 1255 -642 -1551 -584 1583 1786 -110 -953 -1626 -55 3293 1824 -2327 -1633 364 490 1599
2549 1599 1217 -2648 -2497 2181 1662 -628 -951 -2090 -1486 1794 2503 -1066 -2038 -851 524 2057 659
2566 659 -1974 -1657 411 1617 2528 -562 -2722 -348 1877 1114 798 -372 -2716 -298 3570 880
2582 880 -2382 -1396 -312 137 2526 1319 -2575 -2001 1126 1599 608 -766 -1984 -572 1434 1658 394
2599C94k488RL320J255k726l82j38o05K725J296l847j799L240J224n48M16k045
2616f99k190K720K775j991j742p68J065J876O74j717j731j69J795K979j692l191
2632b006L43J615N07J229n48l458L28M258L59k347o65p73j94L130Q43l222j539
2649b140J481J626P02r41k187n33J247J887Q89k746k246K279J888m38n06j025
2665g63j797K434L113j757k624K84Q91Q58J743j001l293O92K301N65q93j795n99
2682a641P30K168L34j626k018J40K846O63j690p83n03K10K491J235l400j972K632
2699a84J550j25J06j388j917J803K764j055k411n14J110J061Q83j152j817q14
2715b100K252K029j568k257kJ010Q96J086q57l021N08L130R44j392j413k88J35
$$ plain form
2599 394 -2094 -2085 1235 2490 -236 -618 -756 -1361 1364 2660 -1187 -2986 254 1478 930 1346 -699
2616 -699 -2889 -169 2606 615 -1127 -1895 -830 1046 1720 3 -1728 -1897 -102 2877 1185 -2006
2632 -2006 -1663 -48 459 1688 1140 -2318 -1990 2268 2627 280 -385 -1158 -1352 1778 2621 -601 -2140
2649 -2140 -659 967 1669 728 -1459 -1992 -745 1142 2031 -715 -2961 -682 1206 768 262 -763
2665 -763 -2560 -126 2987 1230 -1394 -1110 -219 639 2382 1381 -1912 -1220 1081 1646 753 -1042 -1641
2682 -1641 -911 1257 1591 -35 -2053 -1913 933 1596 -94 -877 -1380 -1170 1321 2556 -844 -2816 -184
2699 -184 1366 1241 1347 -41 -1958 -155 2609 1554 -857 -1371 -261 800 1683 531 -1286 -2100
2715 -2100 152 2181 613 -1644 -1646 -636 260 1346 489 -2532 -2024 1106 2050 658 -755 -1043 -908
2732i08K213J211k553j977J441J931K54q29j472q77J002K485J06k795j374J395
2748g47J441K91n00j752j177K040K655r80k395n19J185R10R98m28k443m93K631
2765G17J563j534j287l27K96J438J576k167k492Q22K413J80q20j090j116R99K116
2782A287N58k287j748J272J777L11n53j432j030J328K520m92k204p89J339N09
2798C66Q31R9k718p18K886J091r98j395m73J04J914R24j438k152J63J960J317
2815A763p58j730q94P25J757J156j984k050P32K036L54p77n73j626P99L126l79
2832A677k320n87O27J118J230o08k108p51J539K032n55k036j044J140J470K77
2848A101n44j994p15K206J821j765j217R1j71J395K056k095k540J327K015K18
$$ plain form
2732 -908 1305 2516 -37 -2014 -573 1358 1612 783 -689 -1566 -564 1921 2027 -768 -2142 -747
2748 -747 694 985 485 -1267 -2444 -404 2251 1271 -1124 -1643 -458 452 1450 1022 -1421 -1914 717
2765 717 2280 746 -541 -868 -572 866 2442 275 -2217 -1395 1018 1198 378 -712 -1828 -829 1287
2782 1287 1845 -442 -2190 -918 859 1170 617 -815 -1845 -517 2003 1511 -693 -1482 -143 366
2798 366 1197 1296 -1422 -2140 746 1837 839 -556 -1029 -925 989 1913 475 -1677 -1514 446 1763
2815 1763 1005 -725 -1619 -894 863 2019 35 -2015 -1283 753 1107 330 -243 -1869 -1070 2056 1677
2832 1677 -643 -1230 -603 515 1745 1137 -971 -1722 -183 1849 1294 -742 -1786 -646 824 1101
2848 1101 557 -1437 -2152 54 1875 110 -1107 -1016 -1187 208 2264 169 -2371 -1044 971 1189
2864A189l66r45j165P85J859N70j824j523K71J801M02m61j315m55k18K716N72
2881A893l032q59J693O33O82K10k335j118K378J909j339j068n49n4J870J374j449
2898H39j922KJ174J720q64j633n00N27J268J035j065k596O34K250J9r19l29j424
2916a784K58K819M45k533m12P76Q16N78J46k065o17J431J517m0j526r18O67J405
2934I63J0O5j946j082J900J916j235j469j06j42J330J543j211k577Q01K004J72
2951I36j09r92j116L71J918N35r47j730J22J643R80j198r25m88J24K125L62j920
2969c09j409J476N31O16J16k075j100K257J223r03r33l02k92J517J586j443j861
2986a305K09J214J171k73j630m17O08J342N93r79j895M50J728J49m90l53j471
$$ plain form
2864 1189 823 -122 -1287 -502 1357 1927 103 -1420 -1149 652 1054 593 -722 -1177 -1395 1321 1893
2881 1893 -1139 -1998 -305 328 1010 1220 -1115 -2233 145 2054 715 -353 -902 -956 914 2288 839
2898 839 -1083 -1081 93 1813 949 -684 -1184 -657 611 1646 581 -2015 -1381 869 888 -31 -360 -1784
2916 -1784 -1526 1293 1738 -795 -1207 -431 385 963 1109 -956 -1573 -142 1375 1335 -191 -1109 -442 963
2934 963 973 1038 -908 -1990 -90 1826 591 -878 -984 -1126 204 1747 536 -2041 -1240 764 936
2951 936 827 -165 -1281 -910 1008 1543 596 -1134 -1012 631 1611 413 -512 -1000 -876 1249 1611 -309
2969 -309 -1718 -242 289 905 1021 -1054 -2154 103 1326 423 -510 -812 -1104 413 1999 556 -1305
2986 -1305 -1096 118 1289 1016 -614 -1031 -423 919 1512 533 -1362 -912 816 965 475 122 -1349
3003a349K60K395M49k346p97Q02Q64M24J10j718r72J931J250l58j232r04N80R25
3021C14O73j10j451j129J914J503o89j539k76M82O21J292q18k040k03K278K75
3038A097n57p62j061J47K157L59j565j575P30J189Q52k73j171r27Q41J387O82
3055A550j765j264P21J372O36j07j447j180J550J820r21j219l72n81J498J254
3071A545j154j747j47J628P43Q1j071j216M85J446R09j225j519P5J601R10o76
3088F68r05p14K72J913O08j803j139O34Q06M63L61j400j466J525J604n88j031
3105a92j038J33J044J215o18j562m82J013J644m32j098q00L20J292Q59l94k148
3122a244J56J572N58k93p46r05L4J932M47j405j386L14P18J440n29j080r07R69
$$ plain form
3003 -1349 -1089 1306 1755 -591 -1388 -586 278 702 812 -906 -1878 53 1303 945 -287 -1191 -611 314
3021 314 987 877 -574 -1703 211 1714 1025 -514 -790 -308 313 1605 787 -1253 -1456 822 1097
3038 1097 540 -222 -1283 -1136 1021 1380 -185 -1760 -1030 159 1011 738 -433 -1360 -519 868 1550
3055 1550 -215 -1479 -758 614 1250 1143 -304 -1484 66 1886 965 -254 -626 -1207 291 1545
3071 1545 391 -1356 -1503 125 868 949 -122 -1338 -853 593 1502 277 -1242 -1167 434 1344 668
3088 668 -237 -951 -679 1234 1842 39 -1100 -466 340 803 1164 -236 -1702 -177 1427 839 -192
3105 -192 -1230 -1097 -53 1162 544 -1018 -1500 -487 1157 725 -373 -1173 -853 439 1298 904 -1244
3122 -1244 -1088 484 1042 749 3 -902 -868 1064 1511 106 -1280 -966 -248 1192 663 -417 -1324 -355
3140c55J164L84r03j799O63J242M73j25q97j369J057J742j35j322n00P7Q49J158
3158A404l92j913k78J279Q40J58j211r01J39J153Q31r42r89m75J321Q33o9j049
3176b61r65M60J694M30j085j369M79J008N41J41j273j215R08J441J35r76q12j17
3194h36J006J031p40j135o30R37J349K20j273r76K97R72R87q12j240l96J574M80
3212H15j97n79j229J85J627P46j079j346M14Q18P63mj023j039N90J410N0q56q34
3231g68q8P40R73j11j366n93P87J248O7j247l95pP64J219l58j564n05J312Q09
3250I17j95q80m08o2R83J149j032r28k91Q39P22l3r10o96K20J317M04r96j342
3269a222L37Q65P97l80o18q86M67J602j21r01o71M56M54M28J14j338o21J166J345
$$ plain form
3140 -355 809 1193 290 -1509 -846 396 869 744 -153 -1522 -465 1277 1142 -180 -680 -603 246 1404
3158 1404 1012 -901 -1179 100 940 1098 -113 -1014 -875 278 1109 167 -822 -1297 24 857 788 -261
3176 -261 -1226 -766 928 1358 273 -1096 -617 391 932 1073 -200 -1415 -507 934 1069 93 -719 -836
3194 -836 170 1201 461 -674 -1304 -367 982 1202 -71 -1047 -750 222 1209 397 -843 -1239 335 815
3212 815 618 39 -1190 -1005 622 1368 289 -1057 -643 175 938 934 -89 -1128 -538 872 922 66 -768
3231 -768 -856 -116 857 746 -620 -1213 -426 822 889 -358 -753 -760 4 1223 865 -699 -1204 108 917
3250 917 722 -158 -566 -628 355 1504 472 -456 -747 92 814 781 -129 -825 -605 712 1116 120 -1222
3269 -1222 -885 -20 777 397 -221 -1107 -640 962 841 -60 -731 -275 179 607 721 -617 -1238 -72 1273
3288A273k64q91r20J48P42R54o20r83o94J082P46j43p62m67q8J164O45p19j146
3307i43P4Q84P37O5r15r29N05J680j83q55q23J96N75R73l63j106m46M88J366R3
3327A073j099o83j8R59M22P6j436l42Q55Q85k45n69o67n4J074J273j155j174k14
3346a039J236N85J37r01j113P78Q67N32r32q55j14Q64O01J2p84r70L20J387M81
3365A092j259r45L50Q83O42J9j129r31R51J043M0m32j108J17Q97Q43o45q98j07
3384e77M70R87k35o39j021K38R47P77m50j448J7R32N54J20p57r46L34J365L2l64
3404C36j010j02N12J168j69j154n03O28Q99K27o77j037J52J354L78j93j271m85
3422i47Q71P47j92p06l13j44Q76R07o62j243J31L20N63N27p63j129L21J165M71
$$ plain form
3288 1273 1009 118 -802 -654 88 1042 422 -561 -1255 -173 573 430 -332 -799 -887 277 922 203 -943
3307 -943 -869 15 752 817 -98 -1027 -522 1158 975 120 -703 -507 68 1041 678 -428 -874 -386 980 1073
3327 1073 -26 -709 -727 232 654 730 -706 -1048 -193 692 447 -122 -789 -843 231 1504 349 -825 -1039
3346 -1039 197 782 919 18 -1095 -317 550 1082 150 -705 -819 45 646 658 -126 -1096 -776 611 1092
3365 1092 -167 -1112 -762 121 763 782 -347 -1278 -327 716 756 324 -784 -667 230 1073 428 -470 -577
3384 -577 -107 880 645 6 -1015 -777 170 947 497 -951 -934 -2 552 672 -85 -1031 -697 668 700 336
3404 336 -674 -776 -264 904 735 -419 -922 -294 605 832 155 -882 -730 624 1002 809 -462 -947
3422 -947 -76 671 479 -227 -540 -684 192 1099 437 -806 -675 -355 208 735 -28 -1157 -836 329 800
3441H00m70o90n87R87J059m28n25r20m1J476O33j217p84n4Q42Q84j12j221q16
3460a184Q08R97k29k79r57k18J042N77k19j042l41P92N40O11r41n29J13L96J071
3479A008m60r16j02N85N92J0k80j306J30J155L07m33o52r5K39Q06N35j560o81
3498a118N70P61N38p39o61l31P42J000J58q92q47P45R30k20l21o96k70O55R86
3517I90l49j181j56O61L29M16k54j347kJ211L33p31n52K4M35P60L14r21n36j39
3537f95J386K01o21l60m25M67N23M50j029p73P86M93L73o89l96o29Q16J094o88
3556B84n90q01M99J043J56p43o94L24N13Q04j16j209o7O08M04K99n12o84k85J135
3576C68N79q14m32j19M1R53M06r47j097O86O89J73l96n81j16O18M61J7n29q14
$$ plain form
3441 800 330 -360 -947 40 1099 671 146 -774 -815 661 1294 77 -707 -761 81 965 853 -368 -1184
3460 -1184 -376 621 392 113 -844 -1062 -20 557 338 -704 -1045 -253 287 898 -43 -572 -459 -63 1008
3479 1008 548 -368 -470 115 707 717 437 -869 -739 416 723 290 -362 -457 -218 588 1123 -437 -1118
3498 -1118 -548 213 751 12 -649 -980 -238 762 920 28 -819 -74 856 636 315 -381 -651 4 990
3517 990 641 -540 -696 -35 294 710 456 -891 -893 318 651 -80 -632 -608 -173 587 901 -20 -556 -695
3537 -695 691 892 271 -89 -514 -47 476 926 -103 -876 -90 403 776 87 -309 -938 -122 972 284
3556 284 -306 -1107 -608 435 591 -152 -846 -522 -9 795 679 -530 -597 11 415 714 202 -482 -767 368
3576 368 947 133 -299 -418 -377 576 982 35 -1062 -376 313 486 90 -491 -607 11 472 489 -40 -854
3596h54M44P91M83m98p52j89O35O96j16j015j33K41P19L39m66q60O3O69M23k84
3616C36o26n18N99O60N02p55r98R3N93Q07n15m72l45N95N55J3p23p77M24Q83M73
3637H04p81l32j23K17J004l5r40m74N18M97L70l07o75p00J168K63l22p97m3K31
3657d57P62R8l84n24m6N14P38l72q39R9L84M54L84m29r69j3J107K51q23k37o0
3678c62M37O59q0n88m76L54L27L76m96o45m12R52M68rn82q28O66N05L80l62q09
3699e25J4P99M86l82n72k20N8P33N01o27j067L19M73L72J80p68m34K97Q58%o02
3720a07k46j74N03N52l5r81pN66O56K4q82k00K20M29K18l10m57r2K60Q91m75l79
3742b6o05M46P97k03m73n07j84O15O52k99o31j82M99M70K53n84o61k1J008K49
$$ plain form
3596 -854 -410 381 864 366 -386 -575 60 756 640 -375 -508 -267 452 791 325 -535 -472 197 620 336
3616 336 -290 -808 -209 451 953 198 -800 -707 -114 693 178 -294 -639 -44 511 524 -199 -976 -552 331 804
3637 804 23 -309 -432 -215 789 754 -186 -660 -142 355 725 418 -257 -957 211 474 152 -645 -688 -457
3657 -457 305 403 19 -505 -551 -37 701 329 -510 -411 -27 427 811 382 -587 -600 507 758 -65 -302 -362
3678 -362 75 734 654 66 -410 -56 271 647 151 -494 -906 46 514 505 -77 -905 -239 266 646 284 -525
3699 -525 -511 288 774 392 -180 -400 -342 391 892 265 -802 -483 -10 362 542 -226 -660 -363 495 495 -107
3720 -107 -353 -527 -24 528 493 -488 -495 71 727 751 -131 -331 -111 318 536 226 -231 -323 -63 828 353 -26
3742 -26 -631 -185 612 409 -64 -571 -755 -140 512 213 -418 -600 -101 369 622 38 -623 -644 364 613
3762F13j93p44l64P37M04K47o76p02K02N79N57l47m76j96J04P40K5p18l72P5Q06
3783C01L97q02m74M3N30N49j09o83l13N03K26M30k81r78K30O27M32j1j000k7J65
3804b45O60K31o60l38q3M34K77K58p54n27M87P10no27m32L8Q82J76k69m50k68
3825e05L61M95n6n93L2rN98j09M4o93K45J58N68k06m16l26M3O67J76r7j249L81
3847d91N43J28n9o10L3O7P24K80n90n71K17M21L26k36l80l07O22J57K83n04j95
3868a42j41N56J76k06m96L8j69R95l55l65k53lP45o4k83m39K5K67O80m95k93k57
3890d79K38M63K80n42k20N2K88O13l93k45n15M96N88O9m21o58k1P08L61m49l81
3911a68k84J09M52K57q12LJ5P93O5m55Kn73P48J59j6m41j73M69K10J50k87l59
$$ plain form
3762 613 420 -324 -688 49 453 700 24 -678 -476 103 660 313 -163 -359 -255 485 510 -208 -580 -505 301
3783 301 698 -104 -578 -535 -5 544 435 -248 -561 -58 168 598 317 -661 -431 196 628 617 -383 -410 -245
3804 -245 415 646 -14 -352 -435 -1 276 534 -220 -747 -260 450 445 -182 -614 -576 306 482 213 -237 -505
3825 -505 -144 351 295 -298 -266 -275 323 214 258 -435 -190 -32 536 330 -86 -412 -369 298 474 377 -872 -491
3847 -491 52 180 121 -489 -456 -389 335 615 25 -546 -329 92 418 182 -198 -505 117 274 557 53 -142
3868 -142 -283 273 449 243 -253 -215 -384 611 256 -109 -362 -365 380 316 33 -406 -381 -114 566 71 -222 -479
3890 -479 -241 222 502 -40 -260 -208 80 693 300 55 -460 36 624 693 272 -386 -407 301 662 213 -168
3911 -168 -452 -343 109 366 -446 -443 -428 365 430 -25 -23 -596 152 311 295 -146 -319 150 360 510 223 -136
3933a36k8K17N79j36p16j53JN45L68n89k26MlM25P9l10o02O17O33k37n50j02J48
3956a72L29K95q3m26k30L6N43J88p90j58K23L91M71j20q05j18L17M38m8l91l47
3977d57J68M76L88n08j97q1J48P10k44p67j20M98K71L4j46o73j1O55j18Q3rm73
3999c73K10O18k9p34K82k59M14L08m89k15mK76M16lm79m31L78J52J73O2n09j21
4021c57Q4O45l35m3m45M2Q54J15l02q19L00L70K24on01N0J7J67K69j82m14k19
4043d86R88K27n48o86O4J92L55L10j97o58M37J14Q4j17m32J13L64K51%l67l08
4064c00P5M22K94n95K04m20L11K96Pl54m29M04K69K0J5o21p4K63P26l69j85n00
4086e41K84P41k18L2q99K71M81N8P9l95k50L05L11Q7l16m74N6O41M62l35r16K66
$$ plain form
3933 -136 -164 53 632 496 -220 -373 -372 173 541 -48 -274 -270 -273 152 231 -79 -681 -64 569 332 -218 -320 -172
3956 -172 157 452 369 -57 -287 -251 292 480 -310 -468 -245 146 617 497 -308 -426 -109 329 281 -110 -457
3977 -457 -289 187 575 67 -130 -211 -63 647 403 -364 -484 14 285 319 173 -500 -511 144 26 109 100 -373
3999 -373 -163 455 426 -308 -26 -285 129 437 -52 -267 -271 5 421 418 -61 -492 -114 38 211 273 -236 -357
4021 -357 -273 372 37 -6 -451 -409 445 560 258 -561 -261 109 333 327 -174 -124 -107 60 329 147 -267 -486
4043 -486 502 729 181 -505 -441 -249 106 416 219 -439 -2 112 196 79 -353 -240 124 375 375 8 -300
4064 -300 -225 197 491 -104 100 -320 -9 287 294 -60 -489 -85 184 204 219 -402 -476 -213 513 144 -41 -541
4086 -541 -257 484 266 298 -601 -330 151 209 288 -107 -357 -52 259 346 30 -444 -388 253 715 380 -536 -270
4108b70J60O24j97n67l44L47K12K94K63q85J41J99O23j66n33k41J14M82K03m01
4128E8k23j56J78O10k90n54k10K31O87j34k80o9l56N50N43m36m01l6J53L39J47
4149C51l86p8J0L41j6J19m64k50L55J97P4k99j84j1L58P5j11k77k0J66l3J89k09
4172a03l26J3O84M4j32m28K70K13N1j44j69o44P25K77j49j28l34O9M87J39l59
4193E6l14j99M64J57N0j91Q7m14L96K19j2o87J2K48K16M3k37j68J46J44K89k85
4215B0j92k64K53K56K53m23k51K15N14p1j37l76j3J78N32k04o37M2j88O78J83
4236C68m79k2n1J10L21p9n28k4K26M40j33l63l4k63O69p5J42m73O9L19K07l33
4258A4K04n50K72M7M09l73k04j86P03j58k58J94k42l2J17L95m89l95K32L77J87
$$ plain form
4108 -270 -110 514 317 -250 -594 -247 -35 259 522 -363 -222 -23 600 434 -99 -340 -226 256 459 58
4128 58 -165 -321 -143 467 177 -377 -587 -356 331 197 -83 -152 -508 42 585 149 -252 -288 -135 204 351
4149 351 -35 -113 -103 238 222 341 -123 -373 -18 179 253 -46 -230 -241 117 192 81 -196 -216 -50 -83 106 -103
4172 -103 -429 -416 268 312 180 -248 22 235 286 142 -27 -671 54 331 182 54 -280 -211 276 415 56
4193 56 -258 -457 7 164 214 23 110 -304 92 311 299 -388 -376 -128 88 131 -106 -274 -128 16 305 20
4215 20 -172 -436 -183 73 326 -97 -348 -133 381 310 173 -203 -216 -38 494 290 -347 -305 -493 185 368
4236 368 -111 -133 -184 -74 247 168 -360 -384 -158 282 149 -214 -248 -511 158 83 225 -248 -179 140 347 14
4258 14 218 -332 -60 -13 396 23 -181 -367 336 178 -80 114 -128 -160 -43 352 -137 -532 -300 77 264
4279B64P7m28l44K24L14K07L3m91J10K81K5n0r2k97K36J35j17l31qn2J55M17k63
4302Ek4j77j20M76n7j46l05P6M45q0p2k71j8L92K07m15J4j61K33K40k3j92k40
4325b13j15L83J73n26J99j42O7K79O9k70k70K83K40jj85K7r6M5L97j37k18j52
4347a63K58J19p4j52k04L8L63q9J63k87k95J29M71J37l40m11j35M53R0J22j38
4368E5m45L84J81J12Q2o05M4J11M96k48j99j48J25L36j60k14Q9k18J92L57J57
4389D84p73k43N07K27q0j98k97J23K84J14j63lj59J18L14K76p09k45K15M4J70
4410FJ81l23l8J95L75k43l46K58l69M71P6l56j94L9L66po8o2m10K88K77K23m64
4433a25l12J42P1L27J1m02N8K31L25m53p9k6j9Q1N39k32n5k45K22L40j61k79l25
$$ plain form
4279 264 341 -87 -431 -207 107 314 347 -144 -34 247 272 222 130 -167 69 204 87 -244 -252 -304 -149 268 5
4302 5 -19 -196 -316 160 103 -43 -348 -272 173 93 21 -250 -268 124 331 -84 -70 -231 2 242 219 27 -213
4325 -213 -328 55 228 -298 -99 -241 -174 105 174 -96 -366 -83 157 156 -29 -2 -98 -53 344 207 -11 -163
4347 -163 95 214 140 -12 -216 -178 185 96 259 -28 -323 -194 277 414 74 -337 -472 -19 71 193 55
4368 55 -390 -6 175 287 369 -236 -192 -81 415 167 -32 -180 -55 281 121 -93 -4 -222 -30 327 484
4389 484 -289 -532 -25 202 122 -76 -373 -250 34 148 -15 -18 -177 -59 255 531 -178 -423 -208 -164 6
4410 6 187 -136 -174 21 396 153 -193 65 -304 167 243 -113 -307 -268 98 91 23 -39 -449 -161 116 339 -125
4433 -125 -437 -295 -224 103 114 -288 -230 1 326 -127 -206 -232 -251 -170 369 137 82 -163 59 399 238 -41 -366
4456c66J85M53K8j78j55l9M6J56r4o7k86O1L31K11k08n1j85o1N52k39l16J71o6
4479a17K42M02l79k72j3J68L26j61m31k2M19p0J98m67k17K08J64K06j60J77m19
4500b18L73k77M05l23j82J47m5K72j57O0k02M7K62m3k45Q4J44K12k0o4k99k91
4522c60M33L27j42k05j58l9J19P0k9p0l13K79J21M67m86k21J19K63K1j44n9l5
4544d2L00m7l01J72m77O5L31M13k24l78J02K81K47o19R9K14m2J31k84q4O7RL39
4567B72J0j48m8k23L58n8l39K11m86L17L01o9j2j26j47J50K62k00k29M1n7L5J81
4590dM9l60K32J06K85l69J2l06M22J32r0n5k43J85K0J59k09m3k7K20k8l2lj22
4614f9j38J35J19J31k50K19j86K43k73J58j52k77O52m57J38j53o8L2K59J23n10
$$ plain form
4456 -366 -181 272 300 122 -33 -72 -26 130 36 -31 -317 -256 75 286 78 27 -158 -219 333 94 -222 -51 -117
4479 -117 125 527 148 -124 -137 31 357 196 -235 -257 162 92 290 -177 -394 -186 -22 184 24 201 -218
4500 -218 155 -122 283 -40 -222 -75 -120 152 -5 55 -147 -100 162 119 -126 -42 102 314 294 230 -69 -360
4522 -360 73 400 258 53 -105 -144 -25 45 16 -54 -367 -88 33 500 14 -207 -88 175 196 52 -7 -42
4544 -42 258 211 -90 82 -395 -330 1 414 190 -188 -86 195 442 -177 -78 136 94 225 -59 -143 -76 -67 272
4567 272 282 134 86 -137 221 163 -176 35 -451 -134 167 98 86 -40 -187 -37 225 25 -204 -163 -220 -185 -4
4590 -4 45 -315 -83 23 308 -61 -49 -355 67 199 109 54 -189 -4 16 175 -34 -77 -104 116 88 56 53 -69
4614 -69 -207 -72 47 178 -72 147 -39 204 -69 89 -63 -340 312 -145 -7 -160 -228 -196 63 186 -324
4635c24qM25J07j44k9k49jL13%q7Pj44n3K40K98n20J49J77K03j74k14Mk6j0J95
4660A35K67m92M0m1K17K47k66K2k66K68j08J18Pm48L47J41O9k57j03n8jK38j38
4683f2M3l65L57Q1K65j45m21J98K64K3k17j14P7l3NJ01j50L0J9K21lm6k85J72
4707A5O7k4k12P1m56M36J36J31o7j54m8R8k6R4n35M46L12m11M64r5j90K9P4k37
4731h2J74q5j8o5L61qk49j27L00K23l21k32Q3k25Q7L46rj76q9k4J32M06n28M6
$$ plain form
4635 -324 -332 93 200 56 27 -222 -223 90 90 3 10 -134 -187 53 351 -169 -20 157 360 186 -28 -24 -50 -60 135
4660 135 402 -90 -50 -91 126 373 107 129 -137 131 23 141 148 -300 47 188 257 0 -103 -161 -162 76 -62
4683 -62 -19 -384 -27 54 319 174 -247 -49 215 238 21 -93 -16 -49 -44 57 -93 -63 -44 177 174 128 -157 15
4707 15 82 58 -154 -83 -539 -103 33 164 97 -57 -105 -7 -33 61 -474 -28 284 -127 337 242 52 81 155 -82
4731 -82 92 7 -11 -76 285 277 28 -99 201 424 103 -129 -46 -271 -184 162 153 -23 -112 -136 -4 402 -126 -80
$$ [...]
8191B98
##END NTUPLES=NMR FID
##END=
