##TITLE=1H_DHA-DCC-f3
 CDCl3, 8 sc, 
 5.4.2019
##JCAMPDX= 6.0         $$ Bruker NMR JCAMP-DX V2.0
##DATA TYPE= NMR FID
##DATA CLASS= NTUPLES
##ORIGIN= UXNMR, Bruker Analytische Messtechnik GmbH
##OWNER= root
$$ XWIN-NMR		Version 3.5
$$ Fri Apr  5 14:33:15 2019 Russian Standard Time (UT+4h)  she@DPX200
##.OBSERVE FREQUENCY= 200.1316
##.OBSERVE NUCLEUS= ^1H
##.DELAY= (6, 6)
##.ACQUISITION MODE= SIMULTANEOUS
##.ACQUISITION SCHEME= undefined
##.AVERAGES= 8
##.DIGITISER RES= 18
##SPECTROMETER/DATA SYSTEM= spect
##.PULSE SEQUENCE= zg30
##.SOLVENT NAME= CDCl3
##.SHIFT REFERENCE= (INTERNAL, CDCl3, 0, 15.7039)
##AUDIT TRAIL= $$ (NUMBER, WHEN, WHO, WHERE, WHAT)
$$ ##TITLE= Audit trail, XWIN-NMR		Version 3.5
$$ ##JCAMPDX= 5.01
$$ ##ORIGIN= Bruker BioSpin GmbH
$$ ##OWNER= she
$$ F:/spectra/data/she/nmr/H-F/1/audita.txt
$$ ##AUDIT TRAIL=  $$ (NUMBER, WHEN, WHO, WHERE, WHAT)
(   1,<2019-04-05 14:32:23.71 +0400>,<she>,<DPX200>,
      <created by zg, POWCHK disabled, PULCHK disabled
       configuration hash MD5:
       00 E9 B6 7A A2 85 ED C7 34 08 36 98 17 FE 4E 26
       data hash MD5: 16K
       29 AD AB 83 62 16 9B BD 2E EC A8 A6 2B 3B AC 78>)
$$ ##END=
$$ 
$$ hash MD5
$$ 41 62 A0 B8 DB 3B 19 1D F9 57 62 F7 77 48 E5 DA
##$RELAX= 
##$RELAX= 
##$RELAX= 
##$RELAX= 
##$RELAX= 
##$RELAX= 
$$ Bruker specific parameters
$$ --------------------------
##$DU= <F:/spectra>
##$EXPNO= 1
##$NAME= <H-F>
##$PROCNO= 1
##$TYPE= <nmr>
##$USER= <she>
##$AMP= (0..31)
100 100 100 100 100 100 100 100 100 100 100 100 100 100 100 100 100 100 
100 100 100 100 100 100 100 100 100 100 100 100 100 100 
##$AQSEQ= 0
##$AQ_mod= 1
##$AUNM= <au_zg>
##$AUTOPOS= <>
##$BF1= 200.13
##$BF2= 200.13
##$BF3= 200.13
##$BF4= 200.13
##$BF5= 200.13
##$BF6= 200.13
##$BF7= 200.13
##$BF8= 200.13
##$BYTORDA= 1
##$CFDGTYP= 0
##$CFRGTYP= 5
##$CHEMSTR= <none>
##$CNST= (0..31)
1 1 145 1 1 1 1 1 1 1 1 1 1 1 1 1 1 1 1 1 1 1 1 1 1 1 1 1 1 1 1 1 
##$CPDPRG= <>
##$CPDPRG1= <>
##$CPDPRG2= <>
##$CPDPRG3= <>
##$CPDPRG4= <mlev>
##$CPDPRG5= <mlev>
##$CPDPRG6= <mlev>
##$CPDPRG7= <mlev>
##$CPDPRG8= <mlev>
##$CPDPRGB= <>
##$CPDPRGT= <>
##$D= (0..31)
0 1.2 0 0 0 0 0 0 0 0 0 0.03 0 0 0 0 0 0 0 0 0 0 0 0 0 0 0 0 0 0 0 0 
##$DATE= 1554460343
##$DBL= (0..7)
120 120 120 120 120 120 120 120 
##$DBP= (0..7)
150 150 150 150 150 150 150 150 
##$DBP07= 0
##$DBPNAM0= <>
##$DBPNAM1= <>
##$DBPNAM2= <>
##$DBPNAM3= <>
##$DBPNAM4= <>
##$DBPNAM5= <>
##$DBPNAM6= <>
##$DBPNAM7= <>
##$DBPOAL= (0..7)
0.5 0.5 0.5 0.5 0.5 0.5 0.5 0.5 
##$DBPOFFS= (0..7)
0 0 0 0 0 0 0 0 
##$DE= 6
##$DECBNUC= <off>
##$DECIM= 24
##$DECNUC= <off>
##$DECSTAT= 4
##$DIGMOD= 1
##$DIGTYP= 9
##$DL= (0..7)
0 120 120 120 120 120 120 120 
##$DP= (0..7)
150 150 150 150 150 150 150 150 
##$DP07= 0
##$DPNAME0= <>
##$DPNAME1= <>
##$DPNAME2= <>
##$DPNAME3= <>
##$DPNAME4= <>
##$DPNAME5= <>
##$DPNAME6= <>
##$DPNAME7= <>
##$DPOAL= (0..7)
0.5 0.5 0.5 0.5 0.5 0.5 0.5 0.5 
##$DPOFFS= (0..7)
0 0 0 0 0 0 0 0 
##$DQDMODE= 0
##$DR= 18
##$DS= 0
##$DSLIST= <SSSSSSSSSSSSSSS>
##$DSPFIRM= 0
$$ [...]
##$SUBNAM2= <"">
##$SUBNAM3= <"">
##$SUBNAM4= <"">
##$SUBNAM5= <"">
##$SUBNAM6= <"">
##$SUBNAM7= <"">
##$SUBNAM8= <"">
##$SUBNAM9= <"">
##$SW= 24.9336934301222
##$SWIBOX= (0..15)
0 0 2 0 0 0 0 0 0 0 0 0 0 0 0 0 
##$SW_h= 4990.01996007984
##$TD= 16384
##$TD0= 1
##$TE= 0
##$TE2= 300
##$TE3= 300
##$TEG= 300
##$TL= (0..7)
0 120 120 120 120 120 120 120 
##$TP= (0..7)
150 150 150 150 150 150 150 150 
##$TP07= 0
##$TPNAME0= <>
##$TPNAME1= <>
##$TPNAME2= <>
##$TPNAME3= <>
##$TPNAME4= <>
##$TPNAME5= <>
##$TPNAME6= <>
##$TPNAME7= <>
##$TPOAL= (0..7)
0.5 0.5 0.5 0.5 0.5 0.5 0.5 0.5 
##$TPOFFS= (0..7)
0 0 0 0 0 0 0 0 
##$TUNHIN= 0
##$TUNHOUT= 0
##$TUNXOUT= 0
##$USERA1= <user>
##$USERA2= <user>
##$USERA3= <user>
##$USERA4= <user>
##$USERA5= <user>
##$V9= 5
##$VALIST= <valist>
##$VCLIST= <CCCCCCCCCCCCCCC>
##$VD= 0
##$VDLIST= <DDDDDDDDDDDDDDD>
##$VPLIST= <PPPPPPPPPPPPPPP>
##$VTLIST= <TTTTTTTTTTTTTTT>
##$WBST= 1024
##$WBSW= 4
##$XGAIN= (0..3)
0 0 0 0 
##$XL= 0
##$YL= 0
##$YMAX_a= 282678
##$YMIN_a= -393374
##$ZGOPTNS= <>
##$ZL1= 120
##$ZL2= 120
##$ZL3= 120
##$ZL4= 120
##$ABSF1= 10
##$ABSF2= 0
##$ABSG= 5
##$ABSL= 3
##$ALPHA= 0
##$AQORDER= 0
##$ASSFAC= 0
##$ASSFACI= 0
##$ASSFACX= 0
##$ASSWID= 0
##$AUNMP= <proc_1d>
##$AZFE= 0.1
##$AZFW= 0.1
##$BCFW= 1
##$BC_mod= 2
##$BYTORDP= 1
##$COROFFS= 0
##$CY= 11.3945322036743
##$DATMOD= 1
##$DC= 2
##$DFILT= <>
##$DTYPP= 0
##$F1P= 18.9103706918063
##$F2P= -1.10871071338519
##$FCOR= 0.5
##$FTSIZE= 0
##$FT_mod= 4
##$GAMMA= 1
##$GB= 0.15
##$INTBC= 1
##$INTSCL= 1
##$ISEN= 128
##$LB= 0.24
##$LEV0= 0
##$LPBIN= 0
##$MAXI= 10000
##$MC2= 0
##$MEAN= 0
##$ME_mod= 0
##$MI= 1.114404
##$NCOEF= 0
##$NC_proc= 0
##$NLEV= 6
##$NOISF1= 3.799351
##$NOISF2= 2.8
##$NSP= 1
##$NTH_PI= 0
##$NZP= 0
##$OFFSET= 15.70392
##$PC= 1
##$PHC0= -8853.429
##$PHC1= 15.80028
##$PH_mod= 1
##$PKNL= yes
##$PPARMOD= 0
##$PSCAL= 0
##$PSIGN= 0
##$REVERSE= no
##$SF= 200.130013532006
##$SI= 16384
##$SIGF1= 3
##$SIGF2= 2
##$SINO= 400
##$SIOLD= 16384
##$SREGLST= <1H.CDCl3>
##$SSB= 0
##$STSI= 0
##$STSR= 0
##$SW_p= 3612.71676300578
##$SYMM= 0
##$S_DEV= 0
##$TDeff= 0
##$TDoff= 0
##$TI= <>
##$TILT= no
##$TM1= 0
##$TM2= 0
##$TOPLEV= 0
##$USERP1= <user>
##$USERP2= <user>
##$USERP3= <user>
##$USERP4= <user>
##$USERP5= <user>
##$WDW= 1
##$XDIM= 8192
##$YMAX_p= 0
##$YMIN_p= 0
$$ End of Bruker specific parameters
$$ ---------------------------------
##NTUPLES= NMR FID
##VAR_NAME=  TIME,          FID/REAL,        FID/IMAG
##SYMBOL=    X,             R,               I
##VAR_TYPE=  INDEPENDENT,   DEPENDENT,       DEPENDENT
##VAR_FORM=  AFFN,          ASDF,            ASDF
##VAR_DIM=   8192,          8192,            8192
##UNITS=     SECONDS,       ARBITRARY UNITS, ARBITRARY UNITS
##FACTOR=    0.0002004,     1,               1
##FIRST=     0,             0,               0
##LAST=      1.6414764,     0,               0
##MIN=       0,             -393374,         0
##MAX=       1.6414764,     282678,          0
$$ Real data points
##PAGE= N=1
##DATA TABLE= (X++(R..R)), XYDATA
0 0 0 0 0 0 8 -8 8 -8 16 -16 24 -24 32 -40 48 -63 72 -88 104 -120 144 -168 192 -224 256 -295 336 -383
28 -383 435 -491 552 -622 698 -782 872 -971 1081 -1201 1334 -1478 1635 -1811 2006 -2221
44 -2221 2460 -2727 3031 -3374 3767 -4223 4762 -5405 6188 -7172 8447 -10176 12657 -16547
58 -16547 23553 -40060 157401 -48161 -359001 152436 248195 -175391 -228832 194464 150791
69 150791 -162839 -88199 151099 14762 -125440 770 70219 -56699 -50320 43854 9331
80 9331 -54986 2291 22865 -20579 -12307 16200 -14081 -5697 31671 2798 -23066 35665 43981
93 43981 -20236 -8710 40585 -6077 -31078 43135 40535 -47423 -10277 66359 -15859 -81237
105 -81237 36284 77059 -61051 -71444 67368 34995 -95149 -31230 71210 -21976 -88769
116 -88769 24351 60272 -39082 -24032 60339 -2248 -71623 16615 56737 -43294 -41134 75044
128 75044 54568 -46734 -3345 74516 5078 -64773 -3604 43988 3193 -11851 13290 5787
140 5787 -5683 1965 -18108 -25399 24474 30912 -38687 -45046 21444 7487 -53667 -14340 44948
153 44948 -3087 -42412 12720 25500 -34330 -17172 47443 12998 -38887 17139 54793 -16518
165 -16518 -38109 38012 40299 -33112 -15733 47910 12090 -40847 4430 41617 -5380 -19698
177 -19698 26072 15722 -39664 -32191 5975 -7490 -25230 -467 12539 -2411 -1853 3928 -9499
190 -9499 -13024 -1491 -10738 -18139 6800 20112 881 2435 21496 5867 -12149 10596 17634
203 17634 -9902 2199 36340 7380 -28134 12677 36992 -22207 -36749 30575 28952 -42230
215 -42230 -22239 43757 168 -62712 -5468 45476 -18966 -50287 20399 31895 -40645 -36236
227 -36236 31929 19519 -30028 -4166 30095 -2155 -20122 15512 22932 -3317 3387 19994
239 19994 -800 -13449 7615 13815 345 9939 22483 7091 -5583 -2687 -13642 -23683 -7123
252 -7123 2359 -9476 348 19991 -380 -25162 -4757 7211 -24583 -26864 13585 12211 -23147
265 -23147 -6361 30028 6476 -22163 7595 26690 -5163 -12204 19289 17372 -6695 4003
277 4003 19181 728 -4271 13850 4776 -15572 1045 14516 -10249 -15589 13616 9910 -22386
290 -22386 -13794 10390 -7941 -26211 -4031 6963 -11846 -10393 6546 -1934 -10026 6767 8601
303 8601 -7773 4771 22514 -34 -17111 9314 17085 -10972 -5164 30145 22549 -6562 4756
316 4756 18413 -7337 -20013 3148 4002 -13936 -1718 15123 -5264 -17993 4477 5744 -21743
329 -21743 -18084 8440 416 -21829 -8463 11568 -484 -12514 978 13077 4454 -4563 8
342 8 8591 7607 -1729 55 17173 18894 -2424 -4378 17359 9940 -19742 -8259 23671 7385
356 7385 -21712 1066 23757 -8855 -29966 2795 13842 -20226 -23185 9642 2278 -25986 -9463
369 -9463 16865 -428 -15218 11363 19524 -12683 -19563 10073 11519 -15020 -6794 27971 25542
382 25542 -5234 -3678 22662 14466 -17702 -14538 17782 16951 -13896 -11593 17678 11573 -19885
395 -19885 -14002 13448 2099 -23517 -10383 8605 -8309 -19166 3691 10164 -13752 -13278 11352
408 11352 3377 -19951 -2823 24271 6558 -15635 6911 26581 986 -16237 10186 23656
420 23656 -2875 -12436 13292 18982 -7105 -10685 12128 10231 -14045 -9792 13263 4734 -18867
433 -18867 -9525 9118 -9034 -30527 -9579 14731 -639 -14426 9253 20839 -9211 -25457
445 -25457 -1505 8382 -11377 -8392 20658 20996 -2149 2274 18846 4413 -13330 4019 17549
458 17549 -2993 -11722 14025 19063 -8968 -11917 14839 9437 -22436 -17952 9543 1616 -21149
471 -21149 -7068 16287 1613 -18203 -5848 4447 -12977 -18243 4378 11490 -4154 -2349 15641
484 15641 7877 -12894 -3064 18827 8450 -10030 4852 23105 3520 -16307 3919 22461
496 22461 733 -14938 9131 20044 -9302 -20452 6535 9353 -21551 -20806 11337 5847 -22149
509 -22149 -5891 23126 1221 -27606 -5537 14104 -14118 -25488 11870 25819 -6361 -12117
521 -12117 19262 16736 -14883 -7893 23123 13598 -12676 127 21365 4314 -14411 5230 21173
534 21173 -2823 -18508 2569 12771 -13118 -19809 10043 15934 -15254 -20213 9073 6697 -26014
547 -26014 -18662 16734 8848 -21782 -7792 20070 1490 -21653 4057 26829 2551 -12338
559 -12338 11557 15327 -12060 -11928 15237 14078 -4580 5821 22146 5887 -12061 -1414 5960
572 5960 -9519 -14054 2603 7231 -5812 -8166 3651 2759 -10140 -12516 -2482 -1264 -12547 -11492
586 -11492 5427 10726 -2633 -4050 9474 5515 -12935 -7550 14001 11060 -3880 6274 18722
599 18722 2688 -9115 6899 13325 -4739 -5577 11065 4651 -11810 435 12886 -4502 -14934
612 -14934 2977 5127 -16867 -14064 7974 2809 -16350 -7291 8508 -3637 -16036 -2713 10487
625 10487 3914 -2045 5360 8080 -604 -8506 -5205 6345 10324 5875 7863 15628 9600 -6235
639 -6235 -3325 8387 -980 -11915 2050 10056 -7047 -9096 10854 5984 -18700 -9822 9494
652 9494 -8578 -25073 1403 15963 -11037 -16172 14142 12932 -18608 -13182 13279 3760 -14391
665 -14391 4241 22566 7493 -5068 5844 8921 -468 -225 6378 5508 1840 505 -1652 1055
679 1055 4915 353 -3843 522 -1130 -10160 -6085 2840 -5849 -13108 -1395 1603 -12920 -8033 11936
694 11936 3750 -13976 118 14198 -5973 -16492 7062 14650 -5610 -2613 20082 14877 -4588
707 -4588 -515 8356 -650 -3859 5581 5848 854 2749 719 -6401 -991 5490 -4392 -11197 -1862
722 -1862 -1002 -12486 -6701 6007 -410 -9490 -2106 964 -8682 -5667 5771 1595 -5144 5168
736 5168 10546 -685 -1141 10862 7821 -4705 938 12555 5387 -5181 380 6485 1896 -2381
750 -2381 3075 8405 4090 -6337 -9282 -3003 -2081 -9701 -8900 1445 524 -8687 -4287 6382 285
765 285 -8667 -2866 -167 -8184 -4524 8198 6216 -1410 7038 11612 -1532 -4358 8755 7423 -6557
780 -6557 -617 14406 7694 -4434 3388 9446 -3387 -11276 -1696 4130 -3134 -7042 -1271 794
794 794 -3717 -5988 -2603 66 -5076 -9509 -4184 1612 -2110 -3579 4379 4373 -5621 -2624 9444 5731
810 5731 -4075 5210 12666 -1285 -6873 9076 11145 -6506 -3463 14794 8105 -8643 826 12371
824 12371 -3668 -16980 -3003 5592 -6849 -9977 3341 5158 -6004 -7942 34 974 -6513 -10144
838 -10144 -4201 2010 968 -1643 4899 9919 1058 -6685 2389 7760 -2399 -2227 11475 9289 -4520
853 -4520 3102 15760 1622 -11893 2982 9220 -10198 -12595 11141 10474 -12754 -8637 10802
866 10802 375 -18575 -6242 8626 -6117 -17079 -325 9138 -4564 -8172 5659 7421 -4189
879 -4189 -4518 6031 6537 -2081 -1492 6366 7652 977 694 7743 7701 -1677 -969 7952 4511 -6996
895 -6996 -3519 5544 -2633 -10816 2251 9845 -6854 -12800 3791 3509 -16542 -12156 10078 3469
909 3469 -16276 -3718 15363 250 -15307 2668 14124 -5222 -11099 9980 14102 -3585 -2421
922 -2421 13874 8185 -5901 980 10751 936 -7254 1891 6645 -2304 -3988 4949 3382 -7728
936 -7728 -7214 1900 -1260 -10909 -6426 3521 -2416 -12209 -4601 8742 2210 -9398 -443 11210 -225
951 -225 -12076 384 12469 -1 -7610 8545 15728 380 -3626 10811 9504 -6553 -4857
964 -4857 7654 1969 -9096 1145 11857 -73 -8971 1829 3775 -13119 -16003 2195 5106
977 5106 -9460 -6195 10189 4517 -15084 -9539 8164 1854 -12739 -1423 15210 4426 -9176
990 -9176 4165 16981 1646 -9104 6024 12684 -3529 -7444 8886 11492 -3784 -3466 8618
1003 8618 3126 -9984 -4137 5914 -1929 -9353 -361 3848 -7510 -11930 -670 2468 -7166 -5695
1017 -5695 6974 5533 -7849 -6956 5325 2222 -8914 -1741 13232 7765 -4424 3096 13641
1030 13641 3948 -7959 1473 10032 -760 -6676 6198 10580 -1340 -3509 5472 625 -11178
1043 -11178 -7629 1212 -3464 -6633 2282 4902 -5954 -8075 -218 -1713 -9330 -4637 5451 2294
1057 2294 -4730 402 7386 3446 -2553 2213 8258 3299 -3670 114 7533 5084 -773 2915 8322
1072 8322 2868 -5337 -1609 4076 -494 -4762 47 1433 -5571 -7223 -1749 -2176 -5655 -338 4310
1087 4310 -3161 -8123 -1114 692 -7593 -5770 7239 7054 -2580 -50 9155 3740 -6090 32 9266
1102 9266 3698 -2943 4138 9887 3039 -2827 2898 5162 -2133 -6424 -769 1651 -3535 -4161 1696
1117 1696 1797 -4961 -6496 -2278 -2453 -6712 -4657 935 277 -3687 -1768 2292 591 -2211 2579 5991
1133 5991 1266 -1160 3706 5273 -816 -834 6942 7198 -1302 -421 7678 4831 -4253 -2138 5185 -429
1149 -429 -9200 -4748 2636 -718 -4563 300 3424 -3238 -8241 -6279 -4085 -4497 -2058 2181 3469
1164 3469 2807 1804 -1264 -2672 -330 728 752 3298 6436 5632 3354 3423 3394 1372 1179 1408 -816
1181 -816 -698 2349 1370 -2282 421 3747 -2350 -7885 -2930 80 -5975 -7236 831 2488 -5061 -5322
1197 -5322 1200 -86 -5426 -1696 4962 2902 -983 1317 3566 707 -799 2500 4936 4205 3016
1212 3016 4172 4205 2622 496 -245 -227 -1464 -2458 -98 1267 -145 -499 979 -1970 -7433 -6537 -2075
1229 -2075 -3903 -6489 203 5258 -373 -5607 271 2597 -4859 -5444 4125 6081 -356 802 7223
1244 7223 4964 -581 2256 6347 2589 -996 1968 2769 -876 283 3925 1863 -1841 15 -24 -4935
1260 -4935 -6665 -1037 362 -5037 -5619 583 900 -5587 -5751 1364 2692 -3549 -3930 2680 3682 -3034
1276 -3034 -3208 4704 7182 1028 1576 7461 5262 -2124 -1215 4799 2954 -2235 1545 5505 1073 -3375
1292 -3375 1168 2456 -4604 -7032 -567 -456 -6685 -3707 3439 -100 -8209 -3916 3378 -2633 -8836
1307 -8836 238 7380 -1458 -6474 3892 9148 -846 -4362 6277 8576 -1704 -2634 6867 6004 -3229
1322 -3229 -1238 6674 3383 -2744 475 4385 -1878 -5933 -924 1599 -3927 -5944 -1752 -602 -4894
1337 -4894 -4226 1411 1634 -3778 -3679 936 -1254 -6153 -1763 6728 3675 -2955 3526 11642 2435 -7207
1353 -7207 1787 9474 -1467 -6785 8407 13575 -1862 -6105 6923 5103 -8858 -5445 6021
1366 6021 -371 -9530 -1217 5715 -3855 -7431 2142 1018 -9851 -6854 3196 450 -6259 -685
1380 -685 5760 862 -3407 2342 6626 230 -3508 1693 6234 2537 -780 4742 8721 750 -5477
1395 -5477 2326 7659 -1693 -6050 4517 5629 -7937 -7287 5166 752 -10740 -2642 7789 -3463
1409 -3463 -10112 3116 4357 -11722 -8599 7995 2868 -9422 1679 12695 -1031 -8520 5975
1422 5975 9208 -4569 -4274 8675 6451 -3709 1700 9317 3251 -3409 -709 1318 -522 -1461 -1172
1437 -1172 -230 552 -1353 -4315 -369 2249 -4676 -7640 -934 -464 -7555 -3016 6799 1077 -7089 1689
1453 1689 7023 -3983 -5838 6893 6042 -5614 -197 10938 3719 -4509 4183 8076 -2719 -3333
1467 -3333 7821 5417 -5290 -2803 3659 -1437 -5592 729 3201 -1331 -3639 -3134 -4174 -3359 -1959
1482 -1959 -3664 -2911 1244 238 -3247 305 3465 -1336 -3292 2639 2052 -2293 2676 7538 970
1497 970 -2648 6944 7863 -3133 -2500 7475 2074 -7688 123 9588 680 -6509 1818 3646 -6713
1512 -6713 -7003 2697 1223 -7293 -4018 1713 -2485 -5662 -191 2365 -2564 -3970 885 1840 65
1527 65 744 2159 1471 257 1335 2871 4003 3287 3328 3194 2086 -510 -860 1696 688 -2139 187
1544 187 5074 1064 -4583 -1746 545 -6475 -9024 -331 3515 -3399 -4614 2526 1345 -5875 -3792
1559 -3792 2929 -168 -4585 15 4300 976 611 5610 4796 -112 351 3352 684 -1442 2952 4797
1575 4797 1739 197 3455 1592 -3046 -3507 -848 -1051 -2196 -1586 -268 -1103 -3428 -4433 -3208 -1340
1591 -1340 -1119 -2468 -1266 1016 -667 -2342 -664 2483 985 -671 1892 4134 3130 2255 3749
1606 3749 3094 508 367 1054 312 1587 3635 2524 -102 184 1200 -2619 -5298 -2621 102 -2571
1622 -2571 -3358 -165 975 -2931 -4211 -1764 -862 -2477 -2661 -634 753 681 -6 1249 3816 3641 443
1639 443 -561 2271 2372 166 1548 5780 4455 -640 -153 2908 129 -3056 -134 2379 -1468 -3256
1655 -3256 -393 -1009 -4637 -2854 849 -1599 -3697 76 236 -4645 -4853 953 1219 -2520 59 5076
1671 5076 2881 -1983 514 3886 2397 -765 1189 3992 3048 775 1254 4288 3329 -899 -2356 507
1687 507 465 -3052 -2478 1968 1260 -3504 -2628 177 -3174 -5855 -1387 185 -3633 -2540 2118 -197
1703 -197 -3623 493 4169 -931 -2896 3976 4833 -1932 -391 6278 4158 -1839 955 5833 1524
1718 1524 -1981 1882 4202 598 -1621 -108 -207 -2936 -3157 -1090 222 -234 -1308 -1913 -1905 -3267 -5065
1735 -5065 -3202 -130 -627 -897 2288 2725 -1039 -1674 2892 1166 -2993 1643 6493 1184 -1689 5840
1751 5840 7232 -1497 -2608 5218 3232 -5897 -2713 5957 2224 -4792 201 4654 -2497 -7086 -1964
1766 -1964 -64 -4218 -4049 283 501 -2619 -1953 171 -840 -1884 -323 1163 664 -44 1097 3227
1782 3227 2255 628 1676 4352 2146 -720 2536 5327 677 -2657 2362 4180 -3172 -4705 3408
1797 3408 2856 -5322 -3475 3696 -954 -8381 -3784 2786 -2600 -6070 1053 3563 -3124 -3937 2259
1812 2259 1533 -3444 -508 4229 951 -1213 3168 4890 926 233 4322 3830 -1037 -1156 2707 2405
1828 2405 -1003 -420 3058 2360 -2884 -3645 215 453 -4767 -4453 1070 889 -5323 -4041 2176 436
1844 436 -5570 -1770 3285 -607 -4815 896 4189 -1120 -1843 4836 4707 -1520 823 6184 1471 -2926
1860 -2926 2719 5422 -1430 -2476 4520 4028 -3237 -2312 3675 90 -6052 -2878 1611 -1983 -4988
1875 -4988 -958 1479 -1676 -3849 -1143 -1 -1886 -2563 -934 1209 1184 -445 956 3249 2403 -133
1891 -133 975 3468 1201 -530 2854 3734 91 452 4411 1666 -3298 12 3618 -2293 -5477 1710
1907 1710 2883 -5416 -5786 2447 703 -7415 -3765 3587 -136 -6126 -1232 3430 -1341 -3927 1419
1922 1419 3149 -112 452 3879 2575 680 1810 2244 116 839 2522 2076 1454 1956 1956 312 -22
1939 -22 -1405 -1672 -635 -1451 -2838 -1608 1162 -1173 -4476 -676 1263 -4214 -6007 706 1903 -3830
1955 -3830 -2472 5215 3274 -3282 194 5173 -16 -3364 2473 5389 725 506 4857 2880 -1217
1970 -1217 969 3135 -777 -2221 1572 1278 -2583 -1724 1372 -930 -3876 -2094 -125 -1479 -3324
1985 -3324 -1856 -884 -1168 -2536 -1762 244 1216 -1128 -1813 2550 3851 -781 -1027 4043 3242 -1943 -369
2002 -369 5788 3445 -1211 2065 4382 -695 -2529 1771 1244 -3349 -1232 1959 -1518 -3455 832
2017 832 1378 -4313 -4401 523 -1562 -5088 -1721 2567 -540 -2629 1119 1833 -898 -1075 1216 662 501
2034 501 2129 2288 2072 3074 1921 -304 1028 3444 1479 -918 678 1527 -1168 -2249 978 1075
2050 1075 -1907 -1664 -727 -2076 -2917 -1593 -1604 -2164 -1460 -832 -1920 -714 1245 -245 -1351 515 1539
2067 1539 -459 -11 2217 2129 1011 2460 3056 2108 1612 1860 -415 -1236 1485 2209 -917 -231 2718
2084 2718 113 -4284 -1940 1454 -1588 -4560 -1781 252 -2417 -3279 286 460 -2363 -1976 -192 -1134
2100 -1134 -1117 1533 1641 111 584 2424 1716 293 1382 3153 2059 760 1650 3190 1124 -1507
2116 -1507 -515 1513 -331 -1504 1163 2091 -1948 -3778 -1194 -568 -3527 -2929 574 -264 -3109 -1992
2132 -1992 1121 21 -1849 -824 -146 -1615 -751 1659 2532 1947 2667 2337 844 384 1260 1339 432 614
2150 614 1800 2788 1941 -218 -176 479 -1593 -3640 -1343 1647 -852 -4000 -1942 1141 -2014 -3761
2166 -3761 -434 835 -2787 -3729 285 1468 -490 371 2176 318 -573 1461 2010 1495 1941 2676 1622
2183 1622 641 1170 1659 1016 550 382 795 1007 149 -1273 -799 -633 -2836 -2854 34 675 -3259 -3244 443
2202 443 -332 -4387 -1898 2891 -539 -4584 -31 4183 334 -1780 3264 3577 -1096 -1376 3374 2790
2218 2790 -118 1752 3751 1136 -593 2101 1722 -1660 -1059 1059 -222 -2355 -1627 334 -813 -3427
2234 -3427 -2403 79 -580 -2565 -2296 30 -400 -3200 -1797 2769 1512 -2142 -335 3707 1207 -1486
2250 -1486 1769 4493 128 -1798 2841 3722 -158 938 4490 1429 -2826 -178 1879 -2219 -3039
2265 -3039 1723 1026 -3582 -2075 2148 -1150 -5798 -2310 1208 -2214 -4364 386 3170 -1614 -2850
2280 -2850 1240 2520 -912 -1582 1866 2148 166 679 3324 3248 1401 663 1476 1034 -20 632 2166
2297 2166 467 -1359 -373 436 -1940 -2549 345 192 -2811 -2728 395 -212 -4128 -2511 1339 -723 -4075
2314 -4075 -285 3419 152 -2356 1212 3612 -199 -1859 2106 3313 21 227 3373 3552 224
2329 224 113 1666 618 -1725 -220 1733 12 -1269 19 189 -1875 -2397 -1088 -979 -2810 -2395
2345 -2395 359 210 -2152 -1121 1414 85 -2564 -817 1910 336 -1444 951 3522 1995 25
2360 25 1597 3069 1336 -631 1108 2722 1145 -383 315 1397 -266 -1696 -160 237 -1216 -1800
2376 -1800 -1053 -1212 -2367 -1532 -502 -1888 -2178 -215 409 -1858 -1164 1699 732 -2030 -9 3293 878
2393 878 -1172 1726 3880 1120 -510 1973 2724 -217 -32 1933 1133 -339 279 891 -411 -1099 -892
2410 -892 -1493 -1592 -1062 -1200 -2296 -1747 -626 -848 -1717 -1157 -551 -986 -807 -579 -313 742 827 -10 158 2601
2430 2601 2475 138 1027 3374 1952 -979 1135 3344 695 -1422 1085 2490 -972 -1709 818 75
2446 75 -2614 -1964 -512 -1517 -1803 -611 -724 -1938 -1012 -205 -1652 -2127 -239 460 -541 -165 1595
2463 1595 1806 566 825 1655 1125 886 817 1018 1843 2302 613 319 1853 1554 -1311 -1545 1228 313
2481 313 -2464 -1460 910 -546 -3105 -1228 289 -1925 -2998 -842 -235 -1390 -922 226 -77 -662
2497 -662 681 747 -96 1131 2217 1140 339 2042 2478 677 -105 1729 1749 378 428 1194 659 5
2515 5 73 -1036 -1478 -583 -698 -2483 -1391 467 -801 -3211 -1243 695 -2122 -3602 -348 1570 -869
2532 -869 -984 2044 2079 -580 -500 1603 1110 -290 1537 2290 1458 1533 1616 727 558 1090 547 -862 -769 357
2552 357 -343 -1482 -585 -97 -1511 -2229 -1618 -1694 -1447 -1220 -1366 -1233 -66 -81 -1324 -1021 1139 727 -1314
2571 -1314 507 2898 1143 -603 1298 2673 925 -71 1993 2269 -295 324 1312 447 -467 322 -163
2588 -163 -1539 -549 326 -1458 -2642 -350 -197 -2665 -2954 -117 -97 -2181 -980 1334 574 -1407 -554
2605 -554 777 219 -282 417 1478 1857 1373 703 1006 1889 1120 356 1220 1632 317 -678 477 696 -815
2624 -815 -490 80 -687 -1920 -391 -563 -2170 -1904 -22 -748 -3227 -1317 1122 -788 -2402 716 2575
2641 2575 -753 -1746 1579 2377 -524 -394 3308 3071 142 479 2414 1322 -899 -267 1566 1068 -157
2658 -157 112 373 -340 -1293 -943 -883 -1635 -2197 -1136 -855 -1322 -975 -17 -260 -1991 -1340 188 94 -1721
2677 -1721 330 2524 835 -1008 1266 3123 600 -990 1718 3604 1017 -698 1932 2408 -847
2692 -847 -1464 1362 1439 -1444 -1333 657 -435 -2469 -1174 217 -1242 -2590 -1234 -760 -1749 -912 726
2709 726 -186 -1680 -383 653 -786 -886 1743 2626 587 161 2659 2443 -224 -448 2018 1822 -251
2726 -251 382 2699 1056 -703 -482 148 -483 -1388 -1020 -632 -1146 -1609 -824 -954 -834 -923 -888 -1451 -2015 -671
2746 -671 398 132 -396 649 1054 257 -467 1625 2757 644 -313 2199 3058 -153 -347 2740 1645
2763 1645 -1122 -238 1994 395 -1958 -702 414 -1495 -1951 -505 -547 -1746 -1719 -631 -1105 -1422 -278
2780 -278 -168 -1714 -1003 541 89 -142 1161 1378 510 226 580 921 1809 1391 677 1200 2359 1231
2798 1231 -623 396 1822 -252 -2383 -30 1664 -941 -2505 -135 310 -2409 -2112 474 -142 -2208
2814 -2208 -1666 -379 -825 -1287 318 340 -377 -33 282 765 958 1889 1172 281 733 1252 1203 1281 863 992
2834 992 977 922 -770 -592 834 3 -1926 -1322 1131 -120 -2501 -875 504 -2287 -3625 -900 660
2851 660 -1418 -1645 698 447 -963 505 1324 39 -235 1034 849 203 1916 2884 836 -263 1942
2868 1942 1664 -363 -4 2073 1072 -1177 -653 975 38 -1494 -751 -540 -1303 -1840 -1039 -389 -838 -1242
2886 -1242 -1545 -1132 -714 -762 -218 -38 29 250 694 708 841 496 1143 608 696 1627 2355 824 221 1314
2906 1314 1025 -847 -245 1541 738 -1126 -1034 654 -169 -1810 -1369 -398 -1284 -2617 -1170 28 -491
2923 -491 -771 -380 -331 -410 83 -317 -60 473 901 538 755 1591 2061 932 451 1113 1555 799 166 948
2943 948 770 67 -395 -27 306 -182 -958 -1053 -1011 -855 -1050 -745 -761 -752 -779 -1578 -936 -268 15 -914 -768 717
2965 717 683 2 194 1912 1681 -178 337 1971 1819 140 388 1807 965 -402 370 1500 344 -781
2983 -781 -459 -102 -518 -1467 -600 -629 -921 -1515 -612 -1147 -920 -1016 -192 -895 -942 -45 563 -393 -478 931 1166
3004 1166 324 270 1832 1735 400 456 1862 1842 153 434 1453 1128 -547 -435 957 78 -727 -1113 -496
3023 -496 -644 -1204 -1102 -1058 -880 -530 -1416 -1210 -691 -391 -1026 -541 104 473 194 260 1235 923 718 764 638
3044 638 963 872 650 753 1145 1616 569 93 813 586 -906 -1114 -355 -184 -1310 -1377 -138 -562 -1235
3063 -1235 -1511 -675 -990 -969 -481 -978 -248 238 -69 -315 120 821 264 -219 1100 1783 1392 776 919 1712
3083 1712 1313 256 179 1111 773 -376 -341 596 271 -875 -1267 -191 -108 -1937 -1520 -193 -409 -1829
3101 -1829 -1177 -115 -911 -1599 51 611 -325 55 718 395 -209 856 1366 418 146 1647 2094 527
3119 527 102 1952 1543 -562 -187 1366 572 -1213 -1041 654 633 -1771 -1574 -17 -190 -2144 -1802 273
3137 273 -209 -1527 -1106 131 123 -1245 -349 759 201 -102 603 846 849 981 1492 981 677 1230 1412 539
3157 539 -284 1028 1267 -712 -507 815 426 -1170 -1213 396 -340 -1651 -1700 -604 -905 -1978 -1371 -217
3175 -217 49 -733 -235 234 210 -212 -184 795 746 586 847 1252 844 1200 928 817 928 1131 1020 111 118 1063
3197 1063 339 -778 -536 416 2 -1720 -1290 -61 -735 -1683 -897 -188 -896 -1339 -921 -196 -567 -283 -269
3216 -269 511 326 550 595 607 982 1446 1021 660 1259 1058 614 29 439 946 428 -13 -237 662 386 -1116
3237 -1116 -1051 110 -686 -2227 -1488 -79 -539 -1875 -799 636 78 -1297 -662 785 118 -733 449
3254 449 1363 496 294 1066 1065 753 871 1148 868 656 967 776 238 315 529 119 -740 -514 -76 -511 -1041
3275 -1041 -760 -415 -568 -1307 -1327 -984 -707 -1211 -1234 -66 238 -587 -487 788 1145 107 -137 1387 1682
3294 1682 502 655 1711 962 53 609 1030 321 97 814 252 120 138 -150 -627 -1077 -336 -795 -1828
3313 -1828 -813 87 -716 -1767 -246 -531 -1076 -1160 77 215 -449 12 786 216 160 1061 769 660 1162
3332 1162 1400 655 600 1605 1064 -73 469 993 97 -482 -630 192 -313 -884 -685 -704 -218 -1045 -1462 -1193
3352 -1193 -373 -415 -1342 -565 368 -391 -1281 446 1092 175 79 957 1613 110 440 1360 1026 524 1051 1270
3372 1270 348 332 1101 372 -688 345 875 -1018 -1161 246 98 -1988 -1561 -4 -603 -1956 -1172 150
3390 150 -787 -826 -285 321 -526 -252 144 10 543 1008 597 -5 1172 1333 451 615 1417 1439 10 159
3410 159 822 683 -28 -136 -212 -200 -927 -638 -711 -149 -232 -1293 -1422 -403 -336 -1744 -1140 41 -460 -740
3430 -740 517 663 134 -339 763 377 362 891 1404 713 461 1713 1518 -108 480 1676 193 -1047
3448 -1047 423 1159 -432 -829 -231 132 -1521 -1375 -458 -508 -1363 -1230 -682 -461 -346 -339 -652 -200 -192 -335
3468 -335 -388 456 1133 415 353 962 1162 602 427 1246 1362 422 350 763 462 464 388 13 -228 -211 -169 -576 -568
3491 -568 -82 -869 -1594 -1182 -958 -124 -1134 -1176 -279 118 -704 -561 653 680 -200 -505 891 688 395 363
3511 363 965 1273 427 225 1122 1377 549 84 410 85 92 14 -136 -605 -802 -788 -1137 -886 -79 -438 -1136
3532 -1136 -1038 -576 -202 -854 -834 115 253 -909 -331 1067 1070 -154 401 1456 949 58 961 1519 493
3551 493 -94 688 656 102 631 802 -419 -554 261 146 -1142 -897 27 -817 -1979 -856 189 -524 -1663
3570 -1663 -506 381 -981 -1176 700 763 -206 -285 571 1011 409 201 1002 912 612 554 1031 1130 653 264
3590 264 350 352 -151 27 271 -79 -978 -179 -400 -733 -747 271 -602 -1827 -962 396 -501 -1200 -504 521
3610 521 -340 -1001 427 1222 285 -53 925 1361 268 1078 1203 1023 430 754 536 630 907 496 -226 -453
3630 -453 -101 -241 -808 -704 -96 -337 -1287 -801 -331 -618 -1316 -1070 -809 -528 -369 -488 -29 238 99 -35
3650 -35 195 877 770 628 817 1290 920 743 1226 848 470 153 196 65 499 257 32 -607 -32 -624 -843
3671 -843 -736 280 -588 -1451 -959 132 -739 -1456 -589 70 -109 -636 30 619 476 500 316 822 782 309
3691 309 677 395 981 836 135 1015 1129 526 -46 387 258 -75 -492 -160 -194 -571 -981 -597 -1011 -940 -779
3712 -779 -815 -1016 -624 -336 -355 -876 -90 365 -300 -209 250 1074 430 343 977 1482 578 307 902 1180 577
3733 577 -159 437 794 -213 -353 -164 -18 -521 -899 -458 -447 -792 -953 -990 -887 -670 -362 -716 -715 -296 101
3754 101 -263 -307 506 766 -2 85 1126 1138 376 631 1021 1105 358 280 821 900 260 -46 177 247 -155 -371
3776 -371 -862 -386 -571 -479 -704 -260 -222 -875 -958 -889 -351 -343 -693 -535 176 119 -189 144 1112 562 327 407 1096
3799 1096 1089 728 770 977 577 162 301 429 120 -13 241 38 -228 -303 -264 -735 -848 -897 -1030 -1155 -811 -73
3821 -73 -490 -916 -467 87 297 -719 -11 656 448 -1 465 1308 577 270 252 1039 969 127 444 1015 829
3842 829 158 159 159 251 -506 -533 -355 -255 -650 -569 -349 -637 -815 -748 -841 -657 -387 -428 -679 -353 -20 281 -458
3865 -458 110 748 542 551 792 940 898 613 560 911 356 498 324 438 204 12 58 -6 -166 -362 -954 -592
3887 -592 -326 -436 -955 -690 -1001 -497 -735 -598 -285 -102 17 -129 132 34 16 -136 44 870 262 318 867
3908 867 1079 622 341 517 1099 299 85 230 169 243 -378 -223 -244 -494 -598 -647 -661 -631 -285 -579 -871 -491
3930 -491 -275 -415 -821 -15 431 243 -100 479 855 330 -44 485 1085 279 261 866 1071 489 12 546
3950 546 694 298 -337 75 39 -238 -753 -655 -432 -696 -877 -616 -505 -600 -552 -233 -346 -791 25 -229 -460
3971 -460 76 369 472 -61 724 1042 549 383 842 1057 426 130 715 712 396 135 487 271 -259 -282 -209
3992 -209 -276 -455 -701 -438 -441 -272 -750 -1100 -534 -296 -809 -561 -221 400 -172 -51 73 206 418 -112 481
4013 481 647 1002 407 311 755 956 440 311 514 1020 -18 -387 326 59 -828 -706 -46 -587 -1114 -685
4033 -685 -486 -708 -850 -160 -659 -669 -449 343 -270 -540 471 524 -188 -5 1327 623 229 444 1176 1152
4053 1152 174 198 1021 773 133 -148 614 106 50 -624 265 -239 -660 -545 -503 -465 -865 -656 -607 -641 -484 -384
4075 -384 -563 -368 420 62 -68 274 519 677 7 352 623 746 76 772 981 623 532 283 696 574
4095 574 240 110 285 137 80 -672 -317 -77 -568 -901 -439 -514 -504 -861 -550 -129 3 -591 -856 302 338
4116 338 -93 -14 619 505 580 451 768 627 746 489 187 1012 629 283 329 89 458 97 -386 -254 -60
4137 -60 -370 -782 -1117 -394 -815 -1102 -552 -147 -626 -1081 -380 3 -36 -454 -81 50 210 258 748 665 343
4158 343 536 560 417 1041 1093 355 -75 855 611 -228 -182 131 259 -1105 -693 201 -357 -900 -747 -362 -689
4179 -689 -1028 -634 -338 -152 -617 -552 -180 25 8 116 53 351 483 891 463 724 786 961 298 150 1100
4200 1100 838 -29 33 532 191 -348 -326 422 -16 -1273 -773 -170 -551 -913 -502 -235 -945 -828 -109 -255
4220 -255 -287 -68 -2 -337 129 584 308 -75 191 730 232 -55 956 1235 518 -24 403 404 -268 -375 421
4241 421 365 -55 -738 -189 200 -370 -936 -385 -607 -497 -575 -394 -722 -585 -737 -252 -328 -168 99 -129 -78
4262 -78 379 724 339 138 759 901 443 -68 798 1146 28 108 537 461 -71 -168 409 283 -701 -643 -310
4283 -310 -578 -591 -574 -489 -613 -407 -582 -241 -89 -216 -297 -195 -216 468 551 131 558 898 630 7 373 911
4305 911 917 152 -109 239 476 -233 -6 446 13 -245 -301 -155 -177 -358 -469 -590 -536 -558 -267 -745 -776 -145
4327 -145 -461 -593 -61 466 55 -293 452 740 359 41 531 1076 306 252 540 798 624 413 162 507
4347 507 273 -39 137 162 226 -446 -590 -330 -216 -566 -1020 -599 -1 -375 -621 -142 -129 -360 -320 -451 305
4368 305 352 279 133 524 792 293 407 804 928 901 251 640 773 363 48 2 -36 -2 -139 -503 -32 -322
4390 -322 -708 -772 -428 -268 -554 -788 -508 142 -371 -839 -290 140 -184 -333 490 353 123 264 737 396
4410 396 834 487 767 287 622 863 489 4 533 809 -60 -431 126 -311 -948 -617 -118 -172 -859 -751
4430 -751 63 -267 -673 -764 -337 120 -410 -417 -112 326 251 48 311 433 788 621 484 594 762 764 264 275
4452 275 677 114 -3 -195 151 270 -787 -464 177 -115 -915 -624 -10 -216 -698 -524 -417 -324 -280 -234 153
4473 153 -259 -303 -307 40 288 435 233 458 550 602 598 556 587 598 521 91 486 403 223 -111 -220 156 -232 -260
4497 -260 -683 -168 -533 -697 -677 -515 -378 -445 -253 -78 -478 -231 -574 106 250 -79 383 187 827 572 295
4518 295 391 812 565 647 670 860 331 418 290 195 80 -24 -523 -275 8 -370 -744 -425 -333 -287 -719 -497
4540 -497 -442 -245 -334 -638 245 -143 -1 -271 317 330 391 380 694 589 345 321 438 530 528 361 403 616 502
4563 502 -140 -125 86 -108 -434 -534 -156 -147 -310 -702 -453 -180 -226 -538 -517 -295 -167 -159 -393 228 437 244
4585 244 192 627 319 592 140 298 721 341 501 442 625 412 219 -181 273 -58 0 -442 -337 -148 -844
4606 -844 -727 -464 -301 -852 -558 -483 -485 -427 -793 -102 -197 -49 -309 -171 288 15 241 425 690 495 810 439
4628 439 457 367 389 206 509 500 139 249 -257 -34 76 -185 -451 -238 -46 -410 -635 -424 -306 -623 -485 -570
4650 -570 -217 -553 -321 -285 195 64 32 386 138 486 451 418 606 659 608 446 705 760 510 330 145 297
4672 297 97 -189 -267 -137 36 -640 -489 -298 -579 -567 -734 -672 -430 -478 -620 -309 -351 -476 -147 170 277 248
4694 248 96 353 312 493 409 713 604 375 253 332 270 133 280 387 101 83 -192 -161 -472 -267 -76 -769
4716 -769 -672 -404 -241 -550 -795 -247 -350 -570 -268 200 14 -80 14 354 451 892 379 665 569 656 765 398
4738 398 535 606 240 80 702 501 230 -536 -35 -174 -126 -603 -402 -349 -665 -604 -484 -255 -684 -221 -626
4759 -626 -79 363 -182 -95 -24 339 392 124 498 590 609 297 469 505 686 394 358 644 122 139 177 320 -52
4782 -52 -17 -398 -444 -30 -556 -797 -391 -294 -445 -608 -358 -157 -58 -240 -628 -179 -8 -6 -418 39 357 151
4804 151 379 587 644 406 230 651 660 -109 401 459 713 92 -97 -302 -317 -402 -100 -467 -232 -492 -193 -541
4826 -541 -686 -168 18 -708 -599 95 220 -314 -31 460 27 -6 -135 563 705 78 361 448 352 -147 181
4847 181 467 199 -16 92 94 263 79 5 -471 -313 -316 -350 -419 -938 -189 -382 -1035 -755 -179 300 -311 -417
4869 -417 481 268 -171 112 552 435 -80 218 985 452 596 377 757 128 461 354 205 163 -16 224
4889 224 -452 -361 -74 -58 -562 -237 -104 -417 -915 -480 -383 -423 -840 -342 -102 -349 -435 -175 354 -79 -212 557
4911 557 827 -100 178 686 524 436 745 532 180 314 418 392 262 240 108 -265 -299 -107 -332 -664 -328
4932 -328 -431 -467 -470 -533 -260 -291 -286 -722 -347 -43 -267 4 275 293 144 52 113 491 703 174 366 535 452 369
4956 369 578 52 210 155 -245 -87 -40 151 -243 -554 -258 -336 -603 -414 123 -274 -426 -465 -64 -44 -292 -106
4978 -106 -66 -280 17 246 320 53 621 133 303 384 639 456 38 363 597 12 -120 396 236 -183 -396
4999 -396 -64 -2 -374 -566 -348 -420 -373 -483 -391 -347 -535 -637 -385 -274 327 -79 -1 226 510 97 159 452
5021 452 328 666 220 36 594 435 264 33 291 333 113 -258 200 185 -183 -351 83 -399 -732 -227 -180
5042 -180 -462 -532 -328 -333 -224 -31 193 38 -343 -135 112 64 185 552 283 -66 249 445 414 457 378 709
5064 709 109 114 67 209 -62 -243 -86 47 -233 -183 -239 -495 -307 -3 -636 -513 -205 -242 -549 -561 102 299
5086 299 -338 -59 307 477 250 317 620 914 -197 439 388 719 432 369 505 345 279 -108 -48 -121 -68 -46
5108 -46 -150 -366 31 -398 -434 -639 -185 -397 -629 -460 -83 -243 -225 -198 253 -90 -605 282 402 257 207 419
5130 419 405 430 198 582 243 349 199 182 292 46 -134 -11 42 -311 -47 -303 -572 -529 -209 -406 -507 -407
5152 -407 -424 -526 -820 -109 -17 -9 -272 246 722 272 3 417 807 351 215 394 558 159 340 345 -44 219
5174 219 326 320 -1 246 110 -264 -265 -290 2 -553 -626 -191 -141 -610 -571 -117 -441 -254 -224 143 -92 40 86
5197 86 242 461 387 204 304 450 393 241 619 278 392 -164 41 77 205 -45 -98 -112 -123 -469 -167 -223 -119
5220 -119 -318 -671 -267 -315 -118 -512 -252 -29 -77 78 -231 -72 260 -39 329 280 867 356 184 323 161
5241 161 322 76 237 692 299 233 250 53 315 -305 -268 -123 -128 -205 -324 -490 -384 -439 -559 -421 -200 -2
5263 -2 -162 -16 -15 295 83 -246 -4 345 252 -27 651 1032 296 27 179 562 72 30 440 218 -112 -207
5285 -207 7 -51 -45 -220 -236 -558 -503 -566 -801 -405 -349 -85 -550 -213 -233 -46 -22 -414 234 261 -45 -16 254 356
5309 356 154 -20 490 516 288 172 636 235 394 -324 202 -53 -292 -315 -295 -118 -317 -468 -323 -68 -169
5330 -169 -649 -160 -446 -356 117 -227 -412 -172 -17 -287 109 146 445 203 215 739 814 160 53 521 340
5351 340 397 226 125 419 194 -159 5 -104 -222 -124 -148 -48 -26 -505 -397 -578 -539 -452 -247 -317 -196 -398
5373 -398 -224 -37 180 366 320 172 409 417 510 150 556 454 41 288 384 432 108 213 33 -67 -91 -304
5395 -304 -267 -164 -456 -346 -162 -360 -398 -228 -430 -354 -134 -207 -551 181 -39 -1 -38 113 219 90 514 287
5417 287 452 390 172 417 546 242 146 115 487 412 -110 -197 29 -52 -383 -614 -631 -530 -334 -753 -590 -234
5439 -234 -377 -714 -620 -87 -143 -400 -257 369 138 -40 234 420 477 440 170 313 211 397 461 48 251 383
5461 383 331 -9 165 258 231 -97 -411 200 -291 -553 -336 -121 -420 -299 -113 -161 -77 -328 -59 102 -85 -23
5483 -23 23 14 242 -15 151 297 325 176 60 338 594 294 464 -40 549 141 -67 -350 -91 -206 -240 -272
5505 -272 -117 -334 -533 -271 -279 -561 -472 -249 -541 -233 -204 -193 -381 51 125 8 -158 169 294 316 305 512 511
5528 511 584 9 292 506 131 -88 424 -171 445 -269 -105 -45 -569 -391 -12 -220 -545 -231 -78 -8 -276
5549 -276 -160 -437 -119 -82 157 -357 -311 -171 354 396 318 478 546 668 172 452 628 245 121 170 531 180
5571 180 -263 94 101 -358 -327 148 -46 -612 -113 36 -305 -408 -236 -190 -322 -113 16 -172 -52 116 246
5592 246 -82 -30 362 358 139 10 615 110 -31 316 437 580 64 163 347 115 77 -54 -140 -303 -189 -369
5614 -369 -323 -477 -307 -71 -256 -345 184 -401 -78 -145 -330 -208 -395 -196 98 104 207 161 621 326 255 467
5636 467 463 379 74 107 510 -63 -39 151 41 -70 -336 -171 -229 -474 -403 -214 -245 -207 -96 -259 -379 -326 -10
5659 -10 -239 -342 185 -33 154 18 107 363 24 409 618 205 88 255 147 631 126 -31 -31 110 9
5680 9 73 -328 229 -96 -495 -634 -269 -272 -8 -563 -452 -210 -467 -595 -297 159 -206 -536 62 41 317 -77
5702 -77 289 191 97 431 530 289 122 674 74 226 95 124 15 -397 171 -17 -16 173 44 -399 -234 -367
5724 -367 -283 -44 -670 -592 -194 114 -373 -453 -235 -169 -74 -49 -138 295 -21 481 532 475 83 398 502 332 310
5747 310 569 130 -206 292 217 -218 -405 -139 -202 -376 -273 16 -121 -563 -345 194 -238 -524 -426 213 -305
5768 -305 -98 -91 70 27 318 100 449 175 78 455 577 207 456 -7 133 106 337 639 199 127 222 -19
5790 -19 -272 -124 -29 -211 -309 -203 -46 -307 -604 -219 -273 -80 -367 -45 225 74 -216 -52 206 269 508 98
5812 98 301 -7 218 423 390 571 45 436 9 13 291 49 -111 52 113 -96 -503 -365 224 -266 -300 -331
5834 -331 -348 -227 -65 -223 -303 286 -172 -246 -10 -50 421 8 246 339 183 126 89 441 752 102 270 360 349
5857 349 -58 121 291 75 -364 -113 -211 165 -278 -211 -310 -443 -102 -632 -320 -622 -117 50 -389 -14 219
5878 219 10 -28 292 184 185 66 360 450 141 -158 595 224 230 218 79 281 -15 -122 -4 -60 -186 40 -321
5901 -321 -165 -204 -237 -272 -340 -261 -64 -683 -307 -299 -86 -166 -90 8 33 124 58 353 290 258 328 280 563 265 33 258
5927 258 347 -25 -162 60 261 -118 -105 -10 -70 -357 303 -350 -366 -344 -315 -461 -367 -194 -405 -539 -42 68 314
5950 314 26 155 263 77 0 253 272 543 353 177 385 418 399 -189 283 291 282 166 69 23 32 -108 -248 -283
5974 -283 -306 -307 -414 -577 -47 -184 -22 -130 -428 -5 -96 -113 299 275 450 -70 51 470 98 253 198 372
5996 372 69 541 360 224 248 -110 110 301 103 -241 -49 83 -351 -317 -137 -306 -250 -198 -209 -50 7 88
6018 88 -242 167 -109 -62 -200 -1 352 7 96 222 302 39 194 356 429 183 424 -176 435 130 212 -66
6040 -66 104 104 -487 -508 117 -106 -172 -668 -370 -395 -440 -129 -422 -290 -372 -137 -500 177 -3 21 6 -26 111 118
6064 118 164 627 213 440 322 59 198 144 182 -48 132 54 -195 64 -46 -11 -183 -523 -281 -438 181 -304
6086 -304 -388 -242 -172 -462 -406 -530 -112 22 -34 174 598 22 39 337 182 232 83 276 171 398 216 112
6108 112 -81 238 -260 2 150 95 138 -417 -554 -402 -383 -439 -480 -277 -361 -368 -382 -284 -177 -161 -216 260 3 -326
6132 -326 -151 98 243 108 260 275 374 343 -102 359 440 172 109 449 38 175 -94 10 -38 -137 -61 -454 -155
6155 -155 -242 -179 -279 -334 -134 -128 -429 -102 -58 116 -26 -262 475 290 253 63 112 343 390 436 439 370 -50 344
6179 344 317 70 176 117 76 176 -42 -105 -307 -43 -147 -229 -649 -297 -266 -331 -475 -193 -250 -312 -174 -147 158
6202 158 -132 18 312 -166 357 548 115 703 312 281 333 455 312 64 210 439 0 34 106 -54 110
6223 110 -163 -341 -290 -100 -200 -90 -377 -365 -168 -288 -23 -325 -165 -249 -286 93 57 -118 -154 203 273 208 -25
6246 -25 502 233 136 -69 208 342 190 311 238 319 72 -80 -335 -275 -152 -141 -349 -169 -205 -125 -230 -88 -478
6269 -478 -494 -375 -228 58 -72 -172 84 166 153 181 254 284 31 348 455 139 335 462 184 136 2 -64 10
6292 10 -240 94 -23 -344 -258 38 -198 -382 -512 352 -28 -356 -361 -115 -41 -204 -133 82 -99 15 128 70
6314 70 170 7 106 104 249 388 409 237 -123 326 491 50 76 -12 61 125 -362 379 135 -76 -138 -290 -159
6337 -159 -319 -242 -156 -217 -35 -135 -169 146 -178 -158 -143 -16 110 158 185 144 460 527 236 275 542 331 84 506
6361 506 152 305 -66 -402 -196 -88 -477 -285 -178 -63 -44 -194 -208 -167 -345 -202 -150 -141 -81 -209 20 -159
6383 -159 268 -61 181 99 68 112 -96 152 465 334 39 283 313 84 177 -111 69 32 -257 93 -20 68
6405 68 -215 -126 -205 -206 -439 -206 -304 -250 -44 -482 35 -48 -36 -128 -282 119 127 147 121 370 227 282 420 420 205 245
6431 245 267 291 11 -156 147 102 14 -146 -235 -301 -264 56 -524 -9 -266 -285 -311 -127 -317 276 27 -94 93
6454 93 88 -93 -421 364 473 149 19 72 414 169 151 397 226 205 -209 40 223 67 80 -110 61 15 -31
6477 -31 -83 -597 -478 27 27 -243 22 138 -392 -497 -105 225 156 -261 47 41 228 234 83 415 98 384 64
6500 64 467 386 293 385 130 198 492 265 -177 -268 -54 -250 -277 -236 -168 -506 -68 -360 -173 -178 -273 -110 -419 -559
6524 -559 24 146 44 -7 258 482 21 311 89 131 233 525 227 294 317 456 -7 159 58 61 172 -245
6546 -245 -204 1 -37 -305 -162 64 -460 -321 -375 -13 -396 -407 -228 -189 -5 -135 166 108 185 -52 207 44
6568 44 7 349 -85 238 455 355 72 337 152 219 -12 -21 287 -95 -239 -158 48 -356 -119 -183 -110 -300 -265
6591 -265 -294 -306 -240 111 -149 -140 -32 127 -169 321 266 302 240 128 367 497 604 53 128 280 469 228 182
6614 182 50 338 -331 13 141 -220 -376 -98 -273 68 -217 -31 -458 -170 -129 -368 -277 -273 -106 188 102 -79
6636 -79 538 -69 56 110 199 103 181 66 355 100 300 332 238 171 -106 -173 74 67 -61 -203 57 -186 -173 -383
6660 -383 -314 -283 -401 -291 -5 -212 70 -322 39 349 -15 -148 -81 149 94 -26 327 475 494 301 391 388 -34
6683 -34 101 309 137 350 -191 -183 -288 -152 42 -278 -234 -68 -629 -177 -231 -169 -142 171 -505 -12 -277 94
6705 94 -58 45 190 -16 157 -63 270 254 309 241 314 338 -9 103 126 239 114 79 176 -100 -54 67 91 -34
6729 -34 -379 -378 -243 -74 -174 -224 -59 79 -145 -563 -157 -137 3 -238 -191 71 -178 181 248 174 270 73 292
6752 292 337 290 21 -32 281 -168 244 70 -113 -231 96 139 -229 -54 -163 -31 -234 -274 -120 -197 -279 -19
6774 -19 40 -16 -18 140 -208 -3 -98 87 383 356 191 265 37 129 252 577 -9 107 175 130 160 -55 -31 47 1
6799 1 -220 50 -330 -369 -125 -127 164 -221 -462 114 -167 29 -179 -67 151 48 2 234 153 377 51 216
6821 216 -25 134 274 282 207 303 -5 376 255 66 102 -47 -74 -145 -138 -314 -299 -145 -31 -295 149 -275 -218 -270
6845 -270 -61 -125 -246 -228 -183 26 229 24 142 229 57 224 -83 297 533 258 323 445 221 77 -207 -235
6867 -235 71 -312 187 -417 45 -150 -340 13 -68 -302 -160 -303 -108 -198 -349 -46 -299 -87 229 223 59
6888 59 191 -109 227 234 445 296 271 -10 310 148 34 75 187 77 -236 50 224 80 -265 -104 35 -214
6910 -214 -111 -243 -297 -299 -353 -708 -311 -355 69 -73 -192 -251 -45 63 64 117 265 289 65 138 253 597 281 273
6934 273 316 113 -47 55 169 121 -221 -46 -314 15 -523 -134 -312 30 -165 -244 -195 -255 -82 -300 33 110
6956 110 155 -18 -173 -115 138 229 109 119 -197 326 -189 489 459 311 174 219 229 153 -196 91 -218 50 75
6979 75 -67 -417 -204 -77 -128 -413 -225 128 -144 -319 -125 319 -202 -16 -7 -81 -161 -70 278 -63 163 113 369
7002 369 169 352 264 377 140 211 172 51 176 66 219 -223 -103 114 -84 -344 -322 148 -45 -389 -315 -89
7024 -89 -79 -335 -47 -229 108 68 37 446 155 173 45 -27 241 -48 217 64 -8 290 141 38 327 251 67
7047 67 31 119 34 -209 -242 -87 -70 -124 -290 -120 -104 120 99 -85 -31 -487 248 -85 -172 0 229 52 -76 28
7071 28 140 60 325 118 227 71 319 77 231 225 146 156 144 -197 -256 412 152 -120 -80 -245 -244 -218 -381 168
7095 168 -181 -64 -1 -132 -185 -76 130 9 334 169 -47 220 -64 61 334 -43 -141 252 279 255 40 498
7117 498 301 -71 -57 190 -168 -268 -86 -12 -22 -76 -282 -314 -300 -44 4 -109 -274 -193 -142 -62 -159 -286 30 101
7141 101 242 140 -35 30 239 468 -49 251 399 567 233 103 182 261 30 295 58 -100 -242 -325 67
7162 67 12 -359 -211 10 15 -281 -145 -447 -189 -104 -54 -137 -312 -141 152 35 114 301 129 149 -255 263 272 276
7186 276 568 262 73 2 256 -127 138 307 -89 -143 -123 -25 -485 -110 -353 -217 -139 92 -61 -15 -419 -54
7208 -54 130 11 -89 34 214 91 259 -8 239 106 203 404 130 292 210 448 80 -153 92 38 99 -23
7230 -23 -177 279 -14 -21 -426 -156 -115 54 -279 134 -64 30 121 -69 -382 158 127 -209 121 236 204 146 334
7253 334 -63 153 95 233 60 124 -116 7 372 -184 -12 -140 49 -129 190 -180 -30 137 -100 -124 -94
7274 -94 -324 -36 -435 -315 -190 30 42 93 21 -12 -221 186 218 -75 68 192 108 -22 258 88 236 253 -44
7297 -44 27 302 -14 155 -167 384 -19 -315 130 -211 -100 -243 -440 -155 -190 -631 -207 -139 32 -335 -120
7318 -120 -233 15 45 -68 43 266 158 238 225 305 207 195 203 63 38 109 360 106 102 -115 -112 -271 -66 -414 -26
7343 -26 -190 -260 74 -165 -35 -298 -517 -234 11 148 5 0 -28 97 140 -163 -75 -34 249 105 98 455 111
7366 111 -73 175 21 559 172 -187 168 -144 -200 -401 73 -187 -223 -59 -326 -131 -542 -220 88 -77 -174
7387 -174 177 -178 -351 235 -46 188 -21 181 254 95 270 127 4 122 18 478 258 314 38 -80 138
7408 138 90 -222 -3 -1 -6 119 -179 155 -376 -215 -132 -204 -59 -431 -197 -38 -210 -234 -104 51 50 90 110 129
7432 129 318 137 298 -208 393 210 -79 475 379 226 -154 33 -132 -35 97 -277 -311 18 75 -178 -70
7453 -70 -267 -169 -160 -231 -102 -93 -139 -234 -114 551 -24 350 210 91 -111 -123 334 289 276 -81 470 1 213 219 350
7478 350 399 118 -15 35 132 -155 -109 -299 -126 38 -170 -103 -362 -85 24 -141 -196 -92 47 19 -180 -195 111
7501 111 101 157 303 171 180 96 380 566 -155 139 659 147 230 -11 167 191 72 -175 -309 -157 -245 -263 -220
7524 -220 -196 -41 -40 -508 -213 39 -481 -302 23 125 24 -372 68 60 24 129 322 -85 34 -59 327 202
7546 202 -67 212 108 -140 98 105 -102 16 215 202 -223 -256 -131 -340 -18 -12 -218 -423 -456 -44 33 -246 -160
7569 -160 -31 170 69 137 -52 116 90 218 50 -82 340 190 42 -54 120 417 132 109 335 110 155 -96
7591 -96 7 133 -135 -205 64 32 -266 -1 -327 51 -78 -163 135 -123 -186 103 1 -41 366 478 256 -129
7613 -129 64 277 78 122 367 41 198 -33 46 17 205 -83 21 50 -326 -82 -152 -118 -289 -196 176 -228
7635 -228 -23 37 -164 37 -152 -190 -128 194 -396 50 -104 387 537 202 -8 3 140 243 152 213 -89 313
7657 313 36 -94 82 -55 -128 -25 -183 -71 204 -108 15 -69 -205 -248 -25 -139 -111 -100 264 -119 61 301
7679 301 18 26 -159 61 98 187 417 224 57 -43 -19 541 103 155 -2 166 -238 243 148 -400 -33 10 -13
7702 -13 -172 -275 -17 -93 -253 16 -331 -244 234 -7 59 -62 88 115 63 104 417 271 49 175 167 249 526
7725 526 127 118 47 -64 223 125 117 215 94 36 165 -372 -11 -111 -257 -191 -119 -79 -198 -125 -87 -259 -187 89 -459
7750 -459 -64 -106 24 199 119 146 364 -57 -53 166 209 147 148 169 176 -22 7 -184 -39 -598 -180 -75 -140 31 -308
7775 -308 19 -212 -342 196 -223 -499 -323 194 -86 -99 178 80 63 -59 128 -112 151 231 113 -134 430
7796 430 369 -18 146 -180 283 211 30 -68 366 95 45 -382 -121 -171 -353 -21 -296 -113 -193 -131 -250 -236 -286
7819 -286 33 11 -112 -381 95 92 -157 23 12 14 113 112 314 188 498 109 -31 -241 -83 335 -98 109 -235
7842 -235 21 -204 -519 -17 -231 -293 -113 -317 -323 -52 -45 -322 -192 -261 -156 87 -109 -3 62 72 -31 260 315
7865 315 26 78 446 131 385 148 -133 -38 54 122 -137 189 129 -185 78 -223 -66 -157 -289 -191 -76 -115 -134
7888 -134 55 -216 -330 145 -105 81 -7 -45 245 24 -142 287 175 165 -95 189 160 357 -17 192 267 62
7910 62 324 130 71 13 23 -66 44 164 -237 -253 -224 -347 -198 -200 -212 91 -249 -106 8 39 105 -121 -69 -266
7934 -266 388 -202 100 347 190 341 196 183 178 39 203 361 283 54 253 -228 83 -99 36 341 -261
7955 -261 -58 -110 -379 -590 -94 78 -241 48 23 -383 224 3 -68 -197 354 51 219 31 165 9 -120
7976 -120 162 -109 -129 330 315 -7 169 49 67 36 134 -47 -155 -166 -43 -314 -252 -230 -45 59 -259 -47 -294
7999 -294 -122 -5 192 -23 155 74 164 50 385 149 376 201 27 -100 255 177 265 167 123 15 16 67 129
8022 129 312 79 -74 -280 -148 -157 -118 -305 138 -365 -76 182 -96 -167 -292 -3 -326 -145 -88 46 342 104
8044 104 234 47 382 155 194 -36 141 115 379 474 147 -120 114 -8 -232 -17 -27 312 -215 -66 267
8065 267 -44 -284 -354 71 -105 -124 -339 -234 -9 -94 -37 231 -11 -53 84 256 316 39 -127 136 205 467
8087 467 202 -105 61 116 -221 55 -115 -494 -453 35 -64 -234 -119 -60 494 39 -127 -168 -191 7 -206 -272
8109 -272 -156 -61 223 71 45 109 254 228 305 -47 322 281 53 244 95 60 60 -18 -136 -126 15 -94 136 -155
8133 -155 -401 -322 -16 81 176 144 -280 -131 -41 -187 -175 192 -92 -98 108 -111 269 1 222 56 384 313 91
8156 91 77 170 46 -7 252 -61 64 104 244 61 -60 -167 77 173 -202 -231 -122 -219 -147 -208 -44 -279 -83
8179 -83 5 37 -258 66 42 -119 128 130 352 195 70 27
8191B7
$$ Imaginary data points
##PAGE= N=2
##DATA TABLE= (X++(I..I)), XYDATA
0 0 0 0 0 0 0 0 0 8 -8 8 -8 10 -16 16 -18 24 -32 32 -40 48 -56 64 -74 85 -98 110 -125 142 -160 182 -201
31 -201 227 -254 282 -314 352 -391 432 -479 528 -586 649 -719 794 -883 983 -1093 1221 -1369
49 -1369 1545 -1755 2011 -2336 2753 -3315 4118 -5350 7458 -11733 23674 -120514 -393374 102571
63 102571 282678 -167387 -247839 188961 185335 -182250 -127754 151539 38979 -146264 -13090
74 -13090 95475 -33052 -57785 54450 34015 -46465 4142 45575 -6136 -11328 26832 5688
86 5688 -3436 31523 12947 -21245 23056 38716 -26527 -27946 30145 -338 -39096 21351 31866
99 31866 -53162 -35364 48537 -10023 -81190 21477 75736 -53966 -81067 59579 49160 -86403
111 -86403 -37012 82753 5342 -77147 30240 83751 -24381 -36264 55433 14676 -62692
122 -62692 15559 72378 -21581 -40426 68193 54307 -59681 -31003 56262 -3163 -77106 -8131
134 -8131 53470 2169 -29605 1556 1687 -18611 -10294 -13163 -19727 17018 24623 -36491 -43512 27688
148 27688 27362 -34269 -5431 55936 11913 -39621 12165 38654 -18605 -15108 48367 22468 -37637
161 -37637 6914 51470 -14044 -45284 28416 39207 -37331 -30932 37167 9035 -49510 -7728
173 -7728 37769 -9326 -36032 8693 8336 -43472 -32214 18239 10261 -14473 6891 22952 1764
186 1764 -5606 4477 -3944 -8072 6840 6720 -1347 17944 29342 4902 -3723 13410 2726 -17200
200 -17200 2420 16708 -8664 -7144 22874 1273 -36016 -2561 26784 -24048 -43925 20339
212 20339 27315 -42324 -30739 38230 6693 -56874 -4020 55085 -5531 -46895 21448 42751
224 42751 -28826 -31081 41535 33683 -25706 -5774 35974 6146 -19854 14613 26589 -6175
236 -6175 -8164 11316 -4406 -19421 3122 13196 -4468 -3028 7700 -7979 -23259 -14571 -13135
249 -13135 -17560 -399 12981 163 -351 14485 -2529 -26509 -5558 15277 -8303 -13704 25219
262 25219 26867 -11211 -2496 33191 11602 -22126 4187 27502 -3385 -16766 14690 16555 -12114
275 -12114 -6731 12187 -4323 -15771 1587 -830 -20935 -7868 10305 -10216 -19581 8317 9235
288 9235 -21971 -15337 13377 958 -18943 3151 18854 -1336 -5305 13947 9373 -2971 10653
301 10653 16066 -1272 3174 18805 -188 -18571 6109 19350 -8027 -9103 22477 14281 -20810
314 -20810 -13848 6000 -13610 -26030 -99 8382 -11495 -5742 11808 -5656 -20856 573 8447
327 8447 -15466 -12309 16325 11323 -11991 165 21756 9257 -7011 5909 17580 5544 -5106
340 -5106 1014 9972 7307 -1120 -414 11943 10609 -11018 -14973 5622 2282 -23369 -13589 18308
354 18308 4475 -26750 -7481 18362 -9604 -31751 1994 19093 -13818 -20089 14448 13744 -15491
367 -15491 -2636 26594 10264 -10636 10419 20772 -9619 -17255 14022 19514 -7701 -3385 26854
380 26854 20044 -15521 -15714 10450 5118 -24392 -18361 14684 13194 -18647 -18010 11367 6454 -24088
394 -24088 -18198 12177 4101 -21563 -7650 15703 1786 -11826 8576 17995 -5870 -9054 15695
407 15695 12245 -11351 2062 27945 10240 -15446 3918 23848 -1278 -20455 5098 19783
419 19783 -7387 -19860 5484 12678 -13760 -18748 5343 6275 -17098 -13931 9772 3230 -20223
432 -20223 -11313 9837 -2764 -20905 1141 26051 9213 -9989 8801 19804 -8322 -22414
444 -22414 5671 21060 1488 -817 22823 20488 -8351 -8302 9447 -892 -18171 -1961 14035
457 14035 -4864 -15858 6929 12702 -15541 -20621 6492 4287 -24555 -18573 12359 8195 -15549
470 -15549 -3660 19667 4877 -17304 -4391 11359 -1832 -7941 13555 21011 1862 -1599 14058
483 14058 8100 -11672 -2841 18451 8318 -12633 -1180 15809 -2262 -22083 -2321 17016
495 17016 -4148 -21828 696 13220 -14270 -25937 2821 10447 -17527 -16831 15852 13432 -15996
508 -15996 -4311 23451 3915 -25469 -2996 23070 -621 -14762 19814 32631 -3645 -15404
520 -15404 15305 16285 -15645 -10887 20476 11729 -17753 -7313 15769 461 -20354 -2697 13950
533 13950 -8299 -24907 -2266 11163 -11193 -18430 9694 16405 -14204 -20365 10333 12357 -17718
546 -17718 -11034 24152 17885 -15573 -4749 24990 8541 -16197 6290 28689 2661 -17403
558 -17403 5244 13887 -12019 -13650 14905 14838 -8929 -4766 10848 -4398 -22345 -9494 3483
571 3483 -8461 -13006 3870 9064 -5580 -9583 2189 2777 -8836 -9246 3616 6658 -2037 -1302
585 -1302 13940 16239 796 -3833 7987 6667 -9208 -3965 17205 13858 -5135 18 12192
598 12192 -2221 -15848 -155 9021 -8424 -12441 4749 1643 -14870 -5588 8918 -6235 -18053
611 -18053 418 6887 -11996 -10656 12278 8921 -11354 -3933 13999 4032 -8995 4692 18214
624 18214 8319 -1553 4062 6643 -1515 -6990 -261 10707 11700 3223 -122 4496 -1832 -15260 -11317
639 -11317 2508 -2616 -13467 -960 8618 -6856 -12310 5961 4122 -18874 -11442 11478 -631
652 -631 -16539 6927 23710 -3202 -12974 15439 16938 -14831 -10725 19168 12396 -9143 5325
665 5325 23053 4770 -12337 -371 6317 -4158 -5326 2177 407 -5117 -5460 -4985 -3021 122
679 122 -3457 -8288 -4011 -2115 -8509 -5242 4510 -789 -8598 2063 8739 -4059 -1933 16053 9463
694 9463 -10065 647 16744 -250 -12393 10324 20063 -2172 -4945 15541 9649 -13298 -9932
707 -9932 3819 -2134 -7706 1849 3191 -4598 -4431 -3432 -8501 -5300 2269 -5321 -11893 -1466 3378
722 3378 -6065 -2301 10674 4696 -6589 463 6993 -1109 -58 11076 7783 -1519 5780 11708
736 11708 195 -3485 7964 5807 -7170 -3020 8502 804 -10900 -4789 3427 -1210 -6144 -1725
750 -1725 1838 -3572 -11894 -11502 -2399 1039 -4654 -4179 5811 5786 -4052 -1170 9019 3488 -6251 -120
766 -120 5924 486 1957 13356 10281 -710 3421 8295 -3766 -8192 5011 6077 -7850 -3753
780 -3753 10640 3523 -11228 -5269 2814 -7882 -15067 -2888 4390 -3121 -7539 -633 1922 -2464
794 -2464 -4338 45 2838 -818 -3896 1715 7993 4332 453 6198 7130 -2214 -731 10608 7251
809 7251 -4067 1280 9469 -3054 -10394 4963 8306 -8709 -8675 8843 3731 -14520 -7344 6046
823 6046 -6882 -19086 -2762 9499 -3052 -8535 4757 7191 -5485 -6764 2987 4284 -2688
836 -2688 -3626 4043 9955 7280 2513 5908 8316 -272 -7363 1645 8436 -783 -3795 8374 6824
851 6824 -7831 -4343 8184 -3493 -17620 -3478 7190 -9437 -13278 8990 9734 -13757 -12191
864 -12191 9606 2511 -16304 -4359 13242 242 -11374 5213 15808 701 -5789 7773
876 7773 10398 -2561 -3328 7830 7751 -1646 -1744 5768 5706 -2089 -3040 3011 1996 -6776 -6609 1802 72
893 72 -10274 -7007 3295 -1942 -10317 829 8309 -6682 -13520 3015 7124 -10460 -7169 15155
907 15155 10248 -10439 -570 18991 4639 -12878 3611 16747 -1691 -10093 10403 15179 -4536
920 -4536 -6474 9484 5139 -10544 -4949 6514 -2362 -11809 -1955 4647 -4914 -7885 1156 752 -9396
935 -9396 -7567 2716 1379 -7625 -3001 6749 2669 -6998 459 13018 6004 -6347 1373 12611
949 12611 2181 -9550 3005 15212 2548 -7240 6336 13163 -3144 -9940 3988 4696 -11182
962 -11182 -10232 4882 1341 -10002 -1827 8548 -3320 -13613 -3192 2313 -10704 -11611 7476
975 7476 11168 -4146 -3986 11434 6172 -11563 -5834 13172 8034 -7788 2179 17796 6166 -9452
989 -9452 2461 14800 -258 -12879 1824 10441 -4994 -10490 5035 8061 -8406 -10093 3381
1002 3381 249 -12696 -6583 5198 -1129 -9422 -977 5314 -5068 -9128 3412 7969 -1792 -1613
1016 -1613 9557 8018 -5508 -4342 8941 7244 -3789 1114 14493 7858 -6901 -1649 9081
1029 9081 -322 -12256 -2073 8001 -1786 -9213 2360 6859 -6322 -10458 -1085 -2106 -11998 -6911
1043 -6911 4375 1606 -3591 3476 6127 -4348 -6777 2554 4056 -3180 1062 10302 6568 -1772
1057 -1772 2208 9204 4201 -2787 1525 6454 1388 -5527 -1325 5981 2153 -4608 -2526 2665 -2387
1072 -2387 -10262 -5049 1999 -1681 -6670 -2221 702 -5291 -6290 1061 2074 -2018 1609 5811 -893
1087 -893 -5413 2180 6055 -894 518 11343 10085 -1667 -1560 7382 2872 -6769 -1424 8190 3003
1102 3003 -4952 225 6150 -1799 -8328 -2774 720 -6214 -8749 -2028 1807 -2922 -4473 1012 1647
1117 1647 -4763 -5473 114 1744 -1595 250 5426 4431 -215 975 5386 3433 998 4056 6617
1132 6617 1327 -2071 2465 3989 -1452 -1983 4303 3752 -4978 -5097 2585 346 -8500 -5866 1714 -2174
1148 -2174 -9917 -4364 4648 1057 -4458 -332 3019 -3853 -7144 -1640 3147 2966 4412 7215 6330
1163 6330 2992 560 -1011 -1391 1438 3781 3046 3676 5067 2808 -1343 -1398 -1094 -2804 -3177 -2000 -3404
1180 -3404 -3364 -485 -988 -4283 -2717 836 -3519 -7683 -2438 2942 -2007 -3479 4140 5824 -2053 -2754
1196 -2754 4323 4489 -838 2234 8160 5260 -783 959 3773 1073 -937 2043 3507 1539 -425
1211 -425 -531 -613 -2885 -4146 -4002 -3128 -2853 -2819 -1016 90 -1603 -3078 -2030 -2986 -6417 -3682 2469
1228 2469 2551 -464 4126 8267 1718 -4059 1300 5253 -1298 -1972 7437 8949 345 -189 5951 3288
1244 3288 -3725 -1522 3183 -1005 -5299 -2002 14 -3111 -2348 605 -1533 -5077 -3614 -1692 -4602
1259 -4602 -5174 665 2130 -2546 -3092 3188 3817 -2104 -2194 4971 6634 -434 -1648 5163 5699 -528
1275 -528 -1165 6670 7335 27 -1777 3237 1487 -5668 -4154 2680 1231 -4473 -1991 2312 -2294 -7184
1291 -7184 -2889 56 -6413 -7011 449 2295 -3468 -1762 5553 2135 -5553 -1221 6671 1903 -4031
1306 -4031 3926 10171 1757 -4253 5445 10415 -405 -4981 4869 7274 -3841 -5665 3806 3169 -6196
1321 -6196 -4735 3739 561 -6723 -3859 1363 -3684 -7383 -1833 1943 -3248 -5198 -228 2291 -1438
1336 -1438 -938 4115 4060 -1408 -1927 3624 3106 -946 2292 9455 5522 -2043 1893 8334 -277 -9643
1352 -9643 -445 8225 -1325 -8082 5028 9472 -6744 -12257 1509 2202 -11033 -8184 5377 1055
1366 1055 -9026 -1043 7440 -1829 -7186 2468 3834 -6224 -3536 7659 5778 -2800 1875 8498
1380 8498 3095 -2499 2931 6340 311 -3721 2004 6088 1683 -2896 733 3576 -3222 -8648 -1361
1395 -1361 4952 -3503 -8991 788 3516 -8467 -8760 4767 2647 -9524 -2619 9104 -427 -8657
1409 -8657 3791 7888 -6785 -5748 12132 8565 -6268 1690 12931 147 -9258 4647 10225
1422 10225 -4399 -5788 7342 6239 -5623 -2284 5841 -765 -8549 -4438 -352 -2212 -3299 -1708
1436 -1708 -636 -717 -2011 -3804 -397 2232 -3106 -5939 1766 4110 -2072 527 9453 4169 -5301
1451 -5301 2294 9131 -990 -4893 7406 7947 -4818 -1891 9553 2421 -7848 -111 5751 -4402
1465 -4402 -6990 4085 2552 -8554 -6137 2534 -1093 -6413 -392 2816 -2340 -4872 -2458 -1182
1479 -1182 -551 1533 880 786 3806 3722 -386 1684 4869 723 -1874 3516 4707 -392 1846 6515
1495 6515 191 -4253 3133 5134 -5942 -6647 3741 659 -9027 -2673 7342 -1156 -9691 -1642
1509 -1642 3190 -6225 -6939 3604 3365 -5319 -2674 4535 1395 -2918 2448 5614 244 -1072 3656
1524 3656 5023 1482 1251 2704 1980 117 1464 2711 2188 460 -1063 -1060 -1549 -3982 -3520 -447 -662
1541 -662 -3417 -1623 2002 -1463 -6917 -3770 377 -3864 -5829 3251 7335 -415 -3156 3867 3596
1556 3596 -3721 -1695 5845 3497 -1493 2093 6919 2885 327 3834 2820 -2519 -2271 1119 -519
1571 -519 -2863 702 2779 -1778 -3465 -974 -1604 -5987 -5140 -827 -27 -1914 -1151 599 -884 -2683
1587 -2683 -2107 -53 2405 2239 792 1602 3349 2262 228 1808 4424 2771 158 2027 3956 1883
1603 1883 51 815 52 -2502 -2116 -384 -844 -735 211 -739 -4051 -3478 -1813 -4034 -5262 -1516 1655
1620 1655 -457 -2254 1183 2012 -1730 -2675 804 2720 1398 667 2922 3853 3050 2218 2413 3260 2395
1637 2395 -835 -1713 1250 2061 -880 -101 2613 905 -4637 -4080 -268 -2195 -4833 -1661 982 -2552
1653 -2552 -4586 -1165 -187 -2998 -1296 2244 997 -1929 1039 2533 -1404 -1039 4719 5030 515 1823
1669 1823 5790 3020 -2176 170 4068 1610 -1755 395 2870 1184 -1944 -1546 685 -736 -4763
1684 -4763 -5223 -1740 -578 -3404 -2674 1349 788 -4011 -3372 668 -949 -3266 1033 3485 118 -33
1700 -33 4163 2842 -1416 1789 5569 1227 -1635 4067 5219 -1314 -1585 4960 3370 -3796 -1743 3174
1716 3174 -483 -4982 -849 2265 -2371 -5000 -2349 -1625 -3430 -2788 -53 816 40 -1336 -1657 -1112
1732 -1112 -854 -1215 1077 4089 3211 1805 3332 3645 -484 -1036 3109 2447 -1713 1750 5998 860
1748 860 -3303 2541 4698 -4667 -6443 1777 1066 -7226 -4233 4864 1109 -6559 -2383 2770 -3286
1763 -3286 -7490 -1328 2525 -1204 -1702 3280 3343 -647 191 2193 1805 519 1837 3288 2640 1324
1779 1324 1993 3102 1721 -533 317 1995 228 -2967 -316 1989 -2065 -5459 -659 1610 -4510
1794 -4510 -5909 1457 2494 -5915 -4585 2969 252 -7059 -1827 5801 1178 -3720 3058 5877 -749
1809 -749 -2486 3852 4126 -1086 744 5781 2455 -1328 2202 4127 -11 -1852 1727 887 -3530 -3715
1825 -3715 816 780 -2684 -2809 528 -535 -4542 -4666 -479 126 -3698 -3310 2585 2365 -3029 -2043 4491
1842 4491 3154 -3007 275 5727 2010 -2565 2382 6344 921 -1405 4578 4393 -2392 -1348 3602
1857 3602 31 -5229 -57 3687 -2791 -4700 1974 2231 -5860 -5222 1725 -996 -6759 -2832 3079
1872 3079 -160 -3824 543 3316 -301 -2244 851 2427 529 317 1929 3732 2900 1132 1693 3028
1888 3028 1763 -902 216 2437 439 -1896 598 1777 -2198 -2613 1110 -1034 -5594 -2455 1864
1903 1864 -2633 -5984 615 3106 -4490 -5258 3068 2965 -4425 -1588 5981 2445 -3995 724 5916
1918 5916 1023 -2078 3591 5045 587 217 3446 1631 -1069 83 949 -938 -689 1136 32 -1421
1934 -1421 -1357 -1003 -2320 -2756 -2792 -2645 -1454 -869 -2053 -799 1667 -188 -3545 -68 2793 -1555 -2858
1951 -2858 3592 5249 -1038 -84 6791 4824 -2945 -318 5117 1020 -3062 2012 5268 -549 -2403
1966 -2403 1942 691 -4467 -2098 1036 -2152 -4127 -301 283 -3797 -2985 314 -1008 -3716 -1761
1981 -1761 1326 -199 -1413 358 1841 1150 522 947 2656 3304 958 374 3074 4182 -306 -1059
1997 -1059 3195 2726 -2580 -1595 4426 1806 -3674 -1287 1542 -2728 -5137 -412 327 -3994 -2678 1433
2013 1433 -1115 -4005 153 1703 -3500 -3274 2237 1603 -2181 969 4883 1757 -877 2404 3454
2028 3454 560 -110 2253 2127 1129 2187 1813 532 327 88 -1995 -1303 1366 -453 -3360 -1566 -54
2045 -54 -2588 -3538 -38 290 -2536 -3053 -503 -868 -1769 -35 1166 -87 933 1869 1142 1347 2590
2062 2590 1697 118 1331 2521 1117 821 2354 2211 315 877 1609 -297 -1460 -842 -2204 -2540 61
2079 61 1095 -2166 -2633 190 -1500 -5533 -2746 1612 -766 -3648 -573 2552 -621 -1496 2050 2327
2095 2327 -763 -330 2055 1657 1381 2687 2999 477 485 2237 1563 -196 108 1658 212 -1390 -632
2112 -632 854 -1350 -3099 -2318 -19 -1199 -2790 -474 436 -3107 -4458 -1223 1033 -1426 -1498 2207
2128 2207 1893 -1094 192 3304 2080 -742 788 1967 1141 1272 3384 3571 1312 876 677 -765
2144 -765 -1121 -84 3 -746 -1278 66 154 -1298 -3237 -2814 -1411 -2679 -3143 -1118 1594 -324 -3205
2161 -3205 -864 2186 -316 -2328 1176 3004 -343 -1286 2981 3770 1048 1231 2489 769 -474 1532
2177 1532 2674 775 423 983 -298 -1461 -399 53 -646 -1534 -1288 -1021 -940 -1733 -2628 -1914 -997 -1868
2195 -1868 -2107 1034 1804 -1536 -2098 1865 1380 -1573 243 4769 1810 -2624 1813 6263 1870 -1371
2211 -1371 2264 3319 -1754 -2449 2882 2398 -1133 -212 1254 -1405 -3139 -617 102 -2908 -2587 -37
2227 -37 -705 -3181 -1829 716 -638 -2854 -1111 1635 909 -1457 -367 2315 1900 -737 1009 4899
2243 4899 3212 -877 535 4041 1530 -1956 1013 3790 -294 -2830 1531 2857 -1350 -2007 1168
2258 1168 -1276 -5191 -2031 1075 -2243 -3647 935 1138 -3411 -2717 2109 56 -4632 -643 3986
2273 3986 959 -2171 2570 4911 36 -1616 2495 4083 -236 -782 2436 2929 202 -138 2152 1583
2289 1583 -1207 -1836 -293 -231 -1832 -1088 -156 -1209 -2990 -1980 -496 -2464 -2363 31 777 -2200 -1827
2306 -1827 1456 1123 -2105 -680 3662 1897 -1632 1343 5070 1482 -1937 1617 4003 226 -1802
2321 -1802 1704 3356 -357 -1069 1936 1499 -2224 -2839 -849 -1014 -2581 -1655 633 -347 -2305 -1461 -856
2338 -856 -2069 -2769 -241 256 -1272 -800 2092 1607 -319 233 2557 1702 -784 1092 3309 1778 -390
2355 -390 1616 3658 1448 -1238 228 1784 -494 -2069 -489 1235 -785 -2672 -1544 -20 -1759
2370 -1759 -2832 -1042 -347 -1454 -2259 -974 -173 -1477 -356 1141 411 -767 1444 2374 -148 105
2386 105 3035 2493 -459 742 3915 1802 -908 1377 3047 171 -2071 255 1154 -1625 -2101 293
2402 293 49 -2081 -1453 -568 -1406 -2281 -1516 -1448 -1429 -808 -329 -681 -115 630 405 193 675 1078 984 1170 1158
2423 1158 1545 1717 1938 867 754 2073 1623 -821 -297 1862 97 -2578 -1027 1618 -976 -3436
2439 -3436 -642 1121 -2231 -3484 -404 -329 -2788 -1913 331 -334 -977 758 826 -553 -158 1565 576
2456 576 -218 1705 2398 948 910 2563 2128 341 162 884 335 192 281 17 686 126 -941 -2047 -538
2475 -538 -457 -2804 -2903 -108 -264 -2887 -1957 1053 187 -2437 -1222 1679 63 -1411 927 2053 495
2492 495 821 1925 1705 821 1363 1803 424 1266 2203 933 -743 657 996 -796 -1463 329 33 -1262
2510 -1262 -1501 -790 -1122 -1712 -1518 -1621 -1713 -656 -434 -1449 -662 1277 -27 -2128 135 1889 -26
2527 -26 -1180 2036 3943 971 -30 2719 2453 -658 -471 2034 1667 -282 642 1490 317 -295 -346
2544 -346 -1056 -2001 -1224 -1308 -2152 -1576 -303 -885 -1747 -1095 -633 -1428 -1553 -702 -146 -147 460 755 567 1377 1301
2565 1301 323 652 2442 2295 256 1007 2667 1224 -1201 397 2390 -40 -1431 525 624 -1693
2581 -1693 -1632 -116 -944 -1973 -1054 -725 -2099 -1759 58 -1248 -2316 -93 633 -1466 -1091 1724 1917
2598 1917 -475 596 2516 1549 -208 707 1913 1509 507 886 1980 1514 470 -352 187 257 -85
2615 -85 -1297 -754 -204 -1197 -2193 -892 -427 -1367 -1539 -835 -798 -1902 -564 410 -1129 -715 1059 853 -1239
2634 -1239 396 3217 1143 -721 1886 3419 91 -1274 2339 3100 -270 -733 2646 2449 -1309 -1545
2650 -1545 488 -351 -2078 -1217 557 -492 -2186 -1388 -938 -1598 -2069 -1451 -705 -957 -830 -174 705 62
2668 62 111 1056 564 -205 299 2189 1609 436 1337 3266 1788 -832 486 2592 99 -1908 739
2685 739 2302 -563 -2320 -214 715 -2505 -3000 38 428 -2250 -2272 271 -500 -2444 -1008 387 -487
2702 -487 -1336 343 1113 230 621 2184 1202 -380 865 2536 1176 261 2286 3024 261 -753 1346
2719 1346 1361 -1391 -1985 1161 834 -1470 -1120 464 -646 -2786 -2090 -895 -1022 -2009 -1025 -302 -1020 -581
2737 -581 -93 465 -135 85 289 84 174 1329 2221 1321 868 1344 2008 618 87 1553 2523 -175 -1107
2756 -1107 1232 1352 -1939 -1956 556 87 -2590 -2132 1169 -566 -2917 -1552 207 -917 -1982 -192
2772 -192 293 -1064 -931 883 160 -92 1200 1149 81 741 2125 1976 967 1218 1592 531 -163 404
2790 404 971 953 625 -723 -494 287 -22 -1936 -1392 356 -1337 -3282 -1151 1107 -1510 -2964 -126
2807 -126 1202 -1629 -1582 1588 1041 -1077 -545 1525 1028 643 1517 1419 988 807 1873 1271 1251 1013 596
2826 596 -163 53 481 241 -113 -88 -841 -833 -822 -1482 -1476 -70 -914 -2425 -1411 766 -521 -2617 -808 1080
2846 1080 -1147 -2329 1378 2579 144 -255 1981 2119 325 808 1903 501 -163 1452 1474 372
2862 372 1055 1765 -462 -1451 89 568 -1587 -1347 278 -420 -2690 -1764 540 -641 -2241 -1010 197
2879 197 -554 -776 -14 762 102 -456 173 909 1382 850 945 1296 1371 1017 1225 1209 821 736 545 193 -149
2900 -149 879 1168 -778 -1641 -353 -6 -1624 -1839 562 -544 -2251 -1766 171 -317 -2302 -1194 222
2917 222 -65 -1064 320 1571 1046 355 233 496 867 845 1088 1030 1081 1704 1240 723 1393 1099 172 -611
2937 -611 -145 161 -348 -1115 -781 -401 -1329 -1479 -640 -480 -1138 -1647 -973 -519 -697 -459 -301 232 108 119
2957 119 -364 657 1040 1110 785 529 1632 1642 734 474 1698 1206 -355 -274 1097 855 -1037 -1072 270
2976 270 -149 -1769 -1164 233 -697 -1816 -1509 -440 -1245 -1274 -1159 -154 -514 -585 -44 366 16 643 1020
2995 1020 279 460 934 1503 662 620 1599 1605 722 214 1636 1219 -532 -539 533 349 -1268 -1191 221 -418
3015 -418 -1814 -1210 -527 -573 -1201 -1527 -477 -622 -1094 -760 -233 304 303 -79 15 1232 1059 460 683 1553
3035 1553 1404 846 852 1342 1047 179 215 329 567 379 -174 -470 32 -49 -827 -1391 -904 -685 -1748 -2028 -882
3056 -882 -224 -1037 -1387 255 -163 -596 -601 294 256 623 362 958 1128 1279 972 714 948 1664 1004 463 939
3077 939 1092 767 -92 148 150 -428 -1344 -1067 -105 -265 -1348 -1301 -222 -443 -1607 -2054 -129 83 -1597
3096 -1597 -1038 738 369 -981 -275 1231 670 -13 1126 1933 742 762 1485 887 -97 772 1527 87
3114 87 -131 1060 1222 -741 -866 576 291 -1835 -1913 -58 -269 -2235 -1855 213 -171 -1866 -1178 194
3132 194 -133 -1418 -822 908 994 -376 -94 1530 1251 89 415 1826 1208 323 1272 1302 530 421 935
3151 935 -42 -624 -322 200 -736 -1428 35 -201 -1546 -1228 -94 -352 -1973 -1360 -242 -235 -1528 -890 424
3170 424 272 -414 -227 1031 1616 433 232 947 1164 652 995 1188 1136 729 780 619 837 263 208 -168
3190 -168 -432 -315 -434 -1160 -1334 -214 -551 -1609 -1276 -239 -507 -1700 -867 305 -55 -571 -73 806
3208 806 448 -547 523 1201 933 586 1231 1365 1102 976 835 853 823 1036 446 -119 -37 57 -233 -965 -494
3229 -494 -195 -511 -1092 -974 -142 -390 -1730 -1544 -426 -374 -1568 -659 734 585 -580 -25 1376 683
3247 683 -653 209 1727 1137 316 1110 2046 980 -33 488 1103 157 -105 305 -50 -499 -240 -528 -1146
3266 -1146 -1077 -486 -1065 -1799 -1221 -119 -760 -1009 -603 -388 -455 -956 -578 244 635 -61 214 1044 1027 260
3286 260 274 1273 1410 731 295 1358 1449 -195 -292 731 280 -761 -554 81 -510 -895 -488 -539 -1284 -1098
3306 -1098 -751 -1509 -1444 -401 -355 -947 -255 830 -3 -751 338 1374 193 -18 1214 936 358 732
3324 732 1346 920 635 807 816 600 270 458 -190 -594 152 -257 -1107 -1276 -353 -866 -1671 -990 -509 -593 -1155
3345 -1155 -753 -432 -611 -676 -625 -95 754 349 20 637 1420 983 -26 1249 2117 827 -287 1092 1142
3364 1142 -397 18 988 794 -639 88 423 -746 -1058 -338 -802 -1511 -1165 103 -1087 -1788 -461 161
3382 161 -1511 -1153 609 217 -1033 -103 753 420 -265 636 942 464 509 992 830 1320 1425 829 162
3401 162 760 681 10 -369 446 604 -1373 -616 33 -340 -1365 -1063 -687 -951 -839 -956 -469 -64 -607 -851
3421 -851 -1021 450 450 -155 36 1404 996 39 1087 1538 1106 106 884 1183 301 593 1088 397 -277
3440 -277 727 391 -997 -316 502 -727 -2214 -553 -130 -1062 -1496 -124 -174 -1265 -1397 254 72 -383
3458 -383 -183 -37 320 166 167 318 634 708 709 784 1323 1560 754 -29 857 1023 30 -216 509 121 -698 -533
3480 -533 -302 -427 -553 -637 -1349 -1066 -924 -424 -932 -1133 -384 -556 -882 -490 512 443 114 47 1090 1275
3500 1275 606 583 1127 1532 261 207 1338 1234 395 49 764 632 -459 -421 -164 118 -864 -771 -697 -497
3520 -497 -804 -806 -1030 -611 -996 -818 -766 -309 144 -2 -455 -417 748 502 240 290 1208 936 204 818 1582
3541 1582 1419 -77 246 1114 571 -623 238 663 -111 -1020 -427 22 -531 -417 -388 -1360 -1679 -503 -361
3560 -361 -1469 -1183 121 -205 -1479 -113 1336 223 -1144 647 1510 445 59 1467 1705 222
3576 222 -56 1190 1367 669 213 529 316 32 180 207 -42 -644 -1043 -1093 -757 -1127 -459 -232 -844 -890 -492
3597 -492 -408 -748 -620 459 -130 -954 6 1118 731 -468 457 1716 326 -265 1404 2123 500 -112
3615 -112 773 1140 -499 -66 397 -105 -302 -106 316 -513 -294 -862 -1180 -1144 -613 -425 -1243 -871 -215 -245
3635 -245 -901 -410 238 245 -403 53 697 722 696 321 687 1040 638 243 479 1329 439 493 527 750 -139 -462
3657 -462 -88 -173 -576 -901 -708 -380 -485 -344 -520 -1089 -813 -451 -1175 -711 176 -82 -884 -273 933 653
3677 653 -115 243 941 528 259 1011 1238 404 464 541 227 576 584 -75 100 172 194 -542 -270 -35 -491 -1415
3699 -1415 -1177 -555 -869 -1154 -474 -226 -822 -812 -525 -593 357 438 98 97 607 838 757 385 862 960 652 352
3721 352 1281 1189 221 -106 487 689 7 -673 -343 -68 -631 -1057 -725 187 -383 -1185 -676 -444 -574 -1015
3741 -1015 -509 -213 -695 -502 -210 101 179 451 310 467 854 958 362 76 900 1039 618 143 609 1320
3761 1320 80 -203 718 509 -489 -611 -61 -324 -681 -917 -468 -397 -844 -889 -871 -790 -313 -283 -550 164 152
3782 152 12 -39 90 456 523 130 346 1174 1145 311 686 917 1142 -2 160 778 644 -213 -321 365 -250
3803 -250 -674 -639 96 -524 -901 -960 -453 -484 -700 -436 -1041 -542 35 -62 -239 266 447 623 18 386 766
3824 766 576 -39 581 1202 557 152 420 1055 331 293 -248 686 120 -383 -407 388 -228 -1166 -669 -673 -703 -1308
3846 -1308 -885 -293 -9 -321 -690 -345 -520 124 281 -298 348 827 622 1 597 1210 609 546 710 1082
3866 1082 340 163 597 751 326 -243 8 84 -482 -723 -348 -528 -384 -674 -582 -539 -716 -386 -775 -508 -39
3887 -39 -383 -415 -96 191 332 106 205 999 654 392 437 682 1182 690 491 591 1318 422 -339 487 260
3908 260 68 -616 -420 74 -493 -995 -754 -351 -607 -1102 -454 -664 -182 -378 -541 -344 -216 -9 -131 -207
3928 -207 115 617 350 317 520 1146 750 369 764 1003 475 38 373 870 -98 -227 -103 386 -17 -656
3948 -656 -355 -593 -404 -894 -969 -391 -749 -825 -946 -24 -254 -350 -247 101 -130 -171 464 566 448 732 746 372
3970 372 649 943 798 259 670 1138 317 -109 160 334 -204 -603 78 -282 -325 -925 -519 -128 -915 -967 -743
3991 -743 -494 -362 -788 -681 -346 28 -275 -76 253 392 259 16 489 747 778 442 335 784 580 357
4011 357 486 346 765 47 -288 208 329 -581 -634 -67 -97 -834 -931 -420 -187 -1197 -782 -319 -503 -524 -433
4032 -433 117 108 44 540 204 -120 730 439 15 371 1131 1126 -6 318 903 750 -162 -84 515 271 -405 -307
4054 -307 78 -271 -558 -888 -223 -570 -747 -763 -355 -523 -686 -701 -535 -150 -359 -247 -164 105 485 4 414
4075 414 752 783 431 590 563 662 586 315 550 718 95 -63 173 318 12 -498 -441 -286 -660 -731 -579 -489
4097 -489 -326 -685 -796 -333 -167 -178 -141 -100 172 602 65 -182 984 437 203 318 877 1182 470 347 632
4118 632 669 279 207 826 462 67 -182 -133 -237 -297 -301 -721 -585 -798 -392 -992 -797 -237 -690 -974 -455 60
4140 60 29 -605 -92 464 147 -275 369 1047 195 -72 587 809 643 574 313 435 398 110 119 -227 154 191
4162 191 -634 -1120 -77 -42 -993 -947 -503 -385 -947 -629 89 -336 -798 -810 76 -75 -437 149 502 413 309
4183 309 250 732 766 614 710 669 451 587 781 584 97 116 85 -497 101 375 -150 -559 -1038 -320 -386 -1365
4205 -1365 -843 195 -148 -1458 -667 -17 -23 -775 3 560 -110 26 738 693 290 536 586 514 441 912 703
4226 703 440 162 896 213 -112 501 491 -209 -690 -279 -219 -742 -875 -220 -216 -873 -956 -662 -91 -683 -669 -78
4248 -78 -190 -297 -61 -96 286 432 389 625 268 616 1050 631 127 497 1146 177 7 333 511 -93 -515
4269 -515 248 88 -668 -1166 -131 -260 -1028 -732 -247 -535 -876 -698 -242 8 -137 -65 150 -207 120 219
4289 219 328 466 510 504 609 485 1105 589 529 315 352 668 -144 37 232 184 -618 -807 -7 -324 -848 -845 -221
4312 -221 -755 -1108 -679 39 -240 -598 -127 -127 -203 -238 81 312 335 442 495 409 953 1044 206 127 683 1071 154
4335 154 22 490 531 164 -482 308 83 -238 -395 -398 -326 -673 -622 -564 -524 -497 -579 -699 -140 195 -154 -421 -233
4358 -233 172 230 40 189 374 80 20 585 671 850 397 441 429 727 573 98 382 149 4 -352 -441 -140
4380 -140 -465 -485 -589 -397 -492 -878 -452 -396 -165 -652 -951 -204 109 -7 -455 30 757 352 -211 924 591
4401 591 371 324 752 886 123 407 535 356 246 121 150 111 44 64 -380 -829 -90 -221 -487 -1122 -27
4422 -27 -185 -759 -887 61 56 -521 -180 264 373 -177 -51 481 719 234 597 952 753 713 550 502 377 125
4444 125 567 268 204 129 33 -508 -637 -103 -127 -596 -522 -186 -287 -681 -734 -21 -8 -603 -580 272 -75 -248 119
4467 119 610 231 172 393 767 648 318 381 869 562 691 542 321 630 437 352 -230 197 -163 -40 -151
4488 -151 -564 -349 -523 -801 -260 -143 -442 -650 -544 -482 -222 -478 -215 369 110 -63 20 562 363 103 436
4509 436 575 667 643 635 398 747 639 213 146 274 91 -11 -499 -195 118 -542 -458 -485 -331 -715 -505 -344
4531 -344 -208 -366 -571 -213 -196 211 -525 191 448 698 -78 343 651 740 538 461 996 132 563 245 317
4552 317 748 420 -104 -263 -115 -87 -174 -296 -420 -318 -718 -696 -408 -289 -633 -710 -601 -141 -429 -489 -16 -136
4574 -136 99 22 474 528 283 416 514 613 642 366 489 666 336 285 29 377 433 -155 -98 -155 -131 -383 -288 -386
4598 -386 -606 -175 -678 -535 -250 -374 -638 -668 -122 162 -572 -229 182 239 328 -65 507 610 246 337 611
4619 611 221 523 581 266 278 525 90 159 101 -161 -309 -465 -36 -302 -294 -83 -543 -479 -535 -646 -768 -420 -321
4642 -321 -344 -435 -220 187 -155 -29 357 258 352 160 329 773 308 370 127 677 597 264 237 240 -116 -96 -232
4665 -232 -104 -43 -257 -619 -226 -396 -293 -712 -839 -585 -459 -518 -627 -24 186 -378 -334 269 423 50 250
4686 250 647 324 526 2 745 574 336 450 280 528 198 102 20 11 169 22 -303 -504 32 -272 -535
4707 -535 -556 -317 -133 -689 -522 -112 -11 -223 -572 54 335 -183 -100 556 232 142 187 840 553 235 434
4728 434 635 390 609 224 38 178 57 218 -286 -4 205 -389 -601 -230 -65 -540 -972 -207 -359 -418
4748 -418 -769 -406 -81 -296 -268 78 227 -77 51 339 553 691 500 500 506 565 426 159 608 760 180 -6
4770 -6 252 278 -48 -203 -62 -84 -340 -389 -600 -481 -411 -699 -455 -442 -232 -304 -342 -249 171 -251 -321 10 459 492
4794 492 259 504 292 650 376 149 392 664 419 127 357 514 -156 -301 -406 103 -42 -347 -219 -1
4814 -1 -535 -774 -252 -601 -485 -553 -288 -378 -297 172 -35 -157 239 192 139 28 365 625 117 169 371 727 74
4837 74 145 784 335 287 -103 198 -103 -627 -394 93 -366 -628 -491 -305 -360 -922 -682 -564 -441 -151 -292
4858 -292 -199 -512 294 -136 -173 -158 401 434 -70 270 701 392 138 419 635 440 -173 381 487 93 -76
4879 -76 29 -193 -155 -382 237 -364 -404 -737 -473 -121 -343 -138 -196 -423 -573 -430 -128 -222 -73 618 36 -152
4901 -152 405 467 665 -35 649 660 133 164 427 842 544 14 390 240 -121 67 -53 -235 -423 -305 -513
4922 -513 -175 -392 -246 -395 -803 -228 -122 -652 -781 -26 -205 -420 -52 420 193 393 15 592 595 364 501
4943 501 484 615 3 535 388 390 250 -27 -136 -126 100 -264 -270 -160 -408 -878 -694 -477 4 -504 -498 -577 -57
4966 -57 -26 -363 -110 169 310 -103 84 512 327 -155 546 593 630 350 510 482 155 372 139 274 400 170
4988 170 -87 -345 -247 -20 -402 -586 -530 -34 -1011 -867 -49 -166 -489 -688 -259 12 -137 -70 44 150 392
5009 392 234 244 618 498 623 250 326 317 102 97 -3 409 160 279 -141 -162 -180 -298 -283 67 -143 -619 -872
5032 -872 -228 -177 -482 -435 -260 -243 -544 -192 192 213 176 64 325 268 287 224 361 389 755 445 383 636 647 305
5056 305 -194 236 67 126 -238 -361 -88 -251 -356 -76 -204 -719 -880 -594 -151 -227 -28 -348 -285 -315 -48
5077 -48 -275 -123 208 252 252 186 851 475 206 323 507 495 402 226 688 388 174 -28 64 267 -250 -503 -120
5100 -120 -288 -355 -487 -94 -582 -190 -283 -158 -613 -64 -226 -190 -236 200 328 -175 76 531 637 194 175 643
5122 643 306 -47 565 859 640 -21 276 198 137 -147 -229 -10 124 -557 -374 -358 -564 -578 -424 -583 -351 221
5144 221 -586 -583 -297 0 -433 -261 178 429 383 87 231 560 245 266 352 801 356 0 491 543 275 -40
5166 -40 -7 55 -133 -87 -473 -280 -430 -110 -182 -427 -332 -246 -702 -361 -229 -333 -483 -413 -1 -42 -295 -312 295
5189 295 388 194 335 204 628 344 453 622 555 175 306 195 402 116 166 -104 73 -379 -210 -231 -359
5210 -359 -318 -379 -620 -658 -249 -719 -749 -289 -56 -30 24 418 79 408 91 305 92 817 193 138 277 289 478
5233 478 157 233 349 90 -82 -65 82 -46 -378 -305 191 -616 -534 -223 -108 -164 -158 -588 -235 -212 -817 -274 -24
5256 -24 96 -132 -132 81 336 93 96 464 414 418 510 104 379 681 -10 -157 70 268 82 -88 -119 215 -138
5279 -138 -287 -85 208 -455 -726 -67 -158 -175 -258 -150 209 -232 -402 -213 -33 76 189 195 254 277 469 479 350
5302 350 168 606 -33 407 492 277 169 -167 336 390 -192 -363 -315 194 -246 -589 -331 -294 -775 -687 -209 -61
5324 -61 -116 -205 -294 156 114 -215 107 244 328 268 161 317 518 553 -6 -44 570 327 229 30 293 202 259 131
5348 131 -10 73 -75 -190 -135 -205 -195 -606 -384 -227 -417 -644 -264 68 -328 -217 -235 -29 27 138 1 498
5370 498 120 178 229 468 334 191 146 147 332 247 -163 -189 266 130 54 -244 57 10 -103 -182 -451 -438 -227 -626
5394 -626 -188 -238 19 -272 -273 49 -134 -127 -69 389 402 279 -29 204 342 163 447 699 445 517 347 430 432 365
5418 365 75 68 39 -236 -567 -331 -214 -48 -413 -477 -255 -340 -437 -565 -343 -355 -83 -262 -54 138 211 -135 -57
5441 -57 517 253 491 382 -61 533 375 365 452 346 322 356 307 196 155 -138 139 170 -204 -445 -458 -579 -300
5464 -300 -328 -459 -589 -261 -500 -431 45 -165 -106 -410 -150 405 97 127 131 271 360 57 139 599 410 574 232
5487 232 419 52 1 102 4 -294 187 -261 -249 -212 -400 -482 -619 -283 -252 -372 -177 -120 15 -53 -391 92 79
5510 79 -28 218 418 255 214 338 723 183 278 336 225 241 103 504 -90 -64 207 -137 -115 -36 149 -279 -591
5533 -591 -221 -127 -395 -433 -486 -400 -257 -678 -298 170 -66 -139 104 142 124 -130 375 89 166 419 543 575 387
5556 387 449 383 359 197 753 178 -180 -28 201 -199 -411 -146 -170 -400 -685 -300 -212 -565 -377 152 -139 -192
5578 -192 -259 -154 -120 -10 -13 358 93 203 467 384 24 395 272 -327 -7 620 577 -6 -78 362 126 -213
5600 -213 -212 171 -187 -608 -326 -164 -178 -651 -485 -391 -476 -366 -381 -207 -256 -109 -120 31 111 301 409 240 173
5623 173 303 496 281 127 691 398 -6 551 268 124 100 190 557 -117 -620 -90 61 -329 -546 -335 -301
5644 -301 -266 -236 -378 -445 -603 -234 -255 -160 -130 29 63 17 283 151 117 227 430 181 128 -64 644 615 20 100
5668 100 111 174 -52 -128 -68 -324 -210 -551 -379 -279 -399 -284 -279 -250 -123 44 -112 -240 -150 -350 -418 88 320
5691 320 192 -64 350 315 216 -5 446 417 25 251 301 529 244 122 219 90 -22 -43 -197 -240 -82 -331
5713 -331 139 -443 -280 -248 -228 -458 -25 149 -346 -461 56 270 -46 -369 94 371 171 108 382 688 268
5734 268 193 526 405 190 6 540 194 -53 -284 -69 -261 -443 -191 -374 -403 -186 -258 -322 -678 -118 -295
5755 -295 -462 -323 -379 72 -331 -206 16 -6 -139 451 464 195 194 711 561 486 186 274 262 176 212 380 114
5778 114 25 338 13 -229 -156 36 -191 -543 -498 202 -199 -649 -414 -147 -225 -330 -132 131 -227 -19 57 47
5800 47 142 102 215 324 626 504 135 394 347 253 243 384 316 152 -208 -80 213 -30 -96 -352 -324 -184 -548
5823 -548 -368 -715 -136 -218 -252 80 -110 -257 -110 -90 -295 363 -242 54 256 417 368 12 147 272 476
5844 476 39 -82 318 313 -172 162 286 -61 -334 -20 -9 -452 -539 -359 -261 -452 -393 -271 -538 -275 -291 -102
5866 -102 -133 374 -26 21 -109 117 325 18 443 272 322 245 325 -1 452 306 21 205 205 227 27 75 -17
5889 -17 -34 -316 -68 -159 -278 -85 -108 -51 -66 -107 -184 -304 -113 -133 -175 -122 425 -39 -27 110 360 447 270 331 340
5914 340 323 73 167 485 250 326 -231 39 108 20 -103 -258 72 -312 -590 -48 -347 -335 -135 -334 -192 -61
5936 -61 -203 -283 -3 39 44 -67 422 219 463 256 405 573 316 165 135 800 403 437 -130 135 163 253 -51
5959 -51 88 245 -77 -287 -89 40 -437 -42 -221 -302 -138 -307 -180 11 -340 -47 -252 -112 228 -160 224
5980 224 185 51 357 130 365 421 330 325 252 495 107 201 216 138 9 -126 29 104 -142 -33 -305 -211 -287 -499
6004 -499 -447 -307 -240 -320 -467 -298 257 -73 -142 134 223 -168 -181 291 601 291 -21 293 217 135 172 227 227 528
6028 528 534 -9 196 -223 43 -48 -293 170 38 -235 -368 58 -105 -194 -317 -209 0 -324 -318 -136 -31 182
6050 182 186 166 258 518 473 489 830 348 125 205 511 155 221 -22 -81 349 249 -164 -107 -55 182 -288 -275 -103
6074 -103 -322 -285 -137 -358 -202 -284 -437 -189 -72 215 11 17 28 -63 -195 195 318 324 154 57 456 440 315
6097 315 -172 241 472 48 518 -87 -1 135 24 -153 5 -229 -403 32 -128 -163 -283 -453 -59 -312 -164
6118 -164 -530 -160 -150 -1 85 -94 -46 347 156 326 266 475 234 479 239 208 119 -162 -157 -8 296 145 265
6141 265 -133 -139 -377 -193 -500 -352 -112 -140 -301 -343 -223 -108 -392 -217 -94 -129 -377 249 321 192 -267 392
6163 392 192 383 137 44 481 44 -28 463 265 137 18 72 298 -318 24 -75 -235 -219 -94 -79 -359 -289
6185 -289 -309 -444 -489 -189 -146 -222 -248 223 110 95 -69 14 230 112 175 465 259 -188 346 537 392 8 286
6208 286 507 -49 50 -229 -45 -259 -256 -136 -349 -478 -322 -262 -287 -379 170 -95 -80 38 -99 -24 -49 219 229
6231 229 133 -239 280 -120 35 -18 327 377 205 305 593 340 75 187 111 303 96 -23 -122 -66 -314 -91
6253 -91 -265 -361 -368 51 -325 -583 -308 -301 -449 -106 102 -59 -90 172 268 214 208 241 52 364 227 289 472 334
6277 334 446 110 86 138 -291 -117 -251 85 -52 39 -305 -484 -243 -340 -545 -333 -240 -328 -381 -370 133 -114 -259
6300 -259 -155 -144 -194 -137 29 280 78 337 440 213 231 311 436 236 241 323 75 362 110 -190 -184 -133 98 109
6324 109 -134 -455 -122 -18 -468 -136 -89 -32 -239 -203 -21 -178 -131 -90 202 10 173 408 -49 77 541 243
6346 243 49 76 330 -26 164 307 444 -115 66 -39 -24 -141 -123 -147 -116 -147 -340 -487 -131 -411 -393 -148
6368 -148 -53 44 -209 -35 -346 22 290 -92 183 -7 229 382 162 353 292 257 36 96 204 139 286 121
6390 121 365 -150 -317 -182 -304 -39 -406 -164 -55 -340 -519 -372 -448 39 -251 2 -185 -61 -241 -60
6410 -60 -167 151 211 301 -141 211 523 117 173 383 456 -12 168 270 259 -190 -43 204 131 197 -15 -167 -128
6433 -128 -425 -122 224 -309 -544 82 -367 60 -50 168 78 69 35 125 227 121 296 167 155 179 383 428 63
6456 63 306 472 127 155 86 5 -6 -111 240 46 -24 -341 -261 -247 -463 -21 -309 -212 -114 -153 -231 -199 -73 99
6480 99 176 -153 210 82 168 -47 290 418 90 118 434 533 358 -132 250 270 -103 -93 111 21 401 -288 -124
6503 -124 51 6 -105 -39 -231 -294 -512 -163 -15 -178 365 33 199 124 -275 -186 -306 228 115 171 -28 358
6525 358 187 170 333 290 444 113 232 -287 130 -81 -83 187 -32 13 44 -160 -411 -231 -170 -190 -227 24 -6
6548 -6 -226 -21 -136 3 -292 362 185 57 43 410 225 285 -20 -82 410 48 17 159 483 60 66 84 88 16
6572 16 -100 -9 -23 278 -74 -237 -193 69 -434 -10 -352 35 -171 -186 -313 43 -40 21 220 426 357 193 179
6595 179 30 338 126 126 -12 319 -15 236 130 -201 79 -21 81 234 -181 -107 -232 21 73 -444 -261
6616 -261 -194 -156 -178 -432 45 55 -50 -183 -36 90 -9 -223 514 297 227 407 178 -84 352 234 155 139 -10
6639 -10 171 201 135 67 186 -206 -184 63 -142 -165 -408 -214 -103 -216 -174 -236 59 -324 -70 -344 9 52 40
6662 40 -178 154 178 24 204 477 283 418 -23 82 284 86 295 -79 15 -246 -38 -18 189 -16 -209
6683 -209 -48 -275 -317 -342 -396 -476 22 64 -211 -435 -195 -183 -18 -112 -62 150 87 484 99 144 141 85 269 130
6707 130 169 -37 141 38 256 -36 -40 179 173 301 -272 -127 -117 -89 -496 -192 -132 -356 -409 -159 -83 -244 -330 -109
6731 -109 -103 224 16 30 356 70 154 169 354 98 528 -37 413 251 188 273 101 175 180 -59 -297 -103 88
6754 88 -370 -285 84 -444 -125 -337 -455 -198 -281 -316 42 306 -13 -232 80 117 -52 97 -99 258 40 -109
6776 -109 386 273 377 77 163 198 71 -161 52 284 111 -171 -207 55 29 -101 -347 -78 -263 -167 -413 -404
6798 -404 -215 -289 -181 -466 -102 29 155 100 -237 362 293 132 105 229 287 119 279 26 37 171 90 -25
6820 -25 30 189 110 -39 142 -111 -91 -222 264 -26 -69 -443 -246 -393 -309 41 -568 -320 -109 -558 -139 31
6842 31 -191 156 141 373 49 457 253 -32 500 272 173 510 156 209 -208 257 -9 -19 -98 -263 154 -188
6864 -188 -105 -387 -291 -80 -516 -81 -108 -87 -160 -126 -3 -46 -255 -59 282 120 32 430 348 325 38 151 -223
6887 -223 458 337 159 92 314 233 100 -79 -113 70 -276 26 -21 -24 18 -108 55 -389 -207 -114 -140 -441 -69
6910 -69 -35 11 -457 274 334 91 -161 459 60 166 193 223 208 25 105 237 44 183 27 -43 77 -80 -196
6933 -196 -138 -77 -144 -296 -116 -61 -265 -68 111 -81 -399 -161 -263 -5 -356 -38 -116 74 117 42 58 291 521
6956 521 177 295 265 -27 118 28 52 185 235 116 -2 129 -11 -181 303 4 21 -335 -354 -358 -137 -205 -379
6979 -379 -414 -256 101 -488 -59 341 -135 -139 95 381 142 233 -282 193 3 -274 179 197 175 143 169 60 442
7002 442 139 -81 -30 -299 -241 -33 -475 -308 -19 -236 -392 -148 -445 -105 -429 -386 18 -202 -438 -121 287
7023 287 260 6 157 107 260 282 281 563 -71 43 421 254 198 10 104 -324 72 219 243 -55 112 -166 -362
7046 -362 -176 -512 -32 -180 -326 -22 44 -138 -23 -197 22 60 -355 32 -7 45 95 335 469 -1 326 212
7068 212 109 -178 104 181 214 300 12 -278 20 -84 200 -375 -238 -151 98 -181 -240 -88 -57 -440 -374 -121
7090 -121 -177 -104 29 347 122 -246 48 23 174 -109 19 163 208 -8 443 238 460 283 201 225 -187 108
7112 108 15 -224 -333 -108 -13 -79 147 -176 -301 -191 -189 -24 -280 -51 -101 -78 -14 -104 44 26 8 20 234 96
7136 96 26 236 -245 246 128 281 -24 -148 370 271 -58 51 157 -174 -75 -557 46 -147 -172 120 -139 -299
7158 -299 -394 -229 -335 -357 -401 -239 303 -80 -8 92 148 -104 123 167 237 422 50 215 22 161 76 444 28
7181 28 -237 -85 160 -20 -269 265 -174 -180 -508 -180 -23 -351 -135 -113 345 -204 -104 -161 -52 -102 92 88 101
7204 101 -16 142 143 273 318 165 57 291 344 192 290 3 114 -246 157 110 34 -232 115 121 -33 -140 -556
7227 -556 48 86 -116 -62 -130 -107 -274 100 -14 -67 138 -348 -9 -10 158 80 40 -188 -42 40 228 156 88 417
7251 417 61 170 -95 189 94 243 -44 20 -192 220 -304 -442 139 -112 -46 0 -139 -245 -356 -233 -168 -135
7273 -135 41 30 -124 -181 54 -50 102 115 112 125 -18 49 223 518 89 152 73 -59 -283 -60 -175 -74 -70 -427
7297 -427 -3 -198 -430 -97 38 -347 -196 205 93 74 264 -85 -185 -112 86 190 98 -201 -306 442 317
7318 317 223 178 -49 175 470 -194 75 -189 -11 -124 96 -48 112 -95 -236 -72 -131 50 -49 -350 -321 -201
7340 -201 -124 -164 12 6 43 178 -193 -23 97 132 19 484 247 326 474 96 312 -76 -112 118 -69 -77 -255
7363 -255 141 108 -115 127 -36 -21 6 -384 -7 -321 -63 -3 24 -109 -7 -98 156 2 413 407 61 21 140
7386 140 288 321 97 519 349 73 605 144 -75 233 270 204 164 23 -128 18 -65 26 71 -187 -221 91 -232
7409 -232 -306 -276 -168 -199 78 -281 266 243 -7 127 67 460 34 135 115 99 -26 255 195 235 -158 321 -41
7432 -41 -43 21 163 90 14 -376 55 -208 -432 -504 -234 65 -306 91 31 -458 -225 -404 -58 50 -146 -18 -207
7455 -207 128 420 157 131 183 19 61 50 218 370 359 -1 250 183 140 -210 -46 142 -207 -77 -43 -100 -183
7478 -183 -391 -389 -156 -29 -7 -43 -120 -191 213 280 -59 87 185 214 28 281 99 224 64 130 355 207 243 304
7502 304 24 457 13 0 289 61 122 -5 164 17 -158 -382 -270 -46 -210 -25 -28 -193 -170 -173 -321 -98
7524 -98 -11 -180 -175 141 423 143 411 353 171 357 -164 215 371 170 63 174 282 19 -188 -43 63 59
7546 59 125 -161 -387 10 -276 -57 -4 -31 -136 -502 -189 -43 59 -146 -200 184 236 265 123 314 367 197 90
7569 90 143 271 231 182 285 180 218 178 164 270 449 103 -291 -163 -128 -300 -256 -18 -216 -122 -503 -352 -88
7592 -88 -5 -299 -62 180 -195 54 100 155 187 -138 251 374 220 257 256 376 -12 279 -156 156 280 269 -278
7615 -278 -126 10 24 -59 -360 -36 -180 76 -138 -97 -26 -19 -340 -16 -205 -147 -71 101 116 -128 200 82 130
7638 130 164 457 -79 315 -49 290 170 -5 93 242 246 -206 -148 -52 -30 135 1 -351 -6 103 -65 133
7660 133 -230 -128 -92 -338 -332 213 -308 72 209 49 -24 237 291 127 128 240 277 449 -45 -34 221 348 32
7683 32 -59 24 270 -32 136 -55 237 -157 14 -224 -75 -275 -276 45 -417 -78 -123 -133 -184 -298 64 219 -20
7706 -20 -222 41 -20 262 261 220 9 510 213 -55 10 205 144 92 -47 259 121 -186 -123 -92 -50 -244 -203 -61
7730 -61 19 -291 58 -80 -32 36 -290 -11 -18 -174 -159 56 39 150 261 -131 -9 135 388 389 180 317 208
7753 208 311 294 376 18 399 137 137 23 -237 329 17 -112 -157 -201 -40 -125 -360 -119 -72 -173 3 42 -293
7776 -293 -367 183 -5 165 204 358 -99 -89 299 127 209 -44 290 305 -303 -65 190 -31 269 -100 31 72
7798 72 282 -23 88 -221 -149 -76 -100 -530 -49 -180 -113 -91 112 -103 -3 103 86 172 -118 238 353 224 -96
7821 -96 302 114 435 263 458 75 -17 196 164 -280 91 -215 -273 -112 56 -56 -143 -285 39 -407 -20 -44
7843 -44 115 -181 -127 22 -145 -60 -311 -125 -11 -524 3 245 66 99 214 209 661 145 -94 338 -159 62
7865 62 -203 137 -185 116 0 -221 169 -258 -42 -111 -253 -246 59 -233 -504 -253 -101 116 -138 -107 189 32
7887 32 78 146 65 397 102 311 516 116 198 -211 228 290 214 88 112 33 -167 170 100 -146 -338 -85 12 -66
7911 -66 -199 -48 -270 46 -52 -300 2 128 107 -106 -115 -24 414 157 119 184 148 36 176 128 -77 -87 78 99
7935 99 -203 49 128 40 224 257 73 185 -266 -219 -153 -20 -74 -109 -361 -319 -187 -337 -75 19 -292 27 41 -215
7959 -215 259 94 147 225 188 241 90 85 -68 170 192 48 85 232 127 -113 -36 -297 272 192 -360 -3 -210
7982 -210 -111 -76 -76 -252 -364 83 35 -2 17 -103 -264 -168 100 138 23 82 189 251 206 288 128 -7 148 77 68
8007 68 250 269 146 -216 -18 217 -38 -116 -206 -211 -147 -389 -275 -199 -119 -142 -30 -186 -425 96 -410 -375 -33 -79
8031 -79 -84 118 58 -51 279 32 231 266 41 308 268 129 -154 -90 175 242 60 26 216 -196 -86 -127 30
8054 30 59 -277 -76 56 -273 -72 -131 -20 -349 132 114 -58 -2 -373 230 96 26 337 268 404 -158 132
8076 132 17 153 177 175 -2 -145 -57 -164 -4 -81 -30 -217 -400 -251 -312 -101 24 -228 -92 6 -270 -247 -224
8099 -224 -255 89 266 216 159 26 205 137 479 423 248 272 184 226 77 289 286 2 -92 153 169 -1 -154 17
8123 17 -6 -33 -343 -277 -86 -80 -112 -163 98 70 -250 -46 -19 134 61 174 90 -16 -70 160 177 36 193 87 114
8148 114 94 408 75 179 61 209 -210 -42 30 -27 -103 -193 -117 -243 -209 51 -7 -314 59 -149 -43 -242 -353
8171 -353 -254 358 -234 363 168 174 210 211 -80 175 271 153 57 -10 56 225 376 216 56 128
8191A28
##END NTUPLES=NMR FID
##END=
