##TITLE=1H_DHA-DCC-f3-2
 CDcl3, 8 sc, 
 30.5.2019
##JCAMPDX= 6.0         $$ Bruker NMR JCAMP-DX V2.0
##DATA TYPE= NMR FID
##DATA CLASS= NTUPLES
##ORIGIN= UXNMR, Bruker Analytische Messtechnik GmbH
##OWNER= root
$$ XWIN-NMR		Version 3.5
$$ Thu May 30 13:14:57 2019 Russian Standard Time (UT+4h)  she@DPX200
##.OBSERVE FREQUENCY= 200.13155
##.OBSERVE NUCLEUS= ^1H
##.DELAY= (6, 6)
##.ACQUISITION MODE= SIMULTANEOUS
##.ACQUISITION SCHEME= undefined
##.AVERAGES= 8
##.DIGITISER RES= 18
##SPECTROMETER/DATA SYSTEM= spect
##.PULSE SEQUENCE= zg30
##.SOLVENT NAME= CDCl3
##.SHIFT REFERENCE= (INTERNAL, CDCl3, 0, 15.7039)
##AUDIT TRAIL= $$ (NUMBER, WHEN, WHO, WHERE, WHAT)
$$ ##TITLE= Audit trail, XWIN-NMR		Version 3.5
$$ ##JCAMPDX= 5.01
$$ ##ORIGIN= Bruker BioSpin GmbH
$$ ##OWNER= she
$$ F:/spectra/data/she/nmr/H-F/1/audita.txt
$$ ##AUDIT TRAIL=  $$ (NUMBER, WHEN, WHO, WHERE, WHAT)
(   1,<2019-05-30 13:13:45.84 +0400>,<she>,<DPX200>,
      <created by zg, POWCHK disabled, PULCHK disabled
       configuration hash MD5:
       00 E9 B6 7A A2 85 ED C7 34 08 36 98 17 FE 4E 26
       data hash MD5: 16K
       A4 07 71 5F 54 74 94 D0 B6 E3 8E A0 0A 10 DA 96>)
$$ ##END=
$$ 
$$ hash MD5
$$ B3 04 81 87 67 61 E2 65 8C EA 6A 2B 7D 68 72 70
##$RELAX= 
##$RELAX= 
##$RELAX= 
##$RELAX= 
##$RELAX= 
##$RELAX= 
$$ Bruker specific parameters
$$ --------------------------
##$DU= <F:/spectra>
##$EXPNO= 1
##$NAME= <H-F>
##$PROCNO= 1
##$TYPE= <nmr>
##$USER= <she>
##$AMP= (0..31)
100 100 100 100 100 100 100 100 100 100 100 100 100 100 100 100 100 100 
100 100 100 100 100 100 100 100 100 100 100 100 100 100 
##$AQSEQ= 0
##$AQ_mod= 1
##$AUNM= <au_zg>
##$AUTOPOS= <>
##$BF1= 200.13
##$BF2= 200.13
##$BF3= 200.13
##$BF4= 200.13
##$BF5= 200.13
##$BF6= 200.13
##$BF7= 200.13
##$BF8= 200.13
##$BYTORDA= 1
##$CFDGTYP= 0
##$CFRGTYP= 5
##$CHEMSTR= <none>
##$CNST= (0..31)
1 1 145 1 1 1 1 1 1 1 1 1 1 1 1 1 1 1 1 1 1 1 1 1 1 1 1 1 1 1 1 1 
##$CPDPRG= <>
##$CPDPRG1= <>
##$CPDPRG2= <>
##$CPDPRG3= <>
##$CPDPRG4= <mlev>
##$CPDPRG5= <mlev>
##$CPDPRG6= <mlev>
##$CPDPRG7= <mlev>
##$CPDPRG8= <mlev>
##$CPDPRGB= <>
##$CPDPRGT= <>
##$D= (0..31)
0 1.2 0 0 0 0 0 0 0 0 0 0.03 0 0 0 0 0 0 0 0 0 0 0 0 0 0 0 0 0 0 0 0 
##$DATE= 1559207625
##$DBL= (0..7)
120 120 120 120 120 120 120 120 
##$DBP= (0..7)
150 150 150 150 150 150 150 150 
##$DBP07= 0
##$DBPNAM0= <>
##$DBPNAM1= <>
##$DBPNAM2= <>
##$DBPNAM3= <>
##$DBPNAM4= <>
##$DBPNAM5= <>
##$DBPNAM6= <>
##$DBPNAM7= <>
##$DBPOAL= (0..7)
0.5 0.5 0.5 0.5 0.5 0.5 0.5 0.5 
##$DBPOFFS= (0..7)
0 0 0 0 0 0 0 0 
##$DE= 6
##$DECBNUC= <off>
##$DECIM= 24
##$DECNUC= <off>
##$DECSTAT= 4
##$DIGMOD= 1
##$DIGTYP= 9
##$DL= (0..7)
0 120 120 120 120 120 120 120 
##$DP= (0..7)
150 150 150 150 150 150 150 150 
##$DP07= 0
##$DPNAME0= <>
##$DPNAME1= <>
##$DPNAME2= <>
##$DPNAME3= <>
##$DPNAME4= <>
##$DPNAME5= <>
##$DPNAME6= <>
##$DPNAME7= <>
##$DPOAL= (0..7)
0.5 0.5 0.5 0.5 0.5 0.5 0.5 0.5 
##$DPOFFS= (0..7)
0 0 0 0 0 0 0 0 
##$DQDMODE= 0
##$DR= 18
##$DS= 0
##$DSLIST= <SSSSSSSSSSSSSSS>
##$DSPFIRM= 0
$$ [...]
##$SUBNAM2= <"">
##$SUBNAM3= <"">
##$SUBNAM4= <"">
##$SUBNAM5= <"">
##$SUBNAM6= <"">
##$SUBNAM7= <"">
##$SUBNAM8= <"">
##$SUBNAM9= <"">
##$SW= 24.9336996594482
##$SWIBOX= (0..15)
0 0 2 0 0 0 0 0 0 0 0 0 0 0 0 0 
##$SW_h= 4990.01996007984
##$TD= 16384
##$TD0= 1
##$TE= 0
##$TE2= 300
##$TE3= 300
##$TEG= 300
##$TL= (0..7)
0 120 120 120 120 120 120 120 
##$TP= (0..7)
150 150 150 150 150 150 150 150 
##$TP07= 0
##$TPNAME0= <>
##$TPNAME1= <>
##$TPNAME2= <>
##$TPNAME3= <>
##$TPNAME4= <>
##$TPNAME5= <>
##$TPNAME6= <>
##$TPNAME7= <>
##$TPOAL= (0..7)
0.5 0.5 0.5 0.5 0.5 0.5 0.5 0.5 
##$TPOFFS= (0..7)
0 0 0 0 0 0 0 0 
##$TUNHIN= 0
##$TUNHOUT= 0
##$TUNXOUT= 0
##$USERA1= <user>
##$USERA2= <user>
##$USERA3= <user>
##$USERA4= <user>
##$USERA5= <user>
##$V9= 5
##$VALIST= <valist>
##$VCLIST= <CCCCCCCCCCCCCCC>
##$VD= 0
##$VDLIST= <DDDDDDDDDDDDDDD>
##$VPLIST= <PPPPPPPPPPPPPPP>
##$VTLIST= <TTTTTTTTTTTTTTT>
##$WBST= 1024
##$WBSW= 4
##$XGAIN= (0..3)
0 0 0 0 
##$XL= 0
##$YL= 0
##$YMAX_a= 307438
##$YMIN_a= -408939
##$ZGOPTNS= <>
##$ZL1= 120
##$ZL2= 120
##$ZL3= 120
##$ZL4= 120
##$ABSF1= 10
##$ABSF2= 0
##$ABSG= 5
##$ABSL= 3
##$ALPHA= 0
##$AQORDER= 0
##$ASSFAC= 0
##$ASSFACI= 0
##$ASSFACX= 0
##$ASSWID= 0
##$AUNMP= <proc_1d>
##$AZFE= 0.1
##$AZFW= 0.1
##$BCFW= 1
##$BC_mod= 2
##$BYTORDP= 1
##$COROFFS= 0
##$CY= 11.3945322036743
##$DATMOD= 1
##$DC= 2
##$DFILT= <>
##$DTYPP= 0
##$F1P= 18.9103706918063
##$F2P= -1.10871071338519
##$FCOR= 0.5
##$FTSIZE= 0
##$FT_mod= 4
##$GAMMA= 1
##$GB= 0.15
##$INTBC= 1
##$INTSCL= 1
##$ISEN= 128
##$LB= 0.24
##$LEV0= 0
##$LPBIN= 0
##$MAXI= 10000
##$MC2= 0
##$MEAN= 0
##$ME_mod= 0
##$MI= 1.114404
##$NCOEF= 0
##$NC_proc= 0
##$NLEV= 6
##$NOISF1= 3.799351
##$NOISF2= 2.8
##$NSP= 1
##$NTH_PI= 0
##$NZP= 0
##$OFFSET= 15.70392
##$PC= 1
##$PHC0= -8494.193
##$PHC1= 9.80023
##$PH_mod= 1
##$PKNL= yes
##$PPARMOD= 0
##$PSCAL= 0
##$PSIGN= 0
##$REVERSE= no
##$SF= 200.130013532006
##$SI= 16384
##$SIGF1= 3
##$SIGF2= 2
##$SINO= 400
##$SIOLD= 16384
##$SREGLST= <1H.CDCl3>
##$SSB= 0
##$STSI= 0
##$STSR= 0
##$SW_p= 3612.71676300578
##$SYMM= 0
##$S_DEV= 0
##$TDeff= 0
##$TDoff= 0
##$TI= <>
##$TILT= no
##$TM1= 0
##$TM2= 0
##$TOPLEV= 0
##$USERP1= <user>
##$USERP2= <user>
##$USERP3= <user>
##$USERP4= <user>
##$USERP5= <user>
##$WDW= 1
##$XDIM= 8192
##$YMAX_p= 0
##$YMIN_p= 0
$$ End of Bruker specific parameters
$$ ---------------------------------
##NTUPLES= NMR FID
##VAR_NAME=  TIME,          FID/REAL,        FID/IMAG
##SYMBOL=    X,             R,               I
##VAR_TYPE=  INDEPENDENT,   DEPENDENT,       DEPENDENT
##VAR_FORM=  AFFN,          ASDF,            ASDF
##VAR_DIM=   8192,          8192,            8192
##UNITS=     SECONDS,       ARBITRARY UNITS, ARBITRARY UNITS
##FACTOR=    0.0002004,     1,               1
##FIRST=     0,             0,               0
##LAST=      1.6414764,     0,               0
##MIN=       0,             -408939,         0
##MAX=       1.6414764,     307438,          0
$$ Real data points
##PAGE= N=1
##DATA TABLE= (X++(R..R)), XYDATA
$$ [...]
$$ plain form
2304 -1396 -2177 2960 3699 -1966 -2166 2575 2695 -1420 -293 4697 2823 -2633 -1442 3533 2182 -2118
2320 -2118 -1390 2682 1705 -1797 -248 3152 674 -3753 -1662 2741 743 -3077 -1712 2443 279
2335 279 -3401 -926 2547 -1178 -4885 -1594 2878 -602 -4084 -538 2834 -704 -3434 252 2000
2350 2000 -2198 -4175 751 3192 -604 -1880 1508 2714 -678 -1561 1690 1688 -1519 -1481 2157 2771 427
2367 427 -83 1922 2759 599 -337 1074 1461 -561 -1246 1139 2536 667 -865 1029 1840 -682 -1441
2384 -1441 309 963 -2096 -2139 1211 1379 -1789 -2199 766 380 -1801 -2095 279 314 -2425 -1861 329
2401 329 366 -1621 -1835 139 168 -1024 -775 693 647 -746 -691 1018 1265 -868 -1354 1052 2135 -137
2419 -137 -822 2558 2528 -708 -978 2474 2362 -1477 -1423 2875 2310 -1117 -201 3162 1551 -2264 -230
$$ packed form
2304a396p81N137P39n665k00M741J20m115J127M990j874n456J191M975j351m300
2320b118P28M072r77l502J549L400k478m427K091M403j998l820J365M155k164
2335B79l680K475L473l725l707L291M472l480l482L546L372l538k730L686J748
2350B000m198j977M926K441l796j276L388J206l392q83L251kl207L8L638O14k344
2367D27n10K005Q37k160r36J411L87k022o85K385J397j869j532J894Q11k522p59
2384a441J750O54l059m3L350J68l168m10K965l86k181k94K374L5k739N64K190
2401C29L7j987k14J974K9j192K49J468m6j393N5J709K47k133m86K406J083k272
2419a37o85L380l0l236k70L452j12l839N4M298n65l427R16L363j611l815K034
$$ plain form
2436 -230 2821 635 -2720 -86 2622 -264 -2253 473 2276 -1540 -2783 -58 1314 -1748 -2533
2451 -2533 -291 887 -1623 -2059 -102 236 -1512 -1877 11 604 -563 -1526 -170 1246 -143 -2133
2467 -2133 -390 1418 181 -1877 353 2510 889 -1186 1286 3038 -45 -1771 926 2403 -715
2482 -715 -1482 2542 3058 -315 -644 2674 2757 -1495 -1229 2179 1304 -2108 -973 2052 939 -1481 -337
2499 -337 1601 -320 -1901 -1418 111 -1097 -1852 -986 -2 -140 -993 -683 -640 -406 -1203 -1608 -872 -189 -513
2518 -513 -1440 110 1398 -365 -1569 308 1553 -677 -1443 1358 2120 -473 -981 1909 1587 -823
2534 -823 -193 2549 1367 -891 419 2615 1199 -900 406 2184 227 -1334 751 1681 -132 -750
2550 -750 1179 1021 -473 -666 445 -367 -1273 -891 30 -452 -816 -465 -370 -605 -836 -889 -1083 -1036 -367 -1245
$$ packed form
2436b30L051k186l355K634K708k886j989K726J803l816j243K725J372l062p85
2451b533K242J178k510m36J957L38j748l65J888N93j167r63J356J416j389j990
2467b133J743J808j237k058K230K157j621k075K472J752l083j726K697J477l118
2482g15p67M024N16l373l29L318Q3m252K66L408q75l412J135L025j113k420J144
2499c37J938j921j581M83J529j208p55Q66R84j38q53L10M3K34p97m05P36O83l24
2518e13r27J550J288j763j204J877J245k230p66K801P62k593n08K890l22k410
2534h23O30K742j182k258J310K196j416k099J306J778j957j561K085R30j813o18
2550g50J929j58j494j93J111q12r06L82R21m82l64L51R5k35k31n3j94M7O69q78
$$ plain form
2570 -1245 -1485 -333 250 -652 -1193 824 1188 -1176 -1393 883 418 -1802 -370 1875 694 -768 860
2587 860 2421 112 -1122 1098 2155 30 -202 2129 1683 -795 -492 1866 782 -895 341 1919
2603 1919 434 -579 625 736 -249 -493 249 -399 -899 9 -98 -925 -287 764 -354 -1632 -221
2620 -221 233 -1929 -2625 271 266 -1963 -1202 1529 424 -2172 -1049 1319 -746 -2318 86 2268 -739
2637 -739 -1736 1606 2166 -913 -952 1927 1916 -894 -574 2211 1418 -989 236 1894 1761 213 284 1104
2655 1104 736 535 -96 543 1124 602 -364 -218 616 -111 -1175 -712 1060 207 -1274 -532 778 -1335
2673 -1335 -2643 -239 1227 -1653 -2422 467 1512 -2054 -2475 1076 503 -2897 -1933 1818 426 -2800
2689 -2800 -902 1837 606 -1139 204 1369 -219 -988 145 972 239 201 997 1133 845 1266 923
$$ packed form
2570a245k40J152N83r02n41K017L64k364k17K276m65k220J432K245j181j462J628
2587H60J561k309j234K220J057k125k32K331m46k478L03K358j084j677J236J578
2603A919j485j013J204J11r85k44P42o48n00R08j07q27O38J051j118j278J411
2620b21M54k162o96K896nk229P61K731j105k596J123K368k065j572K404K182l007
2637g39r97L342N60l079l9K879j1k810L20K785p93k407J225J658j33j548P1Q20
2655A104l68k01o31O39N81n22r66J46Q34p27j064M63J772q53j481P42J310k113
2673a335j308K404J466k880p69K889J045l566m21L551n73l400R64L751j392l226
2689b800J898K739j231j745J343J165j588p69J133Q27p33l8P96J36k88M21l43
$$ plain form
2706 923 144 133 639 779 499 1078 508 29 262 1449 851 -670 341 867 -339 -1032 346 1365
2724 1365 -1094 -1651 556 1333 -1144 -2129 -391 203 -1623 -1251 1088 604 -2212 -1877 830 36 -2315
2741 -2315 -1524 654 -189 -1539 -66 1634 -55 -2002 -561 1466 264 -1220 70 1787 34
2756 34 -889 1549 2466 312 -857 1184 2360 427 -1526 417 1857 537 -423 1730 2672 -436
2772 -436 -1767 551 2387 -313 -1556 271 1539 -1361 -1912 1289 1168 -2302 -2483 1468 1643 -2313
2788 -2313 -2829 690 181 -2898 -1713 2031 87 -3678 -1885 2602 778 -2811 -1025 1691 -202
2803 -202 -2128 685 2007 -844 -2165 1003 2498 256 -533 1345 977 -641 23 1744 1308 -274
2819 -274 279 1596 1269 1344 971 -158 -652 977 1324 251 146 746 23 -809 604 1649 -556 -1933
$$ packed form
2706I23p79j1N06J40k80N79n70m79K33J187n98j521J011N26j206o93J378J019
2724A365k459n57K207P77k477r85J738N94j826L72K339m84k816L35K707p94k351
2741b315P91K178q43j350J473J700j689j947J441K027j202j484J290J717j753
2756C4r23K438R17k154j169K041J176j933j953J943J440j320r60K153R42l108
2772d36j331K318J836k700j243J827J268k900n51L201j21l470j81L951J75l956
2788b313n16L519n09l079J185L744j944l765J793M487j824l589J786K716j893
2803b02j926K813J322k851j321L168J495k242p89J878l68j618O64J721m36j582
2819b74N53J317l27P5l73j129m94J629L47j073j05O00p23q32J413J045k205j377
$$ plain form
2837 -1933 -181 1040 -479 -1373 484 73 -2346 -1528 1344 340 -3132 -2285 365 411 -1357 -630 948
2854 948 -537 -1837 -339 1224 -233 -1865 -511 703 645 -34 650 666 169 -412 264 2122 1113
2871 1113 -1466 -481 1879 1918 367 250 1747 496 -1511 645 2889 382 -2517 167 3313 552
2887 552 -1556 800 1863 -1895 -2260 2202 2260 -2670 -2991 1465 1637 -2247 -1374 1723 -637 -3512 -884
2904 -884 2911 -451 -4161 -973 1513 -632 -2054 788 947 -2158 -2048 1651 1907 -1383 -1374 900 599
2921 599 -712 289 1479 205 -746 255 1919 1384 133 396 244 803 908 961 835 365 127 430
2939 430 1152 1324 -43 -717 45 878 631 82 -177 -292 -546 -230 679 95 -664 -773 -777 -775 -136 -315 -1263
2960 -1263 -1486 -595 -124 -483 -729 -433 -566 -1007 178 1043 -447 -1728 -645 812 -91 -600 988 1026
$$ packed form
2837a933J752J221j519q94J857m11k419Q18K872j004l472Q47K650M6j768P27J578
2854I48j485j300J498J563j457j632J354J214n8o79O84J6m97n81O76J858j009
2871A113k579R85K360L9j551j17J497j251k007K156K244k507k899K684L146k761
2887E52k108K356J063l758l65M462N8m930l21M456J72l884Q73L097k360k875K628
2904h84L795l362l710L188K486k145j422K842J59l105J10L699K56l290RK274l01
2921E99j311J001J190j274r51J001J664n35j251K63j52N59J05N3j26m70k38L03
2939D30P22J72j367o74P62Q33k47n49k59j15k54L16R09n84p59j09mKO39j79r48
2960a263k23Q91M71l59k46K96j33m41J185Q65j490j281J083J457r03n09J588L8
$$ plain form
2978 1026 -1372 -959 2114 1780 -748 -665 1635 1479 -262 551 2368 438 -1301 678 3036 539
2994 539 -1140 448 1499 287 -568 1026 1132 -1044 -1553 850 1412 -667 -1469 46 234 -840 -1015
3011 -1015 694 -512 -2039 -1385 445 269 -1286 -1288 -396 -450 -1209 -135 150 -956 -1503 -125 980 111
3029 111 -392 7 249 -490 303 1144 401 -695 -327 1145 663 278 900 898 426 196 1274 1496 349
3048 349 -104 585 1025 663 646 570 -102 197 492 917 -10 -554 -265 75 -114 -339 374 -98 -949 -919 -37
3069 -37 -387 -675 -777 -597 -823 -830 -744 -284 -624 -1333 -386 627 -303 -492 -339 462 -345 -791 194 825 -297
3090 -297 -962 804 1437 433 -510 814 1512 -3 -66 1145 1388 -232 -183 1563 1263 -113 -47 1297
3108 1297 489 -741 233 1051 221 -1162 -190 1173 181 -795 -491 383 -461 -1565 -369 354 -735 -2006
$$ packed form
2978A026k398M13L073l34k528Q3K300j56j741Q13J817j930j739J979K358k497
2994E39j679J588J051j212q55J594J06k176n09K403N62k079q02J515J88j074j75
3011a015J709j206j527O54J830j76j555kQ92n4p59J074K85j106n47J378J105q69
3029A11n03L99K42p39P93Q41p43j096L68J472m82l85O22km72k30J078K22j147
3048C49m53O89M40l62j7p6o72K99K95M25r27n44K89L40j89k25P13m72q51L0Q82
3069c7l50k88j02J80k26pQ6M60l40p09R47J013r30j89J53Q01q07m46R85O31j122
3090b97o65J766O33j004r43J324O98j515o3J211K43j620M9J746l00j376O6J344
3108A297q08j230R74Q18q30j383R72J363r92r76L04Q74q44j104J196P23j089j271
$$ plain form
3126 -2006 -376 225 -507 -1399 -746 -136 -583 -1155 -1001 -149 -304 -1068 -195 503 -57 -393 -294 110 33 -250
3146 -250 28 1013 605 149 384 585 336 166 445 873 402 318 696 1196 803 229 770 1030 768 -452
3166 -452 -166 942 415 -724 122 793 33 -948 -181 607 -322 -1451 -634 252 -476 -1152 -450 376 -857
3185 -857 -1277 -639 -90 -1534 -948 -199 -60 -1244 -841 519 -375 -777 -404 641 257 -357 -307 890 845
3204 845 -81 74 931 984 223 264 1048 1446 494 -150 747 1306 419 -459 781 1186 73 -271 887 1065
3224 1065 -198 -114 446 584 -905 -453 870 168 -1216 -282 674 -333 -1597 -166 829 -997 -1493
3241 -1493 -308 486 -1194 -1580 -46 498 -717 -1514 347 137 -797 -766 191 296 -319 -232 643 601 -32
3260 -32 171 18 822 690 54 798 1311 370 -28 581 1086 246 -513 538 1574 433 -262 698 1183
$$ packed form
3126b006J630O01p32q92O53O10m47n72J54Q52j55p64Q73O98n60l36R9M04p7k83
3146b50K78R85m08m56K35K01k49j70K79M28m71q4L78N00l93n74N41K60k62j220
3166d52K86J108n27j139Q46O71p60r81P67P88r29j129Q17Q86p28o76P02Q26j233
3185h57m20O38N49j444N86P49J39j184M03J360q94m02L73J045l84o14N0J197m5
3204H45r26J55Q57N3p61M1P84L98r52o44Q97N59q87q78J240M05j113l44J158J78
3224A065j263Q4N60J38j489M52J323p02j384R34R56j007j264J431R95j826m96
3241a493J185P94j680l86J534N44j215p97J861k10r34L1R57J05o15Q7Q75m2o33
3260c2K03j53Q04j32o36P44N13r41l98O09N05q40p59J051J036j141o95R60M85
$$ plain form
3279 1183 134 -650 89 1240 -756 -1386 347 650 -848 -848 995 1238 -1176 -1109 41 -352 -1584 -934
3297 -934 580 -267 -1156 -637 69 -734 -1162 -552 388 -630 -649 -43 245 -98 -187 122 137 190 76 78 311
3318 311 506 460 181 659 1143 505 230 550 915 139 -165 1025 1525 139 -281 1045 849 -405 -274
3337 -274 1033 510 -809 -293 988 266 -960 23 892 -1015 -1689 35 232 -1181 -1069 262 187 -1141
3355 -1141 -780 235 -595 -1556 -495 283 -658 -1308 -48 553 -601 -461 644 102 -743 -83 855 258
3373 258 83 666 742 109 358 1137 495 97 575 914 146 544 1092 389 -329 595 1217 156 -344 350
3393 350 649 -282 -282 805 265 -503 -435 274 -376 -998 -130 76 -1081 -883 420 30 -1186 -739 98 -723
3413 -723 -967 -329 -78 -1144 -712 -30 -339 -1012 -134 366 -660 -693 900 642 -831 -264 1222 469 -609
$$ packed form
3279A183j049p84P39J151j996o30J733L03j498%J843K43k414O7J150l93j232O50
3297i34J514q47q89N19P06q03m28O10R40j018j9O06K88l43q9L09J5N3j14KK33
3318C11J95m6k79M78M84o38k75L20L65p76l04J190N00j386m20J326j96j254J31
3337b74J307n23j319N16J281p22j226R83Q69j907o74J724J97j413J12J331p5j328
3355a141L61J015q30r61J061P78r41o50J260O01j154J40J105n42q45O60R38n97
3373B58j75N83P6o33K49P79o42l98M78L39p68L98N48p03p18R24O22j061n00O94
3393C50K99r31%J087n40p68O8P09o50o22Q68K06j157J98J303l90j216M47Q37q21
3413g23k44O38K51j066M32O82l09o73Q78N00j026l3J593k58j473N67J486p53j078
$$ plain form
3432 -609 593 1051 65 -873 1312 1750 -417 -352 1765 1294 -673 329 1877 501 -903 239 1505
3449 1505 329 -1010 258 1126 -944 -780 857 435 -1176 -1171 517 310 -1031 -370 7 -748 -1182 89
3467 89 134 -999 -854 46 -35 -788 -397 -128 -824 -1098 -353 167 -156 -385 19 114 466 512 536 197 19 -218
3489 -218 368 908 736 296 392 733 991 341 538 319 216 -81 431 992 201 -398 158 886 124 -342
3509 -342 497 72 -968 -835 578 558 -897 -1621 -51 -27 -1148 -745 241 -845 -1610 -540 1171 -307
3527 -307 -1816 -335 607 -773 -877 482 638 -1140 -1091 1184 1483 -654 -784 917 259 -387 387 1567
3545 1567 85 -1104 607 2080 691 -157 366 861 -126 -103 1474 1159 -850 -441 1612 924 -490
3562 -490 200 381 -327 -839 299 1067 -582 -1345 -222 879 -140 -754 -24 -336 -1175 -726 186 -32
$$ packed form
3432f09J202M58r86r38K185M38k167O5K117m71j967J002J548j376j404J142J266
3449A505j176j339J268Q68k070J64J637m22j611NJ688k07j341O61L77p55m34J271
3467H9M5j133J45R00q1p53L91K69o96k74P45N20l23k29M04R5L52M6K4l39j78k37
3489b18N86N40j72m40R6L41K58o50J97k19j03k97N12N61p91n99N56P28p62m66
3509c42Q39m25j040J33J413k0j455p24J570K4j121M03R86j086p65J070J711j478
3527c07j509J481R42j380j04J359J56j778M9K275K99k137j30J701o58o46P74J180
3545A567j482j189J711J473j389q48N23M95r87K3J577l15k009M09K053o88j414
3562d90O90J81p08n12J138P68j649p63J123J101j019o14P30l12q39M49R12k18
$$ plain form
3580 -32 -939 -1161 -340 -177 -487 -236 -244 -793 -718 -24 357 -120 -345 -444 42 477 -111 234 51 -107 -19 810
3602 810 1237 707 -133 125 752 491 491 811 165 -4 16 1253 828 -626 123 112 349 -203 518 372 -941
3623 -941 -852 686 670 -781 -1009 104 -112 -1449 -648 710 -379 -1930 -629 955 -299 -1498 -514
3640 -514 137 -1485 -1049 890 720 -1494 -1630 964 818 -906 -424 871 -99 -932 605 1819 25
3657 25 -1298 292 1566 685 -53 721 556 -254 198 1213 1195 52 -432 487 780 146 440 520 -119
3676 -119 -777 -156 956 641 -349 -887 282 40 -451 -138 233 -614 -1396 -398 586 -241 -1591 -1133 -29
3695 -29 -545 -904 -42 167 -1131 -982 612 884 -521 -868 295 196 -591 140 833 114 -782 342 1478
3714 1478 275 -21 229 430 250 316 1380 725 -221 13 1138 1327 111 483 371 -127 -131 610 446
$$ packed form
3580c2r07k22Q21J63l10K51qn49P5O94L81m77k25r9M86M35n88L45j83j58Q8Q29
3602H10M27n30q40K58O27k61%L20o46j69K0J237m25j454P49j1K37n52P21j46j313
3623i41Q9J538j6j451k28J113k16j337Q01J358j089j551J301J584j254j199R84
3640e14O51j622M36J939j70k214j36K594j46j724M82J295r70q33J537J214j794
3657B5j323J590J274q81p38P74j65q10M52J015j8j143m84R19K93o34K94Q0o39
3676a19o58O21J112l15r90n38J169k42m91L13L71q47p82R98R84q27j350M58J104
3695b9n16l59Q62K09j298J49J594K72j405l47J163r9p87P31O93p19q96J124J136
3714A478j203k96K50K01j80O6J064o55r46K34J125J89j216L72j12m98mP41j64
$$ plain form
3733 446 -283 -535 -187 302 -164 -62 13 -484 -401 -224 -150 -225 -819 -522 -440 -463 -276 -291 -333 -692 -636 101 208
3756 208 -609 -647 115 -245 -325 -159 416 88 -828 230 806 184 -167 -58 492 629 -22 880 1080 191
3776 191 -286 644 1194 13 -257 749 550 117 193 630 473 -573 -62 629 156 -1158 -247 169 -153
3795 -153 -604 208 667 -448 -1061 -387 139 -453 -986 -625 26 -468 -749 -179 -31 -810 -757 -161 -115 -507
3815 -507 -236 168 244 -352 186 513 239 -143 286 459 174 344 500 631 171 354 585 566 481 126 342
3836 342 651 217 196 448 519 16 83 288 479 95 -193 317 360 -278 -382 -52 153 -511 -417 -162 -397 -1001
3858 -1001 -403 -50 -485 -458 -443 -398 -384 -750 -107 -285 -401 -207 -419 173 -212 -62 -88 71 82 264 186 201
3880 201 353 512 309 486 267 371 487 339 403 531 181 400 295 476 410 468 881 161 -126 882 419
$$ packed form
3733D46p29k52L48M89m66J02P5m97Q3J77P4p5n94K97Q2k3J87j5m2l59N6P37J07
3756B08q17l8P62l60q0J66N75l28r16J058N76o22l51J09N50J37o51R02K00q89
3776A91m77R30N50j181k70J006j99m33P6M37j57j046N11O91m73j314R11M16l22
3795a53m51Q12M59j115o13O74N26n92n33L61O51m94k81N70J48p79N3N96M6l92
3815e07K71M04P6n96N38L27k74l82M29J73k85J70J56J31m60J83K31j9q5l55K16
3836C42L09m34k1K52P1n03O7K05J91l84k88N10M3o38j04L30K05o64R4K55k35o04
3858a001N98L53m35K7J5M5J4l66O43j78j16J94k12N92l85J50k6J59J1J82p8J5
3880B01J52J59k03J77k19J04J16j48O4J28l50K19j05J81o6N8M13p20k87J008m63
$$ plain form
3901 419 15 -295 -114 259 -29 46 -498 -304 -260 -237 -396 -469 -305 -563 -437 -347 -564 -412 -403 -577 -797 -218
3923 -218 -238 -315 -280 -496 -2 -51 -351 -407 -31 137 -115 84 418 111 132 77 300 299 300 181 550 132 246 587
3947 587 643 354 298 289 608 320 261 365 176 -75 22 542 108 -327 129 17 -164 -526 -99 -72 -417 -402 -381
3970 -381 -154 -488 -713 -306 -642 -792 -556 -358 -476 -551 -539 -220 -587 -453 -40 -177 -404 -351 82 245 72
3991 72 225 500 419 672 310 424 214 580 615 315 576 737 280 223 751 605 187 90 635 623 325 140
4013 140 624 87 -27 -49 287 -216 -365 -103 32 -440 -196 -20 -140 -618 -421 -303 -349 -566 -498 -460 -511 -714
4035 -714 -135 -127 -649 -290 -37 -405 -148 50 175 -115 -323 316 74 -15 266 636 44 150 477 637 66
4056 66 105 758 360 135 403 350 446 135 264 592 349 70 373 387 32 -346 193 138 -461 -114 235 -123
$$ packed form
3901D19m04l10J81L73k88P5n44J94M4K3j59p3J64k58J26R0k17J52Rj74k20N79
3923b18k0p7L5k16M94m9l00n6L76J68k52J99L34l07K1n5K23jJj19L69m18J14L41
3947E87N6k89n6rL19k88n9J04j89k51R7N20m34m35M56j12j81l62M27K7l45J5K1
3970c81K27l34k25M07l36j50K36J98j18p5J2L19l67J34M13j37k27N3M33J63j73
3991G2J53K75q1K53l62J14k10L66L5l00K61J61m57n7N28j46m18r7N45j2k98j85
4013A40M84n37j14k2L36n03j49K62J35m72K44J76j20m78J97J18m6k17O8L8n1k03
4035g14N79Qn22L59K53l68K57J98J25k90k08O39k42q9K81L70n92J06L27J60n71
4056F6L9O53l98k25K68n3R6l11J29L28k43k79L03J4l55l78N39n5n99L47L49l58
$$ plain form
4078 -123 -683 -358 -121 -186 -325 -70 -142 -250 -425 -296 -269 -550 -490 -336 132 -393 -569 -30 -48 -291 -398 45
4100 45 424 28 -336 151 348 59 123 539 86 105 316 730 308 175 213 825 745 112 288 575 213 13
4122 13 292 942 -17 -462 370 87 148 -364 311 88 -388 -369 -193 -72 -654 -927 -475 -287 -238 -360 135
4143 135 -240 -647 -352 -30 -49 -967 -658 134 -459 -432 -71 180 -261 -505 366 674 -486 -455 408 276 -447
4164 -447 226 757 474 -484 189 1034 447 -47 276 728 169 495 756 560 -165 -34 588 727 123 245
4184 245 316 -195 -250 343 111 -300 -718 -411 125 -454 24 -473 -438 -719 -575 -138 -303 -685 -500 -398 -424
4205 -424 -169 -620 -143 -547 -256 9 425 108 -952 140 62 46 2 387 615 -167 94 976 929 145 81
4226 81 383 571 117 436 956 283 -588 340 921 478 -635 91 253 17 -85 858 771 -679 -847 202
$$ packed form
4078a23n60L25K37o5j39K55p2j08j75J29K7k81O0J54M68n25j76N39j8k43j07M43
4100D5L79l96l64M87J97k89O4M16m53J9K11M14m22j33L8O12q0o33J76K87l62k00
4122A3K79O50r59m45Q32k83O1n12O75k23m76J9J76J21n82k73M52J88M9j22M95
4143A35l75m07K95L22j9r18L09P92n93K7L61K51m41k44Q71L08j160L1Q63j32p23
4164d47O73N31k83r58O73Q45n87m94L23M52n59L26K61j96p25J31O22J39o04J22
4184B45P1n11n5N93k32m11m18L07N36n79M78m97L5k81J44M37j65l82J85J02k6
4205d24K55m51M77m04K91K65M16l17j060J092p8j6m4L85K28p82K61Q82m7p84o4
4226H1L02J88m54L19N20o73q71R28N81m43j113P26J62k36j02R43q7j450j68J049
$$ plain form
4246 202 506 -558 -522 -64 -80 -926 -323 1052 -701 -1074 -553 418 -334 -808 -276 430 -846 -610 293
4265 293 418 -614 -997 51 644 127 -199 804 161 -710 175 1003 457 -536 -84 466 595 266 593
4284 593 616 -132 -223 629 967 217 -429 267 844 57 -115 432 335 -667 -122 849 609 -627 -631 -136 -147
4305 -147 -610 -185 190 -979 -1103 -202 264 -96 -1096 -206 -597 -601 -122 72 -349 -957 -679 866 400 -332
4325 -332 -165 -77 -265 -192 511 631 -322 -719 446 961 296 138 409 -33 -140 567 1177 483 -123 139
4345 139 811 394 67 205 498 -251 -199 305 792 -346 -651 161 316 -409 -563 40 -244 -966 -91 653
4365 653 -176 -699 -788 -166 -153 -873 -188 328 -779 -859 94 568 -412 -624 -237 402 -273 -76 496 336 -565
4386 -565 -76 1030 933 -224 -64 955 284 -8 546 699 64 -379 491 1178 657 -248 457 558 -66
$$ packed form
4246B02L04j064L6M58j6q46O03J375j753l73N21R71p52m74N32P06j276K36R03
4265B93J25j032l83J048N93n17l26J003o43q71Q85Q28n46r93M52N50J29l29L27
4284E93K3p48r1Q52L38p50o46O96N77p87j72N47r7j002N45R71k40j236mM95j1
4305a47m63M25L75j169j24R01M66l60j000Q90l91mM79J94m21o08K78J545m66p32
4325c32J67Q8j88P3P03J20r53l97J165N15o65j58K71m42j07P07O10o94o06K62
4345A39O72m17l27J38K93p49N2N04M87j138l05Q12J55p25j54O03k84p22Q75P44
4365F53q29n23q9O22J3p20O85N16j107q0R53M74r80k12L87O39o75J97N72j60r01
4386e65M89J106r7j157J60J019o71k92N54J53o35m43Q70O87n21r05P05J01o24
$$ plain form
4405 -66 54 750 289 -451 -611 373 61 -261 -456 332 -328 -436 363 518 -722 -645 -428 -192 -209 -493 -436
4426 -436 -436 -860 -416 -21 108 -728 -1063 126 230 -125 -237 -50 -30 -353 328 543 290 -174 18 470 97
4447 97 -169 655 420 27 257 744 519 -63 13 640 599 27 397 775 103 -479 245 374 64 -94 50
4468 50 426 118 -7 -39 -111 -724 -541 184 -7 -243 -574 150 4 -406 -378 -116 -387 -847 -80 -174 67 -386
4490 -386 -286 104 -252 -337 299 386 -305 -560 131 514 73 242 347 328 59 233 739 235 68 179 707
4511 707 420 -90 686 313 64 -408 668 624 -148 -323 304 295 -280 -213 140 -94 -288 33 145 -90 -260
4532 -260 -259 53 -515 -561 -38 -243 -814 -236 -85 -266 -457 -554 -233 -277 -410 6 -131 -1 -321 43 -24 20
4554 20 28 -27 365 -144 153 374 11 242 376 428 705 95 107 778 530 242 315 466 364 459 60 437 245
$$ packed form
4405f6J20O96m61p40j60R84l12l22j95P88o60j08P99J55j240P7K17K36j7k84N7
4426d36%m24M44L95J29q36l35J189J04l55j12J87K0l23O81K15k53m64J92M52l73
4447I7k66Q24k35l93K30M87k25n82P6O27m1n72L70L78o72n82P24J29l10j58J44
4468E0L76l08j25l2p2o13J83P25j91k36l31P24j46m10K8K62k71m60P67r4K41m53
4490c86J00L90l56q5O36Q7o91k55O91L83m41J69J05j9k69J74N06n04j67J11N28
4511G07k87n10P76l73k49m72J076m4p72j75O27rn75O7L53k34j94L21J12k35j70
4532b60JL12n68m6N23k05n71N78J51j81j91r7L21m4j33M16j37J30l20L64o7M4
4554B0Qn5L92n09K97K21l63K31J34N2K77o10J2O71k48k88P3J51j02R5l99L77j92
$$ plain form
4577 245 -24 162 285 -158 156 -110 5 88 -283 -186 103 -240 -278 -198 -180 -367 -314 126 109 -275 -520 -151
4599 -151 -81 -322 -467 -239 -170 -396 -34 62 -78 -163 -65 300 203 -74 335 151 196 57 275 397 5 229
4621 229 392 110 231 63 302 160 253 280 452 368 315 -35 57 127 -126 -33 -216 37 -246 -46 -247 158
4643 158 -234 -249 -433 -232 -98 -608 -65 -156 -101 -336 -616 -187 -172 -412 -580 64 -135 -210 -8 61 99 2 37
4666 37 243 -303 -177 -31 522 193 97 356 194 583 383 231 410 146 202 163 200 218 -111 468 333 140
4688 140 -65 179 43 233 -97 -349 6 -284 -479 -51 -35 -370 -248 -7 -148 -373 -626 -59 -114 -400 -384
4709 -384 -138 -364 -542 -107 -34 87 -306 -179 -85 2 -153 -182 100 91 -316 -120 407 283 203 318 335 387 62
4732 62 418 474 285 348 293 482 316 410 172 435 24 191 226 114 -62 -70 91 164 -262 -390 -36 122 -271
$$ packed form
4577B45k69J86J23m43L14k66J15Q3l71R7K89l43l8Q0J8j87N3M40j7l84k45L69
4599a51P0k41j45K28O9k26L62R6j40q5R8L65r7k77M09j84M5j39K18J22l92K24
4621B29J63k82J21j68K39j42R3K7J72q4n3l50R2P0k53R3j83K53k83K00k01M05
4643A58l92j5j84K01J34n10N43r1N5k35k80M29J5k40j68O44j99p5K02O9L8r7L5
4666C7K06n46J26J46N53l29r6K59j62L89k00j52J79k64N6l9L7J8l29N79j35j93
4688A40k05K44j36J90l30k52L55k90j95M28J6l35J22K41j41k25k53N67n5k86J6
4709c84K46k26j78M35P3J21l93J27R4Q7j55k9K82rm07J96N27j24q0J15J7N2l25
4732F2L56N6j89O3n5J89j66R4k38K63m11J67L5j12j76qJ61P3m26j28L54J58l93
$$ plain form
4755 -271 -492 -367 -145 -234 -125 -67 -184 -173 -516 -356 -149 -370 -490 -256 -195 -53 -231 -164 -215 -95 -165 -56
4777 -56 -134 156 70 2 73 332 93 265 438 314 74 311 427 453 238 328 349 80 399 137 605 305 -31
4800 -31 43 531 19 88 -36 106 -209 -137 -82 -125 -224 -273 -47 -545 -243 -276 -141 -376 -508 -398 47 -95 -606
4823 -606 -273 -288 -28 69 -228 40 -120 -290 -332 210 106 -126 -82 188 215 397 449 410 199 111 250 274 5
4846 5 91 387 130 101 509 609 449 -409 376 407 391 -99 58 113 16 186 189 -154 -531 7 82 -181 -521 -491
4870 -491 -158 -384 -386 -202 -112 -304 -844 -286 132 -396 -255 -504 -259 2 120 -192 -90 -247 -155 -78 355 -121
4892 -121 -10 219 171 -417 58 588 213 -115 311 300 427 271 311 525 279 74 633 555 28 -3 528 323
4914 323 -15 29 295 196 -103 -254 506 -182 -772 -373 66 -343 -179 -16 180 -763 -765 -56 -67 -604 -430 -56
$$ packed form
4755b71k21J25K22q9J09N8j17J1l43J60K07k21j20K34O1J42j78O7n1J20p0J09
4777e6p8K90q6o8P1K59k39J72J73j24k40K37J16K6k15R0K1k69L19k62M68l00l36
4800c1P4M88n12O9j24J42l15P2N5m3r9m9K26m98L02l3J35k35j32J10M45j42n11
4823f06L33j5K60R7k97K68j60j70m2N42j04k32M4K70K7J82N2l9k11q8J39K4k69
4846EQ6K96k57k9M08J00j60q58P85L1j6m90J57N5r7J70Ll43l77N38P5k63l40L0
4870d91L33k26kJ84R0j92n40N58M18n28J41k49K45K61J18l12J02j57R2P7M33m76
4892a21J11K29m8n88M75N30l75l28M26j1J27j56M0K14k46k05N59p8n27l1N31k05
4914C23l38M4K66r9k99j51P60o88n90L99M39m09J64J63J96r43kP09j1n37J74L74
$$ plain form
4936 -56 -505 -392 -62 183 -317 -632 -300 521 45 -244 -92 60 -354 -268 259 469 112 -168 231 707 146
4957 146 165 313 145 75 166 823 515 -41 -39 344 374 42 266 403 -224 -243 341 673 -157 -445 193 84
4979 84 -376 -108 75 -233 -738 -436 506 -167 -384 -641 59 -421 -523 -38 -266 -693 -656 15 196 -495 -521
5000 -521 266 340 -262 80 291 83 -570 327 453 660 -141 -90 291 276 -53 888 1136 150 -170 247 819
5021 819 89 -90 476 205 -296 -74 810 267 -638 -517 483 365 14 -187 151 -234 -815 37 497 -386
5041 -386 -686 -435 116 -386 -729 134 57 -625 -814 49 298 -419 -694 53 327 -543 56 388 -145 -332
5061 -332 -34 612 316 -282 -160 673 32 157 528 570 -187 -69 666 491 142 -92 372 103 131 244 454
5082 454 70 -148 107 252 244 -182 -69 -87 -153 -166 466 -306 -475 -302 88 213 -98 -346 73 -421 -506 76
$$ packed form
4936e6m49J13L30K45n00l15L32Q21m76k89J52J52m14Q6N27K10l57k80L99M76n61
4957A46J9J48j68p0R1O57l08n56KL83L0l32K24J37o27j9N84L32q30k88O38j09
4979H4m60K68J83l08n05L02R42o73k17k57P00m80j02M85k28m27L7O71J81o91k6
5000e21P87P4o02L42K11k08o53Q97J26K07q01N1L81j5l29R41K48r86l20M17N72
5021H19p30j79N66k71n01K22Q84n43r05J21J000j18l51k01L38l85n81Q52M60q83
5041c86l00K51N51n02l43Q63p7o82j89Q63K49p17k75P47K74q70N99L32n33j87
5061c32K98O46k96n98J22Q33o41J25L71M2p57J18P35j75l49k34M64k69K8J13K10
5082D54l84k18K55J45qm26J13j8o6j3O32p72j69J73L90J25l11k48M19m94q5N82
$$ plain form
5104 76 -76 -152 -502 -60 211 -73 178 49 -15 -195 -197 480 356 -117 -308 151 208 168 -26 380 213 -158
5126 -158 346 986 214 -221 128 792 347 161 381 267 -43 -92 532 421 -323 -496 423 391 -175 -210 427
5147 427 -117 -687 -133 360 74 -821 -609 91 -94 -651 -7 329 -661 -820 3 160 -143 -688 -230 -67
5167 -67 -27 -170 226 -139 -574 -139 656 153 -173 39 321 340 -257 244 610 45 -172 168 383 181 570
5188 570 130 466 221 93 235 357 -131 -42 119 416 184 120 196 64 -44 -236 7 -138 -220 -129 32 -260
5210 -260 -164 18 -299 -184 -111 -260 -284 51 -506 -119 10 -375 60 -21 -239 -10 174 5 33 -29 382 72
5232 72 128 71 -76 413 27 170 489 356 -28 47 275 455 167 413 292 213 48 20 109 -52 163 245 95
5255 95 -210 -21 412 159 -31 278 51 -488 -377 -19 -192 -116 -396 -229 222 -396 -472 -211 120 -149 -271
$$ packed form
5104G6j52p6l50M42K71k84K51j29o4j80kO77j24m73j91M59N7m0j94M06j67l71
5126a58N04O40p72m35L49O64m45j86K20j14l10m9O24j11p44j73R19l2n66l5O37
5147D27n44n70N54M93k86q95K12P00j85n57O44L36r90j59Q23J57l03n45M58J63
5167f7M0j43L96l65m35M35P95n03l26K12K82J9n97N01L66n65k17L40K15k02L89
5188E70m40L36k45j28J42J22m88Q9J61K97k32o4P6j32j08j92K43j45q2R1J61k92
5210b60R6J82l17J15P3j49k4L35n57L87J29l85M35q1k18K29J84j69K8o2M11l10
5232G2N6n7j47M89l86J43L19j33l84P5K28J80k88K46j21p9j65k8Q9j61K15Q2j50
5255I5l05J89M33k53j90L09k27n39J11L58j73P6k80J67M51o18p6K61L31k69j22
$$ plain form
5276 -271 -294 29 -389 -329 168 -30 -500 -34 -15 182 46 122 -154 -165 -24 372 380 43 80 348 570 93 22
5299 22 212 247 36 342 438 56 108 151 151 447 260 156 -97 -243 -215 15 -166 -342 -442 -178 -75 -2 -33
5322 -33 -277 -70 -234 -285 -234 -81 -546 -222 -52 -116 -409 -52 -169 -147 -205 17 67 -19 231 -56 55 190 37
5345 37 335 197 14 488 470 607 278 77 354 302 168 177 183 431 336 221 142 29 120 -19 34 -201 188 227
5369 227 121 -200 -108 -336 -162 -238 -449 -112 -163 -502 -255 18 -352 -154 -91 -45 -80 -15 -428 -340 -256 -144 49
5392 49 -230 105 161 -240 10 -2 134 182 -118 84 109 98 421 323 288 -6 134 506 425 299 149 177 33
5415 33 332 452 185 213 -211 43 116 134 116 -56 158 -35 -108 -140 -124 -213 -293 -295 -75 -179 -314 -77 -200 -346
5439 -346 -147 -348 -428 -90 -139 -125 -321 -63 -119 202 -78 -56 -130 4 -22 -255 -347 -67 276 -167 103 296 218
$$ packed form
5276b71k3L23m18O0M97j98m70M66J9J97j36P6k76j1J41L96Ql37L7K68K22m77p1
5299B2J90L5k11L06R6l82N2M3%K96j87j04k53j46K8K30j81j76j00K64J03P3l1
5322c3k44K07j64n1N1J53m65L24J70o4k93L57j17K2n8K22N0q6K50k87J11J35j53
5345C7K98j38j83M74j8J37l29k01K77n2j34ROK48r5j15p9j13R1j39N3k35L89L9
5369B27j06l21R2k28J74p6k11L37n1l39K47K73l70J98O3M6l5O5m13Q8Q4J12J93
5392D9k79L35N6m01K50j2J36M8l00K02K5j1L23r8l5k94J40L72q1j26j50K8j44
5415C3K99J20k67K8m24K54P3J8j8j72K14j93p3l2J6q9q0kK20j04j35K37j23j46
5439c46J99k01q0L38m9J4j96K58n6L21k80K2p4J34k6k33r2K80L43m43K70J93p8
$$ plain form
5462 218 55 -45 558 315 2 208 541 168 -11 84 390 69 40 106 255 153 -136 -59 130 -339 -123
5483 -123 -9 195 1 -293 -77 -309 -255 -56 -204 -96 -413 -370 -119 -290 -455 -338 -162 -173 -381 -156 284
5504 284 -70 -101 -63 -193 -262 -513 -129 153 -69 60 79 127 84 355 83 158 362 -63 -3 432 382 313 527
5527 527 295 -277 55 117 80 -85 17 238 101 -10 98 -265 -75 116 -94 -134 -165 17 58 -167 -77 46
5549 46 -306 -103 -114 -134 345 -17 -595 -215 -710 -383 89 -101 167 -274 60 273 -35 191 18 296 -148
5570 -148 -309 60 341 -32 -195 585 317 7 145 312 120 202 15 823 256 50 118 232 167 -338 136
5591 136 156 -275 -182 48 306 -625 -258 41 204 -161 12 82 -202 -493 -424 174 29 -402 -586 -50 -38 -503
5613 -503 97 25 -240 -274 -97 317 -41 -345 -261 56 12 -93 386 103 -47 -163 487 445 -10 -1 235 232 -137
$$ packed form
5462B18j63j00O03k43l13K06L33l73j79R5L06l21k9O6J49j02k89P7J89m69K16
5483a23J14K04j94k94K16k32N4J99j48J08l17M3K51j71j65J17J76j1k08K25M40
5504B84l54l1L8j30o9k51L84K82k22J29J9M8m3K71k72P5K04m25O0M35n0o9K14
5527E27k32n72L32O2l7j65J02K21j37j11J08l63J90J91k10m0l1J82M1k25R0J23
5549D6l52K03j1k0M79l62n78L80m95L27M72j90K68m41L34K13l08K26j73K78m44
5570a48j61L69K81l73j63P80k68l10J38J67j92Q2j87Q08n67k06O8J14o5n05M74
5591A36K0m31R3K30K58r31L67K99J63l65J73P0k84k91O9N98j45m31j84N36J2m65
5613e03O00p2k65l4J77M14l58l04Q4L17m4j05M79k83j50j16O50m2m55RK36ll69
$$ plain form
5636 -137 0 473 -15 -33 432 278 298 109 166 -47 333 -154 333 214 79 -308 45 -24 -96 -132 -103 140
5658 140 -215 -19 251 -146 -753 -130 255 -272 -494 -61 -382 -579 -237 113 126 -354 -383 5 -15 -305 171
5679 171 13 49 -350 242 429 233 -334 327 317 136 209 569 488 -132 -33 433 303 59 261 468 -107 -158
5701 -158 268 337 -132 -201 456 608 245 -628 49 -115 -80 -369 267 67 -471 -365 -178 110 -270 -495 301
5722 301 -75 -437 49 134 -86 -316 -357 9 -81 -155 -89 -163 -282 -157 349 26 -170 -11 406 261 144 46
5744 46 113 23 -371 266 406 284 -234 -52 596 105 39 500 129 -534 -136 182 437 6 -359 104 124 -239
5766 -239 -318 80 -196 -406 -354 226 -408 -558 -159 201 -418 -544 77 -252 -291 -512 -42 173 -467 -541 -100
5787 -100 -75 -367 -174 164 511 -472 188 325 98 -14 188 232 61 -24 233 390 202 -164 186 379 153
$$ packed form
5636a37J37M73m88j8M65j54K0j89N7k13L80m87M87j19j35l87L53o9p2l6K9K43
5658A40l55J96K70l97o07O23L85n27k22M33l21j97L42L50J3m80k9L88k0k90M76
5679A71j58L6l99N92J87j96n67O61j0j81P3L60q1o20R9M66j30k44K02K07n75n1
5701a58M26O9m69o9O57J52l63q73O77j64L5k89O36k00n38J06J87K88l80k25P96
5722C01l76l62M86Q5k20k30m1L66r0p4O6p4j19J25N06l23j96J59M17j45j17r8
5744D6O7r0l94O37J40j22n18J82O48m91o6M61l71o63L98L18K55m31l65M63K0l63
5766b39p9L98k76k10N2N80o34j50L99L60o19j26O21l29l9k21M70K15o40p4M41
5787a00K5k92J93L38L47r83O60J37k27j12K02M4j71q5K57J57j88l66L50J93k26
$$ plain form
5808 153 -4 274 304 -270 236 446 330 -6 -158 192 312 155 178 71 -92 75 97 55 -53 -253 -300 140
5830 140 -142 -136 114 -451 -561 -352 86 -6 -350 -422 10 -99 -96 22 -163 -306 -322 25 422 45 -52 118 203
5853 203 -209 282 357 142 74 -378 463 215 -105 303 181 115 121 199 132 165 -42 436 526 105 -212 -85 312
5876 312 -175 20 129 -151 -579 -244 229 49 127 -223 -103 -407 -268 -176 12 -167 -340 189 -161 51 -156
5897 -156 -47 -196 -416 -271 180 126 4 -93 128 65 138 79 16 -43 -7 101 268 272 50 -7 188 21 -100 197
5921 197 456 -210 103 395 648 -39 -268 375 -107 84 356 343 -380 -345 -159 197 88 -116 -39 -119 -317
5942 -317 -270 -156 -178 -335 -521 -225 -80 -189 -293 63 131 -465 -115 -187 -71 -285 4 -6 246 -117 -216 258
5964 258 20 14 127 180 287 256 208 619 12 210 314 239 203 109 117 296 76 244 188 -1 287 366 196 -10
$$ packed form
5808A53j57K78L0n74N06K10j16l36j52L50J20j57K3j07j63J67K2m2j08k00m7M40
5830A40k82OK50n65j10K09M38r2l44p2M32j09LJ18j85j43j6L47L97l77r7J70Q5
5853B03m12M91P5k15o8m52Q41k48l20M08j22o6OP8o7L3k07M78R0m21l17J27L97
5876C12m87J95J09k80m28L35M73j80P8l50J20l04J39R2J88j79j73N29l50K12k07
5897a56J09j49k20J45M51n4j22r7K21o3P3n9o3n9L6J08J67Mk22n7J95j67j21K97
5921A97K59o66L13K92K53o87k29O43m82J91K72j3p23L5J86L56j09k04P7q0j98
5942c17M7J14k2j57j86K96J45j09j04L56O8n96L50p2J16k14K89j0K52l63r9M74
5964B58k38oJ13N3J07l1m8M11o07J98J04p5l6r4QJ79k20J68n6j89K88P9j70k06
$$ plain form
5988 -10 -43 -83 -180 -201 -82 -174 171 -265 -117 -225 -462 -375 -64 -13 -373 -145 -130 -138 -125 -428 -243 -132 -346 -48
6012 -48 -77 -40 207 -279 330 -168 261 -161 -252 65 76 -126 -128 128 59 291 97 77 58 89 57 294 49 105
6036 105 342 307 138 146 244 -259 189 -109 -149 -250 -103 -38 -174 88 31 -407 -398 -261 -224 -226 -263 -16 -438 -145
6060 -145 -467 -202 -158 -158 -102 -303 -84 160 25 -85 -96 -81 17 -116 -58 -53 103 97 738 319 -36 -138 118 -93
6084 -93 143 442 305 74 303 157 184 67 40 395 -129 -139 101 223 180 -226 53 -104 -148 70 -17 304
6106 304 -127 105 25 -154 -233 -69 112 -236 -72 -36 -119 -127 -228 -33 37 -252 -232 275 -99 -16 -333 -147 -179
6129 -179 -53 258 46 284 -151 111 228 181 -89 212 84 -62 313 84 74 -354 -55 375 264 232 -40
6150 -40 142 -34 -34 47 -76 180 28 -52 -25 -25 -129 114 -303 65 -138 139 -257 -93 -194 -1 -28 -83 -104 -392
$$ packed form
5988a0l3m0r7k1J19r2L45m36J48j08k37Q7L11N1l60K28J5qJ3l03J85J11k14K98
6012d8k9L7K47m86O09m98M29m22r1L17J1k02kK56o9K32j94k0j9L1l2K37k45N6
6036A05K37l5j69QR8n03M48k98m0j01J47O5j36K62n7m38RJ37L7kl7K47m22K93
6060a45l22K65M4%N6k01K19K44j35j10j1J5R8j33N8NJ56oO41m19l55j02K56k11
6084i3K36K99j37k31K29j46K7j17k7L55n24j0K40J22m3m06K79j57m4K18q7L21
6106C04m31K32q0j79p9J64J81l48J64L6q3qj01J95P0k89K0N07l74Q3l17J86l2
6129a79J26L11k12K38m35K62J17m7k70L01j28j46L75k29j0m28K99M30j11l2k72
6150d0J82j76%Q1j23K56j52q0K7%j04K43m17L68k03K77l96J64j01J93k7n5k1k88
$$ plain form
6174 -392 -109 -134 -241 -13 -10 -290 -92 165 -94 105 -99 313 119 49 1 35 154 -77 329 45 114 78 115
6197 115 216 -34 138 211 -70 127 199 39 208 225 58 212 91 -273 265 55 31 66 16 143 -78 218
6219 218 78 12 -113 -341 -276 -59 -70 -175 -147 -244 -278 -287 -140 1 -132 -7 24 -146 -158 155 105 -67 -275 -121
6243 -121 64 -23 -34 97 235 25 363 216 309 -104 280 325 256 134 281 253 6 -14 377 237 -39 187
6265 187 90 -243 -161 114 426 -221 -164 -21 -188 59 -356 -106 -21 -328 -282 110 -53 -261 -152 68 56 -188
6287 -188 -159 139 -31 -67 22 229 53 -292 -281 -256 88 -72 198 310 358 47 -184 390 275 -28 219 282
6309 282 246 76 509 163 -316 48 329 301 -263 244 72 211 136 20 -48 -179 -62 173 -192 -109 -25 26
6331 26 126 -587 -111 -46 -69 -835 -89 199 -209 -87 9 -25 -442 -327 -243 194 -267 -161 8 72 -276 -228 -48
$$ packed form
6174c92K83k5j07K28Lk80J98K57k59J99k04M12j94p0m8L4J19k31M06k84O9l6L7
6197A15J01k50J72P3k81J97P2j60J69J7j67J54j21l64N38k10k4L5n0J27k21K96
6219B18j40o6j25k28O5K17j1j05K8r7l4rJ47J41j33J25L1j70j2L13n0j72k08J54
6243a21J85q7j1J31J38k10L38j47R3m13L84M5o9j22J47k8k47k0L91j40k76K26
6265A87r7l33Q2K75L12o47N7J43j67K47m15K50Q5l07M6L92j63k08J09K20j2k44
6287a88K9K98j70l6Q9K07j76l45J1K5L44j60K70J12M8l11k31N74j15l03K47O3
6309B82l6j70M33l46m79L64K81k8n64N07j72J39p5j16o8j31J17K35l65Q3Q4N1
6331B6J00p13M76O5k3p66P46K88m08J22R6l4m17J15Q4M37m61J06J69O4l48M8J80
$$ plain form
6354 -48 82 -256 81 94 317 179 -32 126 -17 194 207 448 208 -71 233 561 -33 336 -171 391 174
6375 174 -161 231 167 -190 -527 359 387 19 -190 -84 -93 -235 -213 -130 54 -233 -312 -81 -179 -377 -14 3 -299
6398 -299 -358 77 113 -425 -167 193 -89 -104 -43 -85 66 -82 -7 187 311 -286 -96 457 217 -40 326 137
6420 137 350 6 300 411 229 -36 -228 107 -14 272 161 11 -58 400 218 75 -281 16 89 88 -225
6441 -225 129 121 -120 22 273 345 -328 -409 -336 -148 -278 -279 -253 -318 -305 -8 143 17 -410 -450 -194 -191 -316 220
6465 220 210 -211 -310 389 457 253 -136 41 -247 -186 -82 428 475 -315 -26 325 331 -189 -258 614 263 40 -12
6488 -12 390 -27 -340 92 208 -84 10 121 81 -307 -348 217 40 -338 -348 209 -46 143 -130 -151 -310 -438
6510 -438 144 235 -138 -24 -54 249 -127 -86 33 1 -52 42 -98 235 -78 74 154 270 -136 132 81 -48 -10
$$ packed form
6354d8J30l38L37J3K23j38k11J58j43K11J3K41k40k79L04L28n94L69n07N62k17
6375A74l35L92o4l57l37Q86K8l68k09J06rj42K2Q3J84k87p9K31r8j98L63J7l02
6398b99n9M35L6n38K58L60k82j5O1m2J51j48P5J94J24n97J90N53k40k57L66j89
6420A37K13l44K94J11j82k65j92L35j21K86j11j50o9M58j82j43l56K97P3jl13
6441b25L54qk41J42K51P2o73q1P3J88j30jK6o5J3K97J51j26m27m0K56Lj25N36
6465B20j0m21r9O99O8k04l89J77k88O1J04N10M7p90K89L51On20o9Q72l51k23n2
6488a2M02m17l13M32J16k92R4J11m0l88m1N65j77l78j0N57k55J89k73k1j59j28
6510d38N82R1l73J14l0L03l76M1J19l2n3R4j40L33l13J52Q0J16m06K68n1j29L8
$$ plain form
6533 -10 286 136 125 135 -45 191 -190 -39 35 375 -429 -57 283 215 -332 -193 133 138 74 -74 148 102 -322
6556 -322 -35 -5 -317 -178 -519 -288 -465 -36 88 -71 -493 -30 123 77 52 -115 -137 -134 -134 137 73 -222 -323
6579 -323 -4 24 -142 179 -95 -75 -315 169 206 50 -89 36 193 480 155 275 108 197 20 186 477
6600 477 152 -188 440 270 2 -30 50 408 3 139 178 -296 -235 -72 -112 -70 -491 -181 -99 -169 -191 -164 26
6623 26 -300 -349 -146 32 29 -66 -102 86 -269 -270 -22 215 -133 -173 -34 200 25 172 243 -23 -74 161 85 285
6647 285 -169 1 139 326 -67 258 378 192 66 74 -143 -41 261 28 -92 -293 -96 284 -247 -314 35
6668 35 -89 -108 -282 47 -105 136 -10 -87 -362 -198 -198 -268 -131 -66 -158 -139 -396 -115 -190 185 211 -123 -189 -42
6692 -42 -127 -30 -40 -73 233 -101 -105 -156 245 108 -66 207 7 269 159 274 141 60 142 163 230 349 214 12
$$ packed form
6533a0K96j50j1J0j80K36l81J51P4L40q04L72L40o8n47J39L26No4j48K22m6m24
6556c22K87L0l12J39l41K31j77M29J24j59m22M63J53m6k5j67k2L%K71o4k95j01
6579c23L19K8j66L21k74K0k40M84L7j56j39J25J57K87l25J20j67Q9j77J66K91
6600D77l25l40O28j70k68l2Q0L58m05J36L9m74O1J63m0M2m21L10Q2p0k2K7J90
6623B6l26m9K03J78lr5l6J88l55jK48K37l48m0J39K34j75J47P1k66n1K35p6K00
6647B85m54J70J38J87l93L25J20j86j26Qk17J02L02k33j20k01J97L80n31o7L49
6668C5j24j9j74L29j52K41j46p7k75J64%p0J37O5r2J9k57K81p5L75K6l34o6J47
6692d2q5R7j0l3L06l34mn1M01j37j74K73k00K62j10J15j33q1Q2K1O7J19j35k02
$$ plain form
6716 12 167 149 -130 -30 -177 106 8 -125 82 197 -258 -172 222 -358 -268 -298 57 -257 -486 -193 27 -348
6738 -348 -167 -396 -223 35 -175 8 -272 -68 -41 -65 -239 -175 115 -296 160 136 93 40 57 -100 -27 59 134
6761 134 33 116 167 27 140 423 82 -40 217 306 75 200 259 113 26 -45 183 156 -81 -251 3 0 -45
6784 -45 -106 26 265 -364 -18 12 -39 44 24 -75 37 -213 -84 -91 -13 -183 -187 -45 116 -1 163 202 -164 -22
6808 -22 -117 168 258 533 -221 221 165 -59 -219 251 13 243 -109 -14 248 264 213 -9 -182 -59 -188 -59
6830 -59 240 211 4 52 183 -42 142 -100 237 -172 -220 137 -320 -167 -249 -112 -210 -263 -143 -80 157 -99 16
6853 16 -9 104 15 -117 -62 -44 101 -13 -200 65 48 95 225 160 192 -99 59 222 373 154 179 228 129 246
6877 246 -38 388 161 69 35 60 -70 2 -132 110 144 169 -47 -102 -40 -161 -278 -304 -352 -167 -254 -26 181 -117
$$ packed form
6716A2J55j8k79J00j47K83r8j33K07J15m55Q6L94n80R0l0L55l14k29K93K20l75
6738c48J81k29J73K58k10J83k80K04K7k4j74O4K90m11M56k4m3n3J7j57P3Q6P5
6761A34j01Q3N1j40J13K83l41j22K57Q9k31J25N9j46q7p1K28k7k37j70K54lm5
6784d5o1J32K39o29L46L0n1Q3k0r9J12k50J29pP8j70mJ42J61j17J64L9l66J42
6808b2r5K85R0K75p54M42n6k24j60M70k38K30l52R5K62J6n1k22j73J23j29J29
6830e9K99k9k07M8J31k25J84k42L37m09m8L57m57J53q2J37r8n3J20O3K37k56J15
6853A6k5J13q9j32N5J8J45j14j87K65j7M7J30o5L2k91J58J63J51k19K5M9r9J17
6877B46k84M26k27r2l4K5j30P2j34K42L4K5k16n5O2j21j17k6m8J85q7K28K07k98
$$ plain form
6901 -117 -130 -34 -194 -398 -19 136 -115 -200 -127 -74 46 232 35 -46 5 -7 -103 -186 86 259 71 -93 160
6924 160 132 236 -120 -155 39 112 -39 -4 292 191 310 -4 -31 45 79 447 47 -197 7 81 -47 -66 12
6947 12 -65 80 -214 -629 -259 -12 -27 135 43 120 -97 -125 109 48 -288 -207 -134 -247 -143 -163 85 -52 -151 46
6971 46 71 -103 54 45 -208 -107 52 178 -69 41 -57 249 314 31 373 411 194 -163 112 336 -42 15 204
6994 204 32 129 27 222 -32 -59 -99 126 40 -175 -200 57 -271 -421 -160 153 134 -254 -268 60 -48 -325
7016 -325 -316 -158 -88 -383 -50 246 -273 -356 -143 186 33 137 16 0 83 39 115 54 -190 91 -22 267 198
7039 198 -29 141 134 64 -114 58 132 -113 256 96 -134 136 92 -20 38 106 89 -59 -136 13 325 237 -44
7062 -44 152 98 -96 -179 151 -33 66 -85 -31 -443 -197 -231 -314 13 -133 -198 -259 40 -194 61 -280 24 71
$$ packed form
6901a17j3R6j60k04L79J55k51q5P3N3J20J86j97q1N1j2r6q3K72J73j88j64K53
6924A60k8J04l56l5J94P3j51L5K96j01J19l14k7P6L4L68m00k44K04P4j28j9P8
6947A2p7J45k94m15L70K47j5J62r2P7k17k8K34o1l36Q1P3j13J04k0K48j37r9J97
6971D6K5j74J57rk53J01J59J26k47J10r8L06O5k83L42L8k17l57K75K24l78N7J89
6994B04j72R7j02J95k54k7m0K25q6k15k5K57l28j50K61L13j9l88j4L28j08k77
7016c25RJ58P0k95L33K96n19q3K13L29j53J04j21j6Q3m4P6o1k44K81j13K89o9
7039A98k27J70pp0j78J72P4k45L69j60k30K70m4j12N8O8j7j48p7J49L12q8k81
7062d4J96n4j94q3L30j84R9j51N4m12K46l4q3L27j46o5o1K99k34K55l41L04M7
$$ plain form
7085 71 -110 248 -299 -178 27 -28 16 234 -42 285 -124 80 345 -313 -81 3 426 169 -291 26 283
7106 283 105 110 230 -57 -36 65 138 328 -83 -17 220 9 -92 76 337 27 -128 89 280 -472 -4 -113
7128 -113 -130 -246 -302 -138 119 -142 -528 -146 -7 41 -152 245 255 -195 87 21 24 -282 -195 396 127 -17 301
7151 301 352 -48 251 77 183 58 -175 3 340 -9 175 212 344 -255 -9 197 221 -122 -118 69 -56 -6
7173 -6 98 170 -102 -299 -17 -70 -57 -232 -91 26 -318 111 100 303 28 -159 53 130 -355 -180 222 -56
7195 -56 -22 259 43 141 -51 34 236 -44 337 -65 134 -66 27 165 328 120 -352 137 47 94 394 78
7217 78 68 -87 -45 160 10 -102 220 -45 40 2 190 20 -107 -118 49 367 -223 193 -297 -105 -110 -182 -175 -278
7241 -278 -8 -209 129 -214 -39 60 99 -208 -34 -162 -39 79 -43 -105 7 -134 4 -48 -237 -52 146
$$ packed form
7085G1j81L58n47J21K05n5M4K18k76L27m09K04K65o58K32Q4M23k57m60L17K57
7106B83j78NJ20k87K1J01P3J90m11O6K37k11j01J68K61l10j55K17J91p52M68j09
7128a13j7j16n6J64K57k61l86L82J39M8j93L97J0m50K82o6Ll06Q7N91k69j44L18
7151C01N1m00K99j74J06j25k33J78L37l49J84L7J32n99K46K06K4l43MJ87j25N0
7173fJ04P2k72j97K82n3J3j75J41J17l44M29j1K03k75j87K12P7m85J75M02k78
7195e6L4K81k16R8j92Q5K02k80L81m02J99k00R3J38J63k08m72M89r0M7L00l16
7217G8j0j55M2K05j50j12L22k65Q5l8J88j70j27j1J67L18n90M16m90J92np2Pj03
7241b78K70k01L38l43J75R9L9l07J74j28J23J18j22o2J12j41J38n2j89J85J98
$$ plain form
7262 146 489 49 1 78 254 197 67 -140 247 -148 -220 280 117 96 102 5 312 -28 5 -60 24 -330 -212 28
7286 28 -164 -104 94 139 -76 -24 66 1 -160 -42 124 154 -9 -272 -70 -101 -313 -270 -49 -152 -85 187 -62
7309 -62 -135 -182 -188 248 -40 183 207 222 98 84 354 325 -6 -13 261 173 178 58 250 142 276 377 325 -10 -122
7334 -122 -116 137 -164 18 -49 189 111 -142 30 -30 1 -312 33 247 -207 -262 -146 -170 -315 1 -6 -196 -250 -47
7358 -47 -29 -143 -206 -34 189 -110 -174 58 -189 58 -178 -5 -254 -174 -154 67 248 -285 -221 157 167 347 346
7381 346 79 208 -76 150 -83 105 -211 391 41 64 -123 -151 72 -171 -377 119 21 -56 156 142 46 -14
7403 -14 -249 9 83 119 -77 -21 5 -225 144 8 75 -45 -254 -30 19 56 -160 54 -124 73 86 144 -24
7426 -24 69 -205 -167 31 -5 28 122 134 -19 174 -223 201 346 271 -245 334 -131 204 -12 309 53 20 188
$$ packed form
7262A46L43m40m8P7J76n7j30k07L87l95p2N00j63k1Or7L07l40L3o5Q4l54J18K40
7286B8j92O0J98M5k15N2R0o5j61J18J66L0j63k63K02l1k12M3K21j03O7K72k49
7309f2p3m7oM36k88K23K4J5j24j4K70k9l31pK74q8Nj20J92j08J34J01n2l35j12
7334a22OK53l01J82o7K38p8k53J72o0L1l13L45K14m54n5J16k4j45L16pj90n4K03
7358d7J8j14o3J72K23k99o4K32k47K47k36J73k49Q0K0K21J81n33O4L78J0J80j
7381C46k67J29k84K26k33J88l16O02l50K3j87k8K23k43k06M96r8p7K12j4r6o0
7403a4k35K58P4L6j96N6K6k30L69j36O7j20k09K24M9L7k16K14j78J97J3N8j68
7426b4R3k74L8J98l6L3R4J2j53J93l97M24J45p5n16N79m65L35k16L21k56l3J68
$$ plain form
7449 188 201 292 -97 179 113 194 191 -198 238 -137 -317 -35 118 -12 -203 -65 152 71 -30 -211 -131 -177 -194
7472 -194 280 41 -85 11 -153 -143 -96 -68 85 117 202 264 -13 105 205 27 45 47 170 78 185 172 -49 -229
7496 -229 -50 -96 46 131 162 -216 91 209 93 113 218 137 -12 -11 26 -349 -287 81 44 -46 38 -183 -266 107
7520 107 -193 172 -83 263 -207 32 -39 -61 -116 -468 109 69 4 -121 6 -153 -143 105 181 -247 -1 149
7542 149 216 253 -52 134 -105 62 453 267 -86 235 -36 -75 72 82 -134 4 -49 -80 447 238 161 98 97
7565 97 103 -187 119 -56 -112 -257 -11 -281 -23 178 174 40 -128 -209 -233 -255 -112 -156 -382 125 -264 -101 -56 -36
7589 -36 -105 -218 51 289 147 -196 -48 22 12 58 -83 -73 -86 318 285 118 -20 232 259 289 270 151 115 -67
7613 -67 175 -80 33 11 -211 24 6 -108 -193 -128 -88 -161 -34 -210 -255 -312 11 135 -50 108 75 -121 -7
$$ packed form
7449A88J3R1l89K76o6Q1ll89M36l75j80K82J53j30j91J38K17q1j01j81Q0m6j7
7472a94M74k39j26R6j64J0M7K8J53L2Q5O2k77J18J00j78J8KJ23r2J07j3k21j80
7496b29J79m6J42Q5L1l78L07J18j16K0J05q1j49JL7l75O2L68l7r0Q4k21q3L73
7520A07l00L65k55L46m70K39p1k2n5l52N77m0o5j25J27j59J0K48P6m28K46J50
7542A49O7L7l05J86k39J67L91j86l53L21k71l9J47J0k16J38n3l1N27k09p7o3j
7565I7Ok90L06j75n6j45K46k70K58K01mj34j68q1k4k2J43m4k26N07l89J63M5K0
7589c6o9j13K69K38j42l43J48P0j0M6j41J0j3M04l3j67j38K52K7L0j9j19l6j82
7613f7K42k55J13k2k22K35j8j14q5O5M0p3J27j76m5n7L23J24j85J58l3j96J14
$$ plain form
7636 -7 -193 81 -42 -26 32 -70 -101 -176 -80 -196 124 -101 58 -27 101 237 178 93 -110 -4 -74 102 -51 378
7660 378 -35 278 373 54 -223 113 6 136 109 101 117 13 193 251 241 176 154 -149 85 380 363 -227 -39
7683 -39 48 225 -30 10 126 -74 -116 -88 -144 186 -31 -319 144 -174 -137 -6 228 -18 29 81 54 -112 -31 -55
7707 -55 22 -38 102 -8 235 75 -264 310 -42 98 -60 380 184 -234 0 309 267 252 87 130 -50 -88
7729 -88 236 30 116 71 211 73 332 -87 -29 118 146 115 -46 56 -23 70 -263 10 -106 94 52 -185 -134
7752 -134 -420 113 127 -25 -2 222 127 173 -152 -66 304 -29 164 114 -42 93 203 399 237 267 -120 52
7774 52 -227 170 308 -140 -284 -160 279 245 3 -136 27 -178 159 172 -90 -20 -167 -149 -263 -103 25 64
7796 64 -174 -165 93 56 26 -244 -278 -18 -70 -163 153 234 -321 -31 163 -256 -202 82 1 -382 -179 -39 -81 -264
$$ packed form
7636gj86K74j23J6N8j02l1p5R6j16L20k25J59q5J28J36n9q5k03J06p0J76j53M29
7660C78m13L13R5l19k77L36j07J30k7qJ6j04J80N8j0o5k2l03K34K95j7n90J88
7683c9Q7J77k55M0J16k00m2K8n6L30k17k88M63l18L7J31K34k46M7N2k7j66Q1k4
7707e5P7o0J40j10K43j60l39N74l52J40j58M40j96m18K34L09m2j5j65M3j80l8
7729h8L24k06Q6m5J40j38K59m19N8J47K8l1j61J02p9R3l33K73j16K00m2k37N1
7752a34k86N33J4j52K3K24r5M6l25Q6L70l33J93n0j56J35J10J96j62L0l87J72
7774E2k79L97J38m48j44J24M39l4k42j39J63k05L37J3k62P0j47J8j14J60J28L9
7796F4k38RK58l7l0k70l4K60n2r3L16Q1n55K90J94m19N4K84q1l83K03J40m2j83
$$ plain form
7820 -264 -6 -80 -74 100 79 248 66 -73 -92 408 166 69 78 98 15 -59 -108 165 56 144 75 377 138 -203 -136
7845 -136 -17 -97 23 -23 -2 -148 -183 -104 99 21 -3 -190 99 274 -40 -222 -221 63 -450 -95 -54 -67 55 -227
7869 -227 -361 -114 216 83 -135 66 264 246 112 242 343 104 42 35 186 -101 -202 -12 41 -133 -7 185
7891 185 12 274 -66 380 237 247 38 199 144 -146 111 -152 103 -150 261 -160 155 -64 22 156 -140
7912 -140 48 75 228 -281 -205 97 -114 -277 -366 -25 -140 -146 142 64 -120 -296 -146 187 284 93 15 -109 30
7935 30 -210 71 336 -78 -50 -104 384 -246 -4 252 129 151 107 220 206 143 -76 -2 -35 4 98 -171 -118 77
7959 77 331 -304 -578 -55 92 -49 -414 -101 -116 -323 -104 -228 31 -157 -483 -103 22 195 37 -193 61
7980 61 -137 -179 153 96 23 -156 -42 34 -47 -105 68 138 18 123 42 49 -85 -58 -111 -57 277 281 -134 35 21 310
$$ packed form
7820b64K58p4OJ74k1J69j82j39j9N00k42r7RK0q3p4m9K73j09Q8o9L02k39l41O7
7845a36J19q0J20m6K1j46l5P9K03p8k4j87K89J75l14j82JK84n13L55M1j3J22k82
7869b27j34K47L30j33k18K01J98j8j34J30J01k39o2pJ51k87j01J90N3j74J26J92
7891A85j73K62l40M46j43J0k09J61n5k90K57k63K55k53M11m21L15k19Q6J34k96
7912a40J88K7J53n09P6L02k11j63q9L41j15oK88p8j84j76J50L33R7j91p8j24J39
7935C0k40K81K65m14K8n4M88o30K42K56j23K2m4J13j4o3k19P4l3L9R4k69N3J95
7959G7K54o35k74N23J47j41l65L13j5k07K19j24K59j88l26L80J25J73j58k30K54
7980F1j98m2L32n7p3j79J14P6q1n8J73P0j20J05q1Pj34K7n3N4L34Mm15J69j4K89
$$ plain form
8006 310 271 56 203 20 200 298 353 177 286 -113 -210 -232 131 23 -89 -124 -236 -131 258 -3 -304 -63
8028 -63 -78 -289 279 -217 -88 -81 -356 -321 67 90 -44 71 -38 -108 -42 69 -82 203 85 40 -55 -27 -21 53 221
8053 221 70 3 101 77 129 -64 69 268 100 -223 -410 13 103 225 35 64 -131 296 270 195 183 -308 -15
8076 -15 -122 12 55 44 -15 73 -65 73 90 150 17 -161 -31 73 -119 -1 239 -125 193 -187 -124 -390 -112
8099 -112 -226 -168 118 -259 84 -101 -28 177 110 181 -3 192 33 53 200 366 -17 59 35 119 159 280 172
8122 172 -160 74 37 90 -49 -177 -304 60 -333 -7 37 -10 78 -248 4 37 55 37 -30 61 -155 19 -120
8145 -120 -71 -167 -269 -34 110 129 94 169 225 -42 6 83 -61 -142 -138 -108 21 160 36 -178 69 54 66 209 -15
8170 -15 109 -132 18 146 -153 -55 65 61 -39 207 -60 59 17 196 -15 15 176 -22 69 -325 -94
$$ packed form
8006C10l9k15J47j83J80R8N5j76J09l99r7k2L63j08j12l5j12J05L89k61l01K41
8028f3j5k11N68m96J29Pk75L5L88K3j34J15j09p0O6J11j51K85j18m5r5K8OP4J68
8053B21j51o7R8k4N2j93J33J99j68l23j87M23R0J22j90K9j95M27k6p5j2m91K93
8076a5j07J34M3j1n9Q8j38J38J7O0j33j78J30J04j92J18K40l64L18l80O3k66K78
8099a12j14N8K86l77L43j85P3K05o7P1j84J95j59K0J47J66l83P6k4Q4M0J21j08
8122A72l32K34l7N3j39j28j27L64l93L26M4m7Q8l26K52L3J8j8o7R1k16J74j39
8145a20M9r6j02K35J44J9l5P5N6k67M8P7j44q1ML0J29J39j24k14K47j5J2J43k24
8170a5J24k41J50J28k99R8J20mj00K46k67J19m2J79k11L0J61j98R1l94K31
8191i4
$$ Imaginary data points
##PAGE= N=2
##DATA TABLE= (X++(I..I)), XYDATA
$$ plain form
0 0 0 0 0 0 0 0 0 8 -8 8 -8 16 -16 19 -24 32 -37 40 -48 58 -69 80 -90 104 -122 138 -155 176 -199 223 -253
31 -253 283 -315 354 -394 440 -487 540 -600 664 -733 811 -899 997 -1104 1226 -1366 1524
48 1524 -1707 1924 -2180 2495 -2887 3391 -4066 5020 -6471 8919 -13808 27245 -135997 -408939
62 -408939 99797 307438 -120774 -285520 130755 242529 -105478 -178140 110183 112574 -121044
73 -121044 -92219 88603 29669 -82828 927 73910 -21175 -57118 25932 37718 -24813 -16712
85 -16712 6021 -21604 -7909 42690 8812 -40410 11578 54046 -8383 -32905 27197 18816
97 18816 -40362 5075 66121 -4223 -51755 39392 57275 -64639 -60765 82919 60667 -89208
109 -89208 -43231 106334 40199 -99791 -19892 93452 -9458 -100592 16018 83557 -33992
$$ packed form
0@%%%%%%%Qj6J6j6K4l2L5m3N6o9P7q8J06j27J49j70J94k26K60k93L31l75M22m76
31b53N36n98O69p48Q34r27J027j140J264j397J544j710J896k101K330k592K890
48A524l231L631m104M675n382O278p457R086j1491J5390k2727M1053j63242k72942
62d08939N08736K07641m28212j64746M16275J11774l48007p2662K88323K391k33618
73a21044K8825J80822n8934j12497Q3755P2983r5085l5943Q3050J1786o2531Q101
85a6712K2733k7625J3695N0599l3878m9222N1988M2468o2429k4522O0102q381
97A8816n9178M5437O1046p0344m7532R1147J7883j21914L874J43684k2252j49875
109h9208M5977J49565o6135j39990P9899J13344j02910r1134J16610O7539j17549
$$ plain form
120 -33992 -68330 50014 55062 -56791 -37296 55086 -287 -87278 -13104 65253 -10497 -63379
132 -63379 21293 62265 -13093 -41753 8384 7768 -26580 -2812 21383 -4910 1221 34931 -5636
145 -5636 -58727 -688 62000 -2048 -55232 22514 68832 -12815 -46477 29371 34405 -43019
157 -43019 -19086 65654 24586 -57927 -3062 66932 -4888 -63553 22085 67814 -30285 -69338
169 -69338 27850 53035 -37883 -47187 38965 37768 -32167 -13274 40951 -1449 -58081 -17749
181 -17749 27751 -6539 -29762 7628 20418 -8743 -6699 14481 -3009 -23659 -6758 397
193 397 -17376 -6573 18275 4154 -12627 13845 24405 -8643 -13345 16408 1574 -31210 3220
206 3220 41788 -2147 -36468 20556 49189 -17211 -37670 32795 38512 -36734 -27951 50681 29511
$$ packed form
120c3992l4338J18344N048j11853J9495R2382n5373q6991P4174P8357p5750n2882
132f3379Q4672M0972p5358k8660N0137o16l4348K3768K4195k6293O131L3710m0567
145e636n3091N8039O2688o4048n3184P7746M6318q1647l3662P5848N034p7424
157d3019K3933Q4740m1068q2513N4865O9994p1820n8665Q5638M5729r8099l9053
169f9338R7188K5185r0918r304Q6152j197o9935J8893N4225m2400n6632M0332
181a7749M5500l4290k3223L7390J2790k9161K044K1180j7490k0650J6901P155
193C97j7773J0803K4848j4121j6781K6472J0560l3048m702K9753j4834l2784L4430
206C220L8568m3935l4321N7024K8633o6400k0459P0465N717p5246Q783P8632k1170
$$ plain form
219 29511 -48940 -18563 52554 13203 -46894 2835 51507 -8214 -51015 5961 34641 -19293
231 -19293 -33269 18078 21637 -21169 -15629 15363 -1691 -23954 -349 17424 -2756 -9095 4005
244 4005 -6711 -22280 -5429 3320 -14368 -6067 24963 12936 -17530 2367 25521 -12330 -37973
257 -37973 7697 32447 -12309 -23335 30045 33468 -22550 -17381 34987 16347 -36043 -9968
269 -9968 39326 8844 -30294 7524 37131 -5493 -26784 16144 25085 -19130 -20228 21316 14709
282 14709 -21539 -6516 22969 1391 -23929 -1268 15807 -8586 -19079 2524 7135 -8600
294 -8600 -5839 4370 -3970 -9426 106 -3583 -14547 -2352 9584 -6037 -10538 14869 17154 -14894
308 -14894 -16528 11817 2296 -27785 -8888 25548 8455 -14713 13791 33585 -3472 -23923
$$ packed form
219B9511p8451L0377P1117l9351o0097M9729M8672n9721m2801N6976K8680n3934
231a9293j3976N1347L559m2806N540L0992j7054k2263K3605J7773k0180o339J3100
244D005j0716j5569J6851Q749j7688Q301L1030j2027l0466J9897K3154l7851k5643
257c7973M5670K4750m4756j1026N3380L423n6018N169N2368j8640n2390K6075
269i968M9294l0482l9138L7818K9607m2624k1291M2928Q941m4215j098M1544o607
282A4709l6248J5023K9485k1578k5320K2661J7075k4393j0493K1603M611j5735
294h600K761J0209q340n456R532l689j0964J2195J1936j5621m501K5407K285l2048
308a4894j634K8345r521l0081J8897L4436j7093k3168K8504J9794l7057k0451
$$ plain form
320 -23923 9690 18309 -18729 -18426 23423 22297 -14886 -6753 27025 12882 -19484 -6165 19376
333 19376 3871 -16034 -345 14980 -69 -11469 -317 7172 -786 -5521 -1715 2265 1844
346 1844 -5145 -11849 -5356 4092 -5622 -16286 424 16875 -2319 -20644 1349 17699 -10289
359 -10289 -27195 4554 19790 -12126 -22616 12623 20706 -14099 -15685 20803 19693 -15957 -11485
372 -11485 20624 9564 -23361 -10758 22805 11913 -15027 6 27600 13183 -15259 -5212
384 -5212 17002 5965 -15972 -6878 15950 11334 -8594 -4894 13419 7160 -12479 -9544 9736
397 9736 6427 -11977 -7729 10968 3109 -18017 -9589 12513 3897 -18149 -7430 15871 2638
410 2638 -22610 -9882 15122 3238 -21322 -7694 17531 4959 -19559 -6322 17927 5142
$$ packed form
320b3923L3613Q619l7038L03M1849j126l7183Q133L3778j4143l2366J3319K5541
333A9376j5505j9905J5689J5325j5049j1400J1152P489p958m735L806L980m21
346A844o989o704O493R448r714j0664J6710J6451j9194j8325K1993J6350k7988
359a0289j6906L1749J5236l1916j0490L5239Q083l4805j586L6488j110l5650M472
372a1485L2109j1060l2925J2603L3563j0892k6940J5033K7594j4417k8442J0047
384e212K2214j1037k1937R094K2828m616j9928L700J8313o259j9639K935J9280
397I736l309j8404M248J8697p859k1126Q428K2102q616k2046J0719K3301j3233
410B638k5248J2728K5004j1884k4560J3628K5225j2572k4518J3237K4249j2785
$$ plain form
422 5142 -17641 -3722 17662 4320 -16054 -935 18256 2384 -16325 1493 20533 2942
434 2942 -12941 7914 25425 3389 -16231 2004 15767 -6498 -21212 3757 23257 3703
446 3703 -10007 10315 19847 -5570 -20151 600 11361 -10266 -17790 6701 15450 -7895 -14667
459 -14667 10176 15391 -11600 -19290 4975 8493 -18210 -21040 8348 14870 -9757 -12071 13790
472 13790 14895 -12796 -17020 6667 7102 -15724 -13764 12572 13871 -7894 -6438 16774 12739 -12458
486 -12458 -10410 13795 11698 -12550 -8214 18340 14636 -12436 -9366 18161 14201 -13259 -7468
499 -7468 20645 13506 -15528 -8328 17794 5811 -22136 -8236 18976 4348 -19027 107 23325
512 23325 892 -21910 -1137 16752 -8743 -27053 -93 18638 -4189 -18538 4791 16497
$$ packed form
422E142k2783J3919K1384j3342k0374J5119J9191j5872j8709J7818J9040j7591
434B942j5883K0855J7511k2036j9620J8235J3763k2265j4714K4969J9500j9554
446C703j3710K0322R532k5417j4581K0751J0761k1627p524K4491Q749k3345o772
459a4667K4843N215k6991p690K4265L518k6703k830K9388O522k4627k314K5861
472A3790J105k7691m224K3687M35k2826J960K6336J299k1765J456K3212m035k5197
486a2458K048K4205k097k4248M336K6554l704k7072L070K7527l960k7460N791
499g468K8113p139k9034P200K6122j1983k7947J3900K7212j4628k3375J9134K3218
512B3325k2433k2802K0773J7889k5495j8310K6960J8731k2827j4349K3329J1706
$$ plain form
524 16497 -8829 -22165 646 13496 -5600 -16897 2418 14625 -3034 -16145 1749 16770
536 16770 990 -14335 2353 17627 -2109 -20105 884 22221 2560 -15975 6921 23885
548 23885 -3273 -20827 7823 24685 -4041 -16973 13721 23237 -10246 -19233 10866 14199 -14008
561 -14008 -12397 17854 15190 -12506 -9209 13925 6265 -16475 -10733 6441 -605 -13450 -3907
574 -3907 9882 4564 -6236 -3116 4243 839 -8537 -11017 -4162 1009 -3905 -6639 3934 10296
588 10296 -1596 -10022 3221 11179 -5837 -14776 3896 12985 -6015 -9496 13624 15608 -9695
601 -9695 -8337 17835 14140 -13559 -8649 15424 5860 -15964 -1454 21870 6444 -13930 3730
614 3730 20327 211 -16953 843 12570 -4170 -10848 6132 10381 -8858 -13969 2480 8137
$$ packed form
524A6497k5326j3336K2811J2850j9096j1297J9315J2207j7659j3111J7894J5021
536A6770j5780j5325J6688J5274j9736j7996K0989K1337j9661j8535K2896J6964
548B3885k7158j7554K8650J6862k8726j2932L0694R516l3483q987L0099L333k8207
561a4008J611L0251k664k7696L297K3134p660k2740N742J7174p046j2845R543
574c907J3789n318j0800L120P359l404r376k480O855N171m914k734J0573O362
588A0296j1892q426J3243P958j7016q939J8672R089j9000l481K3120J984k5303
601i695J358K6172l695k7699M910K4073r564k1824J4510K3324j5426k0374J7660
614C730J6597k0116j7164J7796J1727j6740o678J6980M249j9239n111J6449N657
$$ plain form
627 8137 -3103 -6622 2780 4611 -5315 -9692 -2662 839 -5778 -9799 172 9390 1735 -9895 -4004
642 -4004 6873 -333 -10971 -605 9212 -4775 -15893 2105 16291 -353 -10753 7891 16561
655 16561 -4262 -10638 8956 9928 -11854 -9202 16016 15056 -6710 -4380 12420 6127 -8246 -111
669 -111 10894 -295 -9968 911 8980 539 -4134 1897 3110 -1360 429 2434 -2216 -5946 -3901
684 -3901 -2699 -1193 2422 -224 -8779 -6924 2618 497 -8251 -2938 6566 -579 -7894 1613 8285
699 8285 -6443 -16166 -2023 9421 665 -5661 4855 7909 -3656 -6105 6274 8242 -5191
712 -5191 -7819 4487 9674 551 -3612 4913 7992 514 -276 9297 8330 -6438 -11079 2723 9560
727 9560 -1075 -3705 7323 7931 -4483 -3680 7936 3232 -12623 -8800 7175 4705 -8292 -5397
$$ packed form
627H137j1240l519R402J831r926m377P030L501o617m021R971R218p655j1630N891
642d004J0877p206j0638J0366R817j3987j1118J7998J4186j6644j0400J8644Q670
655A6561k0823o376J9594R72k1782K652K5218r60k1766K330J6800o293j4373Q135
669a11J1005j1189r673J0879Q069q441m673O031J213m470J789K005m650l730K045
684c901J202J506L615k646q555J855R542k121q748N313R504p145p315R507O672
699H285j4728r723J4143J1444q756o326J0516L054j1565k449J2379J968j3433
712e191k628J2306N187r123m163Q525L079p478p90R573r67j4768m641J3802O837
727I560j0635k630J1028O08j2414Q03J1616m704j5855L823J5975k470j2997K895
$$ plain form
741 -5397 4820 -870 -8436 40 8585 -859 -11320 -5889 2191 -600 -6450 -5120 -894 -24 -808
756 -808 1518 3486 451 -4681 -3184 4307 4429 -3219 -4569 966 627 -2753 4473 11333 2246 -6462
772 -6462 2674 11355 718 -8002 1168 6583 -1523 -732 10956 8128 -5403 -3722 6215 3428 -3461
787 -3461 185 854 -6152 -3692 6300 3346 -5784 -1224 4613 -2045 -4683 3427 -467 -13206 -7050
802 -7050 7761 1229 -9208 792 6658 -8131 -11556 7764 9054 -12872 -11928 10440 7521 -11476
816 -11476 -4056 11822 -377 -14604 2957 17035 -1408 -12610 5421 13768 -2416 -6054 9023
829 9023 7527 -8477 -6853 9254 9018 -3464 -3515 5439 7620 2817 220 1111 1510 -2765 -5757 -632
845 -632 7193 1733 -7496 -991 10092 2168 -9960 -2515 5832 -7425 -15007 3340 11683 -8329
$$ packed form
741e397J0217n690p566Q476Q545r444j0461N431Q080k791n850J330M226Q70p84
756h08K326J968l035n132J497P491J22p648j350N535l39l380P226O860r087q708
772f462R136Q681j0637q720R170N415q106P91J1688k828j3531J681R937k787o889
787c461L646O69p006K460R992k954r130M560N837o658k638Q110l894j2739O156
802g050J4811o532j0437J0000N866j4789l425J9320J290k1926R44K2368k919j8997
816a1476P420J5878j2199j4227J7561J4078j8443j1202J8031Q347j6184l638J5077
829I023j496j6004J624J6107k36j2482n1Q954K181m803k597Q91L99m275k992N125
845f32P825n460r229O505J1083p924j2128P445Q347j3257p582J8347Q343k0012
$$ plain form
859 -8329 -15101 7609 13519 -8471 -11735 7919 4252 -16675 -10675 11643 4780 -14172 -4456 13712
873 13712 4926 -8943 898 9787 -3170 -10997 3012 10132 -1368 -6922 3697 9399 3291 372
887 372 3596 3867 -947 -1797 1781 4570 2988 -1596 -1885 3103 5483 -354 -2706 3046 4229 -3381
903 -3381 -3099 4816 1777 -10121 -6906 6660 4743 -8297 -5213 6645 1257 -10262 -3396 7857
917 7857 -929 -13568 -4987 7481 -443 -10717 -1050 8783 -51 -7513 2202 7859 -4007 -11131
931 -11131 850 8391 -958 -6361 3858 8331 -1232 -4177 6534 8564 -2931 -5741 5829 8670
945 8670 -2487 -4799 5963 8662 -1973 -4623 6318 7809 -4540 -7475 4801 9239 -2529
958 -2529 -7017 3642 6668 -5863 -9506 3271 5873 -6905 -7849 7351 8802 -7377 -10190 3508
$$ packed form
859h329o772K2710N910k1990l264J9654l667k0927O000K2318o863j8952R716J8168
873A3712q786j3869R841Q889j2957p827J4009P120j1500n554J0619N702o108k919
887C72L224K71m814q50L578K789j582m584k89M988K380n837k352N752J183p610
903c381K82P915l039j1898L215J3566j917j3040L084J1858n388j1519O866J1253
917G857q786j2639Q581J2468p924j0274R667R833q834p462R715N657j1866p124
931a1131J1981P541r349n403J0219M473r563k945J0711K030j1495k810J1570K841
945H670j1157k312J0762K699j0635k650J0941J491j2349k935J2276M438j1768
958b529m488J0659L026j2531l643J2777K602j2778r44J5200J451j6179k813J3698
$$ plain form
972 3508 2377 -13377 -9575 8537 6179 -9780 -4866 11969 5150 -13568 -8022 8801 1757 -13181
986 -13181 -3409 11752 2917 -9650 1506 14417 4244 -7949 488 7623 -3090 -9654 1739
999 1739 10238 2137 -2104 6993 10050 -389 -6295 987 4428 -1247 -3967 2984 6914 70 -4826
1014 -4826 614 5824 196 -6685 -1263 5713 -575 -8229 -2367 6113 -786 -9646 -2241 6394 -2924
1029 -2924 -11130 -1445 7847 -1063 -8487 1741 6650 -6014 -11587 7 5010 -4607 -5493 7768
1043 7768 9017 -3019 -4444 4169 1841 -7826 -4381 6147 4845 -2133 2625 9163 4322 -2621
1057 -2621 -421 5158 1761 -4112 -1474 3922 3260 -1723 -282 5821 6517 -401 -3204 1050 2272
1072 2272 -4875 -6701 1492 5589 -690 -3174 3195 2176 -6716 -7562 848 831 -5699 -1731 6787 1406
$$ packed form
972C508j131j5754L802J8112k358j5959M914J6835o819j8718N546J6823p044j4938
986a3181R772J5161q835j2567J1156J2911j0173j2193Q437P135j0713o564J1393
999A739Q499q101m241R097L057j0439n906P282L441n675k720O951L930o844m896
1014d826N440N210n628o881N422O976o288p654N862Q480o899q860P405Q635r318
1029b924q206R685R292q910p424J0228M909j2664n573J1594N003r617q86J3261
1043G768J249j2036j425Q613k328r667L445J0528j302o978M758O538m841o943
1057b621K200N579l397n873K638N396o62m983J441O103O96o918k803M254J222
1072B272p147j826Q193M097o279k484O369j019q892q46Q410j7o530L968Q518n381
$$ plain form
1088 1406 -9033 -4242 3940 -2601 -9892 -1109 7826 969 -6765 519 7409 -628 -6839 -196 4711
1103 4711 -2204 -5379 2273 6099 585 67 6385 6299 -1441 -3717 1967 2926 -3125 -2223 5320 7505
1119 7505 1642 -1113 3439 4558 -1617 -4470 48 3149 -741 -3774 78 3272 -366 -3126 686
1134 686 3290 -1843 -5588 -1161 1664 -4229 -6265 711 4267 -2388 -6125 408 3261 -4766 -6929
1149 -6929 1807 4664 -2281 -3794 2328 1488 -5281 -4540 3018 2784 -1412 2569 6913 2385 -3145 -754
1165 -754 1978 -1355 -3008 1949 5195 3233 1881 3614 3629 1687 649 -361 -625 158 -119 -1328
1181 -1328 -9 3305 3080 383 1491 2625 -1267 -5267 -2200 -350 -4028 -4461 2432 4064 -2123
1196 -2123 -3337 2369 424 -7126 -6082 1694 518 -5360 -2998 3625 2063 -3569 -1711 1841 -675
$$ packed form
1088A406j0439M791Q182o541p291Q783Q935o857p734P284O890q037o211O643M907
1103D711o915l175P652L826n514n18O318q6p740k276N684R59o051R02P543K185
1119G505n863k755M552J119o175k853M518L101l890l033L852L194l638k760L812
1134F86K604n133l745M427K825n893k036O976L556o655l737O533K853q027k163
1149f929Q736K857o945j513O122q40o769P41P558k34m196L981M344m528n530K391
1165g54K732l333j653M957L246j962j352J733J5j942j038j010k64P83k77j209
1181a328J319L314k25k697J108J134l892m000L067J850l678m33O893J632o187
1196b123j214N706j945p550J044P776j176n878K362O623j562n632J858L552k516
$$ plain form
1211 -675 -3846 -1507 1410 595 287 2230 3061 1560 586 140 -444 -703 330 1767 2937 3945 3733
1228 3733 2398 1145 673 -1417 -2146 -191 1655 1327 2077 3628 3056 -110 -1278 395 -574 -3356
1244 -3356 -3437 -391 298 -2254 -1462 1818 1768 -2236 -2503 -19 -683 -4855 -5111 -933 173 -1721 -1314
1261 -1314 1859 1188 -2712 -2522 615 -546 -3516 -1496 2690 1255 -1774 661 3156 393 -2687
1276 -2687 715 4202 2423 -887 1458 4222 1556 -1657 -215 2402 674 -1700 1869 6150 4293
1291 4293 -1213 -747 3111 727 -4740 -3351 2502 824 -3844 860 7212 1446 -6420 -2081 3311
1306 3311 -3463 -9424 -1110 4786 -3645 -6991 3500 7221 -4140 -8279 1498 3390 -5950 -6237 3248
1321 3248 2664 -5420 -2427 6318 3365 -3988 -1195 3728 148 -3448 453 3752 314 -755 3459
$$ packed form
1211f75l171K339K917q15l08J943Q31j501r74m46n84k59J033J437J170J008k12
1228C733j335j253m72k090p29J955J846l28P50J551n72l166j168J673r69k782
1244c356q1L046O89k552P92L280n0m004k67K484o64m172k56M178J106j894M07
1261a314L173o71l900J90L137j161k970K020M186j435l029K435K495k763l080
1276b687L402L487j779l310K345K764k666l213J442K617j728k374L569M281j857
1291D293n506M66L858k384n467J389N853j678m668M704O352n766p866M339N392
1306C311o774n961Q314N896q431l346J0491L721j1361m139R777J892r340k87R485
1321C248n84q084K993Q745k953p353K793M923l580l596L901L299l438j069M214
$$ plain form
1336 3459 4646 1366 -509 208 787 1282 2719 2664 1436 2401 1395 -20 977 1687 -1411 -4019 605
1353 605 4697 763 -2274 2534 3228 -3706 -5464 1939 2352 -6344 -6946 2838 4776 -3431 -3490 2585
1369 2585 163 -5994 -3177 3194 116 -6662 -3565 2727 1539 -2132 -1016 2166 479 -1404 359
1384 359 2784 502 -3734 -2809 3305 5530 404 -1499 3259 4478 -1024 -1357 4986 4217 -5174 -3359
1400 -3359 7156 5712 -4181 -2312 6832 2533 -5945 1101 9187 -1232 -9664 875 9164 -2888
1414 -2888 -9817 1725 6361 -5989 -6775 7538 6687 -8355 -8687 5314 4037 -8457 -6858 4050
1428 4050 762 -7016 -1730 7148 1910 -6820 -3116 4101 1659 -4407 -2735 1675 354 -2426 1406
1443 1406 6093 2587 -3202 -265 5736 4018 -3706 -3081 3496 2425 -2914 1160 8542 4097 -4577
$$ packed form
1336C459J187l280j875P17N79M95J437n5j228R65j006j415R97P10l098k608M624
1353F05M092l934l037M808O94o934j758P403M13q696o02R784J938q207n9O075
1369B585k422o157K817O371l078o778L097O292j188l671J116L182j687j883J763
1384C59K425k282m236R25O114K225n126j903M758J219n502l33O343p69r391J815
1400c359J0515j444r893J869R144m299q478P046Q086j0419q432J0539Q289j2052
1414b888o929J1542M636j2350p86J4313q51j5042l32J4001j277j2494J599J0908
1428D050l288p778N286Q878n238q730L704P217k442o066J672M410j321k780L832
1443A406M687l506n789K937O001j718p724O25O577j071n339M074P382m445q674
$$ plain form
1458 -4577 -540 6679 2276 -5191 -1983 3093 253 -1558 3525 4216 -3359 -4796 547 2108 -2043
1473 -2043 -2217 -160 -1615 -3007 -599 1064 -1596 -3322 -2766 -1331 40 938 -1457 -3553 -1053 1554
1489 1554 -753 -2197 190 -718 -5027 -1214 6035 4060 -4079 -1623 5892 1920 -4381 264 5625
1504 5625 -661 -5692 2516 8705 1847 -4662 1031 5920 1447 -1617 2051 2221 -2213 -2601 2561
1519 2561 4286 727 -2159 312 2559 -447 -2223 -182 724 -3483 -3488 2200 4203 -3521 -7098 -384
1535 -384 3094 -3381 -4814 3624 3710 -6441 -5435 4650 2280 -9055 -6062 5496 3349 -5157 377
1550 377 7841 -647 -9059 550 8284 -1075 -7590 1503 7211 -364 -2728 5647 6399 -1826 -2218 4843
1566 4843 4132 -2508 -3270 1567 2255 1218 2526 3964 1469 -893 -381 461 232 -869 -2033 -1830 310
$$ packed form
1458d577M037P219m403p467L208N076k840j811N083O91p575j437N343J561m151
1473b043j74K057j455j392K408J663k660j726N56J435J371Q98k395k096K500K607
1489A554k307j444K387r08m309L813P249j975q139K456P515l972o301M645N361
1504E625o286n031Q208O189o858o509N693M889m473l064L668J70m434l88N162
1519B561J725l559k886K471K247l006j776K041R06m207nN688K003p724l577O714
1535c84L478o475j433Q438Q6j0151J006J0085k370j1335K993J1558k147q506N534
1550C77P464q488q412R609P734r359o515R093N708p575k364Q375P52q225l92P061
1566D843p11o640p62M837O88j037J308J438k495k362N12Q42k29j101j164K03K140
$$ plain form
1583 310 1430 -121 -588 -210 -940 -1643 -501 225 -2897 -4955 -2282 619 -291 -763 619 233 -2997
1600 -2997 -2683 386 152 -2514 -2310 1344 1832 -539 -587 276 -675 -1300 711 3231 2364 61 -202 1066
1618 1066 1983 1449 725 789 1980 1640 765 1521 1915 713 -1122 938 3769 2126 -1387 -1179 516
1635 516 -1006 -2431 776 2961 -176 -2490 1068 2151 -3073 -5435 -993 1331 -2800 -3487 2144
1650 2144 2559 -4336 -4592 2395 2402 -3611 -3621 1992 614 -4329 -1858 3550 640 -3385 230 4676 944
1667 944 -3112 757 3069 -323 -1551 2701 3200 -1019 -1418 2577 2725 906 1619 3162 1551 549
1683 549 944 -85 -1325 -551 962 618 918 2877 2033 -1683 -1252 873 -782 -2869 -867 818 -2104
1700 -2104 -2744 807 1598 -2221 -1840 1848 363 -3667 -2967 -585 -2838 -4116 -220 2662 449 -833
$$ packed form
1583C10J120j551m67L78p30p03J142P26l122k058K673K901r10m72J382l86l230
1600b997L14L069k34k666K04L654M88k371m8Q63r51o25K011K520q67k303k63J268
1618A066R17n34p24O4J191l40q75P56L94j202j835K060K831j643l513K08J695
1635E16j522j425L207K185l137k314L558J083n224k362M442K324m131o87N631
1650B144M15o895k56O987Po013j0N613j378m943K471N408k910m025L615M446l732
1667I44m056L869K312l392j228M252M99m219l99L995J48j819P13J543j611j002
1683E49L95j029j240P74J513l44L00J959q44l716M31K125j655k087K002J685k922
1700b104o40L551P91l819L81L688j485m030P00K382k253j278L896K882k213j282
$$ plain form
1716 -833 1310 572 -2802 -2095 541 -18 -1066 1279 2666 726 45 1490 816 -507 1243 2400
1732 2400 690 401 2539 1438 -1232 966 3670 922 -1955 1841 3617 -822 -2619 2553 3186
1747 3186 -2248 -1609 3315 579 -5347 -1911 3666 -3 -4648 554 4290 -2130 -5583 -89 2165
1762 2165 -4083 -5009 1352 2161 -3119 -2729 2009 622 -2842 -1445 1525 -130 -2038 -600 646 -314
1778 -314 -121 967 1000 1166 1758 714 -643 895 2202 -789 -335 3442 3331 -910 -331 3828 1671
1795 1671 -2467 726 5268 1267 -3009 977 4067 -2137 -5089 1332 4260 -1810 -3022 3169 2752
1810 2752 -4277 -3625 2337 724 -4652 -2311 2049 -270 -4152 -1482 1853 -781 -3181 -115 1048
1825 1048 -1485 -3484 -1189 -34 -696 -1266 -165 1536 1653 -37 -832 1076 1693 -245 -1633 1131
$$ packed form
1716h33K143p38l374P07K636n59j048K345J387j940o81J445o74j323J750J157
1732B400j710k89K138j101k670K198K704k748k877L796J776m439j797N172O33
1747C186n434O39M924k736n926L436N577l669m645N202L736o420l453N494K254
1762B165o248r26O361Q09n280L90M738j387l464J397K970j655j908J438J246r60
1778c14J93J088L3J66N92j044j357J538J307k991M54L777j11m241N79M159k157
1795A671m138L193M542m001m276L986L090o204k952O421K928o070j212O191m17
1810B752p029O52N962j613n376K341M360k319l882K670L335k634k400L066J163
1825A048k533j999K295J155o62n70J101J701J17j690p95J908O17j938j388K764
$$ plain form
1841 1131 2713 -263 -1273 3105 3944 -205 -629 4035 3328 -2241 -1928 4084 2384 -3326 -1290 5169
1857 5169 2380 -3306 -184 4987 24 -4951 -249 3938 -1683 -5160 619 3226 -2296 -4411 1355
1872 1355 2578 -3134 -3724 1136 1143 -3751 -3273 1136 302 -2486 -1633 1097 234 -1906 -1824 479 1030 -731
1890 -731 -1325 168 1939 619 -2029 454 3030 1007 -1537 1792 4745 816 -2926 1574 4654
1905 4654 -763 -2985 2765 4789 -1343 -2428 4063 4138 -3062 -2771 3773 2877 -4170 -2140 3743 768
1921 768 -4585 -1550 3537 -288 -4426 -790 2611 -1446 -4368 -623 1467 -2151 -3374 -700 1065
1936 1065 -1094 -2380 -800 914 105 -1492 -1597 639 1154 -1710 -1581 1356 1671 -1494 -830 3764
1952 3764 3178 -1411 -907 3438 2095 -3101 -616 4485 1687 -2889 1416 5565 1449 -2892 1471
$$ packed form
1841A131J582k976j010M378Q39m149m24M664p07n569L13O012j700n710K036O459
1857E169k789n686L122N171m963m975M702M187n621l477N779K607n522k115N766
1872A355J223n712n90M860Pm894M78M409q34k788Q53K730q63k140Q2K303N51j761
1890g31n94J493J771j320k648K483K576k023k544L329K953l929l742M500L080
1905D654n417k222N750K024o132j085O491P5p200K91O544q96p047K030N883k975
1921G68n353L035N087l825m138L636L401m057k922L745K090l618j223K674J765
1936A065k159j286J580J714q09j597j05K236N15k864J29K937L15l165O64M594
1952C764n86m589N04M345j343n196K485N101k798m576M305M149m116m341M363
$$ plain form
1967 1471 4021 -660 -3829 1084 3165 -2139 -3119 2245 4173 -871 -3054 840 2036 -2803 -3757
1982 -3757 154 1369 -2669 -3434 1601 2367 -1791 -3227 89 996 -3154 -3521 792 1314 -2980 -3168
1998 -3168 2137 2937 -2196 -2428 2343 2403 -2809 -2225 2977 1797 -2839 -517 4598 2953 -1996 -505
2014 -505 3410 1680 -1638 439 3713 1580 -1174 912 3353 705 -2142 -227 2137 819 -1190
2029 -1190 634 2299 -221 -2521 -522 1910 -724 -3272 -1670 1048 -436 -1855 -472 882 -1651
2044 -1651 -2534 66 514 -2144 -3258 -1073 576 -808 -323 777 544 -1178 -953 840 711 -623
2060 -623 -874 -744 774 1957 1351 -132 207 1665 1523 505 1820 2120 -340 -942 1852 2921 -371
2077 -371 -884 2054 1832 -1268 22 3884 1826 -3248 -1130 3789 1365 -4007 -1584 1847 -1027 -2870
$$ packed form
1967A471K550m681l169M913K081n304r80N364J928n044k183L894J196m839r54
1982c757L911J215m038p65N035P66m158j436L316R07m150l67M313N22m294j88
1998c168N305Q00n133k32M771O0n212N84N202j180m636K322N115j645m949J491
2014e05L915j730l318K077L274k133k754K086K441k648k847J915K364j318k009
2029a190J824J665k520k300J999K432k634k548J602K718j484j419J383J354k533
2044a651q83K600M48k658j114K185J649j384M85J100k33j722K25J793j29j334
2060f23k51J30J518J183o06j483L39J458j42j018J315L00k460o02K794J069l292
2077c71n13K938k22l100J290L862k058n074K118M919k424n372K423L431k874j843
$$ plain form
2093 -2870 1515 3667 -1859 -4302 133 1390 -3251 -3916 124 281 -2655 -983 2785 1252 -3537
2108 -3537 -2749 887 252 -2353 -1930 540 -58 -1025 1218 3145 1806 -1620 -849 1508 1822 -548 -1144
2125 -1144 939 1844 433 1105 3823 2068 -1910 -1065 2517 2301 -1106 -280 2473 686 -1157 1157
2141 1157 2621 -1487 -3342 192 2527 -415 -1263 1003 -92 -2857 -676 1767 -755 -4067 -2201
2156 -2201 495 -465 -960 706 125 -2445 -1427 1375 -898 -3221 -1287 351 -1049 -451 3332 2015
2172 2015 -2805 -2171 2450 1552 -1981 -612 2427 710 -1088 2519 4539 188 -2398 1080 3356
2187 3356 574 -1361 1118 1813 -673 61 3860 2662 -1817 -2141 1461 1589 -1180 -1413 1230 464
2203 464 -2515 -1200 2176 584 -3972 -3675 1133 1732 -1800 -1695 914 -253 -3587 -1565 1991 -826
$$ packed form
2093b870M385K152n526k443M435J257m641o65M040J57k936J672L768j533m789
2108c537P88L636o35k605M23K470n98r67K243J927j339l426P71K357L14k370n96
2125a144K083R05j411O72K718j755l978Q45L582k16l407Q26K753j787j843K314
2141A157J464m108j855L534K335k942q48K266j095k765K181K443k522l312J866
2156b201K696r60m95J666n81k570J018K802k273k323J934J638j400N98L783j317
2172B015m820O34M621q98l533J369L039j717j798L607K020m351k586L478K276
2187C356k782j935K479O95k486P34L799j198m479l24L602J28k769k33K643p66
2203D64k979J315L376j592m556K97M808N99l532J05K609j167l334K022L556k817
$$ plain form
2219 -826 -4404 -1779 2271 731 -1887 561 1765 -1308 -2766 1259 2424 -1907 -3299 831 3293
2234 3293 1212 545 2198 1374 -1053 -159 2320 1638 -1180 -514 1616 2397 1347 1107 1249 196 -775
2251 -775 -98 1325 617 -1069 -1610 671 1777 291 -678 -477 -612 -1164 -971 -298 -676 -1874 -1685 -192
2269 -192 151 -632 -1349 -1675 -1717 -872 -225 315 437 -731 -1471 -938 1021 656 -1990 -1483 1286 1753 -247
2288 -247 4 2581 574 -2164 107 3725 732 -2518 317 3660 970 -673 2682 3722 -1187
2303 -1187 -2366 2621 3127 -1706 -2906 2590 3120 -1889 -1146 3184 1542 -3940 -2831 2427 1688 -3263
2319 -3263 -2352 1847 1046 -3148 -1584 1470 -347 -4023 -2245 2159 805 -3179 -2195 1967 479 -2903
2335 -2903 -1186 2149 -867 -3750 -496 4170 911 -2946 458 4145 -81 -2869 964 3295 -1028
$$ packed form
2219h26l578K625M050j540k618K448J204l073j458M025J165m331j392M130K462
2234C293k081o67J653q24k427Q94K479o82k818O66K130P81j050k40J42j053r71
2251g75O77J423p08j686n41K281J106j486r69K01j35n52J93O73l78j198J89J493
2269a92L43p83p17l26m2Q45O47N40J22j168p40N33J959l65k646N07K769M67k000
2288b47K51K577k007k738K271L618k993l250K835L343k690j643L355J040m909
2303a187j179M987N06m833j200N496N30n009P43M330j642n482J109N258p39m951
2319c263R11M199q01m194J564L054j817l676J778M404j354l984R84M162j488l382
2335b903J717L335l016k883L254M666l259l857L404L687m226k788L833K331m323
$$ plain form
2350 -1028 -2624 2550 4846 397 -1668 1968 2921 -735 -1693 1278 1764 -1112 -1287 2236 2770 138
2366 138 -962 690 1423 -542 -1404 -188 505 -1467 -1750 636 2039 -705 -2536 -179 895 -1952
2382 -1952 -2669 -434 660 -1649 -2186 809 1393 -2026 -2387 744 1058 -1229 -1596 959 1134 -1226 -957
2399 -957 1526 1590 -702 -792 1426 1736 194 -97 1294 1679 104 129 1507 1845 -514 -420 1720 2241
2417 2241 41 -584 1667 2154 -1059 -1514 1745 1606 -2160 -1907 1945 1664 -2132 -1671 1760 115 -3504
2434 -3504 -1520 1729 -380 -3703 -1152 2295 -445 -3463 -239 1833 -1495 -3087 204 1422 -1549
2449 -1549 -2403 895 1494 -542 -1377 705 1320 -468 -1138 792 1960 179 -615 831 1995 681
2465 681 -1002 437 2114 1034 -530 1217 3120 1136 -1099 649 2404 -320 -2345 477 2333
$$ packed form
2350a028j596N174K296m449k065L636R53l656r58K971M86k876j75L523N34k632
2366A38j100J652P33j965q62J216O93j972k83K386J403k744j831K357J074k847
2382a952p17K235J094k309n37K995N84l419l61L131L14k287l67K555J75k360K69
2399i57K483O4k292r0K218L10j542k91J391L85j575K5J378L38k359R4K140N21
2417B241k200o25K251M87l213m55L259j39l766K53L852k81l796M61L431j645l619
2434c504J984L249k109l323K551L447k740l018L224K072l328j592L291J218k971
2449a549q54L298N99k036q35K082O15j788o70J930J168j781p94J446J164j314
2465F81j683J439J677j080j564J747J903j984k235J748J755k724k025K822J856
$$ plain form
2480 2333 -998 -1891 1701 2447 -1452 -1875 734 1000 -2616 -2712 968 679 -2625 -1672 1729 102 -2812
2497 -2812 -1254 477 -534 -2378 -1556 359 -139 -1071 -84 480 293 -397 -188 351 129 -317 -399 546
2515 546 1553 605 -323 877 1983 740 -557 1236 1990 274 -915 1338 2285 -221 -614 2004
2531 2004 1861 -834 -875 1714 1156 -1648 -783 2017 648 -2282 -666 1160 -659 -2340 -507 770
2547 770 -1005 -1414 190 385 -1653 -1628 -509 -623 -1790 -1002 19 -288 -783 -355 -10 -338 -182 -477
2565 -477 -502 -5 502 -65 -296 932 1406 205 -171 1469 1623 -383 -837 1696 1551 -445 182 2701
2583 2701 1435 -574 352 1927 86 -1428 806 1953 -655 -931 1498 1014 -1989 -1587 996 416
2599 416 -1707 -409 1174 -590 -1939 -534 57 -1392 -1180 -681 -589 -1207 -483 -169 -889 -760 619 -274
$$ packed form
2480B333l331q93L592P46l899m23K609K66l616r6L680k89l304R53L401j627k914
2497b812J558J731j011j844Q22J915m98r32R87N64j87o90K09N39k22m46q2R45
2515E46J007r48r28J200J106j243j297J793P54j716j189K253R47k506l93K618
2531B004j43k695m1K589n58k804Q65K800j369k930J616J826j819j681J833J277
2547G70j775m09J604J95k038K5J119j14j167P88J021l07m95M28L45l28J56k95
2565d77k5M97N07n67k31J228M74j201l76J640J54k006m54K533j45j996O27K519
2583B701j266k009R26J575j841j514K234J147k608k76K429m84l003M02K583n80
2599D16k123J298J583j764j349J405N91j449K12M99R2o18P24L14p20J29J379q93
$$ plain form
2617 -274 -1775 -604 535 -1183 -1493 935 1253 -469 -599 2147 1127 -1602 -392 1792 489 -1100
2633 -1100 1160 3283 312 -1082 1923 2657 -449 -1021 1840 2004 -1154 -643 1852 1156 -1020 -153
2649 -153 1712 542 -1054 -738 102 -13 -442 -549 -626 -298 -673 -955 -1265 -118 -687 -1775 -1174 1103
2667 1103 -195 -1776 -864 249 -1353 -2400 245 1656 -845 -1501 1123 1961 -1218 -1390 1587 1998
2683 1998 -1273 -965 2374 1781 -1246 -167 2754 1672 -829 333 1665 84 -788 926 1368 793
2699 793 424 1350 1013 239 175 181 -327 -543 53 5 -181 -341 -356 -915 -653 157 -454 -1624 -923 184 -481
2720 -481 -1564 -322 412 -1258 -2105 503 913 -1592 -2240 156 1119 -874 -1061 1474 1048 -1846 -1213
2737 -1213 1335 1060 -1222 -505 2061 1614 -461 641 2424 777 -1435 532 2451 991 -753 649
$$ packed form
2617b74j501J171J139j718l10K428L18j722j30K746j020k729J210K184j303j589
2633a100K260K123k971j394L005P34l106n72K861J64l158N11K495o96k176Q67
2649a53J865j170j596L16Q40j15m29j07p7L28l75k82l10J147n69j088O01K277
2667A103j298j581R12J113j602j047K645J411k501o56K624Q38l179j72K977M11
2683A998l271L08L339n93l027J079K921j082k501J162J332j581q72J714M42n75
2699G93l69R26l37p74o4On08k16N96m8j86j60j5n59K62Q10o11j170P01J107o65
2720d81j083J242P34j670q47K608M10k505o48K396R63j993j87K535m26k894O33
2737a213K548k75k282P17K566m47k075J102J783j647k212J967J919j460j744J402
$$ plain form
2753 649 1822 691 -279 1334 1744 -161 -1500 382 1909 -355 -2179 14 1403 -75 -1500 175
2769 175 1116 -1310 -2903 -174 1522 -937 -2778 -244 1289 -1139 -2337 577 1212 -2425 -2274 1575
2785 1575 1928 -2099 -2719 1175 1287 -2256 -1282 3141 1322 -2906 -444 3462 1529 -1951 -259 2731
2801 2731 557 -1375 963 2699 -34 -1691 1739 2999 229 -994 779 878 -410 29 1553 819
2817 819 -634 -222 1013 420 -178 -556 -1187 -1122 291 281 -839 -1235 -387 -679 -1088 -241 605 -1543 -2311
2836 -2311 -423 746 -1190 -1471 295 342 -1867 -1097 1785 703 -2305 -1507 1793 1590 -616 -17 1333
2853 1333 197 -1307 792 1987 252 -886 428 2216 1808 378 629 795 120 -383 930 2046
2869 2046 690 -1276 -451 1894 1649 -784 -977 512 -36 -1784 -317 1779 -557 -2934 -355 2444
$$ packed form
2753F49J173j131r70J613M10j905j339J882J527k264j824K193J389j478j425J675
2769A75R41k426j593K729J696k459j841K534J533k428j198K914O35l637J51L849
2785A575L53m027o20L894J12l543R74M423j819m228K462L906j933l480J692K990
2801B731k174j932K338J736k733j657L430J260k770j223J773R9j288M39J524p34
2817H19j453M12J235n93n98l78o31O5J413j0j120l96Q48k92m09Q47Q46k148p68
2836b311J888J169j936k81J766M7k209P70K882j082l008P98L300k03k206N99J350
2853A333j136j504K099J195j735j138J314J788m08j430K51J66o75n03J313J116
2869B046j356j966Q25K345k45k433j93J489n48j748J467K096k336k377K579K799
$$ plain form
2885 2444 -83 -2562 -775 1029 -2358 -3037 1184 1497 -2935 -3392 1686 1971 -2509 -1794 1906 145
2901 145 -3045 -176 3312 -13 -3491 -276 2970 393 -1410 1261 1919 -942 -1089 2758 2386 -985
2917 -985 -1286 1571 1902 0 614 1562 226 -808 796 2460 625 -845 -346 3 378 51 -53
2934 -53 -146 -896 -914 -99 602 -144 -996 -1574 -669 396 -320 -852 -1137 -769 -872 -125 259 -426 -1477 -1147
2954 -1147 79 335 -9 -262 -732 -542 330 999 509 154 166 -25 -444 1114 1608 266 -1138 443
2972 443 2117 1277 -304 811 1389 -234 -446 1980 1634 -1216 -1276 1673 1159 -1009 -328 1466 -65
2989 -65 -1912 35 1858 72 -2496 -858 1411 -340 -1500 6 58 -1641 -1802 710 988 -1433
3005 -1433 -2136 -180 424 -934 -833 37 118 -1472 -567 1378 952 -885 -694 741 366 -81 649 930
$$ packed form
2885B444k527k479J787J804l387o79M221L13m432m57N078K85m480P15L700j761
2901A45l190K869L488l325l478L215L246k577j803K671O58k861j47L847l72l371
2917i85l01K857L31j902O14R48j336j034J604J664j835j470M99L49L75l27j04
2934e3r3p50j8Q15P01p46q52n78R05J065p16n32k85L68j03P47L84o85j051L30
2954a147J226K56l44k53m70J90Q72O69m90l55J2j91m19J558M94j342j404J581
2972D43J674q40j581J115N78j623k12K426l46k850o0K949n14k168O81J794j531
2989f5j847J947J823j786k568J638K269j751j160J506N2j699j61K512K78k421
3005a433p03J956O04j358J01Q70Q1j590R05J945m26j837J91J435l75m47P30K81
$$ plain form
3023 930 -24 -252 1065 1914 683 -124 528 1223 332 636 1142 760 -626 -72 1434 1228 -166 104
3041 104 426 3 -46 610 388 -510 -763 -92 19 -244 -829 -686 -908 -704 -145 -48 -938 -1470 -622 -153 -586
3062 -586 -610 130 -311 -912 -434 200 209 -470 -333 -37 581 25 31 125 -115 2 768 1173 532 -299 258 1093
3084 1093 142 -157 490 1362 396 -224 1240 1984 434 -494 695 1147 -209 -412 800 598 -479 -523
3102 -523 793 482 -1007 -843 507 -346 -1537 -808 318 -615 -1365 -640 381 -188 -1482 -850 186
3119 186 -735 -1597 -64 568 -736 -1152 234 816 -206 -986 -70 737 113 -493 374 873 581 -287 419
3138 419 1105 746 33 562 1117 988 471 921 939 650 380 208 823 71 30 293 586 347 41 136 358
3159 358 -168 -768 -305 226 -541 -1445 -542 400 -120 -1342 -522 228 -236 -1451 -821 230 -753 -1635 -833
$$ packed form
3023I30r54k28J317Q49j231q07O52O95q91L04N06l82j386N54J506k06j394K70
3041A04L22m23m9O56k22q98k53O71J11k63n85J43k22K04N59R7q90n32Q48M69m33
3062e86k4P40m41o01M78O34Ro79J37K96O18n56OR4k40J17P66M05o41q31N57Q35
3084A093r51k99O47Q72r66o20J464P44j550r28J189M52j356k03J212k02j077m4
3102e23J316l11j489J64J350q53j191P29J126r33p50P25J021n69j294O32J036
3119A86r21q62J533O32j304m16J386N82j022p80R16Q07o24o06Q67M99k92q68P06
3138D19O86l59p13N29N55j29n17M50J8k89k70j72O15p52m1K63K93k39l06R5K22
3159C58n26o00M63N31p67r04R03R42n20j222Q20P50m64j215O30J051r83q82Q02
$$ plain form
3178 -833 515 -213 -1157 -214 621 -689 -1077 129 828 -631 -485 415 756 -147 159 1088 1126 297 171
3197 171 1228 1040 -202 93 988 853 118 126 828 953 313 -265 577 1274 119 -606 127 399 -707
3216 -707 -1308 -119 446 -250 -1062 202 534 -984 -1234 -310 -400 -1177 -1245 446 -109 -1373 -692 863 -657
3235 -657 -1604 -221 869 -144 -1287 140 1181 72 -542 637 1381 -151 -704 753 1085 -239
3251 -239 -82 1177 1084 320 551 850 1076 89 238 516 772 515 224 745 670 34 -527 -72 350 53
3271 53 -956 -2 955 -383 -1038 -140 552 -604 -1753 -800 354 -1031 -1570 37 386 -806 -958 353
3289 353 246 -1189 -1244 -85 375 -959 -719 836 413 -618 -335 827 57 -224 426 857 295 83
3307 83 651 1136 383 281 658 880 600 302 592 702 541 403 291 505 968 5 -384 215 779 -140
$$ packed form
3178h33J348p28r44R43Q35j310l88J206O99j459J46R00L41r03L06R29L8q29j26
3197A71J057j88j242K95Q95j35p35QP02J25o40n78Q42O97j155p25P33K72j106
3216g07o01J189N65o96q12J264L32j518k50R24r0p77o8J691n55j264O81J555j520
3235f57r47J383J090j013j143J427J041j109o14J179P44j532n53J457L32j324
3251b39J57J259r3p64K31K99K26r87J49K78K56k57k91N21p5o36n61M55M22k97
3271E3j009R54R57j338o55Q98O92j156j149R53J154j385n39J607L49j192j52J311
3289C53j07j435n5J159M60j334K40J555m23j031K83J162p70k81O50M31n62k12
3307H3N68M85p53j02L77K22k80k98K90J10j61j38j12K14M63r63l89N99N64r19
$$ plain form
3327 -140 -825 426 801 -519 -975 242 66 -1425 -1070 445 79 -1437 -843 934 -372 -1737 -521
3344 -521 236 -834 -1392 414 525 -1207 -1041 644 660 -846 -625 822 114 -743 287 1557 574 -364
3362 -364 782 1164 52 116 958 1077 203 478 1045 576 50 631 799 478 380 813 268 -436 -35 549
3382 549 -424 -278 835 -247 -881 -15 376 -569 -1299 -217 -86 -1022 -905 213 -93 -1522 -659 -40
3400 -40 -640 -1161 -30 277 -620 -610 709 33 -972 -725 628 300 -462 336 937 -295 -77 777 638
3419 638 -70 218 1317 133 158 1154 1394 -151 -143 1219 444 -626 329 1422 -161 -833 884 1318
3437 1318 -745 -963 734 745 -1082 -698 638 -158 -1745 -577 1155 -505 -1775 -552 362 -952
3453 -952 -1050 190 372 -1212 -1182 594 47 -1253 -704 84 -115 -597 194 585 -260 -319 992 886 213
$$ packed form
3327a40o85J251L75j320m56J217j76j491L55J515l66j516N94J777j306j365J216
3344e21P57j070n58J806J11j732J66J685J6j506K21J447p08q57J030J270r83r38
3362c64J146L82j112O4Q42J19q74K75N67m69n26N81J68l21r8M33n45p04M01N84
3382E49r73J46J113j082o34Q66L91r45p30J082J31r36J17J118l06j429Q63O19
3400d0o00n21J131L07q97J0J319o76j005K47J353l28p62P98O01j232K18Q54j39
3419F38p08K88J099j184K5R96K40j545QJ362p75j070R55J093j583o72J717M34
3437A318k063k18J697J1j827L84J336p96j587J168J732j660j270J223R14j314
3453i52r8J240J82j584L0J776n47j300N49P88j99m82P91L91q45n9J311j06o73
$$ plain form
3472 213 182 333 61 -99 463 1031 379 25 599 654 959 560 528 193 143 116 797 435 382 -367 -143 231
3494 231 432 -215 -365 -219 -333 -561 95 428 -256 -1187 -630 114 -436 -1129 -750 -20 -1044 -1172 388
3513 388 579 -911 -1272 363 422 -824 -517 417 -219 -947 94 1548 168 -1347 -52 1090 16
3530 16 -306 894 1135 -540 -294 2013 1450 -479 -546 1222 1096 -31 268 1740 -27 -1042 793
3547 793 1781 266 -1248 37 995 -436 -284 1030 146 -1421 -705 929 369 -977 -737 -39 -642
3564 -642 -1239 28 624 -936 -1516 -179 764 -240 -1014 -743 -462 -700 -420 584 335 -1144 -642 273
3582 273 876 267 170 378 -45 473 735 1031 755 -1 -377 769 990 382 122 133 496 194 791 828 -3
3603 -3 -388 -186 604 377 56 124 -332 -883 51 641 -57 -983 -856 -22 -478 -404 68 -113 -1278 -878 455
$$ packed form
3472B13l1J51k72j60N62N68o52l54N74N5L05l99l2l35n0k7O81l62n3p49K24L74
3494B31K01o47j50J46j14k28O56L33o84r31N57P44n50o93L79P30j024j28J560
3513C88J91j490l61J635N9j246L07R34o36p28J041J454j380j515J295J142j074
3530A6l22J200K41j675K46K307n63j929o7J768j26j127K99J472j767j015J835
3547G93R88j515j514J285R58j431J52J314q84j567P16J634n60j346K40O98o03
3564f42n97J267N96j560n80J337R43j004p74K71K81k38K80J004k49j479N02R15
3582B73O03o09r7K08m23N18K62K96k76p56l76J146K21o08k60J1L63l02N97L7q31
3603cl85K02P90k27l21O8m56n51R34N90o98r26J27Q34m56P4M72j81j165M00J333
$$ plain form
3624 455 210 -1102 -1517 32 -117 -741 -246 857 -340 -1444 -30 1416 27 -1425 164 885 -215
3641 -215 -359 1485 1214 -939 -530 1673 1331 -456 151 1333 720 -224 824 2179 626 -1269 201
3658 201 1778 156 -605 316 497 -164 -402 989 862 -1061 -1295 -148 477 -412 -620 -154 -324 -1078
3676 -1078 -469 732 -216 -1397 -1104 -286 -44 -491 -565 -53 -423 -515 36 653 189 -1131 -554 768 331
3695 331 -44 283 560 -238 17 1102 1121 -248 -55 696 1146 -60 488 1296 307 -410 698 1632 460
3714 460 -653 60 979 -7 -248 1020 93 -1054 -723 481 170 -728 -625 -217 -308 -653 -37 -92 -965
3733 -965 -959 -305 -99 -401 -435 -356 -715 -982 136 340 -577 -947 -228 -146 -358 -100 296 69 -75 366 968
3754 968 399 -108 -123 167 715 388 335 1011 328 3 635 1220 801 -279 215 643 628 -183 325 335 -44
$$ packed form
3624D55k45j312m15J549j49o24M95J103j197j104J414J446j389j452J589P21j100
3641b15j44J844k71k153M09K203l42j787O07J182o13r44J048J355j553j895J470
3658B01J577j622p61R21J81o61k38J391j27j923k34J147O25q89k08M66j70p54
3676a078O09J201r48j181K93Q18K42m47p4N12l70r2N51O17m64j320N77J322m37
3695C31l75L27K77p98K55J085J9j369J93P51M50j206N48Q08r89p17J108R34j172
3714D60j113P13R19r86k41J268r27j147L31J204l11q98J03M08r1l45O16n5q73
3733i65OO54K06l02l4P9l59k67J118K04r17l70P19Q2k12K58L96k27j44M41O02
3754I68n69n07j5K90N48l27n3O76o83l25O32N85m19j080M94M28j5q11N08J0l79
$$ plain form
3775 -44 -440 254 863 -10 -730 -64 96 -296 -368 -221 -109 -1238 -839 177 -482 -1221 -757 278 -66 -988
3795 -988 -169 258 -590 -1307 -153 246 -357 -506 220 380 -4 -145 449 292 -310 -349 557 767 408 291
3815 291 467 552 152 250 662 394 17 195 392 852 278 317 985 73 28 169 490 -204 -388 232 277 -329
3837 -329 -702 -181 -10 -568 -593 -104 -155 -750 -710 -301 143 -857 -549 -162 -231 -744 -481 -174 -144 -596 -205
3858 -205 243 -31 -232 61 -11 -341 -66 517 581 112 355 399 666 554 346 322 546 380 308 763 340 450
3880 450 509 324 129 362 584 88 -1 213 13 -76 76 -69 -149 -317 69 196 -486 -752 -202 -344 -468
3901 -468 -702 -226 -177 -413 -744 -564 -322 -257 -340 -475 -368 -488 -147 -160 -71 127 44 242 -412 15 281 79
3923 79 68 302 691 174 303 498 332 463 896 526 401 644 543 259 146 168 61 176 113 535 256
$$ packed form
3775d4l96O94O09q73p20O66J60l92p2J47J12j129L99J016o59p39M64J035l44r22
3795i88Q19M27q48p17J154L99o03j49P26J60l84j41N94j57o02l9R06K10l59j17
3815B91J76Q5m00R8M12k68l77J78J97M60n74L9O68r12m5J41L21o94j84O20M5o06
3837c29l73N21J71n58k5M89n1n95M0M09M44j000L08L87o9n13K63L07L0m52L91
3858b05M48k74k01K93p2l30K75N83O4m69K43M4K67j12k08k4K24j66p2M55m23J10
3880D50N9j85j95K33K22m96q9K14k00q9J52j45q0j68L86J27o82k66N50j42j24
3901d68k34M76M9k36l31J80K42O5q3j35J07j20L41j3Q9J98q3J98o54M27K66k02
3923G9j1K34L89n17J29J95j66J31M33l70j25K43j01k84j13K2j07J15o3M22k79
$$ plain form
3944 256 -37 164 155 -8 -87 79 121 -470 -488 -239 -378 -645 -613 -72 -664 -788 -578 -236 -127 -611 -81 56
3966 56 -162 -626 -92 -230 -357 -492 148 263 -261 -306 407 311 22 124 436 156 215 527 318 80 272
3987 272 411 496 276 531 351 582 426 407 315 204 605 315 -288 177 181 -127 -197 -30 16 -416 -319 -403 -193
4010 -193 -645 -447 -363 -288 -539 -702 -278 -342 -728 -228 -25 -381 -476 -338 -575 -186 -61 223 -73 -178 -36
4031 -36 235 -70 -71 549 281 122 471 596 487 214 630 599 474 251 918 584 175 419 419 391 -71 432
4053 432 265 72 162 257 115 35 136 207 -227 -326 51 -54 -427 -456 -200 -129 -625 -908 -221 -280 -384 -429 -268
4076 -268 -318 -642 -500 -156 -375 -271 -106 -11 -348 -696 243 339 77 51 470 514 424 31 493 523 8 344
4098 344 761 779 126 -245 695 929 265 -105 319 419 -12 5 514 213 -299 30 341 211 -251 -40 -34
$$ packed form
3944B56k93K01rj63p9J66M2n91j8K49j39k67L2N41n92j24K10L42J09m84N30J37
3966E6k18m64N34j38j27j35O40J15n24m5P13r6k89J02L12k80N9L12k09k38J92
3987B72J39Q5k20K55j80K31j56j9r2j11M01k90o03M65Ml08p0J67M6m32R7q4K10
4010a93m52J98Q4P5k51j63M24o4l86N00K03l56r5J38k37L89J25K84k96j05J42
4031c6K71l05jO20k68j59L49J25j09k73M16l1j25k23O67l34m09K44%k8m62N03
4053D32j67j93R0R5j42q0J01P1m34r9L77j05l73k9K56P1m96k83O87n9j04m5J61
4076b68n0l24J42L44k19J04J65R5l37l48R39R6k62k6M19M4r0l93M62L0n15L36
4098C44M17J8o53l71R40K34o64l70M24J00m31J7N09l01n12L29L11j30m62K11O
$$ plain form
4119 -34 -362 -585 228 289 -503 -926 -394 85 -380 -704 -297 -285 -470 -534 -39 -120 -525 -585 10 453 -97 -99 208
4142 208 -118 -97 -46 876 306 -482 -61 946 146 50 438 656 -188 -305 860 893 39 -92 688 634 -103
4163 -103 205 964 523 -387 191 502 -57 -385 -144 189 107 -122 547 98 -670 -615 171 -104 -611 -510 -295
4184 -295 -220 -697 -73 -10 47 -626 -299 220 131 -179 -43 -241 -452 -61 598 -202 -659 -208 443 488 288 122
4206 122 648 121 151 514 622 10 -95 399 673 457 310 544 133 122 57 660 764 -182 -615 311 173
4227 173 -55 174 467 -75 -913 -267 586 -109 -1202 -291 224 -661 -819 -6 -25 -1180 -1287 457 285
4246 285 -1038 -951 108 -304 -587 -122 638 -178 -948 -157 804 -10 -520 30 568 10 -115 988 796
4265 796 -427 -579 789 1078 -6 370 1117 392 -133 741 1248 133 -809 -314 663 451 -91 -167 29
$$ packed form
4119c4l28k23Q13O1p92m23N32M79m65l24M07J2j85o4M95q1m05o0N95M43n50kL07
4142B08l26K1N1R22n70p88M21J007q00r6L88K18q44j17J165L3q54j31P80n4p37
4163a03L08P59m41r10N78L11n59l28K41L33q2k29O69m49p68N5P86k75n07J01K15
4184b95P5m77O24O3N7o73L27N19q9l10J36j98k11L91O59q00m57M51O51M5k00j66
4206A22N26n27L0L63J08o12j05M94K74k16j47K34m11j1o5O03J04r46m33R26j38
4227A73k28K29K93n42q38O46Q53o95j093R11N15q85j58Q13j9j155j07J744j72
4246B85j323Q7J059m12k83M65P60q16p70P91R61q14n10N50N38n58j25J103j92
4265G96j223j52J368K89j084L76P47p25n25Q74N07j115r42M95R77k12n42p6J96
$$ plain form
4284 29 -189 -306 661 626 -370 -1131 -225 140 -498 -384 -63 -439 -1142 -709 316 374 -1200 -849 15 198
4304 198 -406 -485 200 -362 -435 54 511 -553 -407 133 157 75 130 506 43 -468 231 1205 542 -171 196
4325 196 692 511 174 570 661 172 -383 583 330 -243 -159 441 -64 -541 277 588 -295 -1072 -409 173 -96
4346 -96 -358 -451 -85 -577 -532 163 22 -897 -948 34 107 -582 -578 189 -746 -920 203 263 152 -793 -185 235
4368 235 240 -455 26 -73 -252 -648 633 1113 -27 -526 575 711 6 523 732 374 -344 -120 1138 858
4388 858 -494 -176 739 410 -221 349 698 -330 -801 96 645 -229 -977 -249 488 -523 -395 338 -75
4407 -75 -1202 -830 458 -26 -586 -654 -15 -295 -610 -133 183 -339 -660 -356 266 -181 -449 131 106 -365
4427 -365 55 820 464 -267 -156 627 850 36 101 108 363 106 171 905 38 -51 205 762 450 138 296 496
$$ packed form
4284B9k18j17R67l5r96p61R06L65o38J14L21l76p03M33J025N8j574L51Q64J83
4304A98o04p9O85n62p3M89M57j064J46N40K4q2N5L76m63n11O99R74o63p13L67
4325A96M96j81l37L96R1m89n55R66k53n73Q4O00n05m77Q18L11q83p77O63N82k69
4346i6k62r3L66m92M5O95j41r19n1R82P3o89MP67r35j74J123O0j11r45O08M20
4368B35No95M81r9j79l96J281M80j140m99J101J36p05N17K09l58p18K24J258k80
4388H58j352L18R15l29o31N70L49j028m71Q97N49q74p48P28P37j011J28P33m13
4407g5j127L72J288m84n60o8O39k80l15M77L16n22l21L04O22m47k68N80k5m71
4427c65M20P65l56p31J11P83K23q14O5PK55k57O5P34q67q9K56N57l12l12J58K00
$$ plain form
4449 496 -253 138 517 240 -427 -190 397 72 -204 -318 133 -267 -938 -35 193 -364 -737 -650 -313 -361 -212
4470 -212 -139 -100 -720 -480 232 -193 -425 -433 -38 -128 8 -127 446 -236 -301 313 698 372 -157 484 315 -86
4492 -86 91 347 868 269 62 496 954 335 266 175 575 72 4 553 -33 -183 26 532 40 -146 -121 -90
4514 -90 -364 -409 208 -188 -646 -539 -194 131 -213 -633 -199 -290 -630 54 118 -323 -426 118 34 -40 -424 17
4536 17 124 -182 9 269 51 -154 98 405 294 -93 328 264 228 319 445 472 457 196 206 374 -29 206
4558 206 390 131 -13 262 321 272 -20 -193 74 281 -194 -215 -64 -39 -275 182 -18 -193 -244 -193 -287 -391
4580 -391 -389 -250 -327 -587 -412 -192 -71 -205 -204 -195 -111 -290 -463 128 193 -114 -229 475 164 213 108 371 348 198
4604 198 216 390 432 -82 81 514 650 142 132 472 441 167 209 400 41 -204 193 287 55 -76 109 -64
$$ packed form
4449D96p49L91L79k77o67K37N87l25k76j14M51m00o71R03K28n57l73Q7L37m8J49
4470b12P3L9o20K40P12m25k32qL95r0J36j35N73o82o5O14L85l26n29O41j69m01
4492h6J77K56N21n99k07M34M58o19o9r1M00n03o8N49n86j50K09N06m92j86K5L1
4514i0k74m5O17l96m58J07L45L25l44m20M34r1l40O84O4m41j03N44q4p4l84M41
4536A7J07l06J91K60k18k05K52L07j11l87M21o4l6R1J26K7j5k61J0J68m03K35
4558B06J84k59j44K75N9m9k92j73K67K07m75k1J51K5k36M57k00j75n1N1r4j04
4580c91KJ39p7k60J75K20J21j34JRQ4j79j73N91O5l07j15P04l11M9j05K63k3j50
4604A98J8J74M2n14J63M33J36n08j0L40l1k74M2J91l59k45L97R4k32j31J85j73
$$ plain form
4626 -64 -92 -398 -168 212 -195 -76 -270 -72 -354 -510 -350 -240 -291 -271 -418 -37 -491 -304 -328 -38 -12 -4 -232
4649 -232 417 184 -30 -43 43 88 104 343 2 1 134 322 329 160 136 411 547 280 119 575 257 221 -41
4672 -41 74 16 38 31 91 -14 102 -210 366 -163 -311 -178 -80 -395 -158 -316 -109 -160 -219 -219 -439 -139 -343 -401
4696 -401 -93 -294 -603 -513 -263 -32 -49 -148 69 184 -117 -38 102 128 -164 135 520 458 -12 265 536 262
4718 262 72 -5 327 248 227 358 539 302 150 419 69 258 199 63 26 -131 -284 54 181 77 -32 -34
4740 -34 -46 206 -287 -44 -332 -434 -234 -376 -76 -17 -551 -310 -68 -306 -483 -346 26 -268 -39 -186 -44
4761 -44 -113 -122 -76 -10 81 156 228 305 36 340 413 63 143 247 184 329 499 95 500 335 617 177 -89 684
4785 684 94 33 4 315 105 -310 -25 197 221 -185 -28 -26 -203 -141 -307 -305 -341 -210 -286 -241 -561 -508 -338 -512
$$ packed form
4626f4k8l06K30L80m07J19j94J98k82j56J60J10n1K0j47L81m54J87k4K90K6Qk28
4649b32O49k33k14j3Q6M5J6K39l41jJ33J88Pj69k4K75J36k67j61M56l18l6k62
4672d1J15n8K2pO0j05J16l12N76n29j48J33R8l15K37j58K07n1n9%k20L00k04n8
4696d01L08k01l09R0K50K31j7r9K17J15l01P9J40K6k92K99L85o2m70K77K71k74
4718B62j90p7L32p9k1J31J81k37j52K69l50J89n9j36l7j57j53L38J27j04j09k
4740c4j2K52m93K43k88j02K00j42L00N9n34K41K42k38j77J37L72k94K29j47J42
4761d4o9rM6O6R1P5P2P7k69L04P3l50Q0J04o3J45J70m04M05j65K82m40k66P73
4785F84n90o1k9L11k10m15K85K22K4m06J57Kj77O2j66Kl6J31p6M5l20N3J70j74
$$ plain form
4809 -512 -503 -257 68 -62 -482 -304 -8 -75 -240 -103 323 51 9 77 262 309 256 338 447 422 151 202 305
4832 305 173 73 4 300 277 461 329 428 -187 -76 154 248 -185 -310 458 35 -249 27 45 -310 -480 -84
4854 -84 138 -57 -441 -398 -45 -627 -532 -98 -110 -401 -611 10 -119 -219 -266 -328 20 -169 34 143 -307 -261
$$ packed form
4809e12RK46L25j30m20J78K96o7j65J37M26k72m2O8J85M7n3Q2J09k5k71N1J03
4832C05j32j00o9K96k3J84j32R9o15J11K30R4m33j25P68m23k84K76J8l55j70L96
4854h4K22j95l84M3L53n82R5M34j2k91k10O21j29j00m7o2L48j89K03J09m50M6
$$ [...]
8191a70
##END NTUPLES=NMR FID
##END=
