##TITLE=1H_DHA-DCC-f2
 CDCl3, 8 sc, 
 5.4.2019
##JCAMPDX= 6.0         $$ Bruker NMR JCAMP-DX V2.0
##DATA TYPE= NMR FID
##DATA CLASS= NTUPLES
##ORIGIN= UXNMR, Bruker Analytische Messtechnik GmbH
##OWNER= root
$$ XWIN-NMR		Version 3.5
$$ Fri Apr  5 14:38:44 2019 Russian Standard Time (UT+4h)  she@DPX200
##.OBSERVE FREQUENCY= 200.1316
##.OBSERVE NUCLEUS= ^1H
##.DELAY= (6, 6)
##.ACQUISITION MODE= SIMULTANEOUS
##.ACQUISITION SCHEME= undefined
##.AVERAGES= 8
##.DIGITISER RES= 18
##SPECTROMETER/DATA SYSTEM= spect
##.PULSE SEQUENCE= zg30
##.SOLVENT NAME= CDCl3
##.SHIFT REFERENCE= (INTERNAL, CDCl3, 0, 15.7039)
##AUDIT TRAIL= $$ (NUMBER, WHEN, WHO, WHERE, WHAT)
$$ ##TITLE= Audit trail, XWIN-NMR		Version 3.5
$$ ##JCAMPDX= 5.01
$$ ##ORIGIN= Bruker BioSpin GmbH
$$ ##OWNER= she
$$ F:/spectra/data/she/nmr/H-F/1/audita.txt
$$ ##AUDIT TRAIL=  $$ (NUMBER, WHEN, WHO, WHERE, WHAT)
(   1,<2019-04-05 14:37:14.26 +0400>,<she>,<DPX200>,
      <created by zg, POWCHK disabled, PULCHK disabled
       configuration hash MD5:
       00 E9 B6 7A A2 85 ED C7 34 08 36 98 17 FE 4E 26
       data hash MD5: 16K
       CB 33 F3 04 20 A1 3A 04 59 4C 19 29 29 F8 85 55>)
$$ ##END=
$$ 
$$ hash MD5
$$ 31 AB 12 AD 36 B8 46 2D 4F AD 9C 5F CD ED 57 2D
##$RELAX= 
##$RELAX= 
##$RELAX= 
##$RELAX= 
##$RELAX= 
##$RELAX= 
$$ Bruker specific parameters
$$ --------------------------
##$DU= <F:/spectra>
##$EXPNO= 1
##$NAME= <H-F>
##$PROCNO= 1
##$TYPE= <nmr>
##$USER= <she>
##$AMP= (0..31)
100 100 100 100 100 100 100 100 100 100 100 100 100 100 100 100 100 100 
100 100 100 100 100 100 100 100 100 100 100 100 100 100 
##$AQSEQ= 0
##$AQ_mod= 1
##$AUNM= <au_zg>
##$AUTOPOS= <>
##$BF1= 200.13
##$BF2= 200.13
##$BF3= 200.13
##$BF4= 200.13
##$BF5= 200.13
##$BF6= 200.13
##$BF7= 200.13
##$BF8= 200.13
##$BYTORDA= 1
##$CFDGTYP= 0
##$CFRGTYP= 5
##$CHEMSTR= <none>
##$CNST= (0..31)
1 1 145 1 1 1 1 1 1 1 1 1 1 1 1 1 1 1 1 1 1 1 1 1 1 1 1 1 1 1 1 1 
##$CPDPRG= <>
##$CPDPRG1= <>
##$CPDPRG2= <>
##$CPDPRG3= <>
##$CPDPRG4= <mlev>
##$CPDPRG5= <mlev>
##$CPDPRG6= <mlev>
##$CPDPRG7= <mlev>
##$CPDPRG8= <mlev>
##$CPDPRGB= <>
##$CPDPRGT= <>
##$D= (0..31)
0 1.2 0 0 0 0 0 0 0 0 0 0.03 0 0 0 0 0 0 0 0 0 0 0 0 0 0 0 0 0 0 0 0 
##$DATE= 1554460633
##$DBL= (0..7)
120 120 120 120 120 120 120 120 
##$DBP= (0..7)
150 150 150 150 150 150 150 150 
##$DBP07= 0
##$DBPNAM0= <>
##$DBPNAM1= <>
##$DBPNAM2= <>
##$DBPNAM3= <>
##$DBPNAM4= <>
##$DBPNAM5= <>
##$DBPNAM6= <>
##$DBPNAM7= <>
##$DBPOAL= (0..7)
0.5 0.5 0.5 0.5 0.5 0.5 0.5 0.5 
##$DBPOFFS= (0..7)
0 0 0 0 0 0 0 0 
##$DE= 6
##$DECBNUC= <off>
##$DECIM= 24
##$DECNUC= <off>
##$DECSTAT= 4
##$DIGMOD= 1
##$DIGTYP= 9
##$DL= (0..7)
0 120 120 120 120 120 120 120 
##$DP= (0..7)
150 150 150 150 150 150 150 150 
##$DP07= 0
##$DPNAME0= <>
##$DPNAME1= <>
##$DPNAME2= <>
##$DPNAME3= <>
##$DPNAME4= <>
##$DPNAME5= <>
##$DPNAME6= <>
##$DPNAME7= <>
##$DPOAL= (0..7)
0.5 0.5 0.5 0.5 0.5 0.5 0.5 0.5 
##$DPOFFS= (0..7)
0 0 0 0 0 0 0 0 
##$DQDMODE= 0
##$DR= 18
##$DS= 0
##$DSLIST= <SSSSSSSSSSSSSSS>
##$DSPFIRM= 0
$$ [...]
##$SUBNAM2= <"">
##$SUBNAM3= <"">
##$SUBNAM4= <"">
##$SUBNAM5= <"">
##$SUBNAM6= <"">
##$SUBNAM7= <"">
##$SUBNAM8= <"">
##$SUBNAM9= <"">
##$SW= 24.9336934301222
##$SWIBOX= (0..15)
0 0 2 0 0 0 0 0 0 0 0 0 0 0 0 0 
##$SW_h= 4990.01996007984
##$TD= 16384
##$TD0= 1
##$TE= 0
##$TE2= 300
##$TE3= 300
##$TEG= 300
##$TL= (0..7)
0 120 120 120 120 120 120 120 
##$TP= (0..7)
150 150 150 150 150 150 150 150 
##$TP07= 0
##$TPNAME0= <>
##$TPNAME1= <>
##$TPNAME2= <>
##$TPNAME3= <>
##$TPNAME4= <>
##$TPNAME5= <>
##$TPNAME6= <>
##$TPNAME7= <>
##$TPOAL= (0..7)
0.5 0.5 0.5 0.5 0.5 0.5 0.5 0.5 
##$TPOFFS= (0..7)
0 0 0 0 0 0 0 0 
##$TUNHIN= 0
##$TUNHOUT= 0
##$TUNXOUT= 0
##$USERA1= <user>
##$USERA2= <user>
##$USERA3= <user>
##$USERA4= <user>
##$USERA5= <user>
##$V9= 5
##$VALIST= <valist>
##$VCLIST= <CCCCCCCCCCCCCCC>
##$VD= 0
##$VDLIST= <DDDDDDDDDDDDDDD>
##$VPLIST= <PPPPPPPPPPPPPPP>
##$VTLIST= <TTTTTTTTTTTTTTT>
##$WBST= 1024
##$WBSW= 4
##$XGAIN= (0..3)
0 0 0 0 
##$XL= 0
##$YL= 0
##$YMAX_a= 378466
##$YMIN_a= -510840
##$ZGOPTNS= <>
##$ZL1= 120
##$ZL2= 120
##$ZL3= 120
##$ZL4= 120
##$ABSF1= 10
##$ABSF2= 0
##$ABSG= 5
##$ABSL= 3
##$ALPHA= 0
##$AQORDER= 0
##$ASSFAC= 0
##$ASSFACI= 0
##$ASSFACX= 0
##$ASSWID= 0
##$AUNMP= <proc_1d>
##$AZFE= 0.1
##$AZFW= 0.1
##$BCFW= 1
##$BC_mod= 2
##$BYTORDP= 1
##$COROFFS= 0
##$CY= 11.3945322036743
##$DATMOD= 1
##$DC= 2
##$DFILT= <>
##$DTYPP= 0
##$F1P= 18.9103706918063
##$F2P= -1.10871071338519
##$FCOR= 0.5
##$FTSIZE= 0
##$FT_mod= 4
##$GAMMA= 1
##$GB= 0.15
##$INTBC= 1
##$INTSCL= 1
##$ISEN= 128
##$LB= 0.24
##$LEV0= 0
##$LPBIN= 0
##$MAXI= 10000
##$MC2= 0
##$MEAN= 0
##$ME_mod= 0
##$MI= 1.114404
##$NCOEF= 0
##$NC_proc= 0
##$NLEV= 6
##$NOISF1= 3.799351
##$NOISF2= 2.8
##$NSP= 1
##$NTH_PI= 0
##$NZP= 0
##$OFFSET= 15.70392
##$PC= 1
##$PHC0= -8855.087
##$PHC1= 16.80028
##$PH_mod= 1
##$PKNL= yes
##$PPARMOD= 0
##$PSCAL= 0
##$PSIGN= 0
##$REVERSE= no
##$SF= 200.130013532006
##$SI= 16384
##$SIGF1= 3
##$SIGF2= 2
##$SINO= 400
##$SIOLD= 16384
##$SREGLST= <1H.CDCl3>
##$SSB= 0
##$STSI= 0
##$STSR= 0
##$SW_p= 3612.71676300578
##$SYMM= 0
##$S_DEV= 0
##$TDeff= 0
##$TDoff= 0
##$TI= <>
##$TILT= no
##$TM1= 0
##$TM2= 0
##$TOPLEV= 0
##$USERP1= <user>
##$USERP2= <user>
##$USERP3= <user>
##$USERP4= <user>
##$USERP5= <user>
##$WDW= 1
##$XDIM= 8192
##$YMAX_p= 0
##$YMIN_p= 0
$$ End of Bruker specific parameters
$$ ---------------------------------
##NTUPLES= NMR FID
##VAR_NAME=  TIME,          FID/REAL,        FID/IMAG
##SYMBOL=    X,             R,               I
##VAR_TYPE=  INDEPENDENT,   DEPENDENT,       DEPENDENT
##VAR_FORM=  AFFN,          ASDF,            ASDF
##VAR_DIM=   8192,          8192,            8192
##UNITS=     SECONDS,       ARBITRARY UNITS, ARBITRARY UNITS
##FACTOR=    0.0002004,     1,               1
##FIRST=     0,             0,               0
##LAST=      1.6414764,     0,               0
##MIN=       0,             -510840,         0
##MAX=       1.6414764,     378466,          0
$$ Real data points
##PAGE= N=1
##DATA TABLE= (X++(R..R)), XYDATA
$$ [...]
2528a267o29L014J307j543j282O41o63j033q13J048K306J115q41K28K973k024
$$ -1267 -1896 1118 2425 882 -400 241 -422 -1455 -2268 -1220 1086 2201 1360 1588 4561 2537
2544B537m851N3L804k655m463N326O181n362m345P281K634j0512k409J0004m10
$$ 2537 -2314 -2261 1543 -1112 -5575 -249 5932 570 -3775 3506 6140 -4372 -6781 3223 2813
2559B813r937L215J1423m520j0382O460P902q986p209J0613O234r901k760J1391
$$ 2813 -7124 -3909 7514 2994 -7388 -928 6974 -2012 -9221 1392 7626 -2275 -5035 6356
2573F356R97j2232j114J0583j694j0353L589J1074j778q917K805Q617n071j0555
$$ 6356 7353 -4879 -5993 4590 2896 -7457 -3868 7206 5428 -3489 -684 7933 2862 -7693
2587g693L437Q559m044q225O011J0303o146r223O829Q359r860q564J0681Q215
$$ -7693 -4256 4303 259 -7966 -1955 8348 2202 -7021 -192 8167 -1693 -10257 424 8639
2601H639j1423n803J3657M161j4969k719J4447k58j4583M376J5346n297j2772
$$ 8639 -2784 -8587 5070 9231 -5738 -8457 5990 5732 -8851 -4475 10871 5574 -7198
2614g198P501J0336j1240j0311J0670O969j0450l693J2378L665j0972j955R257
$$ -7198 303 10639 -601 -10912 -242 6727 -3723 -7416 4962 8627 -2345 -4300 4957
2627D957q66j0194R0Q282o93n876J629P411j263o902P76N283q57n971J840O958
$$ 4957 4091 -6103 -6013 2269 1576 -4300 -2671 4740 3477 -3425 -2649 2634 1777 -4194 -2354 4604
2643D604j130o633K364N455l527o994M051O459m764l793P237L982p867k759O653
$$ 4604 3474 -3159 -795 4660 1133 -5861 -1810 4649 -115 -3908 3329 7311 -556 -3315 3338
2658C338j239q730J616P781k031n141N606M964n621l718M729L06o526J084N625
$$ 3338 2099 -6631 -5015 2766 735 -4406 1200 6164 543 -3175 1554 1860 -4666 -3582 2043
2673B043k277k720L960K783n103j060M398m99m490K576M952k824l127L506J146
$$ 2043 -234 -2954 1006 3789 -1314 -2374 2024 1525 -2965 -389 4563 1739 -1388 2118 3264
2688C264n614j481M539k99l443K358M814j325l860J572K459l867m544K471L724
$$ 3264 -2350 -3831 708 409 -3034 -676 4138 2813 -1047 525 2984 -883 -5427 -2956 768
2703G68k079k624M150M966l542m855L116M394n078n397N899N651n635m599P744
$$ 768 -1311 -3935 215 5181 1639 -3216 -100 4294 -784 -6181 -282 5369 -266 -4865 2879
2718B879L178q609l130R349J144r770K173J0887l295j1066M795R080q719r692
$$ 2879 6057 -2552 -5682 3667 4811 -4959 -2786 8101 4806 -6260 -1465 7615 -1104 -10796
2732a0796R064R263r669n734J2299N403j1919m828J0325J394j1785r70J1273Q65
$$ -10796 -1732 7531 -2138 -7872 4427 9830 -2089 -6917 3408 4802 -6983 -7953 3320 4185
2746D185q934J658R808k294r208K631P985l918p984M830Q702n193q411N328Q151
$$ 4185 -4749 -3091 6717 4423 -4785 -2154 5831 1913 -6071 -1241 7461 2268 -6143 -815 7336
2761G336p600q597Q645Q467q288o566J0225N813j1584n751J0242J825j1955kJ2514
$$ 7336 -264 -8861 -216 8251 -37 -6603 3622 9435 -2149 -7900 2342 4167 -7788 -7790 4724
2776D724m26r851M437J0581o825j0285O783P514r281o268J0115O365q975l988
$$ 4724 4298 -5553 -1116 9465 2640 -7645 -862 6652 -2629 -8897 1218 7583 -1392 -5380
2790e380R544K549r445k436Q601J346p273k23O614K61o698o88M300j079l365Q56
$$ -5380 4164 6713 -2732 -5168 3433 4779 -2494 -2717 3897 4158 -2540 -3228 1072 -7 -3372 -2516
2806b516M907J71l169J294K475k711m268J004K525k120j865M010L940k516j891
$$ -2516 2391 2562 -607 687 3162 451 -3817 -2813 -288 -2408 -4273 -263 3677 1161 -730
2821g30K831J096l642j823K153M7j307J393J811j400n20J716j104k173J339K623
$$ -730 2101 3197 -445 -2268 -115 -68 -1375 18 1829 429 -91 1625 521 -1652 -313 2310
2837B310j816j820K939J030l668k053K751o00k989J503L956p88j323L334J137
$$ 2310 494 -1326 1613 2643 -1025 -3078 -327 -927 -3916 -2413 1543 755 -568 2766 3903
2852C903m863k107L935m25n383J484O516k48n120K102O365k718o896J652O148
$$ 3903 -960 -3067 868 443 -4940 -3456 3060 2812 -2308 -206 6159 3441 -3455 -1803 4345
2867D345l350n837M071N766l685n917L881N020n151m499O194M577o039l471P249
$$ 4345 995 -4842 -771 4995 1310 -4607 -726 4294 -857 -5356 838 5415 -624 -4095 3154
2882C154K213r186l405Q578J183q902J004J1043Qr423K286R213m712j0430M560
$$ 3154 5367 -3819 -7224 1354 2537 -6365 -5361 5682 5690 -3733 -1447 7766 3054 -7376 -2816
2897b816Q363o198o753Q290P159q313n024Q971L262j0143k807J0419O91r815L33
$$ -2816 5547 -651 -7404 886 8045 -268 -5292 3679 6941 -3202 -6009 4410 5101 -4714 -4381
2912d381R575j470j0509J613R660k834q752N005R147l897q054M484O260o283p302
$$ -4381 5194 3724 -6785 -5172 4488 1654 -7098 -2093 7054 3157 -4897 -413 5847 -436 -7738
2927g738N421O067m933m068P601N148o922l633O776R74p858k042P300J092p290
$$ -7738 -2317 3750 -1183 -5251 2350 7498 576 -3057 3719 4693 -3165 -5207 2093 3185 -4105
2942d105J134P858j335p610K042O610l263o431M247O045n010m959M725L305n622
$$ -4105 -2971 4887 3552 -4058 -2016 4594 1331 -5100 -853 5192 182 -4777 -52 3253 -2369
2957b369l333N477K881m160o17N634Q93n032n42K967j567l826Q81L442j26j919
$$ -2369 -5702 -225 2656 -1504 -2121 3513 4406 -626 -1168 1799 232 -3594 -2713 729 603 -1316
2973a316K697K501j999j719J103m65k199o0R61j63n34J394M30j454j11J075k07
$$ -1316 1381 3882 1883 164 1267 802 -1397 -1457 -496 -659 -1193 201 631 -823 -934 141 -66
2990f6q32J247J717j931r78J570l13k410r26K285N09j630J932L634o44k649N06
$$ -66 -898 349 2066 135 -843 727 414 -1996 -2922 -637 -128 -1758 174 3808 3164 515 1021
3007A021K292l375l629J904L232k437k120M088L660l780l029L661K538o054k475
$$ 1021 3313 -62 -3691 -1787 1445 -992 -3112 976 4636 856 -2173 1488 4026 -2028 -4503
3022d503N876J860o237j296O786K01p036J98P397o85o813K870P674l447p104L557
$$ -4503 1373 3233 -3004 -4300 2486 2687 -4349 -4151 3246 2561 -4252 -1382 6292 2845 -4259 -702
3038g02N411n809o092O485N648n647l255Q339L102p660l081O338M39q486p98Q694
$$ -702 4709 -1100 -7192 -707 4941 -706 -3961 4378 7480 -180 -3261 3077 3516 -4970 -5768 2926
3054B926l7p939K410Q491k726q273L259P400m245p563M987P585o122p444O666
$$ 2926 2889 -5050 -2640 5851 3125 -5148 -1889 5511 1266 -6297 -1310 6275 153 -7291 -625
3069f25O368p552o038Q909N900p906l397R347K803j0427k851Q366K21r037J145
$$ -625 5743 -1809 -7847 1062 6962 -944 -4341 5006 7809 -2618 -5469 2897 3118 -5919 -4774
3084d774R063p84o822L674O192m346o321L519L938n777l017N407L196n023j583
$$ -4774 4289 3505 -3317 357 6549 2203 -4118 -599 3339 -2438 -5455 -48 3148 -1875 -3458
3099c458N288J030m928m82M703L62m068J37L824o16m369L1L274l60k693J160M420
$$ -3458 1830 2860 -2068 -2550 2153 2515 -1553 -1416 2408 1792 -2577 -2546 728 368 -2325 -1165 3255
3116C255J7k964P91K481j703m605O93K637k210j585K373L420j136j454J537L31
$$ 3255 3272 308 1099 3580 1877 -2728 -2035 602 -1608 -3193 -820 2600 1464 10 1547 1878
3132A878j992j287O05j66l88R87J12j055J578Q41k008j045K963J615l061J9L484
$$ 1878 -114 -1401 -796 -962 -1350 -363 -251 -1306 272 1113 -895 -1940 1023 2638 -423 -404 3080
3149C080r02m143j01L212j812k958L257L160k006j012L628J52m375r55K620j440
$$ 3080 2178 -1965 -2066 1146 -666 -3624 -367 2793 787 -225 3403 3555 -820 -1775 845 -595
3165e95l995J386M931j163k844K201L895k434m271K073L785l150l715K933M225
$$ -595 -4590 -3204 1727 564 -2280 -79 3816 1382 -2889 -816 2969 -181 -3896 -963 3262
3180C262l234m318L642M078l781l995N732M476n542l264O120J970p704k747P443
$$ 3262 28 -4290 -648 3430 -351 -4346 1386 5862 320 -2944 3176 5146 -2558 -5305 2138
3195B138L82q135J664R235p61p814K766P291n217p826M859N484o391m935Q029
$$ 2138 2520 -5615 -3951 5284 4523 -3291 -525 6766 1549 -6277 -1418 4066 -2325 -7260 769
3210G69L842o720j950P840L02p412K11P089j204o671J877O328k914o429K990N968
$$ 769 4611 -2109 -4059 3781 4083 -3329 -3118 3971 2767 -3904 -2027 4301 1387 -5042 -2052 3916
3226C916k776n401M205O202l038o098L546M207m794o102L815N180m633l671O586
$$ 3916 1140 -4261 -56 6146 3108 -2990 556 4763 -31 -6133 -2318 2862 -1771 -5442 1144
3241A144M641n931l042O083J321p922j016P070o74o631K270O885k244o247L902
$$ 1144 5785 -146 -3188 2895 4216 -3706 -4722 2348 1674 -4957 -2687 4198 1954 -4293 -391
3256c91N385m405l891M885K799m553k428M175K64m311p19L902K7k081J753K818
$$ -391 4994 589 -3302 1583 4382 -171 -2599 1576 1840 -2471 -3190 712 739 -1342 411 3229
3272C229j017k231J03P64k015j846O99J518m2m64J064K377k07k332K00J534j129
$$ 3229 2212 -19 84 848 -1167 -3013 -2314 -796 -838 -1302 -238 2139 1932 -400 -200 1334 205
3289B05j879N61K013p16j376J070J162j141l14J525O5p06R08M86j454l76L10j658
$$ 205 -1674 -1113 900 184 -1192 -122 1040 -101 -415 1110 1175 469 1377 1863 409 33 343 -1315
3307a315j581J931J492k122M18L988N8l765O39L319k756n241K859L701l490k379
$$ -1315 -2896 -965 527 -1595 -1177 2811 2869 -896 -257 3062 306 -4935 -2076 1625 -1865 -4244
3323d244N548L211m943j467M820M29n588K47M795r86m707J596L969j814l876K010
$$ -4244 1304 4515 -428 -1895 2925 3354 -2234 -1987 2808 1822 -2885 -1289 2680 866 -3010 -1000
3339a000L813j990k556K603K997k687l118J513K301m030l077L573L546k845k116
$$ -1000 2813 823 -1733 870 3867 1180 -1938 -425 1876 -2154 -5231 -1658 1888 -957 -3073
3354c073N666K808n883k555N971K32p430n45P444k74o675J909P726k276p230L971
$$ -3073 2593 5401 -482 -3037 2934 3166 -4264 -4809 2635 2361 -4314 -2405 5321 3045 -4185 -214
3370b14O110n040n371N557M537p133l168N981J702o421q06O648Q46n478J131N303
$$ -214 5896 856 -4515 1042 5579 -1554 -4722 1259 2961 -3460 -4266 2382 3228 -2250 -1119 4184
3386D184j362n613Q98L253k118l704J866M439j053k498K769L096k356l841J715
$$ 4184 2822 -2791 -1893 1360 -758 -4462 -2596 1843 790 -1708 1061 4157 1801 -2040 -325
3401c25K831k771l483L282L693l507l027M476K644m493j993M860J915n591p37
$$ -325 2506 -265 -3748 -466 3227 -280 -3307 1169 3813 -680 -2673 2187 4102 -1489 -2226
3416b226M466l82n549Q86L867j636l207L211L176k126q37K870M0l497o34J394
$$ -2226 2240 1858 -3691 -2805 1062 -574 -3781 -570 2606 480 -357 2513 2553 -944 -1578 -184
3432a84q83k168K022J995l30p15J902P22j967l02P52p18q37L31L78k17n45P21
$$ -184 -1067 -3235 -1213 782 452 -263 1639 2361 394 92 844 126 -711 -380 -2 -219 -764 -43
3450d3L05r13N25O33j77m8K99M06p31r93j47m92l67k63R19J846n7l36J735P55
$$ -43 262 -651 -126 507 330 282 581 987 256 -737 -884 -1376 -1743 -2006 -1087 759 702 366 2101 2856
3470B856k793j464J773N44l434o57M894Q62m264M61N246j049n616J336N202k889
$$ 2856 63 -1401 372 916 -2518 -3175 1719 2581 -1683 -1222 4024 2975 -2641 -1305 3897 1008
3486A008n066L629L425l619l523L886K349m082r99N068R14m490O75L984j847n052
$$ 1008 -4058 -429 2996 -623 -4146 -260 2089 -1993 -2992 2076 2990 -1500 -825 3159 1312 -3740
3502c740J714L474k259l011L263M125j871k856L087K789l462m077K316K705k803
$$ -3740 -2026 1448 -811 -3822 -559 3566 1695 -1161 1926 4715 1253 -2824 -508 2197 -606
3517f06k724L352L043l400k266M297J750m765j407N076N82n963M8N657j181o114
$$ -606 -3330 22 3065 -335 -2601 1696 3446 -1319 -2726 2350 2932 -3031 -2983 2674 1493 -4621
3533d621J261O236k086m967L848N397l349m507L733L081n205k879M433J606m208
$$ -4621 -3360 2876 790 -4177 -329 5068 1719 -2788 945 4026 -1179 -4058 375 1981 -2227
3548b227N6M907L70l780N20L510j743m083J166K680j397l112J845L191j656k540
$$ -2227 -2171 2736 3106 -674 -154 3356 1613 -2470 -1304 1376 -21 -3133 -1288 1903 247 -2293
3564b293J595K847j413k931J671L011j700l023J370J868k245j737K535J753j728
$$ -2293 -698 2149 736 -2195 -524 2487 787 -2236 -866 1002 -1243 -2980 -445 1308 -420
3579d20J96K628L07k823Q1K049k315k110J185K145j595o58K799P28j993j58J147
$$ -420 -224 2404 2711 -112 -31 2018 -297 -2407 -1222 923 -672 -1330 1469 2197 204 46 1193
3596A193m92j994Q79N24j090m2R90j07j342O01J552p05m35J314O86j410l25J068
$$ 1193 701 -1293 -414 110 -980 -1022 -32 -139 -1481 -880 672 -33 -468 846 1532 122 -203 865
3614H65p82j483K25J415k79j122J801J915j133r82R17N37k357j401J194J095j489
$$ 865 83 -1400 -1175 240 -39 -1161 640 2555 1422 440 1357 1894 -463 -1864 -670 425 -1064
3631a064j061K408K012k292j512K689P41k869j283K855J136l440r31L759j03l735
$$ -1064 -2125 283 2295 3 -1509 1180 1921 -948 -2231 624 1760 -1680 -2611 1148 1045 -2690
3647b690O84M167q45l177K349L485k847k812K315J724m192k276M538J701l553
$$ -2690 -2006 2161 1316 -1861 488 3973 1126 -1686 629 2353 -1839 -4115 423 2124 -1429
3662a429l16M832m8l897n16L923j218m754J340L779j640l216K310L523k318l005
$$ -1429 -1745 3087 3039 -858 -1374 2549 1331 -3423 -2083 1696 56 -3160 -850 2673 355 -2650
3678b650K531L208l191k567L262K235l923j870L346K048m059j410M487J433l672
$$ -2650 -119 3089 -102 -2669 593 2828 -1095 -2965 381 2429 -1630 -3040 1447 2880 -792
3693g92k33M287p8m855n9L621j571l838J529M107j706j932K623K348k930k919
$$ -792 -1025 3262 3184 -1671 -1730 1891 320 -3518 -1989 2118 412 -1520 1103 3451 521 -2398
3709b398K742J362l398j159L266R00l028j4L178j76l255J299L020r83k162P73
$$ -2398 344 1706 -1692 -2851 415 1315 -1713 -1727 1451 1275 -1980 -681 2339 1356 -806 -33
3725c3J800j315k507J451J479j684j134J954J713r59n44J248K35k063p59P06K
$$ -33 1767 452 -2055 -604 875 -809 -1943 11 1724 765 221 1469 1704 -359 -1118 -412 -410
3742d10j108r0J517N51n77N89N20m48q11K81K59q70J55K76o2o27J063N32j049
$$ -410 -1518 -1608 -91 460 -117 472 992 544 -267 14 273 -597 -442 -166 -228 -855 208 740 -309
3761c09o3J245K86o07m69J620p45j489n28J252r17p90J274J439q55n11J603n2
$$ -309 -372 873 1159 552 83 1703 958 -531 -1059 193 -724 -1514 -240 1199 344 -167 1436 1384
3779A384j487j185J443k63k191M71K481l77j712J146K287j470j930J771J488j802
$$ 1384 -103 -1288 155 -108 -2299 -1828 653 276 -1436 -290 1997 527 -1403 368 1856 54
3795E4j160J277J193j937j299K274J142k155q59L089R05k800n5K719q30l523o5
$$ 54 -1106 171 1364 -573 -1872 402 1544 -611 -1470 1619 2524 -276 -331 2388 1558 -1965 -2030
3812b030L018p47l232J629L822j296k772J827K762k513l182K030K443l080j526
$$ -2030 988 241 -2991 -1362 2460 1164 -1608 219 2981 468 -2714 -684 1759 -1321 -2847
3827b847L140J536k885o59L377O13l854N94L604r57l481J025L498j933l506J587
$$ -2847 293 1829 -1056 -1715 1662 2275 -1579 -985 2619 1662 -1819 -794 2704 771 -2735 -1148
3843a148L500k445k512L000K806k395k626K940P08l284j313K770N45k867Q88L063
$$ -1148 2352 -93 -2605 395 3201 806 -1820 1120 1828 -1456 -2769 1 546 -2321 -1433 1630
3859A630n41j892Q41K065j312k660J092K121j262j895J628J998j421j645J629
$$ 1630 1089 -803 38 2103 791 -1869 -777 1344 82 -1813 -185 1813 392 -1253 376
3874C76J237j380r91J510R07j579p73J130l7j714j91J306M76j560J291J583o86
$$ 376 1613 233 -758 752 1659 80 -693 437 400 -1314 -1505 -199 277 -1283 8 1591 905
3891I05j817J058O01j740q71J319P23q26l95J899n6k63j95L28j32n69M52j10o31
$$ 905 -912 146 747 -993 -1864 -545 178 -648 -1043 856 800 537 342 670 538 -31 421 311 -320
3910c20k7P09l55p93O40P59n85n81J031Q73j101l46L93m10j113m15J312k64m03
$$ -320 -347 362 7 -786 -146 613 28 -553 478 1351 250 -96 297 -113 -1226 -1641 -329 -593 -996
3929i96R43J042p2q86K15R88j240j665J202R81r26r21J445J714j609o38J485O42
$$ -996 -53 989 917 31 246 1234 -6 -1671 -469 512 -414 -1335 110 1824 215 -423 1062 1704
3947A704k218n05K140O4k354N5K547r13k647J243K393j590k005K231K567k644
$$ 1704 -514 -1019 1121 1185 -1169 -1114 1433 520 -2127 -884 1509 -81 -2086 145 2712 68
3963F8k209K520J374l419j167L232M73k304K55L326l15k889M66K316r05k514R58
$$ 68 -2141 379 1753 -1666 -2833 399 872 -1432 -1177 2149 1834 -1055 -589 1727 822 -1692 -734
3980g34K371j274j914J715J729j318j874J459J816k019j454K057J348k981j092
$$ -734 1637 363 -1551 164 1893 575 -1299 160 1976 -43 -1497 560 1908 -1073 -2165
3995b165K329R30k958m03L195O39k746L67K933r15k850P42K459j812k566K150
$$ -2165 164 1094 -1864 -2267 928 1567 -1179 -812 2121 1206 -1644 -902 1557 -255 -2821 -671
4011f71K437j736j283K499J512k548q63K067o5k335j14K157m95k072J025J581
$$ -671 1766 30 -1253 1246 2758 210 -653 1414 1349 -986 -1100 1057 562 -1510 -485 1096
4027A096q56j255P29J096m00r48P41K74n57j051M87M03l96k80Q18R23l79r1L53
$$ 1096 240 -1015 -286 810 410 -538 203 477 -80 -1131 -644 -241 -637 -917 -99 824 445 354 707
4046G07L32j137n13J027l18r93L47J395j04j224J288P84j082j018P20K88q80m92
$$ 707 1039 -98 -611 416 98 -895 -548 847 743 -481 807 1591 509 -509 211 499 -381 -873
4064h73J487m61q95M63P32q93o63J424K53o57l77J816r95j875O25J372r43j253
$$ -873 614 153 -742 -279 453 -440 -1103 321 574 -83 -460 1356 361 -1514 -889 483 -460 -1713
4082a713J486J545j203n59J870J80j854j39J172o49j187P4J721l05j144M95J224
$$ -1713 -227 1318 115 -444 1426 1606 -248 -387 785 136 -1051 -977 744 439 -705 -210 1014
4099A014r06n65Q4J117o03r49K31J153j022q68J154P82j396n97K012J029j673
$$ 1014 108 -457 -373 744 141 -808 -577 576 -446 -1314 -160 622 -774 -1371 641 1670 -3
4116cq46K383o5k925L4K411p13k139J483K519j327k136J892J949k478j530J899
$$ -3 -849 1534 1469 -1456 -1422 989 276 -1863 -380 2139 812 -1324 568 2517 39 -1491 408
4133D08R35k612m91K631J53k451M7K351o02k081J196J608r16j272J283N70q47
$$ 408 1343 -1269 -1760 871 1024 -1427 -1380 971 369 -1712 -516 1092 176 -1096 187 757 -90
4150i0j227R89J146j160m63J198Q24o14p58O57Q48j515j252J505N63j693K88J714
$$ -90 -1317 -328 818 -342 -805 393 1217 603 -155 502 1350 -165 -1417 88 651 -1042 -754 960
4168I60L83j914k51K173k83l027P95K234j200j679J646J159j599r42J914L74j448
$$ 960 1343 -571 -822 1351 1068 -1959 -1164 1070 -130 -1809 -163 996 -603 -1545 369 743 -705
4185g05O5J638o1j557N11J046j032r02R52N36q10j77R98M00j60m19N16o00p61
$$ -705 -640 998 937 -620 -109 937 -95 -997 -45 491 -319 -496 502 902 742 323 839 239 -522
4204e22o9K22J47j72Q4L36K29j61k87K09L0n49K55J98J07l35p0N73r27p9R82N12
$$ -522 -591 -369 -222 -394 -310 26 255 94 -193 16 46 -503 -248 -50 57 -278 -348 225 -702 -781 201 713
4226G13q11J19J333l47j081J3R90j328l51Q66P29j581J9K127m49j541O60R03j037
$$ 713 -98 21 1354 1007 -74 -61 929 -399 -750 116 845 -736 -717 1410 961 -580 80 983 -54
4245e4j449J323J007j588o98J743P21j814j76J857j68j678K04J793o26j516Q13
$$ -54 -1503 -180 827 -761 -1459 284 1005 -809 -985 872 704 -974 -770 1023 397 -1119 -306
4262c06J154j163p09J277O51o30n84J003O04q89o45N41K69j182o41R74J290j540
$$ -306 848 -315 -1024 253 904 274 -310 693 1297 408 -237 304 573 -609 -1250 -276 1014 -526
4280e26j19J597J74j544m89J869n28j859L85K142r08j703J213J431j269j226J914
$$ -526 -645 952 1126 -418 -907 962 434 -1425 -1040 1102 194 -1509 -296 1135 -134 -1360 554
4297E54Q00j877m69K046L44k030m45K228k97k298O30J768k02j439O74J327p56
$$ 554 1354 -523 -992 1054 1398 -632 -1077 1151 854 -1444 -814 954 752 -687 -13 1314 558
4314E58j350N55O18o56o90N06O39l64k50N19Q14j060m65O94L16r50j45J250M0
$$ 558 -792 -237 381 -275 -965 -459 180 -184 -434 85 899 -161 -626 68 384 -566 -711 539 579
4333E79j293J07J486l04j122O16J142r28r59Q78J089j438m85Q27K99j185m89J761
$$ 579 -714 -607 879 575 -547 69 1211 283 -676 202 1291 -147 -632 195 494 -691 -1180 581
4351E81L62j480O49R20o67j253M92N67p40m35J243l24l94L82O25k89k73L29J16
$$ 581 943 -537 112 1032 365 -888 -396 171 -569 -1004 239 -85 -479 -97 528 239 -34 295 411
4370D11n50j47N58K45q47J76O86m48l47q6P30Q7m96J38M48%p67m37M19p3m71q3
$$ 411 -139 -286 272 517 -330 -154 532 84 -263 -349 381 468 -28 110 558 558 -209 -646 -227 -300 -771 -854
4392h54J312j38j038P56O48o74q78P79K52q80n1J228Mo88K42J020r54o60O80R00
$$ -854 458 320 -718 38 686 12 -866 -87 165 -715 -766 462 466 -222 20 1040 86 -574 106 1006
4412A006p77r86J298O07j373o64J376O9j314j21J594J00j492N11J195p06j374
$$ 1006 229 -757 541 1148 -225 -889 487 556 -758 -879 715 815 -677 -166 1029 323 -1051
4429a051N61O72m53j101J016P43k77n33O29N16r16n30R06L62p00p57J277P76j514
$$ -1051 -490 182 -271 -1372 -356 387 110 -423 206 722 -194 -724 182 544 -156 -913 364 1140 -374
4448c74o4J289j69j283L97J045p9j284L56J214j264q23M97J281j362o73J571O52
$$ -374 -438 851 682 -601 -204 841 762 -522 -166 1048 -216 -1039 -542 739 -623 -1296 275 927
4466I27j379j76J435j80j541p9J370j34r06N32R32k41r05K50R27r15m93J106N4
$$ 927 -452 -628 807 627 -914 -993 377 243 -663 -131 801 560 -345 -95 832 -83 -576 530 584
4485E84o31K2O81k11q28K32O34k85q02O42M34j74o93M0J001r43o25L83M07k30
$$ 584 -47 -25 656 445 -383 -151 483 198 -604 38 472 298 -395 -355 646 -297 -922 -539 -132 -362
4505c62m58J264J62p72n2M92P1j007K89Q55l56o77N42R73p44o69N87P36j349j45
$$ -362 -820 444 606 -166 -218 274 345 -662 -373 482 126 -551 -9 964 220 -449 138 874 -475 -620
4525f20J009Q8r24M57M47l66p94O05O53r75j79P47N31r96m39J002J24q27n78J142
$$ -620 389 477 -447 10 457 91 -703 -98 555 -420 -599 148 679 -317 -756 246 370 -457 -1035 107
4545A07K06n84j81J240j33o77Q8M11q8p37K7Q86l45o84P64L40n57o23Q38L58r88
$$ 107 313 -271 -452 788 655 -22 66 477 389 -348 -321 565 220 -464 300 640 83 -540 298 656 -332
4566c32o1R71k3r77o7R91m38j036M18Q53n30n54P89P27q52m58N64N83q25m86J007
$$ -332 -393 578 555 -422 -489 502 64 -972 -554 299 -231 -785 4 731 -121 -579 -15 568 -257 -743 264
4587B64L86o84j88P89K19q66O9Q70o52p74J80P34l20o88Q69M28r62l06Q27L51
$$ 264 650 -34 -222 567 786 -80 -11 859 207 -567 -387 347 27 -661 208 636 -326 -632 195 546
4607E46r68l50J380q4j157J49N95lq60K49R85l49p67P51P05n02o48O01L93n82
$$ 546 -422 -772 608 524 -633 -484 111 108 -752 -503 482 133 -634 117 822 320 -328 273 666 84
4627H4p68O37Q64r03m01J206j54j024j4Q01j85o57K48O90m46o02O03J93m41n14
$$ 84 -684 -47 817 -86 -487 719 565 -459 -473 328 143 -514 -266 424 -22 -624 -21 172 -269 -783
4647g83J061K06r47l5R50J36j037R4P52o72j23L24M94j58m86Q09J94p07o82Q62
$$ -783 278 484 -463 -498 452 588 -449 -355 397 -275 -398 -74 420 262 -224 585 779 72 -610 252
4667B52J62r00L69M92j58o57L96M79l28k39L31k02l50Q1J00N20l91o15O41J76
$$ 252 414 -486 -117 375 217 -440 -44 435 107 -132 199 -3 -353 -272 -172 348 -43 -658 -17 159
4687A59k26k68K84M59l72o7K61J29p62J25P76m60m57M36M13K33j038O66K90k90
$$ 159 -67 -335 -51 408 36 -31 230 359 -403 -278 498 38 -419 17 430 663 -375 291 581 291
4707B91q95O63L10o48r2O14J4q98K58P01l58p31P29M34m23n90P31M21p83j57R83
$$ 291 -604 59 369 -279 -371 243 257 -641 -383 318 -40 -771 -42 392 -31 -621 110 531 -252 -409 574
4728E74o2j117K75N83k9l59J28M65j75n28K63L93o68j19L60L44n69j64N98Q2n80
$$ 574 512 -605 -330 253 224 -135 -7 458 283 -245 18 411 -257 -376 -16 328 -241 -405 193 275 -305
4749c05j13K66M81n48j91L88J87p84K94P28k17q12L78P66n61o45Q76L55p30l75
$$ -305 -418 -152 329 -219 -410 -22 165 -619 -325 403 186 -626 -248 518 -43 -688 188 543 -187 -562
4769e62J140j74p96L55M83P2p42L19O09l81j022N21O20q74K76L95N3n97n0O98
$$ -562 578 404 -392 -37 446 518 -224 95 704 323 -699 -178 442 -432 -156 239 292 -305 -355 343
4789C43l4o76pN28k42k26k0O54j86j12N2J08j1k50j94P67N3p23J79P04n91m91
$$ 343 309 -367 -374 154 -88 -314 -334 320 134 22 74 182 171 -79 -273 494 547 -176 3 707 116 -375
4811c75K28L24k40l01N99K90p28k8Q17m33o89k0J003r12m8L96Q38p60n36Q85l9
$$ -375 -147 177 -63 -364 235 525 -203 -231 586 153 -536 -556 447 -465 -513 -117 721 -39 -575 310 271
4832B71r33Q0P84L27q10K73Q15n99o17N12J60m43m8O38J3k95l1O9J86l99n94O65
$$ 271 -662 -582 202 529 -281 -8 807 208 -409 103 263 -180 -228 410 423 128 97 166 352 -47 -641 24
4854B4K2l10K80L48k53k28M3J37P5j88k77K19j47k72L89O86o87m73Q95M72p74
$$ 24 46 -264 16 364 111 -117 -74 63 138 -50 -327 -108 -255 -527 -138 548 -139 -612 283 755 -19
4875a9m67Q59J75p91j38J064n52n14J06J047r25j90N91N59q86k19Q01r4q35j93
$$ -19 -486 373 548 -243 -381 683 131 -383 -277 770 -155 -345 246 805 -81 -300 501 407 -428 -621
4895f21R03k39p03M92N76o93k7N61j01P3o51N06M34m48m2J19K26n01Q6K89L1k77
$$ -621 282 43 -660 -168 408 -285 -312 249 148 221 -430 76 510 62 20 139 365 -136 -50 239 270 -7
4917gk55O73J61n55o7K71Oo63J77N03J9r49N60O68o00j43M2M62r19K90O99k32
$$ -7 -262 411 572 17 -50 221 227 -436 -259 244 263 -686 -126 542 -58 -201 -159 303 -616 -326 373 141
4939A41l85M7M75k60o49O16M95n93k8L68J84j49l70P37k13m85j16L57R8l75K54
$$ 141 -244 -197 278 18 -631 -15 480 -113 -141 227 411 262 -108 629 416 -69 -185 172 270 -105 149
4960A49j30p4l14K32j66j9J43j8K44k27L48m34M88l53k73J20L51r4k08M2L42k40
$$ 149 19 -55 -369 -137 -303 -322 -179 -197 47 -180 168 -266 222 -131 -404 -284 67 -27 -235 -193 149 -91
4982i1J22J19K01n89R4O29k78k51M93L58p53l75Q57l67p18j09P06J28l34P3P25
$$ -91 31 150 351 -238 -144 485 207 -44 449 807 54 -321 536 169 -549 -658 48 176 -158 -85 640
5003F40m82n68J96Q25p07m95M55Jj27n7Q22j22q76K91J13K5j33L30M42l13k87
$$ 640 158 -410 -214 611 -96 -591 -136 -135 -262 -319 503 381 -495 -204 -91 -66 -199 131 573 260 -27
5024b7M18K29p07k87L71N16l49l66J67M72k34o31K69N49q12r3M83O48j026K23
$$ -27 391 620 -87 -374 -3 513 164 -202 -35 437 203 -428 -159 390 -422 -515 -32 616 -410 -187
5044a87L09Q2m32J90O31q48l8K90P11r09j17N05K68m75o3N85m41m58L67O20n05
$$ -187 122 204 -228 -38 593 -255 -293 -3 708 -201 -318 187 455 -20 -83 502 61 -397 -30 590 85
5065H5l53M93j73k64j37L93L02p50n5L37M89n43Q5L20j81n25L57K47M6k10r7N58
$$ 85 -268 225 52 -212 -349 44 346 -404 -459 -122 367 -176 -91 229 48 -477 -120 127 173 -37 -134 424
5087D24j71n04K82K39Om17L4P31n95mL22l9k08l04M84J73p22K39N13k40o85L04
$$ 424 253 -251 31 270 276 -141 -107 624 29 25 347 308 100 -204 280 453 -269 -30 483 243 -442 -138
5109a38M18j62p64P30M1k65k08L03j9Rk39J19j67J27K33M89k70k10j05K85J4l00
$$ -138 280 118 -646 84 125 -140 -348 -45 -64 -55 -294 -175 -342 -215 18 507 237 27 -78 207 221 -79
5131g9N2J65n2j92O2K66j02n35O62q7l56k72M93J65l71k4M13j48j16k54J84J49
$$ -79 -27 138 86 -106 -44 222 120 -415 247 160 -196 -468 25 190 -181 -205 208 60 -56 -310 -126 23
5153B3n11L17P96n12m64L56Q2k05k0J95K68l80m8L97Q2m82J23K16j79n24N23l6
$$ 23 -488 -171 625 113 -351 5 87 -118 -138 57 325 -55 -103 294 376 -106 17 233 54 -470 53 17
5175A7j95n3P91o43k91J34N02j15o51K88J76j19o2K56K46n18J87L81o36N12n55
$$ 17 -178 -231 560 -83 -374 -240 262 147 -504 -216 -40 -159 -221 35 281 -237 -50 331 -305 207 -348
5196c48N91j21qj8o9M00l10J07l9K12n42L14J19k5n03K41O13n55k36JM03l64p24
$$ -348 243 122 114 96 27 427 117 224 185 397 -145 169 288 263 -240 1 614 59 -177 -176 227 -137 -861
5219h61J133P8o79k53N98L76p96j00R61o04J05P8r6J58j82K09P5m25Q8K70L67
$$ -861 272 350 -329 -582 16 392 -404 -504 457 -147 -42 36 -60 98 -84 125 200 -225 -137 133 500
5240E00m44k11M97l81j96K48L99m09N7k00M40k56j47r9j43N4p3K59L15l02j40
$$ 500 56 -155 342 -39 -235 13 412 3 60 -140 300 44 -103 -202 -345 -291 -364 -105 210 -92 -232
5261b32J08K36m72j31M15L2k36j57P28k61l4j16N70k15o44M82K45j16o58N00L79
$$ -232 -124 112 -360 -491 -76 -44 -280 -437 291 30 -4 -120 450 235 -409 73 318 202 -456 44 423
5282D23m95j03N2L31j29j46J91N4n47K80L11k81k39J31K53k65K6M88j28j50j7
$$ 423 -72 -175 -123 208 79 -67 124 178 -369 -89 222 -59 -298 -167 86 -179 -153 335 207 57 40
5303D0L33l95K7J95j12l2k18L00K39m29j1J69K57j17l87M88r1l64k9M42q2o25
$$ 40 373 -22 5 200 88 56 -162 138 377 -52 -63 106 363 246 -141 347 256 -108 -137 305 223 -402
5325d02K37K98j50m83K10P6J87j42k0L88j21q52N33L91n57K51K37L85o38J47L30
$$ -402 -165 133 -17 -500 -290 -214 -27 -169 -189 199 78 -774 -241 150 -407 -156 81 466 -172 -25 305
5346C05j24k43k13P65k41l28K57J54m21l94M28M9l52Q5K49K52r3r6k8J78l06l7
$$ 305 181 -62 -275 490 249 -79 178 332 -89 -483 -55 -6 -358 -273 -24 228 135 39 11 189 -117 -154
5368a54K84k37j5j65M33lj77N0K11k71j57K30J94l6j22J40N47n73k50L86Q0l98
$$ -154 130 -107 -122 -287 146 143 -34 16 227 -44 -201 29 223 187 65 205 752 179 -71 315 395 -3
5390cj77L02k03k33j65M49K13o28J95N14r2l74J52N06n08R1j43J12J6LJ66j0l49
$$ -3 -180 122 -81 -314 -479 -30 183 -445 -250 264 172 -202 -50 456 -52 39 -104 8 24 27 193 183 -166
5413a66J41M88m87q5M01l83j1k6J89N90p23k33M81J64n94J76J02j5l51M64k06
$$ -166 -25 463 -24 -109 292 -91 -102 -128 61 651 -72 -305 176 340 -254 -78 24 9 -342 122 -84
5434h4R7m33K21O9J9m5j03L04p2Q1K12j5m21J39J95k47R1J97k8k33K78j4R0P8
$$ -84 13 -420 -199 -130 -111 -156 -259 45 -27 54 266 251 -170 -31 164 -83 8 205 177 -56 222 208 298 376
5458C76j79n9L5j18l64N58J69n60K00j05J30q36N76K60j23j70R6M26n47J76N1
$$ 376 197 138 173 55 -309 249 418 -142 58 -47 83 -753 -177 83 -40 -210 -114 312 -235 -59 -8
5479hK3l95L20K47k91J29J30J79p2m19J02k12L92K85l33J53k29J2m2K57n94J80
$$ -8 15 -380 -60 187 -104 25 155 334 262 -157 -55 -267 125 410 77 230 1 13 -29 228 -366 -186
5501a86j19N33l26J27J76j14L9k29k5n8j63M44l5J4l33J23L87l23l32L52L08j23
$$ -186 -305 228 -98 29 205 91 130 -99 -124 -182 -345 99 64 78 -255 -132 255 -68 -400 -48 260 137
5523A37k91o0Q92o40K8O4M31p21J21K23ok56K87o2j15p7M0R2j24J0j91M75l90
$$ 137 -154 -214 678 38 66 130 561 -160 -39 184 178 -78 209 147 32 -45 -5 87 -37 -27 -218 257 -133
5546a33o5M5K24oo96M80K5k54Q2M67j37o7P1K41K00q0p15N22k2o0J02P7j56l52
$$ -133 -198 -153 71 65 -631 -151 -126 -380 -298 169 32 -35 36 277 477 397 -318 204 182 122 224 301 145 -207
5570b07n9K75P6l25M1N7J41k35J62P5j26j01K68j00j23j09K51M8n9J85Jr8k09
$$ -207 -266 9 85 -240 -199 -142 -1 -236 -74 1 -125 -226 42 -58 -181 -290 -39 9 -50 135 136 38 -171
5593a71L26Q2m06J12L18l37o6M54j2j25n31M79l1m1L0k40J79j35L30j39n3l61
$$ -171 155 237 -169 -57 261 -76 -142 312 300 175 -356 123 92 51 81 -159 20 -115 215 76 23 -338
5615c38K19L61o05J44J91R3m25J71L31j08j86M5N6J03k54L86Jk90r5K46N61m82
$$ -338 -119 242 -363 -219 -28 65 -360 -189 142 34 -152 -107 -51 52 -202 184 185 -105 -200 46 607 125
5637A25QR3j0k01J58Q2j72j9l01L89k55j54J02M6K54k07k53M32k75R9k21L77m24
$$ 125 133 226 216 15 173 255 83 64 -237 152 -103 -257 -155 -109 145 -62 -315 117 -158 -59 -280 97 -327
5660c27j00J37M46p1m19M04K81k20q2J76j56K1jp0J5j74j57M33K57k16l95J91
$$ -327 -427 -290 156 85 -334 70 351 131 49 225 69 90 89 19 34 -140 -297 136 393 177 -218 -27
5682b7J72k62J69R1k34m0O1Q2k95J47L75k39m86O08j16j09k63M65K10j31l82j03
$$ -27 145 -117 52 143 -91 -131 -70 12 -283 -136 239 0 -486 122 6 -103 -366 99 309 178 -204 -307
5704c07M23n3k79L86n6k17K51j40J38j10j2j64L01l62J55L29o57J23J2K42J3L4
$$ -307 116 63 -216 170 114 -103 148 8 146 36 24 -140 161 -201 -46 283 -374 -251 -239 3 16 50
5726E0j47o1p4Q3P9QK22k40k01N05p1j74L45o37K34P40n96j22K00l66K23Q8j53
$$ 50 -97 -158 -232 -149 -70 -62 160 -80 -281 224 153 -21 324 -313 -79 661 65 -57 143 -223 0 88 -65
5749f5kj04N21l09j3J90n19M31K9k28K15l26K19k17k9J73j12k5O1J13P3q8J22
$$ -65 -67 -171 350 41 28 218 -301 130 159 -69 146 -180 39 -178 -207 -34 -146 -171 -110 3 76 -12 110
5772A10J53k51j30J46J51l94K89K60n1j37R4k18Q0l10K45j86K38Kj76L16M3o33
$$ 110 263 12 -118 28 179 -215 74 334 283 146 240 22 102 -208 37 -149 89 91 -85 231 274 -359
5794c59O4M24K1l56r2M87l39l05M99%P4l13J32M68o69L10K84O8k66O8l4l7m00
$$ -359 -295 129 150 -206 -298 189 -150 -455 44 44 118 -195 -63 405 -264 46 330 398 132 200 166 129 -271
5817b71L02J51l89K93o3R7M2m99M42K66m92k31L59lq7K06J49n66N01k67J49L9
$$ -271 31 182 -207 86 23 120 162 -337 105 371 -121 -352 7 4 -83 123 272 -294 207 -60 89 128
5839A28k08k43N74n58M49k93L96l67K6K86J91p7l23K51k75M2m52M11M09m62k93
$$ 128 -80 -323 251 -307 142 -151 245 -122 -96 190 381 304 -19 232 -43 -1 -453 -42 367 -95 -388
5860c88L55L27m55O6M17m84J58j4J26l87K16r2J05k34R1K39j21L01l93p6M32j90
$$ -388 -33 294 -161 -95 322 -162 -4 -18 108 -279 -63 -155 -50 -284 -193 46 -75 226 -167 -243 189 -1
5882ap9J31M30n06K2K17m9n9n5l4LP0r3Q0J03j62k95L49J84k22k55M14l80P2J98
$$ -1 -80 51 481 -25 -3 214 165 106 51 17 20 90 -3 77 180 18 -277 72 256 34 -221 193 -187 -115 83
5907H3Oj09N8J07J4o5j68r8J08j5K7M63n04R2K59k34J04r8o7j40J18K74m3j02
$$ 83 89 -20 38 145 159 94 -74 -172 -64 -79 -52 411 -93 -1 258 24 128 30 -37 -177 -59 215 172 70
5931G0k13L02l72R7m4J96n1j90K52Kj49j28N4K73l70L25J92l58K32J42j75K0l37
$$ 70 -143 159 -213 -116 -160 36 -15 -205 47 49 -100 -228 -174 99 -271 54 246 -112 120 262 87 107 -230
5954b30L60m9k44r3J48K23j27K00O8l9l82K74j31J15r7K7m6P2M6k84m4K99k66
$$ -230 130 81 -163 -256 -108 115 -12 188 256 217 -165 109 -22 93 -4 23 -23 49 95 -189 -233 66 -200
5977b00K20l0J33l39j4K33P9k74K62K65l14k16J90L91k83M6M6K8j13j90Q3J42
$$ -200 20 -10 123 -216 -230 3 82 -192 70 335 21 -195 -5 386 103 149 195 223 110 -80 3 145
5999A45l77l7L21P4p0j53K93k72l28K02L88l44j89K81K3L60j66m14J43j12J24
$$ 145 -232 -269 52 126 56 -97 196 -76 -404 -202 186 -158 -347 -66 -43 317 151 -263 -120 -232 -108
6020a08L5M8l09M06k30K03j68o9L45N3j68M1k03K09Q3j79m3J13M5jj18J01j81
$$ -108 -73 -25 -334 72 -158 45 -123 -192 153 206 38 79 -124 85 168 -11 -54 59 104 103 -15 86 -95
6043i5k2M24k00l18P9K16k52J44K41m34K42J09l05j7l4L6J61K65k01O9n3r2k53
$$ -95 -117 307 107 -211 -132 84 -168 -24 217 -217 25 134 -171 -188 -222 -186 -25 240 39 108 55 -37 -290
6066b90K10n0M5L16j75M1l4J02j06K14l68K88k66J54N6j40j97N1K97j27l03K08
$$ -290 -80 -130 -85 231 56 97 63 165 59 273 -95 193 -73 81 137 -3 -200 -149 148 21 -282 -74
6088g4j64oM05l98k13O70j91j21K36m20J24L08J6j06j54L29Oj44N7J81j17o67
$$ -74 -238 -244 161 -237 -450 220 29 -92 144 -276 -152 156 172 66 -88 241 247 103 160 341 224 -443
6110d43M32J38k7j10o5L11k06J35J53k61kl16J69N12m45N4J87j61n3r9k4J80k00
$$ -443 -11 127 100 -10 -75 236 30 165 318 57 55 -261 -92 420 -25 29 216 55 2 -97 -121 59 -141
6133a41j05N24m24J5k2K16r8K97n48O85k31p3l3R1p0J7P2l67J54N3j49L4K37j21
$$ -141 -246 278 -146 -131 -153 63 -35 262 -286 399 168 95 62 153 83 100 172 -195 -41 12 -137 -103 134 13
6157A3J45o6j55Q6m02Q02o00k3L06J71j18l53J50K64k11K6K6q3m6l18N87j14q9
$$ 13 158 92 -63 23 -379 423 -177 -200 106 277 159 -194 -44 220 9 35 61 -22 -68 -386 201 87 -2
6180bj33L69k57o1k93M32N3n46K02L13j47N4J65k54P6k82L88k6P5P4j18j79L89
$$ -2 -135 234 -23 -84 -377 55 108 -438 -236 77 -70 -16 149 -105 -29 -311 77 51 126 200 82 -97 292
6203B92l70K54j5k23K5j67J95L67k07j75K6J71J22q6K0J03j77n1n2k60N7r6K76
$$ 292 -78 176 161 -62 -37 -204 -9 358 151 -24 2 173 295 209 229 332 155 104 52 -208 -151 -247 29
6226B9qr8P5K08k81k51K79K43o9m91M47j53J26J12K4k90J08q3J38J35j6n6Q7J9
$$ 29 21 -77 -2 206 -75 -326 -47 196 127 -364 83 -70 56 168 192 -98 10 -73 65 200 184 128 215 234
6250B34m44J9L89l88K47o9L41l31l13L76J54l17k01Q4N89n21K7J28K19k43O8L23
$$ 234 -210 -191 198 -190 57 -12 329 -2 -315 61 215 -102 -303 -219 370 -151 -124 4 223 -20 48 371
6272C71l81K22k40P2R7mk23K58o7k75N47N3j70j43R9L1j22k97K25K54m12N6oJ61
$$ 371 -10 212 -28 44 141 137 -86 172 105 -170 377 430 260 117 216 247 125 -172 53 307 -105 -49 -55 106
6296A06J3m98N06rj18j04k20L64o6j92M14j30q3J6J72o1p4l2K58r2k49N7J70o6
$$ 106 119 -379 127 118 0 -104 -324 40 -26 -218 196 66 -17 -1 171 110 36 4 262 170 -79 -22 148 82
6320H2l58N8L28J60l90K34r4j4j62K23n3J68k52K11J09k01j76R6L90n51L67J36
$$ 82 -276 -218 110 270 -120 114 20 6 -156 67 14 182 -70 141 250 49 -127 -31 359 -192 175 311
6342C11m22K83m02P7M9N5j63K47o0R1p1P2J11m8k51M4J03r4j12p7N32o8j37J48
$$ 311 -111 172 -230 -153 -104 -49 -212 35 -25 66 -5 67 178 130 -121 -77 26 -68 -180 -257 275 207 70 218
6366B18l73j15N24l41O5l08L77J53m53L98n5k77L4k09O00N6l92K82k42K46k14
$$ 218 -155 -270 254 -87 -22 -330 47 200 -253 145 90 -187 -153 -362 238 294 -98 184 -58 188 -26
6387b6k41o8N68j10k30K42P8k85O7J35k9j67j2P5J90Q9j87k3j26j89O3L60n00
$$ -26 -267 -335 233 123 -107 135 213 -72 -5 130 101 -66 -78 -3 187 276 89 66 -60 -249 -186 174 -326
6410c26N4m1K94K44k83J99j34RQ4m07L59K60m82K64j23k07J40J59J94q9n55N23
$$ -326 -272 -313 -19 225 -58 141 7 16 100 -307 52 312 -170 94 -29 -236 -96 63 257 168 -387 136
6432A36l2N2k93J11L28p83N07J1j52l71K87M03j34ml52P4L49l26j88P01m86J86
$$ 136 104 156 -137 -26 302 -481 26 37 -115 -486 -199 204 70 66 -286 -212 137 -189 -377 324 -162 24
6454B4j31J96k36j82L32K24K1k49O7n3Q3k76J08M6J29l95N29l50K50l80J28J09
$$ 24 -107 89 -147 -329 3 227 248 -1 66 13 96 -180 -72 -26 103 -292 237 -113 137 -243 -115 -6
6476fk52J35j47N10n14K55k23L92l59K45j41k4K5l13P75k84q0N3K06k08R9%Q9
$$ -6 -258 -123 -270 240 -274 -19 -242 150 -209 36 -105 -129 -104 -417 358 74 -6 47 253 45 144 144 233
6499B33m24J57K16J45n17p2K06L59l49j31K60r5R0l5j04m0J02o2j3J83l1m8m2
$$ 233 -191 -34 182 327 -190 -262 -56 303 -46 -177 83 -12 78 43 -61 -101 1 -61 -74 109 78 30 -12
6522a2Ll70O7L79M5P8m16L78J31j63j71L25J2j36L1J68l48J44k32L35m50O3r8
$$ -12 -9 -379 -312 67 112 190 -226 152 283 120 -51 274 286 150 181 349 1 145 -87 248 -202 -139 -237
6545b37L16O6k28J5K50k28j2K06K6j1j36P0k11J90k62JK78K1j3j06K80m62J22
$$ -237 79 145 -83 -68 182 -46 -58 148 174 163 27 97 -114 76 -186 -185 93 114 101 -5 275 -187 -65
6568f5P8J00r9j85K89j89J47k34K24K69l05l83O60k59M0O0L8j73j94J49P1j11
$$ -65 13 113 14 -171 118 -71 76 -158 66 335 30 -353 307 48 88 148 186 13 -181 -32 39 -72
6590g2J52l08J43J88J07j30J96m78L27K26l17j6N9k37K95N0j53N2J23j37k7l7
$$ -72 80 -228 -85 103 210 80 276 -202 125 351 34 18 77 -160 135 185 32 84 207 70 43 6
6612FR6j89J99nm2k11J07K08o4n59K32L27j07m9j26m4J34j18mL79k79j18J4K66
$$ 6 102 -87 112 107 65 -146 -39 169 105 -454 -222 105 -2 -51 -177 -221 -87 -205 -209 170 -109 -227 -213 53
6636E3l8p8K78j57N3j2Q1j04j48j19J70m7N5Q0L72l95l61K32O53n92K43o34J37
$$ 53 15 -63 215 58 111 99 180 76 -72 -191 -21 -68 -13 67 439 44 -317 -85 568 -24 219 -415 -278
6659b78K81k76K86r7j16J79K03r0J33m13j69N06j94R5L9k11K44j98K81kl16M2
$$ -278 3 -273 13 -84 -200 -21 182 92 225 -188 -357 149 -45 50 89 -122 122 -76 205 203 -113 -71
6681g1K57k40MJ88l4J56l20R2j37K97k97m7J57J87k82J49k49L67K9m58L87j83
$$ -71 186 -54 -50 138 104 260 -60 32 -105 192 -105 -152 5 192 -90 59 -190 177 206 -252 135 -48
6703d8J02p5J78n4j80J58j1K17k07j16J15J50j49K6m57M72k70K34q7J2l14J84
$$ -48 54 -21 157 103 -77 81 70 287 80 -36 79 229 80 106 -351 121 -149 85 -2 10 -304 -120
6725a20L24k87J56j62K26k94l27L85J17j53J71j91K77j32j87L19j48j11j60K74
$$ -120 204 -83 73 -89 137 -157 -484 -99 18 -135 36 -155 122 -10 -197 122 -26 -137 -297 -23
6745b3j1j24K03K36j49j28j92J40K25j0k51L86o45L99P9j87K77n25N09j58K0k26
$$ -23 -34 -158 45 281 132 4 -188 -48 177 167 -84 302 -343 56 135 -52 225 -300 209 51 71 -155
6767a55K36j89J12k80o4M42j60P0k63L88k66O6J65o6k28K55J00j07k96M8L7K35
$$ -155 81 -108 4 -276 -340 102 -58 12 -251 137 -129 -63 102 36 -192 63 163 56 -240 -192 -155 80
6789H0Q1l2j63k04J52l5K5L66m42K81k57J30o7j73KK33L4K2J83j21k20J18L29
$$ 80 161 129 -34 -238 -86 -121 -96 270 -172 109 -148 -18 -85 -258 -256 -23 11 33 216 95 -125 -7 322
6812C22k60j65J10L36l56q8r5L21j50K2k09K38q9J36K04n1p7j70J56P7j62n9j67
$$ 322 62 -103 7 343 -13 -101 -196 125 -25 -3 -212 26 -63 73 277 226 149 -21 135 212 50 -9 -176
6835a76K57l93J93r8n4R0k5L45k78n1J61J93Nj82k21L66J92o10K03J97l37J15
$$ -176 81 -312 -119 -217 -271 -181 -206 139 -139 -190 -29 164 169 -13 -234 132 324 -286 -83 114 -223 -108
6857a08Q4J81J32l97j88M81k9l1m4j81P5m12M41O8R6m70O22m45J39J69J35k13
$$ -108 -24 157 289 -108 -296 185 156 125 81 -100 -25 -437 4 72 168 -302 320 -125 14 183 318 105
6879A05M5l62M2J82j3m5L45m71OJ11J07K63m81Q6n4k9L27o3m00L93l67N4M12J71
$$ 105 150 -212 -170 12 -1 -46 299 -172 -166 -55 52 315 -166 -80 -134 -163 164 101 -299 94 -273 -219 193 364
6903C64n80J01K9M56n01J72k04M4J05j38L26r3r5R3rm58K57Q5L00k42p0l5m3M05
$$ 364 -216 -115 -86 370 -131 41 -163 -119 -14 -152 174 81 -14 79 70 -388 -131 -46 254 12 -58 -93 -136 269
6927B69o20J28L28j58Q3R9p3k36M53m58M17l07n6N57l03k28R9j56m8Q9j61M35
$$ 269 -351 -223 105 -53 30 129 56 -180 273 -185 232 -75 -131 426 123 -105 -6 -162 -210 -121 -282 153
6949A53j79j13m4L07j22l87J96K96j6k45M55k21k50O5lK59j74q4K44n5o8J04q8
$$ 153 -26 -139 -183 124 2 -385 -189 107 91 -154 301 80 -170 -105 -108 151 -23 -107 137 82 14 118 30
6972C0j01J34l69N15k50j27J98j08J98q1l5Q7q0J07j34p0J94n42K70J86l2J24
$$ 30 -71 63 -306 209 -41 -168 30 -78 120 39 4 91 11 118 -16 -86 108 -434 -164 22 -10 114
6994A14p3m1j93K33J37j42k42p2J64n2Q6J82jm5Q3J24l40R2o8j47R1J49k34K81
$$ 114 41 0 -193 40 177 35 -207 -279 -115 -167 -81 101 100 55 138 262 -78 14 -54 -201 -110 39 -195 86
7018H6L01j29k36p2J75O1p6P4j20j6k38K63K42k24o00N76N2j88L41l02K7Nj70
$$ 86 387 258 22 -50 125 186 110 184 64 48 -190 73 315 91 -509 67 119 -69 272 -30 -3 2 -168
7041a68J86M2n29L11K92k24k5p6M10r4o7k58J76K43k54j92J70l3r2j1J70k0P2
$$ -168 18 60 -469 -158 134 -90 -115 -191 219 125 58 -200 -24 219 -35 -227 -57 -90 -182 -193 -23 -43 29
7064B9j15j18J95k28L14J6j90k2J5J57k66J84K46k95K06j69J23j91j05K02p9K5
$$ 29 -86 -204 -9 -237 77 93 -97 -119 -104 53 -213 -29 217 -78 128 -41 82 -109 -214 -12 -91 -66
7086f6M2K4O1P3k18L62k5k1k92N6p6N1j60J5K40J17l53j12J71J62j18o0k07L96
$$ -66 -24 0 61 134 -84 278 253 232 -60 -4 -80 -29 -189 -174 66 183 -170 -282 -111 51 -67 -127 -334 62
7110F2j49m4K42j41p0j2K63J48K0n6k76j10J9L71J8p3kk17R2K59k70m1K71K5m32
$$ 62 -87 -131 111 -30 -100 -112 151 299 319 263 -13 -123 -104 267 285 212 210 -7 85 344 74 33 304 329 -103
7135a03J8N8k33J86j03L10j49J81N8j49j6m7k33L9K2N6M65m25m0J91j23J26r1
$$ -103 -85 -27 -260 -74 -177 133 -16 165 223 74 58 11 -222 -183 -161 -105 360 -65 -105 86 -37 89 -2
7158bk30M08L2n28K08N1k20L72l45K97k05K53j19Q8r1J42K72l75k57J20pJ71p5
$$ -2 -232 176 208 -320 -112 -61 -281 91 -254 43 -162 91 -28 60 -31 111 383 8 -249 -129 -136 35 -40
7181d0O8O2o8P6k66n7J99l25M86j41k8J02r4P6j31l80K83K72P7m13J35J94k49
$$ -40 28 90 22 98 -168 -225 -26 -351 135 -6 -34 68 -26 50 -81 -461 -178 94 171 -242 -107 87 -162
7204a62QK23J64j21j88J41J96l22j22K13k14J14L02l1l37N9K6K05R2j78l15K16
$$ -162 -154 69 233 112 -76 65 261 -61 -183 30 -184 -70 232 201 -136 -77 -51 154 246 68 -247 -31
7226c1j7Q9J77pk33l17L97j60J72l88M46j71j05P4J8j89J11j78K76N1R4n6j02
$$ -31 -48 41 218 211 -22 -339 58 -102 70 -318 128 -43 -148 -74 -56 -245 -134 -312 -36 15 109 53 -49
7249d9N8J83j98L39k49j92k63M53J68j92J74k97K07k01P2k09K58n0q3J61J61n99
$$ -49 9 192 -6 333 84 -108 -371 82 250 58 232 -65 142 -59 13 -196 62 12 -71 90 251 -348
7271c48K16J40j93K76n0n5j01r5J79O4q3n2Q1j5L57n58J51K04k86OQ2L46k91R5
$$ -348 -132 8 -185 91 41 -14 -115 -210 -31 33 -50 -102 -21 -36 321 -237 -86 118 -168 -162 -80 266 -25 70
7295G0k83L15J17k39O9J74k08k67M90k57P1Q6j36j24P1J18j96L77q8m16K51M3
$$ 70 -213 102 219 -20 49 223 15 -252 238 -19 52 138 2 -122 -51 67 -129 248 160 -256 -5 38
7317C8p7kK14Pm79O37l53M2J03j31J79p6l94L33J25l6k82J57K28j99q8j90K48
$$ 38 -39 -41 173 180 -299 338 -15 27 130 -1 178 102 -292 41 166 130 -152 5 233 34 -54 -244 4
7340DJ71k57K82j18k29q0r7L89j77j47L96M4k25J75m42M95l56J83j44K61j96J81
$$ 4 175 -82 200 82 -147 -227 -324 65 -112 -259 137 181 -44 131 -311 184 -172 11 -133 128 -68 113
7362A13j32J26l20J10J59j28J56k79L51K64n71J54Q7J46l32j8M42l21J1K24m16
$$ 113 -19 107 -213 -103 56 -72 84 -195 156 420 -151 3 90 236 -96 -114 328 7 18 242 -174
7383a74K7M6n1K98k27n2L00j46j76N00m55L17k25R0j6j0n4j39J63J55j44J97n06
$$ -174 -147 -101 -152 146 -81 -133 167 21 -155 345 -110 207 -18 72 56 46 -8 -147 16 171 27 224 -282
7406b82N24k36j80L27J0k6m9L4k80L96l16J09M9j37j86l5N03k21L0n3k7J69n9
$$ -282 242 6 -174 153 163 137 88 122 -158 238 -78 31 80 -57 -243 -278 225 4 34 -19 -46 123 64
7429F4L1j35j08R7L59n88K57J71j0j68J00Q7J95m79rJ80k1j71O6o4L61l86K19
$$ 64 95 -40 -148 -51 308 -280 -23 148 138 -30 70 157 352 -127 -136 44 23 -148 -82 -146 215 -171 48
7452D8K50n21K81M0k09J90l78K95%n1j07K55K32l73l79K07L61M7l02J91rj26J61
$$ 48 298 -223 58 98 -111 79 -299 -4 -4 -55 -162 93 325 -48 -427 -220 141 188 -114 77 68 -58 103
7475A03N1kj84K05l49J68Q5m3j39L49m8k81K41p9m08K36j46K71j35k46M66j16
$$ 103 154 152 -32 173 -176 -8 77 34 -105 244 196 -85 156 77 -331 -95 -241 30 -105 -351 115 -1
7497aJ10j49J47m85N17j36j52R2J87j14J67m4M8j84J83J42l01K11k38J34l29m9
$$ -1 109 -40 107 -378 139 3 -149 -57 130 16 183 139 187 3 186 328 27 238 0 134 -195 -244
7519b44L58L0j19J85n35J39K44k84L30j22k30M52k36Q8j42K97j21k23k0J66J66
$$ -244 114 144 25 210 -325 -186 58 -226 104 -18 -248 204 -32 56 -86 211 90 -133 -153 13 179
7540A79l27J05k19j59L96n8J35j00J80m5K05k15m9k7k66K63j47j55P88o00K26
$$ 179 -148 -43 -262 -421 -25 -83 52 -48 132 87 292 77 28 1 -265 -2 -149 -304 484 -116 110
7561A10J18%k01N7pk45K62j13p1J83Jk44R3L39l42m2p4K14jJ46m66Q3K17j11K37
$$ 110 228 228 27 84 77 -168 94 -19 -90 93 94 -150 -57 282 -60 -102 -176 38 37 183 -283 -200 17 -94 143
7586A43j42k43J79K13o60N05q3K32p6k31K97q4j10n8L2J75l25K05J39R9j10l72
$$ 143 1 -242 -63 150 -510 -5 -88 144 68 -163 134 50 -60 -118 -86 89 -236 -31 108 207 97 -275
7608b75K21J05K04m04M4J57j1J10m3n7j16k6MK4J58k34p5K69j15rN8k92RL12j42
$$ -275 -54 51 255 -149 -105 52 41 151 108 51 -65 -91 -87 -63 95 -139 -214 55 -60 -69 -11 -303 -294 18 -124
7633a24p5J40lJ52k75l8K09L62l75M38m74K86k12KN0o4Jj12J15J07Ko3k7L7m1
$$ -124 -199 -59 -62 90 -185 -223 -14 348 -27 411 -63 223 11 13 63 -1 0 -112 3 110 112 49 22 59 18
7658A8j06L5J10o4K52J15j40o0l6j43k8J42j62q4K26k14J8J70k80O09m53L08k44
$$ 18 -88 -53 57 -7 245 360 220 160 124 -19 -47 95 -67 -151 75 -139 -121 49 -231 378 -75 233 -11
7681a1lkl9j42L12K7k04m5M9P2J29K05k90o7K39q8p7l3J89r4m42J07J37j10qJ15
$$ -11 -14 -16 -55 -197 115 142 -62 -107 -58 14 143 348 58 -9 230 142 65 32 221 127 -315 -208 -71 -181 -189 -74
7707g4q2j43J05K20k19J3J23j21J03J30K5j80K22k28L25m94M05k05k23K60J57
$$ -74 -156 -299 -194 26 -193 -180 -57 -178 -75 55 80 -100 122 -106 219 -275 130 -75 -298 -38 119
7728A19j64p4M14k84n6K36k41J0j12n3r5K92j35O2L0l4K31j2k77R8K78k59j50
$$ 119 -45 -119 295 11 -45 191 -50 -40 -152 -205 -300 -8 -143 -81 -51 -85 146 134 -143 -45 233 -26 -176
7751a76N35l65J3p1Q4r1J34j08J0J04k9J81j45o6j36K57m07L64j93M5J97k20L05
$$ -176 359 -6 7 -64 20 -71 63 -45 -35 69 40 221 76 10 -126 131 -276 88 -105 -60 137 -83 222
7774B22j78o9J51N9j88j37K49m12M29k24J74K12j02j75o7R8k33J25J27j29P8K4
$$ 222 44 -25 126 185 -3 -140 109 -303 126 -98 76 288 186 11 -56 42 -191 -66 61 -68 10 34
7796C4j24R6K01j57j51J17l15L89J6q5j57K13j98L74l5l03j37J73m6J43L0J3k2
$$ 34 -90 6 207 50 -101 16 -299 90 106 21 -136 77 -121 253 218 -85 -222 -49 -95 48 78 91 69
7819F9k31K38J4l04J74L92k44qk67K61j30K45p7j3k44M5L7j02R0n1K1J57p0Ok61
$$ 69 -162 76 90 -214 -40 352 108 100 -167 94 -36 209 132 119 -125 -80 -43 -145 -55 -106 -85 72 2 8 -253
7844b53K97n7j76K68Lk53J02K22l41L77k23J59k66L21k77L55J1j41mKk47l3L5
$$ -253 44 -13 -189 79 82 -171 -69 153 -188 189 -34 125 -141 180 -97 258 269 128 124 126 -121 -154 -119
7867a19J54l72L65ML64k77N0j31J16k35J10k34J11J07r2J76J38l94P3J58j12K0
$$ -119 35 -337 28 32 396 119 169 38 154 -81 29 -205 -94 13 -79 97 235 -159 -86 72 -40 -20
7889b0O2J20j24k18K7q0J79p7L09k53lK16Kl11M93l81q9P5M6J51k56J21r2J97
$$ -20 42 162 38 -180 -153 -233 -54 -131 178 -75 -78 138 140 -171 322 -59 -148 -73 -27 124 -132 -11 -103 94
7913I4l25M65l94o6J30P1J98j05k87M37j51k05L22l42K11K18j15j80J47j12K19
$$ 94 -231 234 -160 -226 -96 -25 173 68 -219 218 67 -138 184 -158 53 271 156 -24 123 11 230
7934B30q7k48K40J12k15l8J10Q6m18j0Q8Q0o5J80j15Q3L6o6R3N1j12K03j18p8
$$ 230 143 -105 135 247 32 -6 104 190 -228 -238 -150 -70 -135 45 -70 13 49 -17 76 127 15 218 100 22
7958B2Q8o1lj34k8L3r5P6q1J42l69L63l7J20Q4J5l25K38J36k14J00l42L25P7o2
$$ 22 110 49 46 -88 -116 -83 -178 -102 -183 -41 -410 -47 -84 36 120 135 -190 48 184 -30 70 -272 53 130 68
7983F8O1R5l36O7p3K60j97j29r5J54R4lq5P6j24L7J30K8j39K06k18K36l26K54
$$ 68 129 224 -112 -45 -118 142 -55 -184 -279 -125 -31 -34 -119 -43 -167 -130 0 28 -111 95 -123 113 -213 41
8007D1P0Rn4k56J90M35l93K20r8k05j1k0J17n6J10k0j94M0j08JK46N5%r8j22J6
$$ 41 111 120 66 -190 0 435 42 262 164 -41 -52 -72 45 -11 99 79 -115 -75 -183 -182 64 119 119 21 -101 -85
8033h5Q8K9j11J52l4J23j60K02k29k40K54J80k40p9R1J23k76L87k20O8l54M96
$$ -85 3 32 -79 73 39 162 2 204 -25 -265 -11 169 -71 -150 -59 64 -212 175 -45 23 -331 165
8055A65M6k68O5j74L6L77k06j0K42k71R0N6j67M9K25o24K36O4M6J14K6j04P9R4
$$ 165 211 -57 8 -166 -130 247 41 31 273 2 92 148 -19 30 255 -369 -133 -69 -23 91 117 13 92 186
8079A86P7o68M34m0J79k00O9j6n8j07K39k62K47k77Q8L75m28J32k73j13M77J00
$$ 186 263 -405 29 -11 168 -32 37 21 -37 -144 95 -167 80 -197 -109 266 -162 -30 -303 -416 61 161
8101A61j32K92k4k13m4j56j4J95j29N9J38k29J84j97L10k66K25n8l4m7j07K11
$$ 161 29 321 297 84 40 -116 -130 65 -64 -5 133 -96 88 -109 201 -65 160 102 68 21 -86 125
8123A25p8M6l40L46j67J85O5l89J71K85l09P5k26r9L72J14kJ31l03pK88k53qJ5
$$ 125 47 93 -247 99 -68 117 182 -207 -36 249 -60 15 -211 -310 62 176 174 305 2 -5 283 30 22 37
8147C7k28J83J3k29J03q1L56Kl19K58J6j64n2M3j83L08K3j99N67l36l66M31j78
$$ 37 -191 -8 5 -224 -121 -202 154 156 -163 95 111 -53 -105 -62 -245 63 86 -113 454 118 -248 183 5
8170Eo7L75p6l58L20K91n36Q7k09M50l49J04qj58J69q2j65J76Jk09M59
$$ 5 -62 313 237 -121 199 490 -46 41 -168 282 -67 37 29 -129 40 -42 -207 -31 -30 -239 220
8191B20
$$ Imaginary data points
##PAGE= N=2
##DATA TABLE= (X++(I..I)), XYDATA
0@%%%%qQ%Qj6J6j6K4l3M1m8N6p2Q5r5J11j33J54j76K03k34K67l03L44l90M40m94
$$ 0 0 0 0 0 -8 0 0 8 -8 8 -8 16 -17 24 -24 32 -40 45 -50 61 -72 82 -94 109 -125 142 -161 183 -207 233 -261
31b61N54o21O94p74Q61r57J062j176J303j443J596j765J955k168K408k678K985
$$ -261 293 -328 366 -408 453 -504 558 -618 685 -758 838 -927 1028 -1140 1268 -1410 1575
48A575l345L766m262M862n610O567p836R604j2238J6563k4830M5844j86971l54529
$$ 1575 -1770 1996 -2266 2596 -3014 3553 -4283 5321 -6917 9646 -15184 30660 -156311 -510840
62e10840O49476K39830o22357j45605O37731Q2216n42663k690M65233q7755l93511
$$ -510840 138636 378466 -243891 -389496 248235 330451 -212212 -214902 250331 162576 -230935
73b30935J07521K94826j37768j94868J56233J37728j45647q1409J21142M7925
$$ -230935 -123414 171412 33644 -161224 -4991 132737 -12910 -94319 26823 74748
83G4748r9280k5464R0495M6401o7784o2518M7418N9056q5489j03749Q9901J19434
$$ 74748 -24532 -49996 40499 86900 19116 -43402 4016 63072 -22417 -126166 -36265 83169
95H3169r7012q6731J63526R7627j87944p8650J89132J547k44284K5049K48255
$$ 83169 -13843 -100574 62952 160579 -27365 -106015 83117 84664 -159620 -134571 113684
106A13684o3244k18594J41497K28188j62399j97163J77335J45123j97360j13311
$$ 113684 50440 -168154 -26657 201531 39132 -158031 19304 164427 -32933 -146244
116a46244J83527P7073j48412l6939J05083J674o5132J0515J2955r199N1005K7883
$$ -146244 37283 114356 -34056 -70995 34088 35762 -29370 -18855 -5900 -15099 35906 63789
128F3789p4401j4825R1740k1570j35433M535J13066k0161q6955N4839J00010k2899
$$ 63789 -10612 -25437 66303 44733 -90700 -86165 26901 6740 -80215 -25376 74634 51735
140E1735n6397J8145J7139l3431k7307m714M138K2107J2784r394J4605K6605k3041
$$ 51735 -4662 13483 30622 -2809 -30116 -34830 -30692 -8585 4199 -5195 9410 36015 12974
153A2974k4104L2609q93n5689K6875P2577n5775p8635Q6181O1180j37341n6683
$$ 12974 -11130 21479 20586 -35103 -8228 64349 8574 -70061 16120 77300 -60041 -116724
165a16724J66181L6500j72291K5222K07348n4216k07070Q2678J64332j56353j64341
$$ -116724 49457 85957 -86334 -61112 146236 92020 -115050 -32372 131960 -24393 -188734
176a88734J77000J31139j79570n7007K22364L6556k08623K51J74571o1365j71351
$$ -188734 -11734 119405 -60165 -117172 105192 141748 -66875 -66624 107947 46582 -124769
187a24769P3389J36922q2785q9393J03221O7493r6514m4068Q2362K1228p0986
$$ -124769 -51380 85542 2757 -86636 16585 84078 -12436 -56504 25858 47086 -23900
198b3900p489O7916J3820o0588k8360M6772J9993p4330m0605R5004O4707r5890
$$ -23900 -31389 36527 50347 -10241 -38601 8171 28164 -46166 -86771 8233 72940 -22950
210b2950l8878J47140L9942j85387m4804J83339j1314k23736M1255K44489n7231
$$ -22950 -61828 85312 125254 -60133 -104937 78402 67088 -156648 -115393 129096 71865
221G1865k13155J22205K12664j57772j94295J70833J37579k04126r8587K14906
$$ 71865 -141290 -19085 193579 35807 -158488 12345 149924 -54202 -152789 62117
231F2117N9785k02814r645J87606l4429j68847O1653J42584p3315r9231R4333
$$ 62117 121902 -80912 -90557 97049 62620 -106227 -44574 98010 24695 -74536 19797
242A9797P4711r9009o5785O8840K6544p3586k1524O9524M4290k9483k3461L7611
$$ 19797 94508 -4501 -70286 -1446 25098 -48488 -70012 -488 43802 14319 -9142 28469
254B8469L5232m9421p1096K7073N8022m7857n9780P7700Q0303p2076n6763R3530
$$ 28469 63701 14280 -56816 -29743 28279 -19578 -79358 -1658 78645 6569 -50194 43336
266D3336L5864j15082k6779J10547k791j07725L3711R9883n7372q7247O7841N5372
$$ 43336 79200 -35882 -62661 47886 45095 -62630 -28919 70964 13592 -73655 -5814 49558
278D9558q3658k4758R7698J3834p5816K0982O1857n1778o3716L9332J9572n1581
$$ 49558 -34100 -58858 38840 52674 -23142 -2160 59697 7919 -55797 -16465 3107 -48474
290d8474P985O3844l253k2214M0066J2271n6220p618L6147l6148m6293N3174M4375
$$ -48474 -40489 23355 20102 -2112 37954 50225 -5995 -13613 22534 -13614 -59907 -6733 37642
303C7642n3920j4269P4778M698p9768K061O8791j8756o2290K7552N6405k5948
$$ 37642 -16278 -30547 44231 48929 -30839 -28778 40013 21257 -41033 -13481 42924 16976
315A6976m9440J3620K9738j8138l2443J0575M4262J7256l0250p362M7719M779
$$ 16976 -32464 -18844 10894 -7244 -39687 -29112 15150 32406 2156 -5206 42513 47292
327D7292p8957k5529P1979N2q8606K4464J21109j9843j04550N6791J04515r2508
$$ 47292 -31665 -57194 14785 14837 -73769 -49305 71804 51961 -52589 4202 108717 16209
339A6209j13155R6301Q2165j22833n7482J45159M1077j45468p503J43856k7909
$$ 16209 -96946 -645 81520 -41313 -98795 46364 87441 -58027 -65530 78326 50417
350E0417j44053N3934J35235p0628j12676R2880R4719j12866r2260J03182O5784
$$ 50417 -93636 -39702 95533 24905 -87771 5109 99828 -13038 -105298 -2116 63668
361F3668j05143m6145J18604O0336r0637m3143Q5146K9937r9937n3436P7144M4355
$$ 63668 -41475 -87620 30984 91320 683 -42460 42686 72623 -27314 -80750 -3606 40749
373D0749p4415k9280R7353M5399q8677l2189R0202P245j12571l204J10535j6179
$$ 40749 -33666 -62946 34407 79806 -8871 -41060 49142 56387 -56184 -59388 51147 34968
385C4968j08966M3328J11727o3329j09270P5959R5186r0344p5303J10112P0203
$$ 34968 -73998 -30670 81057 17728 -91542 -15583 79603 -10741 -86044 24068 94271
396I4271j04714n0212R4993J8691j06061j7521Q6505P557n9383K4190O8450j3845
$$ 94271 -10443 -60655 34338 53029 -53032 -70553 15952 23509 -35874 -11684 56766 42921
408D2921m8458J0249K2195l1755l6070J6168K9643o251j5052J9678L0241j1992
$$ 42921 -5537 4712 26907 -4848 -40918 -24750 4893 -1358 -16410 3268 33509 21517
420B1517l5967M087K9217j4827l5280J8695L8329j8752l1403K1059J7574l2590
$$ 21517 -14450 -10363 18854 4027 -31253 -12558 25771 7019 -24384 -3325 14249 -18341
432a8341j0559L4827L274k1602K6601L1271l5389k8358L4339J334o1186l394O1106
$$ -18341 -28900 5927 9201 -12401 14200 45471 10082 -18276 16063 17397 -43789 -47183 13923
445A3923j83m1159L2391N1103l1250l7221K7311J408m9424L708M2007k2436k8381
$$ 13923 13740 -27419 4972 56075 24825 -12396 14915 16323 -33101 -29393 12614 -9822 -38203
458c8203N4873K9831o4604j8837P1930k035q3250J5613Q7018k3812p7472L9190
$$ -38203 16670 46501 -18103 -36940 34990 32955 -50295 -34682 52336 28524 -48948 -9758
470i758O5108n8118o3674N8703M6607n9497j9313P9149K1682o9737q176N8516
$$ -9758 55350 -2768 -66442 -7739 38868 -20629 -39942 39207 60889 -8848 -17024 41492
482D1492j7908p7268Q591O5460j1527n0731L2284O6699k1346o0114J6624M6855
$$ 41492 23584 -53684 -45093 20367 8840 -41891 -9607 57092 35746 -24368 -7744 39111
494C9111l4338n8900K9198N7523k8280m7383M2889M9538n1373m9653N6205M2312
$$ 39111 4773 -54127 -24929 32594 4314 -43069 -180 49358 -2015 -51668 4537 46849
506D6849o5506l0783Q4608L0130r1069k4124R0183J985j09046J860J14156l394
$$ 46849 -18657 -49440 35168 65298 -25771 -49895 40288 42273 -66773 -64913 49243 45849
518D5849r8841L1935J11449l7872j12195L4023Q6129o2492r0114O9190Q6681o4046
$$ 45849 -52992 -21057 90392 52520 -59675 -25652 60477 -2015 -92129 -22939 63742 -304
530c04n8682Q4884N2855r2985m8111Q7103K4719r7948j2195J04925O527j00606
$$ -304 -58986 25898 78753 -14232 -62343 24760 49479 -48469 -60664 44261 50788 -49818
542d9818P675R8293k3445j00931L2040R9100l3323q2892N1237Q0345n9837q0238
$$ -49818 -42143 56150 32705 -68226 -36186 62914 29591 -53301 -2064 78281 18444 -61794
554f1794N0750N5734o5410m8560P3045N2079n6706k6548O4521J7413p2259k4977
$$ -61794 -11044 44690 -20720 -69280 3765 55844 -862 -27410 37111 54524 -17735 -42712
566d2712N1800M379n3954L111N9489N551m2804N054L8755j2370m1062O586L2144
$$ -42712 9088 13467 -40487 -37376 22113 27664 -15140 -10086 28669 16299 -24763 -18177 13967
579A3967p353k2462J4168K1982j4240k0246P696Q752j1815k787J9753R772o230
$$ 13967 6614 -15848 -1680 20302 6062 -14184 -6488 2264 -9551 -12338 7415 17187 10957
592A0957J768O329j1200j8776l171J593n103J983J5107J0602J599M637l48j2800
$$ 10957 12725 19054 7854 -10922 -14093 -12500 -17603 -15620 -513 10089 11688 16325 15977 3177
606C177q503J373q259j1549J1664K0305o052j2202J7572J5603k4822k2280K4970
$$ 3177 -5326 -3953 -12212 -23761 -12097 8208 2156 -10046 7526 23129 -1693 -23973 997
619I97K0426k6867j5119L8089J8738m2861k2287L9094R690n0063o548O0673J2350
$$ 997 21423 -5444 -20563 17526 36264 -6597 -28884 10210 19900 -30163 -36711 23962 36312
632C6312n2057N591N9524j7035p3514J0346N9004l1880o1320M8096P2175m4989
$$ 36312 -15745 -10154 49370 32335 -41179 -30833 28171 -3709 -65029 -16933 55242 10253
644A0253n4059O1471M7074p8305m9515P5441L1662q1662j5378R3105J0188q8021
$$ 10253 -43806 17665 64739 -13566 -63081 12360 44022 -37640 -53018 40087 50275 -37746
656c7746L830Q2542k0112q3112L0775P9932l3912o5833M6997N8143n7945o1459
$$ -37746 -33916 48626 28514 -54598 -23823 56109 22197 -43636 3361 61504 3559 -57900
668e7900N0632M4448n7555l6032O9583M3606n8160l1347N9909J9769p4234l0895
$$ -57900 -7268 37180 -20375 -56407 13176 56782 -1378 -32725 27184 46953 -27281 -58176
680e8176O4466K0910o4329o041Q0288J1611p4229o54P1556j7354q0557K3296P8113
$$ -58176 6290 27200 -37129 -43170 37118 48729 -25500 -26154 45402 28048 -52509 -29213 48900
693D8900l1840o8831N0473O6156o2987o2610O6495M7189p5317l2808Q6520K8651
$$ 48900 17060 -51771 -1298 64858 1871 -60739 5756 52945 -22372 -55180 31340 59991
705E9991q0209j4776P3898p489q0788N473O5880j3824m8171L2503N2149k5457
$$ 59991 -20218 -34994 38904 31415 -49373 -43900 21980 8156 -40015 -7512 44637 19180
717A9180l7633K4089J8984l6355k3711K8676J8767k1128n224L0886J1613k7538
$$ 19180 -18453 5636 24620 -11735 -35446 -6770 11997 -9131 -14355 16531 28144 606
729F06j4024K1499P269k7424q306L2061J2227k8773q907K7874k46l6923j348L3066
$$ 606 -13418 8081 15350 -12074 -20380 11681 23908 -4865 -13772 14102 13856 -23067 -24415 8651
743H651j668k2730J7773K7051j7867k2245J4378K342k9128k975K6689m55j2449
$$ 8651 6983 -15747 2026 29077 11210 -11035 3343 5685 -23443 -26418 271 -184 -12633
756a2633K2065J7896k0479r671J7312j1282k7753J4426K3700k1683j1014L9557
$$ -12633 9432 27328 6849 -2822 14490 3208 -24545 -10119 13581 -8102 -19116 20441
768B0441R461m4807k985M3536j2575m8772K1101N0126k2851m0460L0430L1400
$$ 20441 29902 -14905 -17890 25646 13071 -35701 -14600 35526 12675 -27785 2645 34045
780C4045l9809l2515L2507K0676k9934o505L7898J1250k6842n442J9164o603l0111
$$ 34045 -5764 -38279 -5772 14904 -15030 -21535 16363 27613 771 -4671 14493 7890 -22221
793b2221k499K5626M229j9869O709L6469L85m0385l043L9591r926n4724J3315
$$ -22221 -24720 906 5135 -14734 -8025 28444 28829 -11556 -14599 24992 15066 -39658 -26343
806b6343O2442j5817n9543K9817O3135m4351o5721M9320N6836o0076m3513P6014
$$ -26343 36099 20282 -39261 -9444 53691 9340 -56381 -7061 49775 -10301 -53814 22200
818B2200L7810p9160k5033P6579J238q6536O883Q3268j4706o7507L7232O9530
$$ 22200 60010 -19150 -44183 32396 33634 -52902 -46019 37249 22543 -44964 -7732 61798
830F1798m1132o2864L8631M1991n1403l9643N0953L6163l9464j9922M5975J7085
$$ 61798 20666 -42198 -3567 38424 -12979 -52622 -1669 34494 -4970 -24892 21083 38168
842C8168m6229j8876L7378R196m0514m863M7352O884m6654j488M6658r815n6674
$$ 38168 -8061 -26937 10441 19637 -20877 -25740 21612 28496 -18158 -19646 27012 17197 -39477
855c9477J2536N9887j6627n3398L3726N6436m1836n7422M1837L9731n6298l2880
$$ -39477 -26941 32946 16319 -37079 -3353 53083 11247 -46175 -4338 35393 -20905 -53785
867e3785O4046K9991n4310o837N9215n242o0250P097M2898k3416l6049L2955L3207
$$ -53785 10261 40252 -14058 -20895 38320 33078 -27172 -20075 22823 -593 -36642 -3687 29520
880B9520k6908j6703K9513O650l2257o637K1349L32j4514N798J3980q16q836n232
$$ 29520 2612 -14091 15422 22072 -10185 -16822 4527 4859 -9655 -3857 10123 9307 471 -4761
894d761j440K660k806p021P834J8155k229j2371Q714R413k1548j6529J7433O852
$$ -4761 -6201 -3541 -6347 -13368 -5534 12621 10392 -1979 6735 16148 -5400 -21929 -4496 2356
908B356j8754O708K9080l382j9678J2961J1410k6552j3447K2373J027k2044J3812
$$ 2356 -16398 -9690 19390 16008 -3670 9291 20701 -5851 -19298 3075 4102 -17942 -4130
921d130K6670j7413j8271K3375M832l5252J221L4583j0868k8137K9305K6579l8237
$$ -4130 22540 5127 -13144 10231 15063 -20189 -18968 15615 4747 -23390 5915 32494 -5743
934e743k1498L9630L087n0331P039N5119j1201m3220L0935M3192m0627m1885L7262
$$ -5743 -27241 12389 15476 -34855 -27816 27303 16102 -27118 3817 47009 6382 -35503 1759
947A759K4434m7076j6732N2337J6883m1616l042M1490l502m4890j837L4178l022
$$ 1759 26193 -20883 -37615 14722 31605 -10011 -13053 28437 24935 -19955 -21792 12386 9364
960I364l1680O071L7378L4l6450k208L4728l735m3853M458N0027k353m7525J4268
$$ 9364 -22316 -16245 21133 21167 -15283 -17491 17237 13502 -30351 -25893 24134 21781 -25744 -11476
974a1476N2217k3720n8361K4702M9401l7516m1663N2616M3134n0913k7056N7607
$$ -11476 40741 17021 -41340 -16638 32763 -4753 -46416 6200 49334 -1579 -28635 28972
986B8972J0387o8393p470O1012q297n5623K4571N9023k6834m8893L1053L6759
$$ 28972 39359 -29034 -36504 24508 16211 -39412 -14841 44182 17348 -31545 -492 36267
998C6267m2028l5708L9187K9116l3962j8102L6252J6899l3970j9136K5582J3339
$$ 36267 -5761 -41469 -2282 26834 -7128 -25230 11022 27921 -6049 -25185 397 13736
1010A3736k5341j1681L1346J8611k4402j5050K5546Q733l6469j3273L4695Q296
$$ 13736 -11605 -23286 8060 26671 2269 -12781 12765 21498 -14971 -28244 6451 14747
1022A4747l2988O101M2778o808m0049J2072K9764k8673l2004L0951K4463l1194
$$ 14747 -18241 -12140 30638 23830 -16219 -4147 25617 -3056 -35060 -4109 20354 -10840
1034a0840q727L9735K522l9639L221L0964j7854k8480K5376K4730k4131r972K8826
$$ -10840 -19567 20168 22690 -16949 -13728 17236 -618 -29098 -3722 21008 -3123 -13095 15731
1047A5731M14l1772J544K3688j1528j6025K0699J7248j5540n253J5139o403j9806
$$ 15731 16145 -15627 -14083 9605 -1923 -17948 2751 19999 4459 -794 14345 7942 -11864
1060a1864L353R472r295j973J7963M811j1227J853R444j1190j5051M504R406m733
$$ -11864 -8511 961 -8334 -10307 7656 12467 1240 3093 12537 1347 -13704 -9200 206 -4527
1074d527l686Q205R589j255j0239n596Q020L793j4949n179K3797J1733k2928o617
$$ -4527 -8213 -8 9581 8326 -1913 -7509 511 4304 -10645 -15824 7973 19706 -3222 -9839
1088i839K7384q61l7380Q28L5086q561l0670K4149L4512k7278k7951L2179J3536
$$ -9839 17545 16684 -20696 -19868 15218 6657 -24013 136 34648 7370 -20581 11598 25134
1101B5134m6901j1994M8193L338m5306J3498N1327j8055m9117K1147L8302l3228
$$ 25134 -21767 -33761 14432 17770 -27536 -14038 37289 19234 -29883 -8736 29566 -3662
1113c662l6592L6446L3563l2803k0613L6683J5628l8927j5242L2777Q474l1835
$$ -3662 -40254 -3808 29755 -3048 -23661 13022 28650 -10277 -25519 7258 15732 -16103
1125a6103k280L8128O223l4841m068L2977l469m2639J42M3596J54m0312J0576
$$ -16103 -18383 19745 25968 -8873 -12941 20036 16567 -26072 -25930 17666 17820 -22492 -11916
1138a1916M7619j2526n0036J1906M1014k5161m1809L1987L8966l0655k4826M0403
$$ -11916 35703 23177 -26859 -14953 26061 900 -40909 -8922 30044 -611 -25437 14966
1150A4966J5680m6724j0268M2797m193m3169J7125M6842k0050l9035K7622L2103
$$ 14966 30646 -16078 -26346 16451 12258 -30911 -13786 33056 13006 -26029 1593 33696
1162C3696l7562l1889L6197K5304l3178j3529L7105J3003l2455j1908K2759R20
$$ 33696 -3866 -35755 442 25746 -7432 -20961 16144 29147 -3308 -15216 7543 8463
1174H463k4867j481K2691M796j3457K410J6111l984k0810j419J4657m057j6940
$$ 8463 -16404 -17885 4806 9602 -3855 -1445 14666 10682 -10128 -11547 3110 -947 -17887
1187a7887R589K4439n777k0668R749J9662j8046k3434J7071K0351j7373j1282
$$ -17887 -8298 16141 10364 -10304 -555 19107 1061 -22373 -5302 15049 -2324 -13606
1199a3606K4495J0289k4070p077J9544o078k1570J0169K0874j0556j1386K0248
$$ -13606 10889 21178 -2892 -9969 9575 3497 -18073 -7904 12970 2414 -8972 11276
1211A1276Q711k5295r330J9367j635k2104N949K4315l647j4439J0148J0856j4609
$$ 11276 19987 -5308 -14638 4729 3094 -19010 -13061 11254 7607 -6832 3316 14172 -437
1224d37j1815R882K319j0473M834J5527k744j0458Q143P942j5555j1545J3234
$$ -437 -12252 -2370 -51 -10524 -5690 9837 7093 -3365 4778 12720 -2835 -14380 -1146
1237a146R983j3339m682K0145Q100j9676r159J5608J472k2293k406K4867M095
$$ -1146 8837 -4502 -9184 10961 19061 -615 -9774 5834 7306 -14987 -17393 7474 11569
1250A1569k0259N323K2997j0038k7800Q929K1383j8383k0959K8080K4452k7252
$$ 11569 -8690 -3367 19630 9592 -18208 -9279 12104 -6279 -27238 842 25294 -1958
1262a958j6298L3786J0501m2837j0737M1520M394m1471O011M7452o549m5207J0410
$$ -1958 -18256 15530 26031 -16806 -27543 13977 18371 -23100 -17089 30363 23814 -21393 -10983
1275a0983L8068k0018l9263K1322L7003k0288k7609K7206K4283l0597k4353K5767
$$ -10983 27085 7067 -32196 -10874 26129 5841 -21768 5438 29721 -876 -25229 538
1287E38J4481k9657j0798L4625J2829k9136n889L0213k91l5788k667L2993j876
$$ 538 15019 -14638 -25436 9189 22018 -7118 -13007 17206 16915 -18873 -21540 11453 9577
1300I577k9808J0559L5189r211l2294J1598K6181k0329k8157K2535K5558k2381
$$ 9577 -20231 -9672 25517 16306 -15988 -4390 21791 1462 -26695 -4160 21398 -983
1312i83j6315L0560J3015l4642j2196L1180J969l5522L838L9526l926l4040J1104
$$ -983 -17298 13262 26277 -8365 -20561 10619 12588 -22934 -19096 20430 16504 -17536 -6432
1325f432L1795j8352l4895J6122K7471j7759j9779K3839K1035j9854j4049J7370
$$ -6432 25363 7011 -27884 -11762 15709 -2050 -21829 2010 23045 3191 -10858 6512
1337F512M863k2109l647J8961L04j2834R986J5209j1485j4450J0493P571j8025
$$ 6512 11375 -10734 -14381 4580 4884 -7950 2036 17245 5760 -8690 1803 9374 -8651
1350h651q012K0483R412j6846k984J9184L48k3205l280J7359k063j6236P446K0006
$$ -8651 -16663 3820 13232 -3614 -6598 12586 12934 -10271 -13551 3808 1745 -14491 -7045 12961
1364A2961m200j4849P163R768j3529j3364J1746J0273j0480m096J8093O333j6638
$$ 12961 8761 -6088 1075 10843 -2686 -16050 -4304 5969 -4511 -8607 9486 15819 -819
1377h19n433J2870j919j6661J835J6792m12j1102P626J1630j1468j2832Q992N021
$$ -819 -6252 6618 4699 -11962 -10127 6665 6253 -4849 2777 14407 2939 -9893 -901 4120
1391D120j4500k001K0309L373j8544L404K0480j0348k6457R149K3256j3195k0012
$$ 4120 -10380 -12381 7928 11301 -7243 -3839 16641 6293 -20164 -11015 12241 -954 -20966
1404b0966K2339K3634k1434j9681K1839J1806k9011j1326K8597Q271k4085J834
$$ -20966 1373 25007 3573 -16108 5731 17537 -11474 -22800 5797 14068 -10017 -8183
1416h183K8144m401k7704N039K0717j3916k0573J7475K1289j6351j3736K0927
$$ -8183 19961 15560 -12144 -7105 13612 -304 -20877 -3402 17887 1536 -12200 8727
1428H727J0194k5906j1849K2087O111k3428o13K8263K964k5658L76K3924p381
$$ 8727 18921 -6985 -18834 3253 9364 -14064 -14677 13586 16550 -9108 -8732 15192 7811
1441G811k8836O579K7700p157k3364J6124K6740j7212k6656J6382J9592k2778
$$ 7811 -21025 -14446 13254 6097 -17267 -1143 25597 8385 -18271 -1889 17703 -5075
1453e075j9482K6643J9466k4144j0755K7849N948l1751o138K6368j276k5855Q527
$$ -5075 -24557 2086 21552 -2592 -13347 14502 20450 -11301 -17439 8929 7653 -18202 -9675
1466i675K8183q427k2264J1435J6581j8977j7558J7514J2871j6040n166K2055
$$ -9675 18508 10081 -12183 -748 15833 -3144 -20702 -3188 9683 -6357 -11523 10532
1478A0532N070j9867m062J6534l565j9720M468K0408j929j5338Q033J7419j0019
$$ 10532 15602 -4265 -8327 8207 4642 -15078 -10610 9798 7869 -7469 564 17983 7964
1491G964k0800O977J5700j0689j5521J5234J8787j2959j4611J4394Q999k0272
$$ 7964 -12836 -5859 9841 -848 -16369 -1135 17652 4693 -9918 4476 13475 -6797
1503f797j0304J8215M998j6196L571K0970o242j8126R092J2383j8895j1969K1605
$$ -6797 -17101 1114 6112 -10084 -6513 14457 8215 -9911 -819 11564 -7331 -19300 2305
1516B305J0341k0876j77K6153k267k7557L612K2100j2228k0930J6015K0584j4204
$$ 2305 12646 -8230 -8407 17746 15479 -12078 -8466 13634 1406 -19524 -3509 17075 2871
1529B871j1916J7609P410k1183p479J5293O10j4353M518J6756l125j1446M686
$$ 2871 -9045 8564 15974 -5209 -12688 2605 3215 -11138 -6620 10136 7011 -4435 251
1542B51O949r438r424O478P208m579j895Q957N089p833n590N684M05r957j172
$$ 251 7200 -2238 -11662 -5184 2024 -2555 -4450 4507 9596 1763 -3827 1857 2262 -7695 -8867
1557h867J3206L053j0528K917J5207o262j9838M303J7597j0985j8272J6993K1512
$$ -8867 4339 7392 -3136 -219 14988 8726 -11112 -6809 10788 -197 -18469 -1476 20036
1570B0036j6376j7805J9979J2420k6881j3036K4939P442k3124Q54K6498j859k3762
$$ 20036 3660 -14145 5834 18254 -8627 -21663 3276 10718 -12406 -11552 14946 13087 -10675
1583a0675N282J7031j2775j7123J4557J5061j2745p143J7943N989j8567o156J4041
$$ -10675 -5393 11638 -1137 -18260 -3703 11358 -1387 -8530 9413 15402 -3165 -9321 4720
1596D720Q17j5879P16J7922L065j4110m65J4612k873j9696j374J8221o06j7765
$$ 4720 5537 -10342 -9626 8296 11361 -2749 -3214 11398 8525 -11171 -12545 5676 5070 -12695
1610a2695O226K2675n919k3469Q115J9693j6355k2285J9947K1597k0496j3502
$$ -12695 -6469 16206 10287 -13182 -5067 14626 -1729 -24014 -4067 17530 -2966 -16468
1622a6468K7896J0424l1171p840K9083j795l0255Q482L1813j0212k3913J6990
$$ -16468 11428 21852 -9319 -17159 11924 10129 -20126 -11644 20169 9957 -13956 3034
1634C034J9217k3397j8258K1382R670k2100k224K5414qk0426M415J5212j1939
$$ 3034 22251 -1146 -19404 1978 11648 -10452 -12676 12738 12730 -7696 -3281 11931 -8
1647hj5842J0981J1130j0039m790J3831N997j2116m932P762J77r955j092J0682
$$ -8 -15850 -4869 6261 -3778 -8568 5263 11260 -856 -5788 1974 2151 -7804 -8896 1786
1661A786M378o045o30Q655l48j1634l039R360m40j0576N248J5016m319j3579Q059
$$ 1786 6164 119 -511 8144 7796 -3838 -6877 2483 2043 -8533 -3285 11731 7412 -6167 1892
1676A892J0512j5827j3151J6120J0165j7844k913K3175J643k2968R26J9087r201
$$ 1892 12404 -3423 -16574 -454 9711 -8133 -11046 12129 13772 -9196 -8270 10817 1616
1689A616k0395J2515J8374j2319j0240J8442P474k0419n291J6748k279j8127P201
$$ 1616 -18779 -6264 12110 -209 -10449 7993 15467 -4952 -10243 6505 4226 -13901 -6700
1702f700J8904n471j3065R085J1400j2882j2667P890R619q229o948J0923J0075
$$ -6700 12204 6733 -6332 2753 14153 1271 -11396 -3506 6113 -2116 -9064 1859 11934
1715A1934q135j0174O458O815j1321j0189J1902J1684j1389o773J7078O332k0390
$$ 11934 3799 -6375 83 6898 -4423 -14612 -2710 8974 -2415 -9188 7890 14222 -6168
1728f168o525J9302j51k2498N541K6355o417k1283J2825J8988j9466j9029J9449
$$ -6168 -12693 6609 6458 -16040 -10499 15856 9439 -11844 981 19969 503 -18526 923
1741I23J2050k1679m722K6020K201k3134L943J8565j2312j9620J3578J4420j4448
$$ 923 12973 -8706 -13428 12592 14793 -8341 -4398 14167 1855 -17765 -4187 10233 -4215
1754d215p467J9190O125j8676l333J4366l228j5290M096J3973k277p391N381P545
$$ -4215 -11682 7508 13633 -5043 -8376 5990 2762 -12528 -8432 5541 3264 -4127 1254 8799
1768H799n337q407J143N013k459m381M530Q958j259q375K839P190q364j1805Q610
$$ 8799 3462 -4945 -3802 1211 -1248 -5629 -1099 7859 6600 -1775 1064 8254 -110 -11915 -3305
1783c305J1198j0470o946J6637P209j8835n435J7495k473k0770N338K1909p720
$$ -3305 7893 -2577 -9523 7114 14323 -4512 -9947 7548 5075 -15695 -10357 11552 3832
1796C832j6589J5580J5087k0922j2713K0160N066k3180R03K5768j678k1488Q363
$$ 3832 -12757 2823 17910 -3012 -15725 4435 9501 -13679 -12776 12992 11314 -10174 -1811
1809a811J8966j3718j9390J3434J2920j4172p579J7579P814j5151m050J1481r13
$$ -1811 17155 3437 -15953 -2519 10401 -3771 -11350 6229 14043 -1108 -5158 6323 5410
1822E410j4299m82J1590R89p921K246J0536j305j1954r15R028k187j1546M296
$$ 5410 -8889 -9371 2219 3208 -4713 -2467 8069 6764 -5190 -6105 2923 736 -10810 -6514
1836f514J5084k391j2557O639J2518j1503j5007J1798J1407j4425o911K0911O535
$$ -6514 8570 6179 -6378 261 12779 1276 -13731 -1933 9474 -4951 -11862 9049 15584
1849A5584j9989k772J9949n578k2969O746K1039r505j5895J5623J4829j7107j2072
$$ 15584 -4405 -7177 12772 7194 -15775 -9029 12010 2505 -13390 2233 17062 -45 -12117
1862a2117J4922M799j8028j732J7351P96j2118M951J1628p846j1058N994O147
$$ -12117 2805 7604 -10424 -12156 5195 5991 -6127 -1176 10452 2606 -8452 -2458 3689
1875C689q255l561J1225N824q097l034P625J359j0945m664R481M757q800j895
$$ 3689 -4566 -8127 3098 8922 825 -2209 5416 6775 -4170 -8834 647 5404 -3396 -5291
1889e291J2740M186j3907m782J2206l12j6196J550J7772k758j4401Q761J4449
$$ -5291 7449 11635 -2272 -7054 5152 4840 -11356 -9806 7966 5208 -9193 -432 14017
1902A4017j2696j4747J2839R172j6769m646K0293L670j8308L485J7591r568j8565
$$ 14017 1321 -13426 -587 8585 -8184 -12830 7463 11133 -7175 -3690 13901 4333 -14232
1915a4232J0788J3869j3710q578J9070P491j7778l581J6933l813j9335M474J7175
$$ -14232 -3444 10425 -3285 -11863 7207 14698 -3080 -6661 10272 6459 -12876 -8402 8773
1928H773n737j2669J0429J2509j0154j2428Q313O797j0405o982J0367Q028o394
$$ 8773 3036 -9633 796 13305 3151 -9277 -964 5833 -4572 -11554 -1187 6841 447
1941D47m787P892L717r204o298P053M107p423j043J1473K762j0597m98J0108m454
$$ 447 -4340 3552 7269 -1935 -8233 -1180 2927 -4496 -5539 5934 8696 -1901 -2399 7709 3255
1956C255j4057N647J3233o691j0597J2732J1994j5466j0642J4431N364j9170l646
$$ 3255 -10802 -5155 8078 1387 -9210 3522 15516 50 -10592 3839 9203 -9967 -13613
1969a3613K0560K632j8071L692J7502o578j8163O481J2867r593j0230J3179J0825
$$ -13613 6947 9579 -8492 -4800 12702 6124 -12039 -5558 7309 -2284 -12514 665 11490
1982A1490j1379o285J2050K584j4762l398J3578J285j1477K317J4601j366j4274
$$ 11490 111 -6174 5876 8460 -6302 -9700 3878 5163 -6314 -3997 10604 9238 -5036
1995e036R42J1504m271j4884N271J5509m436j2997Q806J3398j1874j5244J0699
$$ -5036 -4094 7410 3139 -11745 -6474 9035 4599 -8398 408 13806 1932 -13312 -2613
2008b613J1246j4515q521J8418Q978j7442m264J8454m30k1677J851J9068m559
$$ -2613 8633 -5882 -14403 4015 12993 -4449 -8713 9741 9311 -12366 -10515 8553 3994
2021C994j6425J0709J7080j0923j4148J1602Q417j5417o464J4907M593j2285J369
$$ 3994 -12431 -1722 15358 4435 -9713 1889 10306 -5111 -11575 3332 7925 -4360 -2991
2034b991J3447l929j3144L470Q486p421q257Q704R342o956n113P599L933r260
$$ -2991 10456 6527 -6617 -3147 5339 -2082 -10339 -1635 7707 751 -4362 3237 7170 -2090
2048b090n839N791L722n266r32O932L312m083k276K425j386l898O51L411j070
$$ -2090 -7929 -2138 1584 -3682 -4614 2318 5630 1547 -729 1696 310 -3588 -2937 474 -596
2063e96K10M693K011o373j949N362j443r069J692J0835j106q929M778R248o817
$$ -596 -386 4307 6318 -55 -2004 3358 1915 -7154 -5462 5373 4267 -4662 116 9364 2547
2078B547j0871M812P828q268o209J1629O446r254k988J0712p78j3727P46J1929
$$ 2547 -8324 -3512 4316 -3952 -10161 1468 7914 -1340 -4328 6384 5606 -8121 -7375 4554
2092D554k792j0195P257J2425o652j1285P464P887j1254q218J1759P679j0442
$$ 4554 1762 -8433 -1176 11249 4597 -6688 776 8663 -2591 -10809 950 8629 -1813
2105a813l414J3145K138j5263k472J3006j802j5202M545J7319m049j4979O479
$$ -1813 -5227 7918 10056 -5207 -7679 5327 3525 -11677 -7132 10187 6138 -8841 -2362
2118b362J5165j0698j7315J0008J4999j1098j2240J4431J4506j4223j1386J3790
$$ -2362 12803 2105 -15210 -5202 9797 -1301 -13541 890 15396 1173 -10213 3577
2130C577O802j5956o242J5918L930j3212J260J4397l407j3749L859J0229q281
$$ 3577 10379 -5577 -11819 4099 8029 -5183 -3923 10474 7067 -6682 -2823 7406 -875
2143h75r971J1114R863j0423o449J1901M169j5146m814J2915K098j3201J755J5645
$$ -875 -10846 268 10131 -292 -6741 5160 9329 -5817 -10631 2284 4382 -8819 -7064 8581
2157H581q61j3489J877J1939o021j3010N587J2524n881q921R409J0430r518r781
$$ 8581 7720 -5769 -3892 8047 2026 -10984 -5397 7127 1246 -7675 1734 12164 2646 -7135
2171g135Q014O412j0935n711J1723N679r196k621J0078J10j1675p08R234k284
$$ -7135 879 7291 -3644 -9355 2368 8047 -1149 -3770 6308 6418 -5257 -5965 3269 985
2185I85q165N361R369m819p613N859M775r443o007R261M861q480o55J1351J208
$$ 985 -7180 -1819 7550 2731 -4882 977 5752 -3691 -9698 -437 4424 -4056 -4711 6640 7848
2200G848j1086l06R028l947r998M903R727l860o831P733O110r396o127P690K607
$$ 7848 -3238 -3544 5484 1537 -8461 -3558 6169 2309 -4522 3211 9321 -75 -6202 1488 4095
2215D095r409l02J0320M96q413K490O416n458p808N128M629n537j810Q931J779
$$ 4095 -5314 -5616 4704 5200 -3213 -723 5693 235 -7573 -2445 2184 -3353 -5163 3768 5547
2230E547p187m77O385l063q860L299P853k832n321O876O270o124o334M712L233
$$ 5547 -1640 -2117 4268 1205 -7655 -4356 3497 665 -4656 2220 8490 2366 -3968 744 3977
2245C977o702l671P370M132n547j710P335L20r290j458P667j299p931L427J0553
$$ 3977 -2725 -6396 974 5106 -441 -2151 5184 5504 -3786 -5244 2423 1124 -6807 -3380 7173
2260G173l244j0050N327Q049q518j0351R289R731r480n897J3315O308j4626n326
$$ 7173 3929 -6121 -794 7255 -1263 -11614 -2325 7406 -2074 -7971 5344 11652 -2974 -8300
2274h300J4441n09j5578K032J6383k792j3111P472J3043r892j3306R833Q903j2182
$$ -8300 6141 5632 -9946 -7914 8469 5677 -7434 38 13081 3189 -10117 -284 8619 -3563
2288c563p378J4417P029j3144m501J3359J032j4763j673J3336K87j1470K282J3152
$$ -3563 -10941 3476 10505 -2639 -7140 6219 7251 -7512 -9185 4151 4438 -7032 -4750 8402
2302H402k697j1994K436J0124n724j1033O821J1398n069q289Q491Q399j0294r609
$$ 8402 5705 -6289 -3853 6271 547 -10486 -3665 7733 2664 -5625 2866 11265 971 -8638
2316h638R531N702j1778l501J4190L470j2679m13J2876l261j4397L235J2029n515
$$ -8638 893 6595 -5183 -8684 5506 8976 -3703 -4116 8760 5499 -8898 -5663 6366 851
2330H51j0089Q911R676q915p769Q456M439j0840l164J0550K445p541J363P975
$$ 851 -9238 -327 9349 434 -7335 1121 5560 -5280 -8444 2106 4551 -2990 -1627 6348
2344F348k237p524P37M039k002l858L155N016k84k258N30K421k152m714r24L754
$$ 6348 4111 -3413 -2676 1363 -639 -4497 -1342 3674 3390 1132 1662 4083 1931 -2783 -3707 47
2360D7M93k902J572M086l69l796J64J251k632j431L200L93k212L295L275m995
$$ 47 540 -2362 -790 3296 2927 -869 -705 546 -2086 -3517 -317 76 -2136 1159 4434 -561
2376e61l792N606R95p742L04R925Pq025L656Q395o426r279N803N882q484l354
$$ -561 -4353 1253 2248 -5494 -5190 4735 4742 -3283 373 8768 2342 -6937 -1134 4748 -3736 -7090
2392g090J1424K656r951J382J0186n635j1926N798R244q114p403J0903P735j0864
$$ -7090 4334 6990 -2961 -1579 8607 2972 -8954 -3156 6088 -2026 -9429 1474 9209 -1655
2406a655n043R849K468j1711j649J0856J540q797J712R234k336r809J819Q302
$$ -1655 -6698 3151 5619 -6092 -7741 3115 4655 -4142 -2430 6804 4468 -5341 -3522 4780
2420D780m091r010N836J1546m826r893O503J0051r439j2438Q021J1150r954r505
$$ 4780 689 -8321 -2485 9061 4235 -5658 845 10896 1457 -10981 -2960 8190 -1764 -11269
2434a1269J3091J0375j2895p984J2727L651j5075k352J4866n33j3103N291J3218
$$ -11269 1822 12197 -698 -8682 4045 7696 -7379 -9731 5135 4602 -8501 -3210 10008
2447A0008p489j1680Q443R022j1379p087J3067P148j2068l928J2370J603j3076
$$ 10008 2519 -9161 -718 8304 -3075 -10162 2905 10053 -2015 -5943 6427 8030 -5046
2460e046k776J0903J164r011R78J0037M12q275o81O602k081q793Q56Q255o85p254
$$ -5046 -7822 3081 4245 -4766 -3788 6249 6661 -1614 -2295 4307 2226 -6567 -5711 2544 1859 -5395
2476e395L631R576m959r458M902Q200q116q110R579Q676r764n547J1544L028j2882
$$ -5395 -1764 7812 2853 -6605 -1703 6497 -1619 -9729 -150 8526 -1238 -6785 4759 7787 -5095
2491e095j705J1588r83r854M652J0635o125p640P193L792j0632l463R849J324
$$ -5095 -6800 4788 3805 -6049 -1397 9238 3113 -4527 2666 6458 -4174 -7637 2212 3536
2505C536q209K464R312k793p819K526M295n104l894L631K655j871Q98K570j239
$$ 3536 -4673 -2209 7103 4310 -3509 -983 3312 -1792 -5686 -2055 600 -1271 -373 2197 958
2520I58j391J148j055k471J764K941j361j122K546O66k476j806J240J41r02N14
$$ 958 -433 715 -340 -2811 -1047 1894 533 -589 1957 2623 147 -1659 -419 -278 -1180 -666
2536f66J505J645P01k193o34R32j546m529J156M731j079l383M198N745n853n145
$$ -666 839 2484 3185 992 358 1290 -256 -4785 -3629 1102 23 -3360 838 6583 730 -4415
2552d415N485L192r252k652J0607J865r968J718J0900l791j0617M995R092p641
$$ -4415 1070 4262 -4990 -7642 2965 4830 -5138 -3420 7480 3689 -6928 -1933 7159 -482
2566d82o978J0234O456j0263m846J0801J255j2550r86J1238j26r383L050J0831
$$ -482 -7460 2774 9230 -1033 -5879 4922 6177 -6373 -7359 3879 3753 -5630 -2580 8251
2580H251k644j0579K149P942m965r323M107R950l214p831N497R285o019j0105
$$ 8251 5607 -4972 -2823 5119 154 -9169 -5062 4888 1674 -6157 -660 8625 2606 -7499
2594g499N995Q753q101q317J0066Q925j0715p148J2530M409j4444l107J4925Q58
$$ -7499 -1504 7249 -852 -9169 897 9822 -893 -8041 4489 8898 -5546 -8653 6272 7130
2608G130j3605K349J5010m971j4610O149J0875j0123r949J0950R041r967n083
$$ 7130 -6475 -4126 10884 5913 -8697 -2548 8327 -1796 -11745 -795 8246 -1721 -6804
2621f804J1957L613j2309l294R599O1r672O98R949J73o719J451O625k107o571
$$ -6804 5153 8766 -3543 -6837 2762 2823 -6849 -6151 3798 3971 -2748 -1297 5328 3221 -3350
2636c350N29N846p00n662J475O926j628o969J161O213l138o469M427P017m312
$$ -3350 -2821 3025 2325 -3337 -1862 5064 3436 -3533 -2372 3841 703 -5766 -1339 5678 1366
2651A366m968O011L481q374l993O965N84p417J994Q796j373o225M341M584o393
$$ 1366 -3602 2409 5890 -2484 -6477 488 1072 -6345 -4351 4445 3072 -3153 1188 5772 -621
2666f21m535N204J522n530J098O475j172m264L097K767n169j696M816J80m091
$$ -621 -5156 48 1570 -3960 -2862 3613 2441 -1823 1274 4041 -1128 -2824 1992 2172 -1919
2681a919J556M579l088m317L179J810m740j679N332J531l811J310M690k211n428
$$ -1919 -363 4216 1128 -3189 -10 1800 -2940 -4619 713 2244 -1567 -257 4433 2222 -3206
2696c206J369K705l302l083L486M682j545k536L408L426l949n462K899M556l856
$$ -3206 -1837 868 -2434 -5517 -2031 2651 1106 -1430 1978 5404 1455 -4007 -1108 3448 -408
2711d08m935N804N831n928m843O488L951q708l167R334K144r466M40J0211l355
$$ -408 -5343 461 6292 364 -4479 2009 5960 -2748 -5915 3419 5563 -3903 -3463 6748 3393
2726C393j1315L801R639o426r345R707R995r087o973J0570N282j2785n345J0473
$$ 3393 -7922 -4121 5518 -908 -10253 -546 9449 362 -6611 3959 9241 -3544 -8889 1584
2740A584L372j1231P5J1733J249r763M22R104k370r807J986Q627k869p737M408
$$ 1584 4956 -6275 -6200 5533 6782 -2981 -2559 6545 4175 -5632 -3646 4981 2112 -5625 -1217
2755a217Q377n185q886M774Q236o248q230Q497Q382q111p629R022N727j1348o360
$$ -1217 7160 1975 -6911 -2137 6099 -149 -8379 118 8500 389 -7240 1782 7509 -3839 -10199
2770a0199J1077M133j0307o76J2788M25j1387K317R664n869j0966O371R103p342
$$ -10199 878 5011 -5296 -5972 6816 7241 -4146 -1829 7835 1966 -9000 -2629 6474 -868
2784h68o526R950O481r890n059R552K804r818k538R211J524p713p63O290k89o423
$$ -868 -7394 2556 9037 -853 -5912 3640 6444 -3374 -5912 3299 4823 -2890 -3653 2637 2348 -4075
2800d075l81N672J98l907J497M366n87m326O95K386k700l373K044L578p92j999
$$ -4075 -4456 1216 1414 -2493 -996 3370 2783 -1543 -848 1538 -1162 -4535 -2491 1087 295 -1704
2816a704M172K756l027l320K217R86l911j227L182J007j894J006J786j451j512
$$ -1704 2468 5224 2197 -1123 1094 2080 -1831 -3058 124 1131 -763 243 2029 578 -934
2831i34J674m44k312J228K672j540k356K047J192l668j724L351J203k285J422
$$ -934 740 296 -2016 -788 1884 344 -2012 35 1227 -2441 -4165 -814 389 -1896 -474
2846d74M009q77k839J840O97m612k297M357J172m184J782O467m88o036O05N468
$$ -474 3535 2658 -181 1659 2356 -2256 -4553 -196 976 -3208 -1426 5041 4553 -1483 -878 4590
2862D590k684o681J904O156k406n639L405O039m218n588L946N232m245m816N936
$$ 4590 1906 -4775 -2871 3285 879 -4760 -1355 4684 466 -5122 -1176 4056 -189 -5005 931
2877I31M909o176m926O972K209q437k380R316K127q078O34J0657p73j0770P66
$$ 931 5840 -336 -5262 1710 3919 -4518 -6898 2418 4545 -3533 -2899 7758 6985 -3785 -3019
2892c019Q888m046j0218M336R984m606p391P371P253q160o538Q218L446r657k918
$$ -3019 5869 1823 -8395 -4059 5925 1319 -6072 1299 8552 392 -6146 2072 5518 -4139 -7057
2907g057J0152J734r877j26R938j189j0134J956R775j681q392L494R200m452q757
$$ -7057 3095 4829 -5048 -5174 4764 3575 -6559 -4603 5172 3491 -4901 -1407 7793 3341 -5416
2922e416L188O836n213o762O336P107m739m546O115M665p627m906O232J998p388
$$ -5416 -2228 4608 -605 -7367 -1031 6076 1337 -3209 2906 7571 -56 -4962 1270 3268 -4120
2937d120j882Q226J844o982K14P493j428q030J708O979k776n995L368O053m327
$$ -4120 -6002 2224 4068 -2914 -2700 4793 3365 -4665 -2957 4022 1246 -4749 -1381 4672 345
2952C45n549M145M431n023k948N935L531m297j857N107K87o163j172L942p06l272
$$ 345 -5204 -1059 3372 -1651 -4599 1336 4867 570 -1287 3820 4107 -2056 -3228 714 8 -3264
2968c264J403M739l86k718J907J614k569k601Q10O35j786L05J404O11n58O61M67
$$ -3264 -1861 2878 2492 -226 1681 3295 726 -1875 -1065 -430 -2216 -1911 -507 104 -454 207 674
2985F74j523K70J306j80j120J142J312j691j278O77M32j829q1L110J044j812J104
$$ 674 -849 -579 727 547 -573 569 1881 190 -1088 -411 21 -1808 -1889 1221 2265 453 1557
3002A557K255j478l471L14J427k218k848K952L673j666k494L611L035m895l470
$$ 1557 3812 2334 -1137 -823 604 -1614 -4462 -1510 2163 497 -1997 1614 4649 -246 -3716
3017c716L689K713n232k269N644K533o019j282O431Q79o942O35P220l06p064K066
$$ -3716 -27 2686 -2546 -4815 829 3362 -2657 -3939 2492 3371 -3571 -2936 4284 3978 -3086 -1020
3033a020P022l954p539K967O499m620n401O775N831n442m414O733K985q612l874
$$ -1020 6002 2048 -5491 -2524 3975 -645 -6046 729 6560 1118 -3296 3437 6422 -2190 -6064
3048f064O837J522p620l9Q895M70p562J394P670k577q643K724Q012l885p358M826
$$ -6064 773 2295 -5325 -5364 3531 4001 -3561 -2167 5503 2926 -5717 -2993 5019 1134 -6224 -1398
3064a398P435n617p110O073O990o581n945Q337O179q151n133Q154K813j0063l052
$$ -1398 6037 420 -6690 -617 6373 -208 -6153 2184 8363 212 -4921 3233 6046 -4017 -7069
3079g069Q704K029q387J107R229o19q211K193O239m691o688L443N407m153l689
$$ -7069 1635 3664 -4723 -3616 5613 4994 -3217 -1024 5215 524 -6164 -2721 2686 -1467 -5156
3094e156O241L592n413k045N090R71m858j195M671R07m531J47L653j94m829P23
$$ -5156 1085 4677 -736 -2781 2309 3280 -1578 -2773 1898 2805 -1726 -1579 2074 1880 -2949 -2226
3110b226L742N18l315J386L983q29m084k03K423j924m184J683L804o51k029K596
$$ -2226 1516 2034 -1281 105 4088 3259 -825 -1028 1395 -529 -4713 -3030 774 123 -1906 690
3126F90L251k486k659J176Q46k370p78J422L90k6P31N77r22N87J107j428j035
$$ 690 3941 1455 -1204 -28 818 -1552 -2330 -908 -518 -544 187 764 -158 429 1536 108 -927
3143i27K612R49l325m94K708m49l938L56L756r63k819L279L057k563k145K663
$$ -927 1685 2634 -691 -1185 1523 1074 -2864 -2508 1248 285 -2534 745 3802 1239 -906 1757
3159A757j48m621r22L720j63l491K234N166j263l619J673L396l039m134K258L727
$$ 1757 1609 -3012 -3934 -214 -377 -3868 -1634 3532 2269 -1350 323 3719 680 -3454 -1196 2531
3175B531k191l644K819L992k937m044L568M156l572l603M658L661n484m098N505
$$ 2531 340 -3304 -485 3507 570 -3474 94 4250 678 -2925 1733 5394 -90 -4188 1317
3190A317J965p368k485Q484J626o978Q00Q885j167q908J399P199m695p734M969
$$ 1317 3282 -4086 -6571 1913 3539 -3439 -2639 6246 5079 -3829 -2430 4769 74 -7660 -2691
3205b691O880n236l966P202L919o792k794O835J047p417k4O700r22o604J624O063
$$ -2691 4189 -1047 -5013 2189 6108 -684 -3478 3357 4404 -3013 -3037 3663 2741 -3863 -2239 3824
3221C824k353o354L153O167k053n718L574N174l657o690K842N002m542n301N286
$$ 3824 1471 -4883 -1730 4437 2384 -3334 240 5414 1757 -4933 -2091 2911 -1631 -6932 -1646
3236a646O040l731m223N821M122o706m101N627J822p006j407P938Q41o599J535
$$ -1646 4394 663 -3560 2261 6383 -323 -4424 1203 3025 -3981 -5388 2550 3391 -3208 -1673
3251a673O805k257o376L229M943m002m394M486L109m885l005M265J330m383L74
$$ -1673 5132 2875 -3501 -272 4671 669 -3725 761 3870 -1015 -4020 245 1575 -2808 -2434
3266b434M427K87k771R64K262j901k869L47O58m95j295J545K500K75p88N02J290
$$ -2434 1993 2280 -491 473 2735 834 -2035 -1688 -1030 -1525 -2820 -1275 1225 1500 712 1214 2504
3283B504n45k855O9J460o31j930J376J953n15j601J248R66j484m87J654k74j151
$$ 2504 1959 -896 -827 633 2 -1928 -552 1401 886 -715 533 1499 15 -472 1182 908 -243
3300b43N90q1j274r99J052m94j186K260K162j523m75K958L2m451m90L413j972
$$ -243 347 266 -1008 -2007 -955 -1449 -2635 -375 1787 264 -211 2747 2779 -1672 -2162 1251 -721
3317g21l616K861M624k564k895M651K678n022k738M786J232n843l61N209p41m517
$$ -721 -4337 -1476 3148 584 -2311 2340 5018 -4 -2742 2044 3276 -2567 -2928 2281 1540 -2977
3333b977J236M327j608l988K156M073k150k825K016K661l276l290J961K829k740
$$ -2977 -1741 2586 978 -3010 -854 3219 1069 -1756 260 2921 -355 -3645 -1684 1145 -1595
3348a595k475M446L678l246k330M325J852n917l010N153J872o682l07P670P94
$$ -1595 -4070 376 4054 808 -1522 2803 4655 -1262 -4272 881 2753 -3929 -4236 3434 4228
3363D228p165J128P499k503p986L282O492m722o054N371M722n916m103O533K988
$$ 4228 -2937 -1809 5690 3187 -4799 -1517 4975 253 -5801 -430 4292 -1624 -5727 806 3794
3378C794o271j251O643J091n821K08M695j867n400R04M463j269k872K721M013
$$ 3794 -2477 -3728 2915 4006 -1815 -1607 3088 1221 -4179 -3275 1188 -81 -2953 -232 3781
3393C781j043l233J180K622k265l989J571L334k311l153L469L262k737l452M019
$$ 3781 2738 -495 685 3307 1042 -2947 -1376 1958 -353 -3506 -37 3225 488 -2964 1055
3408A055K890m890k402M648K215n553j134M590k5n190R75M278l49l382K866L311
$$ 1055 3945 -945 -3347 1301 3516 -2037 -3171 1419 1394 -3796 -2821 1457 1108 -2274 592 3903
3424C903k738k148J855M98l855q8K837j95j652J896K908j715j245J003O65k710
$$ 3903 1165 -983 872 1370 -2485 -2573 264 69 -1583 313 3221 1506 261 1264 1929 -781
3440g81p16J099j35p96M31N11O9P7J27J38j52L33K68J5p65K11m2o83o94L4P77
$$ -781 -1497 -398 -533 -1329 -898 -387 -318 -241 -114 24 -128 205 473 488 -277 -66 -108 -791 -1485 -1451 -674
3461f74N07L95P92J159k04j046J64K12k249j528J702J603k559m36M592P16m266
$$ -674 -167 228 1020 2179 1975 929 1093 1305 -944 -2472 -770 833 -1726 -2162 2430 3146 -1120
3478a120M1M454r60o280J551N447k591m854K954M548l944l530M379L027l738j418
$$ -1120 -1079 3375 2415 -3865 -2314 3133 542 -4312 -1358 3190 -754 -4284 95 3122 -616 -2034
3494b034N090M51m855k99M215k094m477J879M547k128k820L481L527k098m192
$$ -2034 3056 3507 -1348 -1647 2568 474 -4003 -2124 2423 295 -2525 956 4483 2385 -1807
3509a807K299K312l596l400K585L793k818k244L378K983l403k548L674J840m773
$$ -1807 492 2804 -792 -4192 -1607 2186 -632 -2876 502 3485 82 -2466 1208 3048 -1725
3524a725j742N049J054n700j84N672p00n699J603O792j676n481K912N233m093
$$ -1725 -3467 1582 2636 -3064 -3248 2424 1724 -3975 -2372 4420 2744 -2737 175 5408 1315
3539A315n244L497L348m434k913M720K486l437n78M573p9m530q9K965j540l256
$$ 1315 -3929 -432 2916 -1518 -4431 289 2775 -662 -1240 3333 3254 -1276 -1365 1600 60 -3196
3555c196J005L587j263k689J890K960j345k855J642K776j654k931J654K505j755
$$ -3196 -2191 1396 133 -2556 -666 2294 949 -1906 -264 2512 858 -2073 -419 2086 331
3570C31k953J839K213j771j734L121J693j667r65K135j83l299l70J884j161k037
$$ 331 -2622 -783 1430 -341 -2075 1046 2739 1072 107 2242 2059 -1240 -1610 274 -887 -2924
3586b924K082K550j326j190K319O18k477j095J796l02j907O45R49n00n9J243K99
$$ -2924 -842 1708 382 -808 1511 2129 -348 -1443 353 51 -1856 -1211 -262 -762 -821 422 721
3603G21j282N44J308o08r14J073J34j162q01J073m97j101P16J906l53n56R62J453
$$ 721 -561 -17 1291 683 -231 842 976 -186 -987 86 -411 -1512 -796 1110 757 201 1163 2616
3621B616j756k128Q14P19k147r28K012J625j182q58K453J165k682j243K214J056
$$ 2616 860 -1268 -454 265 -1882 -2810 -798 827 -355 -1213 1240 2405 -277 -1520 694 1750
3637A750k597j631L001J295l149o60L434K67l490L49M372n27l817J392L485l050
$$ 1750 -847 -2478 523 1818 -1331 -1991 1443 1710 -1780 -1431 2941 2414 -1403 -11 3474 424
3653D24l845K759K581l323k048M338K218l741j204M512J23m942o65M002o36m228
$$ 424 -3421 -662 1919 -1404 -3452 886 3104 -637 -1841 2671 2794 -2148 -2813 1189 553 -3675
3669c675J625M223j109l293K026L390j859l377K222K624k634k963K841K523l079
$$ -3675 -2050 2173 1064 -2229 -203 3187 1328 -2049 173 2797 163 -2800 41 2564 -515
3684e15k347L376K007l421j006L959J058l345j652L846q5m561k44M005o00l603
$$ -515 -2862 514 2521 -900 -1906 2053 3111 -234 -1886 1960 1875 -2686 -2930 1075 475 -3128
3700c128K110L486q86l365K133K401l080k685K760J737l152q32L651J128l175
$$ -3128 -1018 2468 1582 -1783 350 2751 -329 -3014 -254 1483 -1669 -2501 1150 2278 -897
3715h97j56L190l03k685J76L046j171k603Q29J894j561k088J585J741q54j065
$$ -897 -1053 2137 1834 -851 -675 2371 1200 -1403 -574 1320 -241 -2329 -744 997 143 -922
3731i22J928J266j627j303R33Q5j691j245J717P54p84O6K169J26j159j39M86o05
$$ -922 1006 2272 645 -658 275 360 -1331 -2576 -859 -105 -889 -823 1346 1472 313 174 660 55
3749E5p69K53L74m75K07Q48k29m18N83N96n33l00P63L39j555q6O72k72j984K84
$$ 55 -714 -461 -87 -562 -355 493 264 -154 429 1025 492 192 955 1294 -261 -347 325 53 -1931 -1647
3769a647J573r5p43J387J339j063q45Q78l21j779l12J372j46j315P90K433j13
$$ -1647 -74 -169 -912 475 1814 751 -94 784 463 -1316 -1628 -256 -402 -1717 -927 1506 1393
3786A393j796P93J414j150j893O35K332j523k156K285R69j784j253K276J394k068
$$ 1393 -403 390 1804 654 -1239 -604 1728 205 -1951 334 1303 -481 -1734 542 1936 -132
3802a32q12K674K80k711j135K559k49k964J5L332k73k485J304L592j328l304J449
$$ -132 -944 1730 2010 -701 -1836 723 474 -2490 -2475 857 584 -1901 -597 2995 1667 -1637 -188
3819a88K295j877l498K567K350j842j924L362J583l153j039K963N78l901L34L462
$$ -188 2107 230 -3268 -701 1649 -193 -2117 1245 2828 -325 -1364 1599 2177 -1724 -1390 2072
3835B072o87l841M68L931j499l501J908L971j843l237K612K416k768k824K908
$$ 2072 1385 -2456 -1988 1943 444 -3057 -1149 2822 979 -2258 354 2770 2 -2822 86
3850H6J131l135r32L130J083k320M08L212l35l121L84K321j371k585J512K094
$$ 86 1217 -1918 -2850 280 1363 -957 -549 2663 2328 -793 -409 1912 541 -2044 -532 1562
3866A562j129k084J651J978j720j573J499J598j544j387J377O01j716q62J333
$$ 1562 433 -1651 0 1978 258 -1315 184 1782 238 -1149 228 829 -887 -1749 -416
3881d16N08j098j96J648J55q40M84J405j124j936P98N57r44o65J442J265q86R1
$$ -416 92 -1006 -1202 446 601 -239 245 1650 526 -1410 -612 -55 -999 -1664 -222 1043 157 248
3899B48R30M75j178p91P04k58n69N9L31l20J0N18k92l43M28P35r25j54P47K35
$$ 248 1178 1653 475 -316 388 130 -439 -380 -49 -369 -359 159 -133 -476 -48 687 -238 -392 355 590
3919E90j070o88R45l98o75N08J273J86n08O82P28n59j427L96Q13j780o17J435
$$ 590 -480 -1168 -223 -621 -1296 -788 485 671 163 845 1573 1014 -413 -17 796 -984 -1601 -166
3937a66J180q28q70J770P93j724j379J846Q31k184q19J914O82k601J12K179j35
$$ -166 1014 186 -684 1086 1879 155 -1224 622 1453 -731 -1550 364 1046 -1555 -1443 736 601
3954F01k380P33K805r32k388J680K148k489k344K396J597k936q59L626J274k799
$$ 601 -1779 -1046 1759 827 -1561 119 2267 -222 -2566 -170 1427 -1509 -2368 1258 2532 -267
3970b67n51L294n11l155oK777r64k327M92K673j016j731J454J878j477k456J899
$$ -267 -818 2476 1965 -1190 -1196 1581 617 -1710 -1218 1455 439 -1292 162 2040 563 -1893 6
3987FJ275j631j445K105R26k317j319K587J240k550n39K967O99k894L94K681j058
$$ 6 1281 -350 -1795 310 1236 -1081 -2400 187 1427 -1123 -1662 1305 2004 -890 -496 2185 1127
4004A127l181L82L211j053k528K122K372j522j983K312J023k991j269K560K11
$$ 1127 -2054 -1672 1539 486 -2042 80 2452 930 -1053 1259 2282 -709 -1978 582 793
4019G93k272j26K234M25k509Q40J853p37j230N73J273p97j227R68K27q74n94P02
$$ 793 -1479 -1605 629 1054 -1455 -615 1238 501 -729 -156 1117 320 -907 61 288 -586 -1180 -478
4037d78R84o95k67J275M20n27n09M17k98q47o28J026M29j228M80J759n85j054
$$ -478 506 -189 -456 819 1239 712 203 620 322 -525 -1153 -127 302 -926 -446 1313 728 -326
4055c26K15Q26q03j164J070M91j116l03J367mj045J82J408o78o47J141O92j399
$$ -326 -111 715 -88 -1252 -182 309 -807 -1110 257 253 -792 -610 798 120 -527 614 1306 -93
4073i3k57J312l91j821N16J373q22o36J548J290j621p08J108M3j766k84J824l86
$$ -93 -350 962 571 -1250 -734 639 -183 -819 729 2019 398 -310 798 841 -925 -1209 615 229
4091B29j568P87J547l74j156N20Q64m99j512O11J126m65r81M93R62r53r06J298
$$ 229 -1339 -552 995 621 -535 -15 849 350 -1162 -551 575 110 -871 -378 584 -369 -1275 23
4109B3J121j288p74J990R91j958r21J718P6k475R7K274J90k269J060K485j499
$$ 23 1144 -144 -918 1072 2063 105 -816 902 978 -1497 -1400 874 1064 -1205 -145 2340 841
4126H41k243J426J558k345j867K879M97j589r40K767K43k776O28J903k82j772
$$ 841 -1402 24 1582 -763 -2630 249 746 -843 -1783 984 1227 -1549 -921 982 700 -1072
4142a072P11J406p01j344Q18J161r74j093J271P51q13m95J228M62j038j305P08
$$ -1072 -361 1045 344 -1000 -182 979 5 -1088 183 934 121 -374 854 1316 278 -1027 -319
$$ [...]
8191E7
##END NTUPLES=NMR FID
##END=
