##TITLE=1H_DHA-BF3-RT
 CDCl3, 8 sc, 
 5.4.2019
##JCAMPDX= 6.0         $$ Bruker NMR JCAMP-DX V2.0
##DATA TYPE= NMR FID
##DATA CLASS= NTUPLES
##ORIGIN= UXNMR, Bruker Analytische Messtechnik GmbH
##OWNER= root
$$ XWIN-NMR		Version 3.5
$$ Fri Apr  5 14:26:54 2019 Russian Standard Time (UT+4h)  she@DPX200
##.OBSERVE FREQUENCY= 200.1316
##.OBSERVE NUCLEUS= ^1H
##.DELAY= (6, 6)
##.ACQUISITION MODE= SIMULTANEOUS
##.ACQUISITION SCHEME= undefined
##.AVERAGES= 8
##.DIGITISER RES= 18
##SPECTROMETER/DATA SYSTEM= spect
##.PULSE SEQUENCE= zg30
##.SOLVENT NAME= CDCl3
##.SHIFT REFERENCE= (INTERNAL, CDCl3, 0, 15.7039)
##AUDIT TRAIL= $$ (NUMBER, WHEN, WHO, WHERE, WHAT)
$$ ##TITLE= Audit trail, XWIN-NMR		Version 3.5
$$ ##JCAMPDX= 5.01
$$ ##ORIGIN= Bruker BioSpin GmbH
$$ ##OWNER= she
$$ F:/spectra/data/she/nmr/H-F/1/audita.txt
$$ ##AUDIT TRAIL=  $$ (NUMBER, WHEN, WHO, WHERE, WHAT)
(   1,<2019-04-05 14:25:51.62 +0400>,<she>,<DPX200>,
      <created by zg, POWCHK disabled, PULCHK disabled
       configuration hash MD5:
       00 E9 B6 7A A2 85 ED C7 34 08 36 98 17 FE 4E 26
       data hash MD5: 16K
       15 04 03 54 DA EB 25 98 D5 DE 2B EA 88 59 F4 49>)
$$ ##END=
$$ 
$$ hash MD5
$$ C4 5C 0F E6 B8 D1 FE F3 B3 86 32 48 41 CF FD 7B
##$RELAX= 
##$RELAX= 
##$RELAX= 
##$RELAX= 
##$RELAX= 
##$RELAX= 
$$ Bruker specific parameters
$$ --------------------------
##$DU= <F:/spectra>
##$EXPNO= 1
##$NAME= <H-F>
##$PROCNO= 1
##$TYPE= <nmr>
##$USER= <she>
##$AMP= (0..31)
100 100 100 100 100 100 100 100 100 100 100 100 100 100 100 100 100 100 
100 100 100 100 100 100 100 100 100 100 100 100 100 100 
##$AQSEQ= 0
##$AQ_mod= 1
##$AUNM= <au_zg>
##$AUTOPOS= <>
##$BF1= 200.13
##$BF2= 200.13
##$BF3= 200.13
##$BF4= 200.13
##$BF5= 200.13
##$BF6= 200.13
##$BF7= 200.13
##$BF8= 200.13
##$BYTORDA= 1
##$CFDGTYP= 0
##$CFRGTYP= 5
##$CHEMSTR= <none>
##$CNST= (0..31)
1 1 145 1 1 1 1 1 1 1 1 1 1 1 1 1 1 1 1 1 1 1 1 1 1 1 1 1 1 1 1 1 
##$CPDPRG= <>
##$CPDPRG1= <>
##$CPDPRG2= <>
##$CPDPRG3= <>
##$CPDPRG4= <mlev>
##$CPDPRG5= <mlev>
##$CPDPRG6= <mlev>
##$CPDPRG7= <mlev>
##$CPDPRG8= <mlev>
##$CPDPRGB= <>
##$CPDPRGT= <>
##$D= (0..31)
0 1.2 0 0 0 0 0 0 0 0 0 0.03 0 0 0 0 0 0 0 0 0 0 0 0 0 0 0 0 0 0 0 0 
##$DATE= 1554459951
##$DBL= (0..7)
120 120 120 120 120 120 120 120 
##$DBP= (0..7)
150 150 150 150 150 150 150 150 
##$DBP07= 0
##$DBPNAM0= <>
##$DBPNAM1= <>
##$DBPNAM2= <>
##$DBPNAM3= <>
##$DBPNAM4= <>
##$DBPNAM5= <>
##$DBPNAM6= <>
##$DBPNAM7= <>
##$DBPOAL= (0..7)
0.5 0.5 0.5 0.5 0.5 0.5 0.5 0.5 
##$DBPOFFS= (0..7)
0 0 0 0 0 0 0 0 
##$DE= 6
##$DECBNUC= <off>
##$DECIM= 24
##$DECNUC= <off>
##$DECSTAT= 4
##$DIGMOD= 1
##$DIGTYP= 9
##$DL= (0..7)
0 120 120 120 120 120 120 120 
##$DP= (0..7)
150 150 150 150 150 150 150 150 
##$DP07= 0
##$DPNAME0= <>
##$DPNAME1= <>
##$DPNAME2= <>
##$DPNAME3= <>
##$DPNAME4= <>
##$DPNAME5= <>
##$DPNAME6= <>
##$DPNAME7= <>
##$DPOAL= (0..7)
0.5 0.5 0.5 0.5 0.5 0.5 0.5 0.5 
##$DPOFFS= (0..7)
0 0 0 0 0 0 0 0 
##$DQDMODE= 0
##$DR= 18
##$DS= 0
##$DSLIST= <SSSSSSSSSSSSSSS>
##$DSPFIRM= 0
$$ [...]
##$SUBNAM2= <"">
##$SUBNAM3= <"">
##$SUBNAM4= <"">
##$SUBNAM5= <"">
##$SUBNAM6= <"">
##$SUBNAM7= <"">
##$SUBNAM8= <"">
##$SUBNAM9= <"">
##$SW= 24.9336934301222
##$SWIBOX= (0..15)
0 0 2 0 0 0 0 0 0 0 0 0 0 0 0 0 
##$SW_h= 4990.01996007984
##$TD= 16384
##$TD0= 1
##$TE= 0
##$TE2= 300
##$TE3= 300
##$TEG= 300
##$TL= (0..7)
0 120 120 120 120 120 120 120 
##$TP= (0..7)
150 150 150 150 150 150 150 150 
##$TP07= 0
##$TPNAME0= <>
##$TPNAME1= <>
##$TPNAME2= <>
##$TPNAME3= <>
##$TPNAME4= <>
##$TPNAME5= <>
##$TPNAME6= <>
##$TPNAME7= <>
##$TPOAL= (0..7)
0.5 0.5 0.5 0.5 0.5 0.5 0.5 0.5 
##$TPOFFS= (0..7)
0 0 0 0 0 0 0 0 
##$TUNHIN= 0
##$TUNHOUT= 0
##$TUNXOUT= 0
##$USERA1= <user>
##$USERA2= <user>
##$USERA3= <user>
##$USERA4= <user>
##$USERA5= <user>
##$V9= 5
##$VALIST= <valist>
##$VCLIST= <CCCCCCCCCCCCCCC>
##$VD= 0
##$VDLIST= <DDDDDDDDDDDDDDD>
##$VPLIST= <PPPPPPPPPPPPPPP>
##$VTLIST= <TTTTTTTTTTTTTTT>
##$WBST= 1024
##$WBSW= 4
##$XGAIN= (0..3)
0 0 0 0 
##$XL= 0
##$YL= 0
##$YMAX_a= 500425
##$YMIN_a= -672974
##$ZGOPTNS= <>
##$ZL1= 120
##$ZL2= 120
##$ZL3= 120
##$ZL4= 120
##$ABSF1= 10
##$ABSF2= 0
##$ABSG= 5
##$ABSL= 3
##$ALPHA= 0
##$AQORDER= 0
##$ASSFAC= 0
##$ASSFACI= 0
##$ASSFACX= 0
##$ASSWID= 0
##$AUNMP= <proc_1d>
##$AZFE= 0.1
##$AZFW= 0.1
##$BCFW= 1
##$BC_mod= 2
##$BYTORDP= 1
##$COROFFS= 0
##$CY= 11.3945322036743
##$DATMOD= 1
##$DC= 2
##$DFILT= <>
##$DTYPP= 0
##$F1P= 18.9103706918063
##$F2P= -1.10871071338519
##$FCOR= 0.5
##$FTSIZE= 0
##$FT_mod= 4
##$GAMMA= 1
##$GB= 0.15
##$INTBC= 1
##$INTSCL= 1
##$ISEN= 128
##$LB= 0.24
##$LEV0= 0
##$LPBIN= 0
##$MAXI= 10000
##$MC2= 0
##$MEAN= 0
##$ME_mod= 0
##$MI= 1.114404
##$NCOEF= 0
##$NC_proc= 0
##$NLEV= 6
##$NOISF1= 3.799351
##$NOISF2= 2.8
##$NSP= 1
##$NTH_PI= 0
##$NZP= 0
##$OFFSET= 15.70392
##$PC= 1
##$PHC0= -8856.044
##$PHC1= 18.60028
##$PH_mod= 1
##$PKNL= yes
##$PPARMOD= 0
##$PSCAL= 0
##$PSIGN= 0
##$REVERSE= no
##$SF= 200.130013532006
##$SI= 16384
##$SIGF1= 3
##$SIGF2= 2
##$SINO= 400
##$SIOLD= 16384
##$SREGLST= <1H.CDCl3>
##$SSB= 0
##$STSI= 0
##$STSR= 0
##$SW_p= 3612.71676300578
##$SYMM= 0
##$S_DEV= 0
##$TDeff= 0
##$TDoff= 0
##$TI= <>
##$TILT= no
##$TM1= 0
##$TM2= 0
##$TOPLEV= 0
##$USERP1= <user>
##$USERP2= <user>
##$USERP3= <user>
##$USERP4= <user>
##$USERP5= <user>
##$WDW= 1
##$XDIM= 8192
##$YMAX_p= 0
##$YMIN_p= 0
$$ End of Bruker specific parameters
$$ ---------------------------------
##NTUPLES= NMR FID
##VAR_NAME=  TIME,          FID/REAL,        FID/IMAG
##SYMBOL=    X,             R,               I
##VAR_TYPE=  INDEPENDENT,   DEPENDENT,       DEPENDENT
##VAR_FORM=  AFFN,          ASDF,            ASDF
##VAR_DIM=   8192,          8192,            8192
##UNITS=     SECONDS,       ARBITRARY UNITS, ARBITRARY UNITS
##FACTOR=    0.0002004,     1,               1
##FIRST=     0,             0,               0
##LAST=      1.6414764,     0,               0
##MIN=       0,             -672974,         0
##MAX=       1.6414764,     500425,          0
$$ Real data points
##PAGE= N=1
##DATA TABLE= (X++(R..R)), XYDATA
0@%%%qJ6j6J6k4M0n6O4p3R7j28J58j88K28k76L26l82M47n22O08p02Q06r26J062
27E67j210J374j558J758j976K217k486K780l100L451l836M259m724N234n796O417
43C371p103P867q722R681j0765J2005j3434J5105j7089J9485k2458K6261l1315
56a7111L8400m9129O7479j07051L30556l50281n34686Q97711J94513q01116j81412
67e12127Q13052M1915o35372M9260N81157j48635m43668J47181L20079k07134
77E708k02776J92098J42792j78321p1120J33900M2876j20809l1650J00848P6674
88I0220o2466o8681P6656R8304j21303j53362J08998J30658j65844j07345K42505
99F8340J24451k41013m4907K80146l3141l36514N5791K96473j46803k85678K16421
$$ y = [0, 0, 0, 0, -8, 8, -8, 8, -16, 24, -32, 32, -41, 56, -72, 86, -102, 126, -150, 176, -206, 241, -281, 327, -375, 431, -495, 567, -643, 731, -827, 931, -1045, 1172, -1314, 1466, -1634, 1817, -2019, 2240, -2484, 2750, -3046, 3371, -3732, 4135, -4587, 5094, -5671, 6334, -7100, 8005, -9084, 10401, -12057, 14204, -17111, 21289, -27840, 39639, -67412, 263144, -87137, -621823, 275888, 470401, -330715, -512127, 300925, 342840, -292532, -243272, 337885, 189250, -254418, -107237, 212842, 5708, -197068, -4970, 137822, -40499, -111619, 22281, 65157, -55652, -87302, 13546, 90220, 27754, -40927, 35729, 134033, 12730, -140632, -31634, 99024, -66820, -174165, 68340, 192791, -48222, -93129, 187017, 153876, -182638, -126847, 169626, 22823, -262855, -46434]
110d6434K78758k26280k11098K52876J55241k57169j12873K18680O0200j65049
120e3148j1343J07678k1112n1214J9348k9299k5575R4992L9004j03443J1063J51037
132A27988k5642j73525R838J18537o0063j17698O2302J07516j9198l3622L8524
143C4957K3856k4794k8052k8315j3689J9428j093k1977L2399L7758l7030j3310
155a9862N9176k1539q3391O0097R7426r6070q4349J46746O0233k06459m9755K17015
167G9268r483k34673Q3559K69548j03747k23066J72974J83846k46399j77338K36998
178C1487R2122k64433k2905K90827M580k37611O6758K09207j16305j91544J13194
189b4623J24639j33044p9113J40455N4001j19853k3394R9854J342q7876N580Q7021
$$ y = [-46434, 232324, 6044, -205054, 47822, 203063, -54106, -166979, 51701, 111901, -53148, -64491, 43187, 22075, -29139, -9791, -39090, -64665, 30327, 69331, -34112, -23049, 127988, 102346, -71179, -61341, 57196, -2867, -120565, -58263, 49253, 30055, -3567, 34957, 58813, 34019, 5967, -22348, -36037, -16609, -17702, -39679, -7280, 30478, -6552, -19862, 39314, 17775, -65616, -5519, 91907, -4163, -88512, 58234, 118467, -87992, -137747, 79268, 69785, -164888, -81329, 188219, 84472, -138594, 34380, 218226, -28173, -205511, 31487, 123609, -140824, -163729, 127098, 131678, -105933, -39175, 170032, 53727, -137817, -24623, 100016, -33028, -112141, 28314, 82315, -37538, -60932, 38922, 40264, -47612, -42032, 44989]
201D4989J5679o9301j9691P4374J5519j20935n4892J27647N1411j52163j5293
212a02656K26374L0435k37483N549K46011q0425k97000R6464K76094j45952k38131
223b20720K22205K33182k37142j75137K58582J04466k86913n9962K74069K783
233A15413k47749N4942K18293r8157j87741J15179J39313j24157q5906J44195
243D3625P2872j20445m7032Q8959N480j03284l0867P1634L8605l7949j5936O9956
255C5618N8212o2473p6886N0777N1414r7329p0949J12226P1715j09077k9075J41468
267G5641J3410j47633R266J33411m8754j21190Q0363J02638r9521p4662J03176
278B6145K4397j20573J279J13477j9494p2288O8811O6059p6622m6076N5091j7246
$$ y = [44989, 60668, -8633, -28324, 46050, 61569, -59366, -114258, 13389, 64800, -87363, -102656, 123718, 154153, -83330, -77781, 168230, 87805, -209195, -112731, 163363, 17411, -220720, 1485, 234667, -2475, -177612, 80970, 185436, -101477, -161439, 112630, 115413, -132336, -77394, 140899, 42742, -144999, -29820, 109493, -14664, -100570, 43625, 116497, -3948, -50980, 37979, 43459, -59825, -90692, -19058, 19547, -18402, -34338, 35618, 93830, 31357, -45529, 5248, 56662, -40667, -111616, 610, 72325, -36752, -65827, 75641, 89051, -58582, -49316, 84095, 35341, -85849, -5486, 97152, -2369, -77031, 26145, 50542, -70031, -68752, 44725, 25231, -47057, 21754, 87813, 11191, -34885, 20206, 2960]
290B960p8737K2910N6960k8527l098P5373M393o0017K6274L8820p6399m9968P7973
303H917K4678q5786J0212J06424j5736r6135K9610Q1548m5823p1904N0508O4944
315F1457l9252n0761K6417L1562l4938n1405R201N3660R123m3016J5931Q3819
327G1798p093j02249J474Q8901n3268j24025O8622J35119p5880j00332J34939
338C8006J07518j54882r1133J59864M1550j89869j3230J95599j7043j80376O2209
349d1787J68984j00367j55177J22580J29367j38507r2024J62741P3318j69534
359d0406o3368J45820K2419j59350j9909J55328L3662j16682l627J28417J0665
370I2969j32114l5388J01012R691j15973n120J32980J9813j12001J4679J24962
$$ y = [2960, -75777, -52867, 4093, -24434, -27532, 47841, 52234, -7783, 18491, 57311, -19088, -69056, 8917, 33595, -52191, -41979, 64445, 48709, -47426, -17816, 63732, 17909, -53995, -3487, 61457, 22205, -28556, -2139, 29423, -5515, -56920, -47719, 5941, 15064, -27952, -12021, 71798, 64705, -37544, -36070, 52831, -437, -124462, -55840, 79279, 3399, -96933, 38006, 145524, -9358, -100491, 59373, 100923, -88946, -102176, 93423, 76380, -103996, -41787, 127197, 26830, -128347, -5767, 123600, -14907, -106931, 55810, 129128, -40406, -103774, 42046, 64465, -94885, -114794, 40534, 74196, -42486, -46113, 82304, 92969, -39145, -74533, 26479, 36170, -79803, -84923, 48057, 67870, -44131, -29452, 95510]
381I5510l6654j36761M6158J21880p7680j14323J07591J07733j26585r3845J34618
392B7642O4056j51338m2028J60360L4355j37691j182J27562k5820j30246J4204
403f0126Q5332l7177o3586N6360P0554k7628l0052L6406J5841m8736l4000J9772
415a7040J6531k0367j0441L4809L4430j8906l1172J9990K7253l4551l4659L5750
427A627L3258l3510j9863L5069P85m5524J097L0871j9464j3897N1862K3055m7703
440b337M8N0905l1919p7097K0794N4218l9116l3535O9186M2335m7538n284M7528
453D8188k9068n8168L2361K7999o0928p512Q9414P2q9184K6365R2587n3769r6937
466g8580O8188Q8721p6800o6365R4449M8084j07648m1778R2481P523r5094J8061
$$ y = [95510, 58856, -77905, -31747, 90133, 12453, -101870, 5721, 113454, -13131, -106976, 27642, 91698, -59640, -101668, 58692, 93047, -44644, -45826, 81736, 55916, -74330, -60126, 25206, -11971, -75557, -19197, 51357, 23729, -6323, 30083, 45924, -2812, -36812, -17040, -509, -20876, -31317, 3492, 37922, 19016, -12156, 7834, 35087, 536, -34123, 1627, 34885, 1375, -18488, 16581, 17366, -28158, -27061, 3810, -15654, -29551, 22311, 45366, -2337, -2289, 48616, 16697, -60400, -39606, 14612, -24504, -58039, 11147, 53482, 5944, 660, 48188, 19120, -39048, -6687, 21312, -39616, -47128, 42286, 42358, -46826, -20461, 72126, 18357, -78580, -10392, 78329, 1529, -64836, 29613, 77697, -29951, -71729, 20752, 28275, -66819, -48758]
478d8758J06612j2473p7675L9243P1918o1250q5904M2561N8169n7159n0210P4038
490h88O7412n2224m8364N9268L9760p5241n2825O4536M1585o9259k9798Q5245
502B9207K8831r0204k2336R2987M286j02492J3589J18703j6511j14430L4766J10988
514H7384o4661j28513O2464J15684p3483r6452J08360J09531j00660r0314J01794
525C1134N8397j31924o4498J21490M5064j15312j0254J35335O969j28177P975
536d3801J15891l7407j22934M7816J19261n7195j05074P4518R6285r0705r3898
547i7243R3462Q0779r3933n6099J13355N5517j08056m5448R4580J2213j10401
558f1274j3058J02568J0592p7303K1366Q9562k0155q2458J2535N3683l7561o0888
$$ y = [-48758, 57854, 45381, -32294, 6949, 78867, 17617, -68287, -25726, 32443, -24716, -74926, -888, 66524, 14300, -34064, 25204, 64964, -10277, -63102, 1434, 43019, -26240, -56038, 29207, 58038, -32166, -54502, 38485, 42771, -59721, -46132, 72571, 56060, -58370, -23604, 87384, 22723, -105790, -43326, 72358, -1125, -97577, 10783, 120314, 19654, -70660, 31134, 89531, -42393, -106891, 14599, 59663, -55649, -65903, 69432, 76401, -51776, -43801, 72090, 34683, -88251, -40435, 78826, 21631, -83443, -8925, 87360, -3345, -97243, -3781, 76998, -16935, -73034, 40321, 95838, -12218, -57666, 36914, 49127, -61274, -74332, 28236, 38828, -38475, -17109, 72453, 52298, -30160, -17625, 36058, -1503, -62391]
570f2391L3921N6098k2466l3840L4946L2278l5286l2453K4218J8812k3980r492
582a9635K7906J2323k2225q443J1641n735j7088O298J9343M177J513J4473M771
595B9319j4994j1729n024j2362r946P571J1024M164J2801J6443o486j6019K883
608G645M32k7244j4524K6028J4814k4074j261L9016L209m5068n411M3653k747
621A4468m6573J2712N9665r327n8721J3636N1921l2297o4879L4771O8428l2170
633A1634n0175O0023O0785o7535o4096O1934L5544r0636l7729R9225L6316r1332
645c6042n607J08788n909j16517R617J01376l7801j03317N4646J02817o0239q4784
657g2972P5223P0455r0069o3114R4836N1349r0173k6538J02556J8916j03252j6950
$$ y = [-62391, -28470, 27628, 5162, -28678, 6268, 38546, 3260, -29193, -4975, 13837, -10143, -19635, 8271, 20594, -1631, -10074, 1567, -4168, -21256, -14958, 4385, 8562, 10075, 24548, 29319, 14325, 2596, -2428, -14790, -24736, -17165, -6141, -1977, 10824, 27267, 20781, 4762, 7645, 8077, -19167, -33691, -7663, 7151, -16923, -18184, 20832, 24041, -21027, -26438, 17215, 14468, -32105, -19393, 40272, 30945, -27776, -14140, 37781, 5484, -59395, -24624, 43804, 11634, -38541, 21482, 82267, 14732, -49364, 12570, 48114, -42522, -80251, 18974, 55290, -36042, -41649, 67139, 61230, -55287, -45670, 55706, 17905, -85412, -30766, 72051, 11812, -72972, 2251, 72706, -17363, -80477, 14359, 65708, -24465, -51003, 51553, 70469, -32783, -49733]
669d9733Q6743o347r3292J2885R9072m290p7860K3996Q1644l3050r3065K0254
681c3043P2711l9384p5022N3283Q4528m7881o8767O4194N9611q3202o1889Q5042
693A0181M6295r2538k6439J08066J6692j10859m261J04022j8822j04313L7477
704c4499J05377l7672q2219N5705O8297p1308o7699N7796L9526o2433j9517P2211
716B3565K3306n0915l479M4201j4249n2542K448L4034r870k6604K0610L5800r563
729A6742k9212P381K3223j5078l1230J4121L4631q698k8096J6353K6763k6423
741D77l1965K1180K1682k3292n739L8312J0393k7535N16J7935k3350k8771J6435
754a3722J2555j8729Q174L5601m108k1818J8188Q900m0522j2506L7599o046m1056
$$ y = [-49733, 37010, 30663, -62629, -49744, 49328, 45038, -32822, -8826, 72818, 39768, -53297, -33043, 39668, 284, -74738, -21455, 63073, 15192, -53575, 10619, 70230, -12972, -74861, 10181, 56476, -36062, -62501, 45565, 62257, -48602, -52863, 51159, 32337, -71976, -34499, 70878, 33206, -49013, 6692, 74989, 3681, -64018, -6222, 33304, -29129, -48646, 23565, 46871, -4044, -7523, 36678, 22429, -30113, -27665, 6369, -3501, -30105, -9495, 26305, 16742, -12470, -5089, 18134, 3056, -28174, -14053, 20578, 11880, -16216, 137, 26900, 477, -31488, -10308, 11374, -11918, -17657, 20655, 31048, 3513, 4029, 21964, -1386, -30157, -13722, -1167, -19896, -11722, 23879, 19771, -2047, 16141, 25041, -15481, -27987, 9612, 3566, -37490]
767c7490K8174N2084l3627m5164M4253L4275o2455l0559O7440K4683o2679n111
779b6176O4831n692o6747M113M8701j8554m0597L0394M4437j8592k5706K4466
791A4878J7238l6690k9865K2620K1207k4731j6436M1041L5574l5599l5140M0147
803A4244K9312o1744l9655O7240L8898p2071k4934Q9742J7182r9837j0279R6853
815D4951j0966r8705L3673J03852m2106r0826N9102P2234q4061p1315Q4536N2573
827E2942q5582k4641J01808K2758r2255r711P7900j5593q3528J4010P2461j5127
839A5442n2059L1825N5242k9059n0867K4804L7257l5835l8825M0945M2831l9103
851B598l6272M7461L0935o3167l5728O5222K8996o8688j1847Q4683Q013q5760
$$ y = [-37490, -9316, 42768, 9141, -36023, 8230, 42505, -19950, -50509, 16931, 41614, -21065, -26176, 38655, 32963, -33784, -29671, 19030, 476, -40121, -9727, 34710, 16118, -9588, 14878, 32116, -4574, -34439, -11819, 9388, -15343, -31779, 9262, 44836, 9237, -25903, 14244, 43556, -18188, -57843, 9397, 48295, -23776, -48710, 41032, 58214, -41623, -51902, 44951, 33985, -64720, -31047, 72805, 30699, -60127, -1025, 71209, -12852, -84167, 369, 52942, -32640, -57281, 44527, 67285, -24970, -34681, 43219, 27626, -55902, -41892, 30569, 15442, -36617, -4792, 50450, 21391, -29476, -4672, 32585, -3250, -42075, -1130, 41701, 2598, -33674, 13787, 44722, -18445, -54173, 11049, 40045, -28643, -40490, 44193, 52206, -33554]
863c3554j459P4243k5445q0422L3305P4856l4704m8994N8316M3408o1777l3493
875c5720N2398N535n9451N320N7226p477l7552K4561L2125k9509k7191K0350J0521
888A1136k0147j547J9837L396p824j680l572n979n24n024m779J3923J4371q468
902C119k747J6379n726k8068l77J6492j3488j2043K7931J8894j7940o09K3797
915B5614j2351k9766J1051J5024k3381l555L5318P21k8241J5379K3876l4409k4673
928b9393L8112J0388m3811R596N4361k0120n2531L0692L7560n5808l6240O3635
940F441K7246o1477j053P5565p486p5552J3616N9603l6714n9481M4075N6658l7608
953C833l5026N0028L1497n1220l2360L9949K0238m2061j7211M5349K4954l8855
$$ y = [-33554, -35013, 39230, 13785, -66637, -33332, 41524, 6820, -42174, 16142, 59550, -2227, -35720, 16678, 22213, -37238, -31918, 25308, 17831, -19721, 4840, 36965, 7456, -19735, 615, 11136, -9011, -10558, 9279, 12675, 4851, 3171, -401, -6380, -6904, -11928, -16707, -2784, 11587, 3119, 372, 16751, 11025, -17043, -17420, -928, -14416, -26459, 1472, 20366, 2426, 1817, 25614, 13263, -16503, -5452, 9572, -13809, -17364, 17954, 18675, -9566, 5813, 29689, -4720, -29393, 8719, 19107, -24704, -15108, 39253, 19133, -33398, -2706, 34854, -20954, -57194, 6441, 33687, -27790, -28843, 46722, 39236, -36316, -22700, 36903, 189, -59292, -15217, 41441, 3833, -31193, 18835, 50332, -888, -33248, 6701, 26939, -15122, -32333, 13016, 37970, -885]
965h85k4317L8600J9236n0157k6933N3490K7665n3654j6362O6340J1647p6694
977c2024j0113O9933j1098p4929K6755Q1382k9298o3563M9951N5452o7408n2961
989e7921O5102L1072p2607j2205Q3311R172p1880P421O5207k3270o6955K2506
1001b1047N3975k4213m1263L2172L9754k8793l7405J9441K5481k3047k6812K4127
1013g630L3239j4266k6643J8981K5025l0509l4960K5848K7161l0148j5867M6485
1025A6716K0562m2686q414M0474j0643n0110J2704M2982k1263k8815L9841K6935
1037C8283m1822j6290L8146l463m4692J1992M1268j7446k5789L0455J9131l7883
1049h110j4749L0511l872l0668J6063L2420j3900j5810K3369N183l1158o542K0088
$$ y = [-885, -25202, 13398, 32634, -17523, -44456, 9034, 36699, -16955, -33317, 33023, 44670, -32024, -42137, 27796, 16698, -58231, -31476, 49906, 20608, -42955, 6996, 62448, -4960, -57921, 7181, 38253, -34354, -46559, 36752, 45924, -25956, -18535, 46672, 23402, -43553, -21047, 32928, 8715, -32548, -376, 39378, 10585, -26820, -7379, 18102, -4945, -31757, -7630, 25609, 11343, -15300, 3681, 28706, -1803, -36763, -10915, 16246, -13902, -29769, 16716, 37278, -5408, -13822, 26652, 16009, -34101, -21397, 21585, 322, -28493, 11348, 38283, -3539, -19829, 18317, 14854, -29838, -17846, 23422, 5976, -19813, 10642, 29773, -8110, -22859, 7652, 3780, -26888, -10825, 21595, 7695, -8115, 15254, 20437, -10721, -17263, 2825]
1062B825q470j7607K0628K1597j3936q087J9758k50k7764m964J7649p73j4491
1075a3885N971K0699L285j5251q564J0308N946j8305j3912K4013K2716k1529j7833
1088a6341L1204J4568m3958j7760M1605O403m4010J0290N5144j3099m8106K6313
1100B253L7914m7740m1280N1276K9220n6495j0755P0881P587o9919K026O1627
1112C6595k0789o4993K4733N9938k6182m5018L7583M1102m1193l8253L5574K6178
1124B5275l8922j9491M5102K4748l9453j8426M0073J1981n1220j8699M9623J7366
1136B7957m8228o060O0545P997o2148n996N4373j2079o1030J6866N9336k0696
1148A0837m4581L8118L9288m8443l3975M8162J4640n7168n79O4933l762n7512
$$ y = [2825, -5645, -23252, -2624, 18973, 5037, -3050, 16708, 16458, -11306, -16270, 1379, 606, -13885, -7914, 12785, 16070, 819, -7745, 2563, 8509, -9796, -23708, 305, 23021, 1492, -16341, 14863, 29431, -14527, -32287, 9318, 15721, -28289, -17999, 37145, 24046, -24060, 2253, 40167, -7573, -48853, 2423, 31643, -24852, -35607, 35274, 42861, -27058, -25032, 36595, 15806, -49187, -24454, 35484, 9302, -35716, 1867, 42969, 1776, -36477, -903, 25275, -13647, -33138, 11964, 36712, -2741, -21167, 18906, 30887, -20333, -39032, 10591, 27957, -20271, -26331, 34214, 42211, -19937, -25933, 28440, 16361, -44669, -27803, 31533, 10837, -33744, 4374, 43662, -4781, -38756, 9406, 24046, -33122, -33701, 31232, 27470, -30042]
1160c0042J8270N4356l1669n5372L1475M5208l2745l1300M2437L0457l5769k3302
1172a7996K7212P980l1947r419K6720R579j5449J769J9420j129k2749n615J2964
1185A340k910j9034N019K6439J421k1294M334K2656j2227k9852R074K6209j2237
1198a062j7565K3039K0194k1341j4131K0318o71k6794L949K7198o461j6415K1249
1211A1507J7507k5817j7669K0566L270k9088J03L0429N10j9166J0895J7210j7630
1224B627j8548J1800M710j7634K212K3573o52j6698R896J6265j8044k1212J5142
1237f563J7564j7057j1071K6602J7146k3405j5574K1268P311l0394r604L2376
1249H599R921k6554J415L3804n646l9347M015L1984j9084l5277K8371L9545k8534
$$ y = [-30042, -11772, 42584, 10915, -44457, -12982, 32226, -519, -31819, 10618, 41075, 5306, -17996, 9216, 17196, -14751, -24170, 2550, 12129, -3320, -1551, 17869, 16740, -6009, -11624, 1340, -1570, -20604, -15585, 10854, 12275, -9019, -4685, 17971, 5744, -24108, -15034, 11175, -1062, -18627, 4412, 24606, 3265, -10866, 9452, 8781, -18013, -14064, 13134, 6673, -9742, 11507, 29014, 3197, -14472, 6094, 9364, -19724, -19621, 10808, 11318, -7848, 3047, 20257, 2627, -15921, -4121, 589, -17045, -14833, 8740, 8088, -8610, 1286, 17551, -493, -21705, -6563, 11001, -6056, -17127, 9475, 26621, 3216, -12358, 8910, 16221, -14173, -23777, 8599, 18520, -8034, -6619, 27185, 21539, -17808, -13793, 18191, -893, -36170, -7799, 31746, 3212]
1262C212l1003L9506K5745n1730k8282N0595J8698n4459p206O4119O564n9903
1274b4144N81N5314j3286n8425J6476N4986j7241m3017K9535M1726l2820l9893
1286c0208K8893K6374l6201k2351M1255K3604l5266j3055L7810O109m5669j0482
1298b9187L9299K653l8348O297M5818l919m1730Q251L5601j9766l9749K0931L7110
1311B3261k2226k6159L4217K5575l8466k3059L6268J0518m2893m581M8280N190
1323B5925m2075O203M1461j4372m5579J1318L5810j6945k8754K5337L0600k1247
1335G682k0533J9619Q184k7037p927K2354J784j6153J1039K1208j2509j9254J3119
1348A576J0515k2785j2572K5763J3624k1259m092K6006K066k9430n420K2007k062
$$ y = [3212, -27791, 11715, 37460, -14270, -42552, 8043, 26741, -27718, -34924, 29195, 35759, -24144, -23563, 31751, 18465, -39960, -23484, 31502, 14261, -28756, 779, 42505, 9685, -30208, -1315, 25059, -11142, -33493, 7762, 31366, -3900, -16955, 20855, 26964, -18705, -29187, 10112, 12765, -25583, -19286, 26532, 22613, -19117, -10866, 24735, 4969, -34780, -13849, 23261, 1035, -25124, 9093, 34668, -3798, -26857, 9411, 19929, -22964, -27545, 20735, 25925, -16150, -9947, 31514, 17142, -28437, -17119, 18691, 1746, -27008, -1671, 28929, 7682, -12851, 6768, 14952, -12085, -20012, 2342, 4126, -12027, -988, 20220, 7711, -11543, 1576, 12091, -10694, -23266, 2497, 16121, -5138, -9230, 16776, 18842, -10588, -16008, 5999, 3937]
1361C937k1341P891K5926m493j8284Q823J2970j7115j8005J4143J2433j4137l970
1374a1222K2257P731j9687n466J5335m148k1592L549K0843k293j3099J2043J5090
1387A9341j5409j6377J3468O063k1094l207K7729M805k4268L302K8046j1795l5537
1400b4933R944L1324j6224k8401K6564L3484k5281k7759K7234J8033l6855j8332
1412c1202L6275J3867l1833p23L8356k199l7374M469K9025j6414k9876K1934K9486
1425B3791k0276j9796K7905J5374l3726j7455K8843Q488l1676k303L7618M378
1437B1165l3512N03L0839q940l7752O916L5774q016k9703J8291L5109j8507l4486
1450b2319J8208K5719k6924k5438L1569K5736k7323j4725L3431R564l8550r322
$$ y = [3937, -17404, -9513, 16413, 11920, -6364, 2459, 15429, -1686, -19691, -5548, 6885, -7252, -11222, 11035, 18766, -921, -6387, 8948, 4800, -16792, -13243, 7600, 5307, -7792, 4251, 19341, 3932, -12445, 1023, 7086, -14008, -17215, 10514, 15319, -8949, -5647, 22399, 10604, -24933, -14989, 16335, 111, -28290, -1726, 31758, 6477, -21282, 5952, 23985, -12870, -31202, 5073, 18940, -12893, -13616, 24740, 22541, -14833, -10364, 18661, 2247, -27629, -5695, 23791, 3515, -16281, 11624, 26998, -6728, -24183, 4660, 13148, -18528, -20831, 16787, 21165, -12347, -11844, 18995, 10055, -27697, -20781, 14993, 6977, -22726, -4435, 30674, 12167, -22319, -4111, 21608, -5316, -30754, 815, 26551, -772, -15497, 17934, 27498, -11052, -20374]
1462b0374L2405j140l2358R835L5530r985k8382J4468K1278k4696k3193K2503
1474d109J5797k1893o003K8424N978k6133l558K0738o382k4554P798K4998m347
1487F754j7354J2398K0695j4327k2883R750J6874j3527j6506J8828K1301j4171
1499G832j6172J6511R045k3215j1678J9639N634j8553M788K3110p179k1204J0953
1512d89J3056k3919j4422K7419J1741k6508p2L4442m022l5892N850K8828j5759
1525B53k7873K2214K7734j9082j5968K5130R483k8702q354K2599j014k0660Q742
1538e498K3119p115j6400J0523R276j7668j2162J2636P627j0937o94J5764L084
1551A1555j4220l486R453l760j4587K273J8097K81j3651P554J8768j0530k4592
$$ y = [-20374, 12031, 10891, -21467, -11632, 23898, 13913, -14469, -1, 21277, -3419, -26612, -4109, 11688, -10205, -16208, 12216, 18194, -7939, -11497, 9241, 2859, -21695, -13897, 11101, 6754, -10600, 1798, 22493, 8166, -14717, -4967, 11907, -1620, -18126, 702, 22003, 7832, -8340, 8171, 17216, -5999, -17677, 1962, 7596, -10957, -6169, 16941, 9762, -11442, -489, 12567, -11352, -25774, 1645, 13386, -13122, -13194, 21248, 17226, -18666, -12816, 16012, 253, -27620, -5406, 22328, 3246, -12722, 12408, 21891, -6811, -15165, 7434, 6420, -14240, -5498, 17621, 10506, -5894, 4629, 13905, -3763, -15925, -3289, 4338, -6599, -7293, 8471, 11555, -2665, -6151, 3302, -458, -15045, -12772, 5325, 5606, -8045, -491, 18277, 7747, -16845]
1564a6845Q849K1464j5540k1267K3839K6656k2480k0992K7090J4069l5456j5021
1576b5634L3236Q196l0956L342L4825o067l1437R478K1888k0638k1767K3033J8005
1589A5504k1052p133K6400M185k8322l744K1548l706k2383O688K5437k281j8608
1602g467N373J7820q546k3033M072K0314m172j8569J0897K5630j0270k5516J0965
1615b502K0437k0693k3514K4344K3193k5161j3328L2918R491l8765o713L4201
1627A3908n154l5676J3987L8008j6006k8502K3778K1571l1750j9626K9387R541
1639A3466k9490K441L2758m293k6554J0029J8865j9552j8801J9058J3062j7217
1651f228l238K1490L467k0243k041J3268m903j5322M958J4740p10p975M401R954
$$ y = [-16845, -7996, 13468, -2072, -23339, 500, 27156, 4676, -16316, 10774, 24843, -10613, -25634, 7602, 15798, -15158, -11816, 23009, 16942, -14495, -5017, 16871, -3767, -25534, -2501, 15504, -5548, -12681, 13719, 17904, -10418, -14162, 7386, 3680, -18703, -12015, 13422, 11141, -7467, -2094, 15726, 7180, -15853, -11781, 8533, 4361, -14208, -3311, 22319, 12049, -13467, -2502, 17935, -2758, -26272, -1928, 21265, -3896, -17224, 15694, 25185, -13580, -20293, 13908, 8754, -26922, -12935, 25073, 9067, -19435, 4343, 25914, -5836, -25462, 3925, 13466, -16024, -13583, 19175, 14882, -11672, -1643, 17222, -2330, -21131, -2073, 10989, -6228, -9466, 12024, 15491, -4752, -6793, 6475, 1572, -13750, -8792, 5948, 5238, -2737, 1664, 11618]
1665A1618o224j3514J487R631m918r507J1017J5067r377j2661J2945Q174k1964
1678h226j0628K2194P304k2860J779K9320l348k9517O197K2576j6237k3506K0593
1691d359K1138k0091r712K6517M895k9458j932K3590p633k4168J5404K5002j3397
1704E796j7442J8238J3060k2482j4509J7265J0017j6359m405J9247Q050j5651
1716H25q013J1350K923j6408o433J6639Q154j4005k379J9472Q73k4227k085K1522
1730H208n640k3753J2082K8711j2774k2216J9689J8476k8338j7641K7733R939
1742A4476k7975J130L3010m061k8213J0061K1646k1474k0797K3254J4633k3308
1754g618m343K7934Q16k7939K013K0476j1326k0068J2686J8375j0265r457J3296
$$ y = [11618, 5394, -8120, -6633, 2998, -1920, -11427, -410, 14657, 5280, -7381, 5564, 13738, -8226, -18854, 3340, 10644, -12216, -10437, 18883, 15535, -13982, -7785, 14791, -1446, -24952, -4359, 16779, -3312, -13024, 13493, 18388, -11070, -13002, 10588, 2955, -21213, -5809, 19193, 5796, -11646, 6592, 19652, -2830, -17339, -74, 9943, -6416, -10821, 8426, 16476, 825, -7188, 4162, 7085, -9323, -15756, 883, 9037, -4968, -7347, 12125, 12998, -11229, -13314, 8208, 2568, -21185, -9103, 19608, 6834, -15382, 4307, 22783, -5555, -23196, 4537, 14476, -13499, -12369, 20641, 16580, -11633, -1572, 20074, -1400, -22197, 1057, 15690, -7618, -11961, 15973, 16789, -11150, -9137, 11339, 13, -20055, -7369, 11006, 741, -8716, 4580]
1767D580O840j4373p922Q934K287p610k25J1100N658o496l935O462J837j2123
1781d986o854J3247P114j2296j121J9203R79k2298m14J9311r066k2504J3848K2821
1795A6984j6007j5103K3063J0078k9236r207K7319j130k9260J0168L2098j1623
1807H144k5418J8241K0068k5588j8889K4641J2208k3637l001K7901K460k3145
1819f015J253J7315q520j8014P487J5927n629r682J0123R667r446j2154N293P383
1833D988q819r022J1112J3001q832j0407J1600P955j8538j0549J7893O724j8340
1846a1234n8K5347k42k4549M828K1687j4431k3570J7622K1689j7955j2872K4979
1859A1241J0498k6925p413K2256j975k3278O627K3002p976j4614J3190J0184j7503
$$ y = [4580, 11420, -2953, -10875, -1941, 346, -7264, -7489, 3611, 9269, 2773, -1162, 5300, 7137, -4986, -11840, 1407, 8521, -3775, -4896, 14307, 15286, -7012, -7426, 11885, 2819, -19685, -5837, 16984, 977, -14126, 8937, 19015, -10221, -19428, 7891, 6761, -22499, -12331, 19767, 8144, -17274, 967, 21035, -4553, -23442, 1199, 13407, -10230, -13231, 14670, 17130, -6015, -4762, 12553, 4033, -13981, -6494, 9433, 3804, -5878, 4245, 13912, 4466, -7688, -2395, 4988, -3831, -12853, -1741, 11260, 2428, -7979, 3621, 11576, -6962, -17511, 382, 7106, -11234, -11292, 14055, 13813, -10736, -5908, 15779, 1348, -22222, -4600, 17089, -866, -13738, 11241, 21739, -5186, -12599, 9657, 7682, -15596, -8969, 14033, 6057, -8557, 4633, 14817, -2686]
1872b686j0323J4586K602j4962J667J8170n22j3882K506J1526o461j4530K730
1885i579J3356j299r968N737J4410l734j5709J854J2720p434j4821J0414J6924
1898A2871r127j1917J4860R609k0431j0003J8810K823k1147M305K4717n828k0868
1911a1326J1452J6545k0024j6693K0734J1311k2426k124K7731m71k6333N098K1682
1924A5156j4041k2651J6551K0188j5967j2431K1444J0696k2146r571J7331K621
1936G180j8509j79J8538K336j2782J103J1631m080j3739P53J0582k344q161O655
1950a016J2071n463j1209O131Q118j2478j0652J4477J0510j4335m722K0467L776
1963A5675k3700l182K0630l641k3123P570K5127q039j9581J3209J6819j8648j6545
$$ y = [-2686, -13009, 1577, 4179, -10783, -9116, 9054, 8532, -5350, -2844, 8682, 2221, -12309, -9579, 3777, 2478, -7490, -1753, 12657, 8923, -6786, -4932, 7788, 354, -14467, -4053, 12871, 3744, -8173, 6687, 16296, -4135, -14138, 4672, 7495, -13652, -9347, 15370, 9542, -11326, 126, 16671, -3353, -20046, 688, 11999, -10427, -12551, 15180, 14709, -11624, -6526, 15156, 1115, -21536, -4985, 15203, -764, -13195, 8249, 18945, -3201, -12772, 4559, 7180, -11329, -11508, 7030, 9366, -3416, -2313, 9318, 5238, -8501, -7748, 2834, 490, -7671, -1016, 11055, 5592, -5617, 514, 8632, -3846, -14498, -21, 10489, -3846, -8568, 11899, 15675, -8025, -11207, 9423, 5782, -17341, -9771, 15356, 7317, -12264, 945, 17764, -884, -17429]
1976a7429J6506J0430j8602l889K1999L802j8926O94J6307p137j8187O872J6269
1989H709p147j1360J2254J3377j2033j3308R959Q922j3438r898J5163J2437j3027
2002F10q343J5641O230j9791q797J7471M149j8804M07K3330r58k0983M405J8795
2016A3362j1635k0806J3084J7602j4020j1870K0876J0576k0657p700J8724R0k0456
2029a2830L881J9883m496j3749J0754J2220j4012j1767J2000N395j5101j869J6900
2042G209L233j3213L64J0894m457j3733J779R269k534n471N649O897l591m136
2056a841J619K60n545m64N425K61k499N036O320n177q061M737N849q971p059J1787
2072A677R599r347o613J2547M371j6101o597J3203K147j3787K317J6398j432j5153
$$ y = [-17429, -923, 9507, -9095, -12984, 9015, 12817, -6109, -5415, 10892, 3755, -14432, -7560, 8709, 1562, -9798, 2456, 15833, 3800, -9508, 451, 9373, -4065, -13963, 1200, 13637, 610, -7733, 7908, 14138, -5653, -14450, 3021, 7170, -11634, -11227, 12103, 11145, -9838, -5433, 13362, 1727, -19079, -5995, 11607, -2413, -14283, 6593, 17169, -3488, -11188, 7536, 7626, -12830, -8949, 10934, 6438, -7311, 3443, 15663, 1651, -10116, 1884, 7279, -7822, -9691, 7209, 10442, -2771, -2407, 8487, 4030, -9703, -7924, 1345, -1189, -6660, -1011, 5886, 2295, -1841, -222, 38, -5507, -5971, -546, -285, -2784, 2252, 8572, 3395, -4666, 71, 5920, -3051, -10110, 1677, 11276, 1929, -4684, 7863, 12234, -3867, -10464, 2739, 4886, -8901, -6584, 9814, 8382, -6771]
2086f771M807J1569j1279j3719J1170J1510j1857o278J6789O952j7363n372J5666
2099E824L23j8303J957J9144j056j5476O428J6605r832j7580R156J4165j2715
2112a360j2701J7649J4290j6547j1947J7522Q063k3089j0079K1891P671k1082
2124i719k157K3901K089k3175j659J9110m387k0178O978J9225o836j3168J2031
2137B055J1457j4705j0363J3590N029j5468r48J9140J361j6883L350J5306p629
2150E292j8452P695J5365q514j2123J3155J2984j3164j1691J1769O695j6330o934
2163a4253J6088O742j3550k032J5849N78j6517j506J3195k381j2631M373J4227
2176H182l090j0045N415Q533r060q893P661O312p897k066J1650K397j0813j055
$$ y = [-6771, -1964, 9605, -1674, -15393, -4223, 7287, -4570, -10848, 5941, 12893, -4470, -9842, 5824, 6147, -12156, -10199, 8945, 7889, -7587, -1159, 15446, 5614, -11966, -2810, 11355, -1360, -14061, 3588, 17878, 1331, -10616, 6906, 14969, -8120, -18199, 3692, 11363, -9719, -11876, 12025, 14114, -9061, -10720, 8390, 4003, -16175, -9197, 10028, 3192, -9976, 2055, 13512, -1193, -11556, 2034, 7063, -8405, -9353, 9787, 11148, -5735, -2385, 12921, 5292, -13160, -5465, 9900, 1386, -10737, 2418, 15402, 2238, -9453, 2316, 9011, -7319, -14253, 1835, 8577, -4973, -7005, 8844, 9422, -7095, -8601, 4594, 2213, -10418, -6045, 8182, 5092, -4953, 462, 8995, -65, -8958, -1297, 5015, -2882, -4948, 6702, 9099, -1714, -2769]
2190b769R025m077j1826L296J1829l144p985P574R260r047j0234P538N189j0342
2204e713m600J2750M384r268k81J0674k875j2402J950R667n233p451R535Q185
2218I322q173n480Q898P88j1765j043J0721j285q062O587R530p444q418P052L928
2233E156j1234m313J2494M473j0502Q25J2477j849j3242N38R736m052r958O311
2247c140J0628l836p711O509O069r250p863P666N884q558l546J2745L980j2338
2261b761m321J2453k96j5659L19J7278o52j4929N700J6916q472j7805Q206J3739
2275I716j2430j2441J6985J2719j5443q223J8431L642k1144k999J8644j045j7888
2288a1476N856J9641o460j7784Q802J3268j2361j4029J2222J2226j1807p675J4011
$$ y = [-2769, 6256, 2179, -9647, -6351, 5478, 2334, -5651, 1923, 11183, 2136, -8098, -560, 4629, -5713, -10313, 2437, 6821, -2447, -2728, 7946, 5071, -7331, -5381, 4286, -947, -8398, 1137, 9322, 1149, -4331, 4567, 5355, -6410, -7453, 3268, 1983, -6079, 508, 10038, 2594, -5824, 1228, 5156, -6078, -10391, 2103, 6576, -3926, -3101, 9376, 7527, -5715, -5177, 4559, 507, -9451, -3140, 7488, 3652, -4059, 2450, 8519, -731, -8594, -928, 4956, -3602, -7148, 5597, 9577, -2761, -7082, 5371, 5075, -10584, -10265, 7013, 6361, -8568, -2868, 14048, 5576, -12229, -4023, 9716, -2714, -15155, 1830, 14549, -894, -9117, 9314, 12956, -8188, -11187, 7457, 6412, -11476, -5620, 14021, 7561, -10223, -1421, 11847, -514, -14543, -2321, 9905, -1902, -9577, 4434]
2301D434O946j4613p624J2119L649j2866k137J5425K997j2117PJ3010l160j5074
2315i004K028J3068m159j1266Q637J3642q318j1220R795P756j4310q226J4656
2328C079N206j3617p26J5081p03j5442J684J1318o110j0816P867J0043o890n567
2342e593Q445L058r994l159O868J78n132K701P001o1l512J734O17l050k344K62
2358a981N56J288K018M31N84J073o20k886j945j4L44P97o0j96K164K145l568n478
2376e348L045L985n624m043Q785O447q454m113R728J117j3127o71J1907j873r582
2391g821P975J1667q548r150J1097M636j6088m018J6273J712j5917L823J7741
2404A3382n928j7040O899J2794j0426j2679J1822J0956j1030p336J2473M466j3765
$$ y = [4434, 11380, -3233, -10857, 1262, 4911, -7955, -10092, 5333, 8330, -3787, -3780, 9230, 6070, -9004, -6976, 6092, 1933, -9333, -696, 12946, 4628, -6592, 3203, 10959, -3351, -11577, 3079, 8285, -5332, -6058, 9023, 8320, -7122, -5438, 5880, -230, -11046, -3179, 6864, -26, -5593, 2852, 5910, -4084, -7243, -375, -197, -5329, -2628, 4373, 4312, 800, 2534, 3151, 101, -2243, -1981, -1425, -137, 1881, 2312, 2896, 3969, 3349, 463, -1482, -1496, -1152, -355, -415, -611, 1553, 3698, 130, -5348, -2303, 1682, -3942, -7985, 800, 7247, -1207, -5320, 4408, 5525, -7602, -8273, 3634, 1761, -7821, 154, 11821, 3273, -5877, 5220, 9856, -6232, -10250, 6023, 7735, -8182, -4359, 13382, 7454, -9586, -2687, 10107, -319, -12998, -1176, 9780, -1250, -8586, 3887, 8353, -5412]
2417e412n250J2575K383j2393L62J5572J678j4683o40J3841j979j7057Q62J7557
2431G416r14j5368N474J8009n889j7648O239J3496j0783j3056J2730J1475j3077
2444a896o417J5882K362j7877p29J6462m059j6441Q301J6754r025j4088J0036
2457g35J1104j2966j1152J2000R606r799m556J1212N049r878m749O483J319p591
2471d653j756Q223L166n871m81P490K46r989j598Q546k77j0221K193J2488k451
2486E055j1314M660R449p984r996R233P439q594l770J1576J316j1899L19R507
2500D997n686r249Q140R306q029l980J0810K189j1397k273Q174k568p640M093
2514c113O997l203j793N113p40n803J471L170m431k698O670K801n846o38O171
$$ y = [-5412, -10662, 1913, 4296, -8097, -7735, 7837, 9515, -5168, -5808, 8033, 6054, -11003, -10141, 7416, 6502, -8866, -3392, 14617, 8728, -8920, -2681, 10815, 32, -13024, -294, 11181, -1896, -8313, 7569, 9931, -7946, -8675, 7787, 3728, -12713, -4412, 12342, 3317, -10771, -735, 10369, -2597, -13749, -1749, 7857, -1942, -6498, 4714, 9763, -115, -4864, 1619, 2938, -4653, -6409, 1814, 4980, -891, -1372, 6118, 6364, -3625, -5223, 3323, 3046, -7175, -4982, 7506, 5055, -6259, -1599, 7850, -134, -10130, -897, 6542, -2052, -5822, 5754, 7070, -4829, -4510, 4997, -689, -9938, -1798, 7508, -521, -4501, 6309, 8498, -2899, -5172, 3002, 434, -7206, -3113, 3884, 681, -1112, 4001, 3261, -2542, -1071, 2099, -2332, -5030, 1640, 4441, -1405, -2043, 4128]
2529D128j729p185J157N571r92l640L135N021k101m578J48K262k331m403J425
2544d112O208O39m622K475O569l756r485L251P313p041p293R736Q672r797n744
2559f987J2176L550j5240j920J4594p53j4525N876J5235p336j4660R130J1249
2572A0389j2558r964J4232Q975j2855n020J4560K582j5788l358J2574K77j3184
2585i138J243J3962O08j1485J194J1626l059j3952J561J2516k765j2143N815J4203
2599A0186n882j3024P501J1692j0624j1357J3102J0314j3506o975J6298L382j7905
2612f798k521J6334j521j6056O035J6587o406j3208Q087J0307j2509j0242J0484
2625a427O532j0314k981J1982L261r435j522P863j055q122L84O185L04m408R28
$$ y = [4128, 2399, -4786, -3629, 1942, 950, -2690, 445, 5466, 3365, -1213, -1065, 1197, -1134, -5537, -4112, 2096, 2735, -1887, 588, 7157, 3401, -6084, -2833, 4480, -2561, -9854, -118, 8554, -1243, -6987, 5189, 8739, -6501, -8421, 6173, 5420, -9105, -3229, 12006, 4670, -9990, -860, 10389, -2169, -12133, 2099, 11074, -1781, -6801, 7759, 10341, -5447, -8805, 3769, 4046, -9138, -7895, 6067, 6675, -4810, -3616, 8010, 4951, -9001, -7440, 5076, 2311, -9832, -4017, 10186, 4304, -8720, -1219, 10473, -151, -11508, 1594, 11908, -1598, -8573, 7725, 11107, -6798, -9319, 7015, 5494, -10562, -4527, 12060, 5654, -7554, 533, 10840, -1669, -11911, -1427, 5105, -5209, -8190, 3792, 7053, -2382, -3904, 3959, 2904, -5218, -4834, 1351, 1655, -2753, -1825]
2640a825N186L91n409p84M344P53m343P02O026m0o035P43M600m045o327L826N283
2657C046m379j877P369J981p505m58M954l686o873L475M985l624j646O979J371
2672D112o432R88N202m251n147N857M138o210q70P957j056q014J747P137m466
2687F92n560P215N378o539l615O932O36r845j406P728q80o808L523Q625j851p688
2703c463K536O095m857q653L484P647l061o529N300Q673m887q076N211P126o893
2718c47p220R582O556j0034m844J1905K113j4008j446J4515j355j3832N735J5669
2732A2989o984j4934P173J1907j2038j2172J2433J0279j1471o155J3657N889j3147
2745b574m668J1604L54j2440J54J2059n34r790K743J0524l405j0452L122J0247
$$ y = [-1825, 3361, 3752, -1657, -2441, 1903, 2656, -1687, -985, 5041, 5001, -1034, -291, 4309, 264, -6063, -2237, 3046, -1333, -3210, 4159, 6140, -1365, -1823, 3131, -555, -7428, -3953, 1032, -2592, -4238, 2741, 4112, -2320, -1332, 3870, -381, -5528, 329, 4467, -1743, -2613, 5344, 4288, -3726, -1979, 5158, 692, -4868, 2347, 7725, 1186, -2429, 4503, 5139, -4706, -6112, 1616, 736, -6072, -2549, 6076, 4225, -3463, -927, 5168, 311, -8342, -4858, 2789, -272, -6801, -1501, 7172, 2285, -5791, -580, 6546, -347, -7567, 2015, 8571, -1463, -6307, 5598, 7711, -6297, -7743, 6772, 5417, -8415, -2680, 12989, 6005, -8929, -1756, 10151, -1887, -14059, -1626, 8653, -2818, -8973, 4684, 10573, -2574, -7242, 4362, 4716, -7724, -7570, 4489, 3955, -5835, -3092, 7432, 4027, -6425, -3303, 6944]
2759F944l887r670N205J0903n875j0956N438Q955p727r563R140R525q102o131
2773e801J1040M654j2628m476J0528o15j2283L087J2757k904j0271P146R940q339
2787A835r979P911P232r447n930R883N109q294l330P336J864o739r59N183J114
2802B789l130M28K671j288l185l88J121j246o71K239K573M50p03K23J045k145
2818G83k755j67O62j78l55J696J815L35k11k44j105n34Q75j085j779J509L495
2835B757k821k957K669K275m246j944N251K027m139L79N331k347n752J965L295
2850A743m665k983O025N069o083j156Q650O72j0387j622Q932j733r435J968J0497
2865E492j236r090L249Q804m585q861L889P699m659p062N708O951p252o704P087
$$ y = [6944, 3057, -6613, -1408, 9495, 3620, -7336, -1898, 7057, -670, -10233, -1093, 8432, 330, -5801, 5239, 9893, -2735, -7211, 3317, 2702, -9581, -6494, 6263, 3359, -6912, 234, 10174, 1835, -8144, -233, 6999, -2448, -8378, 1505, 6614, -1680, -5010, 2326, 4190, -2549, -3508, 1675, 2789, -341, 87, 2758, 1470, -1715, -2103, -982, -2228, -2899, -660, 1913, 2363, 1660, 1883, 2928, 783, -1972, -2139, -1477, -1655, -2010, -314, 1501, 1836, 1625, 1381, 276, -258, 617, -468, -2247, -738, 2757, -64, -3021, -352, 1923, -2323, -4267, 984, 3011, -1128, -749, 4582, 2235, -3517, -1552, 1743, -2922, -5905, 120, 5189, -894, -2050, 6600, 7272, -3115, -4737, 4195, 2462, -6973, -5005, 5492, 4256, -4834, -1585, 7219, 2634, -6227, -2338, 5361, 702, -6360, -652, 6299, -953, -7657, -570]
2880e70N409q716l968J0501N272r658l035J0973Q09j3244j187J1218o88j1203
2894h087L552J3340k713j0899N565R890q854j0315P966P564r670o092J2074M635
2908G956j1620l002J1572J132j2429K60J2063q01j1779K332J0368m324j0668L969
2922d971R096l554p432O530Q847n149o700N188M092p487n233O180M205n892j314
2937c594Q375K156p013j790O533q38q121L06P218j635o450K496O269l015o230
2952e333L720M466l285l628M757L773m825k751L086J189n039p63M564J015j734
2967g88J970L571j130k349k0M46k793j118J621K38j63J904J362j267o36J440p06
2984A582l372L12K844j602k607K299K399l417k530L805J637l682m22N385Q93m487
$$ y = [-570, 4839, -3877, -7845, 2656, 7928, -1730, -4765, 6208, 7017, -6227, -7414, 3804, 3116, -8087, -4535, 8805, 6092, -4807, 758, 10648, 1794, -8521, -555, 7009, -2661, -8753, 3321, 7956, -3664, -6666, 4906, 6038, -6391, -6131, 5932, 5131, -6648, -4316, 6052, 1728, -8940, -4971, 4125, 571, -6861, -331, 8516, 3367, -3333, 1855, 5947, -1540, -6773, -593, 3612, -2280, -3594, 4781, 6937, -76, -1866, 4667, 3829, -4292, -3986, 3232, 1597, -4853, -2357, 3912, 897, -5333, -1613, 2853, -432, -4060, 697, 4470, -355, -3106, -20, 1169, -3870, -4633, -69, 946, -788, 1182, 4753, 3623, 1274, 1254, 1700, -1093, -2211, -590, -352, -515, 1389, 2751, 1484, 848, 2288, 1582, -1790, -1478, 1366, -236, -2843, -544, 1855, -1562, -4092, -287, 1350, -2332, -2754, 2631, 3524, -963]
3000i63k22M084k324n783J761N157k006l525M817O179l883n148M143L170o642
3015a185n154O097M311o343k643Q076L064q151k587Q214J074q959p05R174m52
3030C831r697J806Q568l213r340M263R463m118p819P832P153p428p125P122M142
3045E440j0062l651J0055L626q252o36J1039j24j0756L80Q470k996r815L358R341
3060E417l624q534N280Q700o092q572O603P823p034o772Q131O483r444o309Q638
3075F94L898r099k919J0347L955q916l01R094j600r657J029O550l636o911N471
3090b001O945m255l680N814L140o409k873M827N28n558J4N617n11m244J155L894
3106B403j179l059J263L352p08k251R61J231j822k465l97J734n1q15J267K835
$$ y = [-963, -1185, 2899, 575, -5208, -3447, 1710, -296, -3821, 996, 7175, 3292, -1856, 2287, 5457, -1185, -6339, -242, 4069, -2274, -4917, 3159, 6223, -1928, -4515, 3699, 4773, -4186, -4891, 4283, 3831, -5866, -4060, 4508, 1295, -8045, -3782, 5681, 1563, -6256, 1576, 8729, 1301, -5824, 1298, 5440, -4622, -8273, 1782, 5408, -2844, -3480, 7559, 7435, -3321, -2941, 5529, 2533, -7282, -3924, 5417, 1793, -6741, -1461, 7239, 1147, -7425, -822, 7001, -33, -6805, 1326, 7809, -1635, -7944, 694, 4592, -4507, -7426, 2921, 6876, -2040, -2341, 6753, 5153, -4504, -3475, 3075, -561, -7472, -2001, 4944, 689, -2991, 2823, 5963, -446, -3319, 1508, 2036, -3522, -3508, 2109, 1598, -2646, -1491, 2403, 1224, -1835, -572, 2780, 2072, -179, 782, 2013, 191, -2274, -2671, -937, -988, -1803, -536, 2299]
3122B299O17j550l51N57j434k442n52Q79O38K47M29J195J206J39j413q81J268
3139H51Q31l089q44L779O68m066p63M939n94m900J739N717j558m572L357L408
3155D903m893m813M089K171n961m19P038J038n492J919O290l118p507K413N399
3170C057m575n442N093O013l968m544N860M586n506m736N461M026n582l564N420
3185A599L617p377l023O995K509p399j110Q955J740q712k08Q116k494j0442J882
3200e352Q817m169p504O867Q587o651n922Q100L998j0033l384Q863J130q996J035
3215d614R450j585p886L425P710m181o943M963O833n059o655N269M741o144n517
3230f193N009N283m838l173N961M320n204m600M578J770o677l267N963K721n526
$$ y = [2299, 2916, 1366, 1015, 1572, 138, -2304, -2856, -1977, -1339, -1092, -663, 532, 1738, 1877, 464, -417, 851, 1682, -1407, -2251, 1528, 2196, -1870, -2633, 2306, 1712, -3188, -1449, 4268, 2710, -1862, 1495, 4903, 10, -4803, -714, 1457, -4504, -4923, 2115, 3153, -2339, -420, 5870, 2752, -4755, -2342, 3057, -1518, -6960, -1867, 4146, 178, -4366, 1494, 6080, 574, -4162, 1299, 5325, -257, -3821, 1599, 5216, -2161, -5184, 1811, 4320, -3079, -4189, 4766, 6506, -2206, -2414, 5702, 3208, -7234, -5352, 3465, -704, -8208, -1341, 7246, 595, -5327, 2773, 6771, -3262, -6646, 2217, 3347, -5649, -4614, 4836, 3251, -4635, -1210, 6500, 2319, -4624, 339, 7172, 2113, -4542, 727, 5468, -676, -6193, -1184, 4099, -739, -3912, 2049, 6369, 1165, -3435, 1143, 2913, -3764, -7031, -1068, 1653, -3873]
3245c873L19P520M6o448R31N731l039o149L500N259l924m136N149L524n295j861
3261b746N124J036m265P38M115j328m058R87K115l036k626K794J365j211O56K745
3277B405k79j176p70o34r44j099k78K92Q93J353L19n1J167P61j446q34R00K41
3295H20p85o27N91O29l87q66k7J260Q46j129k45K815K60l447j030L114j798n049
3313e055J818M976j902l734M818M924m849m634N727J676p626k469P619J023o915
3328d603J000Q489j392p286K928O386l768n762M103M942n145l847M260L147n584
3343b132k487N741K982m803j227N679J307o224k237M573K70o752k27P337J437
3358C237o539J487P815j802q367K079O852m104p378M741P295o008n309P095M909
$$ y = [-3873, -3554, 3966, 4012, -2436, -1505, 4226, 1187, -4962, -1462, 3797, -127, -4263, 886, 4410, -885, -2746, 2378, 3414, -851, -113, 4002, 2674, -1384, -397, 1718, -1318, -3944, -1150, 215, -996, -340, 2405, 2126, 950, 180, -454, -1398, -2497, -2775, -2483, -1590, -237, 82, 31, 1198, 1959, 513, -321, 579, 820, 35, -592, -1, 628, 241, -625, -652, 608, 1454, 325, 80, 2895, 3155, -292, -1322, 1792, -6, -5055, -3237, 1739, -163, -3897, 921, 5845, 996, -3638, 2089, 3765, -3861, -6330, 1289, 2312, -4603, -3603, 4886, 3494, -3792, -864, 5522, 1754, -4008, 95, 5037, -108, -3955, 305, 3452, -2132, -4619, 1122, 4104, -699, -1926, 3753, 5060, -1164, -3401, 1172, 1442, -5310, -5537, 1800, 3237, -3302, -1815, 6000, 4198, -4169, -2090, 4762, 658, -6720, -1979, 5316, -692, -6001, 1094, 6003]
3373F003p490l544Q211J877p829k50P321j259p793J765O174l340m817M095N338
3388D462l198k932M122K197m663l175K796J173l596r44L915K220j941j181L124
3403B379J318l886k158K919J417m283o79L894J219m436m26M668j61m198J848L456
3419B891j208k830J208J917l691j129K062N96k143J799L209q67j595K326Q34l651
3435b72j482J993o18k286J392K487n50j100K093M59k268k55J515j410j797J233
3451h66J511k156q82J767J048k405J44K653R58j567j93J940m20k857r04K222n60
3468e67k175J054M163M89l171J049M071k187n832J415M868l025n140L454O175
3483D641m327m711N133M359o100l762O191K345p083l98O031j097n956J609N680
$$ y = [6003, -1487, -5031, 3180, 5057, -2772, -3022, 4299, 3040, -4753, -2988, 3186, -154, -4971, -876, 4462, 1264, -1668, 2454, 4651, -12, -3187, -391, 782, -2814, -3758, 157, 2377, 436, -745, 2379, 3697, -189, -2347, 572, 1989, -2294, -2973, 921, 2140, -2296, -2722, 1946, 1785, -2413, -565, 2891, 1683, -1147, 61, 1978, -1713, -2842, -780, -184, -2327, -528, 2681, 1814, 219, 2545, 3379, -272, -1754, 239, -379, -2665, -1273, 1214, 664, -436, 1657, 2116, -152, -407, 1108, -302, -2099, -866, 645, -1511, -2393, -626, 422, -1983, -1839, 814, 1772, 205, 12, 1952, 1532, -1325, -2229, -7, -567, -2742, -1688, 2475, 2964, -207, 842, 4913, 2726, -3106, -1691, 3177, 152, -4988, -1534, 4641, 314, -4397, 736, 5095, -1005, -4767, 1424, 3769, -3314, -3712, 2319, 1222, -4734, -3125, 2555]
3498B555k625m508N350M889m646l619M780K383o373l092N524J994n103l40O043
3513C212J683m432j127M333k87n452j033M234K8m549P75M941o85m944J660N246
3529C603k713n375L554N282m166m766M253L536n647l145N952L099m867p72O235
3544D063M66n411K88M280l156m401K033M118k678j993L739K684l134j930K556
3559A524O82l286j622K432J116k340j316J879J767j779j104K096J283j287p98
3574g53J984J94k028q60J106p19j230J255K001j68j88J986P62k358r30R50r26
3591G8k039L28K027m96n66J787M64j384l2J243j433j599J343J123k409n71K622
3608D86k09k667P99L239q90k386K234K484k339k338K047Q35l452j247L859J086
$$ y = [2555, -70, -4578, 772, 5661, 1015, -2604, 2176, 4559, -1814, -4906, 618, 2612, -2491, -2831, 3212, 4895, 463, -664, 3669, 3382, -2070, -3103, 1131, 1159, -3390, -2615, 2326, 1641, -3303, -1643, 3603, 890, -4485, -931, 4351, 185, -4581, -328, 3208, -2439, -5584, 368, 3467, -1400, -2172, 4063, 4529, -882, -594, 3686, 530, -3871, -1838, 2280, -398, -2391, 1348, 4032, 898, -1032, 1524, 2206, -1080, -2702, -270, 846, -1494, -2810, -931, 836, -943, -2047, 49, 1332, 45, -753, 1231, 1425, -603, -1463, -357, -1076, -2306, -1051, 950, 782, 594, 2580, 3342, 984, 54, 1004, 78, -1961, -1633, 394, -102, -668, 1119, 1583, 199, 167, 1410, -23, -1622, -279, 844, -1565, -2136, 486, 277, -2390, -1591, 1648, 758, -1628, 606, 3090, 751, -1587, 460, 1295, -2157, -3404, 455, 1541]
3624A541k768L99M234J67l885j33K812j463l906J88L898k60l415J355L864p99
3640A829l787J317L590k210l533K070L499l295l002L196K362m195j185N170J292
3655C118m291l09N780j430n834Q52M611k490m888K760N266k460l440M218L523
3670D986m472l200L625J747m743j748M719J336l967r12M705K40m232M79M514n25
3686B552m165M49L777j061m697J121L548j802k825K883L706j818l023K787J414
3701B846l552k161K889K76l157j32M405N03k990R92L288j397l614J240K228j993
3717c29k328K437K168k594q97K541P06k105k28K333K38j912j37J066o00k027K06
3734a462J059n89l32J197J127J8l01m7k04j471k76P1o33O84M66O43K67L52Q27
$$ y = [1541, -1227, -828, 3406, 3573, -312, -445, 2367, 904, -3002, -2814, 1084, 824, -2591, -1236, 2628, 1829, -1958, -641, 2949, 739, -2794, -724, 2775, -520, -3522, -326, 2036, -2159, -3344, 1826, 3118, -1173, -1482, 4298, 2868, -2966, -2114, 2497, 7, -4881, -2121, 3145, 685, -2755, 1463, 4986, 514, -2686, 939, 2686, -2057, -3805, 914, 2250, -1717, -2629, 2076, 2316, -1916, -1437, 3077, 2552, -1613, -1164, 2613, 1552, -3145, -2024, 1524, -278, -3103, -220, 3486, 1668, -1355, 1432, 2846, -706, -2867, 22, 298, -2859, -2991, 1414, 1917, -1073, -81, 3207, 1810, -1804, -564, 1664, -329, -2657, -220, 1948, -646, -1543, 998, 1704, -401, -629, 1704, 1942, 30, -107, 959, 359, -1668, -1462, -403, -992, -1324, -127, 1000, 1018, 717, 670, 466, -1005, -1281, -1210, -1843, -1159, -693, -50, 217, 569, 1396]
3753A396k94j238K45J124j060r00P98J432j661j313J624J212j484q36K455Q47
3769B347k076m66J683m87k670l29J844p84j893K014K823j233k014K333J451l452
3785i09j639K466J014k981q12L935J127l210J77L059j18l224O90L120j271l496
3801b072J640L068k388l109K657K408k169k441L589K436l303k360K961R33m123
3816b273j842L553J481l476K55L999Q30l658R0L539j793l391J519L104j976k548
3832b587K580L179k552k570L287K372l563k066M067J355m415j461L830N38m897
3847b903L33L920P6l389J654L245k026k554J264J511k532k325K811J862k413k38
3863a704L387N29k744j66K173k03k847L88K203j84j635M65J508n44r47O71P21
$$ y = [1396, 1102, -136, 109, 1233, 173, -727, 71, 1503, -158, -1471, 153, 1365, -119, -955, 1500, 2347, 271, -195, 1488, 1001, -1669, -1998, -154, -938, -2831, -817, 2006, 773, -1241, 1092, 2543, -909, -2548, -82, 932, -2049, -2861, 1074, 2201, -1009, -832, 2227, 2109, -1115, -425, 2695, 1424, -2072, -432, 2636, 248, -2861, -204, 2204, 35, -2406, 1183, 3619, 316, -2044, 917, 1850, -2273, -4115, -562, 919, -2557, -2302, 1697, 2527, -1131, -1041, 2498, 705, -2686, -1167, 1937, -39, -2587, -7, 3172, 620, -1950, 1337, 3709, 146, -1920, 2147, 3502, -913, -2374, 1456, 1994, -2903, -2570, 1350, 1426, -1963, -309, 2936, 910, -1644, -380, 1131, -1401, -3726, -915, 947, -1466, -1704, 1683, 2212, -532, -698, 1475, 1272, -1575, -1187, 1016, 832, -803, -338, 1170, 626, -321, 350, 1071]
3880A071m43m20P06N07j537q11P78j36j505O58J218L0p30N33J620j095r83K39
3898c00k67q40J8P06L39l98J156Q51q98m57J411j76j677P7J519l66k016Q61J522
3917A065o75j605R68J838j115r51J468P15j573j367J605l79k201r1K448K35j664
3934a279J173K218n70k385N31J433r81k597J038K525r56j897J699K391j712k088
3950a457J922J925k550j626K800J219l710p91L328L54l906P13M404q24l184J074
3966c09L594k410l700K146K600l210k045L506K425l127j143L761Q59l721p18K798
3982A306m76k913N16K823n24k161L88K715j017k370J491K179j480k172J493K190
3998A988j966k444K104J586k129j313L156J745k545j162K786P6l100m19K666m97
$$ y = [1071, 628, 208, 914, 1421, -116, -927, -149, -285, -1790, -1132, 86, 116, -614, -81, 1539, 444, -539, -300, -567, -1407, -1389, -683, -344, -742, 414, 1265, 367, -90, 1321, 1145, -532, -455, 1064, 698, -1318, -457, 1065, 390, -1215, -247, 1591, 476, -475, 993, 1708, 135, -1232, 373, -6, -2207, -2298, 150, 385, -1279, -106, 2112, 1542, -843, -312, 1121, 140, -2457, -1419, 1106, 150, -1747, -48, 2343, 631, -1457, 465, 2390, -160, -1786, 1014, 2233, -1477, -2268, 1060, 1414, -2492, -1779, 2625, 1801, -1383, -309, 3285, 875, -2825, -679, 1921, -1289, -3334, 172, 2597, -530, -1673, 2088, 2947, -774, -1492, 1306, 830, -2083, -1567, 1256, 732, -1429, -1041, 1674, 657, -1713, -222, 1957, 477, -1695, -202, 1988, 22, -2422, -318, 1268, -861, -2174, 982, 2727, 182, -980, 1806, 1882, -1218, -1637, 1029, 532]
4014E32k632J471K645j264j952J901J459k384j772K144P78j927j43J552k66j673
4030a531R57J155j022n78J148M66m33m02P07j86j160q2O52J65n00N40J089Pj36
4049H56J80l1k34j042m54N72M4o02M64J087n02l96M02M60j149o24J079j37j510
4068a537N09J366r40j096J408J045j575m92K417M30k200j03K479r60k577Q05K140
4085A119r55j382K027J913k015j063J523P57k655n07K093n06k059M89K168l78
4101E69j881O45J708r70j786J256J301p27j543N44J556j022j482J546J467j584
4117d03o33K258J433k592r47K188N95l435k42L173o1k864J241K954j234l188J970
4134B13K187k956j959K707J131k467q77K551N32k413j21K543q10j853R77J876
$$ y = [532, -2100, -629, 2016, 752, -1200, 701, 2160, -224, -1996, 148, 926, -1001, -1144, 408, 142, -1531, -574, 581, -441, -1019, 129, 595, 162, -240, 467, 281, -879, -961, -309, -144, -644, -104, 985, 992, 856, 1036, 1005, 771, -271, -725, -153, -109, -711, -247, 840, 338, -58, 344, 804, -345, -969, 110, -27, -1537, -1028, 338, -602, -1698, -290, 755, -820, -1312, 1105, 1535, -665, -768, 1711, 751, -1826, -1021, 1119, 164, -1218, 809, 2722, 707, -356, 1167, 1924, -731, -1238, 855, 349, -1710, -1221, 947, 569, -1312, -667, 1041, 71, -1715, -459, 842, 115, -1428, -884, 672, -350, -1832, -286, 1181, -403, -1036, 1222, 2655, 63, -884, 1304, 1899, -1536, -1778, 1395, 1334, -1530, -289, 2665, 1431, -1757, 213, 2400, -556, -2515, 192, 1323, -1144, -2021, 530, 1062, -1351, -1472, 1071, 261, -1592, -615, 1261]
4150A261j150j263L84J555j226q57J383Q41m39n68J032O95o74j071K20Q21j706
4167g62m95J350R05j095p70J689M03j767k16J580l42j905N01J732r28j539J293
4184c66J058j020q82J467N15j559J47J673p60j154R46M55j405j42J474L19r16
4201a50M26R15k55r50K38K50r40m98O23N10n92J62R07n5o78L9M4k0n79J91J95
4222b17M44p05K8L87J02q39M85Q86o5p70P53O45j011j128Q36Q26j464p69K198
4241F22M52j851K62K453n36k832J195K051k002k414K329K078k060j323K544O02
4257A570k377n65K510P4k225K74J915p00j791P87J301j053j359J577J563j264
4273B37j072J303R84j595r74R09R38j612o12J638J143j289r49K179rk071n8J956
$$ y = [1261, 111, -1152, -768, 787, -439, -1296, 87, 928, 489, -79, 953, 1648, 974, -97, 123, 944, -762, -1257, 93, 998, -97, -867, 822, 1225, -542, -758, 822, 480, -1425, -924, 808, -120, -1659, -366, 692, -328, -1210, 257, 772, -787, -640, 1033, 273, -881, 65, 520, -885, -1027, 447, 766, -150, 276, 1191, 936, -14, 224, 474, -466, -964, -341, 169, -423, -261, 646, 591, -87, -48, -4, -24, -603, -412, -217, 227, -478, -450, -63, 39, -800, -315, 571, 506, -264, 489, 1134, 123, -1005, -169, 657, -807, -1576, 622, 1074, -777, -515, 1938, 1402, -1430, -235, 1816, -186, -2600, -271, 1807, -253, -1576, 968, 1570, -807, -1372, 1138, 1212, -1013, -739, 1176, 476, -1315, -528, 773, -280, -1639, -62, 1501, 237, -835, 468, 1452, -143, -1117, -208, 730, -882, -1494, 144, 1287, -2, -951, 1228, 1219, -852, -910, 1046]
4291A046l30k094O28K421j157j892J697J514j735j414K066J332k173q77K025J34
4307A191k224m34K217m02j876O53J641l80r08P32L61o45j039P66O26j236j74J268
4325A37K48l00k70P71O7r62k5P11K19j041M74Q11L6j174K87N03k1j255R39Q20
4345I75n39q44M76K52j347j02R78J76j303J020Q17m38r84J079J86j187k94J017
4363f2j60q51P49J349o87m67N77Q84j263p44J496K10j322j16J354l31q29k70J191
4382G08m16r80O37R88p91l58K68M56j091p64O06N03l37n23Q98R39r38l13Q06M62
4402G60j526n83J872L2j351M38J802n59j521R36J333j380j431J363J602j562j222
4419i97J526P63k030n16J785J97j742O11J350m29j674O30J434j239j705J326J175
$$ y = [1046, 716, -1378, -750, 1671, 514, -1378, 319, 1833, 98, -1316, 750, 2082, -91, -968, 1057, 1191, -1033, -1467, 750, 348, -1528, -875, 766, 386, -522, 210, 571, -74, -1113, -347, 279, -957, -1131, 137, 385, 85, -185, 586, 653, -309, -334, 377, 596, -445, 29, 840, 876, -298, -11, 492, 471, -784, 155, 975, 436, -408, 68, 320, -1027, -1129, -151, 25, -1278, -258, 559, 121, -863, 216, 402, -785, -1079, -62, -222, -1073, -324, 1025, 338, -129, 448, 1332, 69, -675, 821, 1031, -291, -407, 947, 616, -213, -483, 708, 292, -688, -51, 937, 146, -212, 56, 512, -579, -1343, -737, -234, -571, -1094, -196, 743, -195, -508, 298, 760, -766, -1349, 523, 555, -796, -358, 1444, 885, -636, 300, 1633, 253, -1178, 185, 1787, 225, -997, 529, 1292, -738, -1254, 531, 728, -1014, -403, 947, 518, -1156, -526, 908, -331, -2036, -710, 465]
4436D65q81q39J322P09o82q84J485j04j281M8J589p5j337K98J168p2j420R9J405
4455A013m17j289L73J477p40j450J232O51j143j260J447O88j258l38J476M01j636
4472g73m04J488j81j647O99J155m94l57P12O18q27m54J317k94j289M09R10j71
4490D17q81L10J041o67r94N91R78n28p34O62N10j82j303P99L92j006m19O69R27
4509E82r48k6Q35j09p41K69M61m59p67R08L92m01k57R66K14j060m91J079J76j427
4529h04L71J195j94j563R63R88p06j280J072Q81q55q19J002R14j735j49J206N9
4547E46j278L13J178p23j50L26O34p04p18O20M24q08n51J085M79j150J90O26M27
4566G66j161l80J406j32j108J44Q77k97p89P42L79p83n88J012Q19o21p89J044
$$ y = [465, -416, -1255, 67, 776, 94, -790, 695, 591, -690, -642, 947, 872, -465, -167, 1001, 929, -491, -392, 1013, 596, -693, -320, 1157, 417, -1033, 199, 850, -293, -1553, -106, 582, -676, -1014, 462, 863, -773, -1177, 311, 130, -1517, -818, 337, -157, -514, 198, 816, -11, -465, 852, 558, -731, -322, 588, 417, -464, -154, 887, 220, -774, -183, 795, 267, -467, 195, 705, 523, -780, 19, 411, -595, -1014, -345, 582, -366, -392, 443, 334, -407, -138, 323, -136, -903, 5, 397, -4, -261, 705, 919, -141, -632, 447, 623, -804, -433, 762, 568, -995, -32, 956, 250, -1030, 42, 923, 68, -751, 251, 1165, -570, -719, 487, 546, -732, -419, 759, 36, -114, 212, 846, 142, -576, 44, 468, -340, -891, 194, 673, -477, -287, 339, 766, -395, -775, 631, 499, -609, -465, 412, 115, -674, 68, 447, -336, -924, 88, 907, 286, -503, 541]
4584E41M31j173n02J197J42j177J90J132p7j279K07J409p65j205O92O87o87r17
4602a154J081N61j171P2J050J82j498L32R98j78j126K08J531n84j435P56J068
4619F93o90m76P95Q63p05m62O00L39r34m15P63m1p45R4Q79K04j074R5N59o75m72
4640h05L05N62k34p43N70O13o73l58O07K38q12K16Q23j5p36L46J439j052p42M36
4660a5Q52r64o2P70N26q32l55R06l72n68k46M86k57o22N68O38o75l91M09K39o69
4681f34k74J091j8j017L16O56L1p56j69J135l11p78P08O90k91n95O41L00m83o73
4701d31P02N11n61j95M90M07q09n96R99K7j303Q6P68k04n89L57Q63o53r16P06
4721c41R57j009q05J101N64r02l53J016K98j113K38O63L8j029Q99R27p08n83N58
$$ y = [541, 972, -201, -703, 494, 636, -541, -351, 781, 704, -575, -368, 1041, 276, -929, -237, 450, -237, -1154, -73, 488, -683, -611, 439, 621, -877, -545, 453, 275, -851, -643, 888, 304, -1131, -375, 693, 3, -473, 322, 1185, 480, 18, 618, 957, 23, -392, 371, 330, -415, -321, 558, 762, -312, -217, 342, -333, -805, -500, 62, -172, -915, -345, 268, -405, -763, -156, 82, -730, -514, 309, 294, -442, -96, 1343, 291, -451, -15, 837, -127, -189, 581, 1107, 275, -80, 826, 454, -114, -360, 126, -131, -753, -185, 453, -222, -613, -204, 35, -634, -908, 183, 165, -852, -536, 120, 151, -605, -774, 361, 50, -728, -20, 670, 379, -216, 425, 725, 242, -431, 271, 782, 221, 26, 516, 923, 114, -482, 517, 544, -759, -673, 95, -109, -698, -341, 522, -131, -1047, -341, 616, -393, -1198, -97, 467, -435, -788, 228, 526, -587, -349, 314, 352, -677, 222, 1149, 441, -142, 416]
4740D16M41q43m68M14P71q16n11J292j3r10j73N82j31o08J47P30j86m33l00P92
4760A93k14q44K39Q62l17n55R27O3q56jR67p6j209L97J111k16j055P30Q78p45
4780B79q19P58N01j161k07Q39N12q16J4O91j16j031L21M25l34l54K93N70k56m12
4800c03J44O63q71k0L34r7r8Q0M54M3m03k21J56N45q59L73M46j02n36K98O71o44
4822E3q38P90L38m09n36O32O19j116j14J196j32j049R4J414n03j207L50J172n31
4841B23q95P94L85p40j66O88Jn34k5P99n89m61L27J5o0k74N35J73m57L35k11K22
4863H5m02J78J9M94p48J58L11J33j7m20P37j39n85j31Q81j32n72NR08m80p13L67
4885f3O22o83q35J132J09n60l85P18L39j147K0R83j78q92Q29K94j55n13M96O15
$$ y = [416, 857, 14, -454, -40, 731, -85, -596, 696, 683, -227, -400, 182, 51, -557, -410, 320, 134, -299, -599, 193, -21, -865, -626, 236, -81, -636, 291, 354, -502, -503, 464, 388, -821, -424, 687, 471, -584, 146, 1024, 279, -540, 218, 719, -442, -649, 190, 702, -114, -100, 591, 475, -556, -235, 190, -144, -498, -205, 365, 109, -303, -159, 504, -367, -387, -53, -150, -248, -168, 286, 329, -74, -295, -139, 406, -453, -80, 366, 264, -272, 26, 697, 53, -785, 5, 343, -66, -602, 30, 649, -467, -581, 615, 483, -566, -472, 942, 439, -768, -418, 754, 223, -672, 122, 507, -233, -399, 289, 290, -244, -269, 530, -59, -520, -193, -178, -238, -512, 23, 196, -261, 74, -137, 85, -317, -139, -120, 374, -374, -216, 95, 228, 211, -209, 528, 389, -196, -327, 554, 422, -150, -145, 763, 283, -430, -63, 559, -124, -959, 173, 282, -278, -663, 55, 394, -753, -733, 250, 72, -820, 9, 303, 148, -365, 131, 746]
4905G46p57n41Q33J21m90K61N01r9q12N39J5j93l49M87K47k33o49N05L83m72n51
4926e08K20K23k40m29M14J039j501n2J031l4j092K16Q30K3o11M30J003p56p30
4945e24N94R66r32m84Q35M74j084L3R47l21n63J59L10p10l72O26M83n74j38L82
4965A07J06r50L6R82o34j06M44j02K91m76l5J52Q0k52J72K79j64M8J54N96l13
4986D15o14O48L20m73o40O50M07n92j99M27K54o60n45J132k24r98M82O69k55q10
5006f06L80M53q12m7L37J90p17O11P67j20j097m0R65k25n30N88O47q01k84Q16
5026D75L84p85k15O39%l74k49M95L38n74j09J29M0o36k89R27j72l75O3M64k59
5047h3n67P13J43n49m18P53M10l33m58R12j73o58K29N88m59p79Q30R21o93m92
$$ y = [746, -11, -552, 281, 402, -88, 173, 674, 575, -237, 302, 317, 124, -225, 262, 509, 276, -373, 132, 515, 43, -508, -288, -65, -305, -734, -320, 719, -782, -834, 197, 163, -929, -713, 117, 140, -471, -41, 962, 206, -524, 70, 1036, 104, -380, 455, 929, -155, -122, 825, 504, -59, 100, 410, -300, -672, -46, 437, -137, -275, 107, 213, -737, -701, 281, -353, -459, -15, -117, 174, -302, -337, -185, -105, -357, -185, 94, -70, -22, 132, 728, 415, -199, 449, 769, 296, -344, 306, 713, 121, -78, 349, 603, -57, -602, 530, 306, -692, -210, 459, 204, -606, -226, 227, -585, -632, -295, -105, -822, -211, 556, 436, -661, -701, 264, 39, -491, 97, 744, -57, -341, 475, 859, 74, -141, 498, 498, 124, -125, 370, 708, 134, 25, 154, 194, -442, -731, 196, 24, -351, -288, 176, -83, -650, 63, 206, -343, -761, -8, 402, 69, -389, 523, 350, -308, -79, 509, 50, -729, 101, 1022, 329, -163]
5067a63P61j54p39k41O09L59q63M00R27r07l89Q9N09m78j97M7P46m32j80J45J57
5088Fl24J57N2M7l63J30M19P7j43k13L47L7l69K5J91r2l74N57L94k47o90N12K82
5111D18n36n34P39J10o45L5R80j05q60L07N39n70k16j6R00n99l67Q29J45p82m03
5132f31Q73m49m10M96P01n19k87K85L38l90p09L14N77k01k64K24J47k72k16L54
5152c9N54n86l47O02K09o15Q3N64k24k18J29M23m60k70K35M01l96k18M92L74j066
5173c73k90Q91k59m42K00N25r3p74N59L40m21l59M62L52o27J03K34L28n73k82
5193d99Q66l37k58J14O20k50j07L3L63P9j033M37L90m44j25K94J6j47k35K66L0
5214G3j72m46N68q7l05N3L21j12k90K97J01Q6r49M68N77m28j0N81J47m47k02L81
$$ y = [-163, 598, 444, -295, -536, 73, 432, -431, -31, 896, -11, -400, -311, 198, -280, -477, -430, 316, -116, -296, -151, 6, -318, -161, -109, -62, -425, -295, 124, 201, 58, -155, 192, 229, -140, -115, 76, -16, -390, 167, 561, 314, -376, 136, 418, -118, -652, 87, 197, -448, -413, 567, 462, -398, -91, 448, -122, -338, -354, 546, -53, -420, 409, 554, -228, -631, 242, -207, -617, -121, 580, 61, -226, 59, 397, 7, -702, -388, 189, -12, -276, -52, 95, -177, -393, -39, 515, -71, -418, 184, 393, -222, -139, 425, 201, -17, 112, 535, 75, -195, 40, 441, 45, -173, 319, 693, -373, -663, 228, -31, -473, -273, 252, 159, -615, -56, 284, -137, -496, -34, 318, -309, -206, 28, 356, -217, -499, 367, 30, -228, -114, 506, 256, 149, 182, 545, 624, -409, 28, 418, -26, -151, 143, 159, 12, -223, 43, 73, -99, -545, 23, -64, -369, -316, 5, -107, -397, -100, 1, 87, -862, -394, 183, -245, -255, 326, 473, 26, -176, 205]
5236B05N6m29L25J03j58k02L03L52l69o67R66j78m75j81M04L86o05J43J50N5q20
5257f36M79J25j70k09J65O50q39K98l07L44J17j19J71NJ54k34J9M20l58j30M65
5278D10qo02K00N56j57o71J20O60l72p75N57K65n63m7P44r2p57oN18k27l47J45
5300d49M41k44l20K57M10o8n39N86K99m07O9R4L21k93k68O54j01o09K3M41j25
5321A72k15K72O6p6m43J32N49n18m38K34O36r03J65L77J44p22j43N63L01o39Q8
5342c98P97m97k39M64L10m45m19P17J86l56j56M24J05n31M8L32Q3p51M26K94m59
5363f5j11K43K08m70j05N6J29l16J77K51K61m26j49K67J04k37l27M75j23j14R
5384b63N13L98o71J76K6Lk05r4N78m50m00N88L63l72m97O47m39j47J21N68m83
$$ y = [205, 261, -168, 157, 260, 102, -100, 203, 555, 186, -481, 485, 307, -168, -349, 55, 441, -164, -21, 129, 184, -636, -157, -32, -202, -411, -246, 404, -435, -137, -444, -100, 17, -102, 69, 74, 228, -6, 13, 433, 75, -55, 410, 402, -200, 0, 556, 399, -272, -152, 508, 136, -639, -82, 183, -380, -427, 317, 225, -532, -538, -20, -247, -594, -449, -8, -252, -572, -315, 95, 27, -512, 74, 373, -34, 35, 129, 450, 157, -111, 543, 442, -167, -144, 297, 172, -43, 229, 295, 219, -224, -92, 457, -61, -499, -265, 371, -532, -367, 10, 154, -568, -711, -148, 153, -486, -398, 399, -98, -337, 127, 437, -8, -427, 290, 476, 120, -36, 388, 493, -38, 10, 342, 425, -326, 100, 394, -65, -176, 67, 275, -195, -300, -244, -115, -431, -254, -3, 258, -168, -317, -50, 54, -183, -510, -35, -158, -272, -263, 250, 648, -23, 153, 179, 182, -23, -117, 461, 11, -389, 199, 562, 190, -307, 340, -99, -246, -125, 443, -40]
5405d0j32J28N36m49j90J49M54m14k37O31K39o78j53K78M38j118L44J67K57n20
5425c10K98K51P2o02K64L56k76k39J14K19m24J21K22j69K46j25m5K78l45K59L6
5446B01j09k37J19Q3k27L48l91J13o6J88L19Q7m09k95Q19n69Jj31N53n29l38L61
5468a09K46Kp91O72r3k46m9L20OO6j54O2K4k39L35j64P0p5M21L80m87k2K19r8
5492B96m70k01M82N3m53R0M50n7l11J81R8n83j23L38L01j66l03K62L80k32l20
5513b88J33R0nj96M71K59n72k62O61ln27K81K87J43k22kK51l73k66K45K21j18
5535B08l92K45N28o70J69J09k24k41j56K78l8l98L32J36k0j28L15o2j48j6L28
5556A55O6l06J18K75J31l8j16n1K6k18J40K42K4k83o3L50r7l84j1L08l89m00L09
$$ y = [-40, -172, -44, 492, 43, -147, 2, 456, 42, -195, 436, 675, -3, -156, 122, 560, -558, -214, -47, 210, -310, -12, 239, 311, -291, -27, 329, 53, -186, -72, 147, -277, -156, 66, -103, 143, 18, -27, 251, -94, 165, 201, 92, -145, -26, 57, -170, 178, -213, -100, -166, 22, 341, 428, 19, -276, 543, -26, -25, -156, 397, -132, -470, -109, 137, 139, -652, 20, -73, -319, -368, -48, -42, 24, -130, -68, -44, -283, 52, -112, -42, -117, 304, 684, 197, 175, 394, 296, -174, -375, 107, 160, -293, -203, 247, 190, -121, 60, 158, -425, -548, -210, 91, -75, -378, -116, 264, 32, -288, -155, -65, -70, -266, 205, 464, -108, -370, 291, 288, -239, 42, 329, 472, 250, 248, 499, 126, -140, 105, 326, 208, -184, 61, 589, -81, 88, 197, -27, -268, -424, -146, -184, -582, -250, -114, -134, -262, 53, -9, -157, -173, 155, 221, -85, 33, 308, 439, 401, 285, 234, 260, 42, 182, 424, 448, 165, 102, 452, 355, -29, -40, 268, -121, -521, -212]
5579b12j86J54J6l9M40l60k89K34K39m84J41M48k10j90L41J61p2l50O26j73l82
5600a47K58J38mk24OK54j01n23O48J7nq9J27k42j51p5L22j15l34L15J35l36p0
5623a96m7L48j23k69K91k70O7J23J21j13N0k75L72K94m87J4K23J11k93l4O68j36
5645D39p11L39J50J88p18N99Q9k46m63O02No70J24N15j92o15N46Nk27n09P67M4
5667F1K7k71Q7M0J72j30n4J88P9m08pL61l97RM05L14l69l71N93q7n56K34J00Q3
5691A03n51J30O39j48l19L04P0l17m38P11J98l73l04O37j39m66J29M18j01l69
5711a86K48J07j12l12K57M7l01K30n5K35l19k38L83k75J30k3N38m99r9L7L22k35
5733a20L60j37P3J68l19L11Q1J9m08J67l3k51j38O82n70j04K24jKk30J43M06m53
$$ y = [-212, -398, -244, -228, -267, 173, -187, -476, -242, -3, -487, -346, 102, -108, -298, 43, 204, 132, -218, 408, 235, -147, 111, 249, 245, 21, 27, 281, 180, -343, 305, 322, 317, 228, 355, 113, -38, -113, 209, 94, -240, 75, 210, -126, -196, -243, 105, -18, -287, 4, -266, -199, -76, 45, -68, -18, -293, 79, 373, -114, -100, 123, 234, -59, -93, 575, 439, -272, 67, 217, 405, -313, 286, 375, 129, -334, 268, 273, -397, -273, 242, 50, -565, -19, -14, -241, -750, 17, 61, 88, -183, -96, -56, 116, -14, -68, 120, 199, -209, -216, 145, -252, -243, 162, 476, 107, -264, 329, 242, -314, -80, 20, 103, -448, -318, 321, 173, -146, 158, 228, -89, -527, 184, 382, 9, -295, 342, 203, -263, -134, 284, 183, -186, 62, 169, 57, -255, 2, 49, -252, -22, -77, 158, -161, -399, -16, -291, -161, -184, 354, -145, -244, -207, 115, -120, 240, 103, 176, 344, 25, 336, 417, 436, 28, 195, 162, -89, -227, 455, -115, -219, 5, 4, 6, -224, -81, 325, -128]
5756a28j25L04j54L9k29M34k56o8K40l4Q1k27LJ62k41K79K47l3l17j57N99l34
5778H5j46L15n7m06J5K42K29j16l75P95j74o67j57K44j61J41K59l0j38q1l47n2
5800e82N12p8j28J38Q8O9J0L92j52m0J08Oj43p38P27L35l42k99N67K22o20j63
5822a11M65O3p90M48J08k84o53N89L61o52k7M42L25l61j37K19j08l9l33K83p8
5843b70N3K32P2K61l48o7K86L24m34l24N49J87o69J69K80j51n3k3M91m50m58M06
5865F3N09o48r0K71K28m93k6k92L11j90Q5K1J77j01j39K40K02k10j38K41m5J52
5887A28L43l58j36K47k17K65J6P4l46K15k26L0j01qL97m04r4N0J28j42j52K34
5909e7Mp9K17m21PM2k05L06J23m7R7J45m6Q7j34K96n00O8J6L9L66j75m70N78J52
$$ y = [-128, -253, 51, -103, -64, -293, 141, -115, -183, 57, 23, 104, -123, -120, 42, -199, 80, 327, 294, -23, -180, 419, 85, -61, 254, 197, -209, -194, 48, 277, 161, -214, 581, 407, -260, -417, -173, -334, -193, 66, 36, -102, -183, -530, -582, -70, -148, -276, -138, -50, 19, 29, 421, 269, 229, 337, 343, 200, -538, 189, 524, 182, -117, 450, 672, 52, -111, 354, 417, -373, 75, 183, -101, -754, -165, 196, -456, -483, -41, 284, -77, -214, 5, -103, -142, -475, -192, -270, -217, 15, 87, 348, 0, -67, 219, 543, 109, -215, 334, 521, -148, 21, 301, 150, 97, 74, 565, 115, -343, 63, 572, -76, -166, 105, 333, -160, -186, -478, -167, -357, -272, -251, -74, -175, -314, -74, 128, -82, -220, 21, -24, 128, 471, 113, -23, 224, 7, 272, 288, 362, 16, 231, 5, 35, -66, -74, 323, -81, -175, -125, 3, -139, -291, -57, -53, -132, 85, -336, -329, -287, -492, -186, -63, -110, -13, 132, 86, 173, 39, 335, -165, -97, -81, -42, 324, 149, -321, 257, 409]
5934D09j87l85K31p0k46pO26l52k05M3M89n29l09L56K85k14k93P76o27k31J39
5955c01L91P5n52J20N33k17J54l13L77k01k23M9J92q0l20J82K89k53L8O3M40k60
5977A83l87L81L8j74m52O97J45p23J2M82R2o12J82M47Ko29N44N0l14j86O3K26
5999F7k28k87N68K41j71m63M51j31Qk63K58J88j34n19K64M60n89P5J85K56o09
6020c73L77N15k33n08K75L7J99l65j26M56j54j41K04J22k54k42K27K51n58J51
6040a40K47m64J37m9M81m09K07J9l36J41QQ7J09n1k12K07P4M3j28J95o9r1L58
6063C64k59PJ53k04q5L6L44q35K31N37J07k59k0m20K69K06m14o6L41K9m1l53O51
6086C19n07J32rJ62J67n38K51K39m42R1J37L1j87K06N81Q3n81M45m8k33n03K82
$$ y = [409, 222, -163, 68, -2, -248, -255, 371, 19, -186, -143, 346, -183, -492, -136, 149, -65, -358, 418, -209, -440, -301, 90, 165, -387, -267, 266, 49, 203, -110, 267, 66, -157, -108, 84, 4, -316, -134, 155, -98, -60, 3, 443, 183, -204, 177, 215, 41, -411, 286, 431, -292, -280, 202, 294, -318, -136, 311, 313, -316, 228, 278, -36, -222, -159, 67, -161, -448, 120, 361, 190, -273, 178, 47, 55, -208, 50, 238, 104, -415, -151, 309, -280, -205, -20, 236, -373, 4, 519, 286, -222, 53, 90, 289, -76, -202, 254, 100, -41, 163, 285, 31, -211, 16, 267, -291, -140, 107, -357, -220, -269, 212, -197, 10, 29, -307, -166, -158, -71, 38, -13, -225, -18, 56, 99, -29, 166, 97, 6, 364, 105, 112, 265, 61, -24, 12, 356, -479, -248, 289, 396, 137, 117, -303, -34, 172, -242, -308, 33, 62, 21, -332, 319, -188, -56, -65, 97, 264, -274, -23, 216, -226, -135, 2, 33, -154, 52, 633, 716, 135, 580, 532, 299, -204, 78]
6108G8K12j45l97K12N34p58N3M36J92j069n0P97k18l08Q5J10j1k77K55L19n37
6129d87m5M50M20L2m50J96L40j81n30J76N44o60j1K54N01l51n15O94K81m89n31
6150c62K02L07o11K97K05j18J3l11K85J57l99R4q9M86o30k08O14j2l34J14O46
6171C46r2k87L7K55k57p9K34K22l07j60L88R9l23j70L59j39K95n32L4L87m45l5
6193a70K19N4p62M23J55j64q4J08K45o8j47K3K28q7N8j19P0J16j31j33L42p1N2
6216A57J90n10K94k8o2q2J14m38J89L19Pn21L06J98j8l36j0N88m72j94J2M96j60
6239C9o86Q96q1j68k02L82K72j52l86L42n8m72j1L57N5k64J92j10L19n80M62L40
6261D86l64m27R2O38m53l13M1M72j04m06M16K36j26m35K92L7j56l09M54L03n11
$$ y = [78, 290, 145, -252, -40, 494, -264, -211, 225, 417, -652, -702, 95, -123, -431, -346, -236, -247, -524, -269, 50, -487, -532, -82, 338, 370, -80, 116, 456, 275, -255, -79, 465, -195, -206, 48, 549, 198, -317, 377, 658, 169, -362, -160, 147, -464, -167, 38, -80, -67, -378, -93, 64, -335, -241, -330, 156, -474, -682, -68, -80, -414, -300, 346, 254, -33, 4, 259, 2, -77, 157, 379, 72, -88, 300, 399, 76, -94, 265, 126, 421, -111, -77, 310, -135, -170, 49, 103, -659, -236, -81, -245, -329, -221, 24, -44, -191, -168, 60, -27, 31, -88, -18, 98, -33, -166, 176, 105, 157, 347, -163, 131, 103, 41, -41, 73, -365, -176, 143, 150, -371, -65, 133, 115, -221, -231, 357, -115, -309, -297, 199, 39, -647, 249, 168, 0, -202, 180, 452, 300, -86, 256, 198, -274, -285, 72, 127, -137, 55, -55, 264, -316, 146, 486, 122, -305, -213, 425, -28, -341, -300, 172, 68, -338, 78, 314, 188, -247, 45, 82, -74, -383, 71, 374, -137]
6282a37j32M54J74q1l60J43j29j75l05Q14k7n94J22P54l09m88J47L29k2l97J0
6303b09L50r4m59P09j75k04r6J31J78j08L0L48j58m77J02J5L80n85j50M24L41
6324B93o91M10R1J08l15q8M65l31j8j69K51O9l11J86K73m01p8L43J04l00k05N64
6346B50j63m16R8L72m7L00m01L15J5j30l10J23L15J2n59J25K25j78j48Q3J95j4
6368F2m7j3m6k58K78K10P8o95l97O53K86l52PM13J96r9m05L34J29m56J18L9L37
6391C72l62j3k4M61l23j22P6J73m87M22M39p99j76n8O99n41l25O63k91J80k23
6412b59M95K3p17M8M12L05n32n5L07L25n45j13Q33r3o46M17L99o36k02K69M30
6433D65n49j42K14M16j13m38j31P09j73n08K97N4n47J22N8K04k04k44P60L5m83
$$ y = [-137, -269, 185, 359, 278, -82, 61, -68, -243, -548, 266, 239, -355, -233, 521, 212, -276, -129, 200, 178, -219, -209, 141, 47, -412, 297, 122, -82, -178, -47, 131, 23, 53, 401, 243, -234, -132, -117, 263, -322, -472, -48, 293, -398, 12, 103, 211, -104, -192, 273, -58, -76, -245, 6, 75, -236, -50, 223, -178, -256, 87, 191, -109, -314, 250, 87, -329, -231, 141, 94, 394, -7, 308, 323, 193, -117, 6, 321, 333, -226, -101, 124, -54, -202, -119, 76, 62, 15, 2, -44, -302, -24, 186, 264, -431, -828, -175, 111, -241, -234, 179, 375, 276, -129, 205, 334, -122, -4, 35, 372, 10, -3, -27, 434, 111, -11, 65, 238, -249, 173, 612, -187, -363, -421, 278, -263, -588, 75, -216, -36, -259, 236, 259, -458, -410, 2, 307, -225, -280, 27, 352, -193, -306, 527, 434, -212, 205, 604, -32, -234, 35, 465, -84, -226, -12, 404, 291, -147, -278, 431, 258, -250, 47, 101, -446, -324, -266, -62, -266, -510, 250, 285, -198]
6454a98j27L67L41o75j83O05k21k64j61Q24L2m63K90J73j56j50k89N57l5n83M03
6475H7L45m89l19K58K67j28p7J69K2m1l92K83k55J52O7k74L59r0k77L04M27l85
6497A3l64L11L10m85L5M54Rp00L13N73k06j31l6L72k54o01M10J8Ok09J28j29M0
6520a23j56L74k6j33k29K98P4j8o24L49M81p9m24O9L88j33k17L93K57m69j94J89
6542D7L29l88r8J95J86n90L38K31m4m79J88J75J0k79R4L71n92L25n2J31r1%Q0
6565H7M50k33m86j98M84j5l70j83P96p33p3O86P8j75l20K23J61l19p6J86k6o2
6587a18j54O48j64q22O75L58p7l86m5M09j84m81j26Q95l71l81P7L25j46j33L60
6608A59J73j71n14N45k12r4m63N16J3k81J26O61k98m69k2R8M10k96j17K87j56
$$ y = [-198, -325, 42, 383, -292, -475, 130, -91, -355, -516, 308, 340, -123, 167, 340, 184, 34, -255, 302, 267, -316, 87, 432, -57, -376, -118, 149, 21, -56, 113, 135, 94, -298, -15, -270, -118, -51, -325, 34, -56, -333, -29, 398, 13, -351, -40, 270, -215, -180, 274, 283, -417, -104, 469, 263, 132, 96, 468, 214, -387, 23, 41, 47, -162, -34, -163, -123, -279, 95, 69, -64, -293, 5, 79, 61, -563, -214, 267, 188, -236, -167, 221, 88, -129, 264, 521, 52, -142, 47, 376, -12, -110, 85, 271, -319, 19, 250, 206, -273, -85, 90, 100, -179, -85, 286, -306, 19, -33, 98, 7, 7, 87, 537, 304, -182, -380, 104, 89, -281, -464, 332, -401, -474, 212, 290, 115, -205, 18, 179, -140, -216, -30, -56, -118, -272, 376, 212, -610, 65, 423, 346, -40, -85, 324, 140, -341, -467, 428, 57, -324, -247, 78, -68, -201, 159, 332, 161, -353, 192, -20, -114, -577, -61, -48, -329, -203, 458, 160, -309, -331, -233, 177, -119, -236, 51, -105]
6629a05k61P1M13k04p4l1P74l60l93L12P5j19qP4O3j76j16K98J46l49L3K55j30
6652A88j20l03m6O23l22o61O26Kj73m43L95M97j36l45mK05k57n9K71O27r91O88
6674B62r8L4n5j96N47P2j71l10J01j90l9n8K9K92l36m2N69m76p4K43l21J91m14
6697d40J95L23n67l64P16M38l37l26N67J88n04j74L41M62p12kM64k93l49M71J09
6718B06K25m76K6O37m16m4j99j02J24q4p1M49j06m70j04O76l38k86M25K03m41
6739a66l60L71J98l42m55P40M02n43k78M91L00k71q8K48L6l43j15M89k46j66j14
6760b12M11K01n70J05N49l07q0k78O4P9l26J6K25L8m9l4N28l02k70J41J55lo11
6783e30K32K51J30m20O20k60j84Q6M03ll66o4K84N6m08n1L99n1r9P0K13j35K2
$$ y = [-105, -366, -295, 118, -86, -160, -191, 583, 223, -170, 142, 217, 98, 90, 164, 227, 51, -65, 233, 379, 30, 63, 318, 188, 68, -235, -281, 342, 20, -641, -15, -13, -186, -629, -234, 263, 127, -218, -222, -17, -274, -333, -62, 565, -426, 262, 164, 198, 143, -53, 494, 566, 395, 85, 186, -4, -43, -101, -72, 220, -116, -158, 411, -65, -139, 104, -217, -26, -440, -245, 78, -489, -853, -137, 301, -36, -362, 205, 393, -111, -285, 56, 518, -194, -196, 268, -25, -374, 97, 206, 431, -45, -19, 618, 202, 158, -41, -143, -19, -103, -174, 275, 169, -301, -405, 271, -67, -353, 72, 275, -166, -526, -155, 43, -299, -754, -14, 388, -155, -433, 58, 358, 87, -1, 247, 283, -60, -175, 314, 68, -98, -212, 199, 400, -170, -65, 484, 177, 97, -181, -117, -38, -364, -348, -123, -85, -134, -168, 360, 58, -212, -71, 84, 81, -530, -298, -47, 83, -337, 283, 23, -161, -75, 328, 325, -41, -105, 179, 235, -173, -224, 175, 124, 25, 95, 308, 173, 195]
6806A95k20K63n26k69M07P9J17n56M26J47K35o20L11K86l23j07N2K15k32l36L55
6827a01K72q5k79L57N1l3l34K50J93l62k02K30L05k87l60M82K3j87kJ57N6k93
6849a49J5K41J44m38k8K32K69n19J69K58J8l72J32M80m28k38L22n5j47l52J02
6870c44P83p86N1M83J09l34m93Q94k03n09k11Q45k2o59J41M27J9j45j43L22q1
6891A44m78R8M89k19m56K18J09L82m99J00M6m3J88j27K91q1o51K55M14l36k86
6912d42J88L76Q1n10M14J38l35k26K24L15k48j17L09l41K42j06L46r9l08M67j66
6933B02J81p01P5M04m85J32L49L6q2m40J34M39l62j25Q3M70o74k20L73K67k97
6954b41k21N37L65l78k30O91p6m02j38R1L05j94j26L70K48n81N0L89k8m39j94
$$ y = [195, -25, 238, -288, -557, -150, -71, 46, -510, -84, 63, 298, -322, -11, 275, -48, -155, -103, 112, -120, -456, -101, 171, 86, -193, 164, 215, 182, -152, 98, 291, -71, -273, -43, 262, -25, -385, 97, 120, -67, -69, 88, 144, -149, -134, 107, 251, -187, -215, 17, 286, -233, -64, 194, 212, -160, -28, 452, 24, -214, 108, 53, -94, -446, -344, 439, -347, -296, 187, 296, -38, -531, 363, 160, -349, -560, 285, 263, -396, -255, 172, 191, 46, -97, 225, 144, -334, -236, 253, 34, -422, -204, -95, 287, -212, -112, -66, -109, 79, -48, 243, 162, -489, -234, 180, -156, -442, -254, 122, 203, -307, 107, 245, -90, -316, -92, 223, -25, -142, 167, -174, 68, -38, 308, 209, -99, 368, 202, 383, -318, -243, 161, -324, -192, 157, 193, 111, -329, -195, 244, -118, -243, -160, 310, -364, -584, -211, 56, -241, -462, 75, 440, 62, -168, 523, 447, 45, -93, -2, 303, 109, -17, 353, 601, 20, 70, 459, 431, -8, -202]
6975b02O51k67j81k81N22j56l41K76M3k93j22J84j51M51o18J08N11j50j57j34
6995c07M31k65j44K71N56l38m43L55J01k41lK8L07l54q4O89k85l56K01k38L40
7016B21j71k86K81j00l41k5M96j35k78j85N52j70k05R9M30r2l94K79j71nJ9O4
7038a17M06l3m90N48K63k47m38J06M77m23M7K89r7o33J80M13j76k51k59N02J58
7059B25n06q1P03l04o54M74K55j49J6j28K61J2k97pK53O4l87N80l5n3p05K01L60
7082I8j38J50M92l86j26k84J57K97o40n7K53L90l19k22M56Q1l89J01K38J29m67
7103a86j08P8J39l69L14J75p3j55J57K41j44j87K67K73l22n16M22K90k40j63K91
7124A84L75o85m14Q27K9k43l31R8M08n16J54K91N4l77j6r2K95o1k01M20j54j67
$$ y = [-202, 449, 182, 1, -280, 242, 86, -255, 21, 64, -229, -351, -167, -318, 133, -485, -377, 134, -16, -173, -307, 124, -141, -285, -14, 542, 204, -239, 116, 217, -24, -27, 1, 308, -46, -130, 559, 274, -82, 119, -119, 221, 50, -236, 45, -55, -396, -421, 75, -60, -338, -523, 29, -141, -346, -247, 183, 91, -303, -24, -195, -200, -181, -117, 289, 256, -234, 314, 577, 330, -108, -2, 475, 52, 99, 388, 291, -342, -162, 251, 75, -176, -435, 67, 225, -281, -362, 341, 37, -617, -143, 112, -37, -21, -149, 112, 124, -173, -180, 73, 137, -250, 330, 295, 242, -463, -262, 98, -40, 110, 602, 216, 90, -194, -37, 260, -380, -437, -184, 206, -113, -335, 121, 202, -187, -86, 152, 281, -186, -294, -216, -77, -446, -132, 43, -30, -185, -28, 213, 69, -118, 149, 422, 100, -416, 6, 296, 56, -107, 184, 559, -126, -540, 287, 316, 73, -258, -160, 248, -268, -114, 177, 231, -146, -162, -254, 41, -20, -221, 199, 45, -122]
7146a22o7L9L48m47J05M70k23k6l35N82j72m94N07J69q0n32K26K44Q4m37K67j15
7168ijl18K07M51l08k31J67L66j92m13L58O5k88p5K37K86m25K6J03L30o02j57
7190d23M29j29l31J54N60J28m70j50L81J21n27K98O2j84k38N55k03j2k35J70N74
7211E30q41K28l1P08m70k09K13K29n68J99Q9J77k05J47N1j41l46M19j18j5j74
7232a28j50K63K23m87Q7N15j80l6k99L37k55j57J15L66j05k80K85K46j99o09L03
7253a45L88k5l80J96L00o6j36j07J31k57L2L55l4k36l67M54J78o26R6K60k26j98
7275d13M7L79J5j33j8P4K0j02l7L98m6j29J13m5j50k21L85J1M52m93Q4J24n5j08
7299A52q3L68n72k52K93K07k96L3L45L8l14m17N87P3n9l99k5M49k93l52P21j77
$$ y = [-122, -189, -150, 198, -249, -144, 326, 103, 77, -258, 324, 152, -342, 165, 334, 254, -278, -52, 192, 276, -161, 106, -9, -10, -328, -121, 330, 22, -209, -42, 324, 132, -281, 77, 142, -146, -221, 16, 302, -123, -97, 6, 336, -266, -423, 6, -123, -454, -300, 260, 388, -82, -232, 149, 270, -257, 41, 103, -81, -319, 236, 33, 21, -214, -44, 530, -311, -83, -114, 594, 124, -85, 128, 357, -211, -12, 77, 254, 49, 196, 247, 106, -240, 179, 61, 46, -128, -278, -15, 208, -279, -192, 323, 143, 107, -192, 145, -110, -267, -152, 214, 109, -171, 114, 360, 161, -448, -145, 243, 218, -162, 34, 334, 268, 132, 25, 156, -101, -69, 286, 252, 16, -351, 103, 281, -345, -249, 11, -215, -413, -366, 13, 28, -105, -123, -49, -29, -131, -168, 230, 184, 55, 168, 123, -27, -248, 137, 148, 600, 107, 191, 315, 260, 152, 69, 437, -135, -387, -94, 113, -183, -150, 195, 233, -81, -498, 89, 162, 103, -296, -321, 128, -165, -517, 204, 27]
7321B7J55m59O24o4l82r0M36k08m9R5L80m07k61L02K52m01p3K65Q4j43O6k19L60
7344B90p38j39P81r6k84j93J006l62n18K55L07k32L5k79J77Q3j58J19J12L0j12
7365H4J39j17k4l09k38P13k67K9r6N23k85m11j9P14k83l76L59J6m01q0L31J18
7387A20k04m79N80K0k83j15M06L16o30O8L88l65j27LN01r0q8j90m5L30p1O9K92
7410D06k94k38j35O15k81l74M05OR1m59L57L28n26K3OK39k00j56L46R1j80k40
7432a70O5J89l55k3O26rn13MK57J25k19k5MM44k92k70L89m19R9j70N00l6k94K81
7456A88N4q2m77J67J37j58j10J37J20K83p20N32K26j71l65K95K12r4m18L57K57
7477C70m45j48K06J10k13L4K4k7K8r0J98M2j37k53M62M8k37o4j22M95l88J65n8
$$ y = [27, 182, -277, 347, 283, -99, -189, 247, 39, -10, 85, 465, 58, -203, 99, 351, -50, -123, 142, 226, 83, 149, -70, 290, -448, -587, 194, 98, -186, -379, 627, 265, -253, 2, 309, 77, 112, -167, 10, 93, -65, 54, 166, 196, 84, 223, 106, 82, -227, -465, 248, -19, 10, -86, 437, 152, -259, -278, 436, 153, -223, 136, 152, -249, -329, 2, 120, -84, -563, 17, 37, -246, -361, 45, 361, -269, -201, 187, -178, -305, -302, 199, 109, 21, -169, -214, 116, 45, 114, 406, 112, -126, -261, 354, 73, -301, 104, 110, 201, -258, 99, 427, -99, -76, -70, 169, -31, -187, 159, 250, 70, -170, -105, 84, -271, -294, 332, 323, -190, -186, 71, 196, -23, -48, -44, 400, 108, -162, 227, -192, -93, -263, 237, 201, -93, 188, 242, 160, -317, -150, -13, -171, -281, -144, -24, 259, -461, 71, 297, 126, -239, 56, 268, 174, -244, 113, 370, -75, -223, -17, 93, -120, -86, -62, -89, -61, -151, 47, 89, -48, -301, 161, 209, -28, -92, -214, 281, -107, 58, 0]
7500@M53p06N6P48m62j18N1M19l66l94M50j10J20j67r6jj04m6k46O52l85P0p0
7523b52J40L7k21J56L9P5K9r5q3O5L45p3j37K26m01M74k71k37M4L07jk21k4J70
7547I1L22m76K06P2l71j50M93Mm11j17K41R1k75J76J23l43j07K60L16j72k01R9
7569a29J85k89K94l18K65J26l7l25M76J8j27j39M71j58m42Q0J80L26m60j45M81
7590C33j88n75O78n3k88l5J6J44k61J63p9M63n44J31M47m72l16J43K4M48m23Q5
7612a59K33K9j70m5N38l88k82O8K84j2p9r5K1j30Q2j01M94k32j26L75J62m48k76
7635b57P9L6r4n9K49j85qj08N1L11j21m0L69K3m81l2M81m51J11P3L37q5p5K45
7659C69j98O8k50J73j3j2m48L12N51l23j95l97P63l61Kk86J72k6k68J39J63O5
$$ y = [0, 453, -253, -197, 551, 89, -29, 22, 441, 75, -319, 131, 21, 141, -26, -122, -123, -227, -273, -519, 133, -252, -182, -252, -112, -75, -296, -140, -101, -26, 3, -92, -175, -110, 235, 162, 25, 251, -150, 324, 53, -184, -140, 167, 166, -55, -79, 91, 413, -63, 143, 215, -156, -306, 187, 191, -220, -337, -96, -5, -280, -104, 19, -324, -431, -171, 145, -27, -228, -129, 56, -233, 61, -257, 8, 134, 97, -228, 248, 266, 139, 0, 471, 313, -129, -49, 131, 457, -3, -148, 333, 145, -430, 248, 195, -93, -128, -112, 32, -229, -66, -145, 318, -226, -95, 352, -120, -436, -293, -269, 179, -244, -159, 74, 103, -67, -112, 426, 38, -244, -176, 108, 96, 17, -78, -57, -187, -105, -206, 288, 56, -70, 305, 467, 19, -257, -178, -142, -236, -295, -46, -231, -239, -347, -296, 15, -106, -146, 223, 246, -235, -267, 214, -237, -126, -53, 284, 199, 124, 369, 171, 239, -11, 162, 149, 137, -311, 1, 552, 229, 34, -363, 400, 39, 41, -245, -73, -99, -367, -228, -65, 0]
7681@j48J19k15J67J21k46L23j99o6O03k08m49m5J96J30l81K9L65Q1l95L67k68
7703a19J96l00MK70M2J54l66M23k69r6K7K30j72k04J01K65j28o26M54K07l07L5
7725a79M51l08j45O0J97N06n15j9J51Qk06k28K77Q9k13K33m23M07m32K34J47j12
7747b0j98J77P2O3k00r6M53o5l76K58J16j34k84J42J96R5P4p9j0j56o9q5L49k79
7771e6J4K33jk41k68N81j95o2j72P0m4J71j35N12l77P5j22J89J5Ok19p8M61n57
7795b00L54O2jk05L36j27j6j68J32p1j18k07L88j89L5k48J19j37P8m54O67k20
7817a90OJ91K74k95P1J2l10M84n47M35j18j14J05o7K60j79j38K88l49N9J61j25
7839h6J92P9l24K07j30J8l85L32J07q4k03L01J43m28O4K12k1j27J5o4L70j84m51
$$ y = [0, -148, -29, -244, -77, 44, -202, 121, -78, -144, 459, 251, -198, -243, -47, 83, -298, -269, 96, 177, -218, 149, -119, 77, -223, -219, 51, 93, 247, -119, 304, 35, -61, -34, 196, 24, -180, -79, 186, 58, -568, -114, 93, -214, -179, 272, -36, -181, -121, 76, 582, 67, 48, 199, 207, 1, -227, 50, 139, -74, 159, -264, 143, -289, -55, 92, -20, -218, -41, 31, 94, -106, -202, 251, 186, -190, 68, 184, 50, -234, -92, 104, 199, 273, 194, 184, 28, -41, -126, 223, -56, -42, 191, 190, -51, -319, 262, 67, 5, -167, -97, -141, 30, -105, 407, 30, 105, -17, 172, 187, 193, -26, -104, 357, -200, 154, 216, 215, 10, 346, 219, 203, 35, 167, 96, -22, -229, 159, -30, 5, -243, -124, -261, -183, -637, 30, -190, -184, 7, 281, -14, 57, 69, -241, 243, -304, 131, 13, -101, 4, -63, 197, 18, -120, 168, -181, -122, 39, -86, 106, 185, -139, 68, -62, -44, -429, -97, 10, -74, -277, 24, 167, -261, -197, 15, -6, -133, -118, -182, 188, 4, -447]
7862d47N12N9j56m3N92m35J03q9j4J24j28k71L54n2l33J57J04K2oj57m0j53J74
7885a23J04k94J05l4K65O1k8k83j64N97m51k3L22L3l1l47K84k12K02j27K36K04
7907B96J47l68J22j5j6k24J07j9j20M1M0n2n3J4L96k77j08J1j03q3j73K14J76
7930d7j56J83N4R5k66qK93L32l20m69K87K55l50K04k69N67k80J3o8J94J73o25
7952b08M05M8k34K87k97J1k6l44L75l74L81k22K58k6k83J54j12K65k21K7R8k7
7974f5m14J20O01r2k75J86j2k13K50r2K24j54pL80k96Q7k58O3J61n70M47m37L61
7997eJ54k77L58j67m48L41M06l15J77J8j28j11K8l86L80k13R3j9L38j16j56J10
8019F2k13O9M7K35P1k54k69M4M09m28K76k4k8j28j6J46J16Ok54KJ72N8R9J5m88
$$ y = [-447, 65, 124, -32, -75, 517, 82, 185, 96, 82, 206, 78, -193, 161, 109, -224, -67, 37, 59, 53, -104, -144, -297, -123, -19, -313, -208, -242, 23, 84, 56, -227, -391, 206, -245, -268, 54, 87, 56, -291, -7, -219, -17, -144, 92, 296, 443, 75, 197, 182, 166, -58, 49, 30, -90, -49, -9, -61, -114, -100, 296, 19, -89, -78, -181, -264, -437, -223, -47, -203, -20, 34, 129, -137, -145, 148, 480, 160, -309, -22, 233, -117, 87, -182, 385, 105, 118, 50, 244, 417, -208, 197, 245, 11, 298, 1, 12, -14, -358, 17, -357, 24, -198, 60, 34, -249, -95, -207, 58, -163, -136, -38, -65, -479, -359, 242, 150, -125, 61, 49, -164, 86, -6, 218, 64, 57, 437, 141, 228, -30, 33, 194, -376, 71, -366, -5, 149, -128, 230, 63, -385, -44, 362, 47, 224, 242, 114, 3, 31, -355, 25, -188, -95, -114, 224, 108, -48, 62, -151, -82, -35, 200, 271, 17, -252, -208, 201, -227, 49, 25, -3, -131, -147, -1, 115, 121, -133, -131, 41, 99, 198, 213, -275]
8044b75j36K78J23K08m16J04K50j07l7m23M36J52k37J21J04r7Mj8j16n61P01l85
8066c27N40n12j30O84k86R4m7L98l40l4l0n1K07o5j07K4K54k34O7P0p6P3k12J86
8090A46J15m69J29l46L84J3K73l74j5j79J80O2o4J22J93j93Ml05N80J9o55L54
8112b6K16m07J93J1j06J75j24p3K42J66l58K23j69K06J43n95L47l15J82oj42j19
8134c36K84k90J33Q4k35J16K86r1M9k58M6J02k4L50n3k16m2J91J10j89k59L76
8156A34q4k02K44j90J85K82l44J78J05l16l48L73J30m62K2L48j77j20J50m1J25
8177hJ29n9J09k41J51j36l4K4N7j3Oj34J17J54
$$ y = [-275, -411, -133, -10, 198, -218, -114, 136, 29, -8, -431, 5, 157, -80, 41, 145, 48, 52, 34, -82, -643, 58, -327, 213, -299, -429, 255, -31, 63, 16, 414, 74, 40, 10, -41, 166, 101, -6, 18, 272, 38, 105, 175, 99, 172, -40, 146, 261, -208, -79, -425, -41, -28, 245, -129, -144, -323, -143, -81, -145, -23, 170, -23, -19, -324, 256, 275, -380, -26, 190, -217, -24, -13, -119, 56, -68, -141, 101, 267, -91, 132, -37, 169, 312, -283, 64, -251, -69, -75, -217, -336, -52, -342, -209, -125, -360, -244, 42, -49, 0, -258, -212, -110, -134, 216, 163, -53, -95, 96, 206, 17, -242, 134, 50, -152, 92, -98, 87, 369, 25, 203, 308, -8, -356, 17, 147, -315, -293, 55, -122, -242, -92, -133, -8, 121, 62, 171, -70, 81, -55, -89, -65, -8, -21, -15, -149, -32, 122]
8191A22
$$ Imaginary data points
##PAGE= N=2
##DATA TABLE= (X++(I..I)), XYDATA
0@%%%Pj5Q%Qk0K0k4L9m7N0n8P2q9J05j22J46j73J99k28K62l02L47l93M45n04N68
30C01o38P15q02Q96r96J108j233J369j517J680j861K060k279K524k798L105l454
47a820L854m317M859n502O279p247Q486j0129J2419j5834K1450l2196N9569k43914
61b04043m68931Q52258L21141q19623j93937Q38468J08888p14349k946O10610
71C27536j16995n15114J42691L83673j81233k51146K03866J75197j88274j00710
81a20509J54879N7715j24993k7570J13160N5879q1932p7259N7713P3675j06687
92b5929j31181J15214J52277j25879j08708K12435J21043k47771r7089K48090
102A12502n565l19493M1983L22347r2737k82251J92716K90344k21846k48393K37835
$$ y = [0, 0, 0, 0, 7, -8, 0, 0, 8, -12, 8, -16, 23, -24, 26, -32, 40, -49, 56, -66, 80, -93, 106, -122, 140, -162, 185, -208, 237, -267, 301, -337, 378, -424, 472, -524, 584, -649, 720, -797, 883, -978, 1082, -1197, 1327, -1471, 1634, -1820, 2034, -2283, 2576, -2926, 3353, -3894, 4592, -5537, 6882, -8952, 12498, -19698, 39871, -204043, -672974, 179284, 500425, -319198, -513135, 325333, 434221, -280128, -283074, 327536, 210541, -304573, -161882, 221791, 40558, -210588, -6722, 168475, -19799, -120509, 34370, 92085, -32908, -60478, 52682, 108561, 26629, -50630, 7083, 80758, -25929, -157110, -41896, 110381, -15498, -124206, 88229, 209272, -38499, -135588, 112502, 106937, -212556, -170573, 151774, 59037, -223214, -30498, 259846, 38000, -210393, 27442]
113B7442J78981k61339j34511K41393Q6736j92760l4368J36183q392p9967K3459
124a7143J4741j7653P0562L8167j00898j9384J20570k9608j75217J1446J46545
135D2128l0091j09713P4423J23888l6031p1265K3368J7582m3437l2425o642O054
147d2161L0091J5185j3985K1358L3773l4664k9537M5995l647p2426M0125R2033
159H2140p8060r5321J17858P0345j80208n6249K17657K8835k19313N3278K57664
170A98626r5897k55705J28667J93374k19860j85686K45872J43469k41576m6608
180a35324K87456J5998k69084K5050K15973j01804k06819J15705J60853j20378
190a2374r5786J41874O6859j30851l8242J09035J1274r1551N647Q7669L350q0927
$$ y = [27442, 206423, -54916, -189427, 51966, 138702, -54058, -88426, 47757, 39365, -40602, -17143, -2402, -20055, 50507, 88674, -12224, -31608, 88962, 59354, -115863, -104417, 42128, 12037, -97676, -23253, 100635, 64604, -6661, 16707, 34289, -9148, -41573, -48215, -42161, -12070, 3115, -10870, 10488, 44261, 9597, -19940, 26055, 22408, -50018, -9893, 82140, 4080, -91241, 26617, 96962, -83246, -139495, 78162, 106997, -112316, -59038, 198626, 102729, -152976, -24309, 169065, -50795, -236481, 9391, 152860, -88716, -135324, 152132, 168130, -100954, -75904, 140069, 38265, -168554, -52849, 108004, -12374, -108160, 33714, 100573, -30278, -68520, 40515, 51789, -39762, -34115, 53554, 56904, -24023]
202b4023k2375O4117J2510r7889l2698J30369O3526j30234k8589J91001K0073
213A45788k41843k4472K32850m8102k73562R2477K97549j11133k50109J89161
223H604K37254k35126k12207K42980J35132k76516q1561K84733L2928k61220K7165
234i7834K33566p8790k03311J09761J67074j17447j09591J35955P5067j39436
244b4986o6392R8332K1320r5683j0271R5892M3903m5034k3265N2028L0495p4591
256A748p7360M8771O2542p1411n6313J12773Q0014j06647n0142J24307J7277j50390
268f4831n838J39561k9288j28304O5525J12467r3035r1738J01186N0339j10371
279e4327o761J24369o428r2639M3305O4452q1917o4204O2190J2693o4100K9106
$$ y = [-24023, -46398, 17719, 30229, -67660, -100358, 30011, 93537, -36697, -65286, 125715, 145788, -96055, -120527, 112323, 64221, -209341, -116864, 180685, 69552, -180557, 8604, 245858, 10732, -201475, 41505, 176637, -99879, -181440, 103293, 136221, -124999, -97834, 135732, 56942, -146369, -36608, 130466, 13019, -96572, 39383, 114450, -24986, -91378, 6954, 28274, -67409, -77680, 18212, 62115, 17081, -6184, 45844, 76339, 1748, -75612, -26841, 35701, -35710, -92023, 20750, 100764, -5883, -56025, 68282, 85559, -64831, -70669, 68892, 39604, -88700, -23175, 89292, -3743, -95481, 5705, 56044, -54327, -61088, 63281, 56853, -35786, 7519, 71971, -9946, -74150, -11960, 733, -63367, -34261]
291c4261P9348j7475k4541N4383K40p6394K718M3079n5866m5531Q1714M2704p7271
304b7153l407R8814j4690j05364K0820Q7138l9620p6899M9141O7714m7533o0765
316e1804K9739L7616l1149l7443K7327N8671O978m3874L350N9018j7860j01089
328f0520l385R3093k5191j00682O9011J39847o4987j16207J04052R9849j52099
339a7219j07316J53072O5503j75007k4570J97027R04j89048L9486J73700q3831
350C2701j63072J13007J44541j30617j10828J49377P8521j72072p1653J56703
360B6608M3779j47802j2585J65995L2212j33915k0351J16600n94j37599k8194
371i5846J15681K6626j01531l29J30721J7197j22897o007J13041l0823j35837
$$ y = [-34261, 45087, 27612, 3071, 57454, 57694, -18700, -15982, 27097, -28769, -74300, 7414, 50118, -27153, -30560, 68254, 53564, -51800, -30980, 56158, 16538, -60361, -11220, 56494, 8961, -51804, -22065, 15551, -15598, -53041, -25714, 32957, 39935, -3939, -589, 58429, 40569, -60520, -63905, 29188, 3997, -96685, -27674, 112173, 47186, -69021, 35031, 134880, -17219, -124535, 28537, 94040, -80967, -105537, 91490, 92394, -96654, -57168, 116532, 32701, -130371, -17364, 127177, -3440, -114268, 35109, 113630, -58442, -130095, 26608, 70387, -77415, -90000, 75995, 108207, -25708, -46059, 70541, 69947, -67652, -95846, 19835, 46461, -55070, -55399, 75322, 92519, -30378, -36385, 76656, 45833, -90004]
382i0004L8876J30019o0505j17065R3619J11441j18978j02836J31168Q0693j41922
393d5494m9726J59131L9414j51735k1567J27552j8094j32592K0865J12164j8866
404B1052o5974N4302P0897m2894n3671K4936J4873m8854k6868L5903K9171j4178
416a305p161L1011K2993k8746l6830J5723K5977k8620l0920L5913L5128l5164
428b001k8074L2045R336m1009J760M2218n661j8675L8052J8469n3944j7487M3312
441A8341k0462o6762K8972P2211k2806l7360N9644L9756o1299k9863M1587j8244
453C715n6614L0389M6734m3345j3925P9050N481r1256J0859Q9493m1670r5654
465g6743O1673R4904p2310p8723Q3417N4505j04176m6061J02220K8198q9194J1076
$$ y = [-90004, -51128, 78891, 18386, -98679, -5060, 106381, -12597, -115433, 15735, 96428, -45494, -95220, 63911, 103325, -48410, -69977, 57575, 39481, -93111, -72246, 39918, 21052, -44922, 9380, 80277, 37383, -16288, 8648, 23521, -25333, -52201, -16298, 12873, -1305, -8466, 22545, 45538, 16792, -20038, -4315, 21662, -6958, -37878, -1965, 33163, -2001, -30075, 1970, 11306, -29703, -27943, 14275, 8614, -10061, 27991, 46460, -7484, -24971, 18341, -2121, -68883, -39911, 32300, 9494, -27866, 31778, 71534, 10235, -19628, 21959, 3715, -52899, -22510, 24224, -19121, -33046, 46004, 51485, -39771, -28912, 60581, 18911, -76743, -15070, 79834, 7524, -71199, 12218, 66723, -37453, -83514, 18706, 46904, -42290, -31214]
477c1214J04673j4677r5306K1119O7666n6802q2135N2502P5181m3148m7305P1236
489B1790O1238o4163o1794N0656L8325p0436m7838P0862N0962o3813l3744P8181
501C0226K9180q8766k7021R1605J4789r6070O081J11526j6047j19607K1638J08786
513F6320n1635j20030O6931J27856o3112j01165R3016J01429j09034j06384R4091
524a717P0228j18624n9907J32106O0835j13414k4349J26006O756j35942l791J19167
536E7354k3459j19038M4849J23778n1391j11595O4945J00172q3563r4652R4310
547A710R0188r1627o6889J03111N2759j16184n5158R8271K7000j00402q303J12561
559D7037J7030q7515N697Q0409k6470r2245J0896O5428k4589n3864M1149O3292
$$ y = [-31214, 73459, 58782, -36524, -15405, 52261, -4541, -86676, -34174, 41007, -2141, -49446, 21790, 83028, 18865, -42929, 7727, 46052, -24384, -72222, -1360, 49602, -14211, -47955, 30226, 59406, -29360, -56381, 35224, 50013, -46057, -39976, 71550, 55503, -64104, -42466, 66320, 14685, -105345, -38414, 89442, 26330, -74835, 18181, 119610, 10576, -95808, -1717, 68511, -50113, -110020, 22086, 82921, -30493, -54842, 71164, 77920, -58022, -61813, 57354, 33895, -85143, -40294, 83484, 32093, -79502, -14557, 85615, 2052, -92600, 1710, 91898, 271, -66618, 36493, 89252, -26932, -82090, 16181, 43181, -57221, -65524, 47037, 64067, -23448, -17751, 62658, 36188, -56057, -45161, 20267, -4322, -58186, -17037, 46255]
571D6255k4985m3695K8105L0627l8009l3965K8655K6932k2040j3019K7460R951
583B2272k6598j1925J6156J661j1995R549K2010N20q314K165l379k0388j3816
596b2082K471N36M66J5055J6130K247K002M186j3656k1514k85N045j5151n245
610b9795L1115J8468k2053o560L1454J373m3876n612M5130K801m3272Q723N3564
623D1460j2842o1160Q663N3730k2844n6914L7191P0668l0575n8824M4237N0973
635F3763o9611o7759O0552M9541p4056l2777J00635M1678r3277k1702R7962m452
647E0497j17220N669J08779k2325r9896N0024J05936n6363r4465O6837P6974q3107
659h660o6182R4692N8951r1457l8884R4063J9469j06571k0564R4184O678q7161
$$ y = [46255, 21270, -22425, 5680, 36307, -1702, -35667, -7012, 19920, -2120, -15139, 12321, 22272, -4326, -16251, -95, 1566, -10429, -880, 21130, 21650, 13336, 15501, 12122, -8266, -22082, -19611, -19075, -18609, -3554, 12576, 14823, 16825, 21011, 7355, -14159, -14444, -9399, -24550, -29795, 1320, 19788, -2265, -8825, 22629, 24002, -19874, -25486, 19644, 22445, -20827, -12104, 41460, 28618, -32542, -23879, 29851, 7007, -49907, -12716, 57952, 27377, -31447, 12790, 63763, -5848, -73607, -13055, 36486, -37570, -70347, 30288, 71966, -21311, -43013, 54949, 50497, -66723, -61054, 47725, 25400, -74496, -24472, 81464, 25101, -69364, -2527, 74447, -8660, -74842, 19850, 78801, -12656, -51540, 42523, 61992, -44579, -65143, 29041, 35719, -51442]
671e1442J4077J00016o955q9165J0587P5093l4338r1209K4594Q4391k6127o9247
683e9725N0735Q2822m9708p8714N3170O1618p5419o2303Q5172N7076q6278l5697
695e7251J01219K0737j10700j2242J07850n895j02605L0970J06691l7606r6258
706e5090M3158P1453o7522p0053O5986N6297n5789k5089P0828K1410o3793j7250
718b5454M2796r768n0646Q818M5974k637k5792J7762L1747j5485l4078N428K4592
731A3257j1796k6031J6033L4424j0065l2694J1690K5930k2880l0111K5528K9265
743B2550j9021j1777L1478P218l6571r154J9274j4940k3465K2543K5213j3455
755a07Q47K9442p620l2124P161J2259l3017j0775M1118O064l6286J9663M7480
$$ y = [-51442, -37365, 62651, 55696, -33469, -22882, 52211, 17873, -73336, -48742, 35649, 9522, -59725, -8990, 73832, 24124, -54590, -1420, 60198, -15221, -77524, 7648, 64724, -21554, -57251, 43968, 64705, -45995, -58237, 49613, 43718, -58887, -27917, 78774, 41168, -55090, -11932, 59521, -8001, -78054, -12068, 44229, -11560, -36649, 34179, 55589, -8204, -25454, 17342, 7574, -43072, -34254, 11720, 9083, -16709, 1053, 32800, 17315, -16763, -11335, 13257, 1461, -24570, -8537, 25887, 15822, -16872, -5182, 20748, -2132, -32243, -6715, 22550, 3529, -8248, 23230, 30448, -6123, -15277, 3997, -10943, -34408, -11865, 13348, -107, 740, 30182, 22562, -9562, -2401, 9858, -23159, -33934, 7184, 13248, -23038, -3375, 44105]
768D4105l1958n1037L8368L8472n4194l1324O6932K9207o5063j5792O2022k293
780B7445o8386M427N9212q524m1223K7590M4503k5692l7976J8557J6586l3507
792a6988k3718L0583K9322j9416j5033L4826K5715m0439l8481L4187K9682n1337
804b1097l4038O6547M2194o7777l2171Q0257J9909r6562j5296R9187J406r6425
816e3866K3499J02571l9229r9959M7985P9715p3029p1312Q7607O5813q1735l6386
828d8326R5044K1496j01161j9302Q1940m926p9934J7927Q1627j1119o0430K3691
840c473N2443l3672n5807K4822M2881k9880l5991L9731M1969l9893m0463M1300
852C967L1760n5960l3025O5821L5312o5320k0042P6217Q252q8313p777P9182j1538
$$ y = [44105, 12147, -38890, -522, 37950, -16244, -47568, 19364, 48571, -16492, -32284, 29738, 27445, -40941, -36514, 22698, 14174, -27049, 541, 45044, 19352, -18624, -67, 16519, -16988, -40706, -10123, 19199, -217, -15250, 19576, 45291, 4852, -33629, 558, 30240, -21097, -55135, 11412, 53606, -14171, -46342, 33915, 53824, -42738, -58034, 41153, 42559, -53866, -30367, 72204, 32975, -66984, -18999, 60716, -12313, -83625, 3982, 69795, -11940, -48326, 46718, 68214, -32947, -52249, 29691, 24765, -55169, -37242, 44385, 33266, -27164, -3473, 48970, 15298, -40509, -15687, 27194, -2686, -38677, 1054, 43023, 3130, -37333, 3967, 35727, -20233, -53258, 12563, 47875, -17445, -37487, 38730, 46982, -41331, -49108, 30074, 18536]
865A8536p5461L3368Q2087l1253o1116M5923M3647o4005m1812N5640J9233n4531
877b9744L205O1994m818m7683J5222L2429l0091l1784K4514J9388j9306m496K0813
890I643J956j5302l779r0l333K429K933K40J2343J1133j0910j0724R541m045k4244
905b2209K560K4344k972j0674K3535J7998k3643j2366J8009r759k8834J1337K3539
918A0865j5098p489L0924K944l3674N114K4050k6147k5345L7024J9332l9522M8
931a6974M9216j6405n6116K3564M4848m2561l5635O3668L5318o1050j3243O7818
943D2448o110p9589Q747O7352k4116n7208M3650O1334l9244m6271M2365L0114
955D3472n3633l4452M4951K6839l9627j6345M4821K0937m3434k5852L6242K0364
$$ y = [18536, -56925, -23557, 58530, 27277, -33839, 12084, 55731, -8274, -50086, 5554, 24787, -29744, -26539, 35455, 30637, -17046, -1824, 30605, 514, -31270, -6756, 12632, -6674, -11170, 9643, 11599, -3703, -7482, -7572, -10905, -8476, -5543, -5303, 7040, 18173, 7263, -3461, 6080, 2035, -22209, -19649, 4695, 1723, -8951, 14584, 32582, 8939, -3427, 14582, 4823, -24011, -12674, 10865, -4233, -11722, 19202, 22146, -11528, -6414, 17636, -8511, -33856, 3168, 22500, -17022, -16974, 32242, 15837, -40279, -16715, 28133, -14428, -50063, 13605, 48923, -12127, -25370, 42448, 36338, -43251, -34504, 32848, 8732, -48476, -4826, 56508, 17264, -29007, 13358, 43472, -10161, -44613, 338, 27177, -12450, -28795, 16026, 36963, -6471, -32323, 3919, 24283]
967B4283m4266k1927N3260K9577n2342k2510N8208J2697p4106j2270P4013K183
979B6800o9528K1774Q1111k6817p4150L7173N7076o2060n5598O6908M4008o6371
991a9674j8851Q0356J0310p9711k908O6312j8030o6710K3808O1919k2225m6420
1003c1824K8598L9311l2207m0306K3213L1433j9637k4068K6269L1076j9257l1472
1015a8871J4315K3544k5990l0211K9267L4235k4704j9495L9709J7876m7204j7174
1027b4703L8645k573m5994J3555M9192j5342l4221L0766K7238m3069k4023L8906
1039H377O060m1195Q922M5139j3271l4210K3482K0847l6292j7977L4858O624k8884
1052a7520J2469L3769j4795k5877J6290P881k9599o646K7002J290j6151J7246
$$ y = [24283, -19983, -41910, 11350, 40927, -11415, -33925, 24283, 36980, -37126, -49396, 24617, 26800, -42728, -20954, 60157, 33340, -40810, -3637, 53439, -8621, -64219, 2689, 46697, -19674, -38525, 41831, 52141, -27570, -30478, 35834, 17804, -48906, -25098, 36821, 14596, -31824, -3226, 36085, 3878, -36428, -13215, 18218, -1419, -25487, 782, 31858, 12601, -18871, -4556, 18988, -7002, -37213, -7946, 26289, 1585, -17910, 21799, 39675, -7529, -24703, 13942, 11369, -34625, -21070, 28122, 12780, -21441, 9325, 36563, -6506, -30529, 8377, 14437, -26758, -17836, 27303, 14032, -20178, 3304, 24151, -12141, -30118, 4740, 11364, -17520, -5051, 28718, 13923, -11954, 4336, 12217, -17382, -24028, 2974, 4264, -11887, 5359]
1064E359K1099j7774j6567J4122J198k5650k650K4022M325j4273N554J7833k150
1077A4448j9553p595J1048P124j3454q034K2654J9631k2793k0963K4218J4255
1089B0986l8960j6108M3593J4766m0784L275N0249j2678n4070J7183M0821l8449
1101a0176l9854N1900L8163n1663j8807O4226P774p3336m460O4880j2153o2910
$$ y = [5359, 26458, 8684, -7883, 6239, 7437, -18213, -20863, 3159, 7484, -6789, -1235, 16598, 14448, -5105, -12700, -1652, 5472, -7982, -16016, 6638, 26269, 3476, -17487, 6731, 20986, -17974, -34082, 9511, 24277, -16507, -13232, 37017, 24339, -29731, -12548, 28273, -10176, -50030, 1870, 40033, -11630, -30437, 33789, 41563, -31773, -36233, 28647, 16494, -46416]
$$ [...]
8191B
##END NTUPLES=NMR FID
##END=
