##TITLE=1H_DHA-BF3(30y)-f1
 CDCl3
 8 sc, 
 28.5.2024
##JCAMPDX= 6.0         $$ Bruker NMR JCAMP-DX V2.0
##DATA TYPE= NMR FID
##DATA CLASS= NTUPLES
##ORIGIN= UXNMR, Bruker Analytische Messtechnik GmbH
##OWNER= root
$$ XWIN-NMR		Version 3.5
$$ Tue May 28 16:21:06 2024 Russian Standard Time (UT+4h)  she@DPX200
##.OBSERVE FREQUENCY= 200.1309
##.OBSERVE NUCLEUS= ^1H
##.DELAY= (6, 6)
##.ACQUISITION MODE= SIMULTANEOUS
##.ACQUISITION SCHEME= undefined
##.AVERAGES= 8
##.DIGITISER RES= 18
##SPECTROMETER/DATA SYSTEM= spect
##.PULSE SEQUENCE= zg30
##.SOLVENT NAME= CDCl3
##.SHIFT REFERENCE= (INTERNAL, CDCl3, 0, 15.7039)
##AUDIT TRAIL= $$ (NUMBER, WHEN, WHO, WHERE, WHAT)
$$ ##TITLE= Audit trail, XWIN-NMR		Version 3.5
$$ ##JCAMPDX= 5.01
$$ ##ORIGIN= Bruker BioSpin GmbH
$$ ##OWNER= she
$$ F:/spectra/data/she/nmr/H-F/1/audita.txt
$$ ##AUDIT TRAIL=  $$ (NUMBER, WHEN, WHO, WHERE, WHAT)
(   1,<2024-05-28 16:19:35.62 +0400>,<she>,<DPX200>,
      <created by zg, POWCHK disabled, PULCHK disabled
       configuration hash MD5:
       00 E9 B6 7A A2 85 ED C7 34 08 36 98 17 FE 4E 26
       data hash MD5: 16K
       46 B6 4C A6 77 FB C9 ED B6 8C F9 5D CC A4 B0 4F>)
$$ ##END=
$$ 
$$ hash MD5
$$ 25 B8 82 5C F1 55 5D 47 59 0A DD 3A 01 7A 6F 5E
##$RELAX= 
##$RELAX= 
##$RELAX= 
##$RELAX= 
##$RELAX= 
##$RELAX= 
$$ Bruker specific parameters
$$ --------------------------
##$DU= <F:/spectra>
##$EXPNO= 1
##$NAME= <H-F>
##$PROCNO= 1
##$TYPE= <nmr>
##$USER= <she>
##$AMP= (0..31)
100 100 100 100 100 100 100 100 100 100 100 100 100 100 100 100 100 100 
100 100 100 100 100 100 100 100 100 100 100 100 100 100 
##$AQSEQ= 0
##$AQ_mod= 1
##$AUNM= <au_zg>
##$AUTOPOS= <>
##$BF1= 200.13
##$BF2= 200.13
##$BF3= 200.13
##$BF4= 200.13
##$BF5= 200.13
##$BF6= 200.13
##$BF7= 200.13
##$BF8= 200.13
##$BYTORDA= 1
##$CFDGTYP= 0
##$CFRGTYP= 5
##$CHEMSTR= <none>
##$CNST= (0..31)
1 1 145 1 1 1 1 1 1 1 1 1 1 1 1 1 1 1 1 1 1 1 1 1 1 1 1 1 1 1 1 1 
##$CPDPRG= <>
##$CPDPRG1= <>
##$CPDPRG2= <>
##$CPDPRG3= <>
##$CPDPRG4= <mlev>
##$CPDPRG5= <mlev>
##$CPDPRG6= <mlev>
##$CPDPRG7= <mlev>
##$CPDPRG8= <mlev>
##$CPDPRGB= <>
##$CPDPRGT= <>
##$D= (0..31)
0 1.2 0 0 0 0 0 0 0 0.06 0 0.03 0 0 0 0 0.0002 0 0 0 0 0 0 0 0 0 0 0 0 
0 0 0 
##$DATE= 1716898775
##$DBL= (0..7)
120 120 120 120 120 120 120 120 
##$DBP= (0..7)
150 150 150 150 150 150 150 150 
##$DBP07= 0
##$DBPNAM0= <>
##$DBPNAM1= <>
##$DBPNAM2= <>
##$DBPNAM3= <>
##$DBPNAM4= <>
##$DBPNAM5= <>
##$DBPNAM6= <>
##$DBPNAM7= <>
##$DBPOAL= (0..7)
0.5 0.5 0.5 0.5 0.5 0.5 0.5 0.5 
##$DBPOFFS= (0..7)
0 0 0 0 0 0 0 0 
##$DE= 6
##$DECBNUC= <off>
##$DECIM= 32
##$DECNUC= <off>
##$DECSTAT= 4
##$DIGMOD= 1
##$DIGTYP= 9
##$DL= (0..7)
0 120 120 120 120 120 120 120 
##$DP= (0..7)
150 150 150 150 150 150 150 150 
##$DP07= 0
##$DPNAME0= <>
##$DPNAME1= <>
##$DPNAME2= <>
##$DPNAME3= <>
##$DPNAME4= <>
##$DPNAME5= <>
##$DPNAME6= <>
##$DPNAME7= <>
##$DPOAL= (0..7)
0.5 0.5 0.5 0.5 0.5 0.5 0.5 0.5 
##$DPOFFS= (0..7)
0 0 0 0 0 0 0 0 
##$DQDMODE= 0
##$DR= 18
##$DS= 0
##$DSLIST= <SSSSSSSSSSSSSSS>
$$ [...]
##$SUBNAM2= <"">
##$SUBNAM3= <"">
##$SUBNAM4= <"">
##$SUBNAM5= <"">
##$SUBNAM6= <"">
##$SUBNAM7= <"">
##$SUBNAM8= <"">
##$SUBNAM9= <"">
##$SW= 18.0517689322627
##$SWIBOX= (0..15)
0 0 2 0 0 0 0 0 0 0 0 0 0 0 0 0 
##$SW_h= 3612.71676300578
##$TD= 16384
##$TD0= 1
##$TE= 0
##$TE2= 300
##$TE3= 300
##$TEG= 300
##$TL= (0..7)
0 120 120 120 120 120 120 120 
##$TP= (0..7)
150 150 150 150 150 150 150 150 
##$TP07= 0
##$TPNAME0= <>
##$TPNAME1= <>
##$TPNAME2= <>
##$TPNAME3= <>
##$TPNAME4= <>
##$TPNAME5= <>
##$TPNAME6= <>
##$TPNAME7= <>
##$TPOAL= (0..7)
0.5 0.5 0.5 0.5 0.5 0.5 0.5 0.5 
##$TPOFFS= (0..7)
0 0 0 0 0 0 0 0 
##$TUNHIN= 0
##$TUNHOUT= 0
##$TUNXOUT= 0
##$USERA1= <user>
##$USERA2= <user>
##$USERA3= <user>
##$USERA4= <user>
##$USERA5= <user>
##$V9= 5
##$VALIST= <valist>
##$VCLIST= <CCCCCCCCCCCCCCC>
##$VD= 0
##$VDLIST= <DDDDDDDDDDDDDDD>
##$VPLIST= <PPPPPPPPPPPPPPP>
##$VTLIST= <TTTTTTTTTTTTTTT>
##$WBST= 1024
##$WBSW= 4
##$XGAIN= (0..3)
0 0 0 0 
##$XL= 0
##$YL= 0
##$YMAX_a= 307068
##$YMIN_a= -375608
##$ZGOPTNS= <>
##$ZL1= 120
##$ZL2= 120
##$ZL3= 120
##$ZL4= 120
##$ABSF1= 10
##$ABSF2= 0
##$ABSG= 5
##$ABSL= 3
##$ALPHA= 0
##$AQORDER= 0
##$ASSFAC= 0
##$ASSFACI= 0
##$ASSFACX= 0
##$ASSWID= 0
##$AUNMP= <proc_1d>
##$AZFE= 0.1
##$AZFW= 0.1
##$BCFW= 1
##$BC_mod= 2
##$BYTORDP= 1
##$COROFFS= 0
##$CY= 11.3945322036743
##$DATMOD= 1
##$DC= 2
##$DFILT= <>
##$DTYPP= 0
##$F1P= 15.6554695791079
##$F2P= 12.8336369535428
##$FCOR= 0.5
##$FTSIZE= 0
##$FT_mod= 4
##$GAMMA= 1
##$GB= 0.15
##$INTBC= 1
##$INTSCL= 1
##$ISEN= 128
##$LB= 0.24
##$LEV0= 0
##$LPBIN= 0
##$MAXI= 10000
##$MC2= 0
##$MEAN= 0
##$ME_mod= 0
##$MI= 1.114404
##$NCOEF= 0
##$NC_proc= 0
##$NLEV= 6
##$NOISF1= 3.799351
##$NOISF2= 2.8
##$NSP= 1
##$NTH_PI= 0
##$NZP= 0
##$OFFSET= 15.70392
##$PC= 1
##$PHC0= -25315.28
##$PHC1= 14.78748
##$PH_mod= 1
##$PKNL= yes
##$PPARMOD= 0
##$PSCAL= 0
##$PSIGN= 0
##$REVERSE= no
##$SF= 200.130013532006
##$SI= 16384
##$SIGF1= 3
##$SIGF2= 2
##$SINO= 400
##$SIOLD= 16384
##$SREGLST= <1H.CDCl3>
##$SSB= 0
##$STSI= 0
##$STSR= 0
##$SW_p= 3612.71676300578
##$SYMM= 0
##$S_DEV= 0
##$TDeff= 0
##$TDoff= 0
##$TI= <>
##$TILT= no
##$TM1= 0
##$TM2= 0
##$TOPLEV= 0
##$USERP1= <user>
##$USERP2= <user>
##$USERP3= <user>
##$USERP4= <user>
##$USERP5= <user>
##$WDW= 1
##$XDIM= 8192
##$YMAX_p= 0
##$YMIN_p= 0
$$ End of Bruker specific parameters
$$ ---------------------------------
##NTUPLES= NMR FID
##VAR_NAME=  TIME,          FID/REAL,        FID/IMAG
##SYMBOL=    X,             R,               I
##VAR_TYPE=  INDEPENDENT,   DEPENDENT,       DEPENDENT
##VAR_FORM=  AFFN,          ASDF,            ASDF
##VAR_DIM=   8192,          8192,            8192
##UNITS=     SECONDS,       ARBITRARY UNITS, ARBITRARY UNITS
##FACTOR=    0.0002768,     1,               1
##FIRST=     0,             0,               0
##LAST=      2.2672688,     0,               0
##MIN=       0,             -375608,         0
##MAX=       2.2672688,     307068,          0
$$ Real data points
##PAGE= N=1
##DATA TABLE= (X++(R..R)), XYDATA
0@%%%%%%%%%%%%%%Qj6J6j6J6k2L0l2L7m5N2o0P0q1R1j03J17j32J49j70J91k14
$$ 0 0 0 0 0 0 0 0 0 0 0 0 0 0 0 8 -8 8 -8 8 -14 16 -16 21 -24 28 -32 38 -43 48 -55 62 -70 79 -91 100 -114
36a14K40k65K94l28L65m04M47m94N45o00O61p29Q01q81R70j070J181j305J447
$$ -114 126 -139 155 -173 192 -212 235 -259 286 -314 347 -382 419 -462 508 -562 619 -686 761
55G61j606J789k005K262k571K949l428M051m894O101p944J1051j7156L3037j39944
$$ 761 -845 944 -1061 1201 -1370 1579 -1849 2202 -2692 3409 -4535 6516 -10640 22397 -117547
70a17547k58061N88368l0930n32899L00126L14728l96587k9461L40510j38100
$$ -117547 -375608 212760 181830 -351069 -50943 263785 -132802 -162263 178247 40147
80D0147j68734J95685R885j49305O1869O9882q0146k7187P0988K6743p0160j529
$$ 40147 -128587 67098 76983 -72322 -10453 59429 -20717 -47904 23084 49827 -20333 -21862
92b1862J07876l6387j11461J08313M8952j79154L9333J45716j70324o2024K15161
$$ -21862 86014 49627 -61834 46479 95431 -83723 -44390 101326 -68998 -131022 84139
103H4139p6662j69835J94460P0090k06799O1575J54578j21615n7601J03843j7625
$$ 84139 7477 -162358 32102 102192 -104607 -43032 111546 -10069 -67670 36173 18548
114A8548m4851K3289j3077K4971L5636o2076J1960Q9432m9870n7928P0296M302
$$ 18548 -26303 -3014 -16091 8880 44516 -17560 -5600 83832 33962 -23966 46330 50632
126E0632o9212Q201J8066k3892q487l081O072J2817j4023J0752K0548k7505J4424
$$ 50632 -18580 -10379 7687 -16205 -24692 -27773 -21701 -8884 -22907 -12155 8393 -19112 -4688
139d688L2392o1509J447P8283p2270m9717J28525k4090j16663J26776O1797j58716
$$ -4688 27704 -33805 -32358 45925 -26345 -76062 52463 28373 -88290 38486 100283 -58433
151e8433N7303J34312j45899m6026J60384p4959j24596J28600K0097j34759N8871
$$ -58433 -1130 133182 -12717 -58743 101641 26682 -97914 30686 50783 -83976 -25105
162b5105Q1162r1035n772Q3419l6622m3946M8252Q121n0398k14M3779j3860n2532
$$ -25105 56057 -34978 -40750 42669 6047 -37899 10353 18474 -31924 -32138 11641 -2219 -54751
175e4751M4781O3207p7135k0563J28877l6487j21915J18998O1794j78004K8722
$$ -54751 -9970 53237 -23898 -44461 84416 47929 -73986 45012 106806 -71198 -42476
186d2476J53011j37062q0891J76621l1646j44603J24197O4958j44153L4797J06437
$$ -42476 110535 -26527 -107418 69203 37557 -107046 17151 82109 -62044 -27247 79190
197G9190r6950l9236R5641l0852o8534N6394K6302n0143O245M7347l719l0448
$$ 79190 -17760 -56996 38645 7793 -60741 -4347 21955 -28188 -21943 25404 21685 -8763
209h763J6778L9470l2120l9566N0300O301p6400K5551N7663o9814j5621Q4354
$$ -8763 8015 47485 15365 -24201 26099 32400 -44000 -18449 39214 -30600 -46221 38133
221C8133l3312n1976P3872K163o8557M3390K5359o4653J6705L8019m7197M107
$$ 38133 4821 -47155 26717 28880 -39677 3713 29072 -35581 -18876 19143 -28054 -23947
233b3947M3461k6602j442L7825j7702l430K6765k5169q527K9228l3202k1731M3186
$$ -23947 19514 -7088 -8530 29295 11593 8163 34928 9759 1232 30460 -2742 -24473 18713
246A8713j7767m0723M2351J7152m4637J2594L6074k3823j9544J9207O786k1935
$$ 18713 946 -39777 2574 19726 -24911 -12317 23757 -66 -19610 -403 6383 -15552
258a5552j3355K2129R879l4477J0100N1839l0870k8071P2255j153p5140N3905
$$ -15552 -28907 -6778 3101 -31376 -21276 30563 -307 -28378 43877 42724 -32416 21489
270B1489M5771r4777K404Q6859o8319n1495R6813j2077q5504P0870M2152r2382
$$ 21489 67260 -27517 -25113 61746 -6573 -58068 38745 26668 -58836 12034 54186 -38196
282c8196J5664P7295o4674m7424P5289j332p5892K8098N9468m2335l3363O1900
$$ -38196 -22532 54763 -9911 -57335 17954 16622 -59270 -31172 28296 -14039 -47402 14498
294A4498K3959n8304R141O2945l5505m7910N8697R068p4629L1014N3756o9256
$$ 14498 38457 -19847 -10706 52239 16734 -31176 27521 36589 -38040 -7026 46730 -22526
306b2526j1577Q4798l5039o0942P3286J9420q3428K0271N5206n5914k8216N1593
$$ -22526 -34103 50695 15656 -45286 28000 47420 -36008 -15737 39469 -16445 -44661 6932
318F932p419l7404K6926K1791k1920L138K4752m173j6108J1184J2151k1226j1549
$$ 6932 -487 -37891 -10965 10826 -11094 -7956 16796 12623 -3485 7699 19850 -1376 -12925
331a2925K2780l239k6231J7423J8972k2747M064K3074j7666m275K0530k2627j3852
$$ -12925 9855 6616 -19615 -2192 16780 -5967 -1903 21171 3505 -770 19760 -2867 -16719
344a6719K9420j7838l0052L4132Q144l6360K2027K6482k7327Q805K3694k6037
$$ -16719 12701 -5137 -35189 -1057 7087 -29273 -7246 19236 -8091 714 24408 -1629
356a629K785K5330l4839r553M1794k4676l3698M7733Q324m7776K5791L5213m1015
$$ -1629 1156 26486 -8353 -17906 23888 -788 -34486 13247 21571 -26205 -414 34799 -6216
369f216o873L9085k2733k9830L0243J522l6204J3931K7430k2927j0720L5589N638
$$ -6216 -13089 25996 3263 -26567 3676 5198 -31006 -17075 10355 -12572 -23292 12297 17935
382A7935k9282J3107K8825k5119k0821L3416q72m1348K0369L0969m0812p155N4091
$$ 17935 -11347 1760 30585 5466 -15355 18061 17189 -24159 -3790 27179 -13633 -20788 33303
395C3303j8762m4138M8421K0545o6290P967N6447m7745m0949O1136L788o3310
$$ 33303 14541 -29597 18824 39369 -26921 -18954 37493 -10252 -51201 9935 13723 -49587
407d9587L1901N0315n0024j2428O4471j6701m9806M6251K3360o2951P428N5615
$$ -49587 -17686 32629 -17395 -29823 34648 17947 -31859 14392 37752 -25199 -17771 37844
419C7844m0391l4631O0922O127n7467K9369M5244m8845j8015N2546j5643m9110
$$ 37844 -2547 -37178 23744 29871 -27596 1773 47017 -1828 -19843 32703 17060 -32050
431c2050K9977K0940m5676j978M0379j6677k4438L2168J3074k8571O456K4867
$$ -32050 -2073 18867 -26809 -28787 11592 -5085 -29523 2645 15719 -12852 -6396 18471
443A8471j7129j5207J9325K73k0138Q967J3811j2646M15J7398l791p106J1678
$$ 18471 1342 -13865 5460 5733 -14405 -5438 8373 -4273 -3858 13540 9749 2643 14321
456A4321Q25j2514J620K461j0238m099L343l405j063L699o80L987O000m790n01
$$ 14321 15146 2632 4252 6713 -3525 -7624 -4281 -7686 -8749 -5050 -5730 -1743 4257 -533 -1034
471a034R600o240j2007J0123L874j8890K569K1038j1871j2420K7433O439k8265
$$ -1034 8566 2326 -9681 442 4316 -14574 -12005 9033 -2838 -15258 12175 18614 -9651
484i651J3291K5945l0659j4671L5552j2165l8615K9959J9186m3893P379M5484
$$ -9651 3640 29585 -1074 -15745 19807 7642 -30973 -1014 18172 -25721 -18342 27142
496B7142k9274k3674M8355r55m6369K6542K7735m6341o134M3870j9787l2137L7753
$$ 27142 -2132 -25806 22549 21594 -24775 1767 29502 -16839 -22973 20897 1110 -31027 6726
509F726J6242l9444R157L9141k3830k6833L4775O656m4499P947L5256l1854k3605
$$ 6726 22968 -16476 -7319 31822 7992 -18841 15934 22590 -21909 -13962 21294 -10560 -34165
522c4165M5094J669m4604K9743L4706m6386m745N1928k6811l9645M6314Q908n3767
$$ -34165 10929 12598 -32006 -2263 32443 -13943 -18688 33240 6429 -33216 13098 22006 -31761
535c1761K0346M0509l8648j1650M6887q806l2058K7671J3273l1854O20K1099j7831
$$ -31761 -11415 29094 -9554 -21204 25683 16877 -15181 12490 25763 -6091 -5471 15628 -2203
548b203j6331J8302L334k0098N877K0706j1203j2484K1694N072k5126O853J9417
$$ -2203 -18534 -232 3102 -16996 -11119 9587 -1616 -14100 7594 12666 -12460 -5607 13810
561A3810k1824j0065K4699n998j8234K0841Q367j8153J1818J3797j5992R92J2073
$$ 13810 -8014 -18079 6620 622 -17612 3229 11596 -6557 5261 19058 3066 4058 16131
574A6131j3630m259Q413j1552k353J1592j1562l293K0445q386j4035K1470K615
$$ 16131 2501 -1758 6655 -4897 -7250 4342 -7220 -10513 9932 1546 -12489 8981 11596
587A1596k4034R045J3456k0041n113J5889m963r311J1543O202o213K616J0303
$$ 11596 -12438 -3393 10063 -9978 -15091 798 -4165 -13476 -1933 4269 -1944 672 10975
600A0975k393r424P404P295j8473n377K2492j0309k4852K6997J5034l7052Q973
$$ 10975 8582 -842 6562 13857 -4616 -9993 12499 2190 -22662 4335 19369 -17683 -8710
613h710L8705k9931k1150M3154p914m3450K9123K0120m5202N828M0739k7154j9642
$$ -8710 29995 64 -21086 22068 14154 -29296 -173 19947 -25255 -19427 21312 -5842 -25484
626b5484M1289J427l3671J8440K2303k8151r124K5910p693k4621J6092J5337k3553
$$ -25484 15805 17232 -16439 2001 24304 -3847 -12971 12939 5246 -19375 -3283 12054 -11499
639a1499j699K9510r775k3691K8013J1777l8116O853L3633l1303k0696M0520m554
$$ -11499 -13198 16312 6537 -17154 10859 22636 -15480 -8627 25006 -6297 -26993 13527 8973
652H973l6744K7963K1867l4356N622L1181k0987j4461K5544n996k2545J3101P530
$$ 8973 -27771 192 22059 -12297 -6675 24506 3519 -10942 14602 8606 -13939 -838 6692
665F692j6989N62J3020l198o293N916P688m808p192Q301K911j4772J259J2422
$$ 6692 -10297 -9735 3285 87 -6206 -290 7398 2590 -4602 3699 6610 -8162 -6903 5519
679E519j2357o620J8819l188j2951J7893N363j6491J0086Q871j7087K355R704
$$ 5519 -6838 -13458 5361 2173 -10778 7115 12478 -4013 6073 14944 -2143 212 9916
692I916j5591k05J2040j2963o24J6620j1194n203J9956q881j4681J9711k553k3461
$$ 9916 -5675 -5880 6160 -6803 -7427 9193 -2001 -7204 12752 3871 -10810 8901 6348 -17113
706a7113J5146R955k5481N019K2756j5799q601K4508n31j7458J1619J1828j5569
$$ -17113 -1967 7988 -17493 -12474 10282 -5517 -14118 10390 9859 -7599 4020 15848 279
719B79p060J4244k53j7632M022J8398j2144j3884K4487N646k8175J1655K4000
$$ 279 -6781 7463 7210 -10422 -6400 11998 -146 -14030 10457 16103 -12072 -417 23583
732B3583k8547j1437L2484j3105k9615K8405R678l3789J3433K7676k6230o259
$$ 23583 -4964 -16401 16083 2978 -26637 1768 11446 -22343 -8910 18766 -7464 -13723
744a3723L2239j0418k3428K1462Q063k5930K080K0260j1513j3983J7627R111j7330
$$ -13723 18516 8098 -15330 6132 14195 -11735 -9655 10605 -908 -14891 2736 11847 -5483
757e483J138K0045p488j7930J6347P681k5089K094K0623j8046j0942K5253l701
$$ -5483 -4345 15700 8212 -9718 6629 14310 -10779 -8685 11938 -6108 -17050 8203 4502
770D502j9429J9660Q947k2227Q487J4867j9579l629J7377j1722j0305J5459j693
$$ 4502 -14927 4733 13680 -8547 -60 14807 -4772 -8401 8976 -2746 -13051 2408 715
783G15j0311J0656M627p724M791L641n667O07R35m908J544r32l661M053J683l775
$$ 715 -9596 1060 5687 -2037 2754 6395 728 1335 2270 -2638 -1094 -2026 -5687 -1634 49 -3726
799c726M660M337l522P92K385k067L15l390k747N512m369p905J1145L916j4704
$$ -3726 934 5271 1749 2541 4926 2859 3174 -216 -2963 2549 -1820 -9725 1420 5336 -9368
814i368Q112J4441j5908l216J8719j1166j3775J7744k004k0403J4861R848k1359
$$ -9368 -1256 13185 -2723 -5939 12780 1614 -12161 5583 3579 -16824 -1963 7885 -13474
827a3474N592K1850j4647r510K2036q92j9787R922J1135j6433n529J6042l078
$$ -13474 -7882 13968 -679 -10189 11847 10955 -8832 1090 12225 -4208 -9737 6305 3227
840C227j4197J0741J2292j4797l702K0846n632k0534J5645J1106k6714o63K3878
$$ 3227 -10970 -229 12063 -2734 -6436 14410 8778 -11756 3889 14995 -11719 -12382 11496
853A1496j5104j6009K4276K509k1934J4800J4030k1111K486J9283j6599j0393
$$ 11496 -3608 -19617 4659 7168 -14766 34 14064 -7047 -4561 14722 -1877 -12270
865a2270K0444m147j9388J3561J2095j6596m44J7472l585j1320Q542O762j1300
$$ -12270 8174 4027 -15361 -1800 10295 -6301 -6745 10727 7142 -4178 4364 11126 -174
878a74m165R502l671j0744P197O878j2201J461J4700p862q556J5036O47j6487
$$ -174 -4339 5163 1492 -9252 -2055 4823 -7378 -5917 8783 921 -7635 7401 8048 -8439
892h439P354Q906j5151j323J2937p913n713J2954j280p619R929L304j0412L882
$$ -8439 -1085 7821 -7330 -8653 4284 -3629 -9342 3612 2332 -5287 4642 7946 -2466 1416
906A416O559r138l149P273l943m700N515J174l512M124K586l279J389L565n356
$$ 1416 7975 -1163 -4312 2961 -982 -5682 -167 1007 -2505 1619 4205 926 2315 5880 524
921E24k905N584k988p683M581N526q032r6J1210m282o950J1223J594j2826N686
$$ 524 -2381 3203 215 -7468 -2887 2639 -5393 -5489 5721 1439 -5511 5712 7306 -5520 166
936A66P941j4112k502J4723q154j0766J6569M049j7360Q348J5863j5070p089J8060
$$ 166 8107 -6005 -8507 6216 -1938 -12704 3865 7914 -9446 -1098 14765 -305 -7394 10666
950A0666l796j7363R305R946j5194k554J5592l917j0690J1723O461j3815J701
$$ 10666 6870 -10493 -1188 8758 -6436 -8990 6602 2685 -8005 3718 10179 -3636 -1935
963a935J2568j0211r707J3016L55j6020O864J2002j3197k392J6450m488j1981
$$ -1935 10633 422 -9285 3731 4086 -11934 -5070 6932 -6265 -8657 7793 3305 -8676
976h676J3758M079j6404M949J1320j4212m952J6196m039j3153J3186Q066j3816
$$ -8676 5082 9161 -7243 -2294 9026 -5186 -10138 6058 2019 -11134 2052 10118 -3698
989c698J342J3765p499q303R641m14j0646M325M164q077J274P681n232k773R660
$$ -3698 -2356 11409 3910 -4393 5248 4834 -5812 -1487 2677 -5400 -4126 3555 -1677 -4450 5210
1004E210q42q944N612N531j0299k700R406m127q323Q023M427q177L038Q973n446
$$ 5210 4368 -4576 1036 6567 -3732 -6432 2974 -1153 -9476 -1453 2974 -5203 -2165 6808 1362
1019A362l614Q701j650q718N137L826r380k7Q020m552l930Q627m0o093O422K642
$$ 1362 -2252 6449 4799 -3919 1218 5044 -4336 -4363 3657 -895 -4825 3802 3762 -2331 4091 6733
1035F733r171J897O783r693l632J0319m274r279J0528M736j1060L419J1193q251
$$ 6733 -2438 -541 6242 -3451 -7083 3236 -1038 -10317 211 4947 -6113 -2694 8499 248
1049B48n129J0594k069j0498O261M039r590J502Q986n239m235J0401Q19r060M834
$$ 248 -4881 5713 3644 -6854 -593 3446 -6144 -4642 4344 -895 -5130 5271 6090 -2970 1864
1064A864P233j0089l585J0506m169j0866Q543O701j2643J329J4129p409q475J3589
$$ 1864 9097 -992 -4577 5929 1760 -9106 -563 6138 -6505 -5176 8953 1544 -6931 6658
1078F658R11j4577N815Q584j3054k815J2667n690q418J1445L452j0718N103R082
$$ 6658 7569 -7008 -1193 7391 -5663 -8478 4189 -1501 -9919 1526 4978 -5740 -637 8445
1092H445q704l058R143l484q699O460L593r161J496R208n093m695R778K210j0817
$$ 8445 -259 -3317 5826 2342 -6357 103 3696 -5465 -3969 5239 146 -4549 5229 7439 -3378
1107c378L920Q308r842n249J0665k975j0315Q278M683r945L423Q922p911j438
$$ -3378 542 8850 -992 -6241 4424 1449 -8866 -588 4095 -5850 -2427 6495 -1416 -2854
1121b854R669n848p046R406q98j0962O240O503r598K1J0256l592m550P323J235
$$ -2854 6815 967 -6079 3327 2429 -8533 -2293 4210 -5388 -5367 4889 1297 -3253 4070 5305
1136E305o116J716L241m367k690L356m24l350K447L492k435j584N250o06m523
$$ 5305 -811 905 4146 -221 -2911 445 21 -3329 -882 2610 175 -1409 3841 3235 -1288
1151a288L182J329o835J586M280o966q86Q862m918m991J0846J68r662O415O523
$$ -1288 1894 3223 -3612 -2026 2254 -4712 -5598 3264 -1654 -6645 4201 4369 -5293 1122 7645
1166G645j0942n60R154o182n739P612L93o256M847M425m779M75N582k810m111
$$ 7645 -3297 -3857 5297 -885 -6624 988 1381 -4875 -28 4397 -382 93 5675 2865 -1246
1181a246L751J217o774m81O565m070n591Q191K921r548L916R864r479m903J2426
$$ -1246 2505 3722 -3052 -3533 3032 -1038 -6629 1562 4483 -5065 -1149 8715 -764 -5667 6759
1196F759m600j2059J0534M231j4258M622J2181j1468k707J5184n089r776J0978
$$ 6759 2159 -9900 634 4865 -9393 -4771 7410 -4058 -6765 8419 3330 -6446 4532
1209D532K604j2147L503P217q524k302Q588k903m445N464K726m575O82M338k531
$$ 4532 7136 -5011 -1508 5709 -2815 -5117 3471 568 -3877 1587 4313 -262 420 4758 2227
1224B227m368L077J794o549m58O355l541m562P813J028p283N400N073q512J31
$$ 2227 -2141 936 2730 -3819 -4277 2078 -1463 -6025 1788 2816 -4467 933 6006 -2506 -2375
1239b375P773p394m375R140k439p726Q002L699q580L822O878n937j638O241l266
$$ -2375 5398 -1996 -6371 2769 330 -7396 606 4305 -4275 -453 6425 488 -1150 5091 1825
1254A825m296M198m39m724K293K586l322j91M536J59m012J912L896m467l868N964
$$ 1825 -2471 1727 1288 -3436 -1143 1443 -1879 -2070 2466 2625 -1387 525 4421 -46 -3914 2050
1270B050j200p788N125M645q109J360R518o320m059J0881k272r807Q303L814j2268
$$ 2050 850 -6938 -1813 2832 -5277 -3917 5601 -719 -4778 6103 3831 -5976 2327 6141 -6127
1285f127K855Q627q688k363J0345l036n412P799J268o938L406L324o206j351M343
$$ -6127 -3272 5355 -3333 -5696 4649 1613 -3799 4000 5268 -1670 1736 5060 -1146 -2497 1846
1300A846k301l698K743K831k848j243M980R20n314K417L971o227k043O750l605
$$ 1846 -455 -4153 -1410 1421 -1427 -2670 2310 3230 -2084 333 4304 -1923 -3966 2784 -821
1315h21o363Q145J435r237O062P468r431P79R688o701n544R246k142q914P091
$$ -821 -7184 961 2396 -6841 -779 6689 -2742 -1963 7725 1024 -4520 4726 2584 -6330 761
1330G61K729q753L501O965o170j084P513k539n189M047J635n313j020L874j891
$$ 761 3490 -5263 -1762 5203 -967 -2051 5462 2923 -2266 1781 3416 -1897 -2917 957 -934
1345i34l628L303K858l781j38O048k336m480N652R64p981L069N380q263r01R412
$$ -934 -4562 -1259 1599 -2182 -2320 3728 1392 -3088 2564 3528 -4453 -1384 3996 -4267 -5168 4244
1361D244m659n036R634M17q467O015N225r515N21P475o445m394P127n56n733L966
$$ 4244 -415 -5451 4183 4600 -3867 2148 7373 -2142 -1621 5854 -591 -4985 2142 1586 -4147 -181
1377a81L451m343N22L897j871k908K452M06m347L15L100k441k843N700P92o021
$$ -181 3270 -1073 -551 3346 1475 -1433 1019 1425 -2922 -2607 493 -1948 -4791 909 1701 -4320
1393d320M734N024o705j222Q451m484o862P570J058r204M614O277p796N23Q599
$$ -4320 414 5438 -1267 -2489 5962 1478 -5384 2186 3244 -5960 -1346 4931 -2865 -2342 6257
1408F257n084l592P856k086o776M713J603o605J428M566n020p85N329p98l482
$$ 6257 1173 -2419 5437 3351 -3425 1288 2891 -3714 -2286 2280 -2740 -3525 1804 1006 -2476
1423b476L234K638l936j221L571p92m982K004L743m260j305N772l97m308M643
$$ -2476 758 3396 -540 -1761 1810 1018 -3964 -1960 1783 -2477 -3782 1990 1593 -2715 1928
1438A928K604n984K097M288o158j826O362l699m646O853O53o614M547M978o784
$$ 1928 4532 -1452 645 4933 -1225 -3051 3311 -388 -5034 1819 2472 -4142 405 5383 -1401
1453a401p9O588l833m941M987m2n792K256L810m082r60N695q51m137M178K976
$$ -1401 -1480 5108 1275 -3666 1321 1279 -4513 -2257 1553 -2529 -3489 2206 1355 -2782 1396 4372
1469D372o198k12O167m462n272O915J603q643M535P353p328j712R626l773p604
$$ 4372 -1826 -2038 4129 -333 -5605 1310 2913 -5730 -1195 6158 -1170 -2882 6744 2971 -4633
1484d633Q107J683j0004K890P031q099k071Q680k119n958N750K856o289J555M511
$$ -4633 3474 5157 -4847 -1957 5074 -3025 -5096 3584 1465 -4493 1257 4113 -2176 -621 3890
1499C890m696k540M279q98m377K255L490l591o67N241p6m233K780K805m078j395
$$ 3890 -806 -3346 933 35 -4342 -2087 1403 -2188 -2855 2386 2310 -1923 857 3662 -416 -1811
1515a811M162k127l383L331R48l140K390K469l219J380L064l724j428L762k175
$$ -1811 2351 224 -3159 172 1120 -2020 370 2839 -380 1000 4064 340 -1088 2674 499
1530D99l829K869J286m104J060L506k652m34L976j203k742L418J17m483J481K914
$$ 499 -3330 -461 825 -3279 -2219 1287 -1365 -1799 2177 974 -1768 1650 1767 -2716 -1235 1679
1546A679l668j488M538q49l094M084K506m816J354M571m430k934N549j140o652
$$ 1679 -1989 -3477 1061 212 -2882 1202 3708 -1108 246 4817 387 -2547 3002 1862 -4790
1561d790M298M362o673n24P267k446m959N810J928o573J030M316m621k421N020
$$ -4790 -492 3870 -2803 -3327 3940 1494 -3465 2345 4273 -2300 -1270 3046 -1575 -3996 1024
1576A024j461m264M848K083n399J975N662m055l082N652n58o381L078L896n555
$$ 1024 -437 -4701 147 2230 -3169 -1194 4468 413 -2669 2983 2425 -3956 -878 3018 -2537
1591b537r83O756j986m744N448L085o753R86N938m461m226N390Q9o120K697M399
$$ -2537 -3520 3236 1250 -3494 1954 5039 -1714 -728 5210 749 -3477 1913 2002 -4118 -1421 2978
1607B978n333oN474k097l798M599J265o016J814M066n389j532N177j364m341M743
$$ 2978 -2355 -2361 3113 1016 -2782 1817 3082 -2934 -1120 2946 -2443 -3975 1202 -162 -4503 240
1623B40K079m143J654L742l123j695L869j496l472K597J178l224Q79K323j135
$$ 240 2319 -1824 -170 3572 449 -1246 2623 1127 -2345 252 1430 -1794 -915 1408 273
1638B73p41K481j90j834J140L79k398Q7J226j547j276K283n06j620J818K178k994
$$ 273 -468 2013 1823 -11 1129 1508 -890 -803 423 -1124 -2400 -117 -623 -2243 -425 1753 -1241
1655a241N69K827j785k023K992p64l865K892K234m545J326N127l475k386O127
$$ -1241 -672 2155 370 -1653 1339 575 -3290 -398 1836 -2709 -1383 3744 269 -2117 4010
1670D010p14n530L787K486o343L57M782l804k931N556nn102L717L718n239r55
$$ 4010 3296 -2234 1553 4039 -2304 -1947 2835 -969 -3900 1656 1651 -3451 266 3984 -1255 -2210
1686b210N487k465m914L904K556n899J22N640k519l731N728K016o214K284N072
$$ -2210 3277 812 -4102 -198 2358 -3541 -3419 2221 -298 -4029 1699 3715 -2499 -215 4857
1701D857n130k902O387j672o123M802L148o530J502N936l936k848N804m80n269
$$ 4857 -273 -3175 3212 1540 -4583 219 3367 -3163 -1661 4275 339 -2509 3295 2815 -2454
1716b454K833K684m866j127M184r10l340K381K575l006l36M020j270l539K474
$$ -2454 379 3063 -1803 -2930 1254 344 -2996 -615 1960 -1046 -1382 2638 1368 -2171 303
1731C03J905m532r8L940k421k428M113N03l433K671J652k842J005K103l065K7
$$ 303 2208 -2324 -2422 1518 -903 -3331 782 1285 -2148 523 2175 -667 338 2441 -624 -597
1747e97K426l110q27L648j375k315L529M33k946K338J126k988P71J673l078n19
$$ -597 1829 -1281 -2108 1540 165 -2150 1379 1812 -1134 1204 2330 -658 113 1786 -1292 -1811
1763a811K595j850j904L052P84k479O25K864j496j509J956J90k799K65K851k506
$$ -1811 784 -1066 -2970 82 866 -1613 -988 1876 380 -1129 827 1017 -1782 -1517 1334 -1172
1779a172j686M598N9m414L487L837n652o26O373k920n426N064J458o281J679M635
$$ -1172 -2858 1740 1799 -2615 872 4709 -943 -1569 4804 1884 -3542 1522 2980 -3301 -1622 3013
1795C013m698o03N038k226l067M022J180n400J435L505l438l005M274J374m538
$$ 3013 -1685 -2288 2750 524 -2543 1479 2659 -2741 -1306 2199 -1239 -4244 30 1404 -3134
1810c134Q26N350k588k926M980O65n225J564M664n945j216O216k472m979N977
$$ -3134 -2308 3042 454 -2472 2508 3173 -2052 -488 4176 -1769 -2985 3231 759 -4220 1757
1825A757J918o518K775M824n140j786N128k528l837L719K57l653J911K484k801
$$ 1757 3675 -2843 -68 4756 -384 -2170 2958 430 -3407 312 569 -3084 -1173 1311 -1490
1840a490j69K960n16j708J309J246j405j911J816M69j622k21K336q65j267K382
$$ -1490 -1659 1301 785 -923 386 1632 227 -1684 132 601 -1021 -1242 1094 229 -1038 1344
1856A344J44j734J192R36k381K54J048k065L28J527k178N01K308j066r02K822
$$ 1344 1488 -246 946 1882 -499 -245 803 -1262 -934 593 -1585 -1084 1224 158 -744 2078
1872B078j164k071K917p68k932J862J013l087K59L541k445q91L123n93k115K109
$$ 2078 914 -1157 1760 992 -1940 -78 935 -2152 -1893 1648 -797 -1688 1435 842 -1273 836
1888H36J026k807k15K189j289k092J839J932k985j22M291j397l065L569J779n035
$$ 836 1862 -945 -1160 1029 -260 -2352 -513 1419 -1566 -1688 2603 1206 -1859 1710 3489 -1546
1904a546R34M283m026k843N536j086m794L778L099n466N76N339l756l020M680
$$ -1546 -612 3671 -355 -3198 2338 1252 -3542 236 3335 -2131 -1555 3784 28 -2992 1688
1919A688o59m455K096K866m063m99M387j034k399K333K465l087p97L789j013l576
$$ 1688 1029 -3426 -1330 1536 -2527 -3026 1361 327 -2072 261 2726 -361 -1158 2631 1618 -1958
1935a958K296K211l982J46M520k694k851M871L77m747K321K730m828n1L674l219
$$ -1958 338 2549 -1433 -1287 3233 539 -2312 2559 2936 -1811 510 3240 -1588 -1639 2035 -1184
1951a184k364L655l69k938L109J418k667R41J736j681n04J412l60j167P21M9k71
$$ -1184 -3548 107 -262 -3200 -91 1327 -1340 -399 1337 -344 -848 564 204 -963 -242 -193 -464
1968d64N78N39QJ66K84K00k73q09N22k23j070R1K26p25R83j35j124J395J279k257
$$ -464 114 653 661 827 1111 1311 1038 229 751 528 -542 -451 -225 -950 33 -102 -1226 169 1448 -809
1988h09K92K442k442j182K631j224k354K906P26k849J485K559k930O0L429j775
$$ -809 -517 1925 -517 -1699 932 -292 -2646 260 986 -1863 -378 2181 -749 -689 2740 965
2004I65k674K829O96l314J33K912j780k168K995Q31k705P67L053k282j807L153
$$ 965 -1709 1120 1816 -1498 -1365 1547 -233 -2401 594 1425 -1280 -513 2540 258 -1549 1604
2020A604j36m088K242K708m417K5M948k088l866M916J053n255J732L944m236j945
$$ 1604 1468 -2620 -378 2330 -2087 -2062 2886 798 -3068 1848 2901 -2354 -622 3322 -914 -2859
2036b859M638j511m017M200R15m173J639L932k851k061M166j15l742J400K883
$$ -2859 1779 268 -3749 451 1366 -2807 -1168 2764 -87 -2148 2018 1903 -1839 -439 2444
2051B444k891j430L050L03k977J730K213k274o79L064j183k826K209Q56l860J084
$$ 2444 -447 -1877 1173 1476 -1501 229 2442 168 -511 2553 1370 -1456 753 1609 -2251 -1167
2067a167K294k536j297L382n97j982J939R74k027N48J478j887j23J617n29j153
$$ -1167 1127 -1409 -2706 676 79 -1903 36 1010 -1017 -469 1009 -878 -1001 616 87 -1066
2083a066J525O02j213P65Q97j28m97M25j43l74o84k27K0J02o19k79N12Q75j154
$$ -1066 459 1061 -152 613 1510 1382 885 1310 1167 793 109 -118 -98 4 -615 -894 -382 493 -661
2102f61n73J798n92j496J432L92k097K60K320j843j255L209J56k573K222K063
$$ -661 -1234 564 -28 -1524 -92 300 -1797 -1537 783 -1060 -2315 894 1050 -1523 699 2762
2118B762l397O04K900k550k099L243Ml673J906K446l079j52L351j569k686K833
$$ 2762 -635 -31 2869 319 -1780 1463 1467 -2206 -300 2146 -933 -1085 2266 697 -1989 844
2134H44R82l695L70L377k555k255L745N62m061K009L314k694j776M017l73m006
$$ 844 1826 -1869 -1499 1878 -677 -2932 813 1375 -2686 -677 2637 -57 -1833 2184 1811 -2195
2150b195K426K097l859l16L894j986l141L820J040l506J687K899l328j334L431
$$ -2195 231 2328 -1531 -1847 2047 61 -3080 740 1780 -1726 -39 2860 -468 -1802 1629
2165A629o47l452K309J811l151J94L239j498j998L150M57l004R16J822k014j050
$$ 1629 982 -2470 -161 1650 -1501 -1307 1932 434 -1564 1586 2043 -961 -45 1777 -237 -1287
2181a287J994n18j911J078J252j299R0J256p18r82J356L00j552M04O43q27n57
$$ -1287 707 189 -1722 -644 608 -691 -601 655 -63 -1045 311 611 -941 -537 106 -721 -1278
2198a278J312J49o14Q66M63r7K54Q8n48N28j61q25J62M57j369j03J418m65j308
$$ -1278 34 183 -431 435 898 801 1055 1143 595 1123 962 137 299 756 -613 -716 702 237 -1071
2217a071J628k1j713J087J176j982q17J702o76j809K357R72k050N72K362j427
$$ -1071 557 536 -1177 -90 1086 -896 -1713 -11 -687 -2496 -139 833 -1217 -645 1717 290
2233B90r58K437M20l139J372K000l014o23L356j066l052K963J762m015L48L704
$$ 290 -668 1769 2189 -950 422 2422 -592 -1215 2141 1075 -1977 986 2748 -1267 -919 2785
2249B785k864k732L952K08m678J938L046l279j430M603r42l099K747J891k828
$$ 2785 -79 -2811 1141 1349 -3329 -1391 1655 -1624 -3054 1549 607 -2492 255 2146 -682
2264f82j93L040j763k220K955M68l046Q98K979k394j149L115j39l242J245K326
$$ -682 -875 2165 402 -1818 1137 1605 -1441 -543 2436 42 -1107 2008 1869 -1373 -128 2198
2280B198l020j279L099m73l235K472J829l073L12L119j587k027K739K05k431P98
$$ 2198 -822 -2101 998 525 -2710 -238 1591 -1482 -1170 1949 362 -1665 1074 1279 -1152 -354
2296c54J386j712p1Q52J38o08O22K70n07J95K85m41l52K35Pn55K2J08N73o30P2
$$ -354 1032 -680 -751 101 239 -369 253 523 16 211 496 55 -297 -62 -55 -610 -588 -480 93 -537 -465
2317d65J002j6m48O75o9rp61N34J98o58m23P95O11j856Q34J413j392q94K344j028
$$ -465 537 521 73 748 679 670 -91 443 641 -17 -440 355 966 -890 -56 1357 -35 -929 1415 387
2337C87k141J720P22k707L97K830k290j052L076l54k172J926J396k234N2K241
$$ 387 -1754 -34 688 -2019 -1622 1208 -1082 -2134 942 588 -1584 342 1738 -496 -444 1797
2353A797j144j974K182Q93k742O03K964j983j804K561J227l895R03K682k710k394
$$ 1797 653 -1321 861 1754 -988 -385 2579 596 -1208 1353 2580 -1315 -412 2270 -440 -2834
2369b834L425R7m173K185K850l475j32L742j852k178L121O03l013J229K200k273
$$ -2834 591 688 -3485 -1300 1550 -1925 -2057 1685 -167 -2345 776 1379 -1634 -405 1795 -478
2385d78q17K875m46j859J279J962k194m62J933l02k271Q43J057k208j14K038j232
$$ -478 -1295 1580 1134 -725 554 2516 322 -140 1793 1491 -780 63 1120 -1088 -1202 836 -396
2402c96j928K365O61k369J015J839j874n28J914p74j446J402M44r50O57R58q24
$$ -396 -2324 41 702 -1667 -652 1187 -687 -1215 699 -75 -1521 -119 325 -625 32 990 166
2419A66J38N94l24J15J68n76J51k6p78k2P09p76k40Q84P7o52N07K78p59q6N63
$$ 166 304 898 574 689 857 281 432 406 -372 -394 315 -461 -701 183 260 -392 115 393 -366 -452 111
2440A11p4p25J78Q25m80o56J527J73j335Q20J217j799o93K385j638j869K415M07
$$ 111 37 -688 -510 315 -165 -821 706 879 -456 364 1581 -218 -911 1474 -164 -2033 382 789
2458G89l113J239K723k722p10L620j014k683K316J110k753N49K318j389j420J728
$$ 789 -2324 -1085 1638 -1084 -1794 1826 812 -1871 445 1555 -1198 -649 1669 280 -1140 588
2474E88R23k009M69J979j270j348J917J63k540P24J776k391r01K895p10k862K369
$$ 588 1511 -498 -29 1950 680 -668 1249 1412 -1128 -404 1372 -1019 -1920 975 265 -2597 -228
2491b28J675l568R30L182k662j441K983k6l053J981J658k155K60J859n74j226
$$ -228 1447 -2121 -1191 1991 -671 -2112 871 845 -2208 -227 1431 -724 -464 1395 821 -405
2507d05J514N27j597N49P62r84p99O70j3r47L54J014j406j30R72J45j230N96O44
$$ -405 1109 1636 39 588 1350 366 -433 237 224 -723 -369 645 -761 -891 81 226 -1004 -408 236
2526B36j358K17Q20r14O4R69j19k24J111l07j89N45j19m66Q51l82j221R60M56
$$ 236 -1122 -905 -85 -999 -935 34 -85 -309 802 495 306 851 732 266 1117 735 -486 474 930
2545I30j506K27J769j575o04J180L53j576O44N35j155j28N87j80l90L32O22o69
$$ 930 -576 -349 1420 -155 -759 421 774 -802 -158 377 -778 -906 -319 -499 -889 -557 65 -604
2563f04P1J553n99j040J028J046j967J36J873j333j681K387N1k257J514J600k412
$$ -604 -533 1020 421 -619 409 1455 -512 -376 1497 164 -1517 870 921 -1336 178 1778 -634
2580f34m13L030j785j857J983O83k652M16K507j838p24K139L16j977R69J030j290
$$ -634 -1047 1983 198 -1659 324 1007 -1645 -1229 1278 -560 -1284 855 1171 -806 163 1193 -97
2597i7n33J696p23j506J722M06j871n7K326j388j606K498L82k402O77J777k076
$$ -97 -630 1066 343 -1163 559 965 -906 -963 1363 -25 -1631 867 1249 -1153 -476 1301 -775
2614g75p81K237r05j284J824O69j991J107J478j557j57J454q87o66R22J10j015
$$ -775 -1556 681 -224 -1508 316 985 -1006 101 1579 22 -135 1319 432 -234 688 798 -217
2631b17J51M84l69m37L67M86q05K62m7l48j69M88n17l47L53O09n40J07P95j07
$$ -217 -66 418 49 -388 -21 465 -340 -78 -125 -473 -642 -154 -671 -1018 -665 -56 -596 -489 306 199
2651A99j59L76K7k30O90p00j91P96Mj241O77P98q65l06J091p97n06O88l95j237
$$ 199 40 416 443 213 903 203 12 808 812 -429 248 1046 181 -125 966 169 -337 351 -44 -1281
2671a281Q76L58j176l16J215n47j92J131N87j624P82J113j018o31J544Qj512Q72
$$ -1281 -405 -47 -1223 -1539 -324 -871 -1063 68 655 -969 -187 926 -92 -723 821 829 -683 189
2689A89J115j722M3K017q17j598J767P39k264L36J580j893r65J686J18k136J638
$$ 189 1304 -418 -375 1642 825 -773 994 1733 -531 -195 1385 -508 -1473 213 331 -1805 -167
2706a67P65j707L24J714r29j254J777o8j480N98J280j305m97J744k31j374J042
$$ -167 598 -1109 -785 929 0 -1254 523 455 -1025 -427 853 -452 -949 795 564 -810 232
2723B32Q59j419J22J308o64j178R50P57k083L67J376j051l72J070M40j321J017
$$ 232 1091 -328 -206 1102 438 -740 210 967 -1116 -749 627 -424 -796 274 714 -607 410
2740D10O70j222p2J100n93p86Q11j64p89Q50N22p43n0P99l99q99N83K18j163K03
$$ 410 1080 -142 -214 886 293 -493 318 154 -635 215 737 -6 -56 743 344 -555 28 246 -917 -714
2760g14M92n55k11O43q5M7M44L10o56Q53J49r28K77Q02p66j54O04P5r84Q57J65
$$ -714 -222 -777 -988 -345 -430 -383 61 371 -285 568 717 -211 66 868 102 -52 552 627 -357 500 665
2781F65p25M03K37n84n00Q78n99j101P61P92r16k20R13m41n39J234K73j417R04
$$ 665 -60 343 580 -4 -504 374 -225 -1326 -565 227 -689 -909 4 -437 -976 258 531 -886 18
2800A8O99j139k30J528r26o05J454M22j672P48J600j222j189J598j19j764O57
$$ 18 717 -422 -652 876 -50 -655 799 1221 -451 297 1897 675 -514 1084 965 -799 -142
2817a42J079j557k06J060n06j163J394L38j587Q75J107r20r84J465j14j406R74
$$ -142 937 -620 -826 234 -272 -1435 -41 297 -1290 -415 692 -228 -1212 253 139 -1267 -293
2834b93Q27j052Q0J475p10q64J432M04j698L24J438j440n81R83J34j399Q71R71
$$ -293 534 -518 -438 1037 327 -537 895 1299 -399 -75 1363 -77 -658 325 459 -940 -69 902
2852I02j167j31P57k1j035Q28K02j008L19O47o95k12Q40l88o5K99O17q88J24N29
$$ 902 -265 -396 361 340 -695 133 335 -673 -354 293 -402 -614 226 -162 -227 72 689 -199 -75 454
2872D54m03k78N37j83o68L98J07m07N35kl14J95P20q17QL36l84l84Q72j72p40
$$ 454 51 -227 310 127 -541 -143 -36 -443 92 90 -224 -29 691 -126 -118 218 -166 -550 322 150 -590
2893e90Q52L29o98J1R27p10l67P38J43j051J51L31l64m78Q15l01m14L20R51j158
$$ -590 262 591 -107 -96 831 121 -246 492 635 -416 -265 66 -298 -776 39 -262 -676 -356 595 -563
2913e63j08J410m58j200J196L87j634O40J494j113o64J694j03j485Q48Q70j521
$$ -563 -671 739 281 -919 277 664 -970 -330 1164 51 -613 1081 978 -507 341 1211 -310
2930c10J11J490j199p91J225r1j223K03J247j036m70J087L2j361P71P97r22p87
$$ -310 -199 1291 92 -699 526 435 -788 -585 662 -374 -844 243 275 -1086 -315 482 -440 -1227
2948a227J496j41j118J131P19j282N57J216r02o42J201j25j530J029L45j120K82
$$ -1227 269 128 -990 141 860 -422 135 1351 449 -193 1008 883 -647 382 727 -393 -111
2965a11J071p48p09O36L1l93K61K64n06k92L5nm9R7K19m12M70J76K27k79j80M64
$$ -111 960 212 -497 139 170 -223 38 302 -204 -496 -461 -466 -515 -418 -199 -611 -141 35 262 -17 -197 267
2987B67J25j02j30m11K38M43k72j50M37j38o07R32l88n38Q34nr46K40N74r96r7
$$ 267 392 290 160 -251 -13 430 158 8 445 307 -300 632 244 -294 540 535 -411 -171 403 -593 -690
3008f90J044n38p35J309L1j132P97O92j022l64J119o08l30K19O90q19k01Q20L0
$$ -690 354 -184 -919 390 421 -711 86 778 -244 -608 511 -97 -427 -208 482 -337 -538 282 312
3027C12l92J63N94j046L7J134q04p76Q31N46j434R71R83j228m25J339k89j221
$$ 312 -80 83 677 -369 -332 802 -2 -778 53 599 -835 136 1119 -109 -534 805 516 -705
3045g05J199M07j598L5J562j409n58J252J62j113O34N31n53k73P53l49q53N69
$$ -705 494 901 -697 -662 900 -509 -1067 185 347 -766 -132 399 -154 -427 326 -23 -876 -307
3063c07N44q82j5P82r7n68Q33N73r55K10P40o38n17J040k86q36O59K42q69M73
$$ -307 237 -645 -660 122 25 -543 290 863 -92 118 858 220 -297 743 457 -379 280 522 -347 126
3083A26N65j044J48M53m81j41L44l71k05L29p0k32M72R4l87J85J55j82L21K2k97
$$ 126 691 -353 -205 248 -233 -374 -30 -401 -606 -277 -347 -579 -107 -13 -400 -215 -60 -242 79 101 -196
3104a96Q8P9K92l19L54J19r9j05J7N81l96l37Q24o21p22P73R7p96J62Q07r86m48
$$ -196 -108 -29 263 -56 298 417 318 213 230 811 415 78 902 281 -441 332 429 -367 -205 602 -384 -832
3126h32J243l00j213J470o2p97K39O50p04j15N99j84p96R86J89n96l8P98k36p48
$$ -832 411 111 -1102 368 306 -491 -252 398 -306 -421 178 -6 -802 184 373 -223 -261 537 301 -447
3146d47P14K57o98k60R69n14n01R22l8j045N02Q12j133J80R50m72q52R97l06p06
$$ -447 267 524 -174 -434 535 21 -480 442 404 -641 -139 673 -460 -280 670 198 -654 343 37 -669
3166f69M31K74o49m0J293p86l92P06J15n90L30K58k94l85M60K21o84M06K11k89
$$ -669 -238 36 -613 -653 640 -146 -538 168 283 -307 23 281 -13 -398 62 283 -401 5 216 -73
3186g3K65O7k5k52K58K46l57k36K00k65j47N59j08k33L67J44m93K15K77r38M67
$$ -73 192 259 234 -18 240 486 129 -107 93 -172 -319 240 132 -101 266 410 -83 132 409 -529 -62
3207f2K16m26k53O63k31j23L01J24m20J82L94l79m2K49j09m05N55J02l62K4N52
$$ -62 154 -272 -525 138 -93 -216 85 209 -211 -29 365 -14 -56 193 84 -321 234 336 -26 -2 550
3228E50m28k04M16K88o69J24O55q50l16Q55l82o29M34O21p77k22J030o87l37N15
$$ 550 122 -82 334 622 -47 77 732 -118 -434 421 39 -590 -156 465 -312 -534 496 -191 -528 -13
3248a3r7n08M79N51p68r4Q70m77j95N08J73n89J29J098r28l01M26%l03J82L19
$$ -13 -110 -618 -139 412 -356 -450 420 -57 -252 256 429 -160 -31 1067 139 -162 264 264 -39 143 462
3269D62m95m9M89m22k77K46L24l16j12J88m05k28O73k01l74L74M36p80N92K47
$$ 462 -33 -82 407 -15 -292 -46 278 -38 -150 38 -367 -595 78 -123 -497 -123 313 -467 125 372
3289C72m77J77l3j22k45K54kJ09l34N29J64l00K56Rl40M74k62j00j31j32j16n9
$$ 372 -105 72 39 -83 -328 -74 -76 33 -301 228 392 92 348 357 17 491 229 129 -2 -134 -250 -309
3311c09P29l40m36M81K09l53j79O09n16k24K03N69r14K45K63m00k8N40k37k24
$$ -309 420 80 -356 125 334 -19 -198 411 -105 -329 -126 443 -471 -226 37 -363 -391 149 -88 -312
3331c12N74L04p76K77M42n33O5K83K3m99J49M70m97j31P70p69m6O66l49k82K41
$$ -312 262 566 -210 67 509 -24 41 324 347 -152 -3 467 -30 -161 609 -160 -206 460 111 -171 70
3352G0K79n93k07O19l66M2m7L70k20k17L45m9l59M64j05m64L13K72n83M79M91
$$ 70 349 -244 -451 168 -198 -156 -203 167 -53 -270 75 26 -333 131 26 -438 -125 147 -436 43 534
3373E34n75j90O24j32n39M78R6q5p6L67m01k38N53k63l57K42K66n67l12O23j71
$$ 534 -41 -231 393 261 -278 200 296 211 135 502 101 -137 416 153 -204 38 304 -263 -575 48 -123
3394a23n01L74J44l78L51k7k3l20N63l08j41N01Q1l75QM59l41j17L97J61l61O0
$$ -123 -624 -250 -106 -484 -133 -160 -183 -503 60 -248 -389 112 193 -182 -174 285 -56 -173 224 385 24 84
3416H4K83m59J57K55k63l03L41O5n46K26N62p44l7N46k02l30J71M43m81N1L06
$$ 84 367 -92 65 320 57 -246 95 160 -386 -160 402 -342 -379 167 -35 -365 -194 249 -232 -181 125
3437A25o45J87M15qm56O29j50l54J8N65m87n7K11L34n97L94M44o06k02Q40l14
$$ 125 -520 -333 82 74 -382 247 97 -257 -239 326 -161 -218 -7 327 -270 124 568 -38 -240 600 286
3458B86m66M34j34j34j29L90n48K30N58n57l81M40n1m95N06J09k47k44N97j88
$$ 286 -180 254 120 -14 -143 247 -301 -71 487 -70 -451 -11 -62 -557 -51 58 -189 -433 164 -24
3478b4l07K87j09J6K08o2k01p1K29M42m36K8K56r3j0M58l78k04J10J95l08k56
$$ -24 -331 -44 -153 -137 71 9 -192 -263 -34 408 -28 0 256 163 153 611 233 29 139 334 26 -230
3500b30N73p69K11N40j17r23P22K01p29P2M74l69J39J59M4l76M15K7m8J49J35
$$ -230 343 -426 -215 325 208 -715 7 208 -521 -449 25 -344 -205 -46 -2 -378 37 64 16 165 300
3521C00k42m2J22m6k70M7M94k71k41N67k23n13O00J05m95j57P14j73r10Q81j17
$$ 300 58 16 138 92 -178 -131 363 92 -149 418 195 -318 282 387 -108 -265 449 276 -634 247 130
3542A30m32J69K96o75k6N67j41l48N61P1n92K19J77p9J10O4j36J89L31k91k8Q2
$$ 130 -302 -133 163 -512 -538 29 -112 -460 101 172 -420 -201 -24 -103 7 71 -65 124 455 164 136 218
3564B18K08l03K19j64j09k4K74n7j63j92J86J7k21K74J5n51K56K64l72M8K03l45
$$ 218 426 123 342 178 69 45 319 262 99 -93 93 110 -111 163 178 -373 -117 147 -225 -177 26 -319
3586c19J72L00l39j71N66k27l86L19L51o32M84j38j02j45K40K6n8J21M57l25n2
$$ -319 -147 153 -186 -357 209 -18 -404 -85 266 -366 118 -20 -122 -267 -27 -1 -59 62 519 194 142
3607A42M7K08o47J50M57n11j9J17R4k22K64P9o49K93O24l86p91R92l57l48R9L00
$$ 142 189 397 -250 -100 357 -154 -173 -56 38 -184 80 159 -490 -197 427 41 -750 242 -115 -463 -364 -64
3629f4m0j6L27k03o14P05J48k26J03J66l09L40K2m46q8K22K22l71K23J26K5j54
$$ -64 -104 -120 207 4 -610 95 243 17 120 286 -23 317 339 -107 -195 27 249 -122 101 227 252 98
3651I8M2J13o25R2K04N7j86K15qk41L11k23j38L25J26j82j29L06m75J35L36k6
$$ 98 140 253 -372 -280 -76 -19 -205 10 2 -239 72 -151 -289 36 162 -20 -149 157 -318 -183 153 127
3673A27m19L88J92m42J31K82K6k73K40j02k9M4J19l51Q9Q6O4k11k38M52j4k44
$$ 127 -292 96 288 -154 -23 259 285 12 252 150 121 165 284 -67 22 108 172 -39 -277 175 161 -83
3695h3Q2l05q6L50P9l59K85P3m40K99K01n01K01M90j6o38L35M37l61p9K41J28
$$ -83 -1 -306 -392 -42 37 -322 -37 36 -404 -105 96 -405 -204 286 270 -368 -33 404 43 -36 205 333
3717C33o94M89J0k12K25J57l23j22P03m17n17M73k34n7j91N52k76j14J76L57p00
$$ 333 -361 128 138 -74 151 308 -15 -137 566 149 -368 105 -129 -186 -377 175 -101 -215 -39 318 -382
3738c82K2L03M1l17N01j61m78N36k07m3p0P86n97M9M12j21k05k17L75j71m3J34
$$ -382 -360 -57 -16 -333 168 7 -471 65 -142 -185 -255 531 -66 -17 395 274 69 -148 227 56 13 147
3760A47j46q3N24j87m29J79NR8n7K41m48J09N3k35m8L2N9O9j65N71m22o9L46l7
$$ 147 1 -82 442 255 -174 5 10 108 51 292 -156 -47 6 -229 -277 -245 -186 -117 -282 289 -133 -202 144 107
3784A07l22j35N10k73p8O59k48j10R0J88o59M49K75k67j26j29J63j43J87R8m74
$$ 107 -215 -350 160 -113 -191 468 220 110 200 388 -271 178 453 186 60 -69 94 -49 138 236 -238
3805b38J75M06l12n16L82J28k58k86N10k37k88O38j82m91N60K55n41K96K18l59
$$ -238 -63 343 31 -485 -103 25 -233 -519 -9 -246 -534 104 -78 -569 -9 246 -295 1 219 -140
3825a40k57M46J45j58k4K04m57rO56k92o0k8J77l44L57n8k99K00R5j64l57J26
$$ -140 -397 49 194 36 12 216 -241 -250 406 114 54 26 203 -141 216 158 -141 59 154 -10 -367 -241
3847b41L53m26J24J37p8K63o4k9n2j55j1j45N60M0l12q9K72k22O6O7R7N9K10l09
$$ -241 112 -314 -190 -53 -131 132 68 39 -13 -168 -179 -324 236 276 -36 -125 147 -75 -9 58 155 214 424 115
3871A15K13j19j45J98j33j45lrM7N14n32j50L24m63R0l1N4j11lJ82J46q8L3ll04
$$ 115 328 209 64 262 129 -16 -19 -28 19 533 1 -149 175 -288 -198 -229 -175 -286 -289 -107 39 -49 -16 -19 -323
3896c23kM35j28n2K29J67k97O6O7k66l7M48r0j06K06r9m69N17j16k85R0J75l12
$$ -323 -325 110 -18 -70 159 326 29 95 162 -104 -141 307 217 111 317 218 -251 266 150 -135 -45 130 -182
3919a82K30J7j10j45K60J7j94l0K08p9k41N0L11j94m6RO9J11J74K5l39Q0L0k1
$$ -182 48 65 -45 -190 70 87 -107 -137 71 -8 -249 -199 112 -82 -128 -119 -50 61 235 260 -79 1 31 10
3943A0J35J74J10k87r8J86n29N95O4m08K21j59j77J99j71K60l10p4L35k00p2P7
$$ 10 145 319 429 142 44 230 -299 296 360 -48 173 14 -163 36 -135 125 -185 -259 76 -124 -196 -119
3965a19j06J74L0J59m58J84J74j69k38K58J55j40J24K12m6p8J45j99k07L65J43
$$ -119 -225 -51 -21 138 -320 -136 38 -131 -369 -111 44 -96 28 240 194 116 261 62 -145 220 363
3986C63n45N19k24k20J33j6K98m35M45j54n04L59J6J6m76M79m8j17k50M97k82
$$ 363 -182 337 113 -107 26 10 308 -127 318 164 -340 19 35 51 -425 54 6 -111 -361 136 -146
4007a46j00N17m65M2M41l22j18K82p0j54J15K05l17n0J83Q1j21j51M67k15j06
$$ -146 -246 271 -194 -152 289 -33 -151 131 61 -93 22 227 -90 -140 43 124 3 -148 319 104 -2
4028bq1K94l16K59m01J30j53K07K62l39J22j20J01nK83m09L33l21K23m43L10M5
$$ -2 -83 211 -105 154 -247 -117 -270 -63 199 -140 -18 -138 -37 -42 241 -168 165 -156 67 -376 -66 -21
4050b1j62L36j29j99K1L19k68N2L7L21j17J9q0m05L36R1l1o8J18j56j67J27K79
$$ -21 -183 153 24 -175 -154 165 -103 -51 -14 307 190 209 129 -276 60 151 120 52 170 14 -153 -26 253
4073B53k76j08J92l47R3R0J32k63K56j42Q7q5K3J97l96J97L98l49l6N7Q1l64N90
$$ 253 -23 -131 61 -286 -193 -103 29 -234 22 -120 -33 -118 -95 102 -294 -97 301 -48 -84 -27 54 -310 280
4096B80j13RJ11j19j95M4J39o5k03O5P8k83L21k0K00m54K17K3kk31L05l62K72
$$ 280 167 176 287 168 -27 17 156 91 -112 -47 31 -252 69 49 249 -205 12 35 33 -198 107 -255 17
4119A7k60J08O2L57m19j59L03nm0o0J31mJ3J17j77Jj0K26m29K09J01j93L42l00
$$ 17 -243 -135 -73 284 -135 -294 9 4 -36 -96 35 31 44 161 -16 -15 -25 201 -228 -19 82 -111 231 -69
4143f9N0l4r0L27l47L09Ll94L18j04j64J63J63m6j7j54j07K35j52l3K38k03nN02
$$ -69 -19 -53 -143 184 -163 146 149 -245 73 -31 -195 -32 131 85 68 -86 -193 42 -110 -143 95 -108 -113 389
4167C89l14Oj17M19m11L37L73n26j82K86k31j1L41j75k28J56K2k50p8N87n12k03
$$ 389 75 81 -36 383 -28 309 682 156 -26 260 29 18 359 184 -44 112 134 -116 -194 393 -119 -322
4189c22M60n62K83j16K12p8l1L16n6j11k46L50k6k80L46M8k75J09L66l93K12J5
$$ -322 138 -424 -141 -257 -45 -123 -154 162 106 -5 -251 99 73 -207 139 187 -88 21 387 -6 206 221
4211B21J65l75L35O8Qk07J86l31o8k2Q0k56J46l07J49J15j27L5K26j95J05K72
$$ 221 386 11 346 414 422 215 401 70 2 -20 60 -196 -50 -357 -208 -93 -220 -185 41 -154 -49 223
4233B23l83j5J82J48l52L61k7j40R3K3j07K6J13k44M42l80J68o8k1pN7m4n3L43
$$ 223 -160 -175 7 155 -197 164 137 -3 90 113 6 32 145 -99 343 -37 131 63 42 35 92 48 -5 338
4257C38j53j64K28j57k33r3M71l33L8K3L0M1k07K11q8k90L94J46p55Q17j5k48
$$ 338 185 21 249 92 -141 -234 237 -96 -58 -35 -5 36 -171 40 -48 -338 56 202 -553 264 249 1
4279Aj83M11Qm32O3O21m60j99M07m9j56L50o3j44j49L49m06M3q2J23j99L37k8
$$ 1 -182 229 237 -195 -132 489 29 -170 237 188 32 382 319 175 26 375 -31 12 -70 53 -146 191 163
4302A63k71m2oN7j25K72p2j42j93K66R8N9m11M63K8m22L01j61J49rK72k45j16
$$ 163 -108 -150 -156 -99 -224 48 -24 -166 -359 -93 5 64 -347 116 144 -278 23 -138 11 2 274 29 -87
4325h7M62l15J88j56qj42qK41j88j94j07L43L6j51p3J25o3M0m0j11J1J26O7j48
$$ -87 375 60 248 92 84 -58 -66 175 -13 -207 -314 29 65 -86 -159 -34 -97 -57 -97 -208 -197 -71 -4 -152
4349a52nK5K08m12L58K46j49j10K62j08k23L83k24j31J91L02j44l53r0O4k42J83
$$ -152 -157 -132 76 -336 22 268 119 9 271 163 -60 323 99 -32 159 461 317 -36 -126 -62 -304 -121
4371a21L76k37L8p9K30m04K59K94m37n2K48j27j08qP3K14j91n7J35j64K22J52
$$ -121 255 18 56 -23 207 -197 62 356 -81 -133 115 -12 -120 -128 -55 159 -32 -89 46 -118 104 256
4393B56n20N1M45j10j41L86k23k73J29L3J10J6n5M4j59l7Q1j86R1J36L4l90J21
$$ 256 -264 -213 232 122 -19 367 144 -129 0 33 143 159 104 148 -11 -48 33 -153 -62 74 108 -282 -161
4416a61L68l38NN5O4j56o7Q0N1o9K17k05L45k97l3k1j2M46o9j57K61j75k7p8K92
$$ -161 207 -131 -126 -71 -7 -163 -230 -150 -99 -168 49 -156 189 -108 -141 -162 -174 272 203 46 307 132 105 27 319
4441C19O0n75J28K35n5J45k19J92j00J35l54m2j40L59l87J99Np7J89m55Q17p27
$$ 319 379 -196 -68 167 112 257 38 230 130 265 -89 -131 -271 88 -299 -100 -95 -172 17 -438 379 -348
4463c48L2M76K09n31O1J15J77k26J36L49l31k74K96M2L9q9J33k51L3J56k6l98
$$ -348 -316 160 369 -162 -101 14 191 -35 101 450 119 -155 141 183 222 133 266 15 48 204 178 -220
4485b20K56J36k64l31L73p1j16K13j23J0J08j96l5J32K71p1j33M26p8j64r1O5
$$ -220 36 172 -92 -423 -50 -121 -237 -24 -147 -137 -29 -225 -260 -128 143 72 -61 365 287 123 32 97
4507I7k24J51O2K30k05k6K92j41j31K76K0l61j70K4O9O0k88J27Q9K56l6l07K5
$$ 97 -127 24 86 316 111 85 377 236 105 381 401 40 -130 -106 -37 23 -265 -138 -49 207 171 -136 -111
4530a11K59l81l8L70%l70J39K69l23n7L9q7L41Lq9K54j09j06n2J00K47Nj07j57
$$ -111 148 -233 -271 99 99 -271 -132 137 -186 -243 -204 -291 50 53 -36 218 109 3 -49 51 298 303 196 39
4554C9j88K22l3o8J35J3o9R5qj36J04j57J5J20j72J1K05k99J16j06j21J27J42
$$ 39 -149 73 40 -28 107 120 51 146 138 2 106 -51 -36 84 -88 -77 128 -171 -55 -161 -282 -155 -13
4577a3l75M52Mj46O9PO5j32K39k3k46k0L20n2k86J46J04k30m5J26J43j00O1J57
$$ -13 -388 64 68 -78 -9 -2 63 -69 170 147 -99 -119 201 149 -137 9 113 -117 -162 -36 107 7 68 225
4601B25m50M1M22k4o36K17K43n08N92k76N1k37J96O8r6N21l22m5l1J28J3m3R9
$$ 225 -225 -184 238 214 -422 -205 38 -470 122 -154 -103 -340 -144 -76 -172 349 27 -18 -49 79 92 49 148
4624A48j46R8l4K53j45k40L90k59J8k63J33L37o21L80J5l42Q7Q7J22n5p7L57m64
$$ 148 2 100 66 319 174 -66 324 65 83 -180 -47 290 -331 49 64 -278 -191 -104 18 -37 -114 243 -221
4647b21QL30j28j02n3M17j62j79J36R7k27K51j4L4J78l70J24o7j13j7o8K16M5
$$ -221 -213 117 -11 -113 -166 251 89 -90 46 143 -84 167 153 187 365 -5 119 52 -61 -78 -146 70 115
4670A15l58N54o08K70k20J65P0OK16l05r7R4J24J77k04j37J37Nj82K28PJ91l99
$$ 115 -243 311 -297 -27 -247 -82 -12 -6 210 -95 -192 -98 26 203 -1 -138 -1 4 -178 50 57 248 -151
4693a51K19j71o1L28j6q2l45M83M8l22K05J1l21K57k98N16j32j17n5k61K34K00
$$ -151 68 -103 -164 164 148 66 -279 204 252 -70 135 146 -175 82 -216 300 168 51 -4 -265 -31 169
4715A69k72K0R3P8l19J03K9K35l29L5L82l11J45j18r1J3R1m0N2r9K41Qj63J01
$$ 169 -103 -83 10 88 -231 -128 -99 136 -193 -158 224 -87 58 -60 -151 -138 -47 -87 -35 -134 107 115 -48 53
4739E3K27m62M34R3k17j0P0L3n22N85m34K18QJ11l89l3K45j39P1j75K00r9J25
$$ 53 280 -182 252 345 128 118 188 221 -301 284 -150 68 76 187 -202 -235 10 -129 -58 -233 -33 -132 -7
4762gj30k56J41K53j66j00J17K48o4MJ07j44J84r1O4Q2n64L20J56k60Q8P9k1k94
$$ -7 -137 -393 -252 1 -165 -265 -148 100 36 40 147 3 187 96 160 242 -322 -2 154 -106 -18 61 40 -254
4786b54M25k6k06J81l32J68l04L38m9L7P4k34J27j31K05k72J72k03K93K0n9o2
$$ -254 171 145 -61 120 -212 -44 -348 -10 -59 -22 52 -182 -55 -186 19 -253 -81 -284 9 29 -30 -92
4808i2L03k26J49r7L8o3J86L87n67K70j52j90K4jJ79k45J67K10j36k52K38l09
$$ -92 211 -15 134 37 75 12 198 585 18 288 136 -54 -30 -31 148 -97 70 280 144 -108 130 -179
4830a79M4l7K35k29J1N83n45N8j44J52Q5n2L8J05k63L71J43n93M2L37j74j28K32
$$ -179 -135 -172 63 -166 -155 428 -117 -59 -203 -51 34 -18 20 125 -138 233 376 -217 -175 162 -12 -140 92
4853I2n1k38q4L26J75n26L74J02k08j14L91N7k83J15J25m74K06J32l52j79L43
$$ 92 41 -197 -281 45 220 -306 68 170 -38 -152 239 296 13 128 253 -221 -15 117 -235 -414 -71
4874g1Q3k45L46m2k00k17M74m1l52J53K5J24n0J0J13k11PJ88J1p4K21j54O7k22
$$ -71 12 -233 113 71 -129 -346 128 87 -265 -112 -87 37 -13 -3 110 -101 -94 94 105 31 252 98 165 -57
4898e7M45n27K40o1r8J01k45J32J70k32p8K04k97J12K37R5k42j0m1mK49j75j24
$$ -57 388 -139 101 40 -58 43 -202 -70 100 -132 -210 -6 -303 -191 46 141 -101 -111 -152 -156 93 -82 -206
4921b06J72K60Q6n57N40n1n53M15L60m01k52L24J84m87K99J62k62l14K07L86o66
$$ -206 -34 226 312 -245 295 244 -309 106 466 65 -187 137 321 -166 133 295 33 -281 -74 312 -354
4942c54L16K7k96R0J91L05m78q1K77j26k35M77j40l40J80N47m75O0L40j32j73
$$ -354 -38 -11 -307 -217 -26 279 -199 -280 -3 -129 -364 113 -27 -367 -187 360 -115 -55 285 153 -20
4963b0J97K13o59J86L46m24J1J24R2k25Q2K65l13j41J86P2O4k5R6j98k57L44J33
$$ -20 177 390 -269 -83 263 -161 -150 -26 66 -159 -77 188 -125 -266 -80 -8 56 31 127 -71 -328 16 149
4986A49l76J34K88m23k09J69K69QP8l1k26R5NM9r3M0k4J71k58K51L24k87R2k4
$$ 149 -227 -93 195 -228 -437 -268 1 9 87 56 -170 -75 -70 -21 -114 -74 -98 73 -185 66 390 103 195 171
5010A71K3k46L16j49k15K96J67k62o7J10m8o8J45j08k54M5K64k69m8N4J75j53
$$ 171 194 -52 264 115 -100 196 363 101 34 144 96 28 173 65 -189 -144 120 -149 -197 -143 32 -121
5032a21KJ99l1j49K53j24n5j66N7K58j78J51r7R3n5L95l63K12k25K43m46J45r
$$ -121 -119 80 49 -100 153 29 -26 -192 -135 123 -55 96 -1 92 37 432 69 281 56 299 -147 -2 -11
5055a1O5k40J43K07n61J22L01l18J70K84kk56l08K88j30L62J31l26j53L11m8j35
$$ -11 54 -186 -43 164 -397 -275 26 -292 -122 162 160 -96 -404 -116 -246 116 247 -79 -232 79 31 -104
5077a04J98J10j33j9k69L46j96l09K46K50k61K15J35j31l37M08r2k44J59K22j77
$$ -104 94 204 71 52 -217 129 -67 -376 -130 120 -141 74 209 78 -259 149 57 -187 -28 194 17
5098A7k36M88k9l77J76j11O2j45J08J40R8j27l3l21O0P5O9J78p6K21m20K84l0
$$ 17 -219 269 240 -137 39 -72 -10 -155 -47 93 191 64 31 -290 -230 -155 -86 92 16 237 -183 101 71
5121G1j67L7l5M45n15R2L63Mm87J59l29R7L43j47L7j5p2K43k12j52L96k19j38
$$ 71 -96 -59 -94 351 -164 -72 291 295 -192 -33 -362 -265 78 -69 -32 -47 -119 124 -88 -240 156 -63 -201
5144b01M66l77mj52M80k28R1L0j0M1k64K73j37j12M30m07j6R3J65k60J19J5J25
$$ -201 265 -112 -116 -268 212 -16 75 105 95 136 -128 145 8 -104 326 -81 -97 -4 161 -99 20 35 160
5167A60l07J94j9l75K19K02q8l56J80K67j64K1K63m91M2L11j34k12rL25j48K39
$$ 160 -147 47 28 -347 -128 74 -14 -370 -190 77 -87 -66 197 -294 -252 59 -75 -287 -296 29 -119 120
5189A20j9P3l1J34j82l6j15K33q8k03n6M79l14m9J02K56n05J59l4j67J79%P7j23
$$ 120 101 174 143 277 95 59 -56 177 89 -114 -170 309 -5 -54 48 304 -201 -42 -76 -243 -64 -64 13 -110
5213a10O1M9j03j68K7J43j42N39j71j87q3J59J57j99Kj62pL11p5m1L1k8J80k40
$$ -110 -49 0 -103 -271 -244 -101 -243 296 125 -62 -145 14 171 -28 -26 -188 -195 116 41 0 31 3 183 -57
5237e7K61O9o2k05pK7j22Q8N08l04m33K23j36R4r4J86r9k05J96r3N7J55M9j57
$$ -57 204 273 211 6 -1 26 -96 -8 500 196 -237 -14 -150 -56 -150 36 -63 -268 -72 -165 -108 47 96 -61
5261f1O0P3J41l17L92m8l15PJ73j49R6k0j1J1Q0J51p2l75J10J12M5L0j64J33j43
$$ -61 -1 72 213 -104 288 240 -75 -68 105 -44 52 32 21 32 112 263 191 -184 -74 38 83 113 -51 82 -61
5286f1o4J50k00J33J45j83j32J94R2l66J78Q6j01j16K42L05k29j48QjJ59K26j27
$$ -61 -125 25 -175 -42 103 -80 -212 -18 74 -292 -114 -28 -129 -245 -3 302 73 -75 -67 -68 91 317 190
5309A90n7ok26J01N3p2j49J23O4j94K22k8K82n30O7P0J74k17k12L73r2k08M33
$$ 190 133 127 -99 2 55 -17 -166 -43 21 -173 49 21 303 -227 -160 -90 84 -133 -345 28 -64 -272 161
5332A61j23j24l1j55O11l56j09O7j06J83J4K87l25K19r9J2j61J82J59k23K66l24
$$ 161 38 -86 -117 -272 339 -17 -126 -59 -165 18 32 319 -6 213 114 126 -35 147 306 83 349 25
5354B5M3L8k7j00j4L57n65j18J50L90r4l73M17l06K22m0JP1l64L54j58k75K80
$$ 25 68 106 79 -21 -35 322 -243 -361 -211 179 85 -288 129 -177 45 5 6 77 -287 67 -91 -366 -86
5377h6o3N2J76L5k13o9K97j50j60J02J94J3j22J23J13l24J96J61m19r8N93m92
$$ -86 -149 -97 79 114 -99 -168 129 -21 -181 -79 115 128 6 129 242 -82 114 275 -144 -242 351 -141
5399a41%Q0L76l80l4L1l9J40L8j05j0L4J02n6L2O5j57J16k92O94m33j88K46J92
$$ -141 -141 -61 315 -65 -99 -68 -107 33 71 -34 -44 -10 92 36 68 133 -24 92 -200 494 61 -127 119 311
5423C11l94K53J31m01j99M64r5J17k60J91r2L38m43j58J58j81L48j84j59L8L30
$$ 311 -83 170 301 -100 -299 165 70 187 -73 118 26 364 -79 -237 -79 -260 88 -96 -255 -217 113
5444A13j21M0j59J36j29K37j97K7N2L54k99M6R9O1m08J41K39l39K64K48j99k94
$$ 113 -8 32 -127 9 -120 117 -80 -53 -1 353 54 100 199 260 -148 -7 232 -107 157 405 206 -88
5466h8J34J00o9k16K57m10J35K30J80m97L26J49j65k47P2J85k31O2J68J7l63J88
$$ -88 46 146 77 -139 118 -292 -157 73 253 -244 82 231 66 -181 -109 76 -155 -93 75 92 -271 -83
5488h3MJ30l06K66J48l08K21J08j08o0p2K3R6l4l2k26K34K28j32k87R8K03k61
$$ -83 -79 51 -255 11 159 -149 72 180 72 12 -60 -37 59 25 -7 -233 1 229 97 -190 -92 111 -150
5511a50J06rl3K79m3k91K2N2k6nJ59q1j6J37k52L58k50qM09k49j00J45l65K11
$$ -150 -44 -53 -86 193 150 -141 -119 -67 -93 -98 61 -20 -36 101 -151 207 -43 -51 358 109 9 154 -211 0
5535@o6o5J78l08J98j50j32K09M08l55j8K29k59R2J8j32J33j22K69j92r4j03K42
$$ 0 -66 -131 47 -261 -63 -213 -345 -136 272 -83 -101 128 -131 -39 -21 -153 -20 -142 127 -65 -159 -262 -20
5558b0J10m72M80m05K82j20J49j61j6M35m83J78K56k4j24n5P8j45J23K64l84L8
$$ -20 90 -382 98 -307 -25 -145 4 -157 -173 262 -221 -43 213 189 65 10 88 -57 66 330 -54 -16
5580a6R2J42J2k21j25L09l53L53l43j20M9J98L4l79M57N2j87O9m0k84M0K35J27
$$ -16 76 218 230 9 -116 193 -160 193 -150 -270 -221 -23 11 -368 89 141 -46 23 -17 -301 -261 -26 101
5603A01l59K12L45m14j0J59L5J23k36J12K42n19J92N7j37M5L17Q4l56Q5k3L8j4
$$ 101 -258 -46 299 -115 -125 34 69 192 -44 68 310 -209 -17 40 -97 -52 265 349 -7 78 55 93 79
5626G9O2N1l25K22p4J95l45l3J02l63L80O0j7q0J12k16m5J43J53k51J45K37m1
$$ 79 141 192 -133 89 15 210 -135 -168 -66 -429 -49 11 -6 -86 26 -190 -235 -92 61 -190 -45 192 151
5649A51O1N4l08J39j49K16j55k39O10r2l97p9N65n39J72lR4k80L76j57l19K43
$$ 151 212 266 -42 97 -52 164 9 -230 380 288 -109 -188 377 -162 10 7 101 -179 197 40 -279 -36
5671c6j60K17j74M6Q8J96k33J8J1O5K1r0J26Q3Qj55k7q5L2R0P3r6J15j64M16l74
$$ -36 -196 21 -153 -107 -19 177 -56 -38 -27 38 59 -31 95 178 186 31 4 -81 -49 41 114 18 133 -31 385 11
5697A1j40m3K22k41j15K29J42j61j53J61k51K45M10l00j22mK03Q3o6j80j1k02
$$ 11 -129 -172 50 -191 -306 -77 65 -96 -249 -88 -339 -94 316 16 -106 -110 93 176 110 -70 -81 -283
5719b83L31J23j30K16k6k16M1R8j19k04J71jL43l76K16l55o0K78OK02j01j13K9
$$ -283 48 171 41 257 231 15 56 154 35 -169 2 1 344 -32 184 -171 -231 47 53 255 154 41 70
5742G0J17k83J13m0j36j97M24r3o7j15M06j77p1j34K06p8q4J52q2J92L1j14M31
$$ 70 187 -96 17 -23 -159 -356 68 -25 -92 -207 199 22 -49 -183 23 -55 -139 13 -69 123 154 40 471
5765D71j28l75j3J12P1j73j4P0j67K49n1%j30J21p6L3j69O4K44l06K46q2P7m3
$$ 471 343 -32 -45 67 138 -35 -49 21 -146 103 52 52 -78 43 -33 0 -169 -105 139 -167 79 -3 74 31
5789C1j89K54n7l57K61K86o05L86J68L3o34K81J68q9M40l59P0j45K6r6K10j69
$$ 31 -158 96 39 -318 -57 229 -376 10 178 211 -423 -142 26 -63 377 18 88 -57 -31 -127 83 -86
5811h6J45k13J61on8j92M89m35K0J58jL2L5l7k95q4K07K64k22J11j60K3r1k8M18
$$ -86 59 -154 7 1 -57 -249 240 -195 -175 -17 -18 14 49 12 -283 -367 -160 104 -118 -7 -167 -144 -235 -263 155
5836A55j64J38k0prl9n2k1K38k49J33r0k1K15j37n8L4j3j15M1j25K8J27r9j26
$$ 155 -9 129 109 102 93 54 2 -19 219 -30 103 13 -8 207 70 12 46 33 -82 -41 -166 -138 -11 -110 -236
5861b36J01L02j98K26k01j03J81j74J51J05p5J5k4M67n24O0j11j70j56L11q5P2
$$ -236 -135 167 -31 195 -6 -109 72 -102 49 154 79 94 70 537 13 73 -38 -208 -364 -53 -138 -66
5883f6r4K90PP2nm36J30J45q5k62L67k66r5K64p6K65m3l19N2j57M18M1l56L01
$$ -66 -160 130 137 209 204 -232 -102 43 -42 -304 63 -203 -298 -34 -110 155 112 -207 -155 -312 106 147 -209 92
5907I2p3q0RK05j63J14m09K95p0L59m18N15k38J0R0l71K96l54J79k36K85l90L05
$$ 92 19 -61 -52 153 -10 104 -305 -10 -80 279 -139 376 138 148 238 -133 163 -191 -12 -248 37 -353 -48
5930d8p0j44P5J80k20K15p9J80k10J32J00k13k09L70J12k84K88O2k8j8k87K03
$$ -48 -118 -262 -187 -7 -227 -12 -91 89 -121 11 111 -102 -311 59 171 -113 175 237 209 191 -96 107
5952A07Q0j00Nj39K09k22K73j91j65L27k46pL7j48j06M5K84o7L22m15k7J05L34
$$ 107 187 87 92 -47 162 -60 213 22 -143 184 -62 -69 -32 -180 -286 -241 43 -24 298 -117 -144 -39 295
5975B95l92O7N4j46K44O0l12m5J19K52k27O1k70K98P0j54O4k35P6j01L48j93q7
$$ 295 -97 -30 24 -122 122 182 -130 -175 -56 196 -31 30 -240 58 128 -26 38 -197 -121 -222 126 -67 -154
5998a54J97J13M6l51L12k11L5j47J64k16M66m56M31m11J08N3k87K92q0J26O9k24
$$ -154 43 156 202 -149 163 -48 -13 -160 4 -212 254 -202 229 -182 -74 -21 -308 -16 -96 30 99 -125
6020a25RK52l03L84o38P26J0l75J21k96J86J94K1k01K39j85n5K49j82k1r9K4M0
$$ -125 -116 136 -167 217 -421 305 315 -60 61 -235 -49 145 166 -35 204 19 -36 213 31 10 -89 -65 -25
6043b5R0j66L01k56j06J94k43m1L52J41l22RJ21j7j25p4J83k0O0k80Q7J96J03
$$ -25 65 -101 200 -56 -162 32 -211 -252 100 241 -81 -72 49 32 -93 -167 16 -4 56 -224 -137 59 162
6066A62k82J86j6L91l21j59L42k26k89K11M66n15K61j73lJ61j99P9j17J02J30
$$ 162 -120 66 50 441 120 -39 303 77 -212 -1 465 -50 211 38 35 196 -3 76 -41 61 191
6087A91l80K27j67J17j07J19j76M7J24j79J29K16k58N9J16K18k95k4Rk55K05J30
$$ 191 -189 38 -129 -12 -119 0 -176 -129 -5 -184 -55 161 -97 -38 78 296 1 -23 -14 -269 -64 66
6109F6j22k2L57l73J30j82L85k06m7o1K00rj36Q6k08Q8j80K98j62J48l37L26Q3
$$ 66 -56 -78 279 -94 36 -146 239 33 -14 -75 125 116 -20 66 -142 -54 -234 64 -98 50 -287 39 122
6132A22j62n5L26m15K11j69K89k36L15k94J59j16rJ0K32J9m2q6Q2j19j81J39j20
$$ 122 -40 -95 231 -184 27 -142 147 -89 226 -68 91 -25 -34 -24 208 227 185 99 181 62 -119 20 -100
6155a00J66k18L09r3k47OO5N0J06p1R3j26O3k01L09k45L09N3k42J48k96K13J3
$$ -100 66 -152 157 64 -183 -177 -112 -62 44 -27 66 -60 3 -198 111 -134 175 228 -14 134 -162 51 64
6178F4M5N6k79M18k50n5K14k6M8j40P6qJ3k84J99j11j16R3j64L17k92L2J38k89
$$ 64 109 165 -114 304 54 -1 213 187 235 95 171 163 176 -108 91 -20 -136 -43 -207 110 -182 -150 -12 -301
6202c01J70L8j36p1L79p1n5j62M69k92R8K02k48K30j98K52k80J21P3j54p8J31
$$ -301 -131 -93 -229 -300 79 8 -47 -209 260 -32 66 268 20 250 52 304 24 145 218 64 -14 117
6224A17j07PO5k91K36K17l83J31L8p3K9l1R0n7Q9J13j47J91n15K82j48K41mn2
$$ 117 10 17 82 -209 27 244 -139 -8 30 -43 -14 -45 45 -12 77 190 43 234 -281 1 -147 94 90 38
6248C8rm0m5j77Q8K67k94K87l47K63j9N2l69L56k2R8L5k3j07j14Lj52N45Mk32
$$ 38 29 -11 -56 -233 -145 122 -172 115 -232 31 12 64 -305 51 29 127 162 139 32 -82 -79 -231 314 318 86
6273H6l19K17k89L63J34M6m01j38L21Jq3O4J62l47j1K58j30K8k4J67j06j31J19
$$ 86 -233 -16 -305 58 192 238 -163 -301 20 21 -62 2 164 -183 -194 64 -66 -38 -62 105 -1 -132 -13
6296a3p8J09LN4P3q9l3L64m50k47M69p0o4k24J75L6j26k55M9K92j59K13K0K8J51
$$ -13 -91 18 21 75 148 59 26 390 -60 -307 162 92 28 -196 -21 15 -111 -366 -317 -25 -184 29 49 77 228
6321B28j97J2k1m73M16N6O5l37M44j75K17l42J80L2k61L33K1R7m11m0L78l07q4
$$ 228 31 43 22 -451 -35 21 86 -251 193 18 235 -107 73 105 -156 177 198 295 -116 -156 222 -85 -169
6344a69J60q6K93j28j93J05j73K53M4q1Q1j40k49J44L1J2K04J7k91J41K05j28
$$ -169 -9 -95 198 70 -123 -18 -191 62 106 25 106 -34 -283 -139 -108 -96 108 125 -166 -25 180 52
6366E2m6j68J62K37k0j17p4m0NO5Jp7Q1k3K13J16n36j36J91L14m02M54j65l84
$$ 52 6 -162 0 237 217 100 26 -14 -9 56 57 -20 61 38 251 367 -169 -305 -114 200 -202 252 87 -297
6390b97R6K07k08J84O5M4L8k04J79j63R5m1L48m29O2Ln3j30M3J34k17K52l6O1
$$ -297 -201 6 -202 -18 47 91 129 -75 104 -59 36 -5 343 -86 -24 -21 -74 -204 -161 -27 -244 8 -28 33
6414C3l5j97J98K85m83N38o63J68K36n9q9n5L0M7j60N2K65K0J50k20M2j58M3p6
$$ 33 -2 -199 -1 284 -199 339 -324 -156 80 21 -68 -123 -93 -46 -206 -154 111 131 281 61 103 -55 -12 -88
6438h8N2k3NM6oJ28m24M70K9j69MK08k73j8J69q6j99K62J81j74kM8L4q7Qj5k40
$$ -88 -36 -59 -54 -8 -14 114 -310 160 189 20 24 232 -41 -59 110 24 -175 87 268 94 92 140 174 87 95 80 -160
6465a60J56k03J34k26K87Q4l28K12MK90j83q8R9J4l50J76M4K48k17J48r1j01N6
$$ -160 -4 -207 -73 -299 -12 72 -256 -44 -40 250 67 -21 78 92 -258 -82 -38 210 -7 141 50 -51 5
6488EL3j27j4K01L6jp7nn7J52j91j68J30J39k3J27l87J96p0%J5J03n6P3o8L76
$$ 5 38 -89 -103 98 134 133 56 51 -6 146 -45 -213 -83 56 33 160 -227 -31 -101 -101 -86 17 -39 34 -34 342
6514C42l70N9j3k72L31L29k85j99J4K32m13J06L01k17j20J30J19r0j05J55l9j85
$$ 342 -28 31 18 -254 77 406 121 -78 -64 168 -245 -139 162 -55 -175 -45 74 -16 -121 34 -5 -190
6536a90J57J34j82J75p7k66O9K24l10M37l08oJ59k3J22K11k75J78k11j95J8M66
$$ -190 -33 101 -81 94 17 -249 -180 44 -266 171 -137 -143 16 -7 115 326 51 229 18 -177 -159 307
6558C07k57J11j34J54l98K43K2Ln2R9J93j66K92n06j57J13Q9J44j5j15R9n07K34
$$ 307 50 161 27 181 -217 26 48 51 -1 98 291 125 417 -89 -246 -133 -44 100 85 -30 69 -438 -204
6581b04K35J5o6J7j24OJ07k7J91l7j74K48j94RJ54m22K85L3J56m36J96N7o3j63
$$ -204 31 46 -20 -3 -127 -121 -14 -41 150 113 -61 187 -7 2 156 -266 19 52 208 -228 -32 25 -38 -201
6605b01J4K45j36j04L73r0k14l3J44J55l42M9O8L8o8k4R0L9k87K42K64k35J01
$$ -201 -187 58 -78 -182 191 101 -113 -146 -2 153 -189 -140 -72 -34 -102 -126 -36 3 -284 -42 222 -13 88
6628H8j51R3M9j83M19l73L55m39M38k4k32L7p2N7l76J51K94j46Ll1L58L5m79J49
$$ 88 -63 30 79 -104 315 -58 297 -142 296 272 40 77 5 62 -314 -163 131 -15 -12 -43 315 350 -129 20
6652B0j88J50l1J37r3J84k20j25k72N45l3k44oj4R4J88L8K5k07K02j64O0j36m2
$$ 20 -168 -18 -49 88 -5 179 -41 -166 -438 107 74 -170 -176 -190 -96 92 130 155 -52 150 -14 46 -90 -132
6676a32J21L7j43K04k9M3Q0j12P6m9l8l23J83M4j56L35o3N8k15P5p1N5Oj38K75
$$ -132 -11 26 -117 87 58 101 181 69 145 96 58 -265 -82 -38 -194 141 78 136 -79 -4 -75 -20 -14 -152 123
6701A23J26m77M63j27J05k71J88p6K42k92J4M7LJ41j29J85l62K53k65K71j86L0
$$ 123 249 -228 235 108 213 -58 130 54 296 4 18 65 68 209 80 265 -97 156 -109 162 -24 6
6723FK72n6j16j99P3K67n99K25L45k86k3L36k28N3l46L79j56L0rK39l09Q9K62
$$ 6 278 222 106 -93 -20 247 -352 -127 218 -68 -91 245 17 70 -276 103 -53 -23 -32 207 -102 -13 249
6746B49k08JJ08J75l07K7l7p2L48k91J69k19k70O52m07J09j15O5j37J72Q8l59
$$ 249 41 42 150 325 18 45 8 -64 284 -7 162 -57 -327 325 -82 27 -88 -23 -160 12 100 -259
6768b59P3J97k01L45L8r7J02j37l8j30J23j01l3M8oLR0j95M71l69J15j81J30j64
$$ -259 -186 11 -190 155 193 96 198 61 23 -107 16 -85 -118 -70 -76 -73 17 -178 293 -76 39 -142 -12 -176
6792a76K10M1k88O3L31N6Mm12J09j67r5L12m1J5J61J40j66j10o9p1K73k36J83
$$ -176 34 75 -213 -150 181 237 241 -171 -62 -229 -324 -12 -53 -38 123 263 97 -13 -82 -153 120 -116 67
6815F7k46J75j00L53l57L32k01l8P5J82k27j05Oj94L80k70N9N9J31J74k49J16
$$ 67 -179 -4 -104 249 -108 224 23 -15 60 242 15 -90 -84 -278 102 -168 -109 -50 81 255 6 122
6837A22j20N3j69k84N14R5L5j56q8n5m3k93M58k34r3L17Q1l49J18J5O2J44j46
$$ 122 2 55 -114 -398 116 211 246 90 2 -53 -96 -389 69 -165 -258 59 140 -209 -91 -76 -14 130 -16
6860a6k98K51J37Q3k37J98O4l14K71j20n4k71O67m61J64p1J55j45j48J62K6r1
$$ -16 -314 -63 74 157 -80 118 182 -132 139 19 -35 -306 361 -100 64 -7 148 3 -145 17 43 -48
6882d8j05J41m6J8O7j05j25K23k64K97k54L91k36M4q9J75m10L94o7J60j33r3j15
$$ -48 -153 -12 -58 -40 27 -78 -203 20 -244 53 -201 190 -46 -2 -91 84 -326 68 1 161 28 -65 -180
6905a80J32L6P6k09M15n5m9k29j29J84K50l21J38J74j66j92J43j49K3L69l73K57
$$ -180 -48 -12 64 -145 270 215 166 -63 -192 -8 242 -79 59 233 67 -125 18 -131 -108 261 -112 145
6927A45k37J83l47P5L34m62J50K4M3J27r6J45n1k3J77k28kN6o4N4j87m3K33J85
$$ 145 -92 91 -256 -181 153 -309 -159 -135 -92 35 -61 84 33 10 187 -41 -43 13 -51 3 -184 -227 6 191
6951A91Q0m16J88N5k02N1J54k26K56j08k32J36R2j57J63J16K8j30K19k45j88J00
$$ 191 271 -145 43 98 -104 -53 101 -125 131 23 -209 -73 19 -138 25 141 169 39 258 13 -175 -75
6973g5M09l88J71k12J46M43n09k6J03k39K80k0Pj28r9J27o5j2J39J95k42j32J29
$$ -75 334 -54 117 -95 51 494 -15 -41 62 -177 103 83 90 -38 -137 -10 -75 -87 52 247 5 -127 2
6996Bj53l93K99K70j58M8j55P7L15k01j26pK70j60l9M06l75K80J16j99r0O8j19
$$ 2 -151 -544 -245 25 -133 -85 -240 -163 152 -49 -175 -182 88 -72 -111 295 -80 200 316 117 27 95 -24
7019b4L58L2l77J47k48J21N3N7j58j91K26k4p4N6k3O8n2NJ4J50k25j78J54J2N6
$$ -24 334 366 -11 136 -112 9 62 119 -39 -230 -4 -28 -102 -46 -69 -1 -53 -48 -34 116 -109 -287 -133 -121 -65
7044f5J16j66J05k97L31J11k25J86p0j17k0J60kj77K50k11K30k49R8J7k5K27j50
$$ -65 51 -115 -10 -307 24 135 -90 96 26 -91 -111 49 47 -130 120 -91 139 -110 -12 5 -20 207 57
7067E7q4J64O9q9l3l6q4j9K9m57Q28k34k33R2k5K06k9j11M4K0O6P3k90l16L53
$$ 57 -27 137 206 117 84 48 -36 -55 -26 -483 345 111 -122 -30 -55 151 122 11 55 75 141 214 -76 -392 -39
7092c9J38k7j6J79l29J62qo8k01J04N6j83K76N8j33R3k28Q0K24L4R7l45j77K20
$$ -39 99 72 56 235 -94 68 60 -8 -209 -105 -49 -232 44 102 -31 62 -166 -86 138 172 269 -76 -253 -33
7116c3R0q7J63k12M8j7k6K57p0j65R2K32k25Ok7j85K51J96j20l55K58L1l39M52
$$ -33 57 -30 133 -79 -31 -48 -74 183 113 -52 40 272 47 53 26 -159 92 288 168 -187 71 102 -237 215
7140B15J1k54J69r0p3R4L36l21j22j37K27k45L05j0k73J79j57K75l09J40k1L80
$$ 215 226 -28 141 51 -22 72 408 87 -35 -172 55 -190 115 105 -168 11 -146 129 -180 -40 -61 319
7162C19n07J2J12K75k92j18K29J28j10L5J02j45J16j05j42J77J9j45j9K4Q1l01
$$ 319 -188 -176 -64 211 -81 -199 30 158 48 83 185 40 156 51 -91 86 105 -40 -59 -35 46 -255
7184b55K96j53J46j19L47n78M13l8lm8J12l28J83M2K30k62J06J51k45r6J10Q2
$$ -255 41 -112 34 -85 262 -316 97 59 56 8 120 -208 -25 17 247 -15 91 242 -3 -99 11 93
7206I3j59M0O1j64K42k3j42P8l16J89q2n8R9J70j91J40r0k8J25k60K54J99j8r8
$$ 93 -66 -26 35 -129 113 90 -52 26 -290 -101 -183 -241 -142 28 -163 -23 -113 -141 -16 -276 -22 177 159 61
7230F1J74k69P1p7N9J37j62jJ66k14J59J7l7j28Q9k58J79J25l07L63Mr9j65K63
$$ 61 235 -34 37 -40 19 156 -6 -7 159 -55 104 121 84 -44 45 -213 -34 91 -216 147 151 52 -113 150
7254A50q4l7q3l51K00j8J41J82k81QK17J48k77P8J92k66J61j99J14k19J71J93
$$ 150 66 29 -54 -405 -205 -223 -82 100 -181 -173 44 192 -85 -7 185 -81 80 -119 -5 -224 -53 140
7276A40Or5l04N05Q7l44O0j0j39K58k11R7m6l2r6K63k43nJ24KK46k36j50L22m56
$$ 140 146 51 -253 252 339 -5 55 45 -94 164 -47 50 4 -28 -124 139 -104 -109 15 17 263 27 -123 199 -257
7301b57K38j09J99ol94M13j90K09k5j9mJ13q2J58n02j07N65j52k34K15Q9p8j71
$$ -257 -19 -128 71 65 -329 84 -106 103 78 59 55 168 86 244 -258 -365 200 48 -186 29 118 40 -131
7324a31J83L26l50J5M1N5j63L4l37N66k22l8m22L00j42K19n4p8l0K54j62J97M
$$ -131 52 378 28 43 84 139 -24 10 -327 239 17 -21 -443 -143 -285 -66 -120 -198 -228 26 -136 61 65
7347F5k3j60K24j60q0J46L02k07r0n0O50p33L15r0j79L1o5K18j48L19o75L95l1
$$ 65 42 -118 106 -54 -134 12 314 107 17 -33 617 -116 199 109 -70 -39 -104 114 -34 285 -390 5 -26
7370b6Q9L7j95m9j8J84NQ3J26k47K33k41K1P7Rk78J65J6R2p5L5j25J65rJ87k77
$$ -26 63 100 -95 -144 -162 22 27 110 236 -11 222 -19 2 79 88 -190 -25 -9 83 8 43 -82 83 74 261 -16
7396a6J86j87J01j32n5j8K85o5j23RL09j73j34N3k21L55J3l81K41P8k48K48k4
$$ -16 170 -17 84 -48 -103 -121 164 99 -24 -15 294 121 -13 40 -181 174 187 -194 47 125 -123 125 101
7419A01k7n7q9K34j43j09J96k39J30r7J00k27N20q3k57J38k31k8N3K9N7j08n0
$$ 101 74 17 -72 162 19 -90 106 -133 -3 -100 0 -227 293 210 -47 91 -140 -168 -115 -86 -29 -137 -187
7442a87K61N4k25k6J81j94o2M43k93Q9l0l09J87J53r7j24J18J9M8j72K24p7J07
$$ -187 74 128 -97 -123 58 -136 -198 245 -48 41 11 -298 -111 42 -55 -179 -61 -42 6 -166 58 -19 88
7465H8J72j90O8k18P1l49K90pj60J49K68j67j93M36q6q1k97K04j6R1p8j83K0R0
$$ 88 260 70 138 -80 -9 -358 -68 -75 -235 -86 182 15 -178 258 172 91 -206 -2 -18 73 -5 -188 -168 -78
7489g8J41l46N13k70k94M52j2k86J23J21j4lJ52k93j36K23J25rj31j07K48%k77
$$ -78 63 -283 230 -40 -334 118 106 -180 -57 64 50 47 199 -94 -230 -7 118 109 -22 -129 119 119 -158
7512a58PK74k91K12l3r2qJ13k11R9M9K9M1pl4L9k33L38j73k81K86J85k56m8J57
$$ -158 -151 123 -168 44 11 -81 -89 24 -187 -88 -39 -10 31 24 -10 29 -204 134 -39 -320 -34 151 -105 -153 4
7537DP8k5M0L4k10K33k79J21K7j70Q9K77l23K66k11j71N7R1J07j31o2n8M07k00
$$ 4 82 57 97 131 -79 154 -125 -4 23 -147 -58 219 -104 162 -49 -220 -163 -72 35 -96 -158 -216 191 -9
7561iJ14q7L04l39j7M5r1J49O8j63K43l75J65N8l8J42p7m5L3l61J63L33k7k93
$$ -9 105 18 322 -17 -34 11 -80 69 137 -26 217 -158 7 65 27 169 92 47 80 -281 -118 215 188 -105
7585a05K8j3O4J84k22K78k91J88r4j42J38k19J55Q4o2Pj03J95q2O4K2K5o3q0j18
$$ -105 -77 -90 -26 158 -64 214 -77 111 17 -125 13 -206 -51 33 -29 -22 -125 70 -12 52 74 99 36 -44 -162
7610a62K73j25m9J19K11m1j79J9l89L01O1m9j56J23K34j77j49K14j23J05p7J93
$$ -162 111 -14 -63 56 267 226 47 66 -323 -22 39 -10 -166 -43 191 14 -135 79 -44 61 -16 177
7632A77O1j46K1p5N9R4m15L05J12m0j45K21m83p2L78j47K58j48j25MK59j41R0
$$ 177 238 92 113 38 97 191 -224 81 193 153 8 229 -254 -326 52 -95 163 15 -110 -106 153 12 102
7655A02J07j20Jk97l2J00j55J46O8L7j47J87J05J32k19J94l1j86Q6M02n76L5J73
$$ 102 209 89 90 -207 -239 -139 -294 -148 -80 -43 -190 -3 102 234 15 209 178 -8 78 480 -96 -61 112
7678A12k2j56M3K18l9l63M03n9j09q6J76J09j87k5J09J11j58nJ8j91n5L43m2J44
$$ 112 90 -66 -23 195 156 -207 196 137 28 -58 118 227 40 15 124 235 77 72 90 -101 -156 187 145 289
7702B89j73l9l27J74R6P8J1j40k2K21l70K09M6j30Q9K8j48J08j44j37J73K04L3
$$ 289 116 77 -250 -76 20 98 109 -31 -53 168 -202 7 53 -77 12 40 -108 0 -144 -281 -108 96 129
7725A29J70j53l91L15j56K59m9j60R5N7N0j51KJ52J49m43J97j05k2J54l89M41
$$ 129 299 146 -245 70 -86 173 124 -36 59 116 166 15 17 169 318 -125 72 -33 -55 99 -290 151
7747A51j29jn9j47K68l42K76n8l61M14K00l18K28j62K10o0k53J22K0j10n8j01
$$ 151 22 21 -38 -185 83 -259 17 -41 -402 12 212 -106 122 -40 170 110 -143 -21 -1 -111 -169 -270
7769b70J62N7J47M4l14Q9j5K48k11J73j54O1k54J41O3PK22k09J6j34K94Ll93K62
$$ -270 -108 -51 96 140 -174 -85 -100 148 -63 110 -44 17 -237 -96 -33 -26 196 -13 3 -131 163 166 -227 35
7793C5m2J0m0P2J87r5r3k99o3L10L9L4n5j31K45r4M36o80K74m06L55j01Q7O1n4
$$ 35 -7 3 -37 35 222 127 34 -265 -328 -18 21 55 0 -131 114 20 456 -224 50 -356 -1 -102 -15 46 -8
7818hJ8L0j14p8n8J98k40M5K36K04K9p4l29L35q6k51J39Q9q6j28l1J92K6R2k19
$$ -8 10 40 -74 -152 -210 -12 -252 -207 29 233 262 188 -141 194 108 -143 -4 85 -1 -129 -160 32 58 150 -69
7843f9j77M05l2r9j05J33m8j21K18m6j21K11k42p0J76L0M7m35J16L57k36J71J31
$$ -69 -246 159 127 28 -77 56 8 -113 105 59 -62 149 -93 -163 13 43 90 -345 -229 128 -108 63 194
7866A94o0l41J32K01l6k06N0K09q7n1M35k87l21L22k28j20L06k45o5K24J28j70
$$ 194 134 -207 -75 126 90 -116 -66 143 56 5 440 153 -168 154 -74 -194 112 -133 -198 26 154 -16
7888a6k29J86j6K6M3J31l04J53J04j08K08m18R0Q2j55L25j82j10N01n15K77j49
$$ -16 -245 -59 -75 -49 -6 125 -179 -26 78 -30 178 -240 -150 -68 -223 102 -80 -190 311 -204 73 -76
7910g6J36r1J39j56K9p8j16L81k53J09P1l59J61J4q4J07J25o2j35J93q5r1L9Q8
$$ -76 60 -31 108 -48 -19 -97 -213 168 -85 24 95 -264 -103 -89 -173 -66 59 -3 -138 55 -30 -121 -82 6
7934Fj67K08j44N3l0NJ31K4k70J62j14p2M31l72l7Q6P0j03PL1J45m36M40k16O9
$$ 6 -161 47 -97 -44 -74 -69 62 86 -184 -22 -136 -208 223 -149 -186 -100 -30 -133 -126 -95 50 -386 54 -162 -93
7959i3M13l96K47p0j90J62O7k7j34M0j76J2j31K22N2K4N1j06J71K2k93M0K5l1
$$ -93 320 -76 171 101 -89 73 140 113 -21 19 -157 -145 -276 -54 -2 22 73 -33 138 160 -133 -93 -68 -99
7983i9n3M98m16J44p8J54k22J60l8O8j42j06K0K19lr6j3K38m01L59k56j2J34l88
$$ -99 -152 346 -70 74 -4 150 -72 88 50 118 -24 -130 -110 109 106 10 -3 235 -166 193 -63 -75 59 -329
8007c29L39j58K54k52J22m6k19J03J82o1M5j43P9L37k16l22M20q9j18J18o3L4
$$ -329 10 -148 106 -146 -24 -70 -289 -186 -4 -65 -20 -163 -84 253 37 -285 135 46 -72 46 -17 17
8029A7p1q3J10R3j39Q9J97M1j68j97Q3J80l21J6K47l11K78O8J25K09l34l9q1j90
$$ 17 -54 -137 -27 66 -73 16 213 254 86 -111 -28 152 -169 -153 94 -217 61 129 254 463 129 90 9 -181
8053a81L7m9J24K4k22L94J82l67l8L01l07L49k35j27N9L56j08J1m52K15O3j24
$$ -181 -144 -193 -69 -45 -267 127 309 -58 -96 205 -102 247 12 -115 -56 300 192 203 -249 -34 29 -95
8075i5J00J59j89O0j98K07M2j38j00K58P5j49N7k07K52p8k4j20K14j0j22P6m09
$$ -95 5 164 -25 35 -163 44 86 -52 -152 106 181 32 89 -118 134 56 32 -88 126 116 -6 70 -339
8098c39J3L88j78J98k21P5K30l70J47K06M5k57r8K49l37K80o6K89m26J26J53m14
$$ -339 -326 62 -116 82 -139 -64 166 -204 -57 149 194 -63 -161 88 -249 31 -35 254 -172 -46 107 -307
8120c07J28J14q9K39p1R4J71q8o0p6Q7j36R9k56O9m2J13M3m54O71m00K07L7J48
$$ -307 -179 -65 -154 85 14 108 279 191 131 55 142 6 105 -151 -82 -124 -11 32 -422 249 -151 56 93 241
8144B41r7l15M04n6j11j71J56l8K56m81O35k68j63kP0K19j30p8J7l72K59K74r
$$ 241 144 -171 233 177 66 -105 51 13 269 -212 423 155 -8 -10 60 279 149 71 88 -284 -25 249 240
8167B40l83J46oj00J15J17J30j01n9r5j60K86n11K21l4L23j35r3k18L83L9O5m05
$$ 240 -143 3 -3 -103 12 129 259 158 99 4 -156 130 -381 -160 -194 129 -6 -99 -317 66 105 170 -235
8190b35K55
$$ -235 20
8191B0
$$ Imaginary data points
##PAGE= N=2
##DATA TABLE= (X++(I..I)), XYDATA
0@%%%%%%%%%%Qj6J6k4L2l2M0n6P2q8J04j20J44j69J94k33K72l12L61m17M80n46
$$ 0 0 0 0 0 0 0 0 0 0 0 8 -8 8 -16 16 -16 24 -32 40 -48 56 -64 80 -89 105 -128 144 -168 193 -224 256 -290
32b90O20p03P97r00J013j139J272j418J580j758J954k164K392k647K926l226L555
$$ -290 330 -373 424 -476 537 -602 670 -748 832 -926 1028 -1136 1256 -1391 1535 -1691 1864
49A864l917M314m752N236n774O376p052P813q684R691j0865J2263j3954J6049
$$ 1864 -2053 2261 -2491 2745 -3029 3347 -3705 4108 -4576 5115 -5750 6513 -7441 8608
63H608j8728K2286k7269L4791m7581P4897k32298K55812K28121o33343K26113
$$ 8608 -10120 12166 -15103 19688 -27893 47004 -185294 70518 298639 -334704 -108591
74a08591M15659l43155j83246M05563q3868k48082J70124R0968j90048M4709J02636
$$ -108591 307068 -36087 -219333 186230 102362 -145720 24404 115372 -74676 -29967 72669
85G2669o8376m5935Q3011K1416o1936k2512Q9018k1060j18981O1530Q4271j57126
$$ 72669 4293 -41642 41369 62785 849 -21663 67355 46295 -72686 -11156 73115 -84011
97h4011j0678J70113j05433j11110K08857k399j98207J46300J28589k12443o55
$$ -84011 -94689 75424 -30009 -141119 67738 65339 -132868 13432 142021 -70422 -71077
108g1077J87294j02751j08035J21619J3240p4958L1215J5462M74L3937m4407j6375
$$ -71077 116217 13466 -94569 27050 40290 -34668 -3453 12009 12483 46420 2013 -14362
120a4362P9251l5776q2539N9124K6040p8181L455M3690j8383p872J4282Q696J4586
$$ -14362 64889 29113 -53426 5698 31738 -46443 -42988 702 -17681 -25553 -11271 -2575 12011
133A2011p922k053K1533k1176q581L2574m0094k1679P5338l4631o9358J08136
$$ 12011 4089 2036 23569 2393 -6188 26386 -13708 -35387 39951 5320 -64038 44098
145D4098K0116j29448P8797R6027j53052p357J52127j12768r9820J59464j8151
$$ 44098 64214 -65234 13563 109590 -43462 -50819 101308 -11460 -111280 48184 30033
156C0033j51109J10602P7430j36585K8239J16146p8367m0223R2734k0263o5872
$$ 30033 -121076 -10474 66956 -69629 -41390 74756 -3611 -43834 48900 28637 -37235
167c7235M4759K3047n0990j756M7298l930m5031K9000O2045n9173m7884J03030
$$ -37235 7524 30571 -20419 -22175 25123 21193 -23838 5162 67207 8034 -39850 63180
179F3180p498j37004P3551R4027j59035k2173J73796q6240j21854J69166K8333
$$ 63180 55682 -81322 -7771 86256 -72779 -94952 78844 -7396 -129250 39916 68249
190F8249j66698Q6323J11360j42716j2850J31533p3328p3882J03325K178q2426
$$ 68249 -98449 -12126 99234 -43482 -56332 75201 1873 -72009 31316 33494 -48932
201d8932N1392M9797n2671n099M9690p023l9249N949L0661k7710m5928L6739K3085
$$ -48932 2460 52257 -414 -5513 44177 37154 -2095 3854 34515 6805 -39123 -2384 20701
214B0701o7794Q175P2263m8308l7897Q3456q197p2457N7622K7996p7478K2155
$$ 20701 -47093 -38918 33345 -14963 -52860 30596 22399 -50058 7564 35560 -41918 -19763
226a9763M9775n8879q03N8294l2649j3915N3227j5315k1923L7074j1182k5122
$$ -19763 30012 -28867 -29670 28624 -4025 -17940 35287 19972 -1951 35123 23941 -1181
238a181K3088j5688k3914K7482j4702k9552M0708M166m4536L3306L1041m6101
$$ -1181 21907 6219 -17695 9787 -4915 -34467 6241 10407 -34129 -823 30218 -15883
250a5883j435M1048k2187k8874K1205J0281j9726q036K1916J6037k4434R73M7432
$$ -15883 -17318 23730 1543 -27331 -6126 4155 -15571 -23607 -1691 14346 -10088 -9115 38317
263C8317j7525m2527N2260J4522q0127K4730O2339q0307k5084R6234l6553p2444
$$ 38317 20792 -21735 30525 45047 -35080 -10350 51989 -28318 -53402 42832 6279 -66165
275f6165Q9112K2589r5546M4750O6577q6647j5110Q7333m4435o5056P3235K3030
$$ -66165 22947 45536 -50010 -5260 61317 -25330 -40440 46893 2458 -62598 10637 33667
287C3667p6332J8775P1434l4058m4274N3957K8917o1853j0062N9187k4605o0591
$$ 33667 -42665 -23890 47544 13486 -30788 23169 52086 -9767 -19829 39358 14753 -45838
299d5838M5921K9301p0076J1001O8926n0523l3804Q2525j1481p6478N6263M0653
$$ -45838 83 29384 -40692 -29691 39235 -11288 -45092 37433 25952 -50526 5737 46390
311D6390q3746P26P1738m0924m0761N8614J1859m2807K1884L1577k3923q457K2471
$$ 46390 -37356 -36630 35108 -5816 -46577 12037 23896 -18911 2973 34550 10627 2170 24641
324B4641o093k2696M693J0795j8277j3777K1541M515k4856J1609K4620k0948q255
$$ 24641 18548 -4148 545 11340 -6937 -20714 827 5342 -19514 -7905 16715 -4233 -12488
337a2488K4045j2788j6968K0140j0629k0004K8238P19l0108L0187K4108l4587
$$ -12488 11557 -1231 -18199 1941 -8688 -28692 -454 265 -29843 344 24452 -10135
349a0135J0846L4933k6327r281K6989k0816j4059K6238k1077k0927M0508p010
$$ -10135 711 35644 9317 36 27025 6209 -7850 18388 -2689 -23616 16892 9882
361I882m0549L8851K3383n0891Q429M2305l7704k4042M0768j0992l7124K8416
$$ 9882 -30667 8184 31567 -19324 -10895 31410 -6294 -30336 10432 -560 -37684 -9268
373i268J6839l3111R378L5687j6541j6871L1759R264l2973L065K8747k0839k7063
$$ -9268 7571 -25540 -16162 19525 2984 -13887 17872 27136 -5837 -2772 25975 5136 -21927
386b1927K8763J0631l8042J0843L9209l0409j9893M9718o090n2808L3118L1913
$$ -21927 6836 17467 -20575 -9732 29477 -932 -20825 28893 22803 -30005 3113 35026
398C5026o1865q365O1940k9079n0399N7329K5589o2732J6705O0970m1816l2048
$$ 35026 -26839 -35204 26736 -2343 -52742 4587 30176 -32556 -15851 45119 3303 -28745
410b8745N9321l016o1243L1662L7103n7941q173O2126k3905m5739N4011K2130
$$ -28745 30576 27560 -33683 -2021 35082 -22859 -31032 31094 7189 -38550 15461 37591
422C7591o1275J2344N2609m2182l4048N0691n85n3428K3917L6401l8087r744M6406
$$ 37591 -23684 -11340 41269 -913 -34961 15730 15145 -38283 -14366 22035 -16052 -25796 20610
435B0610o064l1561K6559J9187l2169l987K6077j4142k2008J7873P215j9848N687
$$ 20610 14546 -17015 9544 28731 -3438 -7425 18652 4510 -17498 375 7590 -12258 -6571
448f571J7672j0495n474J5523k361j3750O516K445j4546m25P069o587k019Q528
$$ -6571 11101 606 -4868 10655 8294 -5456 1060 3505 -11041 -11466 -4397 -10984 -13003 -4475
462d475K053R7O549J663N52M552m237m445O145l789j2423P181R237j5045p03K1618
$$ -4475 -2422 -2325 4224 5887 6439 10991 6754 2309 8454 4665 -7758 -577 8660 -6385 -7088 14530
478A4530o588j7411J9828R719l0179J092K5877k4069k3466L3237J301l8164K2728
$$ 14530 7942 -9469 10359 20078 -10101 -9009 16868 -7201 -30667 2570 3871 -34293 -11565
491a1565L2516l6717m183M8486j7882l5390M0775J1298n0117J3645L8307l8006
$$ -11565 20951 -15766 -19949 28537 10655 -24735 16040 27338 -22779 -9134 29173 -8833
503h833j7035M7588n951l8157L0952K5155l9838l942L9103j8952l5809K7762J5254
$$ -8833 -25868 21720 15769 -22388 8564 33719 -6119 -10061 29042 10090 -25719 2043 17297
516A7297m1910n30M1161j9603k9400M0937J4619m5236J4802M1735l9845k1806
$$ 17297 -24613 -25143 16018 -3585 -32985 7952 22571 -22665 -7863 33872 -5973 -27779
528b7779N1014j1917m8491L8565K6045n1313P813N0655k9848k5403M4958O33m1378
$$ -27779 23235 11318 -37173 1392 27437 -23876 -16063 34592 4744 -20659 24299 24932 -16446
541a6446J7898K1498l3085p337K6270j0491j8964J9122J0820j8028K012K1633
$$ -16446 1452 22950 -10135 -17472 8798 -1693 -20657 -1535 9285 -8743 -6731 14902
553A4902q209j7285J5945Q156k5240o8K2695j4974j5225K4719L335k1118J5694
$$ 14902 6693 -10592 5353 13509 -11731 -11799 10896 -4078 -19303 5416 8751 -12367 3327
566C327J5074k0421J550J6755j6382p931J3928r735r056J2383m247n499J4625
$$ 3327 18401 -2020 -470 16285 -97 -8028 5900 -3835 -12891 -508 -4755 -10254 4371
579D371l330p727J8490k064j8636J5065Q026k4645K444J9081j5733r371J9450
$$ 4371 1041 -6686 11804 9740 -8896 6169 14195 -10450 -8006 11075 -4658 -14029 5421
592E421M99j1932J0050Q062r312j544P036l886j1391L114P422j3457p547K1168
$$ 5421 5920 -6012 4038 12100 2788 1244 8280 4394 -6997 -3883 3539 -9918 -17465 3703
606C703j233k3344J9800K2909l1769l669M0071k0890l2039L7882O973m6059J9519
$$ 3703 2470 -20874 -1074 21835 -9934 -13603 26468 5578 -26461 11421 18394 -27665 -8146
619h146L4441l8474o431M6744j6630l0695L5721J0371m0113Q267K6912k6219j7137
$$ -8146 26295 -12179 -18610 28134 11504 -19191 16530 26901 -13212 -4945 21967 -4252 -21389
632b1389K6780l57k5670J2658K0952j8881q509K7965l690k7793J8611J8233l4942
$$ -21389 5391 5034 -20636 -7978 12974 -5907 -14416 13549 9859 -17934 677 18910 -16032
645a6032l401L7446j9205k7995L8951J0288l9223J8324L1833l2603q084L3891
$$ -16032 -19433 18013 -1192 -29187 9764 20052 -19171 -847 30986 -1617 -9701 24190
657B4190j5632k5014K3986K792k6682J0528J5314j6050k011J5577j840r242M633
$$ 24190 8558 -16456 7530 10322 -16360 -5832 9482 -6568 -8579 6998 5158 -4084 549
670E49N978n934q604N113M897j2160j579J5452o082r209J8102L137j5931J1647
$$ 549 6527 593 -8011 -2898 1999 -10161 -11740 3712 -2370 -11579 6523 9660 -6271 5376
684E376J0132j9031K029J2793j5675m102J4552r916n306J6065o373o363J6728
$$ 5376 15508 -3523 -1494 11299 -4376 -8478 6074 -3842 -9148 6917 544 -5819 10909
697A0909n176j2207J5824k137j9916J4336N943k4314R070J8837k1509j241K6409
$$ 10909 5733 -6474 9350 7213 -12703 1633 7576 -16738 -7668 11169 -10340 -11581 14828
710A4828j0788j5309K1969K947k1972N868J3841j5065j0144J4827L362j5196K598
$$ 14828 4040 -11269 10700 13647 -8325 -2457 11384 -3681 -13825 1002 4364 -10832 -8234
723h234J9733p670j5518J8959J0330k7378K133K6636k1530j9482L1742j025l1694
$$ -8234 11499 3829 -11689 7270 17600 -9778 -7645 18991 -2539 -22021 9721 8696 -22998
736b2998K2446K1086l1561L097L2512k0595j8019K9798l273l0456J6215J5149
$$ -22998 -552 20534 -11027 -7930 24582 3987 -14032 15766 12493 -17963 -1748 13401
748A3401k5564k664K4157p043j6448J5689J1880j6983m432J8699m727k0091J0855
$$ 13401 -12163 -14827 9330 2287 -14161 1528 13408 -3575 -8007 10692 5965 -14126 -3271
761c271J2912k1006k987K4892r714j5359K3250N504k2914J2453J5056k3122o75
$$ -3271 9641 -11365 -14352 10540 826 -14533 8717 14221 -8693 3760 18816 -4306 -4981
774d981J9132j5890j0711J9280m800j4374J5536M463j3369P105P602j0734L64
$$ -4981 14151 -1739 -12450 6830 2030 -12344 3192 7655 -5714 1391 8993 -1741 -1377
787a377N257p090k242K577l194M73K862k044L407M438l359K293M474m141j856
$$ -1377 3880 -3210 -5452 -2875 -6069 -5596 -2734 -4778 -1371 3067 -292 2001 6475 2334 478
802D78K979k744j627o91j928M786L25o754Q320P205j2847J237J5007j2584j0350
$$ 478 3457 713 -914 -1605 -3533 1253 1578 -5176 3144 10349 -2498 -1261 13746 1162 -9188
817i188J6865m861j8063J4967N796j9799R285J6829j8218k145K3397j0954j6174
$$ -9188 7677 2816 -15247 -280 5516 -14283 -4998 11831 -6387 -8532 14865 3911 -12263
830a2263J8969L749k2458N250J6125j3913q121J7201K154j4719P902J4292j2713
$$ -12263 6706 10455 -12003 -6753 9372 -4541 -12662 4539 6693 -8026 -124 14168 1455
843A455q270J7727j494k2011J0046J5758k2121o444K6853p102k0648K1486J0206
$$ 1455 -6815 10912 9418 -12593 -2547 13211 -8910 -15354 11499 4397 -16251 5235 15441
856A5441k4540O969J8848k0317p166K1259j1007j5945J9400L093j9828J0028J6842
$$ 15441 -9099 -2130 16718 -3599 -10765 10494 -513 -16458 2942 6035 -13793 -3765 13077
869A3077j5308n432J7609k231j4777N799Q396j0306o054J0269R57j0249O098J0188
$$ 13077 -2231 -7663 9946 7715 -7062 -1263 7133 -3173 -9227 1042 1999 -8250 -2152 8036
883H036r099k305J4266m559j2504J1224M461j7400K691J2897j2075n525J5279
$$ 8036 -1063 -3368 10898 6339 -6165 5059 9520 -7880 -5189 7708 -4367 -9892 5387
896E387l015r415J1722K331j1069N711N662j1918l93Q501p679m789Q760k09n618
$$ 5387 2372 -7043 4679 7010 -4059 1652 7314 -4604 -4997 3504 -4175 -8964 -204 -413 -6031
911f031O148L585l860K230L096m176o95L124m083l857N467J08o356M485O924o045
$$ -6031 117 3702 -158 2072 5168 992 297 3421 -662 -4519 948 1056 -5300 -815 6109 64
927F4k574J0632k075j0006P351L489j3069J004J0706j0645n856J5685k809j3077
$$ 64 -2510 8122 6047 -3959 3392 6881 -6188 -5184 5522 -5123 -10979 4706 1897 -11180
941a1180J3697Q469j7668K610J6545j2386j2100J6489J695j8509O806J4365j1972
$$ -11180 2517 10986 -6682 -4072 12473 87 -12013 4476 6171 -12338 -5532 8833 -3139
954c139n189J6569m72j3240Q388R108j3619l287J2679o574j1979J1629N041j4562
$$ -3139 -8328 8241 7769 -5471 2917 12025 -1594 -4881 7798 1224 -10755 874 5915 -8647
968h647L607J4771r653p233J5429j269j5443Q925P544j6019M0J4085r853q421
$$ -8647 -5040 9731 78 -7155 8274 7005 -8438 487 8031 -7988 -7948 6137 -3716 -12137
982a2137J6603J021j4797J0249J1227j4244k795J4031n872j1976R079L732j0798
$$ -12137 4466 5487 -9310 939 12166 -2078 -4873 9158 3286 -8690 389 4121 -6677
995f677L109Q008o043q87Q975k822n784P713N58j0187K596P119r083m505J0002
$$ -6677 -3568 4440 -1603 -2490 6485 3663 -2121 5592 6150 -4037 -1441 5678 -3405 -7910 2092
1010B092p53q839O664P042p992l43Q760m396p213O906N45r525L059O528o954j451
$$ 2092 1339 -7500 -836 6206 -1786 -2129 6631 2235 -4978 1928 2473 -7052 -3993 2535 -4419 -5870
1026e870R479j554n665P690K078p998L517M277q615p23P954o463n214J0950r5
$$ -5870 3609 2055 -3610 4080 6158 -1840 1677 5954 -2661 -3384 4570 -1893 -7107 3843 3748
1041C748r999P982P804j0928r65J1229o961r064Q948R63j1459M681P720q390o55
$$ 3748 -6251 1731 9535 -1393 -2358 8871 1910 -7154 1794 2757 -8702 -4021 3699 -4691 -5346
1056e346J0416l034o610Q051K561r872J776P791q137n622J0870l43j0759P811
$$ -5346 5070 2036 -4574 3477 6038 -3834 -2058 5733 -2404 -8026 2844 2501 -8258 -447
1070d47R335j0631k278J4257m730j1807J0270M264j4816J603J1846r534o409J3914
$$ -447 8888 -1743 -4021 10236 5506 -6301 3969 8233 -6583 -4980 6866 -2668 -9077 4837
1084D837j339j0919R353O395j1759J026R632p934o713R336p99r536N139O785p150
$$ 4837 3498 -7421 1932 8327 -3432 -2406 7226 -708 -7421 1915 1116 -8420 -3281 3504 -3646
1099c646n48R812k555p396P970L885j1141M76R496p431p379J0738J832j0804N916
$$ -3646 -4194 5618 3063 -4333 3637 7522 -3619 -3143 6353 -1078 -8457 2281 4113 -6691 -775
1114g75Q718r127m52R968o243o048Q953l424r146P377L359j1089M139R508p673
$$ -775 7943 -1184 -1636 8332 2089 -3959 4994 1570 -7576 -199 3160 -7929 -3790 5718 -1955
1129a955k897J0668k286p478N563J981o695m0M359l265k715M288J480k540J341
$$ -1955 -4852 5816 3530 -3948 1615 3596 -3099 -3139 1220 -2045 -4760 -472 1008 -1532 -191
1144a91M255j675k382L392L33n669J779K674n644p0N871m043k732Q698j797o942
$$ -191 4064 2389 7 3399 3732 -1937 -158 2516 -3128 -3198 2673 -1370 -4102 4596 2799 -4143
1160d143Q167K777j1091K622P806r669m152J0327k935p599P540L863o764K521
$$ -4143 4024 6801 -4290 -1668 6138 -3531 -7683 2644 -291 -7890 -350 3513 -3251 -730
1174g30N970m767k495N336j987n162L076K764n315l35O506r62n556O241M796q855
$$ -730 5240 473 -2022 3314 1327 -3835 -759 2005 -3310 -3645 2861 1899 -3657 2584 7380 -1475
1190a475R7R975p502p985J0645P5j3208P585Q725j3324J222J4042q162p803J3838
$$ -1475 -1378 8597 1095 -6890 3755 3830 -9378 -1793 6932 -6392 -5170 8872 710 -7093 6745
1205F745j141j3918Q322N756j2578J017J0072o729m138R545R6n925M846L404n395
$$ 6745 5604 -8314 8 5764 -6814 -5797 4275 -2454 -6592 2953 3049 -2876 1970 5374 -21
1220b1o13M199k333m703L024K829n055p04O778j459n173O278K927q114J530O329
$$ -21 -634 3565 1232 -3471 -447 2382 -2673 -3377 3401 1942 -3231 3047 5974 -2140 -610 5719
1236E719p484l524Q596m351o819Q817J316q749N938O622q477L3Q155n566m651
$$ 5719 -1765 -5289 3307 -1044 -7863 954 2270 -6479 -541 6081 -2396 -2363 5792 226 -4425
1251d425O472j580n514M273K003m354K035M064k111j355M288J09m264P29L342
$$ -4425 2047 467 -5047 -774 1229 -3125 -1090 2974 863 -492 3796 3905 -359 370 3712
1266C712l587m614N032J700o996K878P254o814j924R685l831p969Q890R09j1655
$$ 3712 125 -4489 543 2243 -4753 -1875 5379 -1435 -3359 6326 2495 -5474 3416 4325 -7330
1281g330N229P066j1202m0J1401o096n016J0380k72q095N979L356p923P43N523
$$ -7330 -2101 4965 -6237 -6277 5124 -972 -5988 4392 4120 -3975 2004 5360 -2563 -1820 3703
1296C703n729k248N670j67m061L122L512k551j927L867J235n707J41M773m799
$$ 3703 -2026 -4274 1396 1229 -2832 290 3802 1251 -676 3191 4426 -1281 -1140 3633 -1166
1311a166m126P010j104o661O476M442q861K602Q565q417l302R808m239q718Q515
$$ -1166 -5292 1718 614 -6047 429 4871 -3990 -1388 7177 -1240 -4542 5266 1027 -7691 824
1326H24J819r834N629O326q106J004Q460m730l959P009r79o751L178L317n467
$$ 824 2643 -7191 -1562 4764 -3342 -2338 6122 1392 -2567 4442 3463 -3288 -110 3207 -2260
1341b260j145M990m47l528K852L757l659j519M713j194n686L463K377p771R97
$$ -2260 -3405 1585 1138 -2390 462 4219 560 -959 3754 2560 -3126 337 2714 -5057 -4060
1356d060P278n851l191R425j297p383P811K944r819L069O699q202k636Q784l462
$$ -4060 3218 -2633 -5824 3601 2304 -5079 2732 5676 -4143 -1074 5625 -2577 -5213 3571 109
1371A09o179P347K433o407L103M866m353j538M039j568l730K185R10l777R6L655
$$ 109 -6070 1277 3710 -2697 406 5272 919 -619 3420 1852 -1878 307 1217 -2560 -2464 1191
1387A191j299k908M414K224n838J483O101o271m243P942k003q254O487M287q624
$$ 1191 -108 -3016 1398 3622 -2216 -733 5368 -903 -5146 2796 793 -7461 -974 3313 -5311
1402e311K688Q226o338k326Q851l462o461P265L50p933L943M017o418K95O427
$$ -5311 -2623 5603 -735 -3061 5790 2328 -4133 3132 3482 -4451 -508 3509 -2909 -2614 3813
1417C813l164k455N493j48m656J653K827m052k350L582K65m588J114M596k784
$$ 3813 649 -1806 3687 3539 -1117 536 3363 -689 -3039 543 808 -3780 -2666 1930 -854
1432h54k428N807K01n534K868L926o385o81N757m596k931O681q48n731O520K854
$$ -854 -3282 2525 2726 -2808 60 3986 -2399 -3080 2677 -1919 -4850 1831 983 -4748 1772 4626
1448D626o673K198O040n848l208O974k287o242M506K456n604J159N097k680k513
$$ 4626 -2047 151 6191 343 -2865 4109 1822 -4420 86 2542 -3062 -1903 3194 514 -1999
1463a999M822K77n515K325L557n853j764O178j990o464O290L764p391J506Q306
$$ -1999 2823 3100 -2415 -90 3467 -2386 -4150 2028 38 -6426 -136 3628 -3763 -2257 6049
1478F049n718m925R085j158r237O033M722r500R25Q504n475m222R163k19p037
$$ 6049 331 -4594 4491 3333 -5904 129 4851 -4649 -3724 4780 -695 -4917 4246 4027 -3010
1493c010M206M316o614q93N216l471l701M200R45m484K127M212l115k013M589
$$ -3010 1196 5512 -1102 -1995 3221 -250 -3951 249 1194 -3290 -1163 3049 -66 -2079 2510
1508B510K72n271J585L264l782k682M424l06l792L158K528l203J665K387k763
$$ 2510 2782 -2489 -904 2360 -1422 -4104 320 14 -3778 -620 1908 -1295 370 2757 -6
1523fq0L007k458k748L341j92l959K911K496l552N13M071k000k425L823p59l498
$$ -6 -86 2921 463 -2285 1056 864 -3095 -184 2312 -1240 -727 3344 1344 -1081 2742 1983 -1515
1540a515J711J337m226K40L393k374j899M228N04l353K493K823m639n91M657l316
$$ -1515 196 1533 -2693 -2453 940 -1434 -3333 895 1399 -1954 539 3362 -1277 -1868 2789 -527
1556e27l904N400R78o477K759O257n135k409P591r33o616M241L267o568l29N397
$$ -527 -4431 969 1947 -4530 -1771 4486 -649 -3058 4533 3600 -3016 1225 4492 -2076 -2405 2992
1572B992l493l145N245P7m449L275L352n083j99N426l608m764N056J040o383J780
$$ 2992 -501 -3646 1599 1676 -2773 502 3854 -1229 -1428 3998 390 -4374 682 1722 -4661 -2881
1588b881N483m317k354O813o04n431M049L779n986j188O138k897n071N020K115
$$ -2881 2602 -1715 -4069 2744 2140 -3291 758 4537 -1449 -2637 3501 604 -4467 553 2668
1603B668n470J647N332l542k451N541p38n536L932J800n965J99N020l637l227
$$ 2668 -2802 -1155 4177 635 -1816 3725 2987 -2549 1383 3183 -2782 -2583 2437 -1200 -4427
1618d427N743K05m607L010L588m548l94M293k882l129L552L4l806K273K705k743
$$ -4427 1316 1521 -3086 -76 3512 -1036 -1430 2863 -19 -3148 404 438 -3368 -1095 1610 -1133
1634a133K18L133q21j641J969L44k397K77R71j738o52J982n36j381K122J096k341
$$ -1133 -915 2218 1397 -244 1725 2069 -328 -51 920 -818 -1470 512 -24 -1405 717 1813 -528
1651e28J022K089k485j231K518j299k997K631P62l448J740L023l595Q7M996k363
$$ -528 494 2583 98 -1133 1385 86 -2911 -280 482 -2966 -1226 1797 -1798 -1711 3285 922
1667I22l759M994O22o366K516L839n093j100N964j796m086N342J937n570J933
$$ 922 -2837 2157 2779 -3587 -1071 2768 -2325 -3425 2539 743 -3343 1999 3936 -1634 299
1682B99M237m517k490M779r04n356L172L988m782j551O299j163n089M245K786
$$ 299 4536 19 -2471 2308 1404 -3952 -780 3208 -1574 -3125 3174 2011 -3078 1167 3953
1697C953o068k29N668m217m307O234J74n857L626M715n404p49O521k667m533N046
$$ 3953 -2115 -2344 3324 -893 -5200 1034 1208 -4649 -1023 3692 -1712 -2461 4060 1393 -3140 1906
1713A906J025n897J689M118l905j899M736P1l107J850K979k894j776L312m23m208
$$ 1906 2931 -2966 -1277 2841 -1064 -2963 1773 1844 -1263 587 3566 672 -1104 2208 1785 -2423
1729b423J483K574l969r14M773j372l580M075J765l920Q94K446k598o55K220k168
$$ -2423 -940 1634 -2335 -3249 1524 152 -3428 647 2412 -1508 -614 1832 -766 -1421 799 -1369
1745a369p79L112j556j603L896k7k958K742J890l645L28K334l059m27K627k294
$$ -1369 -2148 964 -592 -2195 1701 1674 -1284 1458 3348 -297 31 2365 -694 -1121 1506 -788
1761g88j402L197k92k338K376J670k835m06K507j231k525J571J206k910J48K796
$$ -788 -2190 1007 715 -1623 753 2423 -412 -818 1689 458 -2067 -496 710 -2200 -2052 744
1777G44j079k267L721J404m477J562M448m704k302N698j304n724M083L591o066
$$ 744 -335 -2602 1119 2523 -1954 -392 4056 -648 -2950 2748 1444 -4280 -197 3394 -2672
1792b672O27N858l332k796N355o10m684L292J716m743l77M540k146l862M377K328
$$ -2672 -2045 3813 481 -2315 3040 2430 -2254 1038 2754 -1989 -2366 2174 28 -3834 543 2871
1808B871m739L46M871k013m157L553J925n522J58N425m145k755O383r25n376M963
$$ 2871 -1868 -1522 3349 1336 -2821 732 2657 -2865 -2707 2718 -1427 -4182 2201 1276 -4100 863
1824H63L503o379K73N997m137l479N634q84m825L534K068l880J192L492k265j493
$$ 863 4366 -2013 -1740 4257 120 -3359 2275 1391 -3434 100 2168 -1712 -520 2972 707 -786
1840g86L417p56k857P46J320j680j561J467J039j488o05K461l4j674J362Q23k074
$$ -786 2631 1875 -982 -236 1084 -596 -2157 -690 349 -1139 -1744 717 683 -991 371 1194 -880
1857h80J90J416j941k32J526j075o0K379j447j70K170n60j703K395k88k912J913
$$ -880 -690 726 -1215 -1447 79 -996 -1056 1323 -124 -294 1876 1316 -387 2008 1720 -1192 721
1874G21M65k831J060K308k991k84L534j834j582K548J47l141J265J763k879n96
$$ 721 1186 -1645 -585 1723 -1268 -1552 1982 148 -1434 1114 1261 -1880 -615 1148 -1731 -2327
1890b327K367k06k318J803K511k262r89L853m49l786K305K989n091p91N101k356
$$ -2327 40 -166 -2484 -681 1830 -432 -1421 2432 1983 -1803 502 3491 -1600 -2391 2710 354
1906C54l916N255J238n700K629M846n273j455N175k523m339M469P82n156J865
$$ 354 -3562 1693 2931 -2769 -140 4706 -567 -2022 3153 630 -3709 760 1542 -3614 -1749
1921a749L899l237j284M263k21l370J743K599l221j493L131j11l573J595L350
$$ -1749 2150 -1087 -2371 1892 1671 -1699 44 2643 -578 -2071 1060 949 -2624 -1029 2321
1936B321l358j375N163j272l886M052J158n257J812L512m247j430M501j452k975
$$ 2321 -1037 -2412 2751 1479 -2407 1645 2803 -2454 -642 2870 -1377 -2807 1694 242 -2733
1951b733L711Q03l087J840K122k903k24K007j534r12N90M02j295O51P01o66M04
$$ -2733 978 1781 -1306 534 2656 -247 -471 1536 2 -910 -320 82 -1213 -562 139 -527 -123
1968a23R0L51j31j9k11m49l47L87j40n24M81O86k16O78M14q58N83J482j950l47
$$ -123 -33 318 187 168 -43 -492 -839 -452 -592 -1116 -635 51 -165 513 927 69 652 2134 184 -163
1988a63K264j720k186K788l9l238K421J931l246M36K761k069j755L246j333l083
$$ -163 2101 381 -1805 983 944 -2294 127 2058 -1188 -752 2009 -60 -1815 1431 98 -2985
2004b985K144J734l438J85L253q77k246K752J653k849J34L019j849k103K526J014
$$ -2985 -841 893 -2545 -2360 893 16 -2230 522 2175 -674 -540 2479 630 -1473 1053 2067
2020B067l917J066L963l451j704N135r77m340L255K638n770j3M675l519l023M807
$$ 2067 -1850 -784 3179 -272 -1976 3159 2182 -2158 1097 3735 -2035 -2048 2627 -892 -3915 892
2036H92j38m208L130K349l855K39M286k428l276M259P27m215L84M092k170k294
$$ 892 754 -3454 -324 2025 -1830 -1591 2695 267 -3009 1250 1977 -2238 -1854 2238 68 -2226
2052b226L337J206k802P40K660k373j519K601l90l011J446J637l399J11L634j758
$$ -2226 1111 2317 -485 255 2915 542 -977 1624 1234 -1777 -331 1306 -2093 -1982 1652 -106
2068a06k036L324J34k811J354J549k175j80J732j611n93J790j2j365J598O63j277
$$ -106 -2142 1182 1316 -1495 -141 1408 -767 -947 785 -826 -1419 371 359 -1006 592 1255 -22
2085b2j56J321o34p91Q8J26k44n96K33J21M14J71k85Q04N63r26m96J223k04j807
$$ -22 -178 1143 509 -282 -194 -68 -312 -908 -675 -554 -140 31 -254 550 1113 187 -309 914 710 -1097
2105a097R52J238k022K68J947j012j355K479L20k715J160J998k941j017L257j823
$$ -1097 -145 1093 -929 -661 1286 274 -1081 1398 1718 -997 163 2161 -780 -1797 1460 -363
2121c63k636K861J266l681J418K699j941j180L390k93l622K438J925l569j28L758
$$ -363 -2999 -138 1128 -2553 -1135 1564 -377 -1557 1833 1540 -2082 356 2281 -1288 -1416 2342
2137B342j609k856L567J806l991N63L501k536k793L586K01m278R33L205l251j348
$$ 2342 733 -2123 1444 3250 -741 -178 3323 787 -2006 1580 1781 -2497 -1564 1641 -1610 -2958
2153b958M090r32l150L013J952m005M97L655k551k253L473K87l671K016L196l101
$$ -2958 1132 200 -2950 63 2015 -1990 -1493 2162 -389 -2642 831 1118 -2553 -537 2659 -442
2169d42l83L515p53k899K375J188k826l31K028j357j733J951L10k004P19J777
$$ -442 -825 2690 1937 -962 1413 2601 -225 -556 1472 115 -1618 333 643 -1361 -642 1135
2185A135j323p87J313m02j362R28L57r17m5J097k96n34J201K01m54P18N32p98
$$ 1135 -188 -975 338 -64 -1426 -498 -141 -1058 -1103 -6 -302 -836 365 566 112 830 1362 564
$$ [...]
8191A97
##END NTUPLES=NMR FID
##END=
