##TITLE=1H_DDQ-easychem
 aceton, 8 sc, 
 26.9.2019
##JCAMPDX= 6.0         $$ Bruker NMR JCAMP-DX V2.0
##DATA TYPE= NMR FID
##DATA CLASS= NTUPLES
##ORIGIN= UXNMR, Bruker Analytische Messtechnik GmbH
##OWNER= root
$$ XWIN-NMR		Version 3.5
$$ Thu Sep 26 15:50:03 2019 Russian Standard Time (UT+4h)  she@DPX200
##.OBSERVE FREQUENCY= 200.1315
##.OBSERVE NUCLEUS= ^1H
##.DELAY= (6, 6)
##.ACQUISITION MODE= SIMULTANEOUS
##.ACQUISITION SCHEME= undefined
##.AVERAGES= 8
##.DIGITISER RES= 18
##SPECTROMETER/DATA SYSTEM= spect
##.PULSE SEQUENCE= zg30
##.SOLVENT NAME= Acetone
##.SHIFT REFERENCE= (INTERNAL, Acetone, 0, 15.7039)
##AUDIT TRAIL= $$ (NUMBER, WHEN, WHO, WHERE, WHAT)
$$ ##TITLE= Audit trail, XWIN-NMR		Version 3.5
$$ ##JCAMPDX= 5.01
$$ ##ORIGIN= Bruker BioSpin GmbH
$$ ##OWNER= she
$$ F:/spectra/data/she/nmr/H-F/1/audita.txt
$$ ##AUDIT TRAIL=  $$ (NUMBER, WHEN, WHO, WHERE, WHAT)
(   1,<2019-09-26 15:48:29.18 +0400>,<she>,<DPX200>,
      <created by zg, POWCHK disabled, PULCHK disabled
       configuration hash MD5:
       00 E9 B6 7A A2 85 ED C7 34 08 36 98 17 FE 4E 26
       data hash MD5: 16K
       92 BE 90 CC 18 C5 85 19 A4 B7 9D E3 D6 DD BE 3E>)
$$ ##END=
$$ 
$$ hash MD5
$$ 27 A0 D6 7A 87 97 A8 09 03 66 13 E0 17 74 B0 92
##$RELAX= 
##$RELAX= 
##$RELAX= 
##$RELAX= 
##$RELAX= 
##$RELAX= 
$$ Bruker specific parameters
$$ --------------------------
##$DU= <F:/spectra>
##$EXPNO= 1
##$NAME= <H-F>
##$PROCNO= 1
##$TYPE= <nmr>
##$USER= <she>
##$AMP= (0..31)
100 100 100 100 100 100 100 100 100 100 100 100 100 100 100 100 100 100 
100 100 100 100 100 100 100 100 100 100 100 100 100 100 
##$AQSEQ= 0
##$AQ_mod= 1
##$AUNM= <au_zg>
##$AUTOPOS= <>
##$BF1= 200.13
##$BF2= 200.13
##$BF3= 200.13
##$BF4= 200.13
##$BF5= 200.13
##$BF6= 200.13
##$BF7= 200.13
##$BF8= 200.13
##$BYTORDA= 1
##$CFDGTYP= 0
##$CFRGTYP= 5
##$CHEMSTR= <none>
##$CNST= (0..31)
1 1 145 1 1 1 1 1 1 1 1 1 1 1 1 1 1 1 1 1 1 1 1 1 1 1 1 1 1 1 1 1 
##$CPDPRG= <>
##$CPDPRG1= <>
##$CPDPRG2= <>
##$CPDPRG3= <>
##$CPDPRG4= <mlev>
##$CPDPRG5= <mlev>
##$CPDPRG6= <mlev>
##$CPDPRG7= <mlev>
##$CPDPRG8= <mlev>
##$CPDPRGB= <>
##$CPDPRGT= <>
##$D= (0..31)
0 1.2 0 0 0 0 0 0 0 0.06 0 0.03 0 0 0 0 0.0002 0 0 0 0 0 0 0 0 0 0 0 0 
0 0 0 
##$DATE= 1569498508
##$DBL= (0..7)
120 120 120 120 120 120 120 120 
##$DBP= (0..7)
150 150 150 150 150 150 150 150 
##$DBP07= 0
##$DBPNAM0= <>
##$DBPNAM1= <>
##$DBPNAM2= <>
##$DBPNAM3= <>
##$DBPNAM4= <>
##$DBPNAM5= <>
##$DBPNAM6= <>
##$DBPNAM7= <>
##$DBPOAL= (0..7)
0.5 0.5 0.5 0.5 0.5 0.5 0.5 0.5 
##$DBPOFFS= (0..7)
0 0 0 0 0 0 0 0 
##$DE= 6
##$DECBNUC= <off>
##$DECIM= 24
##$DECNUC= <off>
##$DECSTAT= 4
##$DIGMOD= 1
##$DIGTYP= 9
##$DL= (0..7)
0 120 120 120 120 120 120 120 
##$DP= (0..7)
150 150 150 150 150 150 150 150 
##$DP07= 0
##$DPNAME0= <>
##$DPNAME1= <>
##$DPNAME2= <>
##$DPNAME3= <>
##$DPNAME4= <>
##$DPNAME5= <>
##$DPNAME6= <>
##$DPNAME7= <>
##$DPOAL= (0..7)
0.5 0.5 0.5 0.5 0.5 0.5 0.5 0.5 
##$DPOFFS= (0..7)
0 0 0 0 0 0 0 0 
##$DQDMODE= 0
##$DR= 18
##$DS= 0
##$DSLIST= <SSSSSSSSSSSSSSS>
$$ [...]
##$SUBNAM2= <"">
##$SUBNAM3= <"">
##$SUBNAM4= <"">
##$SUBNAM5= <"">
##$SUBNAM6= <"">
##$SUBNAM7= <"">
##$SUBNAM8= <"">
##$SUBNAM9= <"">
##$SW= 24.0689530833862
##$SWIBOX= (0..15)
0 0 2 0 0 0 0 0 0 0 0 0 0 0 0 0 
##$SW_h= 4816.95568400771
##$TD= 16384
##$TD0= 1
##$TE= 0
##$TE2= 300
##$TE3= 300
##$TEG= 300
##$TL= (0..7)
0 120 120 120 120 120 120 120 
##$TP= (0..7)
150 150 150 150 150 150 150 150 
##$TP07= 0
##$TPNAME0= <>
##$TPNAME1= <>
##$TPNAME2= <>
##$TPNAME3= <>
##$TPNAME4= <>
##$TPNAME5= <>
##$TPNAME6= <>
##$TPNAME7= <>
##$TPOAL= (0..7)
0.5 0.5 0.5 0.5 0.5 0.5 0.5 0.5 
##$TPOFFS= (0..7)
0 0 0 0 0 0 0 0 
##$TUNHIN= 0
##$TUNHOUT= 0
##$TUNXOUT= 0
##$USERA1= <user>
##$USERA2= <user>
##$USERA3= <user>
##$USERA4= <user>
##$USERA5= <user>
##$V9= 5
##$VALIST= <valist>
##$VCLIST= <CCCCCCCCCCCCCCC>
##$VD= 0
##$VDLIST= <DDDDDDDDDDDDDDD>
##$VPLIST= <PPPPPPPPPPPPPPP>
##$VTLIST= <TTTTTTTTTTTTTTT>
##$WBST= 1024
##$WBSW= 4
##$XGAIN= (0..3)
0 0 0 0 
##$XL= 0
##$YL= 0
##$YMAX_a= 136644
##$YMIN_a= -165950
##$ZGOPTNS= <>
##$ZL1= 120
##$ZL2= 120
##$ZL3= 120
##$ZL4= 120
##$ABSF1= 10
##$ABSF2= 0
##$ABSG= 5
##$ABSL= 3
##$ALPHA= 0
##$AQORDER= 0
##$ASSFAC= 0
##$ASSFACI= 0
##$ASSFACX= 0
##$ASSWID= 0
##$AUNMP= <proc_1d>
##$AZFE= 0.1
##$AZFW= 0.1
##$BCFW= 1
##$BC_mod= 2
##$BYTORDP= 1
##$COROFFS= 0
##$CY= 11.3945322036743
##$DATMOD= 1
##$DC= 2
##$DFILT= <>
##$DTYPP= 0
##$F1P= 20.1720416913024
##$F2P= 0.152960286110954
##$FCOR= 0.5
##$FTSIZE= 0
##$FT_mod= 4
##$GAMMA= 1
##$GB= 0.15
##$INTBC= 1
##$INTSCL= 1
##$ISEN= 128
##$LB= 0.24
##$LEV0= 0
##$LPBIN= 0
##$MAXI= 10000
##$MC2= 0
##$MEAN= 0
##$ME_mod= 0
##$MI= 1.114404
##$NCOEF= 0
##$NC_proc= 0
##$NLEV= 6
##$NOISF1= 3.799351
##$NOISF2= 2.8
##$NSP= 1
##$NTH_PI= 0
##$NZP= 0
##$OFFSET= 15.70392
##$PC= 1
##$PHC0= -9589.537
##$PHC1= 40.00095
##$PH_mod= 1
##$PKNL= yes
##$PPARMOD= 0
##$PSCAL= 0
##$PSIGN= 0
##$REVERSE= no
##$SF= 200.130013532006
##$SI= 16384
##$SIGF1= 3
##$SIGF2= 2
##$SINO= 400
##$SIOLD= 16384
##$SREGLST= <1H.CDCl3>
##$SSB= 0
##$STSI= 0
##$STSR= 0
##$SW_p= 3612.71676300578
##$SYMM= 0
##$S_DEV= 0
##$TDeff= 0
##$TDoff= 0
##$TI= <>
##$TILT= no
##$TM1= 0
##$TM2= 0
##$TOPLEV= 0
##$USERP1= <user>
##$USERP2= <user>
##$USERP3= <user>
##$USERP4= <user>
##$USERP5= <user>
##$WDW= 1
##$XDIM= 8192
##$YMAX_p= 0
##$YMIN_p= 0
$$ End of Bruker specific parameters
$$ ---------------------------------
##NTUPLES= NMR FID
##VAR_NAME=  TIME,          FID/REAL,        FID/IMAG
##SYMBOL=    X,             R,               I
##VAR_TYPE=  INDEPENDENT,   DEPENDENT,       DEPENDENT
##VAR_FORM=  AFFN,          ASDF,            ASDF
##VAR_DIM=   8192,          8192,            8192
##UNITS=     SECONDS,       ARBITRARY UNITS, ARBITRARY UNITS
##FACTOR=    0.0002076,     1,               1
##FIRST=     0,             0,               0
##LAST=      1.7004516,     0,               0
##MIN=       0,             -165950,         0
##MAX=       1.7004516,     136644,          0
$$ Real data points
##PAGE= N=1
##DATA TABLE= (X++(R..R)), XYDATA
0@%%%%%%%nJ3j6J6j6K2l0L3m1N1o0P2q5R7j11J32j56J79k03K34k67L01l41L86
31B05m34M85n45O09o78P57q42R35j036J148j272J408j558J725j913K124k363K637
49A392k950L314l752M285m944N789o919Q509j0940J5168k4556P9895m5262j78227
63a59198R2120J58855K2127j43688o0575P1973P6007l7328m4072K2771L1559m8596
75a8045m1483O1369Q9374m6826j33123j5170J49587R0961j10935j53069L7491
86h9869J64684M4401j30226r4816O9052J04494j9333q0850k353N7261l388n3988
98c4931J2029P5228K70j00424m2172J03349R8355o8686j40448L184J45093O6406
110A17253j08211j12836M8698J20299N841r7662l5379O7036L8862m9891l2803
$$ plain form
0 0 0 0 0 0 0 0 0 -5 8 -8 8 -8 14 -16 17 -24 27 -33 39 -46 51 -60 72 -84 95 -108 126 -141 160 -181 205
31 205 -229 256 -289 320 -358 399 -443 492 -544 604 -668 740 -818 907 -1006 1118 -1245 1392
49 1392 -1558 1756 -1996 2289 -2655 3134 -3785 4724 -6216 8952 -15604 64291 19029 -159198
63 -159198 -67078 91777 113904 -29784 -90359 -18386 57621 20293 -23779 -1008 30551 -18045
75 -18045 -59528 1841 91215 44389 -88734 -103904 45683 136644 25709 -127360 -89869
86 -89869 74815 119216 -11010 -105826 -36774 67720 48387 -32463 -34816 22445 19057 -34931
98 -34931 -22902 52326 52596 -47828 -90000 13349 111704 43018 -97430 -94246 50847 117253
110 117253 9042 -103794 -55096 65203 71044 -26618 -61997 5039 43901 -5990 -38793
121c8793N2121L7456o0947o2511N6805R8612k5995j24081k7708J19898Q4827q1706
133B7978j21202K3591J23885L0391r6842o2405N9360O8617l1066o0787J9970N6777
145C8267j9337o5453J1817Q3051J3173r4567n3563Q3194R5845m5861j19959p236
157h0629J14334N6534q3206q4139M1491Q6591p273p3140j0698N9444J5741n4720
169a9670k1183N8395L7450n8611o4461M3581R1672r949j03327l5550R1499P5212
181H5058n6978r6086J4804R3298J9939p4114l9533N2879M4403l8176m6395L2152
193h749N3042k5570o6952J0104P9847J8343q1376n3473O3411Q3168k9411r4935
205e2551j0755Q6294M3901o3025o1402L6078O4440j4836o0521K756N7343O631
$$ plain form
121 -38793 13328 50784 -10163 -72674 -15869 82743 56748 -67333 -95041 24857 109684 27978
133 27978 -93224 -69633 54252 84643 -12199 -74604 -15244 53373 22307 -38480 -18510 38267
145 38267 18930 -46523 -34706 48345 61518 -33049 -86612 -3418 92427 46566 -73393 -80629
157 -80629 33705 90239 7033 -77106 -35615 50976 43703 -29437 -40135 19309 35050 -19670
169 -19670 -40853 17542 54992 -3619 -68080 -24499 67173 57224 -46103 -81653 9846 85058
181 85058 28080 -68006 -53202 40096 60035 -14079 -53612 -733 43670 5494 -40901 -8749
193 -8749 44293 18723 -48229 -38125 41722 60065 -21311 -74784 -11373 71795 42384 -52551
205 -52551 -63306 22988 66889 3864 -57538 -21460 42980 28144 -32377 -29621 27722 34353
217C4353n8198k0340O0309L9708n3994o3182L4772Q1089l687q4654l1202P0797
229E771N8367m4005p0746J4037O9003R623n8385k3898M7014L1347l8658l8696
241c9226L3252M9067k3908o1596O216O9733J9290o6422m6510M9360O6706k2447
253C3515p2908o673O4964K9570m9457m1028L1482M5401j8304m6103Q641M8426
265B7526Q74n1835j5254N2133L4867m4356n4390K5564O6796K39o6637k6609N4515
278C433M5747l4881n3563J4377N2717J166m7825j1471M2595K0318l9012l0101
290c6500L3659M2516k2641n3309M312N7911J8057n2828l8695L7089N2154j5947
302B5778n5549m038M9682J9081l9678k8247K9863L3575k1325l8034J2790M3002
$$ plain form
217 34353 -23845 -44185 16124 55832 1838 -61344 -26572 54517 50830 -33824 -65026 5771
229 5771 64138 20133 -50613 -36576 32427 42050 -16335 -40233 6781 38128 -530 -39226
241 -39226 -5974 43093 19185 -42411 -36195 33538 52828 -13594 -60104 -10744 55962 33515
253 33515 -39393 -46066 18898 48468 -989 -42017 -10535 34866 16562 -29541 -20900 27526
265 27526 28400 -23435 -38689 13444 48311 3955 -50435 -24871 41925 42164 -24473 -51082 3433
278 3433 49180 14299 -39264 -24887 27830 28996 -18829 -30300 12295 32613 -6399 -36500
290 -36500 -2841 39675 17034 -36275 -31963 25948 44005 -8823 -47518 -10429 41725 25778
302 25778 -29771 -33809 15873 34954 -4724 -32971 -3108 30467 9142 -28892 -16102 26900
314B6900k271m6287j2107M4322K8872l5389m2630J8966N0468J00m8901j7882L9277
327C438L0754k6372l6831J3703L8012l249l6834n553L5258J4285l2857k4952K7990
340c208L5421j8099m2745L044M5231J3458l9906k8712K9185L7180j4145l9602
352b2898J54L6434J0837l0973j7906K4832K3226j8760k8951J2460L3636k583l6758
365a7250r837L5483K2961k7989l3598J5045L8857m98l7244j2058L0569K0779k1757
378C463k5381J3696K6432o093k7975j02K8396P602k7021j7354K3452K6069j4768
391A0416l2299K537L3415J0246k9034j9861K0111K5770j0186k7343K002K5489
403A1263M514k3392r899K0770J5656j7501k0774J1810K5665l552k7678o342K5676
$$ plain form
314 26900 24629 -21658 -33765 10557 39429 4040 -38590 -19624 30844 30944 -17957 -35839 3438
327 3438 34192 7820 -29011 -15308 22704 19455 -17379 -22932 12326 26611 -6246 -31198 -3208
340 -3208 32213 14114 -28631 -25587 19644 33102 -6804 -35516 -6331 30849 16704 -22898
352 -22898 -22744 13690 24527 -6446 -24352 480 23706 4946 -24005 -11545 22091 19508 -17250
365 -17250 -27087 8396 31357 3368 -30230 -15185 23672 23174 -14070 -26128 4441 25220 3463
378 3463 -21918 -8222 18210 12117 -15858 -15960 12436 20038 -6983 -24337 -885 25184 10416
391 10416 -21883 -19346 14069 24315 -4719 -24580 -4469 21301 11115 -16228 -14226 11263
403 11263 15777 -7615 -17514 3256 18912 1411 -19363 -7553 18112 14560 -13118 -19460 6216
416F216J5942j9821k2745J0541K5751j515k4205o729K0951J2352j6567j5959J1744
429d044J8878o856k1279J728K2060N179k1440j2172J7696J8526j1484k2360L010
442a2558K3171N296k0533j1904J5315J6285r800j7629L873J7710J462j6925n631
455a1868J4956J0262j3025j4497R288J7960l103k0039l642J8804J0262j4605j4968
468a4215Q616J7067k673j6398k731J4567N914j1717q367R242J0608o405j3455
481i947L321J5253J621j5111p432J3077J1821q341j4930K184J5767K997j3617
494c337o866J0294R258o974j0731M647J1131j626j2213q47J1995M873j1019q882
508a0297P716J1904l482j2719j689J2160N597r377q369N882R853k755r840J83
$$ plain form
416 6216 22158 2337 -20408 -9867 15884 14369 -9836 -16565 4386 16738 171 -15788 -4044
429 -4044 14834 7978 -13301 -11573 10487 15666 -5774 -17946 -250 18276 6792 -15568 -12558
442 -12558 10613 15909 -4624 -16528 -1213 15072 5272 -12357 -8484 9226 10688 -6237 -11868
455 -11868 3088 13350 325 -14172 -4884 13076 9973 -10066 -13708 5096 15358 753 -14215
468 -14215 -5599 11468 8795 -7603 -10334 4233 10147 -1570 -9937 -695 9913 3508 -9947
481 -9947 -6626 8627 10248 -4863 -12295 782 12603 4262 -10668 -8484 7283 10280 -3337
494 -3337 -10203 91 9349 2375 -8356 -3709 7422 5796 -6417 -7264 4731 9604 -1415 -10297
508 -10297 -2581 9323 5841 -6878 -8567 3593 9190 -187 -8556 -2674 7179 4424 -5416 -5233
522e233R176K481r267m470P903P445o074r702L419J0731L7j0542l800Q807P047
537G958o523q168L174Q558k75q029k096O860M034n234n660L893O448k034p155
552d249k95P795K585p322m676N438O786k952q348Q18Q017J789o776m184N081N182
568D689k918n664J269N814k00n806q63N463K829m799m682L297O124j391o311j820
584d969O249L711m089n391K435N340n48n193n28M595J731m498k343L854L595l264
600F87m818J969N380M57n367k395M143L586j969m449N27M168N89l454j866L218
616D06K052k873k522K340L475j517l846k29M293J681l891k819K628L769j353l882
632b288J1L797N11l162j393K609J939j678k495N16L254O3k834j253K849K252k123
$$ plain form
522 -5233 3943 6424 -2843 -7313 590 8035 1961 -7741 -4322 6409 6446 -4096 -7896 911 7958
537 7958 1435 -6733 -3559 4999 4724 -3305 -5401 1459 5493 259 -5401 -1508 4940 2906 -4249
552 -4249 -4544 3251 5836 -1486 -6162 -724 6062 3110 -5238 -4420 3597 5386 -1390 -5574 -493 4689
568 4689 1771 -3893 -2624 3190 2990 -2816 -3679 1784 4613 -186 -4868 -1571 4553 3162 -3149 -4969
584 -4969 1280 4991 902 -4489 -2054 3286 2738 -2455 -2983 1612 3343 -1155 -3498 356 3951 687
600 687 -4131 -2162 3218 3675 -1692 -4087 56 3642 1673 -2776 -2249 1919 2508 -946 -2812 406
616 406 2458 -415 -2937 -597 2878 1361 -2485 -2714 1579 3260 -631 -3450 -822 2947 1594 -2288
632 -2288 -2277 1520 2031 -1131 -2524 85 2024 346 -2149 -1633 1621 1684 -1150 -2403 446 2698 575
649E75k990J208L117O6l472j026L171J864k381k607J986K572p03k676k27K379
665H56R51k013j638J723J872j128k131M23K458K97k485j403K203K282j239k609
681a581m47L300N60k086j402J586J826j329j874P88K179n69k196J01K146M16j510
698i2j970J498K366m85k259n63J745J234r81j695O07J262r8j301p1J727N85j869
716c60j174J806J350j195j939L02K304O37k070r79J071J424o06j205k61J548K92
733I45j441l51J233R06j278j034K26J886L20k036j086J808J218o52j753K02J834
750I47n9j695l42J431J012j353j219J066J253k38j357m87J574J73o65p37J46J226
768F76J09j518j91J581M01j215j081R61J685l32j942n72J746R41j245j019P38
$$ plain form
649 575 -2415 -1207 1910 1976 -1496 -2522 649 2513 132 -2475 -489 2083 1380 -1296 -1523 856
665 856 1807 -206 -1844 -121 1751 623 -1508 -1085 1373 1670 -815 -2218 -15 2267 1028 -1581
681 -1581 -2028 1272 1832 -254 -1656 -70 1756 427 -1447 -659 1520 951 -1245 -1144 1002 1418 -92
698 -92 -2062 -564 1802 1317 -942 -1505 240 1474 493 -1202 -595 667 569 -732 -803 924 1509 -360
716 -360 -1534 272 1622 427 -1512 -1210 1094 1731 -339 -1318 -247 1177 571 -634 -895 653 945
733 945 -496 -847 386 1292 14 -1020 -794 1092 1412 -624 -1710 98 1316 664 -1089 -887 947
750 947 888 -807 -1149 282 1294 -59 -1278 -212 1041 803 -554 -1041 533 706 41 -696 -550 676
768 676 785 -733 -924 657 1058 -157 -1238 -277 1408 1076 -866 -1438 308 1249 4 -1015 -277
785b77J272m71r72k32J065P01j462o25R58J289p33j620j31J665J128j725r85M09
803g46J865j27j935r9J384Q53j591r87J013J650j264j595O18J861M06k100j057
820a851J252K027n61j862J34J336N96j348j213J437J290j166j271L94K094j70
836A118k015q29K488J199j792k252R33K518k23k034n04J440J169j206j359Q35
852e14J780o04j981j84K226J014j684j747J053K090l93k141m37K284R44j818j616
869a728J491K012j047k373K48K635L21k111j470K129J596j040k216L98K194O76
885A715k235j095J981J179r58k150N45K752k32k737p37K441J883k305k163Q35
901a281L126n17k294r89K653R11j492j900J322K096q44k412L0K720O67k194j830
$$ plain form
785 -277 995 524 -448 -680 385 1086 -376 -1001 -43 1246 513 -1107 -1238 427 1555 -170 -1155 -746
803 -746 1119 992 -943 -1042 342 1195 -396 -1383 -370 1280 16 -1579 -961 900 1306 -794 -1851
820 -1851 -599 1428 867 -995 -861 475 1071 -277 -1490 -53 1237 71 -1200 -806 1288 1118
836 1118 -897 -1726 762 1961 169 -2083 -1150 1368 1145 -889 -1393 47 1216 10 -1349 -514
852 -514 1266 662 -1319 -1503 723 1737 53 -1694 -641 1449 1056 -1085 -1522 762 1706 -112 -1728
869 -1728 -237 1775 728 -1645 -1397 1238 1559 -552 -2022 107 1703 663 -1553 -1155 1039 1715
885 1715 -520 -1615 366 1545 587 -1563 -1018 1734 1502 -1235 -1972 469 2352 47 -2116 -1281
901 -1281 1845 1328 -966 -1955 698 1609 117 -1783 -461 1635 791 -1621 -1591 1129 1796 -398 -2228
918b228J743K621r04k831j96K649J273k721j194J440K355j045k541N80K627J78
934A806k684j367K480J990j742k502Q02K984J49k544j012J905J561j255k164R92
950f01K357k82k688o84K443J867k507k304J612K717k43l350k61K838J270k349
966a65j849J689K297j259k374O1L293L81l030j176K156K192j549k360M26K500
982A233L71k450j120K524J707j853k244Q90K651l62k920k87K439J659j984k555
998b301J883K352m68k631n56K379Q12j778j839J907K343j001k632p8K484J249
1014B125k959j613K326J974j247k266L57K781J02k357r62J948J681j509k182Q47
1030i54K553j91k657n54K514J596k049k267J247K338l76k387j49J672J346j897
$$ plain form
918 -2228 -485 2136 1232 -1599 -1795 854 2127 -594 -1788 -348 2007 962 -1579 -999 1628 1806
934 1806 -878 -2245 235 2225 483 -2019 -1217 1767 1916 -628 -1640 265 1826 571 -1593 -601
950 -601 1756 1474 -1214 -1898 545 2412 -95 -2399 -787 1930 1687 -1663 -1924 914 2184 -165
966 -165 -2014 -325 1972 713 -1661 -1600 1693 2074 -956 -2132 24 2216 667 -1693 -1267 1233
982 1233 1604 -846 -1966 558 2265 412 -1832 -942 1709 1347 -1573 -1860 579 2238 254 -2301
998 -2301 -418 1934 1466 -1165 -1721 658 1470 -308 -2147 -240 2103 1102 -1530 -1608 876 2125
1014 2125 -834 -2447 -121 1853 606 -1660 -1303 1478 1580 -777 -1739 209 1890 381 -1801 -954
1030 -954 1599 1408 -1249 -1803 711 2307 258 -2009 -762 1576 1200 -1187 -1336 336 1682 -215
1046b15j594J662K221j159k827K05K751R81k374j919K164J898r11k560L40K793
1062A456p5k224q93J948J704j821k118J109K483l24k356o99K246J540k128j849
1078b001J392J991k85k185j57K149M49j580j485J639J782q84k400K45K656L55
1094A681k247r05J312J769j230k060O59K161J09k401j2J488J278j342k057J021
1110g76K255L8k394p60K005J361j946j271Q33J832j75k355M61J746L40j905j041
1127a752J672J808j252j887L28K269K32j695j157J391J546j298j450N76J973k98
1143A006j721m93J668J068j285k053J188K065m96k097j19J913N47j059j501J477
1159A08J365j198j473M60J727K55j807j000J541J704j169j672M78J543K28j746
$$ plain form
1046 -215 -1809 -147 2074 915 -1912 -1707 1044 2025 -349 -2268 -104 1794 883 -1677 -1337 1456
1062 1456 1381 -843 -1736 212 1916 95 -2023 -914 1569 1245 -1111 -1810 436 1976 -152 -2001
1078 -2001 -609 1382 1097 -1088 -1245 904 1353 -227 -1712 -73 1709 825 -1575 -1330 1326 1681
1094 1681 -566 -1471 -159 1610 380 -1680 -1021 1140 1249 -1152 -1164 324 1602 260 -1797 -776
1110 -776 1479 1517 -877 -1637 368 1729 -217 -1488 -655 1177 1002 -1353 -892 854 1194 -711 -1752
1127 -1752 -80 1728 476 -1411 -1083 1186 1418 -277 -1434 -43 1503 205 -1245 -669 1304 1006
1143 1006 -715 -1208 460 1528 243 -1810 -622 1443 947 -1150 -1269 644 1191 132 -1369 108
1159 108 1473 275 -1198 -738 989 1244 -563 -1563 -22 1682 513 -1159 -681 862 1090 -656
1175f56l94J348R94q51j646Q45J599o18j412m66J930Q29j877j069J082J369l79
1192F28j655J91J797j61j114p38R03J366o32j891Q84J471j45j531l56J169J254
1209A440j221j786O91J913m99j190m77J478P49j154r81P04J709o66j944L78J688
1226H32L28j514r88J229J440j024j222J93J416L76j619r03J939P25j205j019N81
1243d35J681l92j817k43J770Q52j657j119R76J161k52j186k63J571M46j632q91
1260a430J311J436r32j850N50J782K87j667q78J193J417q96j197L92J287j2j580
1277g87l68J613P18r00j789J064J779p26j415m28J694P89j165j342J023J247n33
1294D74j618L61J476R7j129q03J055J410p74j702K47J555O54j552o78O01J356
$$ plain form
1175 -656 -1050 298 1292 441 -1205 -360 1239 621 -791 -1257 673 1502 -375 -1444 -362 1007 628
1192 628 -1027 -836 961 800 -314 -1052 -149 1217 585 -1306 -422 1049 904 -627 -983 186 1440
1209 1440 219 -1567 -876 1037 538 -652 -1129 349 1098 -56 -1037 -333 1376 710 -1234 -856 832
1226 832 1160 -354 -1342 -113 1327 303 -919 -726 690 1066 -553 -1456 483 1208 3 -1016 -435
1243 -435 1246 854 -963 -1206 564 1416 -241 -1360 -384 777 525 -661 -924 647 1093 -539 -1430
1260 -1430 -119 1317 385 -1465 -915 867 1154 -513 -1391 -198 1219 323 -874 -482 805 793 -787
1277 -787 -1155 458 1176 276 -1513 -449 1330 604 -811 -1239 455 1244 79 -1263 -240 1007 474
1294 474 -1144 -783 693 790 -339 -1142 -87 1323 549 -1153 -906 649 1303 -249 -927 -326 1030
1311A030o50j728Q38J764l91j581o04K062O02j444j174Q10J351j49j347l78J184
1328A95Q72q80j266J080O63l82j126K71J434r0j003j050J099J286n64j681L21
1345h21J588L87j404m76O82J008o31j218N34J317n78r78o23J408Q40j055j029
1362a049M58J596p8j473l90J194O26p40r86N57J351p34j316K95J288M01j100r68
1380a068J006J103n94j152j93J184N14q19o66P90O49n13r33M96O87L02j330l19
1398h56Q54O12o4j759N61J219J44j084j9L70N70m37p12K95P97k86p73j92J028
1417B68M25q77p47P49O59L18j079n43Q94M82l12q87O42P49k84j315L15R76L16
1436G49j259n33R96Q45k79j301K45R96j7o78l18P13K23n53k47K74M79K86r86m65
$$ plain form
1311 1030 380 -1348 -510 1254 863 -718 -1322 740 1342 -102 -1276 -466 885 736 -611 -989 195
1328 195 1067 187 -1079 1 664 282 -844 -573 861 771 -232 -1282 -183 1103 539 -1142 -821
1345 -821 767 1154 -250 -726 -44 964 333 -885 -351 966 388 -590 -1213 195 1035 -20 -1049
1362 -1049 -591 1005 927 -546 -936 258 884 144 -842 -285 1066 332 -984 -689 599 1000 -100 -1068
1380 -1068 -62 1041 447 -705 -898 286 800 -19 -685 105 754 241 -692 -196 491 793 -537 -856
1398 -856 -2 610 546 -1213 -652 567 711 -373 -392 -22 548 111 -601 -306 491 205 -568 -760 268
1417 268 693 -184 -931 -182 477 795 -284 -827 67 549 237 -650 -8 741 457 -858 -543 433 749
1436 749 -510 -1043 -47 798 519 -782 -537 459 442 -236 -554 159 382 -171 -418 -144 335 621 -365 -830
1456h30Q81P64o08o81J01O73M02j041j02L29L54k63n92M90P42k22q04j20Q81J74
1476E28p72m20N33R72k40p90m86Q05L79l26l71k12N63J83p84J73O17J63p90k22
1496d97M37O76j49j002rQ99L39o98m33O1P70k51p79N08K96K05m15o37L88Q90k64
1517C35r11O5O35O89q93r32N68J143k99j082M22O68J26q38l07P47N63l15r84K10
1537c90R11L9m16p00L95R78l57j014J00Q86J13q56jL16Q05p24q78N76R17L2j162
1558d30l16O99O83m14j017N63O51k41n63k51J048J74n89p68P55J133p76q44P2
1577d31Q69M78j049r16O32J424m70r02l64R48O05j159o28J038R18p74j105K01
1595f85J208K21j094o54J112J010m17j480J74J345K55j390o49J153P20o14j159
$$ plain form
1456 -830 51 815 207 -474 -373 300 702 -339 -441 -112 242 -21 -613 -123 619 397 -407 -527 354 528
1476 528 -244 -664 -131 841 601 -189 -675 130 509 183 -188 -400 163 346 -438 -265 352 515 -275 -497
1496 -497 -60 616 467 -535 -544 355 694 -4 -437 -376 394 143 -636 -128 168 373 -42 -679 -291 599 335
1517 335 -576 -511 124 813 -80 -1012 -444 699 400 -682 -260 408 534 -304 -611 136 699 384 -600 -390
1537 -390 521 560 144 -556 -161 817 460 -554 -454 432 545 -311 -312 4 809 85 -793 -217 700 732 -430
1558 -430 -746 -47 636 222 -795 -232 419 178 -385 -636 412 586 -3 -771 -16 1117 341 -503 -431
1577 -431 438 916 -133 -1049 -417 1007 537 -365 -729 219 824 -335 -963 75 993 219 -886 -685
1595 -685 523 744 -350 -1004 108 1118 701 -779 -605 740 995 -395 -1044 109 829 215 -944
1612i44K58J570k60j367j39J330O93j199j039Q67J163l12j293k14J178Q17j254
1629a45q61Q19J396r36j212J24J565M25j649p16J243J115q60j197K82J872k34
1646A031j533o67J771L91j312j209J148J575k82j896j45J630R36j527j175R61
1662c03J423k82k012N0J793M46j479j085J393J216n93j891L39K120J42j872j331
1679a926K050J254j110j543N72K068l44j852q24K304Q95j529j914J384K053n16
1695A022j973l30J643J273j706j504J301J806m83k465J90K096R57k642j200K038
1711B3J972j668k150L72K964R5k392r20J801J820j445k267J056K484n08k311q90
1728a964K918J317k475k457K237K430q40k879P5K614J239k559j954J957K456j125
$$ plain form
1612 -944 -686 884 624 -743 -882 448 1141 -58 -1097 -230 933 621 -672 -886 292 1109 -145
1629 -145 -1006 -187 1209 273 -939 -815 750 1175 -474 -1190 53 1168 308 -889 -607 1265 1031
1646 1031 -502 -1169 602 993 -319 -1528 -380 1195 913 -983 -1128 502 1438 -89 -1264 -303
1662 -303 1120 838 -1174 -1124 669 1115 -364 -1449 -56 1160 567 -1324 -985 1135 1277 -595 -1926
1679 -1926 124 1378 268 -1275 -703 1365 1021 -831 -1655 649 1544 15 -1899 -515 1538 1022
1695 1022 -951 -1281 362 1635 -71 -1575 -274 1532 1049 -1416 -1226 870 1827 -815 -2015 23
1711 23 1995 327 -1823 -1451 1513 1608 -784 -1704 97 1917 472 -1795 -739 1745 1237 -1074 -1964
1728 -1964 954 2271 -204 -2661 -424 2006 1166 -1713 -1638 976 2215 -344 -2298 -341 2115 990
1744I90l122N66L338J26l022j234K661K259k110k724Q17L223L30l593p93K956
1760F68J671k135k548J235L336m99l468j97L164J611k865k766J764L481q45l591
1776a984n54L950J167l116k033K055L359j865l207M77L744O84l946j747L105L074
1792C163k364l621J216L877K9l821j564M000K517l372l442K465M210j071m831
1807b609k53M409K105m151l065K878M072j487m723j76M900J570m080k767L454
1822G7L336k117m856R90N226N35m794k138M224L785l537m284J423N142m54m990
1838b432j187M769K953l768m342K548N182j228n482r11N810K831n050l981L269
1853a019N057j532n973o3N930J956n338l314L968M910l028n632R11N939J212n854
$$ plain form
1744 990 -2132 -1566 1772 1898 -1124 -2358 303 2562 452 -2272 -1455 1768 2098 -1495 -2288 668
1760 668 2339 204 -2344 -1109 2227 1728 -1740 -1937 1227 2838 -27 -2793 -1029 2452 1607 -1984
1776 -1984 -2538 1412 2579 -537 -2570 -515 2844 979 -2228 -1751 1993 2677 -1269 -3016 89 3163
1792 3163 799 -2822 -1606 2271 2300 -1521 -3085 915 3432 60 -3382 -917 3293 2222 -2609
1807 -2609 -2862 1547 3652 -499 -3564 -686 3386 1899 -2824 -3000 1900 3470 -610 -3377 77
1822 77 3413 1296 -3560 -2570 2656 3191 -1603 -3741 483 4268 731 -3553 -2130 3012 2558 -2432
1838 -2432 -3619 1150 4103 335 -4007 -1459 3723 2495 -2987 -3898 1912 4743 -307 -4288 -1019
1853 -1019 4038 2506 -3467 -3530 2400 4356 -982 -4296 -328 4582 1554 -4078 -3167 2772 3984 -1870
1869a870k804M865M777l935n740K357N976J50o441k082N749M084m951n279L396
1884a748O203r65p054p67O457L328n749n290M095O465k368o570k4O698K573o581
1900a297m351N378N792l418o906J191P367J306o965l701N940N115l878o702K204
1915b925P267p9p267k636O785M920n365o504L061P965j226p995j216P109M262
1930F156o073n922L864P514j943q088q69Q359L096p344n107N335P634l813q367
1945e568J222Q412K028q143m785O841O557m656q156K195Q902N16q365l652P356
1960G04O088n932p572L428Q933o73r062k034Q195M944o910p323M839Q679k061
1975D243r414o81R137L693q284n948O108P928l194r616M98R637K581q840n500
$$ plain form
1869 -1870 -4674 191 4968 1033 -4707 -2350 3626 3776 -2665 -4747 1002 5086 135 -5144 -1748
1884 -1748 4455 3490 -3564 -4331 2126 5454 -295 -5585 -1490 4975 2607 -3963 -3987 2711 5284 -1297
1900 -1297 -5648 -270 5522 2104 -4802 -3611 3756 5062 -1903 -5604 336 5451 1573 -5129 -2925
1915 -2925 4342 4263 -3004 -5640 1145 6065 700 -5804 -2743 5222 3996 -3999 -5215 1894 6156
1930 6156 83 -5839 -1975 5539 3596 -4492 -5361 2998 6094 -1250 -6357 -1022 6612 2799 -5568
1945 -5568 -4346 4066 6094 -2049 -6834 7 6564 1908 -6248 -4053 4849 5365 -3000 -6652 704
1960 704 6792 860 -6712 -3284 5649 4976 -4086 -6120 2075 7019 109 -7214 -2375 6304 4243
1975 4243 -5171 -5852 3285 6978 -1306 -7254 -1146 6782 3588 -6028 -5530 4107 6688 -2152 -7652
1990g652P308P845m783r145J679R958J177r449m235P987P134n986r339L483J0148
2005F130q5j0191l411R488O243p406q396M546R880j486j0799j122R710M887q685
2020f97p427O267R530l068j0888k33J0567L684r528o310P503Q497m683j0099J082
2035e803J1235J995j0597n406R092P955o206j0107L294J0698Q17j1192l818R683
2049A640P360p922r419M635J0760j028j1466k267J0401O010q986q722O665J0547
2063H208k869j1700o31J0739M664r673p830P563J0114m474j1301N02J1654L109
2077H075j0865n997Q785R161n670j1482K288J2031J264j1252n158R917P862p162
2091A797j0518L860J1965m99j1727l244J0941O528q783r333N597J1564k170j2390
$$ plain form
1990 -7652 -344 7501 2718 -6427 -4748 5210 6387 -3062 -7297 690 7824 1838 -7501 -4018 6130
2005 6130 6045 -4146 -7557 1931 8174 768 -7628 -3082 6798 5312 -5487 -6609 3101 7988 -697
2020 -697 -8124 -1857 7673 4605 -6283 -6516 4051 7735 -1793 -8103 -600 7897 3214 -6885 -5803
2035 -5803 5432 7427 -3170 -8576 516 8471 2265 -7842 -4548 6150 6967 -4225 -8043 1640
2049 1640 9000 1078 -8341 -3706 7054 6026 -5440 -7707 2694 8704 -282 -9004 -2339 8208
2063 8208 5339 -6361 -6992 3747 8411 -1262 -9092 -1529 8585 4111 -7190 -6688 4966 8075
2077 8075 -2790 -8787 -2 9159 3489 -7993 -5705 6326 7590 -3662 -8820 1097 8959 1797
2091 1797 -8721 -4861 7104 6605 -5122 -8366 2575 9103 320 -9013 -3416 8148 5978 -6412
2105f412j698J1673N481r860q608P426J0597m066j2009L94J2178L968j1535p068
2119i539Q930R844n374j2185J695J2849J938j2057n204R761R032p406j1286L822
2133e180J2486J84j2504m023J1296P684q886j0283N029J2177j345j2721k419J1710
2147C205O292r619r449O754J1619l275j2578m31J2055M952j1175q157Q355J0654
2161I202m703j2510R08J2748K823j1150o822R184R898o484j1981L183J2481J212
2175G989j2409m741J0742Q184p808j1198M414J2767n62j2803l402J1558P015r127
2189F19j0303O465J1982k464j3216q43J2215N255j0673r104Q201J1452m538j3069
2203h021N47J2742L792j1743p052R060J0613o445j2020K319J2863J624j1990n878
$$ plain form
2105 -6412 -8110 3563 9044 -816 -9424 -1998 8599 4533 -7476 -7082 5096 9064 -2471 -9539
2119 -9539 -609 9235 3861 -8324 -6629 6220 8158 -3899 -9103 658 9690 2284 -9002 -5180
2133 -5180 7306 7490 -5014 -9037 2259 9943 1057 -9226 -4197 7980 6635 -6086 -8505 3205
2147 3205 9497 -122 -9571 -2817 8802 5527 -7051 -7482 4573 9525 -1650 -9807 -1452 9202
2161 9202 4499 -8011 -7103 5645 8468 -2682 -9504 -320 9578 3094 -8887 -5704 6777 7989
2175 7989 -4420 -9161 1581 9765 1957 -9241 -4827 7940 7378 -5425 -8827 2731 9746 619
2189 619 -9684 -3219 8763 6299 -6917 -7760 4455 9710 -963 -10067 -1866 9586 5048 -8021
2203 -8021 -7474 5268 9060 -2683 -9735 -675 9938 3493 -8527 -6208 6655 8279 -3711 -9589
2217i589J0406R086p446j1540L776J2677K51j2692m088J1406P398q816j0308N702
2231c777J1709j497j2695k138J1846O098j0040r140O728J1814l566j2281q77J2458
2245D642M412j0564p732P760J0998n259j2108R86J2882K672j1677o739R892R435
2259I600o393j1638K931J2418R53j2163m698J0410P979p864j0814M723J2273r42
2273F775j2621k703J1432O345q881r883O539J1100k341j2188j337J1567N101r873
2287i68q462P823J0124l948j2137M82J1999M042j1506o730Q483R748n596j1169
2301g815K039J1686J855j1384n184R620Q166o899j0606L747J1481J10j1639l911
2315h734J0349P425q242r536N255J0772j479j1444k065J0757N872r496q116O444
$$ plain form
2217 -9589 817 9903 2457 -9083 -5307 7370 7621 -5071 -9159 2247 9645 829 -9479 -3777
2231 -3777 7932 6435 -6260 -8398 3448 9546 -494 -9634 -2906 8908 5342 -6939 -7816 4642
2245 4642 9054 -1510 -9242 -1482 9516 4257 -7851 -6865 6017 8689 -2988 -9727 165 9600
2259 9600 3207 -8431 -5500 6918 7871 -4292 -8990 1420 9399 1535 -9279 -4556 7717 6775
2273 6775 -5846 -8549 2883 9228 347 -9536 -2997 8103 5762 -6426 -7763 3804 8905 -968
2287 -968 -9430 -1607 8517 4569 -7568 -7086 4913 8955 -2551 -9281 -798 8950 3354 -7815
2301 -7815 -5776 5910 7765 -3619 -8803 817 8983 2084 -8522 -4775 6706 6816 -4823 -8734
2315 -8734 1615 9040 798 -8738 -3483 7289 5810 -5634 -7699 3058 8930 -566 -8682 -2238
2329b238J0361l632j1106j70J1048M009j0103p021P934R371m616j1002J495J1049
2343E379K065j0735n191R079Q166o484j0076L090J1126L97j1197l495R723O636
2357H483p326r429M786J0474j264j0731k558J0326N056q049q205N777J0128k686
2371D782j0965p21J0931L799q908o983O854Q869m084j0347Q68J0259K442r191
2385b395n143P353P875n041r737K203J0343J006r948m114Q529O794o249q844L697
2400c671R574o09r560k365Q681N654p515p720M617R647j948r940j308R552L961
2415G050p782o706O034Q405l312r240P4R480K591q083n917P016P759m850q607
2430f088J372R530J572r097m057P076O742n542q256L179Q754M18r223k834Q127
$$ plain form
2329 -2238 8123 4491 -6615 -6785 4263 8272 -1831 -8852 -918 8453 3837 -7165 -5670 5379
2343 5379 7444 -3291 -8482 597 8763 2279 -7797 -4707 6419 6816 -4381 -7876 1847 8483
2357 8483 1157 -8272 -3486 6988 5724 -5007 -7565 2761 7817 -232 -8437 -2660 7468 4782
2371 4782 -6183 -6904 4027 7826 -1082 -8065 -1211 7658 3574 -6773 -5905 4354 6796 -2395
2385 -2395 -7538 -185 7690 2649 -7088 -4885 5458 6464 -3484 -7598 931 7725 1476 -7368 -3671
2400 -3671 5903 5294 -4266 -6631 2050 7704 189 -7531 -2914 6733 4785 -5155 -6463 3089 7050
2415 7050 -732 -7438 -1404 7001 3689 -5551 -5477 4003 6594 -1489 -7406 -390 7369 2519 -6088
2430 -6088 -4716 4814 6386 -2711 -6768 308 7050 1508 -6748 -3569 5185 5603 -3620 -6454 1673
2445A673N385o364p568M175Q253r64q902j618Q575L885o916o193M636P987k494
2460C550q366j67Q101K979p278n462O035P227l950q351J380Q314J546p785m306
2475f533O675O159m363p424K169P638O15q037k658O916M939n288o711L555P217
2490D869o38p785j621O962M252o152n730L787P529k020p770j82P452K455o670
2505a262m550N110O305l155p058N45P499J385o284l934N889M627l322o788J585
2520c408P592N23p142k904O388M721m849o004K310P204o68o750k009O265L953
2535E222n097n013L164O242j314o576p41N956K852n161m651M203N902k706n953
2550c671P1O057J786n406l735M537N074l134n869J286O512M23o007k554N062M214
$$ plain form
2445 1673 7058 694 -6874 -2699 5554 4590 -4312 -5930 2645 6530 -386 -6579 -1943 6044 3550
2460 3550 -4816 -4983 3118 6097 -1181 -6643 -608 6619 2669 -5682 -4302 4012 5558 -2227 -6533
2475 -6533 142 6301 1938 -5486 -3317 4321 4936 -3101 -5759 1157 6096 808 -5903 -2348 4869
2490 4869 4231 -3554 -5175 1787 6039 -113 -5843 -2056 5473 3453 -4317 -4499 2953 5408 -1262
2505 -1262 -5812 -702 5603 2448 -4610 -4065 3434 4819 -1465 -5399 490 5117 1795 -4993 -3408
2520 -3408 4184 4707 -2435 -5339 1049 5770 921 -5083 -2773 4431 3763 -2987 -4996 1269 5222
2535 5222 125 -4888 -1724 4518 3204 -3372 -4113 1843 4695 -466 -5117 -914 4988 2282 -3671
2550 -3671 -3600 2457 4243 -1163 -4898 -361 4713 1579 -4290 -3004 3508 3931 -2076 -4630 432 4646
2566D646l658n392J814O244n9o227j694N238L535m125m725K900N284r43o040m53
2582c655N424K512m874l856L440M794j356n759J17N227J919m996l096L793M199
2597C833k362n168J057N147P10m801k378L985M148l199m847J967M665N4m475j678
2613c342L941L180l430l536J733M663o92m660j008M284K228l555l304K329M184
2628C015j138m179m81M052K047m007k926L100L750j804m225P59M025J100m134
2643a046k352L492L163j949m156P83M234M22l741j576K976K750k354l483J454
2658a383L735l71l715q73L644J850l159k653J904L676j013l584j52L191J413k853
2674c43k240J921L192j447l082J3L142J617l524j888K527K677j638l168M75L448
$$ plain form
2566 4646 988 -4404 -2590 3654 3595 -2632 -4326 912 4447 322 -4403 -1503 3781 2838 -3202 -3655
2582 -3655 1769 4281 -593 -4449 -1009 3785 2429 -3330 -3213 2014 3933 -1063 -4159 -366 3833
2597 3833 1471 -3697 -2640 2507 3217 -1584 -3962 23 4171 972 -3875 -1908 2757 2811 -1664 -3342
2613 -3342 599 3779 349 -3187 -1454 3209 2517 -2143 -3151 1133 3361 -194 -3498 -1169 3015
2628 3015 1877 -2302 -2783 1269 3316 -691 -3617 -517 3233 1429 -2796 -2037 1988 3088 -1046
2643 -1046 -3398 94 3257 1308 -2848 -2065 2169 2591 -1150 -2726 250 3000 646 -2837 -1383
2658 -1383 2352 1981 -1734 -2607 1037 2887 -272 -2925 -1021 2655 1642 -1942 -2094 1097 2510 -343
2674 -343 -2583 -662 2530 1083 -1999 -1986 1156 2773 -751 -2639 -112 2565 927 -2241 -1766 1682
2690A682M18l006j550K961J955j954k760Q93L362l50k733j329L325J445k265k284
2706b190J330K614l82k545q98K640J286j752k243J521K791j047l042P3K950R45
2722B051k465j626J812K319j203k223j51K730N95k486j002J847J808j735j888
2737a617Q30K339l35k015r91K088J555j473k335J096K535m90k034m17J932R10
2753A578j656j990J584K131p73j851q03K564J050k051j620J263K050p47j881R4
2769a058J991K95j600r68J137J555q81j855M14J943K18j792p88J274J504j015
2785C74j557M06J638J26j849l89J549P12p77j276M37J547k92j546j96J813M38
2802A158j209j066O38J470m81j336j38J240Q72j371o85R29R05o16j493N01J202
$$ plain form
2690 1682 2100 -906 -2456 505 2460 506 -2254 -1361 2001 1651 -1082 -2411 914 2359 94 -2190
2706 -2190 -860 1754 1372 -1173 -2071 569 1855 103 -2140 -619 2172 1125 -1917 -1844 1106 2051
2722 2051 -414 -2040 -228 2091 888 -1335 -1486 1244 1839 -647 -1649 198 2006 271 -1617
2737 -1617 -787 1552 1217 -798 -1789 299 1854 381 -1954 -858 1677 1187 -847 -1264 668 1578
2753 1578 -78 -2068 -484 1647 874 -977 -1780 784 1834 -217 -1837 -574 1476 729 -1152 -1058
2769 -1058 933 1228 -372 -1340 -203 1352 471 -1384 -970 973 1191 -601 -1389 -115 1389 374
2785 374 -1183 -777 861 987 -862 -1251 298 1010 233 -1043 -606 941 649 -897 -1093 720 1158
2802 1158 -51 -1117 -479 991 510 -826 -964 276 1148 -223 -908 21 926 310 -1183 -682 520
2819E20K78j211q29J364P45o94j171N53Q43M22j219l60R85P38r12q27K87J305
2837H17m09o96m12J001N51q35p79N68P83k07q80l7O66M62r58J0L4Q17J3j228M00
2858c19N02L77p29o00R20K29j47o01j94R10Pl96m07N49L66j97r25J48J025L35
2878H53r53m68O91L84R3q31J48J89M86j007r5P15K02j36o95M06N21l76l86n53
2898h12J083K64n20k98M8O34j84m87k34O61O9l16l88M54K71k30l19k2O94j9l93
2919d4p5Q5K75r4m34K10K62m5l64n4J00N97m10M9l0l8J94l59j78M35K43k13m22
2942c10L65K2K99o30n1N25J26l66j15J8K44o2o5k58N32k2k29k52l33P18J04rp43
2965d92M10K54j48l60J22L70M3m22p1K32L51q8n87p5N29j0m8o5j08K71l77K51
$$ plain form
2819 520 798 -413 -1242 122 867 173 -998 -445 398 820 -399 -759 226 964 52 -775 -488 817
2837 817 408 -288 -700 301 852 17 -762 -194 589 382 -498 -535 131 593 -365 -355 -321 496 509 -719 -319
2858 -319 183 560 -169 -769 151 380 233 -368 -562 348 355 -41 -448 101 467 270 -655 -507 518 853
2878 853 -100 -568 123 507 600 -231 -83 106 592 -415 -510 205 407 271 -424 -18 503 127 -259 -812
2898 -812 271 535 15 -283 -235 399 215 -272 -506 155 224 -92 -480 -26 245 15 -304 -326 368 349 -44
2919 -44 -119 -34 241 147 -287 -77 185 140 -224 -278 -178 419 9 58 28 -10 184 -175 -353 82 325 112 -310
2942 -310 55 77 376 -254 -305 220 346 -20 -135 -117 127 65 0 -258 274 252 23 -229 -562 156 260 251 -492
2965 -492 -82 172 24 -336 -214 156 199 -223 -294 -62 289 201 -386 -461 68 58 10 -55 -163 108 -269 -18
2987a8k16K83k80R3J80J70j09m34QL67j6J98j84l38M22o8j16N9j47K02K47p9M8
3010B72j92o0m17R5M57K8k11k75q4M39j0n1k67K64K80m48K43j07L96j83l36L66
3032A99k6K25m21j00j81N32k59l46P9K0N18k1l36j2M2J42Po2J03N5q0m91N80L31
3056D98m44m09J00J63J51O1m38K05M35m48k93J52L24j08k27Q9l0L75k15j68K0
3077b07L92J98m89q6J58J73r1j66J26k71J52k84L93J74K54n99J74NJ02n4l58L58
3099E4K29k43j95j63M87J9j66j92k5K10L6j24j93L29K23m34j25M31O5j68j72J87
3121G0j83J99q7L0P9L07j86k64K10Pp3k01l28N85m0j60J36o3m6M08o05nN40R6
3145D26m57j9rK03J3k90J84J33l5l68k06L51K98k74R0qO9J02l23l54N58M39o69
$$ plain form
2987 -18 -234 49 -231 -138 42 212 103 -331 -323 44 28 226 42 -296 126 58 -58 1 -146 56 303 224 272
3010 272 80 20 -397 -302 155 183 -28 -303 -387 52 42 -9 -276 -12 268 -180 63 -44 352 169 -167 199
3032 199 173 398 -23 -123 -304 228 -31 -377 -298 -278 240 219 -117 -129 -87 55 62 0 103 158 78 -413 167 498
3056 498 54 -355 -255 -92 59 120 -318 -113 322 -126 -419 -267 57 -51 -278 -189 -219 156 -59 -227 -207
3077 -207 185 383 -106 -192 -34 139 48 -118 8 -263 -111 -395 -2 172 426 -173 1 6 108 54 -304 54
3099 54 283 40 -155 -318 169 188 22 -170 -195 15 51 -73 -266 63 286 -148 -273 158 223 55 -117 70
3121 70 -113 86 -1 29 108 415 229 -35 175 182 109 -92 -420 165 125 -35 101 38 -8 400 -205 -210 330 426
3145 426 -31 -50 -59 144 157 -133 51 184 149 -219 -425 -74 224 -50 40 32 101 203 -120 -474 84 523 -146
3168a46k26K89N16k75n02K85jM41k83n64K67O25k45m55q3R75k12o29l21O88L08
3189D52k79l29j54N87n8j18m68L81M21p38k54K97M46J48j028M19L52pl66k71N84
3210A7N50l11p33L4P91m30M0j78L69n9J20n90k3Q56j26o54lM54L98k86n47j39
3232d50R14k37o26j95O16M00o57n5L62P1j7n42R4O59K87m67l87L4O59k94k84k28
3254c43P46k8k40r8N0M43p23m07J78R10r5o00k75K92N91j55p56L23K89O14j141
3275d25mM56K68k73q87P65O90l75p56K17M61L88o17n04M24M49qp50L32M27J74
3296D52l36l10L56N63m24o26l12J297N5j029m00R03L42k77l97j95O68M7o65k01
3316d89Q74K53n77m76L40M41l7r59J14Q54L38q97m38M93M93ko75j37Q92P7l71
$$ plain form
3168 -146 -372 -83 433 158 -344 -59 -60 381 98 -466 -199 426 181 -274 -357 618 406 -223 -544 144 452
3189 452 173 -156 -310 277 219 101 -367 14 435 -303 -557 -260 186 334 -694 -275 77 70 -296 -567 17
3210 17 567 256 -477 -443 348 -82 -42 -220 149 90 210 -380 -403 453 327 -327 -330 124 522 236 -311 -450
3232 -450 464 227 -399 -594 22 422 -235 -290 72 143 126 -416 -322 337 624 157 -230 -196 463 169 -115 -343
3254 -343 403 375 135 37 87 530 -193 -600 -422 488 393 -207 -482 -190 401 246 -510 -187 102 716 -425
3275 -425 -429 27 295 22 -865 -100 590 215 -541 -324 137 525 -92 -596 -172 277 269 -481 -149 278 452
3296 452 116 -194 162 725 301 -325 -637 660 715 -314 -714 189 531 254 -143 -338 330 377 -288 -489
3316 -489 385 638 61 -415 -75 366 329 -630 -516 338 676 -221 -659 -166 327 325 -350 -487 405 482 111
3337A11o89N14M61n4p24nQ36O8q15r4N15O39n37j043L72R16k15p93J09O30N44
3358G46o02q00O80N65J99j065l30Q61M27p09o53P52N85l77m71j00R32L5p84k49
3378c58L73P47o74m87k88J267mp26n05N81N31j51q13r9J238k97p14l31Q50N33
3398F73q79k51K07P63p0q98q4Q12J31m70m27L92P35m91l59k49N42N31p31o38N04
3419b57R41m46p49J19O00J63m98k16K97P45n33q13J69R46q1p64k36M80P76q28
3439a85n88N48O03l48l97j48O74L40n78l72O2O65k97m24r0M27P14p81m66M49O69
3460D77k21p73j4O97M43m70m74J57O89o79m18J47M97J16l28m20M10Q91m99p75
3480e47J91P98l39l26k24M16O78o12l69N1O24L3q42n7O57K57l71m95K57N85R2
$$ plain form
3337 111 -578 -64 397 343 -381 -386 450 518 -297 -391 124 763 226 -817 -445 471 256 -537 -428 202 746
3358 746 144 -656 24 589 788 -277 -607 254 681 -28 -681 71 656 279 -192 -292 640 675 -109 -358
3378 -358 15 762 88 -399 -687 580 576 -150 -655 -74 457 306 -507 -606 632 335 -379 -710 140 673
3398 673 -206 -457 -250 513 443 -455 -539 273 404 -66 -493 -101 634 143 -216 -465 77 608 -123 -761 -257
3419 -257 684 238 -511 -392 208 371 -127 -343 -46 699 166 -647 -478 468 387 -377 -613 -133 643 -185
3439 -185 -773 -225 378 30 -367 -515 159 499 -79 -451 -389 276 -21 -445 -535 -108 606 -175 -641 -192 477
3460 477 256 -517 -531 166 609 139 -335 -178 511 -168 -586 -439 58 174 -154 -574 -164 727 228 -547
3480 -547 -356 442 103 -223 -447 -31 647 35 -334 -283 341 374 -468 -525 132 389 18 -477 -220 365 457
3501D57n59n07P75L96o85l07M21N32j59q16J78N14k9m20k86N07N57q5q40j93O74
3522A25L51o66n12O99M60n77l53J13P33K1m37k15K34L76m70n29N03P50l37m96
3542b27J37K42O0J7o64R0P14r2n16n7O79J75q46j4K1K32L41m09P4L58o0m79r2
3565c16K74K46L5r1k64L78j59k90J56J38L12o40k0O4L63k19J18l82M49J90l57
3586a5k09L74K92l39l65J13K40J84Q0l78K10j0J54l98j07K37K63k63l85L01j91
3607b12R7j03o1K44N21p08k13L96L87l02k48o2M27J93n39j32K93m3P4N2m86M80
3629E5K72m76j12K69M7N8r9j00K89J33j42j85k92J88ok38L77mp3j60k6M05J28
3652C08m45P4j08K56m9K20m39rL99q5l96N17k39J35j65j50K67q3j07l74K82L13
$$ plain form
3501 457 -102 -609 166 562 -123 -430 -9 523 364 -452 -274 240 211 -209 -495 12 569 484 -356 -549 125
3522 125 476 -190 -702 -3 457 -120 -473 -360 373 394 -43 -258 -24 352 -118 -647 -144 606 269 -227
3542 -227 -90 152 212 229 -435 -345 369 277 -239 -296 383 558 -288 -302 -281 -49 292 -117 -43 315 255 -224 -316
3565 -316 -42 204 239 148 -116 262 103 -187 -31 107 419 -221 -241 -177 186 -33 85 -297 152 342 -15
3586 -15 -224 150 442 103 -262 -149 91 275 355 -23 187 177 331 -67 -174 63 326 63 -322 -21 -212
3607 -212 -115 -218 -279 -35 486 -222 -435 -39 348 46 -202 -264 163 356 -183 -315 -22 -65 9 61 -425 55
3629 55 327 -149 -261 8 55 113 14 -86 203 336 194 9 -283 -95 -101 -339 38 34 -39 -199 -225 180 308
3652 308 -137 -63 -171 85 36 256 -183 -192 207 122 -274 243 4 139 -26 -176 91 8 -99 -473 -191 122
3674A22o3k56L04J22j53j82J21l10L83j48q5MK23j37k45M12m69M88k90m6L78j29
3696D4o6mK71k21j20j2K33m6R4l55L69l61L51l85j01K54l81M81q6j91K1M52j81
3719F0j9M5l1k2J71q9K70l31o5j60K39k13J46J73k70Q7K77k9j79P9k61L36k96
3742h2JK16k09N15m39j73J28KP8k83K27L4J56j2k89K4J96J0l00K49k57K69m05
3765c44M55J98l98L37k51k70N15l83L71m39j46O04J65l84k10N13l09j79J12J77
3785A34j10k37O2M12J50l50k95K56L47l14o1k55J25K49k02K99l63K58l5m77L32
3806g5J04K43o45J34K22N21l24k00q4L89k39l7k76M48k3j94j26k27M39Q3n80L48
3828i9J25K17k97m73M25K11Mk0j15P3K28j75j98L2M06m90j99P8M11K73n71j63
$$ plain form
3674 122 59 -197 107 229 76 -106 15 -295 88 -60 -145 -141 82 -55 -300 112 -357 131 -159 -205 173 44
3696 44 -22 -26 245 24 -96 -108 125 79 173 -182 187 -174 177 -208 -309 -55 -436 45 -41 -232 -211 241 60
3719 60 41 86 55 33 204 115 385 54 -11 -171 68 -145 1 174 -96 -9 268 239 60 139 -122 214 -82
3742 -82 -81 135 -74 441 2 -171 -43 -41 37 -246 -19 15 171 159 -130 -106 90 100 -200 49 -208 61 -344
3765 -344 111 309 -89 248 -3 -273 242 -141 230 -209 -355 249 414 30 -180 333 24 -155 -43 134
3785 134 24 -213 -151 261 411 61 -234 22 369 55 -6 -261 -136 113 -89 210 -153 105 70 -407 -75
3806 -75 29 272 -373 -239 -17 504 180 -20 -104 285 46 9 -267 181 158 -36 -162 -389 50 133 -447 -99
3828 -99 26 243 -54 -527 -102 109 113 93 -22 51 279 104 -94 -62 344 -146 -345 -267 144 417 -154 -317
3850c17K00L93j02k59j6M89j53l89J22J3M65m29m89K59O60j9q22P4L56L74l67
3871D3n60K35O68l52n02J65N42K03o96j98P87J50q7n49j64Q06K04j044k65N66
3891d8N97n36l16nO13J52r43J71L88M86m53n01L78Q1K02o59N1N16P45p81p02N71
3913GL63K43r45j80J001K75q75q26P62P07m83m84R7Q08K74q88n16O10Q77p58q21
3934g52J61J022M6o52l75O36O09n69r50L88J201J12j311k86R08O95q11p33K74
3953c87J169l4j443p1J191M90j280j019J241J360o15j486QJ306N23j252q82J004
3971a77J317p76j125M9J179M17j557k40J017J014j174j016J09J742Q7j008q71
3988a013J051J242j340p48P6J438R0j484o14J645P30j135j487J404J373k59j833
$$ plain form
3850 -317 -117 276 174 -85 -101 388 235 -154 -32 -19 446 17 -472 -213 447 428 -394 -320 36 410 43
3871 43 -517 -282 386 34 -468 -303 239 442 -254 -452 335 485 398 -151 -315 491 695 -349 -614 -48
3891 -48 549 13 -303 -308 305 457 -486 -315 73 559 106 -395 -17 64 266 -393 -342 174 919 138 -564 7
3913 7 370 613 -332 -512 489 764 -111 -937 -175 532 49 -435 -338 470 744 -144 -660 -50 827 69 -752
3934 -752 -591 431 477 -175 -550 86 695 126 -824 -436 765 877 -434 -720 188 883 72 -661 -387
3953 -387 782 748 -695 -766 425 915 -365 -1384 -143 1217 602 -884 -876 430 953 -299 -1181 -177
3971 -177 1140 364 -761 -712 467 884 -673 -913 104 1118 -56 -1072 -963 779 866 -142 -1013
3988 -1013 38 1280 -60 -808 -732 706 796 -688 -1302 343 1073 -62 -1549 -145 1228 969 -864
4005h64m10J983N11j267j433J351J604q74j551J61J459N17j843q12J474J587j081
4022E12j810N27J840M33k133j110K044J050j120j797Q94J939o77j615n00K046
4038E23J044j680j472Q52K165n03j920n91K422O87j706j446J434J686m42k354
4054a301L13K086L88j953j459J648K170j274k262O57K408J74k282j024J743J997
4070B029j528k174N33K150N00k515q49K220K006j949k633J272K671p1k756p83
4086a877K543J353j921k121J250K573m77l084L3K977P49k298j809J656K583j205
4102I25k684J45K862O89k599j613K108K513j663k720O68K948L73l059j179K591
4118C05K208j956k788R95K946J35l129p72K711J801k313k822J803L015n14l120
$$ plain form
4005 -864 -1274 709 1220 -47 -1480 -129 1475 601 -950 -789 670 1187 -656 -1468 6 1593 512
4022 512 -1298 -771 1069 1502 -631 -1741 303 1353 233 -1564 -670 1269 592 -1023 -1523 523
4038 523 1567 -113 -1585 -733 1432 929 -991 -1582 840 1527 -179 -1625 -191 1495 1053 -1301
4054 -1301 -988 1098 1486 -467 -1926 -278 1892 618 -1644 -987 1421 1595 -687 -1711 32 2029
4070 2029 501 -1673 -1140 1010 1510 -1005 -1854 366 2372 423 -2210 -938 1733 1662 -1094 -1877
4086 -1877 666 2019 98 -2023 -773 1800 1323 -1761 -1728 1249 1998 -300 -2109 -453 2130 925
4102 925 -1759 -1614 1248 1937 -662 -2275 -167 2346 683 -2037 -1369 1579 1952 -1107 -2286 305
4118 305 2513 557 -2231 -1236 1710 1845 -1284 -2056 655 2456 143 -2679 -876 2139 1625 -1495
4134a495o21L165J349k303k739J871L106j231l157Q9L110J058k666k336K572K415
4150B187j086l147J58L379R13l363j582K617K481j864l424J089L821j40l328j235
4166b524L010K041k177l067J358L703m16l610r42L648J912l190k544J827L324
4181B353n84l835j21L597J089k610k638K382L439j520m247N24L844J165l959j683
4197b804K680L004j598m020P62M208M83m050j454L063K566k427k890Q75M216l24
4213B290m029j311M160K107l135l384J877M418q45m133p23L847K161l441l161
4228c302K383M066j559l962k33M503J335l954k389K718L845j940l860K93M124
4243B068J107m445j602L040K984k024m141J214M323K61m575j446M294K513l056
$$ plain form
4134 -1495 -2116 1049 2398 95 -2644 -773 2333 1102 -2055 -1966 1144 2202 -464 -2800 -228 2187
4150 2187 1101 -2046 -1888 1491 2404 -959 -2541 76 2557 693 -2731 -1642 2179 2039 -1289 -2524
4166 -2524 486 2527 350 -2717 -1359 2344 1928 -1682 -2624 1024 2936 -254 -2798 -971 2353
4181 2353 1769 -2066 -2187 1410 2499 -111 -2749 -367 3072 1552 -2695 -2171 1673 2838 -1121 -2804
4197 -2804 -124 2880 1282 -2738 -1976 2232 2715 -1335 -2789 274 2840 413 -2477 -1602 2614 2290
4213 2290 -1739 -3050 1110 3217 82 -3302 -1425 2993 2148 -1985 -2708 1139 3300 -141 -3302
4228 -3302 -919 3147 1588 -2374 -2607 1896 3231 -723 -3112 -394 3451 1511 -2349 -2056 2068
4243 2068 3175 -1270 -2872 168 3152 1128 -3013 -1799 2524 2785 -1790 -3236 1058 3571 515
4258E15l642J191M703l51m615q03L704K632l286l346K119M240r64m564l44M369
4274A558J568l541l381L147L938j478m833M87M672R95m233k585L641L585k298
4289A242m959J507M791M40m599j855L700L296k539m448J578M622o0m755j399M472
4305A034K450l253l607J957M463o18m761j040M513K501l804l428K699M374j357
4320B123m872k09N033J362m368k858L740L436k062m512O13M872J160m700k601
4335c843M426L585l223m347J251N009J69m922j719M419L096l584l997K280M904
4350C504r78m929j027M379L007l968l723K540M566r84n081o95N504J417m237l437
4366d142L512M264j657m851R4N208J039m715k455L615L813k386m538Q09M733Q55
$$ plain form
4258 515 -3127 -1936 2767 2416 -2199 -3002 702 3334 48 -3298 -1179 3061 2097 -2467 -2811 1558
4274 1558 3126 -415 -3796 -649 3289 1811 -3022 -2535 2137 3132 -1101 -3686 -45 3540 1242
4289 1242 -3717 -2210 2581 3021 -1578 -3433 267 3563 1024 -3424 -1846 2776 2716 -2039 -3438 1034
4305 1034 3484 231 -3376 -1419 3044 2426 -2335 -3375 1138 3639 -165 -3593 -894 3480 2123
4320 2123 -2749 -2958 2075 3437 -931 -3789 -49 3387 1325 -3187 -2574 2298 3458 -1242 -3843
4335 -3843 583 4168 945 -3402 -2151 2858 3027 -1895 -3614 805 3901 317 -3680 -1400 3504
4350 3504 2526 -2403 -3430 949 3956 -12 -3735 -1195 3371 2387 -2694 -3389 2115 3532 -705 -4142
4366 -4142 -630 3634 1977 -2874 -2780 2428 3467 -1248 -3703 -88 3725 1339 -3199 -2390 2343 3198
4382C198m615k127M108L341k858m643J395N203J97n358j272M294L114l658l880
4397c561K185M345l25m841j246M944K381m128l560K900M269j538m713l15N157
4412A954J757m237l263L525L878k116m631L61N405Q32n010k262L982L476k604
4427A047m566J406M673P01n131j702M454K730l059m282J888M941m87m387j867
4442c641M957K221l579l456K243M711j180m766m80M466K148m024l376K960M217
4457C421j470m735J9M627J364l966k873L612L538k208m643R22N041N55m535k216
4473c547L768L625k949m234J488M573Lm626j697M112K841l096m010K329M467o94
4489B353m822p73M566K296l670l446K592M206j308m825O1M405J874m213k878L224
$$ plain form
4382 3198 -1417 -3544 564 3905 1047 -3596 -2201 3002 3199 -2159 -3431 863 3977 319 -3561
4397 -3561 -1376 2969 2644 -2197 -3443 1501 3882 -246 -3806 -906 3363 1825 -2888 -3203 1954
4412 1954 3711 -526 -3789 -264 3614 1498 -3133 -2772 2633 3465 -1545 -3807 175 3651 1047
4427 1047 -3519 -2113 2560 3261 -1870 -3572 882 3612 553 -3729 -1841 3100 2613 -1774 -3641
4442 -3641 1316 3537 -42 -3498 -1255 3456 2276 -2490 -2970 1496 3644 -380 -3756 -796 3421
4457 3421 1951 -2784 -2765 1862 3226 -740 -3613 -1 3537 1329 -3314 -2392 2649 3204 -1331 -3547
4473 -3547 221 3846 897 -3337 -1849 2724 2727 -1899 -3596 516 3357 261 -3749 -1420 3047 2353
4489 2353 -2469 -3242 1324 3620 -50 -3496 -904 3302 1994 -2831 -2770 1635 3509 -704 -3582 -358
4505c58L776k041m655M92N044N67m014k491L415L825k753m035J148M470N09m651
4521a752j496L752L181l337l861J613M784m53m437j425M216K844l239l844J855
4536a599M893j282m510k63M019K037l518l361K919L999j606m432L57M101J300
4551C054l881k391K665L831k352m007J168M277M11m102j954L347L429k923l609
4566c037R46M735J9m442r47L329K494k696l810K073M013q20l508j205M361J818
4582C323l412l086K058L804q20m212l45M162J660l648k184J894L597j426m152
4597b787O87L905R95l902k042L034L115k053l796J020L651O01l519j964L479K484
4613B908k194l171J025L565K64m130q19L118K141k143l376J588L826o22l913n71
$$ plain form
4505 -358 3418 1377 -3278 -2786 2258 2825 -1189 -3680 -265 3560 807 -3228 -2080 2390 2899 -1752
4521 -1752 -3248 504 3685 348 -3513 -1900 2884 2431 -2006 -3431 785 3629 390 -3454 -1599
4536 -1599 3294 2012 -2498 -2761 1258 3295 -223 -3584 -665 3334 1728 -2704 -2347 1754 3054
4551 3054 -827 -3218 -553 3278 926 -3081 -1913 2364 2775 -1327 -3281 66 3495 572 -3037
4566 -3037 -2091 2644 2663 -1779 -2726 603 3097 401 -3409 -1336 2677 1857 -1651 -2856 1505 3323
4582 3323 -89 -3175 -1117 2687 1867 -2345 -2690 1472 3132 -516 -2700 -806 2791 1365 -2787
4597 -2787 -2100 1805 2800 -1102 -3144 -110 3005 952 -2844 -1824 1827 2428 -1091 -3055 424 2908
4613 2908 714 -2457 -1432 2133 2397 -1733 -2552 566 2707 564 -2812 -1224 2602 1980 -1933 -2504
4629b504L537J817k960k529K075L089j256l469K02L275J120l026j987K171L180
4644B735j474l533M99L489N83l375j321K567K645j767l464J123L348R5l332j324
4660b506L279J867k263k810J558K879k22l190p15K977J807k527k687J622L184
4675B253o04l230n24L063J271k590j780J609K408p23l125L8L054R32k591j811
4691b350J835K937j484k639K2L411K27l042q42K327J893j847k466R56L117m25
4707A630k480r58K226J773j872k481R31K860r7k499r12K489J452k026k059J449
4723e74K524r20k392m04K719J149k315j694J586K140j136k147J7K573M45k195
4739f24j323K306J483r21k454N50K094O69k284j014J763J436j204k026Q34K133
$$ plain form
4629 -2504 1033 2850 -110 -2639 -564 2525 1269 -2200 -1998 1277 2397 -629 -2616 -445 2735
4644 2735 1261 -2272 -1773 1716 2299 -1076 -2397 170 2815 1048 -2416 -1293 2055 2150 -1182 -2506
4660 -2506 773 2640 377 -2433 -875 2004 1782 -1408 -2123 854 2661 134 -2553 -931 2253
4675 2253 1649 -1581 -2105 958 2229 -361 -2141 -532 1876 1153 -1972 -1934 1120 2052 -539 -2350
4691 -2350 -515 2422 938 -1701 -1679 1732 1959 -1083 -1925 402 2295 448 -2018 -1062 2055 1630
4707 1630 -850 -1808 418 2191 319 -2162 -1231 1629 1532 -967 -1879 610 2062 36 -2023 -574
4723 -574 1950 1030 -1362 -1766 953 2102 -213 -1907 -321 1819 683 -1464 -1447 1126 1571 -624
4739 -624 -1947 359 1842 921 -1533 -983 1111 1780 -504 -1518 245 1681 477 -1549 -715 1418
4755A418k68k156m95J961J172j791j510J049K033k64j937p36J942J373j804j434
4771a447J074J879m92k046k21J726J137j830j373J592J342q05j876N37J840J68
4787A205j518j164J570J400j310j450M00J963O3k021l05J708P53j248j399N08
4803h45J892r0j696n62J358J366j424j467Q24J622m39j423l6J335R13j477r34
4820a083P44J647n54j766j10J961M32j314q70N14J519n83j285LJ316K07j363k99
4838h84P46J245o06j409M72R24K76r94q17J191P41q32q40M53J105J0j463J78P61
4857B57Q29j020r48N73O96J48r57l25J081N45j172m68P57N50k08j104J59P96N17
4876G06j001m44P04O59n53p10M44N18K27r14l70P50P00o54r85N52J196k48j061
$$ plain form
4755 1418 1150 -1006 -1501 460 1632 -159 -1669 -620 1413 1149 -788 -1524 418 1791 -13 -1447
4771 -1447 -373 1506 1014 -1032 -1253 473 1610 -220 -1593 -1 1341 536 -1340 -803 1037 1205
4787 1205 -313 -1477 93 1493 183 -1267 -867 1096 1159 -862 -1167 541 1294 46 -1353 -845
4803 -845 1047 957 -739 -1301 57 1423 -1 -1468 -644 978 539 -884 -920 415 1328 -149 -1083
4820 -1083 -339 1308 754 -1012 -1122 839 1271 -43 -913 -399 1120 537 -748 -745 571 778 -585 -884
4838 -884 -138 1107 501 -908 -436 488 764 -230 -1047 144 885 53 -787 -334 771 781 -682 -504 257
4857 257 1086 66 -882 -309 387 535 -422 -747 334 879 -293 -761 -4 546 338 -766 -607 189 706
4876 706 -295 -739 -35 624 71 -639 -195 323 550 -364 -734 16 716 62 -923 -371 825 577 -484
4895d84j50O64Q86p55q74K57R81q4r30l21R68L34p87j40J65R14l83p22J89M50
4915A78K38m28m16J47P82m60l86k06Q16J95l97p15L40Q14k80m41M7N43l32n64
4935e25J49K99O59l01j170J002J2m7k33RM40J36m61j74j28Q13k20o87l12Q43L14
4956D18n0p19J0P22p7l27m72L68N73m51k06J49K70k13j99r6M06K27j43n96K71
4977a35K69l8k25o8L68j1n01J67K60J18l33k13K97L0L43j06n88M05j36k6k62M63
4999G8P7M4m36j20N20O9k40K01l89L78J3l99p6L69K61n68J42J50K21p5n29L68
5021E9N4Q5m69J57N2j89J43k10M67k1k53J1J10Q4r8j14q7J63O4J14j49K9j01n2
5045a51K76j87J82j76j99J72L0J2l5R9o6J75J95m16J29j18L22K2n36L10K3k82
$$ plain form
4895 -484 -634 30 916 161 -713 -456 525 441 -489 -810 158 492 -295 -435 -270 644 261 -461 -272 178
4915 178 416 -12 -428 -281 501 41 -345 -551 265 460 63 -652 -312 502 222 -219 -172 371 39 -525
4935 -525 -376 -77 582 281 -889 113 125 78 -155 -146 294 430 -31 -205 -333 480 260 -427 -739 104 418
4956 418 368 -351 -341 381 304 -23 -495 -127 446 -5 -211 -62 208 -5 -204 -300 106 333 190 -406 -135
4977 -135 134 96 -129 -197 171 160 -341 -174 86 204 -129 -342 -45 -15 328 222 -366 39 -97 -123 -385 78
4999 78 155 199 -237 -357 163 232 -8 193 -196 182 195 -204 -280 89 350 -218 -76 74 295 220 -309 59
5021 59 113 198 -271 -114 -62 -251 -108 -318 149 128 -125 -114 -4 80 -18 -132 -219 -56 8 122 -27 2 -99 -151
5045 -151 125 -62 120 -56 -255 -83 -53 -41 -76 23 -43 132 327 -89 40 -78 244 266 -270 40 63 -219
5067b19K17R9j03q0J23j31l1K07l5J24k9j53rj77L37J1nk21M06n06N27m65o0R
5091a64J48p8K5j13O4J47L3j64K87J03j87k27J76J26k24m4j76L68Q5j84J33j19
5113A5j35J09L15j66j46J47k31j64K98n9Q2j02P3r2K05j78m97M86J42k22J87k28
5135a61M7l8N22n92M29p0r5m5n2K14j15K14m72K26j39J83J4j60R5J01l59O6L4
5158a53J17k57K31o4nM20l54j43J02K21n2j64M0j19L56j15j99K47j11n0Q6n1j17
5181a34L3o4Q9K37j66J94j08p1RK1L32n68L6J18K16R1j37Oj63j96R9K73J44j20
5205A71pj20j66j37K93j27k70L58j80K5L24j84K43k41K18p7J7j90J22n0m7Q2P6
5228A33k73L12m06M37l45J55P2p1j72J37k16M86n4k3j81L59J6l29j64L4N64o31
$$ plain form
5067 -219 -2 97 -6 -86 37 -94 -125 82 47 171 142 -11 -20 -197 140 151 146 -75 331 -175 352 -113 -173 -164
5091 -164 -16 -94 -69 -182 -118 29 62 -102 185 288 101 -126 50 176 -48 -92 -268 100 185 1 134 15
5113 15 -120 -11 304 138 -8 139 -92 -256 42 -17 65 -37 36 -56 149 -29 -526 -40 102 -120 67 -161
5135 -161 -114 -152 370 -222 207 137 42 -3 -55 159 44 258 -214 12 -127 56 70 -90 5 106 -253 -187 -153
5158 -153 -36 -293 -62 -126 -131 289 -65 -208 -106 115 63 -101 -61 -180 176 61 -138 109 -2 -52 34 -17 -134
5181 -134 -101 -165 -76 161 -5 189 81 10 19 40 372 -196 -160 -42 174 265 128 134 -29 -225 -126 147 291 171
5205 171 164 44 -122 -259 34 -93 -363 -5 -185 -160 164 -20 223 -18 200 123 140 -50 72 22 -25 57 133
5228 133 -140 172 -234 203 -142 13 85 14 -158 -21 -237 249 195 172 -9 350 366 37 -127 -93 471 -160
5250a60N8R0J06n9N9l11L28J80j59l47K28K63R7l23l33M23j76K6j84PJ70Q0J00
5273A63k7n2R4j46j19j01K07J70j05k88K81L8n2j85n6M04Pk65j16K33J38j45l21
5296b43RJ68J65l25j4J41K83m15j38N49p3Q3l48j23M18N1j96J84l04Q3J14j55
5318h6j1J82%j8l32L6N28k83k6j41J79K76j55n28K35J88Qj55j05J96J22j30l41
5341c61M86R5k66l68J04N83mk73K9J37j64q6jJ51K06k22l7j76K45L76m78k94J39
5364a79L33j27j82J37M7L9q6l73L99J00q7j4l50O24q2o5q6j09M49k66l03p2N63
5387C10q7k51l71N12K48n16n5L6M52k36J83n15O56k69J41k15k33L46o2k92J32
5408h6L68j65k71j90R8N42j68l68k4M69m4m88J78J35K80l4m84M0N38q8m58j13
$$ plain form
5250 -160 -102 -12 94 35 94 -217 111 291 132 -215 13 276 373 50 -283 140 -36 -10 -194 -187 -17 63 163
5273 163 136 84 178 32 -87 -188 19 189 84 -204 77 115 63 -122 -178 226 233 -32 -148 85 223 78 -243
5296 -243 -234 -66 99 -226 -240 -99 184 -231 -369 180 107 190 -158 -281 137 188 -8 176 -128 -45 69 -86
5318 -86 -97 85 85 67 -265 -229 299 16 -10 -151 28 304 149 -379 -144 44 52 -103 -208 -12 110 -20 -361
5341 -361 125 220 -46 -414 -310 273 269 -4 25 162 -2 -88 -89 62 268 46 9 -167 78 454 -24 -318 -179
5364 -179 154 27 -155 -18 29 68 -18 -391 8 108 21 7 -343 281 199 134 48 -61 388 122 -181 -253 310
5387 310 223 -28 -399 113 361 -155 -210 -174 278 42 225 -290 366 97 238 23 -210 136 74 -218 -86
5408 -86 282 117 -154 -344 -246 296 128 -240 -264 205 161 -327 -149 -14 266 232 -252 -212 326 238 -220 -333
5430c33M49L31k7q51K77K15K63l83k25M60K80n33M0L6K3J49n26J95L08k35K20
5451A33n24K88J33K14o35O2M14p7m4l77O56j42J48l61k1J69J68k26l56M53K18
5472B93k83J2j39L33l00j53J4N1M94m54N5q8J33J13r0l14J24M36l84k2R8L08j48
5495H9n22J6N61j37k27j13J72L14J26o31J96L15M52l24j5l68K35k09n10M45J53
5516A8L05l98k9J65L44l18n06M40J03M3l08j26M18K20j04o78K60R7L15p63K26
5537b76N09n1j99m37N70K59l98k23K08M4O9J04l98K79K29p3m99j95N43R1m64K72
5559c6K19k4j79k28n3M4L55l47QK64L7%l26K44R7Nj73q3M77M9m45J05Q9n8p6J72
5585A37l78J25L93k10O2j2J20j32k60J73J21J88m80J9L74j71j1j69j77O01l37
$$ plain form
5430 -333 116 447 420 -431 -154 61 324 -59 -284 176 456 -77 -37 -1 22 171 -355 -160 148 -87 133
5451 133 -391 -103 30 244 -391 -329 85 8 -36 -413 243 101 249 -112 -133 36 204 -22 -378 75 293
5472 293 10 22 -117 216 -84 -237 -223 -172 322 -132 -77 -165 -32 81 -9 -323 -199 237 -147 -169 -71 237 89
5495 89 -433 -417 144 7 -220 -333 -161 153 279 -352 -156 159 611 287 272 -96 139 -70 -580 -135 18
5516 18 323 -75 -104 61 405 87 -419 21 124 167 -141 -267 151 371 267 -411 -151 -54 261 -502 -276
5537 -276 233 182 -17 -454 116 375 -23 -246 -38 6 75 179 -219 60 289 216 -283 -478 65 156 -308 -36
5559 -36 183 159 -20 -248 -301 -257 98 -249 -241 23 60 60 -266 -22 75 80 -93 -176 301 350 -95 10 99 41 -35 137
5585 137 -241 -116 277 67 129 117 237 105 -155 18 139 327 -153 -134 240 69 58 -111 -288 313 -24
5606b4K28m39J14K13Qk48m5J75R2j05j31mK68k93M89k99J22j88N8J15j81J51j74
5629i8L4p0J57M3j59K62J0r6j57j86mK92q9M8KJ02j04o9L7j86M20l40j03J75M45
5654C66k85j28K39K24n22K4k42J39K71j68J73J34k57J73j1o57K32L85j28k81K96
5675b3n9K09qO0k17o4P2J8l73L22J07j28R7K47P0m48M7r9L19m24J67J91J39n5
5699A67j55j61L41k91J40j67NN2j38J56J19J47m16K37J8n16N24R8j84m1j25O2
5721a28m5L15K00l56n9Q5j49K57j3k35K87j72J41k12J91j4k69K04j19k4L7L90
5743C12n80Q2J67q1K18j38m0kK5j69L53Q5m88L07L39l02k43J01J39j12L41k55
5765E9k6p2J11j67J30J33j2j83R4k96L25j51k35K19Q3K06j05j07m17j7P26o16
$$ plain form
5606 -24 204 -235 -121 92 100 -148 -193 -18 74 -31 -162 -166 102 -191 298 -1 121 -67 -9 106 -75 76 -98
5629 -98 -64 -134 23 66 -93 169 179 83 -74 -260 -264 28 -61 -13 -11 91 -13 -82 -45 -231 189 -151 -254 -79 366
5654 366 81 -47 192 416 -106 -82 -324 -185 86 -82 91 225 -32 141 130 -527 -295 90 -38 -319 -23
5675 -23 -82 127 119 179 -38 -102 -30 -12 -385 -63 44 -84 13 260 330 -118 -71 -170 149 -275 -108 83 222 167
5699 167 12 -149 192 -99 41 -126 -121 -69 -207 -51 68 215 -201 36 54 -462 62 160 -24 -65 -190 -128
5721 -128 -173 142 342 -14 -73 12 -137 120 107 -128 159 -13 128 -84 107 93 -176 28 -91 -115 -78 312
5743 312 -268 -186 -19 -100 118 -20 -60 -62 -37 -206 147 232 -256 51 390 88 -155 -54 85 -27 314 59
5765 59 33 -39 72 -95 35 168 156 -27 67 -229 96 -55 -290 -71 12 218 113 6 -411 -428 298 -318
5787c18J92J62j14K23J31m01L63l12k94N78k33J80k56Q7J69%n4M2j32l9qK82k52
5810dJ42j47R7j79J08j99N62l94k4n0M46l52j17J32rk9R7k6j00j87L44r9j15k09
5834c12K67K1j02J63j17K6K2j81L37R7l23J03Q8qj05k29n8K91j49M25k25j93L48
5857A86l27j14R6M90j23k19l7N3j38P0L47l17o1K31o0J58l95K64K4K28k11l58
5879b13L69j6m91L08L80l83L96o28L68j42m7n8K69j91r6L78n22L84q0r0K17k1
5901I1j2l1O0l18J18L91j04j29p9p4N7J04l42K26J62j59n6k13K09L4l8p8j39L75
5925E5P7m1k00K83mk36j08q5J22K65m1k55M06k10N2j24o6M24j04o4J79n57K78
5948D6K4j46K16j2J35k79j98M20k29l62K55QK52j75K94k66J36k25L27k53q9N23
$$ plain form
5787 -318 -126 36 -78 145 276 -125 238 -74 -368 210 -23 157 -99 -12 157 157 103 145 13 -26 -34 248 -4
5810 -4 138 -9 88 -91 17 -182 380 -14 -38 -88 358 6 -111 21 12 -17 80 54 -46 -233 111 12 -103 -312
5834 -312 -45 -24 -126 37 -80 -54 -32 -213 124 221 -102 1 89 81 -24 -253 -311 -20 -169 256 31 -162 186
5857 186 -141 -255 -159 331 208 -11 -48 5 -133 -63 284 -33 -94 137 77 235 -160 104 128 356 145 -213
5879 -213 156 140 -351 -43 337 -46 350 -278 90 -52 -99 -157 112 -79 -175 203 -319 65 -15 -105 112 91
5901 91 79 48 108 -210 -92 299 195 66 -13 -87 -30 74 -268 -42 120 -39 -95 -308 -99 -65 -103 -181 -320 55
5925 55 132 91 -109 174 170 -66 -174 -259 -137 128 87 -168 238 28 80 -44 -110 314 210 146 325 -232 46
5948 46 70 -76 140 128 263 -16 -214 206 -23 -385 -130 -122 130 -45 249 -17 119 -106 221 -32 -121 402
5970D02k46j73N0j85L93k45l62L82J06j04n1J67o0J11k27n7j87M53k30j74O5L57
5992A85j64On3L70l0j12j48j89M60k01k75K75L1j6p6r4J84L5k13j32J16Q9K12
6015B60n00j40N48J21l56Kj19J72K90l70J41k4L07r7m28K6J10L74l60j88M5M44
6037B58j80l03j58Q37m04p5J85q4K91k70l50K79K30j27k78j17M17l37J96j57J29
6058a8M8K37k92k67M16J72k85m04L37L92j64l74M2M61L30o52m92P24J55j75k79
6079h8o3M01Q1o34k35N11N12l06k64o1J59K57n35K40K78p7j74n98J76O69j11k40
6101a02j09O20j6m20k83O6N87qm47k56N56r6o5k34L13qJ12n75kN82L65o18l53
6124c91N06J66p0m82J95L36j14l83r9M93J97k81k01j32O76j06r02K2P08K19k66
$$ plain form
5970 402 156 -17 33 -152 241 -4 -366 16 122 18 -33 134 74 185 -42 -99 -286 167 -63 -237 -172 185
5992 185 21 27 -26 344 314 202 54 -135 325 124 -151 124 155 139 63 -31 153 188 -25 -157 -41 48 260
6015 260 -240 -380 168 289 -67 -65 -184 -12 278 -92 49 25 332 235 -193 -167 -57 317 -43 -231 -186 258
6037 258 78 -225 -383 454 50 -25 160 76 367 97 -253 26 256 129 -149 -266 151 -186 10 -147 -18
6058 -18 30 267 -25 -292 124 296 11 -393 -56 336 172 -202 -160 301 631 -21 -513 211 366 191 -88
6079 -88 -151 250 331 -303 -538 -27 485 179 -85 -146 13 270 -265 -25 253 176 2 -596 -420 249 138 -102
6101 -102 -211 409 393 -27 -310 -244 343 335 -112 -368 188 92 27 -207 106 98 210 -365 -367 215 580 -38 -391
6124 -391 115 281 211 -271 -76 260 146 -237 -336 157 354 73 -128 -260 416 310 -592 -570 138 357 91
6145I1m26M71L42l44o34l1O67L72o10n38O50M34o27l30L90L27N79q97m02N20P49
6166G53n80l89R2L15K78q56l3O90K85j98r86N38O72k67n54j67P09K45n45k48K61
6187A5M38j73p28J11O30k7l28m52L97Q40m59o69j49J004J87p86n58N68P70l90
6207B41q70K67Q40L9n04o48N73N91l33o89J05P32J93p81m15O75O59p97k98J25
6227b95Q89l23n53K6K60L70n84n10Q36K67J51r95K9P94J81m98q43P34P90l89r66
6248f29J18Q29R4r34j58P56M69k12r33L01Q45l29o19k00J090J11l89j178P30P55
6268E17k52p28P6N79M76q51o65L11R39N9j043M88J04N41r08l63O41Q93q46m57
6288d89k61J159K80j046o17Q04J094l87j164J12J128L30j541r3Q70O26n70q22
$$ plain form
6145 91 -335 136 478 134 -500 -531 136 508 -102 -640 10 444 -183 -513 -123 204 783 -114 -516 4 753
6166 753 173 -216 -124 191 469 -387 -420 270 555 357 -629 -91 581 314 -240 -407 302 547 2 -246 15
6187 15 453 280 -448 -337 293 266 -62 -514 -117 723 264 -405 -554 450 637 -149 -707 -139 631 241
6207 241 -629 -362 478 517 13 -635 -62 529 196 -493 -388 344 537 -244 -659 16 675 -122 -420 -295
6227 -295 594 271 -282 -256 4 374 -210 -720 116 383 534 -461 -432 362 543 45 -798 -64 726 337 -629
6248 -629 -511 318 412 -522 -680 76 545 333 -600 -299 546 217 -402 -602 488 599 210 -968 -238 517
6268 517 265 -463 -387 192 668 -183 -848 -537 402 461 -582 -94 10 551 -357 -720 -79 814 -32 -489
6288 -489 -750 409 689 -357 -974 -170 924 537 -627 -515 613 943 -598 -691 179 805 235 -587
6306e87K98N56J20j180K43P75N95j076n58M54P64J68q30m67R06P79j098q26Q92
6325g2J070o21j131L42Q81K97q53o89O01P68J10j575J58J447N9j079m84J039L74
6344F42l70r52K37J363k23j370m18J414L78o89q42N35J127l38j068k71J110Q37
6362A102j231q32J045P99m30j256J29J088P31j188p54O95J046n93j346L81J571
6379I57m46q30m37P19P75o82p25L27J080p3j130l77R89O02o44q68K24J097K54
6398H12j254k72J233M08q76r41N83R26m36p44qJ129K22o61j109P12J034k86j141
6417f69K77J189j46p36j140J577O59j075j003P09J007J65j439k48J402N05j153
6434a19p33K75J484Q4j699o6Q94R55j116q42M72J414o98j174L54J244K96j445
$$ plain form
6306 -587 -289 267 387 -793 -550 225 820 -256 -814 -360 404 572 -258 -725 181 960 -138 -964 -72
6325 -72 998 377 -754 -412 469 766 -87 -776 -175 593 703 -872 -714 733 792 -287 -771 268 642
6344 642 272 -680 -443 920 697 -673 -1091 323 701 12 -830 -295 832 494 -574 -845 265 1102
6362 1102 -129 -961 84 883 453 -803 -674 414 1145 -43 -797 -102 944 351 -995 -614 957
6379 957 511 -319 -756 -37 738 56 -669 -342 738 665 -465 -842 147 749 105 -763 -539 558 812
6398 812 -442 -714 519 927 51 -890 -307 619 183 -561 -569 560 782 121 -988 -276 758 472 -669
6417 -669 -392 797 651 -85 -1225 352 1011 -64 -1067 -358 649 814 -625 -873 529 1034 -119
6434 -119 -852 -577 907 991 -708 -774 120 1075 -41 -883 -411 1003 305 -869 -515 729 1025 -420
6452d20m63Q62P91k59j456J75J773k7r71j060J027R30p05j189K86J336K95r27
6470bj061J181R27q43j206N08J457m04j025m21R94R82j217q13Q30J045j03j772
6488i43l4J378N28q60j235O40J353r0j703R7J580L60j524r09J079J406r37j146
6506i60K28J436L78j414o02Q86J137q70j236Q7J703j49j092m10J221N94q60j396
6524a319O60J629k87j330l04J347L47p89j048Q30J051l06r62j71J134M13j230
6541c35n21O19J129l49j437J57J566K93j308j218J463J097p64j490N38J383M8
6558H71j473l66J165Q07r44j423J004J281m8j574k85J269P17r10j425Q30J486
6575I82j61j725l53J772O75j520p76R45J326n98j423O9J481L01j304r11Q98J539
$$ plain form
6452 -420 -883 -21 770 511 -945 -770 1003 976 5 -1055 -28 902 197 -992 -706 630 925 -2
6470 -2 -1063 118 1045 202 -1004 -496 961 557 -468 -889 105 1087 -130 -943 -113 932 829 -943
6488 -943 -977 401 929 69 -1166 -526 827 737 -966 -869 711 1071 -453 -1362 -283 1123 186 -960
6506 -960 -732 704 1082 -332 -934 -48 1089 219 -1017 -930 773 624 -468 -878 343 937 77 -1319
6524 -1319 -659 970 683 -647 -951 396 743 -46 -1094 -264 787 481 -481 -652 482 895 -335
6541 -335 -856 -237 892 543 -894 -737 829 1122 -186 -1404 59 1156 392 -1098 -560 823 871
6558 871 -602 -968 197 1004 60 -1363 -359 922 874 -700 -985 284 1001 91 -1334 -504 982
6575 982 821 -904 -1257 515 1190 -330 -1106 -161 1165 567 -856 -787 694 995 -309 -1220 -322 1217
6593A217q63j370M64J460M2j323n80J115J098j044j360M43J581O1j364o67J008
6610h2J233j179j010N68J170j71j172m16J743M21j218j102O24J734m77j676R6
6627i14J514O09j379q65J119P98j95j792L20J165N00j413o31J105J242r88j285
6644a090O55J418o5j222p02P90J555j288j275P74J562m31j282j22R00J018j241
6661d6j020R22J021j06j660J76J118O12j270r28J095R74m47j331M9J547K63j187
6679b18q23J242O85k06j609M13J372N3j386n43J190R77j099q91L43J248K65j658
6697f45l66J123P49j056p49N62J339o7j630j26J409K64r26r46R26J094p22q04
6715e71k00J466K02q78q67P09J143o07j260r9J432M29r35q95R45P69o55j211O24
$$ plain form
6593 1217 354 -1016 -552 908 950 -373 -953 162 1260 216 -1144 -701 880 941 -423 -1090 -82
6610 -82 1151 -28 -1038 -470 700 529 -643 -1059 684 1105 -113 -1215 -591 1143 666 -1010 -914
6627 -914 600 1209 -170 -1035 84 882 687 -1105 -785 380 880 -533 -1164 -59 1183 195 -1090
6644 -1090 -435 983 918 -304 -1006 -216 1339 51 -1224 -450 1112 681 -601 -723 177 1195 -46
6661 -46 -1066 -144 877 771 -889 -713 405 1017 -253 -1181 -86 888 441 -890 -841 706 969 -218
6679 -218 -1041 201 886 680 -929 -516 856 909 -477 -1020 170 1147 48 -843 -500 748 1013 -645
6697 -645 -1011 112 861 -195 -944 -382 957 890 -740 -866 543 807 -119 -1065 -139 955 233 -571
6715 -571 -771 695 897 19 -848 -139 1004 397 -863 -962 470 899 -36 -931 14 783 128 -1083 -459
6734d59J302J0j503l67J279R25j140j165Q00J183J52j542l48J195M96p35j010
6751i27N11J101j19j098o12J610Q11j355q99P74J327p18j323J41J381M52j144
6768h7p32P15Q44n64r13N6J170N15j422n52J528K52o26j011L42J072L75j383l17
6787g38R61P67p02j296P40R31l97q76l19R09O72r42k53M75J041n54j163L04N88
6806A48Q06j336l23O86R03m23j256J90J094J41r49m98P62Q14p05r89P19O30J3
6825D27q01l07R35O12j049m27M39R33j57r83j78P99N61p81j004P39Q81m40l81
6844a82l49Q37M08p60p08P52P53k46j232L89O63L88q20n10N16O50j07j079mJ161
6864E20Q7p27m26N14Q70p85p26M97O45K81j076L8M87M79o87p02P92K38O1o11m22
$$ plain form
6734 -459 843 853 -650 -1017 262 1187 47 -1118 -318 865 1017 -525 -873 322 818 83 -927
6751 -927 -416 685 566 -532 -1144 466 1277 -78 -977 -203 1124 406 -917 -776 605 1057 -87
6768 -87 -819 -104 740 176 -737 -681 489 1004 -418 -970 558 810 184 -827 -485 587 962 -421 -738
6787 -738 223 990 288 -1008 -268 663 266 -610 -929 -20 652 -290 -543 -68 973 419 -744 -440 148
6806 148 954 -382 -705 -19 884 461 -795 -605 489 630 -319 -817 -55 759 54 -935 -216 414 427
6825 427 -374 -681 254 866 -183 -610 -171 762 605 -378 -556 243 804 23 -981 -242 639 199 -182
6844 -182 -531 306 714 -46 -754 -2 751 505 -727 -338 325 713 -107 -617 -101 549 442 -637 -641 520
6864 520 607 -120 -546 -32 838 53 -673 -176 469 750 -326 -288 199 678 -9 -711 81 319 380 -231 -653
6885f53R15M34o38o58M26P87m06o39J19P46L3m27q19P27O35m43m73j75O58L57
6905E06p16l24Q16J85l63m32QQ60j55p40q9M30N76m46r12N50N09J65q72K03O80
6926D39j19k30o89L21R51j25j137o0J118J1p95j88M41N09J47p89k05N38L9j52
6946B5m41M60N05m90l51j25Q20j59l51j62n4P18l14o18K42O01O4m21k08N44L09
6967E94o60j42J64L25M9o25K06K67M44o20n76M79K87j15l88j5N67J75n71k81L22
6988a14O96n98m71K15L58J54l55k3K32K86j92n53K11J48L46o02o9N30L7j23m33
7009c20K67k3L64j87l02K05N01n04k09J1N47k49l28l31N83m4j38l19K47N96k17
7030A50n73K25L77L77p95L12k54P22m89k74j07N02L93q85L02J5J38j53k50Q3L60
$$ plain form
6885 -653 262 696 58 -600 -174 613 207 -432 -313 433 466 39 -780 -53 582 139 -334 -509 149 506
6905 506 -210 -534 282 467 104 -328 -320 540 385 -355 -444 -14 562 116 -796 -246 263 428 -444 -241 439
6926 439 320 90 -599 -278 673 548 -589 -649 469 480 -315 -503 -62 447 594 -195 -400 138 177 25
6946 25 -416 44 549 59 -292 -417 403 244 -107 -269 -323 395 81 -537 -295 306 370 -51 -259 285 594
6967 594 -66 -208 -44 281 330 -295 -89 178 622 2 -574 -95 192 77 -311 -326 241 416 -155 -436 -114
6988 -114 582 -16 -487 -272 86 240 -115 -138 94 380 188 -365 -154 -6 340 -262 -331 199 236 113 -320
7009 -320 -53 -76 288 101 -201 4 505 1 -208 -197 350 101 -227 -558 25 -19 -157 -476 -229 367 150
7030 150 -423 -198 179 556 -239 73 -181 541 52 -222 -329 173 566 -319 -17 -2 136 -17 -267 -184 176
7051A76J11m67m7J95J64j68j26K7K73Jq0k24r6N43k07l35J55K42j40k7j46J17
7073e9P5k21K92J0J51Km72P9K8L60o66N41R4R1K57m86K4j68K99k72k52K84J99
7096A90k99J47q6J36j21M8oL36l70K98m44J69K86m03k5J34k8M95m24k67J35O4
7118c5J51k63J47j05J51j03JK78k16j9j50M0K68k28jL09j54l9n5K9p2J3L8k58
7142b73N10p6q2k62J56R1k99J41q5J2J66j74M54o56M84k02k35J43K21L8p4j67
7164a69k5N63k17k53o7L21J1j96k32M31k34K01N1r1j36L8P2K14n86M35l8j31q0
7187a18K03K3j19R1K4M6l29J11r4J59J74q2q5NP7o0j82NM58j0j53k46J38r9K57
7212A94j43J6j4rl92L52J15N3j07j13j9J63K07l07o9J65Q2n2n1l14J3R1n1J02
$$ plain form
7051 176 287 -180 -227 -32 132 -36 -162 -135 138 139 59 -165 -261 282 75 -260 -105 137 -3 -30 -176 -59
7073 -59 16 -205 87 97 248 250 -222 -143 -115 245 -421 120 214 305 562 76 100 -68 231 -41 -293 -9 190
7096 190 -109 38 -48 88 -33 15 9 345 -25 273 -171 -2 284 -119 -144 -10 -38 457 33 -234 -99 -35
7118 -35 116 -147 0 -105 46 -57 -56 222 6 -13 -163 -123 145 -83 -84 225 71 32 -23 6 -66 -53 -15 -273
7142 -273 237 161 79 -183 -27 64 -235 -94 -179 -167 -1 -175 279 -377 107 -95 -330 -187 34 72 -2 -169
7164 -169 -194 369 152 -101 -168 153 164 -32 -264 167 -67 134 185 94 -42 -4 68 282 -304 131 93 -38 -118
7187 -118 85 108 -11 80 104 150 -179 -68 -162 -3 171 89 4 9 86 26 -156 -151 307 297 144 -102 36 -63 194
7212 194 51 67 53 44 -348 4 119 172 65 -48 -67 96 303 -4 -73 92 174 122 71 -243 -230 -139 -190 -88
7236h8K79j76k7j20L3K93j22l40M69M0j57M4k91j52L56J75k26n5L82m51J72j49
7258a11p3K56q7j43K53l52L58o0K3Pk50J62m14M44M3l4p5njJ79j84L88k40m5j70
7283a31K10l08P9K30p2Kq1M7J00M5l56L46k37j76L69j90K83k8m65M69j85k13L75
7306A13k02K87J08qk04j86J95l57L60K5j08J17j42J69j35j03N9L7j44l0O6O2n3
7329g4O3J71l06L9j22M03r2k14M44k4k39n6J43k21p3J24R6j51l9j41M38j09j49
7352h9k24N82n85K31L18j68J43q4J43k74N2j58L65j49j1K6m4k50r1M09j51k75
7374b84K13m9J10N2P0N1p6J31m79M04k6M6k01k5K15J84j62l5r9R4j22M5k6J09
7398A40j14K47j80j67J47L7m8j34L12k49k9q1O2J90l99J86k0K26k51r5K93j11
$$ plain form
7236 -88 191 15 -12 -132 -99 194 72 -268 201 241 84 128 -163 -315 41 216 -10 -65 317 -134 38 -111
7258 -111 -184 72 -15 -158 95 -257 101 41 64 71 -179 -17 -431 13 56 22 -53 -58 -59 120 -64 324 84 39 -131
7283 -131 79 -229 -150 80 8 10 -71 -24 76 121 -235 111 -126 -302 67 -123 160 132 -333 136 -49 -262 113
7306 113 -89 198 306 298 94 -92 103 -254 106 131 23 140 -2 167 32 -71 -12 25 -119 -149 -83 -21 -74
7329 -74 -11 160 -146 -107 -229 174 82 -132 312 288 49 -7 136 -85 -158 -34 62 -89 -128 -269 169 60 -89
7352 -89 -313 269 -316 -85 233 65 208 124 267 -7 45 -113 252 103 92 118 74 -176 -267 142 -9 -284
7374 -284 -71 -120 -10 42 112 163 87 218 -261 143 117 163 -38 -63 152 336 174 139 40 134 12 57 31 140
7398 140 26 273 93 -74 73 110 62 -72 240 -9 -38 -119 -57 133 -266 -80 -100 126 -125 -220 73 -38
7420c8J1r5K15j6N0P2l98M72j57J14k38J10m09K75L33m16J80J73j28j65m9J26
7442B2L8j4j03J9j03K11l74M56l91J81J42l78J70Q0j13P3R2L6J38N1j31j15J09
7465I6K49k62k68J81Q7P1j76m4J64R0l74K12K17r5j37OJ63l68K57N8k21L11m9
7488A68j01J38j58j35J07j72j66m6M7N2L73j5%m8j73J98on6j22J86J88j38mk23
7512a06K59k33L26j67k56K29j39k32L12R6M5l2Pm2k64O45n86k15K57l0j99K60
7534f5L1L8J7O0k02J72k04L88m26K62p4q2K9J38j49K19p7j21J56j0l8k8k12J04
7558g4k7oo8J43J25j45O3o6J1k4K8j54K48Q6j89r6J72k06K86j05pk6J18k36J27
7583b2R1k42J84J3k56J98J77j16j2l63M35n3n3l42l9K74J93j32k5j4K31j15NR7
$$ plain form
7420 -38 -27 -122 93 77 127 199 -199 273 116 230 -8 102 -307 -32 301 -115 65 238 110 -55 -104 22
7442 22 60 46 -57 -38 -141 70 -304 152 -239 -58 84 -294 -124 -44 -157 -84 8 44 182 233 102 -13 96
7465 96 345 83 -185 -4 83 154 -22 -66 98 188 -186 26 243 148 11 17 180 -188 69 127 -94 217 168
7488 168 67 205 47 -88 19 -153 -319 -365 -318 -266 107 92 92 44 -129 69 63 7 -115 71 259 121 117 -106
7512 -106 153 -80 246 79 -177 52 -87 -319 -7 89 134 102 109 67 -197 448 -138 -353 -96 -126 -325 -65
7534 -65 -34 4 21 81 -121 51 -153 235 -191 71 -3 -85 -56 82 -67 152 75 -46 110 100 62 34 -178 -74
7558 -74 -101 -107 -175 -32 93 -52 11 -55 -44 -68 -40 -194 54 140 -49 -145 27 -179 107 2 -5 -31 87 -149 -22
7583 -22 69 -173 11 24 -232 -34 143 27 15 -348 87 34 -19 -361 -400 -126 67 -65 -90 -104 127 12 17 114
7607A14j75J35k28L52j43J86r6r2j54n8P3P9K75k67O7j0l75O56m06k52M02K06
7629B89l40l7O7j07L76p5l07K40J38J4q5l15k66K17M14l31L11k98Q3O0L02j78
7651A72n0j83K46l35k04N33J3j93j61L70m07J60J73k68K73J0k0l23O7r7N24l80
7673h0L2j9pPM63k03j51p4k68L28j14J56j12P9J15L32m43O4k92N0K02j22K8J39
7697A10q7RL6k93M70k06j62K28j50J78O7k7j14N6j51oP4r2k3K01o8k47K70l3k37
7722a97K19j59J35j56Rj3M45l61L51k15m9j26J56j13J76J76r4J29l77J42L4K4
7744A36m6k90m7N1J71j0J48o5N6j13K12k44k9N1l7L6M1j40J97o7N8j05K64n29
7768c01L42L70k73j03Nj31j18J01J50k24j39L99K66j40L58l69j19K4j4l57L9N98
$$ plain form
7607 114 -61 74 -154 198 55 241 145 53 -101 -159 -86 -7 268 1 68 58 -317 339 -67 -319 83 289
7629 289 -51 -88 -21 -128 248 173 -134 106 244 258 173 -142 -408 -191 223 -108 203 -95 -12 48 350 172
7651 172 122 -61 185 -150 -354 179 192 -1 -162 208 -199 -39 134 -134 139 149 129 -194 -127 -224 300 -80
7673 -80 -48 -67 -74 -67 396 193 42 -32 -300 28 -86 70 -42 37 152 484 41 105 -187 -137 65 -57 -29 110
7697 110 23 32 68 -225 245 39 -123 105 -45 133 200 173 59 115 -36 -42 32 -60 -83 118 50 -197 73 40 -197
7722 -197 22 -137 -2 -158 -149 -162 283 -78 273 58 9 -117 39 -74 102 278 184 313 -64 78 112 136
7744 136 90 -200 -247 -196 -25 -35 113 48 104 -9 203 -41 -70 -19 -56 -20 21 -119 78 11 69 -36 228 -301
7768 -301 41 411 138 35 40 -91 -209 -108 42 -182 -321 78 344 204 562 193 74 98 84 -273 -234 364
7790C64j91n15N31r7k41j27L10pk1j67L05J0j90j03J59n9r4K03nk02o7L21J3l15
7814a85R5M80l11j65R8J51k75P8k57L35J96m25L98m19K79k1M6k14J37Q0j30p3
7836a02L98k82j63J87k22J49K6j06m5O4R5K8j68J65K07k98J59M6j68M2k7J59N4
7859A98l71K26k62K27J17M8l69K15L04l23J0J60l13k7J25lj0j59M19k88J86j24
7881a4O4nj05N8J65L2j5l64K82j84j1J14J56J03j42j99j66K3J89j1J64k28J04
7904A0K54k77K4j84L45J27l57J35j06L7K35l83J32j56J52N4j21L08l61R3K49l72
7926a62M89n15K5K50ln0k57K37ql00M40k16LJ49J34Q6q3j93K4j79O8j12M37O9
7950C33l28j82M1J87J14l84L91l37N29m87NN00l34j67J70j80L01k3J7j66j77J52
$$ plain form
7790 364 173 -342 189 92 -149 -276 34 27 6 -161 144 154 -36 -139 20 -39 -133 70 65 -137 -204 117 130 -185
7814 -185 -90 390 79 -86 12 163 -112 -34 -291 44 240 -185 213 -206 73 52 98 -116 21 101 -29 -102
7836 -102 296 14 -149 38 -184 -35 -9 -115 -160 -96 -1 27 -141 24 231 -67 92 138 -30 12 -15 144 198
7859 198 -173 53 -209 18 135 183 -186 29 333 10 20 180 -133 -160 -35 -38 -48 -207 212 -76 110 -14
7881 -14 50 45 -60 -2 163 195 180 -184 98 -86 -97 17 173 276 134 -65 -231 -208 -19 -30 134 -94 10
7904 10 264 -13 11 -173 172 299 -58 77 -29 8 243 -140 -8 -164 -12 42 -79 229 -132 -39 210 -162
7926 -162 327 -188 -163 87 84 34 -223 14 6 -294 146 -70 -67 82 216 302 219 26 50 -129 -61 -173 264 333
7950 333 5 -177 -136 51 165 -219 172 -165 364 -123 -118 382 48 -119 51 -129 172 149 166 0 -177 -25
7972b5lO7j31J05L64k49j17L31k70q2L5l8K77r3l67L44n68O09l40J22o6K79j96
7995a2J94l9o9m5k2k23M52lj89q1J7l4L5k86K07J8J78k1k35p4J49J16q1n3N5M1
8021ek10K19j02J12j37L48l15J48j23J04j35J6L99j35k37KP3M1m6k44L84p6K5
8044A06j7j44J56M3k19j7k4M31m55L25o2q1R4No5l7pj22L2J31j20J15l73J7K41
8069d7L31k0j08k44L42j23j16M07j81l37J83l4R0m3P8k03j55K91j94o4k07L34
8091b0o8J01j44K03k3k12K82k51J77K55Jj35j8l31K40P4k15R8L03k90j11J18O
8114D0o4j41K91K7j02J71l56K41r6K91k11o4j43O9M20l51m2l23M70j01J43k76
8136a07N5O0K0l50M42M6j07j12L09j70n3j53K52r8L5n03L31m9kq9l15Q38j34J93
$$ plain form
7972 -25 -28 39 -92 13 377 128 11 342 72 -10 25 -13 264 171 -196 148 -420 189 -151 -29 -95 184 -12
7995 -12 182 143 74 29 7 -216 236 233 44 -37 -20 -54 -19 -305 -98 -80 98 77 -158 -232 -83 33 -48 -101 -46 -5
8021 -5 -215 4 -98 14 -123 225 -90 58 -65 39 -96 -80 319 184 -53 -51 22 63 17 -227 157 81 106
8044 106 89 -55 101 144 -75 -92 -116 315 -140 185 123 42 136 141 76 39 32 -90 -58 73 -47 68 -305 -288 -47
8069 -47 284 264 156 -88 254 131 15 422 241 -96 87 53 143 100 178 -25 -180 111 -83 -147 -354 -20
8091 -20 -88 13 -131 72 49 -163 119 -132 45 300 301 166 148 -183 57 131 -84 14 317 27 -84 34 40
8114 40 -24 -165 126 153 51 222 -134 107 11 302 91 27 -116 -47 373 22 -20 -343 127 26 169 -107
8136 -107 -52 8 28 -322 120 166 59 -53 256 86 33 -120 132 34 69 -434 -103 -152 -154 -243 -558 280 146 339
8160C39l67j01J15K13j80j9m2K49j68J22l85L01k84L38k95N5j15L85k02o0N3L9
8182ij07J61k57n5M88m25L95k99l6
$$ plain form
8160 339 -28 -129 -14 199 19 0 -42 207 39 161 -224 77 -207 131 -164 -109 -224 161 -41 -101 -48 -9
8182 -9 -116 45 -212 -267 221 -204 191 -108 -144
8191a44
$$ Imaginary data points
##PAGE= N=2
##DATA TABLE= (X++(I..I)), XYDATA
0@%%%%%%%%%%%Lj1J6j6J6j6K0k8L2l4M2n0N7o4P3q5R6j10J25j38J54j73J91k14
35a14K41k68K97l29L64m03M47m95N48o08O73p46Q34r34J049j186J351j554J814
54I81k159K633l336M484o671J2264n0256j23890J27278J64489k6199j61140m3667
67a05189J05469P6297n2635n9920K3851L6520l5419l0901N6763O3278n9941j12947
79i4774J9822J47492N2321j36140j27197P7704J64975N494j52607p4946J00700
90a7156J04826m1505r4671M106O8342J304n2325Q803O2734r364q8916j8101J06322
103C4399P0136r1071j22582L8464J47770L3392j30913r4308P9562J21270j9033
114F7086j11199k4455Q1549L9338n5999l5515M8856L3165n7193m7502O1828Q0269
$$ plain form
0 0 0 0 0 0 0 0 0 0 0 0 0 3 -8 8 -8 8 -8 12 -16 16 -18 24 -26 31 -33 40 -45 51 -59 66 -72 82 -91 100 -114
35 -114 127 -141 156 -173 191 -212 235 -260 288 -320 353 -393 441 -493 556 -630 721 -833 981
54 981 -1178 1455 -1881 2603 -4068 8196 -42060 -165950 -38672 125817 99618 -61522 -105189
67 -105189 280 76577 23942 -35978 -12127 24393 -11026 -41927 14836 78114 18173 -94774
79 -94774 -74952 72540 124861 -11279 -138476 -60772 104203 109697 -42910 -117856 -17156
90 -17156 87670 46165 -48506 -44400 23942 25246 -27079 -18276 44458 35094 -53822 -71923 34399
103 34399 104535 13464 -109118 -70654 77116 110508 -20405 -114713 -35151 86119 67086
114 67086 -44113 -68568 12981 52319 -3680 -39195 9661 42826 -14367 -61869 -41 80228
126H0228m5482j13406O62J26448N7514j04560j06866N3900J26938N156j12485
137c1953n0535P8274O8479m3176o5611K3609N7499j9277n8958J7249P3571j875
149D7296r0655l1722R1961P5756o7261j11524K0086J21511L3652j01657p3708
160h6265O2389Q8360k2559q0720m261O5434J4180n5664j7794N5956K7793n9811
172a2962m9962N3845P8900k8595j00314j2558J00764N7064p6553q8403L5863R7422
184E4511M594q5111l1231O2797M3090m4628m4806L4300M9040k9762n9601J9656
196b7151P3770K943q2577l5945P4805P0123m8296r1857R474R3334K8379p5540
208h538n4462M9017O4131k4410o2418P733N8367J876n7123j2839N9818K9229n8571
$$ plain form
126 80228 34746 -78660 -77998 48450 105964 1404 -105462 -51562 75376 80532 -31953
137 -31953 -82488 -4214 64265 21089 -44522 -20913 36586 17309 -41649 -24400 49171 47296
149 47296 -43359 -75081 16880 92636 25375 -86149 -66063 55448 89100 -12557 -86265
160 -86265 -23876 64484 41925 -38795 -43056 22378 36558 -19106 -36900 19056 46849 -12962
172 -12962 -62924 -9079 69821 41226 -59088 -71646 29118 86182 9629 -78774 -42911 54511
184 54511 59105 -26006 -57237 5560 48650 4022 -40784 -6484 42556 12794 -46807 -27151
196 -27151 46619 49562 -33015 -68960 5845 75968 27672 -64185 -54711 38623 67002 -8538
208 -8538 -63000 -13983 50148 25738 -36680 -28947 29420 31296 -25827 -38666 21152 50381 -8190
221h190n1412M5776P3731k0148q5440j3378P9655M5842n8361o6510K8700P1575
233D1840j289o4367j7451N1989K8244m2334l5077L6178M3273k9086n5270J5869
245b7481O6966N723o9974l3125N9879N8045l6952p1966P623P0945J8826n7783
257i274l6624M0476M4306k5280m5400J3469M7148m790m9619q024N2931K4803m9545
270e423m4797L6109O1762j3160o8768j3560O1853L7210m5145n0933K4509N4119
282C3776o313n0399p059M5065J5919m0638k4567L6375L6004k8840m8337J4349
294b4665N6971O439n6640k8939M5767M6484k7040n4569N635N2587J3154m4961
306i777k4613L4787L1192k5441l5516J7304L9985p949m4466m740M5662K1008m1091
$$ plain form
221 -8190 -59602 -13826 59905 39757 -45683 -59061 20594 66436 8075 -58435 -29735 41840
233 41840 40551 -23816 -41267 10722 38966 -3368 -38445 -2267 41006 11920 -43350 -27481
245 -27481 39485 45208 -24766 -57891 1988 60033 23081 -48885 -41262 29683 48509 -9274
257 -9274 -45898 -5422 38884 13604 -31796 -18327 28821 24031 -25588 -33612 19319 44122 -5423
270 -5423 -50220 -14111 47651 34491 -34277 -47837 14016 51226 6081 -44852 -20343 33776
282 33776 27463 -22936 -29995 15070 30989 -9649 -34216 2159 38163 9323 -39014 -24665
294 -24665 32306 38745 -17895 -46834 -1067 45417 18377 -36192 -30557 22030 35184 -9777
306 -9777 -34390 397 31589 6148 -29368 -12064 27921 19972 -24494 -29234 16428 37436 -3655
319c655l6478K7881M7738r304n1024r641M5146K5094l3354l4275K0026L7358p745
332A7767l7616j495L6131J0120l4599j9266L1217K9409k3577l9320J1116M5080
344B4967M932m3715k1276L5306L3324k1510l9297O950L8688N608l3708j4876K7947
357C340K0667k1994k6072J6022L1198p792l5789l262L6913J6572l2562k8882K2400
370i241L6755p896l8976n885L4329J7104k6483k3259J7514K6085r792k7222L423
383a3544K7579M462k8410j2905K5958K2064j9481k9485Q312L3790M047l1313j6120
396b5046K4697K3627j5394k6788O050K6545J305k4168p758K2539J2746j9535j8217
409a9397J5102K3336p819k7298j151K7327J1317k3304j9834J5524K4540o036k5253
$$ plain form
319 -3655 -40133 -12252 35486 26182 -24842 -34483 10663 35757 2403 -31872 -11846 25512 17767
332 17767 -19849 -21344 14787 24907 -9692 -28958 2259 31668 8091 -31229 -20113 24967
344 24967 29899 -13816 -35092 214 33538 12028 -27269 -20319 18369 23977 -9731 -24607 3340
357 3340 24007 2013 -24059 -8037 23161 15369 -20420 -23682 13231 29803 -2759 -31641 -9241
370 -9241 27514 19618 -19358 -25243 9086 26190 -293 -23552 -6038 20047 10255 -16967 -13544
383 -13544 14035 18497 -9913 -22818 3140 25204 5723 -23762 -15450 18340 22387 -8926 -25046
396 -25046 -349 23278 7884 -18904 -12854 13691 14996 -9172 -16930 5609 18355 -1180 -19397
409 -19397 -4295 19041 11222 -16076 -17227 10100 21417 -1887 -21721 -6197 18343 12307 -12946
422a2946k843K2816R809j9052j3895J3580J8086r480j9954M276K1796J771k2331
435h367q698J9743J6029j5074k1218P680K3313J267k2449q570J7828J4396j2132
448C748j7465O899J7611j043j7443l230J5603P778j4275j2160J1437J6589o806
461G243j9105J16J9352P199j6761j3308J1937J6643n879j7118p2J5735M502j3041
475b557p682J0554R995q271j1920M834J4113o54j5139m510J4123R639j0567j3833
489a1875N100J5897K51j4359n294J1949P822q323r913N544J0799k843j1380k9
503f654J1850L283j1152p555J0110J0245n679j2838J190J2319L805j0612p358
516i046P760Q674l761j0086J625R496J257r354l632Q586O112p081q375M685J0261
$$ plain form
422 -12946 -15789 7027 16836 -2216 -16111 -2531 15555 6075 -13879 -9603 12193 13964 -8367
435 -8367 -17065 2678 18707 3633 -17585 -9905 13408 14675 -7774 -16344 1484 15880 3748
448 3748 -13717 -6818 10793 9750 -7693 -10923 4680 12458 -1817 -13977 -2540 14049 7243
461 7243 -11862 -11746 7606 14805 -1956 -15264 -3327 13316 7437 -9681 -9753 5982 10484 -2557
475 -2557 -10239 315 10310 2039 -9881 -5047 9066 8412 -6727 -11237 2886 12525 1958 -11875
489 -11875 -6775 9122 9373 -4986 -10280 1669 9491 1168 -8745 -3201 7598 4755 -6625 -6654
503 -6654 5196 8479 -2673 -10228 -118 10127 4448 -8390 -7200 5119 8924 -1688 -9046
516 -9046 -1286 7388 3627 -6459 -4834 4662 5919 -3435 -7067 1519 7631 550 -7825 -3140 7121
531G121j820j0825j925J0068N177p369p868M563Q548j499q192j242P507L449o424
546g31m724M261O391k894p281J014P580J412p553l624O379O170m439q055K076
561d018P991J415p703k953N673M726l873n648K342N727j068n820l7N202K135n258
577a167l836M356N353k401o340j26O223L002n532m338L222N479j737m991O0M714
593A941Q53m210k026M146L061l895m021K457N541q24n707j430N327K761l326m211
609c563J471M356J64m033q62K873K202k958k218K168L545j975m119J009M371P92
625C223m619j681K799L509j804l777O13L542K20k945j492K867J563j676k351J294
641g15K396l32k697q84L089J659k298k625J524L025l53l724k22L267J296k840
$$ plain form
531 7121 5301 -5524 -7449 2619 7796 427 -7441 -2878 5670 4171 -4021 -5263 2244 5693 -731
546 -731 -5455 -1194 5197 2303 -4978 -3964 3616 5028 -2525 -6149 230 6400 1961 -6094 -4018
561 -4018 3973 5388 -2315 -5268 405 5131 1258 -4390 -2048 3679 2611 -3209 -3246 1956 4091 -1167
577 -1167 -5003 -647 4706 2305 -4035 -4161 2062 5064 -468 -4806 -1584 3895 2158 -2833 -2773 1941
593 1941 2794 -1416 -3442 704 3765 -130 -4151 -1694 3847 3023 -2684 -4114 1213 3974 648 -3563
609 -3563 -2092 2264 2428 -1605 -2467 406 2608 -350 -2568 -400 3145 1170 -2949 -1940 2431 3223
625 3223 -1396 -3077 -278 3231 1427 -2350 -1737 1805 2025 -920 -2412 455 2018 342 -2009 -715
641 -715 1681 1349 -1348 -2232 857 2516 218 -2407 -883 2142 1789 -1935 -2157 1110 2406 -434
657d34k113K075K679q83l253M04K788K63k256j156K347J442j660j655N46K301
673A435J57k710q80K429J993j845k835J146K484L42k366r71J813J971k074j265
689a176Q46J563n45k303L64K457L66k015j196J468K237q79k478j80K056R80j630
706f5j338Q92J785l79j353l64J711K4j812n30J861J292j606j739M56K870m41j889
724f25r35J608J233q88j208L79R82J83j513m78J743K91r66r45J004J370m15j484
742f64q20J676J035p19j997J119J061k20j183l88J561R32j747j271J263J648n62
759G24j775J89J473J45q55q43P55P55j6j040n11J376N84j160j312J225J549l72
777H91j889m05K115Q47j837q21Q40J416o36j484q5J831r9j192m69J227Q91r48
$$ plain form
657 -434 -2547 -472 2207 1324 -1929 -1525 1263 1526 -730 -1886 461 1903 243 -1412 -866 1435
673 1435 1592 -1118 -1998 431 2424 579 -2256 -1110 1374 1716 -650 -1621 192 2163 89 -1176
689 -1176 -330 1233 688 -1615 -1251 1206 1572 -443 -1639 -171 2066 1187 -1291 -1471 585 1565 -65
706 -65 -1403 -511 1274 895 -458 -822 889 913 -899 -1429 432 1724 118 -1621 -1165 1705 1264 -625
724 -625 -1560 48 1281 393 -815 -436 546 729 -784 -1262 481 772 -194 -1139 -135 1235 820 -664
742 -664 -1484 192 1227 508 -1489 -370 691 471 -712 -1100 461 1393 -354 -1625 -362 1286 724
759 724 -1051 -862 611 756 -99 -942 -187 568 552 -488 -999 377 961 -199 -1511 -286 1263 891
777 891 -998 -1403 712 1559 -278 -1099 -259 1157 521 -963 -1048 783 684 -508 -977 250 1141 193
795A93j478N47J685K95j988q27J174J582l35j937M8J399R98j839o71J246R75r20
813A47j498Q62J850n33k026k28J679J345j419j553N06J547Q07j660j272J466J087
830A107p39j690Q89J952p15k007l57K177J185j606j937R81K223n97j843j64J901
847G60M37j215j340J099J566p52j658j35K337K59k058j076J843J709p82k193j29
864a328K222O53j633j744J706J748r86j916M1K784Pk563o17J954J705j723j868
881a558O84K504r0j973j154J890J302j164k058P61K224L19k688o23K202J758k483
898a47k144J774K323j72l197j04K659R02k013j367J002K021j155k402Q65K480
914A325P22k681j652K095K028p50k656J27K530P83k492j259K046J807j805k116
$$ plain form
795 193 -1285 -738 947 1242 -746 -1573 -399 1183 848 -1089 -1041 358 1356 -483 -1154 92 1067 147
813 147 -1351 -489 1361 828 -1198 -1426 253 1598 179 -1374 -868 679 1486 -174 -1446 20 1107
830 1107 368 -1322 -433 1519 804 -1203 -1560 617 1802 196 -1741 -760 1463 866 -977 -1141 760
847 760 1197 -18 -1358 -259 1307 555 -1103 -1238 1099 1358 -700 -1776 67 1776 994 -1199 -1328
864 -1328 894 1547 -86 -1830 -124 1624 638 -1278 -1237 1547 1554 -1009 -1626 328 2033 310 -1558
881 -1558 -874 1630 1540 -433 -1587 303 1605 441 -1617 -856 1368 1687 -1001 -1624 578 2336 -147
898 -147 -2291 -517 1806 1634 -1563 -1667 992 1894 -119 -1486 -484 1537 382 -2020 -1155 1325
914 1325 2047 -634 -2286 -191 1837 1087 -1569 -1442 1088 1871 -621 -1880 166 1973 168 -1948
930a948Q67K711j10k880q22K723J700k227k373J528K865p22k548p90K390J487
946A851j936j634J154K599r71k649o9K708J102k612k095K066K540o51l182J23
962a656K570J034k695j738K486K082j683k384P17K766J86k838m55J752J966j927
978A83k418R61K831L75k743j115K637J290j864k221J626K314q08k786j33K833
994I62J178k518k178K140K385p04k903J5K749O35k260j348J980J664j562k077
1010a842N50K871J39k648j125K246J813j534k391O36L048j11k574q79K116J614
1026A929k156k010J713K343p29k798N3K788P66k285j729J498K697q86k377k64
1042a447K370P05k217j172J610K258j716k471R66K545M73k817r88K024J978j456
$$ plain form
930 -1948 -1081 1630 1520 -1360 -2182 541 2241 14 -2359 -831 2034 1312 -1236 -2026 364 1851
946 1851 -85 -1719 -565 2034 1063 -1586 -1655 1053 2155 -457 -2552 -486 2054 1403 -1779 -1656
962 -1656 914 1948 -747 -2485 1 2083 400 -1984 -1267 1499 1685 -1153 -1608 144 2110 183
978 183 -2235 -1274 1557 1932 -811 -1926 711 2001 137 -2084 -458 1856 1048 -1738 -1871 962
994 962 2140 -378 -2556 -416 1969 1265 -1638 -1623 1126 1761 -499 -1847 133 1797 235 -1842
1010 -1842 -1292 1579 1718 -930 -2055 191 2004 470 -1921 -1285 1763 1652 -922 -1801 315 1929
1026 1929 -227 -2237 -524 1819 1090 -1708 -1655 1133 1899 -386 -2115 -617 2080 1194 -1183 -1447
1042 -1447 923 1628 -589 -1761 -151 2107 391 -2080 -1114 1431 1904 -913 -1901 123 2101 645
1058F45k389P72K227J23k186q66K338Q41j503j841J435K433p10k667j44K362Q97
1075A767j807j751J082K468q29k344K95K089N04j913j467J857K245j620k189Q32
1091g81K268L2k359j102K312J297r72k194P83K047j20k290k12J880Q34j395j959
1108a931J580K054p34k491LK177J289k108j221J170J804j023j839J29J861O56
1124A376k065q18J883J450j589j860R56K122l05j669r37J958J093j624j370R36
1140d63J695m34j784k47J995Q67k124j179J441J568p23j914j10K217O58j819j149
1157a505J403J318r20j601O32J803k82j747l57J770Q14j202j796Q69J884j34j788
1174h39n28J651R32j364j205R87J521o95j701M97J600J74j690j024J668J170q42
$$ plain form
1058 645 -1744 -972 1255 1378 -808 -1674 664 1505 2 -1839 -404 2029 1319 -1348 -1492 870 1767
1075 1767 -40 -1791 -709 1759 930 -1414 -1119 970 1474 -439 -1906 -49 2196 576 -1613 -781
1091 -781 1487 1519 -840 -1942 370 1667 695 -1499 -716 1331 1211 -1079 -1291 589 1423 28 -1931
1108 -1931 -351 1703 969 -1522 -1519 658 1947 -161 -1382 -212 1592 569 -1270 -1141 720 1376
1124 1376 -689 -1507 376 1826 237 -1623 -667 1455 1150 -519 -1456 502 1595 -29 -1399 -463
1140 -463 1232 798 -986 -1233 762 1629 -495 -1674 -233 1335 612 -1302 -1412 805 1463 -356 -1505
1157 -1505 -102 1216 296 -1305 -673 1130 848 -899 -1256 514 1328 126 -1670 -801 1083 949 -839
1174 -839 -1367 284 1216 -148 -1353 -366 1155 460 -1241 -744 856 1030 -660 -1684 -16 1154 312
1191C12j753P27J697j30j388r26J612J074j103j590R25J913n24k058J01J722Q48
1208A459j584j464J333J094j37j702P1J401N56j413p19J171J359j412j212L81
1224h18J602K71j582p13J478J358j011j476L32J569j09j893K06J176Q64j388r96
1241a130J052J176n25j648l28K278L66j408j066Q81J653p90j382pJ744Q6j419
1258d67n66J250Q00q32j351M85J219M23j426n99J227J200j195j298R24J017k71
1275E40j235l43J704O44j505j401J262J879j039j517l10J914L00r26j388J140
1291b81J542j119j047L06J156J98j390j67J319J181j279j438N89J402O6j525n72
1308a059J141J211j094r54K44J401m83j073l06J626K67j149p57Q77J325l77j791
$$ plain form
1191 312 -1441 -714 983 853 -535 -1461 151 1225 122 -1468 -543 1370 846 -1212 -1111 611 1459
1208 1459 -125 -1589 -256 838 701 -1001 -930 471 1027 -386 -1105 66 1425 13 -1199 -818
1224 -818 784 1055 -527 -1240 238 1596 585 -891 -559 1010 901 -992 -786 390 1254 -134 -1130
1241 -1130 -78 1098 573 -1075 -1403 875 1241 -167 -1233 -352 1301 511 -871 -878 866 952 -467
1258 -467 -1033 217 1017 185 -1166 -681 538 961 -465 -1064 163 1363 168 -1130 -206 811 540
1275 540 -695 -1038 666 1310 -195 -1596 -334 1545 506 -1011 -1321 593 893 -33 -1421 -281
1291 -281 1261 142 -905 -599 557 755 -635 -802 517 1698 419 -1019 -430 972 1038 -487 -1059
1308 -1059 82 1293 199 -755 -511 890 407 -666 -972 654 921 -228 -985 -108 1217 840 -951
1325i51j84J967J33j278o42P85J396o55j388L78J371k76j061o07R18J438j094
1342B50j227K71J491K40j480n06J122R11j018j104Q76J072m65j289j08J522M88
1359A046j210q51N98J427o21j069l41J640L09j102p28O59J346p02j238O13Q41
1376F17J8j034n70J014J030r51o54J5J225j1j187k15R38N91n54o59J10R26j27
1395E22q15m32J181L24p40r73J40J675M9j489k67R62L84l74o22M48P09l45r84
1414f47K37J065K48j374n53R52R61n22q87k64Q96P51r77o88O80O12l65n47P0J077
1434G25m07q78k14P88J156r60r74L47Q56J52r46l03M49O51o13m71N11O29j09q60
1454d71K1Q77J70p66o61N77Q63j3q99k06O67M89l96o19K05M69J16q31K2R98kp64
$$ plain form
1325 -951 -1135 832 965 -313 -955 -170 1226 571 -817 -439 932 656 -405 -1012 -94 1344 250
1342 250 -977 -706 785 1025 -455 -961 161 1072 54 -1050 -174 898 433 -856 -964 558 1046
1359 1046 -164 -1015 -417 1010 389 -680 -1021 619 928 -174 -902 -243 1103 401 -837 -224 617
1376 617 635 -399 -969 45 1075 124 -530 -515 710 699 -488 -703 235 826 272 -387 -277 649 522
1395 522 -293 -725 456 780 40 -933 -793 882 931 -558 -825 137 521 147 -475 -27 682 337 -647
1414 -647 -410 655 903 -471 -1024 -72 889 367 -520 -784 112 863 -114 -802 -122 490 125 -422 -352 725
1434 725 318 -560 -774 14 1170 210 -764 -417 439 591 -355 -658 -209 442 -171 -642 -131 498 389 -471
1454 -471 -450 427 597 -169 -830 -253 610 597 -302 -508 159 648 252 -367 -162 307 423 -408 -386 612 610 -154
1476a54n15O62N45l20o64q6L75N83q17l36N44M12O3n89k45Q11J06p37L7K57M49
1497C81J38j218J49Q13L64m74r32N75M09J95q83L06L21L14o86m22Q78K65n83q21
1517i11M65J143k13n23o14R08M60k64j233J15O14M57n37m28O64M30l64o35K61
1536b05O71K16j140k95R26M24j30j129L23O85R9o87K6L58L01n04q57Q04P88k48
1556D26j071j35J058M82o99q34K56J314m16o99k06Q82J70q66k26M71R95n33r63
1575e94j44J288N7r31n52Q04O21q7r71k36J322K80j052o52J362M58p75r53O10
1594a45J027l83j022n16R66J057r29q42M67J119l47r95j81J086N25r01j123J179
1612D2J154p84j198N9J136N45j174n44O91J292q11j156k2J567J44j289m19J114
$$ plain form
1476 -154 -669 -7 538 218 -446 -532 -157 426 -391 -727 -183 229 292 -297 -542 269 375 -362 -325 -68 381
1497 381 519 -699 -550 263 627 153 -779 -204 205 400 -483 -177 144 458 -228 -650 228 493 -90 -911
1517 -911 -446 697 484 -39 -653 255 715 451 -782 -667 -53 404 -133 -561 103 533 169 -466 -205
1536 -205 466 682 -458 -753 173 597 467 -662 -339 346 445 -242 -216 142 443 -61 -918 -114 674 426
1556 426 -645 -780 278 760 61 -773 -517 797 381 -318 -524 358 528 -338 -564 -93 902 369 -594
1575 -594 -738 550 607 -324 -876 -72 549 462 -509 -745 577 857 -195 -847 515 973 198 -755 -145
1594 -145 882 499 -523 -1039 -73 984 55 -787 -320 799 452 -543 -724 362 887 -14 -1137 42
1612 42 1196 412 -786 -727 409 954 -220 -764 -73 1219 408 -748 -770 797 941 -348 -767 347
1630C47O08m25j360L61J155L78j281p86J122J075q36j583N29J438Oj292m50J603
1648F09P69j472j373J378J252m23j841k33K224L00j247j306J368J249p12j486
1664i44J59J516M44j706q80J408J482j301j395N18K082L3k444o24J944J019j155
1681A56j801J085K292p15k121p6J829P85k049j186J488J989j025j947j72K232
1697G64Q78k237r27J542J587j028j873L79K096K58k432o26J792J936j960k027
1713a878Q71K608j85k541p46K470J237j618k199J008L008j065k604N9K658J092
1729B175k964j296K061K039j248k674K98K699R82k761j546K410J977j696k597
1744b141P66L270j49k942p26K799J619k371k520J377L272m90l126q04L336J300
$$ plain form
1630 347 955 530 -830 -469 686 1064 -217 -1003 119 1194 358 -1225 -696 742 748 -544 -994 609
1648 609 1378 -94 -1467 -89 1163 740 -1101 -1334 890 1190 -57 -1363 5 1254 542 -944
1664 -944 -785 731 1175 -531 -1411 -3 1479 178 -1217 -699 1383 1416 -1028 -1652 292 1311 156
1681 156 -1645 -560 1732 1017 -1104 -1180 649 1434 -615 -1801 -313 1676 651 -1296 -1468 764
1697 764 1642 -595 -1522 20 1607 579 -1294 -915 1181 1439 -993 -1619 173 2109 149 -1878
1713 -1878 -1007 1601 1416 -1125 -1871 599 1836 218 -1981 -973 2035 970 -1634 -1575 1083 2175
1729 2175 -789 -2085 -24 2015 767 -1907 -1609 1090 2072 -689 -2235 175 2152 456 -2141
1744 -2141 -1375 1895 1746 -1196 -1922 877 2496 125 -2395 -1018 2254 1764 -1362 -2166 1170 2470
1760B470k628k347K084K864j329l172O8L732P60l244k208K657L016j461l399K41
1776a896L565R47l518j724K970K172j976l180R73M328l06l889j671M224K340l130
1792B29l398J923M004m48m167q56M158J606l233k965K476L716j352m419K61M346
1808A881J533m101k774L213L859k184m512Q85M506M51m232k107L976K985k776
1823F03l855J564M669m5n148j412M845K724l500m459K417N100r97n134q44M877
1839A405K668m347l966L462M857k079n352j44N746J625m762l748M075M792k533
1854A699n439J153N684P66n287l054M885M158l399n544K017O378n13o058j610
1869d164N054L873m233n357K886O018p48o386j236O134L032n465m657M046O028
$$ plain form
1760 2470 -158 -2505 -421 2443 1114 -2058 -1990 1742 2502 -742 -2950 -293 2723 1262 -2137 -1896
1776 -1896 1669 2616 -902 -2626 344 2516 540 -2640 -1667 2661 2355 -1534 -3205 1019 3359 229
1792 229 -3169 -1246 2758 2310 -1857 -2713 1445 3051 -182 -3147 -671 3045 1693 -2726 -2465 1881
1808 1881 3414 -687 -3461 -248 3611 1427 -3085 -2200 2306 2757 -1475 -3582 394 3379 603
1823 603 -3252 -1688 2981 2936 -2212 -3624 1221 3945 445 -4014 -1597 3503 2506 -2628 -3472 1405
1839 1405 4073 -274 -4240 -778 4079 2000 -3352 -3496 2250 3875 -887 -4635 -560 4232 1699
1854 1699 -3740 -2587 3097 3863 -1424 -4478 407 4565 1166 -4378 -2361 4017 3504 -2554 -4164
1869 -4164 890 4763 530 -4827 -1941 4077 3329 -3057 -4293 1841 4873 -592 -5249 -1203 4825
1884D825k362o480j3O858K140o039m423M859N762k961o962J513O510J540o853
1899b086l021N497N016m236o321K229P025K58p129k557O393M541n093o415L447
1914b452P334j013p552j449P091L991o059n650M184P175k138p743o47P739L475
1929F286p494m948N320O790l456p305N82P915K263q133l886O308N991m573p820
1944f160K303Q448R10q298l450P399N632n465p619L285Q569q72q767j763P950
1959B102M778o906p054N009Q281k430q862m65Q672L662q051o024O340P744l374
1974C422r251Q42R401J902q544n061P248P375m796r296K209R801J028r470m074
1989g264P704P012n701q695L583R560o51r752k591Q660N650o888q671N123R543
$$ plain form
1884 4825 2463 -4017 -4030 2828 4968 -1071 -5494 -635 5127 2166 -4796 -3283 3227 4767 -2086
1899 -2086 -5107 390 5406 1170 -5151 -2922 4103 4361 -2768 -5325 1068 5609 516 -5899 -2452
1914 -2452 4882 3869 -3683 -5132 1959 5950 -109 -5759 -1575 5600 3462 -4281 -4928 2811 6286
1929 6286 -1208 -6156 -836 5954 2498 -4807 -4225 3690 5953 -2180 -6066 242 6233 1660 -6160
1944 -6160 -3857 4591 5501 -2797 -6247 1152 6784 1319 -6300 -3015 5554 4682 -4085 -5848 2102
1959 2102 6880 -26 -7080 -2071 6210 3780 -5082 -5547 3125 6787 -1264 -7288 -948 6796 3422
1974 3422 -5829 -4987 4414 6316 -2228 -7289 -41 7334 2538 -6758 -4549 5252 6280 -3190 -7264
1989 -7264 440 7452 1751 -6944 -3361 6199 5548 -4204 -6795 1865 7515 627 -8044 -2921 6622
2004F622j736j0019j610R781M844q476p270O314Q968l312j0099p7J0195L404r468
2019a939o071P189Q784m880r896J424J0688K000j0043n712Q907P712n750r985
$$ plain form
2004 6622 4886 -5133 -6743 3038 7882 -594 -7864 -1550 7418 4106 -5993 -6070 4125 7529 -1939
2019 -1939 -8010 -821 7963 3083 -6813 -5389 5299 7299 -2744 -8456 451 8163 2413 -7572
$$ [...]
8191H8
##END NTUPLES=NMR FID
##END=
