##TITLE=1H_DDQ-easychen(+1)
 aceton, 8 sc, 
 27.9.2019
##JCAMPDX= 6.0         $$ Bruker NMR JCAMP-DX V2.0
##DATA TYPE= NMR FID
##DATA CLASS= NTUPLES
##ORIGIN= UXNMR, Bruker Analytische Messtechnik GmbH
##OWNER= root
$$ XWIN-NMR		Version 3.5
$$ Fri Sep 27 14:57:19 2019 Russian Standard Time (UT+4h)  she@DPX200
##.OBSERVE FREQUENCY= 200.1315
##.OBSERVE NUCLEUS= ^1H
##.DELAY= (6, 6)
##.ACQUISITION MODE= SIMULTANEOUS
##.ACQUISITION SCHEME= undefined
##.AVERAGES= 8
##.DIGITISER RES= 18
##SPECTROMETER/DATA SYSTEM= spect
##.PULSE SEQUENCE= zg30
##.SOLVENT NAME= Acetone
##.SHIFT REFERENCE= (INTERNAL, Acetone, 0, 15.7039)
##AUDIT TRAIL= $$ (NUMBER, WHEN, WHO, WHERE, WHAT)
$$ ##TITLE= Audit trail, XWIN-NMR		Version 3.5
$$ ##JCAMPDX= 5.01
$$ ##ORIGIN= Bruker BioSpin GmbH
$$ ##OWNER= she
$$ F:/spectra/data/she/nmr/H-F/1/audita.txt
$$ ##AUDIT TRAIL=  $$ (NUMBER, WHEN, WHO, WHERE, WHAT)
(   1,<2019-09-27 14:56:06.04 +0400>,<she>,<DPX200>,
      <created by zg, POWCHK disabled, PULCHK disabled
       configuration hash MD5:
       00 E9 B6 7A A2 85 ED C7 34 08 36 98 17 FE 4E 26
       data hash MD5: 16K
       AF 0B A6 34 EA 90 27 1B E0 16 A2 31 C6 71 BF 2A>)
$$ ##END=
$$ 
$$ hash MD5
$$ 9B 6B 30 33 F3 24 3A 1E 8B 01 20 C4 7F F6 39 4F
##$RELAX= 
##$RELAX= 
##$RELAX= 
##$RELAX= 
##$RELAX= 
##$RELAX= 
$$ Bruker specific parameters
$$ --------------------------
##$DU= <F:/spectra>
##$EXPNO= 1
##$NAME= <H-F>
##$PROCNO= 1
##$TYPE= <nmr>
##$USER= <she>
##$AMP= (0..31)
100 100 100 100 100 100 100 100 100 100 100 100 100 100 100 100 100 100 
100 100 100 100 100 100 100 100 100 100 100 100 100 100 
##$AQSEQ= 0
##$AQ_mod= 1
##$AUNM= <au_zg>
##$AUTOPOS= <>
##$BF1= 200.13
##$BF2= 200.13
##$BF3= 200.13
##$BF4= 200.13
##$BF5= 200.13
##$BF6= 200.13
##$BF7= 200.13
##$BF8= 200.13
##$BYTORDA= 1
##$CFDGTYP= 0
##$CFRGTYP= 5
##$CHEMSTR= <none>
##$CNST= (0..31)
1 1 145 1 1 1 1 1 1 1 1 1 1 1 1 1 1 1 1 1 1 1 1 1 1 1 1 1 1 1 1 1 
##$CPDPRG= <>
##$CPDPRG1= <>
##$CPDPRG2= <>
##$CPDPRG3= <>
##$CPDPRG4= <mlev>
##$CPDPRG5= <mlev>
##$CPDPRG6= <mlev>
##$CPDPRG7= <mlev>
##$CPDPRG8= <mlev>
##$CPDPRGB= <>
##$CPDPRGT= <>
##$D= (0..31)
0 1.2 0 0 0 0 0 0 0 0.06 0 0.03 0 0 0 0 0.0002 0 0 0 0 0 0 0 0 0 0 0 0 
0 0 0 
##$DATE= 1569581765
##$DBL= (0..7)
120 120 120 120 120 120 120 120 
##$DBP= (0..7)
150 150 150 150 150 150 150 150 
##$DBP07= 0
##$DBPNAM0= <>
##$DBPNAM1= <>
##$DBPNAM2= <>
##$DBPNAM3= <>
##$DBPNAM4= <>
##$DBPNAM5= <>
##$DBPNAM6= <>
##$DBPNAM7= <>
##$DBPOAL= (0..7)
0.5 0.5 0.5 0.5 0.5 0.5 0.5 0.5 
##$DBPOFFS= (0..7)
0 0 0 0 0 0 0 0 
##$DE= 6
##$DECBNUC= <off>
##$DECIM= 24
##$DECNUC= <off>
##$DECSTAT= 4
##$DIGMOD= 1
##$DIGTYP= 9
##$DL= (0..7)
0 120 120 120 120 120 120 120 
##$DP= (0..7)
150 150 150 150 150 150 150 150 
##$DP07= 0
##$DPNAME0= <>
##$DPNAME1= <>
##$DPNAME2= <>
##$DPNAME3= <>
##$DPNAME4= <>
##$DPNAME5= <>
##$DPNAME6= <>
##$DPNAME7= <>
##$DPOAL= (0..7)
0.5 0.5 0.5 0.5 0.5 0.5 0.5 0.5 
##$DPOFFS= (0..7)
0 0 0 0 0 0 0 0 
##$DQDMODE= 0
##$DR= 18
##$DS= 0
$$ [...]
##$SUBNAM2= <"">
##$SUBNAM3= <"">
##$SUBNAM4= <"">
##$SUBNAM5= <"">
##$SUBNAM6= <"">
##$SUBNAM7= <"">
##$SUBNAM8= <"">
##$SUBNAM9= <"">
##$SW= 24.0689530833862
##$SWIBOX= (0..15)
0 0 2 0 0 0 0 0 0 0 0 0 0 0 0 0 
##$SW_h= 4816.95568400771
##$TD= 16384
##$TD0= 1
##$TE= 0
##$TE2= 300
##$TE3= 300
##$TEG= 300
##$TL= (0..7)
0 120 120 120 120 120 120 120 
##$TP= (0..7)
150 150 150 150 150 150 150 150 
##$TP07= 0
##$TPNAME0= <>
##$TPNAME1= <>
##$TPNAME2= <>
##$TPNAME3= <>
##$TPNAME4= <>
##$TPNAME5= <>
##$TPNAME6= <>
##$TPNAME7= <>
##$TPOAL= (0..7)
0.5 0.5 0.5 0.5 0.5 0.5 0.5 0.5 
##$TPOFFS= (0..7)
0 0 0 0 0 0 0 0 
##$TUNHIN= 0
##$TUNHOUT= 0
##$TUNXOUT= 0
##$USERA1= <user>
##$USERA2= <user>
##$USERA3= <user>
##$USERA4= <user>
##$USERA5= <user>
##$V9= 5
##$VALIST= <valist>
##$VCLIST= <CCCCCCCCCCCCCCC>
##$VD= 0
##$VDLIST= <DDDDDDDDDDDDDDD>
##$VPLIST= <PPPPPPPPPPPPPPP>
##$VTLIST= <TTTTTTTTTTTTTTT>
##$WBST= 1024
##$WBSW= 4
##$XGAIN= (0..3)
0 0 0 0 
##$XL= 0
##$YL= 0
##$YMAX_a= 99456
##$YMIN_a= -152624
##$ZGOPTNS= <>
##$ZL1= 120
##$ZL2= 120
##$ZL3= 120
##$ZL4= 120
##$ABSF1= 10
##$ABSF2= 0
##$ABSG= 5
##$ABSL= 3
##$ALPHA= 0
##$AQORDER= 0
##$ASSFAC= 0
##$ASSFACI= 0
##$ASSFACX= 0
##$ASSWID= 0
##$AUNMP= <proc_1d>
##$AZFE= 0.1
##$AZFW= 0.1
##$BCFW= 1
##$BC_mod= 2
##$BYTORDP= 1
##$COROFFS= 0
##$CY= 11.3945322036743
##$DATMOD= 1
##$DC= 2
##$DFILT= <>
##$DTYPP= 0
##$F1P= 20.1720416913024
##$F2P= 0.152960286110954
##$FCOR= 0.5
##$FTSIZE= 0
##$FT_mod= 4
##$GAMMA= 1
##$GB= 0.15
##$INTBC= 1
##$INTSCL= 1
##$ISEN= 128
##$LB= 0.24
##$LEV0= 0
##$LPBIN= 0
##$MAXI= 10000
##$MC2= 0
##$MEAN= 0
##$ME_mod= 0
##$MI= 1.114404
##$NCOEF= 0
##$NC_proc= 0
##$NLEV= 6
##$NOISF1= 3.799351
##$NOISF2= 2.8
##$NSP= 1
##$NTH_PI= 0
##$NZP= 0
##$OFFSET= 15.70392
##$PC= 1
##$PHC0= -9562.536
##$PHC1= 1.000931
##$PH_mod= 1
##$PKNL= yes
##$PPARMOD= 0
##$PSCAL= 0
##$PSIGN= 0
##$REVERSE= no
##$SF= 200.130013532006
##$SI= 16384
##$SIGF1= 3
##$SIGF2= 2
##$SINO= 400
##$SIOLD= 16384
##$SREGLST= <1H.CDCl3>
##$SSB= 0
##$STSI= 0
##$STSR= 0
##$SW_p= 3612.71676300578
##$SYMM= 0
##$S_DEV= 0
##$TDeff= 0
##$TDoff= 0
##$TI= <>
##$TILT= no
##$TM1= 0
##$TM2= 0
##$TOPLEV= 0
##$USERP1= <user>
##$USERP2= <user>
##$USERP3= <user>
##$USERP4= <user>
##$USERP5= <user>
##$WDW= 1
##$XDIM= 8192
##$YMAX_p= 0
##$YMIN_p= 0
$$ End of Bruker specific parameters
$$ ---------------------------------
##NTUPLES= NMR FID
##VAR_NAME=  TIME,          FID/REAL,        FID/IMAG
##SYMBOL=    X,             R,               I
##VAR_TYPE=  INDEPENDENT,   DEPENDENT,       DEPENDENT
##VAR_FORM=  AFFN,          ASDF,            ASDF
##VAR_DIM=   8192,          8192,            8192
##UNITS=     SECONDS,       ARBITRARY UNITS, ARBITRARY UNITS
##FACTOR=    0.0002076,     1,               1
##FIRST=     0,             0,               0
##LAST=      1.7004516,     0,               0
##MIN=       0,             -152624,         0
##MAX=       1.7004516,     99456,           0
$$ Real data points
##PAGE= N=1
##DATA TABLE= (X++(R..R)), XYDATA
0@%%%%%%%jRj6J6j6K4l2L3m1M9n7P2q8J00j15J36j56J79k04K33k66L01l41L87
$$ 0 0 0 0 0 0 0 0 -1 8 -8 8 -8 16 -16 17 -24 25 -32 40 -48 52 -63 73 -83 96 -108 125 -141 160 -181 206
31B06m36M89n47O10o80P57q42R35j037J149j273J410j560J727j915K126k365K639
$$ 206 -230 259 -288 322 -358 399 -443 492 -545 604 -669 741 -819 908 -1007 1119 -1246 1393
49A393k954L322l762M295m956N802o933Q534j0987J5272k4923Q8262l0381j57205
$$ 1393 -1561 1761 -2001 2294 -2662 3140 -3793 4741 -6246 9026 -15897 72365 41984 -115221
63a15221N9156R7736J2159p8434R080O5729J206j02113l4314R2184R1736n6228
$$ -115221 -56065 41671 53830 -24604 -15524 50205 51411 -50702 -85016 7168 98904 42676
75D2676j07393O34R8380K5318p7747m0824P3574N8475o1075q7161L5049J00613
$$ 42676 -64717 -64083 34297 59615 -18132 -58956 14618 73093 12018 -75143 -40094 60519
87F0519L511r8563l6604Q0843O0028o1114p4207M0059Q7293j5949r4929j6204
$$ 60519 64030 -34533 -71137 9706 69734 8620 -65587 -25528 61765 45816 -49113 -65317
99f5317R0248M6404p2250o8752M9077Q2052k2879q7505n323Q5243L1353p5224
$$ -65317 24931 71335 -915 -69667 -20590 61462 38583 -48922 -54245 30998 62351 -12873
111a2873n6730N7863P6565l1683q6921M302Q8106K2762q1903m8670O6689O9678
$$ -12873 -69603 -11740 64825 33142 -53779 -49477 38629 61391 -20512 -69182 -2493 67185
123F7185m5132q1983J9036Q8076P983q4215l4705P1302N5650n2775p2630K9823
$$ 67185 22053 -59930 -40894 47182 55165 -29050 -63755 7547 63197 10422 -62208 -32385
135c2385Q2713k433q3191k4165P3988M8062n9059o7174L7102P8442j1801q1220
$$ -32385 50328 47895 -35296 -59461 14527 62589 3530 -63644 -26542 51900 40099 -41121
147d1121j2985P7008L7588o5432n8257M5736P2324k3813p9078j130P8678K7248
$$ -41121 -54106 22902 60490 -4942 -63199 -17463 54861 31048 -48030 -49160 29518 56766
159E6766p0053m8024N3347O4158l3401p3748R333P5343J5398o8820l6410N7226
$$ 56766 -13287 -61311 -7964 56194 22793 -50955 -41622 33721 49119 -19701 -56111 1115
171A115N4645l9205o7814J6758P2932O675p0659k9210O1965M9534m5603o3541
$$ 1115 55760 16555 -51259 -34501 38431 45106 -25553 -54763 7202 56736 11133 -52408
183e2408K6031P0342m395p1545j8272O5718L8447n2122n4175L5201O5397j5051
$$ -52408 -26377 43965 39570 -31975 -50247 15471 53918 1796 -52379 -17178 48219 33168
195C3168o9237q439O5467K9525n6085m6973M0839O0378k0520o6325r46O5727K0529
$$ 33168 -36069 -44508 20959 50484 -5601 -52574 -11735 48643 28123 -38202 -39148 26579 47108
208D7108n9235l9535M6526N4714k9084o3107R280O6187J1599o2414l1759N1576
$$ 47108 -12127 -51662 -5136 49578 20494 -42613 -33333 32854 44453 -17961 -49720 1856
220A856M6834l5999n7584J8582O2445K003o0799k0642N2931L7031m1577m9875
$$ 1856 48690 12691 -44893 -26311 36134 38137 -22662 -43304 9627 46658 5081 -44794
232d4794K4777N7499n198n8180j3407N4249L1145m4373m5460K9041N4160j2265
$$ -44794 -20017 37482 32284 -25896 -39303 14946 46091 1718 -43742 -14701 39459 27194
244B7194n6781n235N5472K2393m7867l7185L5678M7741k1225n3825L211N4645
$$ 27194 -29587 -34822 20650 43043 -4824 -42009 -6331 41410 20185 -33640 -30429 24216
256B4216J4508m8766k9419L8803M1623k5798m9630R255N1446P543m9148k2745
$$ 24216 38724 -10042 -39461 -658 40965 15167 -34463 -25208 26238 33781 -15367 -38112
268c8112M2179L6268l0354m5675J5330N0276L19n0737j6485M5229L1078l4614
$$ -38112 4067 40335 9981 -35694 -20364 29912 30231 -20506 -36991 8238 39316 4702
280D702m0993K1529M7189p289m9229q396M5589K2553l8431l3921K7720M2492j3065
$$ 4702 -36291 -14762 32427 25138 -24091 -32487 13102 35655 -2776 -36697 -8977 33515 20450
293B0450m6028k399M4654J6081l9115k8906K9750L8318j6730m2924L312M3928
$$ 20450 -25578 -27977 16677 32758 -6357 -35263 -5513 32805 16075 -26849 -23537 20391
305B0391J0046m1196k2724L2838L2761k2247l9530J0379M2751L470m0699j6703
$$ 20391 30437 -10759 -33483 -645 32116 9869 -29661 -19282 23469 26939 -13760 -30463
317c0463L4557K6553k5630l4184J4337L8185j661l8001j0151L4976K0966k8585
$$ -30463 4094 30647 5017 -29167 -14830 23355 21694 -16307 -26458 8518 29484 899
329H99l0424J8403L5420o048l7512n516L6120J6784l0166k6192K1292L2177j1679
$$ 899 -29525 -11122 24298 18250 -19262 -24778 11342 28126 -2040 -28232 -6940 25237 13558
342A3558l5734M30L6027J0539l1636k0003K5627K7107j6631l2764N393L4003N455
$$ 13558 -22176 -21746 14281 24820 -6816 -26819 -1192 25915 9284 -23480 -18087 15916 21371
355B1371l1195j5364K6314K3817j8094k9287Q430L1124J277l0911j0894K7665
$$ 21371 -9824 -25188 1126 24943 6849 -22438 -14008 17116 18393 -12518 -23412 4253
367D253K0209k1363k6045J2890L0147l743l1204o411K8387J5110k2957k1814J6658
$$ 4253 24462 3099 -22946 -10056 20091 16348 -14856 -21267 7120 22230 -727 -22541 -5883
380e883K6468p620k8273j791K6620R832k3749j6680J7934K2874r983k5699J535
$$ -5883 20585 12965 -15308 -17099 9521 19353 -4396 -21076 -3142 19732 9749 -15950 -14415
393a4415K6007O504k3905j4435J8755K0168j2346k3117N265K5057K418k4206r928
$$ -14415 11592 18096 -5809 -20244 -1489 18679 6333 -16784 -11519 13538 15956 -8250 -18178
406a8178K0287J5697j5016k0219Q482K3098p87k2817n937K0473J1899j6027j7633
$$ -18178 2109 17806 2790 -17429 -8947 14151 13364 -9453 -15390 5083 16982 955 -16678
419a6678J0171K0174l456k0696k685K0198R135j7516j4598J2088J8521o644k0511
$$ -16678 -6507 13667 10211 -10485 -13170 7028 16163 -1353 -15951 -3863 14658 8014 -12497
432a2497rK0635O846j7713j1882J3905J5532r297j8199L339J8715K551j7278p852
$$ -12497 -12506 8129 14975 -2738 -14620 -715 14817 5520 -12679 -9340 9375 11926 -5352 -13204
446a3204J5107J2330j0363j5967N088J6606M04j6686n560J4649J0623j0616j3904
$$ -13204 1903 14233 3870 -12097 -7009 9597 10001 -6685 -12245 2404 13027 2411 -11493
459a1493O409J5359k260j6065k922J5198P590j2292j1036R019J3900m413j5084
$$ -11493 -5084 10275 8015 -8050 -10972 4226 11816 -476 -11512 -2493 11407 6994 -8090
472h090p42J3922M777j2138q219R759J0889n591j2407J619J3008J898j2001o678
$$ -8090 -8832 5090 9867 -2271 -10490 -731 10158 4567 -7840 -6221 6787 8685 -3316 -9994
486i994R698R670o042j1567L054J2544Q96j1863n552J0324P783p937r542M993
$$ -9994 -296 9374 3332 -8235 -5181 7363 8259 -3604 -9156 1168 8951 1014 -8528 -3535
500c535J1168j358j1272k321J0695N213r169p979O047R587k261r923p11R667L665
$$ -3535 7633 6275 -4997 -7318 3377 8590 -579 -8558 -2511 7076 4815 -5108 -5819 3848 7513
515G513q665o136O032P681l595r010Q47R714K434q707m937P065O636m695r181
$$ 7513 -1152 -7288 -1256 6425 2830 -6180 -5333 4381 6815 -1892 -6829 236 6872 2177 -7004
530g004K143R336Q01p780l320P133M899n198p002L430O895r03p713r73P211L714
$$ -7004 -4861 4475 5276 -2504 -5824 1309 6208 1010 -5992 -2562 4333 3430 -4283 -5256 1955 5669
546E669n335n587L186O303j220p247p42O457L279n676m221M750N661l083o381
$$ 5669 334 -5253 -2067 4236 3016 -4231 -4973 1484 4763 -913 -5134 -384 5277 2194 -4187
561d187M83O574O61n855k661N420M623l670n443J716N301R1n468j885M587L495
$$ -4187 -3704 2870 3531 -2324 -4985 435 5058 1388 -4055 -2339 2962 3053 -2415 -4300 287 3782
577C782l618l944K629M836j114n045j714M946K434l716l796K837N158j216n001
$$ 3782 164 -3780 -1151 3685 2571 -2474 -4188 758 3192 -524 -4320 -1483 3675 2459 -2542
592b542k34M738J032m291k604L500L551k248l758J420M072K39m450j631L042K968
$$ -2542 -2776 1962 2994 -1297 -3901 -401 3150 902 -2856 -1436 2636 2875 -1575 -3206 -164 2804
608B804k170l340R82L848K36l431j277L080K026k964l000K045L675m86l680o54
$$ 2804 634 -2706 -1724 2124 2360 -1071 -2348 732 2758 -206 -3206 -1161 2514 2028 -1652 -2306
624b306M143J110l455k458K167L217j547k916P34L000O29k817j544K432J695k043
$$ -2306 1837 2947 -508 -2966 -799 2418 871 -2045 -1311 1689 2318 -499 -2043 389 2084 41
640D1k155J98L140Q15k633j411K548J772j680k758P66K501j21k407M7K723J218
$$ 41 -2114 -1916 1224 2039 -594 -2005 543 2315 635 -2123 -1357 1144 1023 -1384 -1337 1386 2604
657B604k314k116J571K081j027k401l5K589R22j991j296J814J442j261j863Q7
$$ 2604 290 -1826 -255 1826 799 -1602 -1637 952 1874 -117 -1413 401 1843 582 -1281 -1194
673a194J518O28j541o22J901J568j215k201L51K211M0k136j203J795J966j037
$$ -1194 324 952 -589 -1211 690 2258 1043 -1158 -807 1404 1444 -692 -1895 -100 1866 829
689H29j673P70J766l12k399k35J937O94j642j154J101J882l33j567p48J507Q75
$$ 829 -844 -74 1692 1380 -1019 -1254 683 1377 -265 -1419 -318 1564 1231 -336 -1084 423 1298
706A298j711j148Q95J579J4j407K34J059N35j667j218J208J429p28j568N00J891
$$ 1298 -413 -1561 -666 913 927 -480 -246 813 1348 -319 -1537 -329 1100 372 -1196 -696 1195
723A195L18j385j108P65R01o49r15K09J179J98j237r6J020Q91j006j645L23J909
$$ 1195 1513 128 -980 -215 686 37 -878 -669 510 708 -529 -625 395 1286 280 -1365 -1042 867
741H67l50j109o60J596J001o47j560l34J747k90j093l58J366R48j275j022J375
$$ 867 517 -592 -1252 344 1345 698 -862 -1196 551 261 -832 -1190 176 1124 -151 -1173 202
758B02P47n32j763k34J072J015n03r85O66R80O2j127n64Q15P53j207o71Q62J291
$$ 202 949 417 -1346 -1580 -508 507 4 -981 -315 665 727 -400 -964 -149 604 -603 -1274 -412 879
777H79J1j371n55J714L96j652j049J100J129k19r00k5J275N6j050q60P82Q20l92
$$ 879 890 -481 -1036 678 1074 -578 -1627 -527 602 383 -517 -542 733 789 -261 -1121 -339 481 89
796H9j294O5J719Q11j224j178P29J185n11j502j42J579O93j192p18J275J138j076
$$ 89 -1205 -1140 579 1390 166 -1012 -283 902 391 -1111 -1253 326 1019 -173 -891 384 1522 446
814D46j610L76J564r2k008j07J681J129o14j825L85J332J20j457l49P09J233o82
$$ 446 -1164 -788 776 684 -1324 -1431 250 1379 765 -1060 -675 657 777 -680 -1029 -320 913 231
832B31j640J028J896m90j746q23J733J166j448j442R38J707K98j667q09J388P72
$$ 231 -1409 -381 1515 1025 -721 -1544 189 1355 -93 -1535 -597 1110 1408 -259 -1068 320 1092
849A092j178j774J667J173r7j943J87J849M01j187j715P41K128m31k134l23J862
$$ 1092 -86 -1860 -193 980 883 -1060 -873 976 1377 190 -1525 -784 1344 913 -1221 -1544 318
866C18J607j671j365J206J332p98k110L25K471K76k177q41J883J716j572j961
$$ 318 1925 254 -1111 95 1427 629 -1481 -1156 1315 1591 -586 -1427 456 2172 600 -1361
882a361M75J684M84j706q53J660J507j334j614M04K113k11k516n96K022J693j206
$$ -1361 -886 798 1282 -424 -1277 383 1890 556 -1058 -654 1459 1248 -1268 -1864 158 1851 645
899F45k289J372K390n90k626o87K288R01j534j567J356K291r32j914l31K263O55
$$ 645 -1644 -272 2118 1528 -1098 -1785 503 1404 -130 -1697 -341 1950 1018 -896 -1227 1036 1691
916A691k095j711J638K262m38k188k68K233P37k264j346J496J811q06k254N12
$$ 1691 -404 -2115 -477 1785 1347 -841 -1109 1124 1861 -403 -1749 -253 1558 752 -1502 -990
932i90K653K02k676r30K043J664j764k437J046K696R6k062p05J431J743j746j887
$$ -990 1663 1865 -811 -1741 302 1966 202 -2235 -1189 1507 1603 -459 -1164 267 2010 264 -1623
949a623Q70J956l83k334j51K315J555k230j914J402K206o53k593l38K618J016
$$ -1623 -753 1203 820 -1514 -1665 650 2205 -25 -1939 -537 1669 1016 -1577 -1915 703 1719
965A719j885j661J987J674j284j945J96K308K77k346j138K368J754j158k588O05
$$ 1719 -166 -1827 160 1834 550 -1395 -1199 1109 1386 -960 -2098 270 2024 866 -1722 -1117
981a117K283n8k085q78J741J523r59k106J135K428n99k514p97K487J353k153k016
$$ -1117 1166 1108 -977 -1855 -114 1409 450 -1656 -521 1907 1308 -1206 -2003 484 1837 -316 -2332
998b332J515K590l40k669k00K073P48j814j629J596J718o22j894J31K302N48k406
$$ -2332 -817 1773 1433 -1236 -1436 637 1385 -429 -2058 -462 1256 634 -1260 -1129 1173 1721 -685
1015f85j518J895K197j153k450N79K440O09k704q91J782J771j916k036Q42K889
$$ -685 -2203 -308 1889 736 -1714 -1135 1305 1914 -790 -1681 101 1872 -44 -2080 -1238 1651
1031A651l91k613j95K327J159j855k283J653J841j05k274j99K058J096j775j914
$$ 1651 1260 -1353 -1548 779 1938 83 -2200 -547 1294 1189 -1085 -1284 774 1870 95 -1819
1047a819J759J714j093k312L47K613N07k313j390K104J622r38k550L81K219J67
$$ -1819 -60 1654 561 -1751 -1404 1209 1716 -597 -1987 117 1739 801 -1749 -1368 851 1018
1063A018j740q83K252J053j202k210R55K118m26k169m41K141J297j541j581Q00
$$ 1018 -722 -1605 647 1700 498 -1712 -757 1361 935 -1234 -1675 466 1763 222 -1359 -559
1079e59K202j30k555k33J605J022j810j100J711J817r68k092j74K257O62k092
$$ -559 1643 1513 -1042 -1275 330 1352 -458 -1558 153 1970 1002 -1090 -1264 993 1655 -437
1095d37j469J867J475n92j954O63J757l97j660o51J714J212j570j330P75K350
$$ -437 -1906 -39 1436 844 -1110 -447 1310 913 -747 -1398 316 1528 -42 -1372 -597 1753
1111A753m23k132m55J793R72j527j413J013J718n28j732K98J596j15j529p61J754
$$ 1753 1330 -802 -1257 536 1508 -19 -1432 -419 1299 771 -961 -663 933 818 -711 -1472 282
1128B82J314j149j425J43K204L33k035p29R13J294o27k030Q21J880m10j320m63
$$ 282 1596 447 -978 -835 1369 1702 -333 -1062 -149 1145 518 -1512 -691 1189 779 -541 -1004
1145a004J662Q64j462j628O86K113o05j665m6J787R64j570j484J012J279o94j502
$$ -1004 658 1522 60 -1568 -882 1231 626 -1039 -1085 702 1666 96 -1388 -376 903 209 -1293
1162a293N74J312M54j331r90J456R39q64j398j7J729M37j399q25J498J013r94
$$ -1293 -719 593 1047 -284 -1274 182 1121 257 -1141 -1158 571 1008 -391 -1216 282 1295 301
1179C01j356O38J222q4k034M2J700J087j852q92J218J055m36j852k01J727L02
$$ 301 -1055 -417 805 721 -1313 -1271 429 1516 -336 -1228 -10 1045 609 -1243 -1444 283 585
1196E85j262l48J058R75q01j488M80J431J15j773n17J216J879j248j146Q0J515
$$ 585 -677 -1025 33 1008 207 -1281 -801 630 745 -1028 -1545 -329 1550 302 -844 -764 751
1213G51j38j733P8J227J178j258j021P25J595p83j552M7J445L12j358j213J530
$$ 751 613 -1120 -1042 185 1363 105 -916 -191 1404 621 -931 -884 561 873 -485 -1698 -168
1230a68J427n35j398l28J230L29j207k82P79J039p41j089M61J595m3j451p56J280
$$ -168 1259 724 -674 -1002 228 557 -650 -932 -153 886 145 -944 -483 1112 1069 -382 -1138 142
1248A42J086j353p98M65J677k81j649j48J426L89j321o52Q29R83m82j085K01J582
$$ 142 1228 -125 -923 -458 1219 938 -711 -859 567 956 -365 -1017 -188 795 313 -772 -571 1011
1266A011J77j560q80J109J123o59j426Q09J137J32j151o21J385O14j432o81M52
$$ 1011 1188 -372 -1252 -143 980 321 -1105 -296 841 973 -178 -799 586 1200 -232 -913 -461
1283d61J778l49j580l00J417N58j231o66M57J012l95r05J75J181L37r58j147J250
$$ -461 1317 968 -612 -912 505 1063 -168 -834 -377 635 240 -665 -490 691 1028 70 -1077 173
1301A73J098p61j653P13R53O40j449o57J027Q68m74j061K46P65j39j050j49J421
$$ 173 1271 510 -1143 -430 523 1163 -286 -943 84 952 478 -583 -337 428 289 -761 -910 511
1319E11R85j409q96N10J387n68j041j25Q54O82j010n71N47J298n20j021j93P68
$$ 511 1496 87 -809 -299 1088 520 -521 -646 208 890 -120 -691 -144 1154 634 -387 -580 188
1337A88M83j073p82J124J233l95j794N19J379J48j596m37P60J119o82q84N01J096
$$ 188 671 -402 -1184 -60 1173 778 -1016 -497 882 1030 -566 -1003 -243 876 194 -690 -189 907
1355I07l62r80l37Q01P61q68q03M15J167O2q58o62R15M35p94p55M31J366l14j311
$$ 907 545 -435 -772 29 790 -78 -881 -466 701 763 -95 -757 158 593 -201 -956 -525 841 527 -784
1375g84L44J003J23j191l34M56Q27m00j034L49J148L82p08p48R16M63q36p78M75
$$ -784 -440 563 686 -505 -839 -383 444 44 -990 -641 507 889 181 -567 349 812 -24 -802 -327
1394c27R71k67r43l75J255N10q79p54k02J400L2j112j8Q53N75q61o22L03O64k88
$$ -327 644 377 -566 -941 314 824 -55 -809 -1011 389 421 -691 -709 144 719 -142 -764 -461 203 -85
1414h5n41P6Q12M99r93m69O65O98j15q47n89Q47K87k68q27P11N95j01j046L57
$$ -85 -626 -550 262 761 -232 -701 -36 662 547 -300 -889 -42 245 -23 -850 -139 456 355 -691 -334
1434c34R24k78q04n67Q71Q16M9j204J34Q86K0n82n87L12R12m72m97L01O64l92
$$ -334 590 312 -492 -1059 -188 628 677 -527 -393 493 513 -69 -656 -344 568 96 -401 -100 564 172
1454A72m22r9M69M78l65j025M10P61O8k20r54O95N96m49o27J01O85k17n31QR53
$$ 172 -250 -349 120 598 233 -792 -382 379 447 227 -727 -32 564 115 -512 -411 274 57 -474 -466 487
1475D87m9l78n47K01R96k16p79m91Q93O96o38o98K20N73J75r52o1N55K86p1p17
$$ 487 438 60 -487 -286 710 494 -285 -776 117 813 175 -523 -303 270 445 -507 -568 -13 273 202 -515
1496e15M66P38Q1j211k3Q04L33m89n77K72M92L2n77J39O51j3p13m95O25N08j85
$$ -515 -49 689 770 -441 -464 340 673 184 -393 -121 371 403 -174 -35 616 603 -110 -605 20 528 343
1517C43p14J43P47N34j165j41J95K02Q8q77L38N83K11l65m42M03M86o45l17P4
$$ 343 -371 -228 519 1053 -112 -253 -58 144 232 -645 -307 276 487 122 -320 83 569 -76 -393 -319
1537c19P05K35p21m67M96P61n01m08M8N93j54o80k33P77O60o74o37K62P74l6q21
$$ -319 386 621 -100 -567 -71 690 189 -219 -171 422 268 -412 -645 132 792 118 -519 -257 517 481 -340
1558c40l12P14Q49q84m81N65N12q0r00l16O85L59p81k01O15O32j10j104k00R88
$$ -340 -652 62 911 27 -454 111 623 543 -357 -673 12 371 -410 -611 4 636 526 -578 -778 210
1578B10L10n10j187R23P44l54q41K88O54L13n72n67M94O38o00j087M11J540oj437
$$ 210 520 10 -1177 -254 490 136 -705 -417 237 550 -22 -589 -95 543 -57 -1144 -733 807 801 -636
1598f36k97Q19Q17n57j126K31J424k4q14p84J215O74j162p52L64J342m86j129
$$ -636 -933 -114 703 146 -980 -749 675 651 -163 -947 268 942 -220 -972 -608 734 248 -881
1616h81l63J399R71r97r87M67J207n09j106j59J323N23q87j224J182J186q11j428
$$ -881 -1244 155 1126 129 -858 -391 816 307 -799 -958 365 888 1 -1223 -41 1145 334 -1094
1634a094J71J601n9j119o33J192J333p88j555J04J478J3j329m50J296R32j079
$$ -1094 -923 678 619 -500 -1133 59 1392 604 -951 -847 631 644 -685 -1135 161 1093 14
1651A4j171Q64J417k03j914k36J453Q38j286j135J006J614l68j746m8J345Q12
$$ 14 -1157 -293 1124 921 -993 -1229 224 1062 -224 -1359 -353 1261 893 -853 -901 444 1256
1668A256j907q71J492J290j009j461M92J680J87j864q02J558J242q91j572M47
$$ 1256 -651 -1522 -30 1260 251 -1210 -718 962 1149 -715 -1517 41 1283 392 -1180 -733
1684g33K019j31j834m70J487J128j451j883J346K149m61k126j28K143O89j762
$$ -733 1286 1155 -679 -1149 338 1466 15 -1868 -522 1627 1166 -960 -1088 1055 1744 -18
1700a8j557J250J698n64k055p1K460N73j946j457J769J704j228k194M30K521L34
$$ -18 -1575 -325 1373 809 -1246 -1317 1143 1716 -230 -1687 82 1786 558 -1636 -1206 1315 1649
1717A649k439q72K180J535j433k057Q49J943j88k452l51K581J200k134k055J791
$$ 1649 -790 -1662 518 2053 620 -1437 -588 1355 1167 -1285 -1636 945 2145 11 -2044 -253
1733b53K250q41k803K19K580P56k263j755J832K203j053k797L45K877L30k603
$$ -253 1997 1156 -1647 -1428 1152 1908 -355 -2110 -278 1925 872 -1925 -1580 1297 1627 -976
1749i76j214K379K373j954k625O54L107J54l261r50K860J935k295k248J436K906
$$ -976 -2190 189 2562 608 -2017 -1363 1744 1898 -1363 -2313 547 2482 187 -2061 -625 2281
1765B281m62l380l83K776J702k804k187J617L196j062l172j24K859J554l327j986
$$ 2281 1819 -1561 -1944 832 2534 -270 -2457 -840 2356 1294 -1878 -2002 857 2411 -916 -2902
1781b902K842K783j584l086J95L580M45l400j714K990K722k112l319R05M020k81
$$ -2902 -60 2723 1139 -1947 -1752 1828 2273 -1127 -2841 149 2871 759 -2560 -1655 2365 2084
1797B084l622j069L134K425k831l028J805L958r46m058m34L928J641l377l124
$$ 2084 -1538 -2607 527 2952 121 -2907 -1102 2856 1910 -2148 -2582 1346 2987 -390 -3514
1812c514K651L761j178m439K27L977J540l792k686L379L322k155m264R16M816
$$ -3514 -863 2898 1720 -2719 -2492 1485 3025 -767 -3453 -74 3248 1093 -3171 -2255 2561
1827B561P75m769k147L529L638k837m204J195M606N21n108j145M069L185l704
$$ 2561 3336 -1433 -3580 -51 3587 750 -3454 -2259 2347 2868 -2240 -3385 684 3869 165
1842A65l997K581M248o05n083q86N150K355m283l582L013M622j478n328j93N278
$$ 165 -3832 -1251 2997 2392 -2691 -3577 1573 3928 -355 -3937 -924 3698 2220 -3108 -3301 1977
1858A977J830m653l283M023M100k525m731K38N705J074n371l014M948M316l428
$$ 1977 3807 -846 -4129 -106 3994 1469 -3262 -3024 2681 3755 -1616 -4630 318 4634 1206
1873A206n138J516O039k82n679j717M954L365l827n012K801N832r92o175r04N757
$$ 1206 -3932 -2416 3623 3341 -2338 -4055 899 4264 437 -4575 -1774 4058 3066 -3109 -4013 1744
1889A744L067n276m041L158N732j562o462k1O304K007n554m435M827N479k873
$$ 1744 4811 -465 -4506 -1348 4384 2822 -3640 -3661 2643 4650 -904 -5339 -512 4967 2094
1904B094o111P01O940R84o071l737N300N173l656o188J645O754M48o729k394N863
$$ 2094 -4017 -3316 3624 4608 -1463 -5200 100 5273 1617 -4571 -2926 3828 4276 -2453 -4847 1016
1920A016M390m740n850K758O856n83p101j626P201L457n551n768L818O406j401
$$ 1016 5406 666 -5184 -2426 4430 3847 -3254 -4880 2321 5778 227 -5541 -1723 4683 3282
1935C282p168m40P002K949o455m673M697O461l140p119K90P684K010p180m290
$$ 3282 -3886 -4326 2676 5625 -830 -5503 -806 5655 2515 -4604 -4314 3370 5380 -1800 -6090
1950f090N939O141l684p434J583P903N10p558k961O529N562n348p019K793Q452
$$ -6090 -151 5990 2306 -5128 -3545 4358 4868 -2690 -5651 878 6440 1092 -5927 -3134 5318
1965E318p38q329j997P540M579o366o384M141P768j443q515j005Q505K997o942
$$ 5318 4580 -3749 -5746 1794 6373 7 -6377 -2236 5532 4089 -4426 -5431 3074 6071 -871
1980h71n831N379P623k892q590J98Q750K415p989n157O702O800l776q660J672
$$ -871 -6702 -1323 6300 3408 -5182 -4984 3766 6181 -1808 -6965 -263 6537 2761 -5899 -4227
1995d227R072J011q467m293P698N944n381q082K960R084J54r374k569P924N650
$$ -4227 4845 5856 -2611 -6904 794 6738 1357 -6725 -3765 5319 5473 -3901 -6470 1454 7104
2010G104o784p240M350Q394j246r264j261Q694M416p701o741N370Q516k800r537
$$ 7104 320 -6920 -2570 5824 4578 -4686 -5947 2747 7163 -538 -7279 -1909 6607 3807 -5730
2025e730K3R094L642q797n753O508P945m045r398J285R793K010r234m919Q064
$$ -5730 -5707 3387 7029 -1768 -7521 -1013 6932 2887 -6511 -5226 4567 6577 -2657 -7576 488
2040D88P145n809r127L021J0111M17r992l813R058O053o381q449M080R436j060
$$ 488 7633 1824 -7303 -4282 5829 6246 -3746 -7559 1499 7552 1171 -7278 -3198 6238 5178
2055E178j0202k178R985N088p767p969N631R502k508j0558q17J0219M017r037
$$ 5178 -5024 -7202 2783 7871 104 -7865 -2234 7268 4760 -5798 -6615 3604 7621 -1416
2069a416o502O661Q936l904j0416J145R862K527r177n872P775Q312n197r978K246
$$ -1416 -7918 -1257 7679 3775 -6641 -5496 4366 6893 -2284 -8156 -381 7931 2734 -7244 -4998
2084d998J0491J559j0412m458Q217P685o499r111L365J0704l08j0617k956R713
$$ -4998 5493 7052 -3360 -7818 399 8084 1585 -7526 -4161 6543 6235 -4382 -7338 2375
2098B375N966p901q740N262J0097j578j0881j604J0266N170q968q091O839R429
$$ 2375 8341 440 -8300 -3038 7059 5481 -5400 -7004 3262 8432 -536 -8627 -1788 7641
2112G641l039j1208K99J1051L430j0248o202P605R174n013j0560J388J1189J741
$$ 7641 4602 -6606 -6307 4744 8174 -2074 -8276 -671 8503 3490 -7070 -5682 5507 7248
2126G248j0489m765Q885P582o151r840K978J1216j74j0825l653R864O768p619
$$ 7248 -3241 -8006 879 8461 2310 -7530 -4552 6664 6490 -4335 -7988 1876 8644 1025
2140A025r381M843J0774j745j0999k223J0503N805q504q645O218J0316k908j1153
$$ 1025 -8356 -3513 7261 5516 -5483 -7706 2797 8602 98 -8547 -2329 7987 5079 -6074
2154f074r62J1215M054r704p417P505R752m515j0809M96J1365K928j0668n894
$$ -6074 -7036 4179 8233 -1471 -8888 -1383 8369 3854 -6955 -6459 4906 7834 -2834 -8728
2168h728Q714Q558n537j0524K528J0991J458j1678m144R693P621p424r839M011
$$ -8728 -14 8544 3007 -7517 -4989 6002 7460 -4218 -8362 1331 8952 1528 -8311 -4300
2182d300J1164l15j1433l355J0889O047q641q798N811J0466j900j1729j204J1351
$$ -4300 6864 6549 -4884 -8239 2650 8697 56 -8742 -2931 7535 5635 -6094 -7298 4053
2196D053M473r378p716O538J0238l722j1359K98J1486L031j0399o609Q428R149
$$ 4053 8526 -852 -8568 -2030 8208 4486 -6873 -6575 4911 7942 -2457 -9066 -638 8511
2210H511n512j0795K141J1423J820j0778n413R166Q243o768j0063L488J0994K66
$$ 8511 2999 -7796 -5655 5768 7588 -3190 -8603 563 8806 2038 -8025 -4537 6457 6723
2224F723j1211l449R857O954q026r319N210J0547j463j1299k201J0478N599q926
$$ 6723 -4488 -7937 1920 8874 848 -8471 -3261 7286 5823 -5476 -7677 2801 8400 -526
2238e26q313O459J0022k810j1051o68J1058L760r324p149P248R652m566j0970
$$ -526 -8839 -2380 7642 4832 -6219 -6887 4171 7931 -1393 -8542 -1294 8358 3792 -7178
2252g178J122J1058K528j0658n160Q285Q502n890j0280K758J0653J120j0947m055
$$ -7178 -6056 5002 7530 -3128 -8288 -3 8499 2609 -7671 -4913 5740 6860 -4087 -8142
2266h142R751O513o989r124M002J1064j134j0828k419J0042N629q299q325N518
$$ -8142 1609 8122 1133 -7991 -3989 7075 5941 -4887 -7306 2736 8365 66 -8259 -2741
2280b741J0355k399j0955j361J1164L930r044p309O795R624m128j0581O13J0692
$$ -2741 7614 5215 -5740 -7101 4063 7993 -1051 -8360 -1565 8059 3931 -6650 -6037 4655
2294D655L033r713o090P611Q405n054r804J741J0488J658j0204m361Q214P289
$$ 4655 7688 -2025 -8115 -504 7901 2847 -6957 -5216 5272 6930 -3274 -7635 579 7868
2308G868o120r246L509J0099K01j0562l148R299O045o998q901M908R732j530j0228
$$ 7868 1748 -7498 -3989 6110 6311 -4251 -7399 1900 7945 947 -7954 -3046 6686 5156 -5072
2323e072j676R709N037q169p884O303Q859l001j0131l6R974L419q889o340P102
$$ -5072 -6748 2961 7998 -171 -8055 -1752 7107 4106 -6025 -6061 3913 7332 -1557 -7897 -795
2338g95Q362m005j0067J653R465J965r299m596P813P201n538r171L108R532N46
$$ -795 7567 3562 -6505 -4852 4613 6578 -2721 -7317 496 7697 2159 -7012 -3904 5628 6174
2353F174r838l410Q714O035o510q193L752R345j050r622k128R142N147p672p072
$$ 6174 -3664 -7074 1640 7675 1165 -7028 -3276 6069 5019 -4603 -6731 2411 7558 -114 -7186
2368g186N124Q823k540r460o16R384L319q026n924N708Q098l195r387Q91R013
$$ -7186 -2062 6761 4221 -5239 -5855 3529 6848 -1178 -7102 -1394 6704 3509 -5878 -4987 4026
2383D026K254q244m897O417P741m796q671K097Q902J012q667l891P620N827n117
$$ 4026 6280 -1964 -6861 -444 7297 2501 -6170 -4073 4829 5841 -2826 -6717 903 6730 1613
2398A613p888K759Q733k81q678k484Q115M988o382p144M436Q157j609r024r67
$$ 1613 -6275 -3516 5217 4936 -3742 -6226 1889 6877 495 -6649 -2213 5944 4335 -4689 -5656
2413e656Q340M107p211o310N450P505l357p952L06Q316K588p767m499N957O598
$$ -5656 2684 6791 -420 -6730 -1280 6225 2868 -5084 -4778 3538 6126 -1641 -6140 -183 6415
2428F415m012p891J059Q812J091p825l682O314O307n259p014K337Q032k54q079
$$ 6415 2403 -5488 -4429 4383 5474 -2351 -6033 281 6588 1329 -5685 -3348 4684 4430 -3649
2443c649k143O959M869n837o129L308P757j002q060j510P641L577o051n518M238
$$ -3649 -5792 1167 6036 199 -5930 -2622 5135 4133 -3927 -5437 2204 5781 -270 -5788 -1550
2458a550O752k094p368l93P447K448o389m648M936O276k991p056N16P190J920
$$ -1550 5202 3108 -4260 -4653 2794 5242 -1147 -5795 -859 5417 2426 -4630 -4114 3076 4996
2473D996o639l861N420N353l619o710J976P128J11o559k631N887M549m897n980
$$ 4996 -1643 -5504 -84 5269 1650 -5060 -3084 4044 4155 -2404 -5035 852 5401 504 -5476
2488e476K950P119p25p293j225O232L567m975n178L351O198j544o690m46O590
$$ -5476 -2526 4593 3868 -3425 -4650 1582 5149 174 -5004 -1653 4545 3001 -3689 -4135 2455
2503B455K383n475m289M195N540k777o033L86O216J821n595l695M932M765l010
$$ 2455 4838 -637 -4926 -731 4809 2032 -4001 -3615 2601 4422 -1173 -4868 64 4829 1819
2518A819n861J190O334M42o023k266N053L988l764n429K060O157J11o096k029
$$ 1819 -4042 -2852 3482 3924 -2099 -4365 688 4676 912 -4517 -2457 3700 3811 -2285 -4314
2533d314N345L609m338m277K644N427j083o000p07N248K715m883l820L544M994
$$ -4314 1031 4640 302 -3975 -1331 4096 3013 -2987 -3694 1554 4269 -614 -4434 -890 4104
2548D104j649n748j07N741J541m616l466L691M618k559n117R32N356P61n096k302
$$ 4104 2455 -3293 -3400 2341 3882 -734 -4200 -509 4109 1550 -3567 -2635 2721 3482 -1614 -3916
2564c916M192L814l069m877J961N361k69n294j534M328L289l674m092K404M618
$$ -3916 276 4090 1021 -3856 -1895 3466 3197 -2097 -3631 697 3986 312 -3780 -1376 3242
2579C242r58m725j059N116K104m085l243K703M158j305m477m47M828J622m193
$$ 3242 2284 -2441 -3500 1616 3720 -365 -3608 -905 3253 1948 -2529 -2976 1852 3474 -719
2594g19k967L068L865k042m032L67M652Q75m195k379L571L333k453l894J126L984
$$ -719 -3686 -618 3247 1205 -2827 -2460 2192 3067 -1128 -3507 64 3397 944 -2950 -1824 2160
2610B160O96m058j585L498K171k272l495J384L924m2m305j105M020J974k952k763
$$ 2160 2856 -1202 -2787 711 2882 610 -2885 -1501 2423 2381 -1924 -3029 991 2965 13 -2750
2626b750J687L818p53m015o18M007J564l456k516K653L202j486l656K22L528J144
$$ -2750 -1063 2755 2002 -2013 -2631 1376 2940 -516 -3032 -379 2823 1337 -2319 -2097 1431 2575
2642B575l494k044K961K689k043l160R67L201O10l418j647L270K425k763l034
$$ 2575 -919 -2963 -2 2687 644 -2516 -1549 1652 2262 -1156 -2803 467 2892 129 -2905
2657b905J665L440k14l279j022L235J491k523k649J784K963o85l151j43K809J408
$$ -2905 -1240 2200 1986 -1293 -2315 920 2411 -112 -2761 -977 1986 1301 -1850 -1993 816 2224
2673B224k597k242J886K725r47l048L29L266L78k575j573J607K698j394k630L99
$$ 2224 -373 -2615 -729 1996 1049 -1999 -1670 1596 1974 -601 -2174 -567 2131 737 -1893 -1494
2689a494L013M38k913p67J888J682j178k554Q01K608o0k616p65K203J679j726
$$ -1494 1519 1957 -956 -1723 165 1847 669 -1885 -1084 1524 1464 -1152 -1917 286 1965 239
2705B39j901P12K620k80k589n67K203J676k357j389J215K255r91k377K24K357
$$ 239 -1662 -950 1670 1390 -1199 -1766 437 2113 -244 -1633 -418 1837 846 -1531 -1307 1050
2721A050N74k215j010J272K034r36k248M82K372j27k161p68J810J825j492j812
$$ 1050 1624 -591 -1601 -329 1705 769 -1479 -997 1375 1248 -913 -1681 129 1954 462 -1350
2737a350O24J817K70k154o80J783J410j368j742J095J694m78j650m87J670J026
$$ -1350 -726 1091 1361 -793 -1473 310 1720 352 -1390 -295 1399 921 -729 -1216 454 1480
2753A480j234j535J014J531l20j821l21K068M76j343j356J178J405o61j491J69
$$ 1480 246 -1289 -275 1256 936 -885 -1206 862 1338 -5 -1361 -183 1222 561 -930 -761
2769g61J334N36j328r33J109J217o48j321m5J618K26j530o15J034J327q75j409
$$ -761 573 1109 -219 -1152 -43 1174 526 -795 -840 778 1004 -526 -1141 -107 1220 345 -1064
2786a064K25J242L89j626J8J060P17r83j038Q53J076j99j196j21J084O82j258
$$ -1064 -839 403 792 -834 -816 244 961 -22 -1060 -207 869 670 -526 -647 437 1119 -139
2803a39o37O28J091o47r86K47O21P27j080q43R59J141m66j046k07J058N32j618
$$ -139 -776 -148 943 296 -690 -443 178 905 -175 -1018 -59 1082 616 -430 -637 421 953 -665
2821f65k38R39R15l87j175j05J456l83o86l07N10M97m13o19N30O97J23j199k78
$$ -665 -903 36 951 564 -611 -716 740 357 -329 -636 -126 371 -42 -661 -131 566 689 -510 -788
2840g88P10O88l09j034M10J076l44q88O1N58L87p85m47L89R18m65n36J09O58K41
$$ -788 -78 610 301 -733 -323 753 409 -479 -418 140 527 -258 -705 -316 602 137 -399 -290 368 609
2860F09o03m36K35R55m00o87l14J005j78k72m49O08M09n08l66J81M46J88m31m67
$$ 609 6 -430 -195 760 360 -327 -641 364 186 -86 -535 73 482 -26 -392 -211 235 423 -8 -475
2880d75N07R0L4n98Q1P31o7q21K96K88K76l65n01L22M58M0m54m44M81N06l70n54
$$ -475 32 122 156 -442 -361 370 303 -518 -222 66 342 -23 -524 -202 256 296 -158 -602 -121 385 15 -539
2902e39L60M77k00q6J7J37J02l64k72N22J5K90n22m31M92M11o36l40O55j1K43
$$ -539 -179 298 98 12 29 166 268 -96 -368 154 169 459 -63 -494 -2 409 -227 -567 88 77 320
2923C20m40k09M02L81p28p5J53L50m82J62J01P5L63o59r6M78jj49Q4m02N66m8
$$ 320 -120 -329 73 454 -274 -349 -196 154 -328 -166 -65 10 373 -286 -382 96 95 -54 30 -372 194 146
2945A46M3m27N66P5k94k91K9M46p3m69J78k1L72j83j37j46K45L49m48j23J34N02
$$ 146 189 -238 328 403 109 -182 -153 293 220 -249 -71 -92 280 97 -40 -186 59 408 -40 -163 -29 473
2967D73k35l82L45O1j69p9m26N62j59N5n45N37j25L43k58l02J95L00l87K78J40
$$ 473 238 -144 201 262 93 14 -412 150 -9 46 -499 38 -87 256 -2 -304 -109 191 -196 82 222
2988B22k87lJ32m7R3o2Mk85J39L95j61q1k19J69K47j39j53J81j22N9l29R3J83
$$ 222 -65 -68 64 17 110 48 52 -233 -94 301 140 59 -160 9 256 117 -36 145 23 82 -247 -154 29
3011B9m7N9j86J82L37l96N7l19M05l21K71l31LM48l9k5p2J26r7k14R5r6L98m98
$$ 29 -18 41 -145 37 374 -22 35 -284 121 -200 71 -260 -257 191 152 127 55 181 84 -130 -35 -131 267 -231
3035b31P2j28L21k11J17K02l60K75j82O9l31M30L8q2o4J04J45m54R3n5L76N6m52
$$ -231 -159 -287 34 -177 -60 142 -218 57 -125 -56 -387 43 81 -1 -65 39 184 -270 -177 -232 144 200 -252
3058b52J14L52Oj60l23j92O77k65o8j28L14k4j60j19L71L3k95l02K00M83j59k4
$$ -252 -138 214 220 60 -263 -455 222 -43 -111 -239 75 51 -109 -228 143 176 -119 -421 -221 262 103 79
3080G9k92L42l20N00n67K29K53n86K17L61K9j56n6m01J72L37k01k89M4J04O65
$$ 79 -213 129 -191 309 -258 -29 224 -362 -145 216 245 89 33 -368 -196 141 -60 -349 -305 -201 464
3101D64m49q2J21K01j91l15j99M45N5q6j84K11K73l51k0J90j6m1J02k43K37om06
$$ 464 15 -67 54 255 64 -251 -450 -5 50 -36 -220 -9 264 -87 -107 83 67 26 128 -115 122 116 -290
3124b90L42p3K15j19l02J96K91j0n41P5L71j23j67J52o4L75k51k93OJ92L61m03
$$ -290 52 -21 194 75 -227 -31 260 250 -291 -216 155 32 -135 17 -47 328 77 -216 -210 -18 343 -60
3146f0n7J29J46J7n39K02M40k0j65N3o8K52k93j52j09N79j37k19l83Q15J11p23
$$ -60 -117 12 158 175 -364 -162 278 258 93 146 78 330 37 -115 -224 355 218 -1 -384 431 542 -181
3168a81R6K86J06k01l2l95M00K20k19o22O90M22m95l49J48M06k11j61n55O41L23
$$ -181 -85 201 307 106 74 -321 79 299 80 -542 148 570 75 -274 -126 280 69 -92 -647 -6 317
3189C17l72j01N5P56n62j61p6N01k76j18r7M5M52qm08l08O67m2l82q9J60N39j12
$$ 317 -55 -156 -101 655 93 -68 -144 357 81 -37 -134 -89 363 355 -53 -361 306 264 -118 -207 -47 492 380
3212C80o54L9O86j23n79R3K36J79l20k31J98O00k21l44l09K96L65j44l57m7Q11
$$ 380 -274 -235 451 328 -251 -158 78 257 -63 -294 -96 504 283 -61 -370 -74 291 147 -210 -257 554
3233E54O7q66j28M13L90k0r14L97L96M9o48m0N01J30n55k86L77K83k04k49J72
$$ 554 621 -245 -373 40 430 410 -504 -107 289 338 -310 -350 151 281 -274 -560 -183 100 -104 -353 -181
3254a81L11M75q10r4Q8N39n15l07M18K44j7o53K26J09M58l24m81K52P47m51k89
$$ -181 130 605 -205 -299 -211 328 -187 -494 -76 168 151 -502 -276 -167 291 -33 -514 -262 485 34 -255
3275b55k89O74K72m71k12K58K10M0o08k94N87O48n70m27M55L60l31l36p8L52M09
$$ -255 -544 130 402 -69 -281 -23 187 227 -381 -675 -88 560 -10 -437 18 378 47 -289 -367 -15 394
3296C94p20J45K53J26J8o88J18P87k66m97j61K16P78Jj064K05Q36j50l72m57Q08
$$ 394 -326 -181 72 198 216 -472 -354 433 167 -330 -491 -275 503 504 -560 -355 481 331 -41 -498 310
3317C10L69p23p14L91J050l72p06LN56O23r61k58K55P19j97o92L25J59L22n77
$$ 310 679 -44 -758 -367 683 311 -395 -392 164 787 -174 -432 -177 542 345 -347 -22 137 459 -118
3337a18j35J42M63j73n39m7P06L24q05k61M05O86n68l14j89P33O1o96J16M27N27
$$ -118 -253 -111 352 179 -360 -407 299 623 -182 -443 -38 648 80 -234 -423 310 371 -325 -209 218 745
3358G45n67m86J91P82k46p59R8O63J44n15m04J52O84j21p79J38M08L06m19l60
$$ 745 178 -308 -117 665 419 -340 -242 421 565 50 -354 -202 482 361 -418 -280 128 434 15 -345
3378c45R8J037m14o25K16K02K24n33n66R21J38j93m69j18P71r1n18m69P72N40
$$ -345 -247 790 376 -249 -33 169 393 -140 -706 215 353 160 -309 -427 344 253 -265 -734 38 578
3398E78m17j40Q5K28O1o95j70Q69K64k52j046N47O15q2o60j04N64K23m63l35K25
$$ 578 161 21 106 334 395 -300 -470 399 663 411 -635 -88 527 445 -215 -319 245 468 5 -330 -105
3419a05P93j66j044O5P79R7n10k15L46J92l1o02j58J071r8o04m20N82O20m89o00
$$ -105 688 522 -522 -457 322 419 -91 -306 40 232 201 -401 -559 512 414 -190 -610 -28 592 103 -497
3440d97O2O61J43o50k40O44L99m33n77P33O8J3n51r9M45K84l12n76N57N4L00p64
$$ -497 -435 226 369 -281 -521 123 522 89 -488 245 313 326 -225 -324 121 405 93 -483 74 128 428 -336
3462c36J3M97J93m19m76M56M36qq12K51M06M83o91l73j36Q63o71o3M5N51J24o18
$$ -336 -323 174 367 -52 -528 -72 364 356 -456 -205 201 684 -7 -380 -516 347 -324 -387 -342 209 333 -285
3484b85j99K62O14k20l24n9J53K30k85n34O03L11j75n22N97L82n89k84K11K11
$$ -285 -484 -222 392 172 -152 -211 -58 172 -113 -647 -44 267 92 -430 167 549 -40 -324 -113 98
3504I8L05o31k93L77M38p9m86J63K98L43j023p5O21K57j85n53K27M02L9l71j94
$$ 98 403 -228 -521 -144 294 215 -271 -108 190 533 -490 -565 56 313 128 -425 -198 204 243 -128 -322
3525c22L78L99m76k79J97N19j77l7l40j01M88L1p30J31N20Q0m36J3J70L16j99
$$ -322 56 455 -21 -300 -103 416 239 202 -138 -239 249 280 -450 -319 201 281 -155 -142 28 344 145
3546A45l57N8M40j08l87J23M04j25j91l33L43O49o79k81K01L45J37l29l60L11
$$ 145 -212 -154 286 178 -209 -86 318 193 2 -331 12 661 -18 -299 -98 247 384 55 -305 6
3566FK46k16n05M63L91m3n21k29M49L96j52o10L35J62r5k82k1M23R2n1m12J28
$$ 6 252 36 -469 -6 385 342 -179 -408 41 437 285 -325 10 172 77 -205 -226 197 289 238 -174 -46
3588d6R2j0L8j46J76J56J90p65O20J36l45j38J31j82M29n72J18K26K52P7n84j59
$$ -46 46 36 74 -72 104 260 450 -315 305 441 96 -42 89 -93 336 -236 -118 108 360 437 -147 -306
3610c06O27j62j08j10L6k1K99n59L11N0J83q8l28K64J92j98k26J62j90K70k34
$$ -306 321 159 51 -59 -23 -44 255 -304 7 57 240 152 -176 88 280 82 -144 18 -172 98 -136
3631a36J28J25j17N9R4m51L30L5k38n5K6M47k01o0N3j61Q5j63P7J12j13R7j40
$$ -136 -8 117 0 59 153 -298 32 67 -171 -226 -200 247 46 -14 39 -122 -37 -200 -123 -11 -124 -27 -167
3654a67J83R4j84n2J4K69m37K81q1%J17l32K73j43L56k80rJ59JJ32j07j41r0K24
$$ -167 16 110 -74 -126 -112 157 -280 1 -80 -80 37 -295 -22 -165 191 -89 -98 61 62 194 87 -54 -144 80
3678H0j48R9k09K8L89j98j55J17k91J94l3MJ42L18l57l52J63K11j22M9J67n7Q6
$$ 80 -68 31 -178 -150 239 41 -114 3 -288 -94 -127 -123 19 337 -20 -372 -209 2 -120 -71 96 39 125
3701A25k83J51o0J31k6n6j24L1K23k97K2R5J75j35m2J77k30L15l30Q0J45P2R6
$$ 125 -158 -7 -67 64 38 -18 -142 -111 112 -185 -163 -68 107 -28 -70 107 -123 192 -138 -58 87 159 255
3724B55p8p2j61N1k56J75O7J77l6k19N6K48l17p6L9L0J5p9K7K71m3J65j41K7l8
$$ 255 177 105 -56 -5 -261 -86 -19 158 122 -97 -41 207 -110 -186 -147 -117 -102 -181 -154 117 74 239 98 125 87
3749H7q7j33j69L04J50l07K33l31N9K93K12k03j92p6R1n4o5N33k39K3l87L42k00
$$ 87 0 -133 -302 2 152 -155 78 -253 -194 99 311 108 -84 -160 -69 -123 -188 345 106 129 -258 84 -116
3772a16j21N19m86J19J11R4j86J76no5P5J22M8k79j42j27J45K91m9k24N4L41q0
$$ -116 -237 282 -204 -85 26 120 -66 110 105 40 115 237 285 6 -136 -263 -118 173 124 -100 -46 295 215
3795B15k18j4K01l2l84K75N7k89O2J60K01j10r9m7K48j92K04k91n9R1J86J98j40
$$ 215 -3 -17 184 152 -232 43 100 -189 -127 33 234 124 25 -22 226 34 238 -53 -112 -21 165 363 223
3818B23n57J49L82j82k78K72J90j65L3j94M95J07l52k44J41l1J74l98k7L94m1
$$ 223 -334 -185 197 15 -263 9 199 34 67 -127 368 475 123 -121 20 -11 163 -235 -262 132 91
3839I1l18K01l63M28N2k68Q7J00J77k37k53L49K46k63r7j86K92K79l80j93O8N31
$$ 91 -227 -26 -389 39 91 -177 -90 10 187 -50 -303 46 292 29 -68 -254 38 317 -63 -256 -188 343
3861C43m40R3kM81k07m55L7K83K70n69k37K41L01J55m01k28L16J94k14l44K54
$$ 343 -97 -4 -6 475 268 -187 -150 133 403 -166 -403 -162 139 294 -107 -335 -19 175 -39 -383 -129
3882a29L74r4m20o6M92L32m72l71N21K04k44l44l86R94P2n67m77N75P20o46o56
$$ -129 245 151 -269 -335 157 489 17 -354 167 371 127 -217 -603 391 463 -104 -581 -6 714 68 -588
3903e88M65M24q2l13m40O21M27n70o32L43Q53j65q60L19J55N40n89k64M9R27l78
$$ -588 -123 301 219 -94 -534 87 514 -56 -688 -345 508 343 -517 -198 -43 497 -92 -356 -307 620 242
3924B42p20K24N80M64q68n18N66Q95o42o85o0R07K8r93M5O43N54o12r94N63R77
$$ 242 -478 -254 326 790 -78 -596 -30 865 223 -462 -522 385 413 -580 -535 108 662 50 -944 -381 596
3945E96j67j055r9O11Q59n01j040L52R70l02p02l20J019P23p43q58M13Q02M4r40
$$ 596 429 -626 -725 -114 745 244 -796 -444 526 224 -478 -798 221 944 201 -657 -244 558 602 -338
3965c38m03Q86K82l51q75P19R08l03j204L3J214J15o85j043J300R07q20j276J71
$$ -338 -741 145 427 76 -799 -80 828 525 -679 -646 568 683 -2 -1045 255 1162 342 -934 -763
3984g63J621J62j213o04Q36J051p55j076J15J729l34j317o68J579J121j235j379
$$ -763 858 1020 -193 -797 39 1090 335 -741 -626 1103 769 -548 -1216 363 1484 249 -1130
4001a130Q54J156k44j566k46J952L52j529o68Q30J428o18j540Q2J668K18j134
$$ -1130 -276 880 636 -930 -1176 776 1128 -401 -1069 -239 1189 571 -969 -887 781 999 -135
4018a35q87Q94J611q83j418j71K138j03j535o33J423R87r01j672N54J897R1k043
$$ -135 -1022 -128 1483 600 -818 -989 1149 1046 -489 -1122 301 1288 387 -1285 -731 1166 1257 -786
4036g86o3J223J044j117j590Q98J670k32j955m03K132P33j630j500J460J540m87
$$ -786 -849 374 1418 301 -1289 -391 1279 1047 -908 -1311 821 1554 -76 -1576 -116 1424 937
4053I37j816j54J758O30j608j285J491J489j049j538L2K154O34k210j247J644
$$ 937 -879 -1033 725 1355 -253 -1538 -47 1442 393 -1145 -1113 1041 1675 -535 -1782 -138
4069a38J686q97k207N58J868O34k105r13J719J452j228k167P73K101M98k520o47
$$ -138 1548 651 -1556 -998 870 1504 -601 -1514 205 1657 429 -1738 -965 1136 1634 -886 -1533
4086a533J795J517j573j844P60K207r3k360k78K232J109k342j254J280J906n14
$$ -1533 262 1779 206 -1638 -878 1329 1236 -1124 -1402 830 1939 -403 -1657 -377 1529 1015
4102A015k264m5K293P12j988j843J754K179j258k135K94K717K55k796n83J955
$$ 1015 -1249 -1294 999 1711 -277 -2120 -366 1813 555 -1580 -1286 1431 1686 -1110 -1693 262
4118B62J665j337k691R20K536L82k908o83K321J643j967k022J131K492l82k571
$$ 262 1927 590 -2101 -1181 1355 1737 -1171 -1854 467 2110 143 -1879 -748 1744 1362 -1209
4134a209r37K859J419k409k211J864K682q88k836K8K392J481k460k026J987K517
$$ -1209 -2146 713 2132 -277 -2488 -624 2058 1170 -1666 -1638 754 2235 -225 -2251 -264 2253
4150B253j069l125J09L292N57k763j746K472K388j769k630O09L447l7k839j464
$$ 2253 1184 -1941 -1832 1460 2017 -746 -2492 -20 2368 599 -2031 -1422 2025 1988 -851 -2315
4166b315K712J830j870k578R15L304Ol275j006K909J851k442k233J305K787k13
$$ -2315 397 2227 357 -2221 -1306 1998 2004 -1271 -2277 632 2483 41 -2192 -887 1900 1687
4182A687l501J6K805J459k610k168J818K996j236l331L01L353P51k969j909K416
$$ 1687 -1814 -1798 1007 2466 -144 -2312 -494 2502 1266 -2065 -1764 1589 2340 -629 -2538 -122
4198a22K642j523l396O86L208P86l436j558K770K724k072l284J402K871M91l443
$$ -122 2520 997 -2399 -1713 1495 2281 -1155 -2713 57 2781 709 -2575 -1173 1698 2189 -1254
4214a254j603L253K669k868k785J463L462n03l170j041L298J924k762k689J858
$$ -1254 -2857 396 3065 197 -2588 -1125 2337 1834 -1336 -2377 921 2845 83 -2606 -748
4229g48K869n71l471k64L698J037k799k348J899L288j184l438K60L148J269l668
$$ -748 2121 1550 -1921 -2185 1513 2550 -249 -2597 -698 2590 1406 -2032 -1772 1376 2645 -1023
4245a023j943L201K309j785l374Q14L950P1l129j812L118K515k371l223J371L363
$$ -1023 -2966 235 2544 759 -2615 -1801 2149 2220 -909 -2721 397 2912 541 -2682 -1311 2052
4261B052l8l610r75L303K135k819l041J877L644o80l511q64L896J551l220k725
$$ 2052 2014 -1596 -2571 732 2867 48 -2993 -1116 2528 1848 -1663 -2527 1369 2920 -300 -3025
4277c025K520L217j156l575r5L870J248l773k086K603L241j780l819N78M177O89
$$ -3025 -505 2712 1556 -2019 -2114 1756 3004 -769 -2855 -252 2989 1209 -2610 -2032 2145 2834
4293B834l686k005K774L202k333l409Q18M064J19l716j584L124K696k332l640
$$ 2834 -852 -2857 -83 3119 786 -2623 -1805 2259 2378 -1338 -2922 202 2898 566 -3074
4308c074J674L827j61m399p13L714K278l146l063K382L386o99m081p67M281J677
$$ -3074 -1400 2427 2266 -2133 -2846 868 3146 0 -3063 -681 2705 2006 -2075 -2842 1439 3116
4324C116l630k829L105L237j555m001R7M152J003l390k351K939L254k094l842
$$ 3116 -514 -3343 -238 2999 1444 -2557 -2460 1692 2695 -695 -3046 -107 3147 1053 -2789
4339b789Q07M343N3l729j822L485K991k548l907J619M051k13l944j333L801K365
$$ -2789 -1982 2361 2414 -1315 -3137 348 3339 791 -3116 -1497 2554 2341 -1603 -2936 865 3230
4355C230l157l279J884M014n27m263o36M038J924l253k999K186L773r40m546q1
$$ 3230 73 -3206 -1322 2692 2165 -2098 -2734 1304 3228 -25 -3024 -838 2935 1995 -2551 -2632
4371b632M403J180l531k716L219L413k104l881M89M260J046m167j979L165L007
$$ -2632 1771 2951 -580 -3296 -77 3336 1232 -2649 -2160 2100 3146 -1021 -3000 165 3172
4386C172k126m093J331M183L22m303j282L180K854k724l515J488M450o67m218
$$ 3172 1046 -3047 -1716 2467 2789 -1514 -2796 384 3238 514 -3001 -1513 2937 2270 -1948
4401a948q90L863K033l268k947K073M149r45m244o28M037J781l587k788K625L642
$$ -1948 -2838 1025 3058 -210 -3157 -1084 3065 2120 -2124 -2752 1285 3066 -521 -3309 -684 2958
4417B958j281m192Q9M121J225l715k446L372L124k034m124R60M103O12m120j968
$$ 2958 1677 -2515 -2426 1695 2920 -795 -3241 131 3255 1221 -2903 -1943 2160 2772 -1348 -3316
4433c316L709K741k336l754J394L925J60m067j177L488K719l158l169J715L780
$$ -3316 393 3134 798 -2956 -1562 2363 2523 -1544 -2721 767 3486 328 -2841 -1126 2654
4448B654m12m280q84M073J843k974l096K079L744r61m240k44L895J725l245k782
$$ 2654 2242 -2038 -2922 1151 2994 20 -3076 -997 2747 1786 -2454 -2698 1197 2922 -323 -3105
4464c105K590L467j469m224R34L843P21l759j833K877K986j987l552O58L999M28
$$ -3105 -515 2952 1483 -2741 -1807 2036 2757 -1002 -2835 42 3028 1041 -2511 -1853 2146 2574
4480B574m134j266L448K775k783l377J412L981m32m055r34L743J907k828k984
$$ 2574 -1560 -2826 622 3397 614 -2763 -1351 2630 2198 -1857 -2791 952 2859 31 -2953
4495b953K098L558p57m163O0L342J674l257k702K202L722j528l662K72L423J465
$$ -2953 -855 2703 1946 -2217 -2157 1185 2859 -398 -3100 -898 2824 1296 -2366 -2094 1329 2794
4511B794l752j834K516L096j593l978O13M041L55l326k000L286K719k292l292
$$ 2794 -958 -2792 -276 2820 1227 -2751 -2138 1903 2258 -1068 -3068 218 2937 645 -2647
4526b647J071L850J36l814j290L455K061k605l056J615L696n14l480q56L297J853
$$ -2647 -1576 2274 2410 -1404 -2694 761 2822 217 -2839 -1224 2472 1958 -1522 -2378 919 2772
4542B772k684k905J943L718j236l781l5L475J629l539k191K339L228j511l631
$$ 2772 88 -2817 -874 2844 1608 -2173 -2208 1267 2896 -643 -2834 -495 2733 1222 -2409
4557b409N92L326J309l631k191K861K870k036l030P00L429L10l062j696L243K074
$$ -2409 -1817 1509 2818 -813 -3004 -143 2727 691 -2339 -1639 1790 2100 -962 -2658 585 2659
4573B659k171k989J169L168pl195j131L173J948k650k721J822L273p23l169p34
$$ 2659 488 -2501 -1332 1836 1829 -1366 -2497 676 2624 -26 -2747 -925 2348 1625 -1544 -2278
4589b278L281J675l033k251J941K945q32l267QK990J161l181j790K228K771j248
$$ -2278 1003 2678 -355 -2606 -665 2280 1448 -1819 -1811 1179 2340 -841 -2631 -403 2368 1120
4605A120l126N21L116M40l019j439K391K323j526l053R41L196J6k928j364L091
$$ 1120 -2006 -1485 1631 2071 -948 -2387 4 2327 801 -2252 -1311 1885 1901 -1027 -2391 700
4621G00J563j893k739J499K859k79l132p60K887J835k329k538J705K431m57k862
$$ 700 2263 370 -2369 -870 1989 1710 -1422 -2182 705 2540 211 -2327 -622 1809 1352 -1510
4637a510j81K567J504k791j979J906K831j301k920K30K993P13k604j663K303K060
$$ -1510 -1691 876 2380 -411 -2390 -484 2347 1046 -1874 -1644 1349 2062 -542 -2205 98 2158
4653B158j533k271L81K715J15k600j025K291J996j909k491J116K673l30k144j204
$$ 2158 625 -1646 -1265 1450 1565 -1035 -2060 231 2227 318 -2173 -1057 1616 1286 -858 -2062
4669b062K487J832k185k060J427K282k25l035J0K027J354k087j746J535K033k54
$$ -2062 425 2257 72 -1988 -561 1721 1496 -1539 -1529 498 1852 -235 -1981 -446 1587 1333
4685A333k677k34K587O37j950j482J578J941q86k265L06K107N34k359p55J503
$$ 1333 -1344 -1578 1009 1646 -304 -1786 -208 1733 847 -1418 -1112 995 1529 -830 -1585 -82
4701h2J684j109j991M65K210L21k487p28J816J703j417j951J099J760l14k050
$$ -82 1602 493 -1498 -1033 1177 1498 -989 -1717 99 1802 385 -1566 -467 1293 979 -1071
4717a071o00K305J145j798j523Q41J769q5k128k8K047O75j682j493J253J933o49
$$ -1071 -1671 634 1779 -19 -1542 -701 1068 983 -1145 -1173 874 1549 -133 -1626 -373 1560 911
4734I11k175K39J789O09j876j091J443J710q80j877J64J880N55j917p83J550R95
$$ 911 -1264 -1025 764 1373 -503 -1594 -151 1559 679 -1198 -1034 846 1401 -516 -1299 251 1246
4751A246r30j539L72J946qj979k99J605P54j150j395O62J727p3j648m77J400J100
$$ 1246 316 -1223 -851 1095 1087 -892 -1191 414 1168 18 -1377 -715 1012 939 -709 -1186 214 1314
4769A314j694o87O61J737m44j671j40J394P65j369j401J337J439l40j587k81J774
$$ 1314 -380 -1067 -406 1331 887 -784 -924 470 1235 -134 -1535 -198 1241 901 -686 -967 807
4786H07L50j708o71J172J346r56j543Q34R31M50j704l81J431Q47j320r18N81J086
$$ 807 1157 -551 -1222 -50 1296 340 -1203 -369 562 1012 -692 -1073 358 1205 -115 -1033 -452 634
4804F34Q2j380l34J324N97r18j113O76J270k76j325QR76O44p20j252O46J243j33
$$ 634 716 -664 -998 326 923 5 -1108 -432 838 562 -763 -755 221 865 145 -1107 -461 782 649
4823F49j360L88R01L19j285m65P41R03r5j548L65O93O11j110q10J325Q42o64j126
$$ 649 -711 -323 578 897 -388 -853 -112 791 696 -852 -487 206 817 -293 -1103 222 1064 400 -726
4842g26P7J161L34j158l27O79P04o52p15M5J246m69n92m69J039P24p55j122P27
$$ -726 -649 512 846 -312 -639 40 744 92 -623 -578 668 199 -393 -862 177 901 146 -976 -249
4861b49R86p8r65n50J102M92o79p75O50P61o19n12K9P78K23r42j55J63R90n08
$$ -249 737 659 -306 -856 246 738 59 -716 -66 695 76 -436 -407 371 594 -348 -503 -340 650 142
4881A42l94j15R32k08n53m64Q07N21o29n09r2R82q7p28j10N80N36m13o58N17M43
$$ 142 -252 -367 565 357 -196 -660 147 668 39 -470 -562 420 333 -395 -505 75 611 198 -460 57 500
4902E00J05j000N4L40M64l31p32N66M16m5n64J2M03K73n68j94m5P22k23l58l51
$$ 500 605 -395 -341 -1 463 132 -600 -34 382 337 -227 -215 188 461 -107 -301 -346 376 153 -205 -556
4923e56Q88N4l92l66L12M87l19m68J76L04M33p40l1L80Q8j40l57P4N35P7n98O
$$ -556 332 386 -6 -372 -60 427 108 -360 -184 120 553 -187 -218 162 250 110 -247 -173 362 439 -159 -153
4945a53L92J06l8n64J61K55j34j32l96O75K62m26k56N8N16l80k39L68J17J06k35
$$ -153 239 345 307 -257 -96 159 25 -107 -503 172 434 8 -248 -190 326 -54 -293 75 192 298 63
4966F3j01M7L61k24n27L27j96M44l03J55o8K16j02j87k98O41r3q4j65J32K28m87
$$ 63 -38 9 370 146 -381 -54 -250 194 -109 46 -22 194 92 -95 -393 248 155 71 -94 38 266 -221
4988b21J24l0K68o4k24K50N8o0r7j33j35K37L4R5p5K1N8K7m05K30J36p6q6j24
$$ -221 -97 -127 141 77 -147 103 161 101 4 -129 -264 -27 7 102 27 48 106 133 -272 -42 94 18 -68 -192
5012a92L24j39n5J04o2L1n5N7m7L0j01K72j80k31K37O6n3j03n0J71N3J81k80Q7
$$ -192 132 -7 -62 42 -20 11 -44 13 -34 -4 -105 167 -13 -244 -7 59 6 -97 -147 24 77 258 -22 65
5036F5O1J7L4l11K06J88j48o2K6k8k69N02l68J07P1m0lO8M3j05pm1K03k53K33
$$ 65 126 143 177 -134 72 260 112 50 76 48 -221 281 -87 20 91 51 48 116 159 54 47 6 209 -44 189
5061A89l75J08K14j77J20j06l7K75j64j32R3J27N8K5r8r8J97l87L73q4j7p8k06
$$ 189 -186 -78 136 -41 79 -27 -64 211 47 -85 8 135 193 218 120 22 219 -168 205 121 104 26 -180
5084a80j6L12j48J2M8j77N0M9J8Q3k28L46J69n28J26K21Ln3K8k19l8L41j75q6
$$ -180 -196 116 -32 -20 28 -149 -99 -50 -32 51 -177 169 338 -190 -64 157 160 107 135 -84 -122 219 44 -42
5108d2N4L08k85N2j40J60M9P9p3L1m4j01j73n2K00j66R2J1q1P2k5j01L9M6O1J21
$$ -42 12 320 35 87 -53 107 156 235 162 193 149 48 -125 -177 23 -143 -51 -40 -121 -49 -74 -175 -136 -90 -29 92
5134I2m11M95p0k79r4J43J2l3L91k17j59J98j64J85j86R8J83n61J13K52k08J47
$$ 92 -319 176 106 -173 -267 -124 -112 -145 246 29 -130 68 -96 89 -97 1 184 -377 -264 -12 -220 -73
5156g3K69k37k46L8L81k24j37J66R3m6k64M28l00q0L86k28L29l89K02q0q5J25
$$ -73 196 -41 -287 -249 132 -92 -229 -63 30 -16 -280 148 -152 -232 154 -74 255 -134 68 -12 -97 28
5178B8j66K0Q5N2K79l01Q1J44k78R4J09l74J70J07O3lK48l44N7J8j34p1P2L3k64
$$ 28 -138 -118 -33 19 298 -3 78 222 -56 38 147 -227 -57 50 113 110 358 14 71 89 -45 -116 -44 -11 -275
5203b75M17p3o7k4O8L7k02R3J10J27j36J58k01j69K81n62M31k0J09k3J7m40J78
$$ -275 142 69 2 -22 46 83 -119 -26 84 211 75 233 32 -137 144 -418 13 -7 102 79 96 -344 -166
5226a66K62j46K66k55O3M2m03M71J64j09l29P8L06O3n0m98o3L40Nj20o5L15K5
$$ -166 96 -50 216 -39 24 66 -337 134 298 189 -140 -62 244 307 257 -241 -304 36 41 -79 -144 171 196
5249A96j73K2l15O89k18j94l22L31j02K23L4k55L75K4l92R2O6M9j73q3j18M19
$$ 196 23 45 -270 419 201 7 -315 16 -86 137 171 -84 291 315 -77 15 81 130 -43 -126 -244 175
5271A75r1j43J38O6q1k55J5K03K76k64J56l48P5L00p2k81L0K3Q8R0p6J21K36l35
$$ 175 84 -59 79 145 64 -191 -176 27 303 39 195 -153 -78 222 150 -131 -101 -78 10 100 24 145 381 46
5295D6j93R6M66r4m30M5Q8l0J39k36j78L77k71M5K61n9R0M1k3L1j34m9j60J66
$$ 46 -147 -51 415 321 -109 -64 24 -6 133 -103 -281 96 -175 -130 131 72 162 203 180 211 77 28 -132 34
5319C4N3K36k80k59L87J7j91j28K3K68r1j57k26J96O46n48o0m7J16L12l63l4Q5
$$ 34 87 323 43 -216 171 188 -3 -131 -108 160 69 -88 -314 -118 528 -20 -80 -127 -11 301 -62 -96 -11
5342a1R2k32P4j41K73N8l38k18N35M4M0m04K74K34k01k01J20J87l46J10l14K90
$$ -11 81 -151 -77 -218 55 113 -225 -443 92 136 176 -228 46 280 79 -122 -2 185 -161 -51 -365 -75
5364g5K13N2n12J11M36qj87k84K14J68j23j28r4J16K68n78L94K97m42M62k11N
$$ -75 138 190 -322 -211 225 217 30 -254 -40 128 5 -123 -217 -101 167 -411 -17 280 -162 300 89 94
5386I4J9L6l00p2M41M4J24q56P02j18O6r2l40M06K32m48k35L98M6K10n55M7K97
$$ 94 113 149 -151 -223 218 262 386 -470 232 114 180 88 -252 154 386 -62 -297 101 147 357 -198 -151 146
5409A46K56n14j82L74J96K00p96L13J19j9k11N7j17L80J01o24j30P27N7n42j74
$$ 146 402 -112 -294 80 276 476 -320 -7 112 93 -118 -61 -178 202 303 -321 -451 276 333 -209 -383
5430c83L52K32m29k72N36K44k54j14q5Q9L50l74l52N57n0O3J4m83N49Jk40J53
$$ -383 -31 201 -228 -500 36 280 26 -88 -173 -84 266 -108 -460 97 47 110 124 -359 190 191 -49 104
5452A04r4L13j49k66m21M48L35j90k05K54Q9k25r3j88J54N73k59k15J40K93l01
$$ 104 10 323 174 -92 -513 -65 270 80 -125 129 218 -7 -100 -288 -134 439 180 -35 105 398 97
5473I7o47M60J1L01k06l12L82J26n3k58K11Q4O3n06K27j04J96r8j80k8L69K13
$$ 97 -550 -90 -79 222 16 -296 86 212 159 -99 112 196 259 -247 -20 -124 72 -26 -206 -234 135 348
5495C48n93j2L13K91l47o29O21K75o0j39k57L53n7j18k85J63k6J45j39p6J91O5
$$ 348 -245 -257 56 347 0 -629 -8 267 207 68 -189 164 107 -11 -296 -133 -159 -14 -153 -229 -38 27
5517B7K58k81n14R21k21k80N5R1K28k71j82N68k16j27k13L0L12R7m89p0M97k6
$$ 27 285 4 -510 411 190 -90 -35 56 284 13 -169 399 183 56 -157 -127 185 282 -207 -277 220 194
5539A94k96j9J91K29J18l89r2pK36l64N3K54m4k02R2l14M44r5J3k83L10J32n7
$$ 194 -102 -121 70 299 417 28 -64 -71 165 -199 -146 108 64 -138 -46 -360 84 -11 2 -281 29 161 104
5562A04k55J68j2K17j39l83M44o5k05j64L01NK17l44j82M47j40K55n63L73p9Q3
$$ 104 -151 17 5 222 83 -300 144 79 -126 -290 11 16 233 -111 -293 154 14 269 -294 79 0 83
5584H3j69p6Q6N5j17k38L27J78r9l5k9J98J52l71n8p0N09l55P6k73M49j77j75
$$ 83 -86 -162 -76 -21 -138 -376 -49 129 30 -5 -34 164 316 -55 -113 -183 326 -29 47 -226 223 46 -129
5607a29o2l0K17j12j59L00p2M27n54N8L51N7j42k99K24l78N01l63j62L08qj49
$$ -129 -191 -221 -4 -116 -275 25 -47 380 -174 -116 235 292 150 -149 75 -303 198 -165 -327 -19 -27 -176
5629a76L01l28L12j06m09N24j65j1K28l34J09L2K18k07R1j3K58j75j99k5L47j16
$$ -176 125 -203 109 3 -406 118 -47 -58 170 -164 -55 -23 195 -12 79 66 324 149 -50 -75 272 156
5651A56k00R2j49K33l06Q8J30j74j33K14R8J22n9k04l5K20j10Q9j25J55KnJ06
$$ 156 -44 48 -101 132 -174 -86 44 -130 -263 -49 49 171 112 -92 -127 93 -17 72 -53 102 104 99 205
5674B05m55K52J85k58J5J81j53P3k7l7j27M40l62P7J04k56%K88k44j87K97l8j69
$$ 205 -250 2 187 -71 -56 125 -28 45 18 -19 -146 294 -68 9 113 -143 -143 145 -99 -286 11 -27 -196
5697a96K09o5L70l39m0o6J60J35l45Q9l8k2M20k08J98k22j22J01J4j55Q2K95l03
$$ -196 13 -52 318 -21 -61 -127 33 168 -177 -88 -126 -148 272 64 262 40 -82 19 33 -122 -40 255 -48
5720d8O4J14o0o8m1J60r5L38l12m0j28M18j06j8O1q7m3J49l15J2J76k67j2M18
$$ -48 16 130 70 2 -39 121 26 364 52 12 -116 302 196 178 239 152 109 258 -57 -45 131 -136 -148 270
5744B70l63J27J61l17L8O2K23j45j74M9L44j08l20J36j06K2J71j27M0k61J4k99
$$ 270 -93 34 195 -122 -84 -22 201 56 -118 -69 275 167 -153 -17 -123 -101 70 -57 -17 -278 -264 -563
5766e63L74p4K62M8J4J63j8m09R4J4L82j46m79K90k2P2j03K51J87l85k6p1N70
$$ -563 -189 -263 -1 47 61 224 206 -203 -109 -95 287 141 -338 -48 -70 2 -101 150 337 -48 -74 -145 425
5789D25l49Q3k72Q2N7l6K61l38J53O8k8j16K18j79K89l26k2L7k45J93j09m5K36
$$ 425 76 159 -113 -31 26 -10 251 -87 66 134 106 -10 208 29 318 -8 -30 7 -238 -45 -154 -199 37
5812C7j08L0J07P8q8k29o2K75k7k7o7m3j49M36m42K69j59J32K70k60M7J16j91
$$ 37 -71 -41 66 144 56 -173 -235 40 13 -14 -81 -124 -273 163 -279 -10 -169 -37 233 -27 20 136 -55
5835e5J49J2K10j72j06L7l25L63j11L86m47k92J41J28k7J45K5J91m47K77p8J48
$$ -55 94 106 316 144 38 75 -250 113 2 388 -59 -351 -210 -82 -109 36 61 252 -195 82 4 152
5857A52k21j67K66n1j25J12j55k02L14J37l38K34m2J82K9l28KK83J93l10l2L50
$$ 152 -69 -236 30 -21 -146 -34 -189 -391 -77 60 -278 -44 -86 96 125 -203 -201 82 275 -35 -67 283
5879B83k08k51M86o99O44j8j59j16K32j45j20J25K49l41p3n8J91j53J83k8n7k11
$$ 283 75 -176 310 -389 255 237 78 -38 194 49 -71 54 303 -38 -111 -169 22 -131 52 24 -33 -244
5901b44J17M24j51k03j20L11l68J16p9K01J04j67Q5j74K24n0Q6n1M0j25J72o3
$$ -244 -127 297 146 -57 -177 134 -234 -118 -197 4 108 -59 26 -148 76 26 112 61 101 -24 148 85
5923H5m8J12j80j08J90o8o6J61p7L7Q6j3J90p8l37K26o6j05K54O3j79l50J19J34
$$ 85 37 149 -31 -139 51 -17 -83 78 1 38 124 111 301 223 -114 112 46 -59 195 258 79 -271 -152 -18
5947a8j79k1L52k25J35J28o2j37O8K32j75J0k92J52r9J67j97J05K81k82j56Q2
$$ -18 -197 -218 134 -91 44 172 110 -27 41 273 98 108 -184 -32 -131 36 -161 -56 225 -57 -213 -131
5969a31P3L3j80K16Q3j65J97p3j5P3k03Qj0J54j15o3j66K93l5J58k16J52K56m58
$$ -131 -58 -25 -205 11 94 -71 126 53 38 111 -92 -84 -94 60 -55 -118 -284 9 -26 132 -84 68 324 -134
5993a34J71j51N5J61l9l14K17l02L56k49M50k42L6R0l80L40K19k25j86J57Q0m1
$$ -134 37 -114 -59 102 63 -251 -34 -336 20 -229 221 -21 15 105 -275 65 284 59 -127 30 110 69
6015F9p5j95J36Q2q8K29k33K9L68k06k69O3L48j07m80L68K36M7o63J31L35J78
$$ 69 -6 -201 -65 17 -71 158 -75 -46 322 116 -153 -90 258 151 -329 39 275 322 -341 -210 125 303
6037C03j63m90L82J76K42r00K02M98j30j0l79L79k25J17J60l75P1O06l03m52K33
$$ 303 140 -350 32 208 450 -450 -248 250 120 110 -269 110 -115 2 162 -213 -142 464 161 -291 -58
6058e8J56n2pj82K33J17l95l81L77L77j71m74J68L52P8q4m86L98J92j2j54K08
$$ -58 98 46 39 -143 90 207 -188 -569 -192 185 14 -460 -292 60 138 54 -432 -34 158 146 -8 200
6080B00O1J2m95L1M05m8k65j78K04K37q3j77l8K36L93l89m45M13j55L43n08l05
$$ 200 261 273 -222 -191 214 166 -99 -277 -73 164 81 -96 -134 102 495 106 -339 74 -81 262 -246 -551
6102e51N58J51k26o3J30k28L84o54L22O17l80k75K0J14L50N5n43Q7K40M16o61
$$ -551 7 158 -68 -131 -1 -229 155 -499 -177 440 60 -215 -195 -81 269 324 -219 -132 108 524 -137
6123a37k08O43q9j91k48j22P34j04m39k18N40M11n75l69L83J28J99p99K62L17
$$ -137 -345 298 209 18 -230 -352 382 278 -161 -379 161 572 -3 -372 11 139 338 -461 -199 118
6143A18L67n88l14K59O08k52m97R4L99K37n75k43M99N31m56k71p1M77J67q74J05
$$ 118 485 -103 -417 -158 450 198 -299 -205 194 431 -144 -387 112 643 187 -84 -155 322 489 -385 -280
6164b80K42K44j97n03M78J27L52n86n43Q01K24m39l0j49P93k54o21j29L24N36
$$ -280 -38 206 9 -494 -16 111 463 -123 -666 135 359 -80 -110 -259 534 280 -341 -470 -146 390
6184C90k54m74j02J042k81l75n47O51P43q27p08N67O93l12n43j54M54N24l97n68
$$ 390 136 -338 -440 602 321 -54 -601 50 793 -34 -742 -175 518 206 -337 -491 -37 487 90 -478
6204d78M52K53j55m05p1Q15k13j71m99N46N87m12o62J13O66j7n54l81Q47Q8l28
$$ -478 -26 227 72 -333 -404 411 198 27 -472 74 661 249 -413 -300 366 349 -205 -586 261 349 21
6225B1o10N02N85m39m96K1M95M30n01o66L92P33J02p92m40P54N38p68o48O02Q07
$$ 21 -589 -87 498 59 -437 -416 79 509 8 -658 -266 467 569 -223 -663 91 629 -139 -787 -185 622
6246F22m69p64L08O13M94r52o98P55O17j12p67j16J011Q4q60n53Q18Q17o34q40
$$ 622 153 -611 -303 310 804 -148 -846 -91 526 414 -353 -469 542 626 -234 -787 31 848 214 -626
6266f26L71M28J24o29J4L76P91j057k30L59O60j91n97k82Q04N40q16k78J86L86
$$ -626 -255 173 297 -332 -318 58 849 -208 -438 -79 581 390 -207 -489 315 855 39 -239 -53 333
6286C33J18r27L4P86J43n84o07O91P42l96q39R6Q84O6q55l17O55P70o91r48N09
$$ 333 451 -476 -442 344 487 -97 -704 -13 729 333 -506 -410 474 540 -315 -632 23 793 102 -846 -337
6307c37R17j11q87k84R05K05l29n85J98R42J53j093k31Q88N00p74q10Q48L50k3
$$ -337 580 469 -418 -702 203 408 79 -506 -308 634 787 -306 -537 351 851 77 -733 115 465 442
6327D42j073J66Q91M34j015m47N29N12O0j042M2J068j07p63n26O45R25o49p76
$$ 442 -631 -465 426 860 -155 -602 -73 439 499 -543 -501 567 460 -303 -829 -184 741 92 -684
6346f84O40P14n6n95o37N32R04o12j043M76R46q2j111K07P49O43j187n35M91O28
$$ -684 -44 670 614 19 -618 -86 818 206 -837 -361 585 503 -608 -401 348 991 -196 -731 -240 388
6366C88J07j039j0P80M81r06p30R35Q15l40j092j3J327k7p15p52P13Q41m50p37
$$ 388 495 -544 -554 226 707 -199 -929 6 821 481 -611 -624 703 676 -39 -791 -78 763 313 -424
6386d24J48O71L06r89l48O02Q79o44q17J17J008K46j198k86J299J73o84o77M80
$$ -424 -276 395 701 -288 -636 -34 845 201 -616 -499 509 755 -443 -729 570 743 59 -618 -138
6405a38P48k20r38r9J122K33p72j016J005R00k94r63l15J411j12p76k22M61R10
$$ -138 610 390 -548 -647 475 708 -64 -1080 -75 825 531 -432 -747 664 552 -224 -446 15 925
6424I25q72q87N00Q90L07j069n48Q61N67n14j063Q4J330k9r03k78J152L53p89
$$ 925 53 -834 -334 556 863 -206 -754 107 674 160 -903 -819 511 482 -421 -699 453 806 17
6443A7q91O66J121m70q39k16J111M70j032r93J001Q30j31j182l36J444K4o67o00
$$ 17 -874 -208 913 443 -396 -612 499 969 -63 -1056 -55 775 644 -538 -874 570 594 -73 -673
6462f73P12Q90n77j315N08R88Q5j103k53P60N34m61r37L70J061n3q31m57P82N31
$$ -673 39 929 352 -963 -455 533 618 -485 -738 22 556 95 -842 -472 589 536 -295 -752 30 561
6482E61m42q94L69J316l33j139m03J094L96m28r39M65J000k74j106J80P35N88
$$ 561 119 -775 -406 910 577 -562 -965 129 525 97 -842 -377 623 349 -757 -577 158 746
6500G46j228k92O13P84l11j127K18J066K10j089k28Q55O70m29j131O8J487l93
$$ 746 -482 -774 -161 623 312 -815 -597 469 679 -410 -638 217 887 458 -673 -605 882 489
6518D89p60n36R59P45q20j219R39J164l47j238k85J484N63j396n90K92J574k45
$$ 489 -271 -807 152 897 77 -1142 -203 961 614 -624 -909 575 1138 -258 -848 -556 1018 773
6536G73j493j75J214Q62j415p27Q48Q01l34r81j71J169K55j064k23P05R09p71
$$ 773 -720 -895 319 1181 -234 -961 -113 688 354 -627 -798 371 626 -438 -661 44 953 182
6554A82j060L13J252K55j213r27J249J080j039r98M36J222j95j187k53J151N65
$$ 182 -878 -565 687 942 -271 -1198 51 1131 92 -906 -470 752 557 -630 -883 268 833
6571H33p35r80O18J239l54r47m25J232M33r77j023J035J215p85j067k41J487M06
$$ 833 98 -882 -264 975 621 -326 -751 481 914 -63 -1086 -51 1164 379 -688 -929 558 964
6589I64j146q33R77P62n47r61Q0J163L93j035n06N23J127q01j231P62J020rj336
$$ 964 -182 -1015 -38 724 177 -784 -704 459 852 -183 -689 -166 961 160 -1071 -309 711 702 -634
6608f34l46J346L90o83p83M46J203k15j436r6R62R42j133o42K64J269l49j133
$$ -634 -980 366 756 73 -710 -264 939 724 -712 -808 154 1096 -37 -679 -415 854 505 -628
6626f28j4J018L97r59o95R72R34n69r66k7R93L44r07p49J009Q40r06p59J32J136
$$ -628 -642 376 773 -186 -881 91 1025 456 -510 -537 456 800 -107 -856 153 993 87 -672 -540 596
6646E96L71j479l94J050O00n56j107L90J306j19j254m11J335M41p31j267Q16J015
$$ 596 967 -512 -906 144 744 188 -919 -529 777 658 -596 -1007 328 769 38 -1229 -413 602
6664F02O4j447J66R10O47j382m10Q68Q00l98j072J48J011N19j232n80R42N63l60
$$ 602 666 -781 -615 295 942 -440 -850 18 818 420 -652 -504 507 1026 -206 -786 156 719 359
6683C59j097r5J402j20j008n18J080O53m11j111L79R86J10j084k18Q12J194j105
$$ 359 -738 -833 569 449 -559 -1077 3 656 245 -866 -487 499 609 -475 -693 119 1313 208
6701B08j287Q75Q79j9j288P0Q35O05q15r51O06R54l23j086J73Q74O35r71o94M95
$$ 208 -1079 -204 675 656 -632 -562 273 878 63 -888 -282 672 349 -737 -564 310 945 -26 -720 -225
6721b25J004k61r36j02R94L77q77j067J193Q29p31j152O97Q08K04r70n61P82Q32
$$ -225 779 518 -418 -520 474 851 -26 -1093 100 929 198 -954 -257 551 755 -215 -776 6 838
6740H38n35j036K65R31K34j178j91P26O95n51j081P91N96K51j435j54J115M84
$$ 838 303 -733 -468 463 697 -481 -672 54 749 198 -883 -92 504 755 -680 -834 281 765
6758G65q20q83P54R63m24j031L5R19M34r01l15M19O37k53q41J48O79L89p30o78
$$ 765 -55 -938 -184 779 355 -676 -641 278 712 -189 -504 -85 552 299 -542 -394 285 674 -56 -734
6778g34Q53N65l40r68M39Q68j56p67k38M27R89j242k28K33R31k33r16j36J051
$$ -734 119 684 344 -624 -185 683 527 -240 -478 -51 938 -304 -532 -299 632 399 -517 -653 398
6797C98J83o67n80L60P42k27n15k86P52M74q42n74O96Q91l27j035k06J223J08
$$ 398 581 -86 -666 -306 436 209 -306 -592 160 634 -208 -782 -86 805 478 -557 -763 460 568
6816E68p87o50O93J089j028m02J40J148m40p89m8O94M36o24p50N08Q54l03o41
$$ 568 -219 -869 -176 913 -115 -517 -377 771 331 -458 -506 188 624 0 -750 -242 612 309 -332
6835c32j15M53K48m26n91M67Q69j71r00k32P77O18j008j88L16N42l87l75LL70
$$ -332 -447 6 254 -172 -763 -296 573 402 -498 -730 47 665 -343 -531 -215 327 -60 -435 -432 -62
6855f2L56k87o05M15J005n41r57J70P32K81p59l36O98K39l45m89J44Q24J1q81
$$ -62 294 7 -598 -183 822 281 -676 -506 226 507 -252 -588 110 349 4 -485 -341 483 494 -387
6875c87l33P81N56m02q18L33O89m2p99j26Q02R0q6n67L41N80n25l00j37N90R9
$$ -387 -720 61 617 215 -603 -270 419 377 -422 -548 254 344 258 -309 32 612 87 -213 -350 240 339
6896C39j16p60M85N20l63o54K22O30K78m88k93K44M60n43l70k2N93M21p70j90
$$ 339 223 -537 -52 468 105 -549 -327 303 581 93 -200 44 504 -39 -409 -431 162 583 -187 -377
6916c77K11O01k49l78n5M90J8k78j93L23K52l38m56J79O03j87m13j56M24M00m89
$$ -377 -166 435 186 -192 -247 243 261 -17 -210 113 365 27 -429 -250 353 166 -247 -403 21 421 -68
6937f8m85O35O18l97p74nO64K81n03l07J05M75l4o33K59N58J8l58k93M24M5l93
$$ -68 -553 82 700 303 -471 -476 188 469 -34 -341 -236 239 205 -428 -169 389 407 49 -244 180 225 -168
6959a68j98K15N98j50p25L5N77J12l6l83j4M09or58M31J58K71p6l73K17L34j67
$$ -168 -366 -151 447 297 -428 -393 184 296 260 -123 -137 272 266 -692 -261 -103 168 92 -281 -64 270 103
6981A03k22l30O64m9l50J11K25j5O7o94J79P40k15m0o04P38K08n09j84J51k29
$$ 103 -119 -449 215 166 -184 -73 152 137 204 -490 -311 429 214 174 -430 308 516 7 -177 -26 -255
7002b55K58Q3KJ00m1m15J24K91p8M9k56k38N10j08K8j55o4L28k6k13M7P0J81j33
$$ -255 3 86 88 188 147 -268 -144 147 69 118 -138 -376 134 26 54 -101 -165 163 137 -76 -29 41 222 89
7026H9j00J24M4j09j91M6K47N5l87j67N23k46J05j15j3L72k76k02r0L76R0k6j63
$$ 89 -11 113 157 48 -143 -97 150 205 -182 -349 174 -72 33 -82 -95 277 1 -201 -291 85 175 149 -14
7049a4K1L2nk68Pj5L49M3l41J72l4J32j93Ql9K34j90LO6O02m88l6l3L6K69m72
$$ -14 7 39 34 -234 -227 -242 107 150 -191 -19 -53 79 -114 -106 -145 89 -101 -98 -32 570 82 46 13 49 318 -154
7075a54N6J38K45J11n21K06n0Pk41K65L9R1l67J1L8J87j03J75j58l73M05k33K81
$$ -154 -98 40 285 396 -125 81 31 38 -203 62 101 192 -175 -164 -126 61 -42 133 -25 -398 7 -226 55
7098E5k95J80j4J29o2qm0J37j85k24K15J13m81M02R2j7M7rr0J76l6j31K63l25
$$ 55 -240 -60 -74 55 -7 -15 -55 82 -103 -327 -112 1 -480 -78 14 -3 44 35 -55 121 85 -46 217 -108
7122a08K08r5q8K97l7k23P2m3jK45j57j28J45l61K35J99m09J28K9J03j05L98k55
$$ -108 100 5 -83 214 177 -46 26 -17 -18 227 70 -58 87 -274 -39 160 -249 -121 -92 11 -94 304 49
7145D9J39q6k05Q6K18m78j8L02J17L0l43K71j55K30k00O6l19J7L31j6r0P0R1k71
$$ 49 188 102 -103 -17 201 -277 -295 7 124 154 -189 82 -73 157 -43 23 -296 -279 52 36 -54 16 107 -164
7169a64M39p7l6k71j77L57J61j10m69M85j07j92J75k66J22R4M2j69J02J49J41
$$ -164 275 198 162 -109 -286 71 232 122 -347 138 31 -161 14 -252 -130 -36 6 -163 -61 88 229
7190B29j75K55k79l3n1M8K18j06j21J8k00K4J78J51m51L20K9j65K41k83L53k96
$$ 229 54 309 30 -3 -54 -6 212 106 -15 3 -197 -173 5 156 -295 25 54 -111 130 -153 200 -96
7212i6k31K07K18O1k65K26l32O0K70P8k38K50k02j6k73K89kO6l5J9L85m69M8k41
$$ -96 -327 -120 98 159 -106 120 -212 -152 118 196 -42 208 6 -10 -283 6 4 70 35 54 439 -30 18 -223
7236b23P4J47K9N2k41L45j69O9l17M88l51L3lk8K94l34J68J90l18J41J38j17l71
$$ -223 -149 -2 27 79 -162 183 14 83 -234 254 -97 -64 -67 -95 199 -135 33 223 -95 46 184 67 -304
7259c04L11l63K34QM53j32Jr9j09P2j04K04j46l10L54j76P9n2k03K31j91L31o7
$$ -304 7 -356 -122 -114 339 207 208 109 0 72 -32 172 26 -284 70 -106 -27 -79 -282 -51 -242 89 22
7282B2K03k44O7k32L64l67K32J31j32l2o6K84n80L38K74l25qK48k2k62mK80j57
$$ 22 225 -19 48 -184 180 -187 45 176 44 12 -54 230 -350 -12 262 -63 -71 177 155 -107 -111 169 12
7305A2Q5j77J43j58N9mQ1J54Q9m67l3J12r2J63q5J71j65K77o4j13J57j2op0j67
$$ 12 97 -80 63 -95 -36 -40 41 195 284 -183 -216 -104 -196 -33 -118 53 -112 165 101 -12 145 133 127 57 -110
7330a10J31J22n62K94K39k91p7J12K70j08J52m06J26R6J3LJ92k85R1J47j92j05
$$ -110 21 143 -419 -125 114 -177 -254 -142 128 20 172 -234 -108 -12 1 4 196 -89 2 149 -43 -148
7352a48N4J64P9k69p9M07k99p4j05K67l5j19K68o9l41L46m3J3k19K47k89k9M05
$$ -148 -94 70 149 -120 -199 208 -91 -165 -270 -3 -38 -157 111 42 -299 47 4 17 -202 45 -244 -273 132
7375A32j17k68O6J82j46K60k64P2J50j67J66l8J81j76J12k99K00l8J39r0m6mj01
$$ 132 15 -253 -187 -5 -151 109 -155 -83 67 -100 66 28 209 33 145 -154 46 8 147 57 11 7 -94
7398i4L33j94j83M68K2j63l05K46j50M1o5K0k8j5n8K31j85N6J39O5o2n9j76J74
$$ -94 239 45 -138 330 352 189 -116 130 -20 21 -44 -24 -52 -67 -125 106 -79 -23 116 181 119 60 -116 58
7422E8m12J94L40j82o5J20k0k07J18j18J18p5L59l15J5q1rj75J50O6n6J52l7J7
$$ 58 -354 -160 180 -2 -67 53 33 -174 -56 -174 -56 -131 228 -87 -72 -153 -162 -337 -187 -121 -177 -25 -62 -45
7446d5L8j58L81j63j84n1J47j31R3K48j76j79L36j1M3r5l5J64j47k55L72m9j77
$$ -45 -7 -165 216 53 -131 -182 -35 -166 -73 175 -1 -180 156 145 188 93 58 222 75 -180 192 143 -34
7469c4p4J15J37l45M05n6k02r0J76P5j06k47L7L62p8p4J20l89M52r0j3O8k7J54
$$ -34 -108 7 144 -201 204 148 -54 -144 32 107 1 -246 -209 153 75 1 121 -268 184 94 81 149 122 276
7493B76k92K22Q6k16k67L91l83J38Q7k62J96K13k4j6k63J83j5L0k2m34O15k75
$$ 276 -16 206 292 76 -191 200 -183 -45 42 -220 -24 189 165 149 -114 69 54 84 62 -372 243 -32
7515c2L9j8k63K12k9j8K32l70N9K24k75lK11J19k21KM42m51J44q5O6j64Q6K91
$$ -32 7 -11 -274 -62 -91 -109 123 -247 -188 36 -239 -242 -31 88 -133 -131 311 -140 4 -81 -15 -179 -93 198
7539A98m25K26j38n4L48j25j47k4L37j25k60K40p4K77k8N1l17r2K69p0q3k30N16
$$ 198 -227 -1 -139 -193 155 30 -117 -141 196 71 -189 51 -23 254 226 277 -40 -132 137 67 -16 -246 270
7562B70j96j61J57k4j94J70J71m41L03nJ27k16j15N5j6M8l25K39J82k67oQ3K90
$$ 270 74 -87 70 46 -148 22 193 -248 55 50 177 -39 -154 -99 -115 -67 -392 -153 29 -238 -244 -161 129
7585A29J30j22k13k1K02K3P4l53nL42n51M28o4J54l48K70j67J52q1l5Oj2K90j09
$$ 129 259 137 -76 -97 105 128 202 -151 -156 186 -365 63 -1 153 -195 75 -92 60 -21 -56 -50 -62 228 119
7609A19l47R9L20o9k13J67J08o0%l76K24j65K19k7R3k5J84j93j63Q3l6J42j30
$$ 119 -228 -129 191 122 -91 76 184 124 124 -252 -28 -193 26 -1 92 67 251 58 -105 -22 -58 84 -46
7632d6j5j56J05J93L1j76K7Nk40kM38k35N5q0J91j88J30l1J31r8J33l21lJ60j05
$$ -46 -61 -217 -112 81 112 -64 -37 -32 -272 -274 164 -71 -16 -96 95 -93 37 6 137 39 172 -149 -152 8 -97
7657i7j4L4R0p3j64J66k87M34N4j39K52m41K57J84k45j51l5M99n31P5r8J44K67
$$ -97 -111 -77 13 -60 -224 -58 -345 89 143 4 256 -185 72 256 11 -140 -175 324 -207 -132 -230 -86 181
7680A81N2l35J29n5J30%m7J07j19j82J97K8j26J79j31O8nk0r6j47L3K78k52O0
$$ 181 233 -102 27 -28 102 102 55 162 43 -139 58 86 -40 139 8 76 71 51 -45 -192 -159 119 -133 -73
7704g3M8nj41R1J31j00L47n67J83J08N2k12j13K25j52L3J32o5J17L7o7k70J96
$$ -73 -25 -30 -171 -80 51 -49 298 -269 -86 22 74 -138 -251 -26 -178 -145 -13 -78 39 76 9 -261 -65
7727f5N3J26k29lK08N9j59j67L23k72L21k63n2L61m46K0O60o43J63J6J7n0k81
$$ -65 -12 114 -115 -118 90 149 -10 -177 146 -126 195 -68 -120 241 -205 -185 475 -168 -5 11 28 -22 -303
7750c03M91l99L37j17r4K34j44K03j3j14K8n9L2j95m1J62o0j41p1M81k45L22J59
$$ -303 188 -211 126 9 -85 149 5 208 195 81 109 50 82 -113 -154 8 -52 -193 -264 217 -28 294 453
7773D53m71j2K60k34k64L16J87q0n48L88L31l87j25K58n1M2j16L94k46Oj77J46
$$ 453 -18 -30 230 -4 -268 48 235 155 -393 -5 326 -61 -186 72 21 63 -53 341 95 101 -76 70
7795G0L2p9K4K65j65K17l17j20jK63j82Q1k59K5M0J59j8k22J33J3J45j75J93n5
$$ 70 102 23 47 312 147 364 47 -73 -74 189 7 88 -171 -146 -106 53 35 -187 -54 -41 104 -71 122 67
7819F7K37o31O23j11l50K12m43M35oN0K9p5K4J32Q5l03r5Q1J57J59m65L57j90
$$ 67 304 -327 296 185 -165 47 -396 39 33 83 112 37 61 193 278 -25 -120 -39 118 277 -188 169 -21
7842b1L4k42K59J31M1k58J58J73l75J85L3k71R1J99j69K21j81M6k58k3K8J70K18
$$ -21 13 -229 30 161 202 -56 102 275 -100 85 118 -153 -62 137 -32 189 8 54 -204 -227 -199 -29 189
7865A89k63j7J77n4L2q2j23M17m17L9L32k55r2j5K06J53l28J20J54l72J08L05
$$ 189 -74 -91 86 32 64 -18 -141 276 -141 -102 230 -25 -117 -132 74 227 -101 19 173 -199 -91 214
7887B14r5j17N9j23L76k14o1m1j98K32q3N1J51J9l55M02k13O0J31qj46k5nL8j14
$$ 214 119 2 61 -62 314 100 39 -2 -200 32 -51 0 151 170 -185 217 4 64 195 187 41 16 11 49 -65
7912f5L71q4l71P2R1k13J70J79l43R5m3J47k51J19L10j19k65J4L14J1m6j80K22
$$ -65 306 222 -149 -77 14 -199 -29 150 -193 -98 -141 6 -245 -126 184 65 -200 -186 128 139 93 -87 135
7935A35J25k3j75q2j32K0L64j36k07J70j27J06j60J11k0n4K67qj20k44J35j75
$$ 135 260 237 62 -20 -152 -132 232 96 -111 59 -68 38 -122 -11 -31 -85 182 174 54 -190 -55 -230
7957b30J44n9m3M21l1j16j8k01J26J79k48K74j36M6M9J56k14l89K70Q8j97J82
$$ -230 -86 -145 -188 233 202 86 68 -133 -7 172 -76 198 62 108 157 313 99 -290 -20 68 -129 53
7979E3l7J62k71LL07l03K2k12Q4R0K66k47J7jK62l39J74J60j64J03k79J24N8K01
$$ 53 16 178 -93 -90 217 -86 -64 -276 -192 -102 164 -83 -66 -67 195 -144 30 190 26 129 -150 -26 32 233
8003B33k94K5M4K59l32J58j77k16M80Q1m34j87L90K51j04p8J2ol60M27l71K84
$$ 233 -61 -36 8 267 -65 93 -84 -300 180 261 -173 -360 30 281 177 99 111 105 -255 172 -199 85
8025H5p2J9m6o7k56N87k82j83K82l34K56J59j74Oj60J60J40m5j92M2N8J74k62
$$ 85 13 32 -14 -81 -337 250 -32 -215 67 -267 -11 148 -26 -20 -180 -20 120 75 -117 -75 -17 157 -105
8048a05p7l2J56Qj28n2J94o1J4J19q2J49R7k38K48l13Q5k1k72L25J63J08m12J00
$$ -105 -182 -214 -58 -50 -178 -230 -36 -97 -83 36 -46 103 200 -38 210 -103 -18 -39 -311 14 177 285 -127 -27
8072b7k94L19oJ38j38j47L21N4j03k55K26l33K3K53M8l4j44J35q0L45m36J58k77
$$ -27 -321 -2 -8 130 -8 -155 166 220 117 -138 88 -245 -222 31 79 45 -99 36 -44 301 -135 23 -254
8095b54K89j65J56p1q7NN7L13k93l9K39m25K59j67J08j28K04K84n28M50j44j06
$$ -254 35 -130 26 -45 -132 -127 -70 243 -50 -89 150 -275 -16 -183 -75 -203 1 285 -243 207 63 -43
8117d3M3K57n8J92k79k11L15n3l48J44K3k37Q4K90j63p0L5o3O0N54l11k23l0L64
$$ -43 0 257 199 391 112 -99 216 163 -185 -41 -18 -255 -171 119 -44 -114 -79 -142 -82 472 161 -62 -92 272
8141B72o29N65l0L6j70K7l05K74J75j60o6k94K60p3J67k41L20j88J21L2j50n5
$$ 272 -357 208 178 214 44 71 -234 40 215 55 -11 -305 -45 -118 49 -192 128 -60 61 93 -57 -112
8163a12O7j9J27mp5K03k40j16K16J79j77k79l9J92l6k6J14m0K10k35l0k2Q3K46
$$ -112 -45 -64 63 59 -16 187 -53 -169 47 226 49 -230 -269 -77 -113 -139 -25 -65 145 -90 -120 -142 -59 187
8187A87k31n3K47M2
$$ 187 -44 -97 150 192
8191A92
$$ Imaginary data points
##PAGE= N=2
##DATA TABLE= (X++(I..I)), XYDATA
0@%%%%%%%%%%%Qj6J6j6J6j6K3l1L2l5M3m9N7o7P5q7R8j10J26j42J58j77J99k20
$$ 0 0 0 0 0 0 0 0 0 0 0 0 8 -8 8 -8 8 -8 15 -16 16 -19 24 -25 32 -35 40 -47 51 -59 67 -75 83 -94 105 -115
35a15K45k76L06l38L76m16M60n09N65o28O94p70Q60r62J081j221J387j593J858
$$ -115 130 -146 160 -178 198 -218 242 -267 298 -330 364 -406 454 -508 573 -648 739 -854 1004
54A004k203K675l371M498o620J1963m6561j14009R9272J24748p150q9687j027
$$ 1004 -1199 1476 -1895 2603 -4017 7946 -38615 -152624 -53352 71396 64246 -25441 -26468
67b6468O3958o195q6848j1989J01279O5719p9497j03837K5457J06295J4707q5648
$$ -26468 37490 31295 -55553 -67542 33737 99456 19959 -83878 -58421 47874 62581 -23067
79b3067l4212P5151M7782o9119p2821N0626R5160j5701j02013k1064R0851M9546
$$ -23067 -57279 17872 65654 -3465 -76286 -25660 69500 53799 -48214 -69278 21573 71119
91G1119p1463o7660N0376Q1107k9261r1987K61R4713L1956q2451n8844O1327P6603
$$ 71119 -344 -68004 -17628 63479 34218 -57769 -57508 37205 69161 -13290 -72134 -10807 65796
104F5796l6299q5706Q724Q7019J8372q1050m4603O7610O7773m5201q3377J7684
$$ 65796 29497 -56209 -47485 39534 57906 -23144 -67747 -137 67636 22435 -60942 -43258
116d3258Q8608R400q6002l5932P5573O0164n6330p6868L2734Q6127n831q6842
$$ -43258 45350 54750 -31252 -67184 8389 68553 12223 -64645 -31911 54216 48385 -38457
128c8457k2210P8637M6371o2865o4474M2475P8867j6756q4304j1041P9328L6755
$$ -38457 -60667 17970 64341 1476 -62998 -20523 58344 41588 -42716 -53757 25571 62326
140F2326o7729n8067M8756P3978k4549q0976p73Q0094K5419p2329m9006N6549
$$ 62326 -5403 -63470 -14714 59264 34715 -46261 -47034 33060 58479 -13850 -62856 -6307
152f307O6553l4999p6674J1436Q0311J4043p5414l8295O2471N6237m3770o9578
$$ -6307 60246 25247 -51427 -39991 40320 54363 -21051 -59346 3125 59362 15592 -53986
164e3986K1663P5479L152p2857k6460O3839M5701m8801o2152K8326P1475n286
$$ -53986 -32323 43156 46308 -26549 -53009 10830 56531 7730 -54422 -26096 45379 40093
176D0093p2273j8309O7546L9856n4750n7207L5955O7840j5257p1969o701O9876
$$ 40093 -32180 -50489 17057 56913 2163 -55044 -19089 48751 33494 -38475 -45176 24700
188B4700K8833n9911m6423M4280O0196k5296o8432K811O8696J9485o1697l8403
$$ 24700 53533 -6378 -52801 -8521 51675 26379 -42053 -39242 29454 48939 -12758 -51161
200e1161M8882N4549l1263o4556R857O6877J0758o3254l0723N4207M7767l8506
$$ -51161 -2279 52270 21007 -43549 -33692 33185 43943 -19311 -50034 4173 51940 13434
212A3434n9289J9167O5136R83o5497k1875N7778M0009m4418n2659K7882O0426
$$ 13434 -45855 -26688 38448 39431 -26066 -47941 9837 49846 5428 -47231 -19349 41077
224D1077q092o2684j1525N7038K8732m6837m4324L3282N4493j4963n8999m176
$$ 41077 32985 -29699 -41224 15814 44546 -2291 -46615 -13333 41160 26197 -32802 -36978
236c6978N7089K2394m9989l8738L6918N0395k0651n5792L916N6723J3762n2448
$$ -36978 20111 42505 -7484 -46222 -9304 41091 20440 -35352 -31436 25287 39049 -13399
248a3399k9987M2128M2685k8275n1887J2740N5290N921n2347k2387M4164L5835
$$ -13399 -43386 -1258 41427 13152 -38735 -25995 29295 35216 -17131 -39518 4646 40481
260D0481l2687m6239J7581N1009l69n0743j5052M6089K9617l6828m1455K2928
$$ 40481 7794 -38445 -20864 30145 29776 -20967 -36019 10070 39687 2859 -38596 -15668
272a5668M8461p686n0847q282M8477K4142l9893l6718K8153M4628j4787m8934
$$ -15668 32793 25107 -25740 -34022 14455 38597 -1296 -38014 -9861 34767 19980 -28954
284b8954n68M8012J5964m2530k8407L3173L8840k0810m4795N157M5685R528m2361
$$ -28954 -29522 18490 34454 -8076 -36483 -3310 35530 14720 -30075 -24918 20767 30295 -12066
297a2066k2415L4559L4609k3634m1625J0547M3697L039m2758j6447L7150K8745
$$ -12066 -34481 78 34687 11053 -30572 -20025 23672 26711 -16047 -32494 4656 33401
309C3401k8221l6653J7166M1676l731m2824j0235L8409K1622l0012l0799K0280
$$ 33401 5180 -31473 -14307 27369 23638 -19186 -29421 8988 30610 598 -30201 -9921
321i921L7228q403l8751m213L6848J5243l2116k5893K3648L3760j2141l6989N05
$$ -9921 27307 18904 -19847 -24060 12788 28031 -4085 -29978 -6330 27430 15289 -21700 -21195
334b1195L6929J1188l3437k2129K6138K9401j6407l4261N928L6724M964l3969
$$ -21195 15734 26922 -6515 -28644 -2506 26895 10488 -23773 -17845 18879 23843 -10126
346a0126j5542K8574K3711k1100l0630J1201L4032n5l2745j0621K9215J9666k2506
$$ -10126 -25668 2906 26617 5517 -25113 -13912 20120 20065 -12680 -23301 5914 25580 3074
359C074k7473J3589L0354l265l1692n685K9912J5452k4423k3954J7158K8535q362
$$ 3074 -24399 -10810 19544 16279 -15413 -21098 8814 24266 -157 -24111 -6953 21582 13220
372A3220l1099j276L0303J0931k5705j8592J9719K4159j2135k7472K735K7740
$$ 13220 -17879 -19155 11148 22079 -3626 -22218 -2499 21660 9525 -17947 -15212 12528
384A2528N301k4635j3356K1028K0095j4290k4311N853K5473L054k5248j0897K1304
$$ 12528 17829 -6806 -20162 866 20961 6671 -17640 -11787 13686 16740 -8508 -19405 1899
397A899J7603j5038k2006Q926K4267j763k4690o306K2173J3287j8128j8247J2504
$$ 1899 19502 4464 -17542 -8616 15651 13888 -10802 -17108 5065 18352 224 -18023 -5519
410e519K2216n160k3451k582K1705R028j8450j4973J3598J8975o872k0505M53
$$ -5519 16697 11537 -11914 -14496 7209 16237 -2213 -17186 -3588 15387 8515 -11990 -11537
423a1537K0505N829j9167j2257J5067J6760r225j9726L283K1039L444j9434r504
$$ -11537 8968 14797 -4370 -16627 -1560 15200 5975 -13751 -10468 10571 14015 -5419 -14923
436a4923J5726J3658j1571j6791O159J8969j64j8499n062J6336J0436j3201j4567
$$ -14923 803 14461 2890 -13901 -7742 11227 11063 -7436 -12498 3838 14274 1073 -13494
449a3494P733J6738k082j7171k982J6115Q026j3020j2219Q611J4505m394j5583
$$ -13494 -5761 10977 8895 -8276 -11258 4857 12883 -137 -12356 -3745 10760 6366 -9217
462i217m70J5606N799j3794r776J0762J2941p112j4805J834J4452L229j3122o500
$$ -9217 -9687 5919 11718 -2076 -11852 -1090 11851 4739 -10066 -8232 6220 9449 -3673 -10173
476a0173J1054R790p861j1813L344J2712L38j2386m648J1307Q318q154j0832M685
$$ -10173 881 10671 2810 -9003 -5659 7053 7391 -4995 -9643 1664 9982 1828 -9004 -4319
490d319J1799o79j2856l305J1511O530q858q900O803J0507l338j1227m74J1011
$$ -4319 7480 6801 -6055 -9360 2151 8681 -177 -9077 -2274 8233 4895 -6332 -6806 4205
504D205L313r983o814Q112R271m120j0024J100R574K035r127n123O993P869n220
$$ 4205 7518 -2465 -9279 -1167 8104 3984 -6040 -4940 4634 6669 -2458 -7581 -588 7281 2061
519B061q571K407R185J247r402l862P817N899o288p683L649R469q21q780j848
$$ 2061 -6510 -4103 5082 6329 -3073 -6935 882 6781 493 -7190 -3541 5928 5107 -3673 -5521
534e521P778L740o838n469M310P102k072p198k44P758K375o786m726M577N808
$$ -5521 2257 5997 -841 -6310 -2000 5102 3030 -4168 -4412 3346 5721 -1065 -5791 -1214 4594
549D594k459o602J02P277J777n759l917N122M875m004o046J679O431K95n971j632
$$ 4594 2135 -4467 -4365 2912 4689 -1070 -4987 135 5010 1006 -5040 -3361 3070 3365 -2606 -4238
565d238N712L795m340n328K454N493j144n064j079N133K679l959l465K854M384
$$ -4238 1474 5269 929 -4399 -1945 3548 2404 -2660 -3739 1394 4073 114 -3351 -497 3887
580C887k021n263r1N399J844m265l187L462M118j800n096L77M744O57m654j588
$$ 3887 1866 -3397 -3488 1911 3755 -510 -3697 -235 3883 2083 -3013 -2636 2108 2765 -1889 -3477
596c477M201L280l164l612J798M077q52m408j038L658K850k788l112J928L333
$$ -3477 724 4004 840 -2772 -974 3103 2251 -2157 -3195 463 3313 525 -2587 -659 2674
611B674o71l368q47K979J787l001k539K845L405j431l789K65L776P77l576k390
$$ 2674 2003 -1365 -2212 767 2554 -447 -2986 -141 3264 1833 -1956 -1691 2085 2862 -714 -3104
627c104K716L149j368k918O21L101L6k962j335K771J525k301k037J531K784k92
$$ -3104 -388 2761 1393 -1525 -904 2197 2233 -729 -2064 707 2232 -69 -2106 -575 2209 1917
643A917k829q29K353J808k269k519R79K683l92j997L09K480N34k769j554J872
$$ 1917 -912 -1741 612 2420 151 -2368 -1389 1294 902 -1095 -786 1694 2228 -541 -2095 -223
659b23K088j262k394M52K748N11k100j070J495J370j423k313R48J917J84j609
$$ -223 1865 603 -1791 -1339 1409 1920 -180 -1250 245 1615 192 -2121 -1173 744 928 -681
675f81o24J825J384j839j895N33K342q2j982o57J933J519j163j852J036J367p01
$$ -681 -1305 520 1904 65 -1830 -1297 1045 963 -1019 -1676 257 1776 613 -1239 -203 1164 463
692D63j872P8J939N89j676j135J779J615j126j679j60J432M68j068r68J275J211
$$ 463 -1409 -1331 608 1197 -479 -1614 165 1780 654 -1025 -1185 247 715 -353 -1321 -46 1165
709A165m01j429L4J259J69j560p95J404J233j085j470R18J827o9j886o61J184
$$ 1165 764 -665 -631 628 797 -763 -1558 -154 1079 -6 -1476 -558 1269 1200 -686 -1347 -163
726a63P93q76p65L58J506m56o61r23J334O56r23j755J014J739J67j493n76J459
$$ -163 630 -246 -1011 -653 853 397 -264 -1187 147 803 -120 -1875 -861 878 1045 -448 -1024 435
744D35P82j018j592N75R92R9j175j87J954N05j639p81R64J114o74j705L5J488
$$ 435 1217 199 -1393 -818 174 273 -902 -1089 865 1370 -269 -1050 -86 1028 354 -1351 -1316 172
762A72P18q73m69K52Q56k79j315J02P35M59n80j105J459R93k32j687j30J493j03
$$ 172 890 17 -452 -200 656 377 -938 -836 -101 358 -222 -1327 132 1125 893 -794 -924 569 466
781D66j384n07J338R95Kj475Q4J100K23j208m30L99Q67m72q08K84J650J85j465
$$ 466 -918 -1425 -87 908 910 -565 -481 619 842 -366 -796 -397 470 -2 -810 -526 1124 1309 -156
800a56r58J048R90o29j611L70J546O80j314m16J064Q50j220j209L93J474J67j793
$$ -156 -1114 -66 924 295 -1316 -946 600 1280 -34 -450 614 1464 244 -965 -572 902 1069 -724
818g24j36J731R84j346j292M96J299J95j826k36J190R76q78j239P68J420n90j719
$$ -724 -860 871 1855 509 -783 -287 1012 1207 -619 -855 335 1311 433 -806 -38 1382 792 -927
836i27n69J997J297j435j703J045K243l80j915n27J576K34j344r24J612J200n35
$$ -927 -1496 501 1798 363 -1340 -295 1948 1568 -347 -874 702 936 -408 -1332 280 1480 945
853I45j569K40J390K98j546j554J361J786o08j621R1J672J220k365j096J104J563
$$ 945 -624 -384 1006 1304 -242 -1796 -435 1351 743 -878 -787 885 2105 -260 -1356 -252 1311
870A311j141j851Q55K136L62k480o46J916J221j572j974Q74J955J3j576l88J774
$$ 1311 170 -1681 -826 1310 1672 -808 -1454 462 1683 111 -1863 -989 966 979 -597 -985 789
887G89R14j379j691N56J919j74j784o21K045J324j594j987J187K420j021k513
$$ 789 1703 324 -1367 -811 1108 934 -850 -1471 574 1898 304 -1683 -496 1924 903 -1610
903a610l48K682P60j689j181J239J970j149j963l7K188M25j945j157J830J706
$$ -1610 -1958 724 1484 -205 -1386 -147 1823 674 -1289 -1326 862 1287 -658 -1815 15 1721
919A721r27k078K42K019N15k254j180J654J539p91k078R05K751m77k938o25K207
$$ 1721 794 -1284 -1042 977 1492 -762 -1942 -288 1251 460 -1618 -713 2038 1561 -1377 -2002 205
936B05J537k028k011J628K483l44k464p17K067J075j554j552J031K177p62j973
$$ 205 1742 -286 -2297 -669 1814 1470 -994 -1711 356 1431 -123 -1675 -644 1533 771 -1202
952a202j34K159J259k385k079J820J927o35k573L51K545M67k122j263K051J397
$$ -1202 -1336 823 2082 -303 -2382 -562 1365 730 -1843 -1492 1053 1520 -602 -1865 186 1583
968A583j580j931P25K427O9k579m83K456J097j336k526J049K159J53k159p36J991
$$ 1583 3 -1928 -1203 1224 1293 -1286 -1769 687 1784 448 -2078 -1029 1130 1283 -876 -1612 379
985C79J400j708j694J081K037o01k504m23K977J081k264j801J929K120j016k631
$$ 379 1779 71 -1623 -542 1495 894 -1610 -2033 944 2025 -239 -2040 -111 2009 993 -1638
1001a638Q3K717N44k521q64J775J884j129k007N60J658L29k382j233K417K037
$$ -1638 -1555 1162 1706 -815 -1679 96 1980 851 -1156 -596 1062 1391 -991 -2224 193 2230
1017B230j492k209O61K311Lk133j110K405R73j842j913J904K142p30k186k03K051
$$ 2230 738 -1471 -810 1501 1504 -629 -1739 666 1639 -203 -2116 -212 1930 1200 -986 -1189 862
1034H62R98k131j845J817J786l54k187j81K375K83j835j537J901J802j233k052
$$ 862 1860 -271 -2116 -299 1487 1133 -1054 -1235 1140 1423 -412 -1949 -48 1754 521 -1531
1050a531N64K652L27k661j193K229J713j569k356P36K278l3j846n49J903J171
$$ -1531 -967 1685 2012 -649 -1842 387 2100 531 -1825 -1089 1189 1156 -690 -1239 664 1835
1066A835j681j901R43K104k15k306JK114Q78j494j807J312J704n06k352J08K074
$$ 1835 154 -1747 -804 1300 1085 -1221 -1220 894 1772 278 -1529 -217 1487 981 -1371 -1263 811
1083H11P45j649j064J657J264j379k333Q82K262p3j865p93J732J566j140j913
$$ 811 1556 -93 -1157 500 1764 385 -1948 -1066 1196 1123 -742 -1535 197 1763 623 -1290
1099a290Q66J424k08j974j58J858J050j520j358Q60K216q87k153l37K175O47j465
$$ -1290 -424 1000 792 -1182 -1340 518 1568 48 -1310 -450 1766 879 -1274 -1611 564 1211 -254
1116b54j403J047K247r37j640kJ744J61j767q95J728J283r67j805P48J832k30
$$ -254 -1657 -610 1637 700 -940 -942 802 963 -804 -1699 29 1312 345 -1460 -712 1120 890
1133H90j705q35J611J209j100j203J015J177q4j598o34J605O56j538r90Q81J751
$$ 890 -815 -1650 -39 1170 70 -1133 -118 1059 975 -623 -1257 348 1004 -534 -1524 -643 1108
1150A108k01k162K30J864O72k034j007J068J132p30j127O56J816l32j455o88J396
$$ 1108 907 -1255 -1025 839 1511 -523 -1530 -462 670 -60 -1187 -531 1285 953 -502 -1190 206
1167B06J004j322j338N48J894p4j605m21J393P78j171j211Q47J159m59j209J90
$$ 206 1210 -112 -1450 -902 992 918 -687 -1108 285 1063 -108 -1319 -472 687 228 -981 -791
1184g91J824K95j706q33J115J391j100j144J38J552O96j490p55J291O36j200r79
$$ -791 1033 1328 -378 -1211 -96 1295 195 -949 -811 741 1437 -53 -808 483 1119 -81 -1060
1201a060N17J510l78j312m77J740R27j172j433N32J543l04j762K30J465N10j133
$$ -1060 -543 967 589 -723 -1200 540 1467 295 -1138 -606 937 633 -1129 -899 566 1076 -57
1218e7j093J272J233j385j267N99J482K26j588m33J491J003r97j285o5J561j6
$$ -57 -1150 122 1355 -30 -1297 -698 784 1010 -578 -1011 480 1483 486 -799 -864 697 681
1235F81j091n68J212O77q07r45P72J539m82j745m66J568N79p31j475J322R87m43
$$ 681 -410 -978 234 911 104 -841 -69 1470 988 -757 -1223 345 924 193 -1282 40 1027 584
1253E84j184j03J496j61q94p96J016J097l92r90kJ116K29j566m97J424O81p60
$$ 584 -600 -703 793 632 -262 -1058 -42 1055 663 -327 -329 787 1016 -550 -1047 377 1058 298
1271B98j076O53J267k16j558p5O67O98r88p63J011J268n56j240k37J430O23j540
$$ 298 -778 -125 1142 926 -632 -707 -40 658 -330 -1093 -82 1186 630 -610 -847 583 1206 -334
1289c34o86P63J270p89r57L52J219K08j493m21Q88R76j037j173N77J318L15j322
$$ -334 -1020 -257 1013 224 -733 -381 838 1046 -447 -868 20 996 -41 -1214 -637 681 996 -326
1307c26n59R56Q10p88j184O02P98K42j542j71J820K85r25r57O16J415q44j049
$$ -326 -885 71 881 93 -1091 -489 309 551 -991 -1162 658 943 18 -939 -323 1092 248 -801
1325h01p3J332L65p77q19P39P56o46q97o7J362J4p86m31J023O50p98j244L01J213
$$ -801 -874 458 823 46 -773 -34 722 76 -821 -888 474 488 -298 -729 294 944 146 -1098 -797 416
1345D16J78j224j36O87R72q65r19Q10N82k46j474K16J220K38p67m79N08J282m46
$$ 416 594 -630 -766 -79 893 28 -891 -81 501 255 -1219 -1003 217 455 -312 -791 -283 999 553
1364E53j216j57J106M52j072n24Q79O46n47q23R7J176R1j148o03J190N23m39j163
$$ 553 -663 -820 286 738 -334 -858 21 667 120 -703 -606 570 661 -487 -1090 100 623 184 -979
1383i79O68J029l8r78k24N58N63m90j114R74O32j25q86l42J020O71o10j251N78
$$ -979 -311 718 680 -298 -522 36 599 109 -1005 -31 601 476 -410 -752 268 939 329 -922 -344
1402c44P75O7q16k8Q40L18p65q79P59N82k15j114O95P78j2q98n23P68P09n22q49
$$ -344 431 498 -318 -346 494 812 47 -832 -73 509 294 -820 -125 653 641 -257 -780 -12 697 175 -674
1423f74R8P12M95o54l93M53Q34p06o38K36P67j58r62j07R79P80o21r45K65R14
$$ -674 -576 136 631 -23 -416 37 871 165 -473 -237 530 372 -590 -697 282 1062 441 -504 -239 675
1443F75l00p97K5N05P10n75k89j5Q16l30o58j61N41L94k33p73K08J126l70m43
$$ 675 375 -422 -397 108 818 243 -46 -61 755 425 -233 -394 147 541 308 -465 -257 869 499 56
1463E6l75N21N34p51l24M02K05L0l55K2N88J32p85o76O73L52p1m34l11J217R5
$$ 56 -319 202 736 -15 -339 63 268 298 -57 -35 553 685 -100 -776 -103 249 178 -256 -567 650 745
1484G45o80m27N20K14j88n66j69Q25K82o24l55Q96L91p01n87r1M92N34q04o1N26
$$ 745 65 -362 158 372 184 -382 -551 274 556 -68 -423 473 864 163 -424 -515 -23 511 -293 -354 172
1505A72K38J04p40q9R48m48k54n00N52O35j03o58j26P33J0n65n50K69Q23j45q64
$$ 172 410 514 -226 -315 633 185 -69 -569 -17 618 515 -143 -269 464 474 -91 -641 -372 451 306 -558
1526e58K68O67M4p77j80O95K90o28n81N29N13J06p36m96P35P14o71m72R4O44J02
$$ -558 -290 377 421 -356 -536 159 449 -179 -760 -231 282 388 -348 -844 -109 605 -66 -538 -444 200 302
1547C02o62j33P72Q7l80m56J08Q86m76o28l94J255M79r36o52N17O46qp49l65N98
$$ 302 -360 -493 279 366 -14 -470 -362 524 48 -580 -974 281 760 -176 -828 -311 335 327 -422 -787 -189
1568a89L11m73k93P26O40l99r33RJ079J88r51n67O91Q46k23j011J16J217j89r70
$$ -189 122 -351 -644 82 722 323 -610 -601 478 666 -285 -852 -161 685 462 -549 -433 784 595 -375
1588c75m26Q37N77m12j392R98J215n82r55m78J197N46q55q39P19J002j28j189
$$ -375 -801 36 613 201 -1191 -193 1022 440 -515 -993 204 750 -105 -944 -225 777 649 -540
1606e40K34M79O26j176o33P89R49l78r76l83J794K44j127j209J074J233r37p82
$$ -540 -306 173 799 -377 -1010 -221 728 350 -626 -1009 785 1029 -98 -1307 -233 1000 63 -719
1624g19J74J394J73j101q03P58J244o58j202J75J301J24j531j41J275M93p35r99
$$ -719 -545 849 1022 -79 -882 -124 1120 462 -740 -565 736 860 -671 -812 463 956 221 -778
1642g78J38J582m94j340j56J712N71j367r16R21J453q80j602k73K137M26j149
$$ -778 -640 942 448 -892 -1048 664 1235 -132 -1048 -127 1326 446 -1156 -1429 708 1134 -15
1659a5j147J316J168q93j247P1J647J8j580k40J135J526j358j682Q56J815j76
$$ -15 -1162 154 1322 429 -818 -747 900 918 -662 -902 233 1759 401 -1281 -425 1390 1214
1676A214k291k86J660J244j232j701J084J463k26k103l8J916P41j664j152J247
$$ 1214 -1077 -1363 297 1541 309 -1392 -308 1155 929 -1174 -1212 704 1445 -219 -1371 -124
1692a24J842n85k323q8K186M02j573j399J874J173q50j542R9K087M07k228p55
$$ -124 1718 1133 -1190 -1278 908 1310 -263 -1662 212 1385 535 -1007 -908 1179 1586 -642 -1397
1709a397J839J069j201j931M97K552q8k311q44K443J106j892j581J048K322r03
$$ -1397 442 1511 310 -1621 -1124 1428 1340 -971 -1815 628 1734 -158 -1739 -691 1631 728
1725G28k027O6K571O51k264j895J829K236j240k421K99K763N77k629j215K266
$$ 728 -1299 -1233 1338 1989 -275 -2170 -341 1895 655 -1766 -1467 1296 1873 -756 -1971 295
1741B95J906j711k561R48K682J5k563r20K573J705k364k377J461K904k20l233
$$ 295 2201 490 -2071 -1123 1559 1574 -989 -1909 664 2369 5 -2372 -911 1993 1773 -1460
1757a460q54L138J207k195k224J999K466q98l065q2L295Q02k759j813K241K647
$$ -1460 -2314 824 2031 -164 -2388 -389 2077 1179 -1886 -1968 1327 2129 -630 -2443 -202 2445
1773B445j379l464N85L268Q35l284j902L338K017j733l237J159L696j53l755j181
$$ 2445 1066 -2398 -1813 1455 2290 -994 -2896 442 2459 726 -2511 -1352 2344 2191 -1564 -2745
1789b745L357K112k555l026J492L704j94m010o58L446J709k969k805K470L470
$$ -2745 612 2724 169 -2857 -1365 2339 2145 -1865 -2523 923 2632 -337 -3142 -672 2798
1804B798j252l898l07M401J017l785k390K778L884j899m242J019M252O90m416
$$ 2798 1546 -2352 -2659 1742 2759 -1026 -3416 -638 3246 1347 -2895 -1876 2376 3066 -1350
1819a350k069L747L097k632m159J514M402L78m829j444L890L059l362m074K408
$$ -1350 -3419 328 3425 793 -3366 -1852 2550 2928 -1901 -3345 545 3604 242 -3832 -1424
1834a424M628o68n017n72M459K261l858l519K925M177j233n302L70N174J387m397
$$ -1424 3204 2536 -2481 -3053 1406 3667 -191 -3710 -785 3392 2159 -3143 -2773 2401 3788 -609
1850f09k900L230M212k498m987Q96N000J230n009k311M140L722k941n236J857
$$ -609 -3509 -279 3933 1435 -3552 -2656 2344 3574 -1435 -3746 394 4116 1175 -4061 -2204
1865b204N434k7n538j506M994L378l920m625K544N192p21n875j003N535K906m761
$$ -2204 3230 3203 -2335 -3841 1153 4531 611 -4014 -1470 3722 3001 -2874 -3877 1658 4564 -197
1881a97m166L441N691k137o231l16O272K135n401l967M631N102k911n960R01O039
$$ -197 -4363 -922 4769 2632 -3599 -3915 2357 4492 -909 -4876 -245 4857 1946 -4014 -3113 2926
1897B926J498o037l140N163M726l553o233J985O512L73o828k379O073M093m723
$$ 2926 4424 -1613 -4753 410 5136 1583 -4650 -2665 3847 4220 -2608 -4987 1086 5179 456
1912D56n426K724O463o45o698j399O349L469n776n213M202O407j837p105j49O938
$$ 456 -4970 -2246 4217 3572 -3126 -4525 1824 5293 -483 -5696 -1494 4913 3076 -4029 -4178 2760
1928B760K509o079m857M637O207k513p354Q01P053K014p021l700N433N761l863
$$ 2760 5269 -810 -5667 -1030 5177 2664 -4690 -3889 3164 5178 -1843 -5543 -110 5651 1788
1943A788p162J914P498M09o707l345O249N459n220o684K922P580n45p792j933
$$ 1788 -5374 -3460 4038 4447 -2260 -5605 644 6103 883 -5801 -2879 4701 4156 -3636 -5569
1958e569P448M141o086o130M405P280k127p920q06Q449L260o951n815N178P007
$$ -5569 1879 6020 -66 -6196 -1791 5489 3362 -4558 -5364 3085 6345 -606 -6421 -1243 5764
1973E764k628q268M81Q300K064p639m580O385O801m242q397J887Q546J020q342
$$ 5764 3136 -5132 -4651 3649 5713 -1926 -6506 -121 6680 2438 -5959 -4072 4474 5494 -2848
1988b848l493P220N837n484p383K865Q665k58r214k380Q303M921o124p785M497
$$ -2848 -6341 879 6716 1232 -6151 -3286 5379 5121 -4093 -6473 1830 6751 627 -7158 -2661
2003b661Q745j397r253j621Q791M171p280o576N287Q215k592r119j13Q787L293
$$ -2661 6084 4687 -4566 -6187 2604 6775 -505 -7081 -1794 6421 3829 -5290 -5403 3384 6677
2018F677q127o054O983P687m130r264J046R784J732q961m750P771P065n424q901
$$ 6677 -1450 -7504 -521 7166 3036 -6228 -5182 4602 6334 -2627 -7377 394 7459 2035 -6866
2033f866K774R584L19r803k985Q363O385o727q617M047R788j240r672k185R131
$$ -6866 -4092 5492 5811 -3992 -6977 1386 7771 1044 -7573 -3526 6262 5022 -4650 -6835 2296
2048B296N494q181p351N504R197k683r786p16J0236L566q819o418O548Q927m007
$$ 2296 7790 -391 -7742 -2238 6959 4276 -5510 -6226 4010 7576 -1243 -7661 -1113 7814 3807
2063C807j0371J106J0469K198r358n347P576P736n202r540K030J0541Q75j0005
$$ 3807 -6564 -5458 5011 7209 -2149 -7496 80 7816 2614 -6926 -4896 5645 6520 -3485
2077c485m164Q767P361p174q798L494J0442l78j0520l161R800N743p560q493N519
$$ -3485 -7649 1118 8479 1305 -7493 -3999 6443 6065 -4455 -7616 2184 7927 367 -8126 -2607
2092b607R835j974j0800j273J0158M680q745p827O992R375l521j0751L21J0909
$$ -2607 7228 5254 -5546 -6819 3339 8019 -726 -8553 -1561 7814 4293 -6458 -6137 4772
2106D772K824r850o136P681Q977n100j0441J864J0960J678j0660n064R255P726
$$ 4772 7596 -2254 -8390 -709 8268 3168 -7273 -5409 5551 7229 -3431 -8495 760 8486
2120H486o306j0222L528J1105L73j1325l853R982O893q012r104M994J0776j483
$$ 8486 2180 -8042 -4514 6591 6964 -4361 -8214 1768 8661 649 -8455 -3461 7315 5832
2134E832j1042k252J0731N326r065q275O518J0152k879j1189q74J1057M183r858
$$ 5832 -5210 -7462 3269 8595 -470 -8745 -2227 7925 5046 -6143 -7017 4040 8223 -1635
2148a635p069P898Q948m385j0940Q45J1570K801j0760n859Q682Q416n943j0521
$$ -1635 -8704 -806 8142 3757 -7183 -6338 5232 8033 -2727 -8586 96 8512 2569 -7952
$$ [...]
8191H7
##END NTUPLES=NMR FID
##END=
