##TITLE=1H_Costus-Summ1-f24-f14
 CDCl3, 8 sc, 
 7.8.2020
##JCAMPDX= 6.0         $$ Bruker NMR JCAMP-DX V2.0
##DATA TYPE= NMR FID
##DATA CLASS= NTUPLES
##ORIGIN= UXNMR, Bruker Analytische Messtechnik GmbH
##OWNER= root
$$ XWIN-NMR		Version 3.5
$$ Fri Aug  7 10:51:23 2020 Russian Standard Time (UT+4h)  she@DPX200
##.OBSERVE FREQUENCY= 200.1314999998
##.OBSERVE NUCLEUS= ^1H
##.DELAY= (6, 6)
##.ACQUISITION MODE= SIMULTANEOUS
##.ACQUISITION SCHEME= undefined
##.AVERAGES= 8
##.DIGITISER RES= 18
##SPECTROMETER/DATA SYSTEM= spect
##.PULSE SEQUENCE= zg30
##.SOLVENT NAME= D2O
##.SHIFT REFERENCE= (INTERNAL, D2O, 0, 15.7039)
##AUDIT TRAIL= $$ (NUMBER, WHEN, WHO, WHERE, WHAT)
$$ ##TITLE= Audit trail, XWIN-NMR		Version 3.5
$$ ##JCAMPDX= 5.01
$$ ##ORIGIN= Bruker BioSpin GmbH
$$ ##OWNER= she
$$ F:/spectra/data/she/nmr/H-F/1/audita.txt
$$ ##AUDIT TRAIL=  $$ (NUMBER, WHEN, WHO, WHERE, WHAT)
(   1,<2020-08-07 10:50:10.98 +0400>,<she>,<DPX200>,
      <created by zg, POWCHK disabled, PULCHK disabled
       configuration hash MD5:
       00 E9 B6 7A A2 85 ED C7 34 08 36 98 17 FE 4E 26
       data hash MD5: 16K
       70 03 0C 2D 4F C6 F0 96 9A 7C 93 F8 F1 D8 71 9E>)
$$ ##END=
$$ 
$$ hash MD5
$$ 80 8E 29 2B 39 1C 82 25 6B 40 BD 3C AD 4A 85 AF
##$RELAX= 
##$RELAX= 
##$RELAX= 
##$RELAX= 
##$RELAX= 
##$RELAX= 
$$ Bruker specific parameters
$$ --------------------------
##$DU= <F:/spectra>
##$EXPNO= 1
##$NAME= <H-F>
##$PROCNO= 1
##$TYPE= <nmr>
##$USER= <she>
##$AMP= (0..31)
100 100 100 100 100 100 100 100 100 100 100 100 100 100 100 100 100 100 
100 100 100 100 100 100 100 100 100 100 100 100 100 100 
##$AQSEQ= 0
##$AQ_mod= 1
##$AUNM= <au_zg>
##$AUTOPOS= <>
##$BF1= 200.13
##$BF2= 200.13
##$BF3= 200.13
##$BF4= 200.13
##$BF5= 200.13
##$BF6= 200.13
##$BF7= 200.13
##$BF8= 200.13
##$BYTORDA= 1
##$CFDGTYP= 0
##$CFRGTYP= 5
##$CHEMSTR= <none>
##$CNST= (0..31)
1 1 145 1 1 1 1 1 1 1 1 1 1 1 1 1 1 1 1 1 1 1 1 1 1 1 1 1 1 1 1 1 
##$CPDPRG= <>
##$CPDPRG1= <>
##$CPDPRG2= <>
##$CPDPRG3= <>
##$CPDPRG4= <mlev>
##$CPDPRG5= <mlev>
##$CPDPRG6= <mlev>
##$CPDPRG7= <mlev>
##$CPDPRG8= <mlev>
##$CPDPRGB= <>
##$CPDPRGT= <>
##$D= (0..31)
0 1.2 0 0 0 0 0 0 0 0.06 0 0.03 0 0 0 0 0.0002 0 0 0 0 0 0 0 0 0 0 0 0 
0 0 0 
##$DATE= 1596783010
##$DBL= (0..7)
120 120 120 120 120 120 120 120 
##$DBP= (0..7)
150 150 150 150 150 150 150 150 
##$DBP07= 0
##$DBPNAM0= <>
##$DBPNAM1= <>
##$DBPNAM2= <>
##$DBPNAM3= <>
##$DBPNAM4= <>
##$DBPNAM5= <>
##$DBPNAM6= <>
##$DBPNAM7= <>
##$DBPOAL= (0..7)
0.5 0.5 0.5 0.5 0.5 0.5 0.5 0.5 
##$DBPOFFS= (0..7)
0 0 0 0 0 0 0 0 
##$DE= 6
##$DECBNUC= <off>
##$DECIM= 24
##$DECNUC= <off>
##$DECSTAT= 4
##$DIGMOD= 1
##$DIGTYP= 9
##$DL= (0..7)
0 120 120 120 120 120 120 120 
##$DP= (0..7)
150 150 150 150 150 150 150 150 
##$DP07= 0
##$DPNAME0= <>
##$DPNAME1= <>
##$DPNAME2= <>
##$DPNAME3= <>
##$DPNAME4= <>
##$DPNAME5= <>
##$DPNAME6= <>
##$DPNAME7= <>
##$DPOAL= (0..7)
0.5 0.5 0.5 0.5 0.5 0.5 0.5 0.5 
##$DPOFFS= (0..7)
0 0 0 0 0 0 0 0 
##$DQDMODE= 0
##$DR= 18
##$DS= 0
$$ [...]
##$SUBNAM2= <"">
##$SUBNAM3= <"">
##$SUBNAM4= <"">
##$SUBNAM5= <"">
##$SUBNAM6= <"">
##$SUBNAM7= <"">
##$SUBNAM8= <"">
##$SUBNAM9= <"">
##$SW= 24.9337058888022
##$SWIBOX= (0..15)
0 0 2 0 0 0 0 0 0 0 0 0 0 0 0 0 
##$SW_h= 4990.01996007984
##$TD= 16384
##$TD0= 1
##$TE= 0
##$TE2= 300
##$TE3= 300
##$TEG= 300
##$TL= (0..7)
0 120 120 120 120 120 120 120 
##$TP= (0..7)
150 150 150 150 150 150 150 150 
##$TP07= 0
##$TPNAME0= <>
##$TPNAME1= <>
##$TPNAME2= <>
##$TPNAME3= <>
##$TPNAME4= <>
##$TPNAME5= <>
##$TPNAME6= <>
##$TPNAME7= <>
##$TPOAL= (0..7)
0.5 0.5 0.5 0.5 0.5 0.5 0.5 0.5 
##$TPOFFS= (0..7)
0 0 0 0 0 0 0 0 
##$TUNHIN= 0
##$TUNHOUT= 0
##$TUNXOUT= 0
##$USERA1= <user>
##$USERA2= <user>
##$USERA3= <user>
##$USERA4= <user>
##$USERA5= <user>
##$V9= 5
##$VALIST= <valist>
##$VCLIST= <CCCCCCCCCCCCCCC>
##$VD= 0
##$VDLIST= <DDDDDDDDDDDDDDD>
##$VPLIST= <PPPPPPPPPPPPPPP>
##$VTLIST= <TTTTTTTTTTTTTTT>
##$WBST= 1024
##$WBSW= 4
##$XGAIN= (0..3)
0 0 0 0 
##$XL= 0
##$YL= 0
##$YMAX_a= 260029
##$YMIN_a= -178985
##$ZGOPTNS= <>
##$ZL1= 120
##$ZL2= 120
##$ZL3= 120
##$ZL4= 120
##$ABSF1= 10
##$ABSF2= 0
##$ABSG= 5
##$ABSL= 3
##$ALPHA= 0
##$AQORDER= 0
##$ASSFAC= 0
##$ASSFACI= 0
##$ASSFACX= 0
##$ASSWID= 0
##$AUNMP= <proc_1d>
##$AZFE= 0.1
##$AZFW= 0.1
##$BCFW= 1
##$BC_mod= 2
##$BYTORDP= 1
##$COROFFS= 0
##$CY= 11.3945322036743
##$DATMOD= 1
##$DC= 2
##$DFILT= <>
##$DTYPP= 0
##$F1P= 16.9975609425685
##$F2P= -3.02152046262296
##$FCOR= 0.5
##$FTSIZE= 0
##$FT_mod= 4
##$GAMMA= 1
##$GB= 0.15
##$INTBC= 1
##$INTSCL= 1
##$ISEN= 128
##$LB= 0.24
##$LEV0= 0
##$LPBIN= 0
##$MAXI= 10000
##$MC2= 0
##$MEAN= 0
##$ME_mod= 0
##$MI= 1.114404
##$NCOEF= 0
##$NC_proc= 0
##$NLEV= 6
##$NOISF1= 3.799351
##$NOISF2= 2.8
##$NSP= 1
##$NTH_PI= 0
##$NZP= 0
##$OFFSET= 15.70392
##$PC= 1
##$PHC0= -9803.059
##$PHC1= 24.60092
##$PH_mod= 1
##$PKNL= yes
##$PPARMOD= 0
##$PSCAL= 0
##$PSIGN= 0
##$REVERSE= no
##$SF= 200.130013532006
##$SI= 16384
##$SIGF1= 3
##$SIGF2= 2
##$SINO= 400
##$SIOLD= 16384
##$SREGLST= <1H.CDCl3>
##$SSB= 0
##$STSI= 0
##$STSR= 0
##$SW_p= 3612.71676300578
##$SYMM= 0
##$S_DEV= 0
##$TDeff= 0
##$TDoff= 0
##$TI= <>
##$TILT= no
##$TM1= 0
##$TM2= 0
##$TOPLEV= 0
##$USERP1= <user>
##$USERP2= <user>
##$USERP3= <user>
##$USERP4= <user>
##$USERP5= <user>
##$WDW= 1
##$XDIM= 8192
##$YMAX_p= 0
##$YMIN_p= 0
$$ End of Bruker specific parameters
$$ ---------------------------------
##NTUPLES= NMR FID
##VAR_NAME=  TIME,          FID/REAL,        FID/IMAG
##SYMBOL=    X,             R,               I
##VAR_TYPE=  INDEPENDENT,   DEPENDENT,       DEPENDENT
##VAR_FORM=  AFFN,          ASDF,            ASDF
##VAR_DIM=   8192,          8192,            8192
##UNITS=     SECONDS,       ARBITRARY UNITS, ARBITRARY UNITS
##FACTOR=    0.0002004,     1,               1
##FIRST=     0,             0,               0
##LAST=      1.6414764,     0,               0
##MIN=       0,             -178985,         0
##MAX=       1.6414764,     260029,          0
$$ Real data points
##PAGE= N=1
##DATA TABLE= (X++(R..R)), XYDATA
0@%%%%%%%%qJ6j6J6k0K8l2L9m7N6o8P8r0J08j28J46j70J96k21K52k90L29l69M16
32B21m69N27n90O56p30Q13r04J004j113J232j365J511j670J852k055K281k541
49a340K838l183L592m079M674n425O401p728R654j2722J8499m6788K27893M7789
63B40075l30240o2373K12948P5061j88277n8912J39796O0785j16925m6944P7615
74B609M1453m4041K925L6725l2328p0987K1002P8366J4811n2694j8684K5254J0193
87A4604j4714O973K1025r954l9419p740L6621K2140k8806k4485K3580K2106k6540
100d609j5869M8294L3169n6445n7557M1370N6727l6084m8984M5043N2347n3659
112C743n9795N2440O5071m6417o2019L9407M6810m7768l7912O5632M9384o4925
$$ plain form
0 0 0 0 0 0 0 0 0 0 -8 8 -8 8 -12 16 -16 23 -24 32 -36 42 -48 60 -68 78 -92 104 -117 135 -155 174 -195 221
32 221 -248 279 -311 345 -385 428 -476 528 -585 647 -718 793 -877 975 -1080 1201 -1340
49 -1340 1498 -1685 1907 -2172 2502 -2923 3478 -4250 5404 -7318 11181 -35607 192286 240075
63 240075 -90165 -152538 60410 135471 -52806 -111718 28078 88863 -28062 -75006 2609
74 2609 44062 21 2946 39671 7343 -63644 -42642 35724 50535 -2159 -20843 4411 14604
87 14604 -110 6863 27888 17934 -21485 -29225 7396 29536 730 -23755 -175 21931 -4609
100 -4609 -20478 27816 60985 4540 -53017 -11647 45080 8996 -39988 5055 57402 3743
112 3743 -56052 -3612 61459 15042 -46977 -7570 39240 -8528 -46440 19192 68576 3651
124C651n6186N4662M8980n2088m4218N0121L6189n4579l7419N4230M3515m0957
136E901l7124L3967K8481l3779k7934L0492K8091k5812l0207J6359K7405o341
148I499j6483Q527J1559k0053k5687J7720L9987l282m4347p979M5118J8197m1798
161i022k3481L9499K5349m2943l6568L6147M3407k0551l4574J2227K0387j3962
173d085q257K2703M327k9863n563K9917J728k9892M343L5353n855l9630M895M1331
187B1452l232l9844m03L3784j97k7208Q807K8829j1267l2185Q422L3145l757l0441
201a4095l442K1830L530j4620J602J7743L338j6293j1597O991J2865K503q897
214A458o971K030N028J943K965M413m855j1252j084Q221o91n895Q525J3033r394
$$ plain form
124 3651 -52535 2127 51107 -981 -45199 4922 41111 -13468 -50887 3343 46858 5901
136 5901 -31223 2744 31225 -2554 -30488 4 28095 2283 -27924 -11565 15840 9499
148 9499 -6984 1543 13102 -6951 -32638 -14918 25069 21787 -22560 -30539 14579 32776 -9022
161 -9022 -32503 6996 32345 -10598 -47166 -11019 32388 11837 -22737 -10510 9877 -4085
173 -4085 -12342 10361 14688 -15175 -20738 9179 10907 -18985 -14642 20711 14856 -24774 -19879 21452
187 21452 18220 -21624 -22027 11757 11560 -15648 -6841 21988 10721 -21464 -13042 20103 16346 -14095
201 -14095 -17537 4293 7823 -6797 -5195 12548 15886 -407 -12004 -5013 7852 10355 1458
214 1458 -5513 -3483 1545 3488 6453 10866 6011 -5241 -6325 1896 1205 -4690 3835 16868 7474
229G474j8105Q047K1442o168k5311o10K0564R29j4052N754J5975p560j8312N041
243d892J5469n673j2581P255J1256q750j1031J0774J2340r569j3641L659P895
256B511l321l282O654L966n701m770J276J816K164K824j042p461j254N655Q00
271H35n820P75O235r50o890N2O045Q41k616N16j500m622K183R143j46r926j319
288g164P477j839r035M229J2015l724j3016K117J2698j351r619K478P914n373
302b193q336O681J1557l931j0942j504M064j029R98O531K174n031l063K755%j826
318c095K240K426m360k763N306O204k161l722p79k812l605K585O241R51j638K441
334C459J664m724j905N890J142r315k922R693M952o686k167O473p1r813n75J0929
$$ plain form
229 7474 -10631 -2584 18858 12690 -12621 -13231 7333 8262 -5790 -36 15939 8379 -9933 -4892
243 -4892 10577 4904 -7677 -422 10834 2084 -8947 1827 14167 4598 -9043 -5384 2511
256 2511 -810 -4092 2562 6528 827 -3943 -2667 -851 1313 4137 3095 -4366 -5620 35 835
271 835 -4985 -4210 2025 1075 -5815 -5763 282 1123 -1493 -977 -2477 -7099 -4916 4227 4081 -5845 -7164
288 -7164 313 -1526 -10561 -6332 5683 1959 -11057 -8940 3758 2407 -7212 -4734 3180 -2193
302 -2193 -10529 -3848 7709 3778 -7164 -8668 -4604 -5633 -4635 1896 4070 -961 -4024 -1269 -1269 -3095
318 -3095 -855 1571 -2789 -5552 -246 5958 3797 75 -704 -3516 -7121 -4536 1705 2656 1018 3459
334 3459 5123 399 -1506 4384 5526 -3789 -6711 2982 7934 1248 -919 5554 5483 -4330 -4905 6024
350F024K801q379k631O848J243n751K07O016m95n122J9M030q14l317J55J018k263
367d11j84L156K861J29p01j135j876r67P75p01j190M53K794j13l48J816j523m575
385a740p0M169j345n768L558Q835k378r519K273J0135l197j1631J682J0220l168
400B056j1558L784J2202j904j0151K374Q872m022q402L450P382m737o979N237
414b396O014l968m734M930L629o074m439L896L214l184q28M300J196l494j193
429c131L529O41l876j487K117K034j509k124k9K955J336k159j839K872K587l324
445a407k457M293L154n090m117M658M104n307k635P138M443q219n425O705M778
460D616o154l405P393K650p573j557Q648K186p132k232N578o07p470P62Q383N00
$$ plain form
350 6024 8825 446 -2185 4663 5906 155 362 6378 5883 761 780 4810 3996 679 834 1852 -411
367 -411 -595 2561 5422 5551 4850 3715 1839 872 1647 946 -244 209 3003 2890 2542 4358 2835 -1740
385 -1740 -1810 2359 1014 -4754 -1196 7639 5261 -4258 -1985 8150 4953 -6678 -4996 5224 2056
400 2056 -9502 -5718 6484 4580 -5571 -3197 5675 1653 -6749 -3299 4083 -654 -7633 -2396
414 -2396 3618 -350 -5084 -154 3475 -2599 -7038 -3142 72 -3112 -3940 360 1556 -1938 -3131
429 -3131 398 1039 -2837 -4324 -2207 -173 -1682 -3806 -3835 -880 456 -1703 -3542 -670 1917 -1407
445 -1407 -3864 429 3583 -1507 -5624 -966 3138 -2169 -4804 2334 6777 -1442 -6867 -162 4616
460 4616 -1538 -4943 2450 5100 -2473 -4030 4618 6804 -328 -2560 3018 2411 -5059 -4297 4086 4586
476D586o551J051P242k47o651l80M940r39n570o12N227K370j812q06J110p7k465
493D16k121J329K175k38j757J083L766j37m620j061L941P7m534l1M721l92n675
510c058J145O202k247o936K788Q117k717p697K770P924m259r620L441Q859l405
525A307p638N861P944o943r494N689Q585n305q294M788Q069l542o244M527M393
540C703n295n850L866M095l274j756M234K246m570l398L435L212j821k000J635
555a538J347j021j517K54J070l45k154M59K504J963k092j083J743K60l446q28
571d424M683J889l702j064M851O09o438j851O266K281o186j355O716K535o676
586a866k324N696K499n028j173M802j02m268Q78M745j741n241K603M778k228m208
$$ plain form
476 4586 -1965 -914 6328 6081 -570 -950 3990 3051 -2519 -3131 2096 4466 2654 1848 2958 2881 416
493 416 -1705 -376 1799 1561 -196 887 4653 4516 -104 -1165 2776 2853 -1681 -1712 3009 2617 -3058
510 -3058 -1913 4289 2042 -4894 -2106 6011 3294 -4403 -1633 6291 2032 -7588 -4147 4712 1307
525 1307 -6331 -470 7474 531 -8963 -3274 5311 6 -8288 -3500 4569 1027 -5217 -690 3703
540 3703 -1592 -7442 -3576 519 -2755 -4511 -277 1969 -2601 -5999 -2564 648 -1173 -3173 -1538
555 -1538 -191 -1212 -2729 -2475 -1405 -1750 -3904 -3445 -941 1022 -1070 -2153 -410 -150 -3596 -4424
571 -4424 259 2148 -1554 -2618 2233 2842 -3596 -5447 819 3100 -3086 -4441 2275 4810 -1866
586 -1866 -4190 1506 4005 -1023 -2196 2606 2504 -1764 -886 3859 2118 -3123 -520 4258 2030 -2178
602b178M152M740l474o025J382M595q09k624K325L089k196k344M97N87r01K82
618A098J993jk312j93L091J055k340j698j71J457K25r50j103J400K866q60m184
635f27j272L922J663k763m63K206P98l022r2J543j374k245K571K619l160l633
651c329L976L031l655l790L595M269m162l988L540L830l403k342L037J342m595
666b644j343M935O83n245m38N599K76n460n51O094J089n185k422L162J260j676
682a866k20J133k16p43P76L56j597m92K013Q54k414j202L067J957j120k461N5
699b120J488P43j518j417K40K932p5k556o32L044J234k259q77J722Q23j635P4
716g89J542j311j711K304L114k278l746K506K743k059k865K815K324k256o66K951
$$ plain form
602 -2178 1974 6714 3240 -2785 -1403 3192 2383 -241 2084 5173 2977 633 1130 1717 816 1098
618 1098 3091 3090 778 585 3676 4731 2391 693 522 1979 2204 1254 151 1551 4417 3557 -627
635 -627 -1899 2023 3686 923 460 2666 3464 442 350 1893 519 -1726 845 3464 304 -3329
651 -3329 647 3678 23 -3767 -172 4097 -65 -4053 -513 3317 -86 -2428 609 1951 -2644
666 -2644 -3987 948 1631 -3614 -4052 1547 1823 -3637 -4188 1906 2995 -2190 -4612 -1450 -190 -1866
682 -1866 -2086 -953 -1169 -1912 -1136 -780 -2377 -2869 -856 -2 -2416 -3618 -551 1406 286 -2175 -2120
699 -2120 -632 111 -1407 -2824 -2584 348 273 -2283 -2915 129 1363 -896 -1773 -51 772 -863 -789
716 -789 753 -558 -2269 35 3149 871 -2875 -369 2374 315 -2550 265 2589 333 -333 2618
732B618L25l662j16M172o42n206O69N946L21n978j11N162J92m713l29M763L72
749C783l087j097K243l88o04P48k25j982N46K670N51l811l53K791k06k416nK331
767A489P56q72r3l37j637k71J521n42j215O35J301rr72N66k15k034N57K198p15
786A11k716J681L466j336m948J065L909r29m016J597L982j419l569J027J954j535
802a676j568K438R04j847j33L231p53m323l19L629M95l247L65L517K46k823k62
819b126J084p24j087J406J025j088j55K135L79k005j061R65L29j24P87j62o87
836a109N23J297l74k417Q60K539m51k616J379K370j169k031Q19J548j169l60K478
853B117K51k594o30L104o20k850J317L420j168l705J689M429k074l823Q73L120
$$ plain form
732 2618 2943 -719 -835 3337 2695 -2511 -1842 4104 4425 -1553 -1664 3498 3690 -1023 -1352 3411 3783
749 3783 696 -401 1842 1454 850 1598 1373 -609 -63 2607 3158 -653 -1006 1785 1579 -837 -842 1489
767 1489 2245 1373 1280 943 -694 -965 556 14 -1201 -566 735 726 -246 320 105 -1929 -1372 826 111
786 111 -2605 -924 2542 1206 -3742 -2677 1232 303 -3713 -2116 1866 447 -3122 -2095 -141 -1676
802 -1676 -3244 -806 98 -1749 -1882 1349 596 -3727 -4046 -417 78 -3169 -2804 713 959 -1864 -2126
819 -2126 -1042 -1766 -2853 -1447 -422 -1510 -1665 470 849 -1156 -2217 -1252 -923 -1047 -260 -422 -1109
836 -1109 -586 711 337 -2080 -1220 1319 868 -1748 -369 2001 832 -1199 -380 1168 -1 -361 2117
853 2117 2368 -226 -856 2248 1628 -1222 95 3515 2347 -1358 331 4760 2686 -1137 -264 2856
869B856j603j950L009K436k925k302K150J508k499p10K291M28k172j60K641l08
885B690j489L46J047j895j436K231J845j993j943J510J275r52q90O20Q96q92m07
902E63L24l01j54J52j93m90Q89R09j116j307L87N87r01o28J431O90j735m45J798
921D60O59j471m66R31n79k094R10K038n30k320N69K524j192j511J555J135k153
938a535j429J627J066j862p3K929J01l116m59J990P02k031l65J941l06r67L39
955a448J709o94p14P28L80j613q22J458P94j13n68M15n00n98J232R67q40j79L36
974g0l17p56N68J789q20j272J010J003o03j386J428N52k063j308K641J953j923
991D26m99K140r6k396m41K645O11k760q29K092J476j233m77R39o46j711J046J982
$$ plain form
869 2856 1253 -697 2312 4748 1823 -479 1671 3179 680 -30 2261 2689 517 357 2998 2690
885 2690 1201 1547 2594 699 -737 1494 3339 1346 -597 913 2188 1236 346 966 1862 970 563
902 563 887 586 432 584 391 -99 790 1699 583 -724 -337 250 -651 -1279 152 842 -893 -1338 460
921 460 1119 -352 -818 113 -466 -2560 -1650 388 -142 -2462 -1893 631 -561 -2072 -517 618 -1535
938 -1535 -2964 -1337 -271 -2133 -2206 723 824 -2292 -2751 -761 -59 -2090 -2455 -514 -820 -1787 -1448
955 -1448 261 -433 -1147 -419 -39 -1652 -2474 -1016 -222 -335 -903 -488 -988 -1586 -354 613 -227 -406 -70
974 -70 -387 -1143 -575 1214 394 -878 132 1135 532 -854 574 1126 -937 -2245 396 2349 426
991 426 -73 2067 1971 -425 -866 1779 2390 -370 -1199 893 2369 1136 659 1598 952 -759 287 2269
1009B269p50j672N83J152r38m97J140J154j331j558M60J288o6j073l54J17l7L89
1027B76Q95O30L0j524j330L1Q67P75o2l83pk09k27K83R02j049j595L1J706Lp73
1048g30P34J204j544j870P44J394l06j175N41P56j196l54J893M48k153o43J685
1065e72O18j510l88K229m01k593J48J728M40j143J79J256o21j631M10J267J36
1082d48j058Q18O84p19n13R32N39q94j032N21L54j51M53R43O68j103q93M13M99
1101A3L13p3k60j17K6O84R2j55M37k37j205J43J541O16j087q66O82L21n60N44
1121H52J636j00j939n09J334L20j150N40P04r03r86J227K137o83j867L1M49n27
1139E66k60J909Q83j948j303J053P43j62r63P45k73p91k88J253J127n25r17j11
$$ plain form
1009 2269 1519 -153 430 1582 644 147 1287 2441 1110 -448 12 1300 1234 161 -193 -76 -113 276
1027 276 1171 1801 1831 307 -1023 -992 -125 650 588 205 198 -11 -238 45 947 -102 -1697 -1666 40 43 -730
1048 -730 4 1208 -336 -2206 -1462 -68 -374 -1549 -1008 -252 -1448 -1802 91 539 -1614 -2257 -572
1065 -572 46 -1464 -1852 377 -24 -2617 -2469 -741 -301 -1444 -1265 -9 -630 -2261 -1851 -584 -448
1082 -448 -1506 -688 -4 -723 -1236 -304 235 -659 -1691 -1170 -816 -967 -514 429 1097 -6 -899 -486 13
1101 13 326 253 -7 -124 -98 586 678 523 960 723 -482 -339 1202 1818 731 -135 547 868 308 852
1121 852 2488 2388 449 -60 1274 1594 444 984 1688 785 -201 1026 3163 2480 613 644 1093 566
1139 566 306 2215 3098 1150 -153 900 1643 1481 518 1263 990 199 -89 1164 2291 1766 849 738
1157G38l57M75K73M7l49q52n84L51R10N29k12j183j68P31n65l26O64R25j119j198
1177a270Q82P32m30m43R19o09j639k24K173N97k252mK246o80k283O76K555n68
1195C78k799LK243k54j717Q39J804q58j949P89J675o06j481K15J378q07p40J408
1213d79P83j061p48O32J49n95j1R60p0p90j50P93O95m2J8n68l58m6M47R63l96
1234A26o19l44K7O00Q13l9k86J83j27r60l89J624J493j348j848Q67J993l20j064
1253C82J33L36p99q09J030L40K86L43L18m95j525Q69J577k25k179l82J576P73
1271A549q96p77R77L0o93J45O97j49j90J54q15o28N51J503l63q29p7K68k50K38
1291D45K36o64r28r0J212p9J64M41L33n30j189k98P59j53J59J83p16q72J173J399
$$ plain form
1157 738 381 856 1129 1176 827 -25 -609 -258 652 1181 969 -214 -382 349 -216 -542 122 1047 -72 -1270
1177 -1270 -388 344 -86 -529 390 -219 -1858 -2082 91 688 -1564 -1568 678 -2 -2285 -1609 946 378
1195 378 -2421 -2418 -175 -429 -2146 -1307 497 -361 -2310 -1521 154 -452 -1933 -1718 -340 -1147 -1887 -479
1213 -479 304 -757 -1505 -873 -724 -1319 -1330 -370 -440 -1230 -1380 -587 108 66 84 -484 -842 -888 -441 522 126
1234 126 -493 -837 -810 -210 603 564 278 461 334 -626 -1015 609 2102 754 -1094 -227 1766 1446 382
1253 382 515 851 52 -757 273 613 899 1242 1560 1065 -460 409 1986 1761 -418 -800 776 1549
1271 1549 653 -124 853 883 190 335 1032 883 693 847 32 -596 -45 1458 1095 266 189 457 207 445
1291 445 681 17 -911 -1001 211 132 296 737 1070 540 -649 -947 -188 -341 -182 1 -715 -1587 -414 985
1311I85q17j851L72J607m59j679O63J855q44j675L90J548n61n44K48O51j604k52
1329a967J351J45j021K47R23L09j143M28J015L5j631l24L47P05m67P69K66o88
1347g01o47R51J218q32p68Q0R77o71k0N78O24o26q37L39k0J075Po98n93P6J020
1368E32l01jM27L60l40l53N78J58ok34j17r22m47J568J064o39q49JJ142o74n23
1389D24N83R90p13r47M67O27l84J69M37l17j483J35J450P89k035k43J467j90n55
1408F71J07J173o57p68K33K36p46j62M87K78q19r80J539Q27p31p52J0N55k53k27
1428B1J06K09m84qk89Q5K31M7l07n81o9N39N48n68K55q0o74L23L86J03n17j38
1450h62J34o95l06L51J369n96q87j37Q50J72k20K54N03r15p30N85R11m74m33K89
$$ plain form
1311 985 168 -1683 -1311 296 -163 -1842 -1179 676 -168 -1843 -1453 95 -466 -1010 -762 -111 -1715 -1967
1329 -1967 -616 -471 -1492 -1245 -322 -13 -1156 -728 287 322 -1309 -1633 -1286 -581 -1048 -279 -13 -701
1347 -701 -1348 -397 821 -11 -779 -699 278 -393 -413 165 789 163 -674 -335 -355 720 727 29 -564 -488 532
1368 532 231 230 657 1017 677 324 902 1060 1054 820 703 -219 -666 902 1966 1327 478 479 1621 947 424
1389 424 1007 1997 1284 337 804 1431 1047 1216 1653 1336 -147 -12 1438 2227 192 -51 1416 1226 671
1408 671 778 1951 1294 526 759 995 249 87 574 852 33 -947 592 1419 688 -64 -54 501 248 21
1428 21 127 336 -148 -156 -445 -360 -129 -82 -389 -970 -1039 -500 48 -520 -265 -345 -1019 -696 -310 -207 -724 -862
1450 -862 -728 -1423 -1729 -1378 -9 -605 -1492 -1629 -779 -607 -827 -573 -70 -985 -1715 -1130 -219 -693 -1126 -837
1470h37l30m79K96P83P38o90j015M20M70K0L71M03l9p68n05P22M2K74k54k89k28
1491h95j31K04J075L22J2q80k27O32N71j29p28L17N12o14l05P19J73l79n21L36
1511F4N37n69K60P21l33m33j68J171P0o85l63M20k69o71L67Q80j22j049N6J300
1531A184j0n50K02M58q23j100P86J101l95o69J29K10o92j64J251J54j251P4N98
1550D93l5l88M08M52m41q75j39L07M77k82k42k49j43pL89L40m9J78Q7o49n71N72
1572c67J88n03N2j24M03l20M17K52o04p58M67L32m61L23M96N10r41k32Q87M86
1592E03j097o63P65j63o59K44Q64M12r18n06J126J85o36J74L85j4j034M87N98
1611E3K23n59k73K51o7L17J18Q0k88k09M52k46N95N75K6q93l27O48J39m36J17
$$ plain form
1470 -837 -1167 -1646 -1350 -567 171 -519 -1534 -1114 -644 -624 -253 150 111 -657 -1162 -440 -398 -124 -378 -667 -895
1491 -895 -1026 -822 253 575 587 -293 -520 112 683 554 -174 143 655 41 -264 455 628 249 -272 64
1511 64 601 32 292 1013 680 247 79 1250 1320 635 272 692 423 -248 119 999 877 -172 -116 1184
1531 1184 1174 624 826 1284 461 -639 147 1248 853 184 313 523 -169 -333 918 1072 -179 -105 493
1550 493 458 70 478 930 489 -386 -525 -218 259 -23 -265 -514 -657 -664 -275 65 16 194 281 -368 -939 -367
1572 -367 -179 -682 -630 -754 -351 -671 -254 -2 -606 -1364 -897 -565 -1026 -703 -207 303 -638 -870 17 503
1592 503 -594 -1257 -492 -655 -1314 -1070 -206 206 -712 -1218 -92 93 -543 -369 16 2 -1032 -545 53
1611 53 276 -283 -556 -305 -372 -55 63 143 -145 -354 98 -148 447 1022 1048 155 -172 476 615 179 296
1632B96L29m55k63N05O22m0o14P49M1j063J63J231k82q28j9M50k54j03J87J008
1652A660o17j065M61O96J09j032K52J080m12r38P58O73o97k00k61j70l36K23M32
1671F16K15p86K63P20k39l07m71Q91l78m87l20M08O9q5l32R5J08n8K54k9n31j15
1693d99O08q09O07K49l46l24J71M23j011K57L31l27m39k65L07Q38k00l73N47k5
1713b80o00k31J090k6r92j13L18p4l60J99O84j54q82N51O08m63n9J90N91p70k65
1734a038O15L79j69m77J06N2J2KJ87k60l36N66K40m3j2L52L76o00j57N39j44l98
1756b08P9n0l05q4J162J0m92m80P99L10n54N5L12n5o88L36Q78j59p83O05R1p04
1778G5m98N39N87l71j95L73M57p59M89P09l80r34k65L84L42o44L12M88m40n64
$$ plain form
1632 296 625 170 -93 412 1034 994 380 1129 1170 107 270 1501 1219 391 372 822 568 465 652 1660
1652 1660 1043 -22 439 1135 1244 212 464 1544 1132 194 952 1625 928 728 467 297 -39 184 616
1671 616 831 45 308 1028 789 482 11 902 524 37 -283 125 194 109 -223 -128 -20 -78 176 147 -384 -499
1693 -499 109 -700 -93 156 -190 -514 -343 80 -931 -674 -343 -670 -1109 -1374 -1067 -229 -429 -802 -255 -280
1713 -280 -880 -1111 -21 -47 -1039 -1152 -834 -908 -1268 -1069 -385 -539 -1421 -870 -262 -725 -784 -594 -3 -773 -1038
1734 -1038 -423 -44 -213 -690 -584 -532 -520 -518 -331 -591 -927 -361 -121 -164 -176 176 552 -48 -205 334 190 -208
1756 -208 -129 -179 -484 -568 594 604 112 -368 431 741 187 242 554 499 -189 147 1025 866 83 688 779 75
1778 75 -423 116 703 332 137 510 967 208 697 1406 1026 92 -173 211 553 -91 221 709 269 -295
1798b95L91Q55k82k92N9K52n16k57K64N54r0n19r3K25m60J77K69k62k82J90k30
1819c42M97m23J30K04J11l29K10l79j89L76k10o45J49N31L34n48m05P06K1j67
1839c68k28K49k22n04J55N76j04k82L41L96q85k0Q06J01p42m91O35M49m26K38
1859c26L49M9l64m30N57j21j59K97J32m06k95O69N22l91l86N48K18r16k39R23
1879B31L02p06j61M86K75m37L61M80m44m67J19J53O4O2L95M76p84r8P17m7p78
1900A99n8l2J94m6J97L16j06r2L91j41j27J7k0j88n26M03L62K09m57k25M75k40
1922E05m05rP80m25K1k94L76j86J85J74J62j046k5M25o4j64k87M20l80k47L87
1943i7O81k22k98m21K53K72k77P0r0n95M10K21o70L17K78k1m85j77J67M69j37
$$ plain form
1798 -295 96 951 669 377 436 688 172 -85 179 733 643 124 31 256 -204 -27 242 -20 -302 -112 -342
1819 -342 155 -268 -138 66 177 -152 58 -321 -510 -134 -344 -989 -840 -309 25 -523 -928 -222 -201 -368
1839 -368 -596 -347 -569 -1073 -918 -342 -446 -728 -387 9 -876 -896 -90 11 -731 -1222 -587 -138 -564 -326
1859 -326 23 72 -292 -722 -165 -286 -445 -148 -16 -422 -717 -48 474 83 -303 245 463 -453 -692 231
1879 231 533 -173 -334 152 427 -10 351 831 387 -80 39 192 256 318 713 1189 405 307 1024 977 199
1900 199 141 109 303 257 454 770 664 572 963 822 695 712 692 504 -22 381 743 952 495 270 745 505
1922 505 100 91 871 446 467 173 549 363 548 722 884 -162 -187 238 174 10 -277 143 -237 -484 -97
1943 -97 584 362 64 -357 -104 168 -109 -39 -129 -724 -314 -93 -763 -446 -168 -189 -674 -851 -684 -215 -352
1964c52j41J72j77M8k12M10l36l69J15m6L4m49L33Q11n69j60P08j80j87m8J92
1985d03k5p46M00M55j62p2K97p3k37l68L84K22k10r1O00o3l32%Q30j01n89m50
2007g34P96m71N3J26L17k14m32N34O31k1q01L32M22p00L62J05J50m05K78L56m75
2028B09m85O28M61p63k96J24R05n31K60K91m60k60M39L22k50n66K15N60m61n29
2048a87R46K62k20p94N12j42j74K84M81n89m99Q8N30j99m26K70O65o62p08P65
2068B03L58l18m14P8J68m87M42P73l68n62MM30m57k1J11P7n80p8M64K57k95p3
2090b88O34n00p54N20O82k28o08j15N62k88k72M80M65q02l24M35L27m78k41Q28
2110C5l08o14M41J073n64q52M03L68k19n63L60N92k63j01L83ok46J12K07k39m86
$$ plain form
1964 -352 -493 -321 -498 -450 -662 -252 -588 -957 -842 -888 -854 -1303 -970 -159 -728 -888 -180 -360 -547 -595 -403
1985 -403 -428 -1174 -774 -319 -481 -553 -256 -329 -566 -934 -550 -328 -538 -629 -29 -92 -424 -424 406 305 -284 -734
2007 -734 62 -409 -356 -230 87 -127 -559 -25 606 585 -216 116 538 -162 200 305 455 50 328 684 209
2028 209 -276 352 813 50 -246 -122 783 252 512 803 343 83 522 844 594 28 243 803 342 -187
2048 -187 759 1021 801 7 519 377 203 487 968 379 -120 -32 498 299 -127 143 808 146 -562 203
2068 203 561 243 -171 -93 75 -412 30 803 435 -127 -123 307 -150 -171 -60 17 -563 -641 -177 80 -215 -288
2090 -288 346 -154 -908 -388 294 66 -542 -657 -95 -383 -655 -175 290 -512 -836 -401 -74 -552 -793 35
2110 35 -273 -887 -446 627 63 -789 -386 -18 -237 -800 -440 152 -111 -212 171 165 -81 31 238 -1 -487
2131d87J77P27n40p2Q5M90j49n84P16J2j70l81K40K66J9OJ02j28k52J83K81M7
2153E88l37K9K39k21j40J61K41j92J60J63k74j94M28J8o7R7n00K14p1K95J42N4
2175H33l15j97K43q0j38J92M91k13r47M0O60K0m08Q4J78n16k26N32J08m52k1J81
2197D9L50o57L39J35k11m10M0L72m00o4K29NJ00j89L21o8j59k91L95j89o19N52
2219c70K15j95P2j39J66n94N59k72K6m52L67N60m05l55j73R36m99j39l9O02j41
2240b70p96L21N75l68R1K00Q7n44j17P28J21p10N11J85k65p12M91M73k38m56N34
2261a59J28l45K6K12L80k89k17j94P39j17j85L73j23j90j64M8L40J71j57Kl2j97
2283E0K93k05L24l70J92j92k5M24j73J06k8J89O1o03L30N17k59m49m8N74k59m10
$$ plain form
2131 -487 -310 417 -123 -195 -110 380 231 -353 363 375 205 -176 64 330 349 355 457 329 77 260 541 588
2153 588 251 280 519 298 158 319 560 368 528 691 417 223 651 669 602 699 199 413 342 637 779 833
2175 833 518 321 564 484 346 538 1029 816 -131 -91 569 589 181 265 443 -73 -299 233 341 -111 -132 49
2197 49 399 -258 81 216 5 -405 -365 7 -393 -457 -228 -223 -123 -312 9 -59 -218 -509 -114 -303 -922 -370
2219 -370 -155 -350 -278 -417 -251 -845 -286 -558 -532 -984 -617 -57 -462 -817 -990 -54 -553 -692 -731 -129 -270
2240 -270 -1066 -745 -170 -538 -447 -247 -160 -704 -821 -93 28 -682 -171 14 -251 -963 -472 1 -237 -693 -159
2261 -159 -31 -376 -350 -138 242 -47 -264 -458 281 164 -21 352 229 39 -125 -77 263 434 277 279 247 50
2283 50 343 138 462 92 284 92 67 491 318 424 396 585 646 43 373 890 631 182 134 708 449 39
2305C9M67K58m90Lj67P95m44m26K95L12o55j29O11l9j60n72N23N62o34l15M53
2326B87j24m69K10L50J07m50K16K48l73n43M73K99m02k96M76MR4k08J8Q3l35J13
2348b22J99j8m25L4O9J45j64L54J08o45K9J95O4m4j20L19J63p08Q50l11j72p9
2370c79K58l9j88j77K00K33l58M54j68J48n28L82K91m85K05J43J78l22l61L05
2390b08M86m59J43K80J0m90K82K39ol68R7L00k36J22J45K81n18j94J00L13O0j75
2412B04j37J23j0L1M58k66J4K7Q4q6J54k85J95m69N53n9j46p8J25k3n5n26P86
2435F14k53K12m59J94L97k89j26J32j5l56K8J75J71m07j94K64j45j63K43K66k53
2456C6j8Q9K95m34k88K52J44l89J49J29K0l83l27M09L00n46M38N4k91l74K28M69
$$ plain form
2305 39 506 764 274 277 110 905 461 35 330 642 -13 -142 469 430 270 -302 221 783 149 -166 287
2326 287 163 -306 -96 254 361 -89 127 375 2 -541 -68 231 -171 -467 9 13 107 -101 -83 0 -335 -222
2348 -222 -23 -41 -466 -432 -363 -218 -382 -28 80 -565 -536 -341 -277 -321 -441 -122 41 -667 183 -128 -300 -379
2370 -379 -121 -160 -348 -525 -325 -92 -450 4 -164 -16 -544 -162 129 -356 -151 -8 170 -152 -513 -208
2390 -208 278 -181 -38 242 252 -238 44 283 277 -91 6 306 70 192 337 618 100 -94 6 319 379 204
2412 204 67 190 180 211 669 403 417 444 528 442 596 311 506 37 590 531 385 307 432 409 354 -172 614
2435 614 361 573 114 308 705 416 290 422 407 51 79 254 425 18 -176 88 -57 -220 23 289 36
2456 36 18 107 402 -32 -320 -68 76 -313 -164 -35 -15 -398 -725 -316 -16 -562 -124 -70 -361 -735 -507 -38
2478c8j60k72O5K12j49m53J97M60j34k55O9o5J69k66K94j73lJ07j31K23k20N52
2500B9n01j65J59Jk6R9R5m2M1k62N71n50J68J80j57N4K8K6N8K23j41k0k4p9K79
2525D4L23o1k71j9N08j00k72k24J02L86m71Q3L63j9j97M2J86k67K90k52K27j74
2547B27o6K10N9J53j86k16J3m80M77L36p7r8K08k0o9j20j33J81r6q3L21k21m38
2570a18N72k69N44n45k62K76J94j19k00K31j73jJ23Q1j39j31J50J35l00JM5K32
2592C27m56Q3K01j74k58M41J97p42Q3J08J70l56j0N10k79k00N0J47n9k29O0Q5
2614c01M4l49Q1M47r4N5P7k50l7K73k45M9j49J59j64L07q6r2Q7j35O6J10r3Mq0
2639c16J52j40M9L61q7j33n0j03J54P4K15l46K50o8k50K26K87j30n4J33j94k07
$$ plain form
2478 -38 -198 -470 -405 -193 -342 -795 -598 -138 -272 -527 -458 -523 -354 -620 -326 -499 -502 -395 -526 -303 -523 29
2500 29 -472 -637 -478 -477 -503 -404 -309 -351 -310 -572 -1 -551 -383 -203 -360 -306 -278 -252 -194 29 -112 -132 -156 -235 44
2525 44 367 306 35 16 524 424 152 -72 30 416 -55 28 391 372 175 217 403 136 426 174 401 227
2547 227 161 371 430 583 397 181 194 -286 191 527 450 352 560 540 471 351 218 399 303 220 541 320 -118
2570 -118 454 185 729 184 -78 198 392 273 73 304 131 130 253 334 195 64 214 349 49 50 95 327
2592 327 -129 -46 155 -19 -277 164 361 -381 -298 -190 -20 -376 -386 124 -155 -355 -305 -158 -217 -446 -386 -301
2614 -301 -257 -606 -525 -78 -172 -117 -40 -290 -327 -54 -299 -250 -399 -240 -404 -97 -183 -275 -188 -323 -257 -147 -240 -236 -316
2639 -316 -164 -304 -255 106 19 -114 -164 -267 -113 -39 176 -170 80 12 -238 -12 275 145 91 224 30 -177
2661a77j82P34m11O3N9J31J95k78LK23r4j11J50O5NpJ05L43o94q0N02k71j66O3
2685A70J7J6j00J9N37l70j76J59O30o02O7j85k7L19l87j60K33O0j25L71n32k93
2707c59M19qK3J9n4J49j33j48K76k6j45k18k55L31l05M10k5m61l0K76MK81m48
2730d27L87K1m06K27K12j36j98k24K51j45j82L15q4K87l74k69N76Nn8k37K74k1
2752b06Q2l62P7K00k68nk6q2J47J07m18L30M9K95k31J11k7k92J39k2K88K36m68
2775c46J96MR2k48M39j03j79J32K50m13K43j71O75k66m55K76j03J91r3K0J14j98
2797E7k45M60j23n6Kj1M03Q9r5k49JK85l49J60j40L81j54j42m1j17K84l9p6q6
2821A99K42j2J37p5Q9k33j9o8O4j88M2p0K63n01L61MJJ41j37Pj83Pj49K71Nk14
$$ plain form
2661 -177 -359 375 -36 27 86 217 412 134 137 360 266 155 305 370 375 368 473 816 122 42 544 273 107 170
2685 170 187 203 103 122 659 289 113 272 902 300 367 182 155 474 87 -73 160 220 95 466 -66 -359
2707 -359 60 52 75 94 40 189 56 -92 184 158 13 -205 -460 -129 -434 -24 -49 -510 -540 -264 -260 21 -427
2730 -427 -40 -19 -425 -198 14 -122 -320 -544 -293 -438 -620 -305 -389 -102 -476 -745 -169 -164 -222 -459 -185 -206
2752 -206 -124 -486 -409 -209 -477 -482 -508 -590 -443 -336 -754 -424 -375 -80 -311 -200 -227 -519 -380 -402 -114 122 -346
2775 -346 -150 -146 -54 -302 137 34 -145 -13 237 -176 67 -104 571 305 -150 126 23 214 121 141 255 57
2797 57 -188 272 149 93 95 84 487 576 481 232 233 518 169 329 189 570 416 274 233 116 400 361 285 199
2821 199 441 429 566 491 580 347 328 260 324 136 178 108 371 -130 231 235 236 377 240 247 64 71 -78 193 198 -16
2847a6N5j42J46l65K85k51L70l34Q5N2n2J85l6r6M9J61j43j90R3n8j31k25J86
2870c72R1Q9K8j11L69o8l80P9N9k85j7M8J89K07m0N0k4Q1n89K87O6N2P5j77K89
2895dk6k43K73k19J50L8j1l00L03j49j7j34J31K75k8J02J82j63m19M60j20L15
2917C96k61Rn7J47p9j17K44L0j02l6j14J68l55M06J11k05L9l2L44l51K45l36J58
2940B52j0j00J83j46J3Q8J87j62j34L56l54j16J4k23J07K34N2m2K17l62j3J50
2962A91k15K58J57n42m8N2O13l99j58mk54J99R8P8r1k13K49k56K96L9l33L58l15
2985b40j01K97q4q2j90J37m2J21l14O3L74L79k92l74oJ12k13J29k5J06Qk27J49
3008c15O6J7j14j44j49L14j39Q9N0L12k63N10k72OQ7j95l0l8j42R1J13l7Ml84
$$ plain form
2847 -16 39 -103 43 -322 -37 -288 82 -252 -167 -115 -167 18 -18 -114 -65 96 -47 -237 -144 -202 -333 -558 -372
2870 -372 -281 -192 -164 -275 94 26 -354 -275 -216 -501 -518 -470 -281 -74 -114 -64 -88 -7 -596 -309 -243 -191 -116 -293 -4
2895 -4 -30 -273 0 -219 -69 -31 -42 -342 -39 -188 -205 -339 -208 67 39 141 323 160 -259 201 81 396
2917 396 135 144 87 234 155 38 282 312 210 174 60 228 -127 279 390 185 224 192 536 185 430 94 252
2940 252 242 142 325 179 192 280 467 305 171 527 173 57 71 -152 -45 189 241 199 416 54 41 191
2962 191 -24 234 391 -151 -199 -147 466 67 -91 -95 -349 -150 -52 26 -65 -278 -29 -285 11 50 -283 75 -240
2985 -240 -341 -44 -128 -210 -400 -263 -305 -184 -498 -435 -61 318 26 -348 -354 -242 -455 -326 -351 -245 -237 -464 -315
3008 -315 -249 -232 -346 -490 -639 -325 -464 -375 -325 -13 -276 234 -38 -32 55 -140 -170 -208 -350 -259 -146 -183 -179 -563
3032e63O91j03k41k3K15n4j60K61J73j61J35l42K51j7j58J64q0j28Q6Q0K87L8
3054C51k35K36j1j30L01mq2n9j91J22k72k72L31K39J97mm67M47L5l25L57l60J14
3077C18O8j28m4K53o5n3l31J56p3K52P7j27q4kj58J35J03m5Q2m17M10k31K07l16
3101a3L1j78K32k75Q6J19J45k58K91k13p0j7R3J3n1QK2k25K19j56N5k45q3K48
3125b22K61n75Q09k21n10J17J73L39m78m8q9K58j84n8M07k07j83L54q6M1p6Q1
3147i7l23J69q7J99rn8k46M41J26m61K32J30j39j74L35j80n2J18o3L23k04j27
3169a47K63l01K47O9j12n6J76j40J93J49l33J89J35o2j52J22l53K55p1l8R8k47
3191a16K53nj9J22J63l34J41N5l68M11j37R1k24K41o6J5p8K8k2l72L93J71R%j96
$$ plain form
3032 -563 128 25 -216 -239 -24 -78 -238 23 196 35 170 -172 79 62 -96 68 -12 -140 -54 26 313 351
3054 351 116 352 341 211 512 508 426 367 176 298 26 -246 85 324 521 517 50 497 532 207 564 204 318
3077 318 386 258 214 467 402 349 18 174 101 353 430 303 219 217 59 194 297 252 334 -83 327 96 303 -13
3101 -13 18 -160 72 -203 -117 2 147 -111 180 -33 -103 -120 -27 -14 -65 -57 -35 -260 -41 -197 -142 -387 -470 -222
3125 -222 39 -536 273 52 -458 -341 -168 171 -307 -355 -444 -186 -370 -428 -21 -228 -411 -57 -143 -102 -178 -97
3147 -97 -420 -251 -338 -139 -148 -206 -452 -11 115 -346 -114 16 -123 -297 38 -142 -194 -76 -139 184 -20 -147
3169 -147 116 -185 62 131 19 -37 139 -1 192 341 8 197 332 270 118 240 -113 142 71 33 131 -116
3191 -116 137 132 113 235 398 64 205 260 -108 303 166 257 33 274 208 223 145 173 151 -221 172 343 352 352 156
3216A56k00J94j41P1j33L63l51j79N42l47r5J67K20m27L20l80J03r9L38k32P0
3237d0j29J17r4m9K21K6l08l1p3j61J06K95K23k9m1j75j30q5J51j34J84j98j32
3260d86J97o1J30R1k47J87k23j69K85M4K36j90r4Q7PJJ09j33n0j98M28n67M67
3283a49j92k26O87L1l83N6o0J56L3j81K87k55N3K49j69P8O5j34NLL16K59o55J67
3307D1j33L54j18Q0J0K5j26L12j64k93J25J15j61K07L14k64K6k19j8K47k75K05
3329B90j53J98l2j38K30k58M10m06K33j6N8j56j95J78n5k4J39l34R5m8K10j73
3351E3L00j86l9q7J07q8J00J30j10J44j93j34p8k3K78l92K95m01m7L17k53K18
3373h9o2L20m10L12n09K56k0p7J25m1L02k04K47k90k07J20l46M08j97J02R8k30
$$ plain form
3216 156 -44 150 9 80 -53 310 -41 -220 322 -25 -120 47 267 -160 160 -220 -117 -216 122 -110 -40
3237 -40 -169 -52 -146 -195 26 52 -256 -287 -360 -521 -415 -120 103 74 33 -142 -272 -357 -206 -340 -156 -354 -486
3260 -486 -289 -350 -220 -129 -376 -189 -412 -581 -296 -252 -16 -206 -300 -213 -206 -205 -96 -229 -279 -477 -49 -616 -149
3283 -149 -341 -567 120 151 -232 -176 -236 -80 -47 -228 59 -196 -143 106 -63 15 80 -54 -49 -46 270 529 -126 41
3307 41 -92 262 144 224 234 259 133 445 281 -12 113 228 67 274 588 324 350 131 113 360 85 290
3329 290 137 335 303 165 395 137 547 141 374 358 416 260 65 243 188 164 303 -31 64 16 226 53
3351 53 353 167 128 41 148 60 160 290 180 324 131 -3 -81 -104 174 -218 77 -324 -371 -54 -307 -89
3373 -89 -151 169 -241 71 -438 -182 -202 -279 -154 -195 107 -97 150 -140 -347 -227 -573 -165 -362 -260 -162 -392
3395c92K45K48M3m60Q8J1j14L3J0Q9o9l52K91J17J2L7k1Jj01K79j9n19N26M3m4
3420a8K6p1l8O7n5j73K45j31N0j53Q0K37K15j79M9jK3j81P1j15K39l33m0M20j58
3445G6J92k03j0K51k20J51j6k32Q2J53J10j95k17K99l10J85k08q9L28Kk5pJ06
3468B03N9k29N42j54m45K19j31q1R3m0J14mL0L3J21l66K39r3j13m72O09m26J42
3491a50J10N8j2L1j92Q7Q7j91K30k39j00P0j36J80l36J63K53N3j96O4j45p4n7
3514d42J49M8J87l11J10M6O2m6K0J8q2J28q7K94k30O4j6J05k25j74L66m6j32j48
3538c42L70%k50K64k95K06K1l01P0J54K27m97M62j98K33m70M56k31L87k22PK63
3560C14r1j31J60r0r5J8M0j95J05K07l2k40j06M56q7J34l8L9m29K46J11N1k23
$$ plain form
3395 -392 -147 101 144 -316 -228 -217 -331 -298 -288 -199 -268 -620 -329 -212 -200 -163 -184 -183 -284 -5 -24 -543 -17 26 -18
3420 -18 8 -63 -101 -34 -89 -262 -17 -148 -98 -251 -171 66 281 102 151 150 173 -8 63 -52 187 -146 -186 234 76
3445 76 268 65 55 306 86 237 221 -11 71 224 334 139 -78 221 -89 96 -112 -201 127 129 104 97 203
3468 203 262 33 575 421 -24 195 64 -17 76 36 150 146 176 209 330 -36 203 110 -3 -475 134 -292 -150
3491 -150 -40 18 6 37 -155 -68 19 -172 58 -181 -281 -211 -347 -167 -503 -340 -87 -34 -230 -166 -311 -385 -442
3514 -442 -293 -245 -58 -369 -259 -213 -151 -197 -177 -159 -241 -113 -200 94 -136 -72 -88 17 -208 -382 -16 -62 -194 -342
3538 -342 28 28 -222 42 -253 -47 -26 -327 -257 -103 124 -373 89 -109 124 -346 110 -121 266 44 51 314
3560 314 223 92 252 162 67 85 125 -70 35 242 210 -30 -136 320 233 367 329 368 -61 185 296 347 124
3583A24J69j41Q7p2j09kM95k61mK61l54m1K53k33j13j57J77R5M06n27M01l01M
3606A57q2K63o5J22n30J74K96l01JJJ18K79l43J4j25j84J38R3nN9l5K1j86J57
3630C7j12l61M10o8q5L2K49j0j45o1n5r4j28Q4K33m32K35J10j23K60k74P5k2K86
3654D1n3j98k72M34R1l86k3J62M39l61L0m1j08L7J40J5m60L18k79K00RK12j22
3677a75L34o5k79j21L52j38J22L11j41k37R8p6p9M40n37K31J04Q9J41m52J61K71
3699C54j16l57L63o0j26N0R2j08L8l65J96j80M42R3j13J15j08J06k45P7M3J91
3721C82l45J63k02O9j88M9L0j39M71j51j2p4j96K89o9J55j8L0n17L53j80n8J06
3744e2J31M8R7k52j07k9J80K94l20J1j84J94l5j00L4m5J84k37M57m73J9Q7k30
$$ plain form
3583 124 293 152 239 167 58 56 551 290 286 547 193 152 405 172 59 -98 79 174 580 53 454 153 157
3606 157 75 338 273 395 -135 39 335 34 35 36 154 433 90 104 -21 -205 -67 26 21 80 45 66 -120 37
3630 37 -75 -436 -26 -94 -179 -147 102 92 -53 -114 -169 -263 -391 -307 -74 -506 -271 -161 -284 -24 -298 -223 -245 41
3654 41 -12 -210 -482 -48 43 -343 -366 -204 235 -126 -96 -137 -245 -208 -68 -53 -513 -195 -474 -274 -265 -53 -175
3677 -175 159 94 -185 -306 46 -92 30 341 200 -37 61 -15 -94 346 -191 40 144 233 374 -78 83 354
3699 354 238 -119 244 184 58 108 200 92 130 -235 -39 -219 223 316 203 318 210 316 71 148 191 382
3721 382 37 200 -2 67 -121 -72 -42 -181 290 139 127 53 -143 146 77 232 214 244 -273 80 -100 -158 -52
3744 -52 79 127 224 -28 -135 -164 16 310 -10 1 -183 11 -24 -124 -90 -135 49 -188 269 -204 -185 -98 -328
3767c28j25L73k53L10j18r5L50m46j50J90L33l4j54k17l0J19M8K3j1m2L18j99
3789a38o0R8j59J70J4m4nk06K5Q7K77N0l68M38j33m3lR4j15J07k20J97l30L02
3813C5m3R7J94m44K07j20L7K57j09JJ05j33K0LQJ75m9j77J1K18j14j76J34K21
3837C58k74K15q1P2j12J7P4k48j71M51k35K98o2J03k08MJ72L3n6j54L06o70L90
3860B22M1N2k02k5ql11L31j15M43l45j1N2m21M69k31J84Q9j46j46J40m05L09o3
3883i7O9R6R7Q4m39L9J75j7j90Q8k05L85o5m0j95J05k01r2M02p8j55J70PQ1k68
3908b44o0J36k07K39M5k46L75l65R2J15r5j10J9K64L4k39M4J96l7j38M2K4r8j97
3932d11L65j13KJ31l88K69M3jP3M3p7J04j5j81K03k21L43m73K56l0K98k6j25K28
$$ plain form
3767 -328 -453 -80 -333 -23 -141 -236 114 -332 -482 -292 41 7 -147 -364 -394 -275 -227 -204 -215 -257 61 -138
3789 -138 -198 -100 -259 -89 -75 -119 -124 -330 -305 -218 59 109 -259 179 46 3 0 94 -21 86 -134 63 -267 35
3813 35 -8 89 283 -161 46 -74 -37 220 111 112 217 84 104 107 115 290 241 64 75 293 179 3 137 358
3837 358 84 299 218 290 178 195 269 21 -150 301 66 364 302 405 197 201 373 406 350 196 502 -168 222
3860 222 263 315 113 88 80 -231 100 -15 428 83 72 124 -297 172 -59 125 214 68 -78 62 -343 -34 -97
3883 -97 -28 68 165 249 -190 -151 24 7 -183 -95 -300 85 20 -20 -215 -110 -311 -403 -1 -79 -234 -64 -57 24 -244
3908 -244 -304 -168 -375 -136 -91 -337 38 -327 -235 -120 -215 -325 -306 -42 -8 -247 -203 -7 -44 -182 -140 -116 -214 -411
3932 -411 -46 -159 -157 -26 -414 -145 -102 -103 -30 13 -64 40 25 -156 47 -174 169 -304 -48 -78 220 194 69 297
3956B97j53l32J74k24M02l03J5N8j0q9K68M1R8j4J42j73j24L81l42M0l19Q0K74
3979A87Pk73L67l58L25k49L03m36L6K26j4j35J63j95K29l82K97N4j7m38N89k94
4001hk1J16j94K29l36L96j40L8j75j60o6O9L03M9J7j11k21K48k05m5K41J88l76
4024a64J11k28L20L9k33J8p0p1J42k70P6M13k59q5O3J77n0l5L7j49J34Q1q3j6
4048a02N3N4j12J07nj69J4K5n3K83l31j2J57K52j26m73K92j49M21j18J50m3r5
4071B0o8K16L2K0J5j70J01R2l06o5L14k74J32J77k71k86M17J43Lmj35o3P0j55
4095d5M74j96j59K8m9L14m3p6j46k31J21J48K76l94o1K06p1%p1r4J59J02j93K83
4119B82j67q9J08J73k30K23l0j12l27K62n12L89L52j76O0Q9l59M15j50m75M08
$$ plain form
3956 297 144 -188 -14 -238 164 -139 -124 -66 -76 -165 103 144 242 228 370 197 73 454 112 152 -167 -87 187
3979 187 194 -79 288 -70 255 6 309 -127 -91 135 121 -14 149 -46 183 -199 98 152 135 -303 286 -8
4001 -8 -29 87 -107 122 -214 182 42 80 -95 -255 -321 -252 51 100 117 6 -215 33 -172 -217 24 212 -164
4024 -164 -53 -281 39 78 -155 -137 -207 -278 -136 -406 -330 83 -176 -261 -198 -21 -71 -106 -69 -218 -84 -3 -86 -102
4048 -102 -49 5 -107 0 -5 -174 -160 -135 -188 95 -236 -248 -91 161 35 -438 -146 -295 126 8 158 115 20
4071 20 -48 168 200 220 235 65 166 258 -48 -113 201 -73 59 236 -35 -321 96 239 242 238 103 40 110 -45
4095 -45 429 233 74 102 53 367 324 248 102 -129 -8 140 416 22 -39 167 96 96 25 -69 90 192 -1 282
4119 282 115 26 134 307 77 300 270 158 -169 93 -419 -30 322 146 206 295 -64 351 201 -274 134
4140A34j88J16l26n8M78j83j76L70m36K12J01l41K76J64l39L11k14P2L1k57j80
4161d33J21J34K28p1l38J60J43j20J10k25K95k49j0N5L3j81L02N7j57LP5J29l27
4184b66R6N4j16L00n0m15L40l9j63L38j16J30k04J79k3k41L38l67J19j18M45j90
4206C1Q4k39j10M48k55k43L45J9J33j5P7l70K27j37K11Pk47K13k81J71j27J75
4228A17J23j37k44L88k55J25k3J82m0J7M1N7j64n9j00J19l30L27J47l60K27J03
4250B61l61oJ86N1n8L81n56J63P0l92K35J62n2J7k20J85l65N59k60J87k67J5j9
4273h4j35K17q0k32K97M5k62J36q1J91j97k33K72L2J4M2O2l28M58k23j53J11J7
4296a14J12M6k85P8p5J41j05J21K29r1m6R7O1m78N5J65K43k05m7O2Rj63K00Q2
$$ plain form
4140 134 -54 62 -264 -322 156 -27 -203 167 -269 -57 44 -297 -21 143 -196 115 -99 -27 4 -253 -433
4161 -433 -312 -178 50 -21 -359 -199 -56 -176 -66 -291 4 -245 -255 -200 -167 -348 -46 11 -146 -143 -68 61 -266
4184 -266 -170 -116 -232 68 18 -397 -57 -96 -259 79 -37 93 -111 68 45 -196 142 -225 -106 -224 221 31
4206 31 115 -124 -234 214 -41 -284 61 80 213 198 275 -95 132 -5 206 213 -34 179 -102 69 -58 117
4228 117 240 103 -141 247 -8 117 94 276 236 253 294 351 187 128 28 147 -183 144 291 -69 158 261
4250 261 -100 -106 80 131 73 454 -102 61 131 -261 -26 136 84 101 -119 66 -299 260 0 187 -80 -65 -84
4273 -84 -219 -2 -82 -314 -17 28 -234 -98 -179 12 -185 -418 -146 -114 -100 -58 4 -324 134 -89 -242 -131 -114
4296 -114 -2 44 -241 -163 -238 -97 -202 -81 148 57 11 108 169 -309 -254 -89 154 -51 -98 -36 -27 -190 10 92
4320I2l02N1J75k29M26j55j02Q5j51J8K28K7j98J80j05k76R8N31k2l68K21j78
4342D6J09j34N5jJ56J2l11L39j11l4o2J97nq8n4K14j77J81j70j74N1P6Mj19j59
4367a59L88O3o1Q8m82N1K90j39K15j30K10q9j25J49j81j19K19k29j13Q9M2P5j36
4390h4K19P2m19J65m0J25k4k31Q8K33k97O2k02L56k92K72J44k25p6K1K08l87R3
4413b19J70o6j12ML13j65j09k39K91N3L4j97m5J05k44K16L44l66K77m0l94M12
4435B3K26m76j41Q2O7L37k86P0k02j6K69J2k55L0m1O7Q8j4J19J00n8J97l14QL12
4460B04j63r8P7J2L8l56M27j03n3K18j26p6k46M04k04P6p9K16k29J2J58k29M42
4483C22m53L14p8N6l83L89j27j22M71l01J7Jl6n5k5K01M3Lj72k6J19j73j48M2
$$ plain form
4320 92 -210 -159 16 -213 213 58 -44 41 -110 -92 136 163 -35 145 40 -236 -138 393 371 3 224 46
4342 46 155 21 76 75 231 243 -68 271 160 126 64 261 256 168 114 328 151 332 162 -12 39 115 119 0 -159
4367 -159 229 292 231 319 -163 -112 178 39 254 124 334 245 120 269 88 -31 188 -41 -154 -65 -23 52 -84
4390 -84 135 207 -212 -47 -87 38 14 -217 -129 104 -193 -131 -333 23 -269 3 147 -78 -154 -133 75 -312 -219
4413 -219 -49 -115 -227 -223 90 -75 -184 -423 -132 -79 -45 -242 -287 -182 -426 -210 134 -232 45 5 -389 23
4435 23 249 -227 -368 -286 -219 118 -168 -98 -300 -316 -47 -35 -290 -260 -301 -234 -146 -160 -41 59 1 198 -116 -108 204
4460 204 41 -57 20 32 70 -286 141 38 -15 203 77 1 -245 159 -45 31 -48 168 -61 -49 109 -120 322
4483 322 -131 183 105 161 -222 167 40 -82 389 88 105 106 70 15 -10 191 234 237 65 39 158 -15 -163 -121
4507a21L21m5o1L7r7K7L89l54l0m4k94K58R9j8m2r2l6o3l7J37j97J60J98l77J35
4532a47K1J73o3L24j93n13M87k0k94N3K12q2j37K44J7n26K47K55L9q4j63J15l4
4555f9k23J60K3M12k68K3k95K56j34J02N3J1Qn0J13l05j57J10K52j37r3j02O58
4578C48p6j86J59l72L00k30N8j83k84M08J06J6k22L16j19P7L47m61j53K44p9k25
4600b11M2K95J08j87N8j15K12k11n6K54j44J21k16M14q0p1j10P4j01o9J66K26
4622C99k37L19m87J6K36j17k32R8j9k3J79J17l03R2q8J6q2J34K38j85n2k19L44
4645A44k83R3O8P0k9l04k0M66l58J01o0L9J90m47K60J01j78K57j5k83J28J66m59
4668c53K03L25m85Q2p1K06k39L58l9n9K0r9j77j01N0K96K24m45L24L8j44K93l95
$$ plain form
4507 -121 200 155 94 131 34 61 450 96 66 22 -272 -14 85 67 25 -67 -103 -166 -203 -66 -263 -103 95 -282 -147
4532 -147 -126 47 -16 308 115 -398 89 69 -225 -172 40 -42 -179 65 82 -444 -197 58 97 13 -150 -35 -69
4555 -69 -292 -132 -109 303 35 58 -237 19 -115 -13 40 51 59 9 122 -183 -340 -230 22 -115 -208 -310 348
4578 348 272 86 245 -127 173 -57 1 -182 -466 -58 48 64 -158 158 39 116 463 2 -151 93 14 -211
4600 -211 -169 126 234 47 105 -10 202 -9 -65 189 45 166 -50 364 284 213 103 177 76 7 173 399
4622 399 162 481 -6 10 246 129 -103 -5 -24 -47 132 249 -54 38 -50 -34 -116 18 256 71 19 -200 144
4645 144 -139 -46 22 92 63 -241 -261 205 -153 -52 -112 -73 117 -330 -70 31 -147 110 95 -188 -60 106 -353
4668 -353 -150 175 -310 -228 -299 -93 -332 26 -13 -72 -52 -151 -328 -429 -379 -83 141 -304 20 58 -86 207 -188
4691a88O9j54J40J68l9N6m34J92o3M15j58r6J63Q5j03Q8j65J64k05J73k91OL25
4714A48q1k48N1P1P2j10p7K71k73L92J1k47J74j9j2j94K9J41J40k87j5K89j08
4737A18j67J91k02J84L43l71o6j23M11l68m2P1k22N86k49N1m3j82L01j08l7K03
4759B79k48j00L12l28K52K0q7J17l71K93P2j3j93j19O5q1J50L6J36l25K26K1k2
4782I2q8k21J34o1J69o9j9J3J11J18k86J77J0m85M63J40k73J98k57jO9J44n73
4805d95K31K11J7J54j31j55J07j1k12J8K13l99P09l57k0K70l28K25l9n8O9qj49
4828a38j11N05o55Q9J31K15J8j07K89m25K19k95J48J09j16K22m23M08j93Q1j62
4849a91J16J09k12N32l69K3J19J28l21O5j30J13JM0o9l0K08J68l15l1p1L67l51
$$ plain form
4691 -188 -119 -273 -133 35 -4 52 -382 -190 -253 162 4 -92 71 156 53 141 -24 140 -65 108 -183 -177 148
4714 148 67 -181 -130 -59 13 -97 -174 97 -176 216 227 -20 154 135 123 -71 -42 99 239 -48 -63 226 118
4737 118 -49 142 -60 124 467 96 30 -93 318 -50 -92 -21 -243 343 94 145 102 -80 221 113 76 279
4759 279 31 -69 243 -85 167 187 100 217 -154 139 211 198 5 -114 -49 -130 20 56 192 -133 93 114 92
4782 92 4 -217 -83 -144 25 -44 -63 -50 61 179 -107 70 80 -405 58 198 -75 123 -134 -135 -66 78 -495
4805 -495 -264 -53 -36 118 -13 -168 -61 -72 -284 -266 -53 -452 257 -100 -120 150 -178 47 8 -50 19 11 -138
4828 -138 -249 256 -399 -310 -179 36 54 -53 236 -189 30 -265 -117 -8 -124 98 -325 83 -110 -29 -191
4849 -191 -75 34 -178 354 -15 8 127 255 -66 -1 -131 -18 -17 23 -46 -76 132 300 -15 -46 -117 250 -101
4872a01M13j30Jr1n6J85l48K0R7K30k04J81n91M50j98k9K61o9O5m7l74l1K55K83
4896A72j25K0K26l19R3l18M32j37m7q7P5J53k36J98m44L41p1P5r7L03j60j98N4
4919i7J25K12l17K2Q4j21jk07J65m9K46j60J16J7l98J98k0K9j05Q6N4K0j72p3
4943c46L02m7j69K43j38R6n5k4l7K65l62M15l03j58O1K15m7k03L16J99m96J47
4965a26l0K94j49r4M74m53m6j39J34P5J90k96L1R2J87m8q0R6j53o4L80l45K47
4988A77m9k48M6K21l8o9P0j52R7k33N98l32j6k99J93q6O2%O7Q0KK24l93N4r6K08
5014H8J39j74k42N67l42J97m2l74N90n95J89j57K50J6k66j07K9K22R5J06lk49
5036f3J00j03p7O9J92J04k30Qk2n3K23j79K5Q6k10K20l53J99K9J46o8j43m4J90
$$ plain form
4872 -101 312 182 183 92 36 221 -127 -107 -10 220 16 197 -394 56 -142 -171 90 21 86 39 -335 -366 -111 172
4896 172 47 67 293 -26 67 -251 181 44 -3 -90 -15 138 -98 100 -344 -3 -74 1 -96 207 47 -151 -97
4919 -97 28 240 -77 -55 29 -92 -93 -300 -135 -184 62 -98 18 35 -363 -165 -185 -156 -261 -175 -121 -101 -273 -346
4943 -346 -44 -91 -260 -17 -155 -59 -114 -138 -175 90 -272 143 -160 -318 -257 -42 -89 -292 24 223 -273 -126
4965 -126 -156 138 -11 -105 369 -84 -130 -269 -135 -60 130 -166 -135 -43 144 96 16 112 -41 -105 275 -70 177
4988 177 128 -120 -74 147 109 40 110 -42 55 -178 420 88 72 -227 -34 -120 -58 -58 9 89 91 315 -78 -24 -120 88
5014 88 227 53 -189 378 36 233 191 -183 407 -188 1 -156 94 110 -156 -263 -234 -12 83 189 186 -63
5036 -63 37 -66 -143 -74 118 222 -8 0 -22 -75 148 -31 -6 80 -130 90 -263 -64 -35 111 43 -100 -144 46
5060D6J5r5j8p0k5%K9J30j04o6o0M7L72m11P3O1j3K1j86J24L9j55L16j03qj45
5086a86K11l5rQ4J5k28l3J64J10k21N7n9K47k88J96q5L41l46J85P4O5n0k76j9
5110h6L03l77L54o4k0k17L17o6o3J11l33J22L62k31j00J39j51J86j41K76n10K94
5132A05M4po6j18J18k11Q9J80j87j41J28P7L41k11l71R1J47j1J5N3J78p5j4L1
5156A85m91M08k49R6N8J08J50J0o0n08K53j40P8K11J50j80n7k66J77K82m34RR6
5179a14r8J19J8r7lJ60O2k41k64j6L60M4J79J81k61j50j12J76p1J88k10j21N21
5202B50j89j15k5q4k5M3J17m2Q1o5j24M9k8K01j13Kp6Q3l2L41k77M0l5n7m7K3
5228a04K88J75o60K64J18q5j10j2J15k47Q4J06j12j66M51L8k80K33j19k37L52
$$ plain form
5060 46 61 -34 -52 -122 -147 -147 -118 12 -92 -158 -218 -171 201 -210 -137 -76 -89 -68 -254 -130 -91 -246 70 -33 -41 -186
5086 -186 25 -10 -19 65 80 -148 -181 -17 93 -128 -71 -130 117 -171 25 -60 281 -65 120 194 259 209 -67 -86
5110 -86 217 -160 194 130 110 -107 210 144 81 192 -141 -19 343 112 12 151 0 186 45 321 -189 105
5132 105 149 142 76 -42 76 -135 -46 134 -53 -194 -66 11 352 141 -230 -139 8 -3 12 65 243 168 154 185
5156 185 -306 102 -147 -51 7 115 265 275 215 -293 -40 -180 -102 109 259 79 22 -244 -67 215 -219 -210 -114
5179 -114 -212 -93 -75 -172 -175 -15 47 -194 -458 -474 -114 -70 109 290 29 -121 -233 -57 -128 60 -150 -271 250
5202 250 61 -54 -79 -163 -188 -145 -28 -70 11 -54 -178 -129 -157 44 -69 -67 -143 -60 -92 249 -28 12 -23 -80 -127 -104
5228 -104 184 359 -301 -37 81 -4 -114 -126 -11 -258 -174 -68 -180 -346 105 143 -137 96 -23 -260 92
5249I2q2J88j15P9M1j15K77l92J83K7Q9j16l27J21K09j78K54l51K34k81J02J18
5271E7m3J29n5p6n1J57l8l9K7j3L8N2k61J46j76J53J37j51R7k40K40K8m33L19
5295Dpq6J04k44J19K92r9J97l9k72J00J6k45j59N05j75j22M55m23R3R4k68L73
5318B13J33k37k80L0L2Q9n0O4l4N5l24K08n4R9L3j60J21M1j17J41rj82L9R4j46
5343b01K50M1k15J00p9j58K00J76o9j02J64j36J5k63J62M93n17%J47K34l90J53
5365EJ21j55N1k04L60m28L55l5N9r7j38Q8J48j75J92k11j78K22J34M4j33j77R5
5388e7j69J82K77j68p9m7M62l76j02K73j59J2j4L1j77L04n5k58M2J20r9L68j15
5411A96k25O8k23J34K41R1k2n26J24K65j3m21J68M70k57l00K79p7J80j83K3k00
$$ plain form
5249 92 10 198 83 162 203 88 365 -27 156 183 272 156 -171 -50 159 -19 235 -116 118 -163 -61 57
5271 57 14 143 88 12 -39 118 80 41 68 55 93 145 -116 30 -146 7 144 -7 90 -150 90 118 -315 4
5295 4 -3 -89 15 -229 -110 182 83 280 241 -31 69 85 -160 -319 186 11 -111 344 -79 14 108 -160 213
5318 213 346 109 -171 -141 -109 -20 -70 -6 -40 15 -309 -101 -155 -56 -23 -183 -62 -21 -138 3 -6 -188 -149 -55 -201
5343 -201 49 90 -125 -25 -104 -262 -62 114 45 -57 107 -29 -14 -277 -115 378 -139 -139 8 242 -148 5
5365 5 126 -29 22 -182 178 -250 105 70 129 32 -106 -18 130 -45 147 -64 -242 -20 114 158 25 -152 -57
5388 -57 -226 -44 233 65 -14 -61 401 25 -77 196 37 49 35 66 -111 193 138 -120 -78 42 -57 311 196
5411 196 -29 39 -184 -50 191 282 260 -266 -142 123 110 -311 -143 327 70 -230 49 -28 152 -31 -8 -208
5433b08K24J66j54mp7j23J99k13J73K42k60J34m13K92r3j93L58j28j54L46j39
5454b5j49R2K31l1j03l8j37j4N0j37L11K0j89J90k24n2%L4n5K38k22O4m0n2M00
5479A62k15Lj74K45M2p4K5k72N44j90L7Q3j49k25L22k15N4j13l9N6K78j81r0L1
5503e5K38p1R1m5j85K33k49Q9k31K62j84K26j27J51l24O14l44r6K0J21J27j48
5525A13J10n30M44j88K22j37K34m27O43l81L1k11Q5j82L34j38pK92l61L3j11M1
5547i1K75k85K90p9p8n2j87K48j91K99o9n05J73L22j48K31l60jK44j84l9K01l4
5570b0k18L81k7Mk30j12K62o0J28k43PK44j73m2J60j54j29J01J06k31K42Q4q4
5593dk12J65n1J17j35j99N02k11O2k46K30K18l09K29J52l40k78K82k90N09p1R
$$ plain form
5433 -208 16 182 28 24 -53 -176 23 -190 -17 225 -35 99 -314 -22 -115 -308 50 -78 -232 114 -25
5454 -25 -174 -82 149 118 15 -23 -160 -174 -124 -261 50 70 -119 71 -153 -205 -205 -171 -226 12 -210 -146 -186 -238 162
5479 162 -53 -50 -224 21 63 -11 14 -258 286 96 133 216 67 -158 164 -51 3 -110 -149 -93 185 4 -86 -55
5503 -55 183 112 203 158 -27 206 -43 46 -185 77 -107 119 -8 143 -181 433 89 -7 13 134 261 113
5525 113 223 -307 137 -51 171 34 268 -159 484 103 134 -77 8 -174 160 22 15 307 -54 -21 -132 -91
5547 -91 184 -101 189 110 32 -20 -207 41 -150 149 80 -425 -252 70 -78 153 -207 -208 36 -148 -187 14 -20
5570 -20 -238 143 116 120 -110 -222 40 -20 108 -135 -128 116 -57 -99 61 -93 -222 -121 -15 -246 -4 80 -4
5593 -4 -216 -51 -102 15 -120 -319 183 -28 34 -212 18 236 -73 156 308 -32 -310 -28 -318 191 120 129
5615A29l59k2J40J69L20k46kN0k62J34o3K7o3K88k95K37J02l55M21j85j72j74
5637a81J69j7j7K40J88m07qJ84j12J5q7j06J64j03k10J95J85Q8j40k77O05r5j04
5660A69n1P1k12k20J54Q0J50j54n3K37j87%L69k56o0qOJ12R6n68L22J77j62M3
5684E5r8K8O7m8p8m8M6J09q4oK56j99q6P6K36p5P7k72J49N9m10L61j22j92M31
5709B32n34J82k00L06j37NJ68L21l36R5k15NK15n7l21K42m9M13l35p9R7k00K86
5732A04l61J41L7J00J19m30K89J30k07K85n24L60L3k21Q4K08j27j36j78M88l39
5753a45j80K42K31k52J45q6Q1o9q3L70m9p2k97M08j56k87K89l18L47J08j91l2
5775Dn1P2j16K97k5k24P7N9m6K1r9J52J50M0j15k21K15r2j88J38l6J29j50l2K66
$$ plain form
5615 129 -230 -252 -112 57 377 131 129 179 -83 51 -12 15 -48 240 -55 182 284 -71 350 165 -7 -181
5637 -181 -12 -29 -46 194 382 -25 -33 151 39 54 -33 -139 25 -78 -288 -93 92 180 40 -237 368 273 169
5660 169 118 189 -23 -243 -89 -9 141 -13 -66 171 -16 -16 353 97 37 29 35 147 243 -325 -3 174 12 55
5684 55 -43 -15 52 4 -74 -122 -76 33 -51 -57 199 0 -86 -10 226 151 228 -44 105 164 -246 115 -7 -199 232
5709 232 -302 -120 -320 -14 -151 -146 22 343 7 102 -113 -108 107 50 -271 -29 -78 335 0 -79 18 -182 104
5732 104 -257 -116 -79 21 140 -290 -1 129 -78 207 -317 43 76 -145 -61 147 20 -116 -294 194 -145
5753 -145 -325 -83 148 -104 41 -45 36 -33 -116 254 205 133 -164 244 88 -199 90 -228 119 227 36 4
5775 4 -47 25 -91 206 181 -43 34 93 47 68 -31 121 271 311 196 -25 190 98 -90 48 12 141 -9 -41 225
5800B25k52k5k6J39k40J18l6L03j50l3P9k2J1j35K53l93K72J49l25P5R3kq1j26
5824a29K38J07l65K46n1J94m12J32J86m30J40N0J00J58l04L6J07K28l47qJ84j73
5846a13J55n62N44p7j54J46n9j24K66k2k08M60k41k2l2j58J09j76J16K07l45M26
5868A36j04p3j18J46J60j89J28J13j47K4j29k6J82K03k24r3j75J26Q9j60Rj24
5890b46J31J98j93K69j69m5K79k25r1K7L0J50j83N0K34l71K27l65n6K50J84j53
5912f8M35k48k10q1N0J06Q2J85k31k33M34K8k67M8J7j51K3O5p7K20k39L4M4O1
5936B7j24K04m7P0J31j89l55M11M5p2r4q1j95M29k62n0J85K6p0J17p9k29m9J79
5960g2k75K45L52k87j40J43J63j83J84l62J71r5j9j09L10j08K95m2K7j71j55K11
$$ plain form
5800 225 -27 -52 -78 61 -179 -61 -97 206 56 23 102 80 91 -44 209 -184 88 237 -88 -13 80 78 -3 -129
5824 -129 109 216 -149 97 46 240 -172 -40 146 -284 -144 -94 6 164 -140 -104 3 231 -116 -124 60 -113
5846 -113 42 -520 24 -53 -207 -61 -120 -244 22 0 -208 252 11 -11 -43 -201 -92 -268 -152 55 -290 136
5868 136 32 -41 -159 -13 147 -42 86 199 52 76 -53 -79 103 306 82 -11 -186 -60 29 -131 -122 -246
5890 -246 -115 83 -110 159 -10 -55 224 -1 -92 -65 -35 115 -68 -18 216 -155 72 -293 -349 -99 85 -68
5912 -68 367 119 -91 -172 -122 -16 66 251 20 -213 221 249 -18 30 47 -104 -81 -16 -93 127 -112 -78 -34 27
5936 27 -97 107 60 130 261 72 -283 128 173 101 7 -74 -269 160 -102 -152 33 59 -11 106 27 -202 -251 -72
5960 -72 -347 -102 250 -37 -177 -34 129 -54 130 -232 -61 -156 -175 -284 26 -82 213 171 198 27 -128 83
5982H3j56Q2K80j65j96L2K0j27K01r0J05k40L38n9k32mK06j16j08J79L13j51J71
6005C66m39K3j90J22J46P9p4k18L0Q3k8J04o6M2Q8L5j71nQj34L43k52q5K22L04
6030C33l75J89k75K94j19n9K46j45J00l56J85j54k9M4J47O8q0q3K54j79k28pK84
6053E5k71M35r8j4j60n5m2j6N1L04l53J20J83n8j9n2O7k18L49l19O1R7j01K46
6077A92On7q4k04l0K25m02L86m4P2k07K29O6k49K23J20k26J03m9j13K87q9l76
6100b21j97M02Qk41K08J18j89J55M0L09m01j46O3N9K42k30r7J4J08J15k78K96
6122A37J8rk23J5k22J07q8L8K04j72K48j30L59l99o6k4J15J86j10K48j67J71l0
6145B06o8J30q5l37M09l29L0L36m00R8J60j61O1J58j44R8p1K16l21k90M58J0M2
$$ plain form
5982 83 -73 9 289 124 -72 -40 -20 -147 54 -36 69 -171 167 108 -124 -128 78 -38 -146 33 346 195 366
6005 366 -73 -50 -240 -118 28 107 33 -185 -155 -72 -100 4 -62 -20 68 103 -68 -73 -65 -199 144 -108 -193 29 333
6030 333 -42 147 -128 166 47 -12 234 89 189 -167 18 -136 -165 -121 26 94 14 -69 185 6 -222 -229 55
6053 55 -216 219 121 107 -53 -108 -150 -166 -115 189 -164 -44 139 81 62 10 77 -141 208 -111 -50 47 -54 192
6077 192 198 141 57 -147 -177 48 -354 32 -12 60 -147 82 148 -101 122 242 16 119 70 -43 244 155 -221
6100 -221 -418 -16 -8 -249 -41 77 -112 43 83 392 -9 -155 -92 -33 209 -21 -118 -104 4 119 -159 137
6122 137 155 146 -77 -62 -284 -177 -265 -227 -23 -195 53 -77 282 -117 -183 -207 -92 94 -16 232 65 236 206
6145 206 138 268 183 -154 255 -74 -44 292 -108 -10 150 -11 50 208 64 162 91 307 -14 -304 154 164 206
6168B06l58K06Q0K06o2l53J94l47K77q7K53k71J46j33J12q2J6Q9q4J85J16j91
6190A18l20M45r3k77K89q7j70L26m24j17J39J40L9M8k3L5m1J5j35J45N6j11o9
6213g2J7j84M27Kj80k9l09L66j49J15J80k27o8L47l82PJ32M1k76K04n8K1L54l04
6237b5j25M00j29k66M9j13J46O3k26J91M1p7m8J50J3m0K2pK61l52M7m9p8K61K2
6262A31j47R7j96J82k83K10q0m8K64j33K42m56R0M01j59J69j78j47J09j72L68
6283B64k87P5K6j56J96L40n04j71K63j04K09K28m92L35k28J26M8K5k16J71m7k29
6305a28Q6j49Q3K0J00k11J13J46K09n79K75q0K98k66K4p3j1o4J97P3j23P1K0N2
6329H3R5l20K99p7L5j14J70k93J4J94kOj83J39k35n3K67k09K14O7L7j31J13n7
$$ plain form
6168 206 -152 54 134 340 278 -75 119 -228 49 -38 215 -56 90 -43 69 -13 3 92 8 193 309 118
6190 118 -202 243 150 -127 162 75 -95 231 -193 -310 -171 -31 8 56 33 68 27 42 -93 52 108 -3 -72
6213 -72 -55 -239 188 190 10 -19 -328 38 -111 4 184 -43 -111 236 -146 -139 -7 34 -242 -38 -96 -75 279 -25
6237 -25 -150 250 121 -145 -96 -209 -63 0 -226 -35 6 -71 -119 31 44 4 26 19 280 -72 -25 -74 -152 109 131
6262 131 -16 81 -115 67 -216 -6 -86 -134 130 -3 239 -217 -127 274 115 284 106 -41 68 -104 264
6283 264 -23 52 78 -78 118 458 -46 -217 46 -58 151 379 -113 222 -6 120 168 193 -23 148 101 -128
6305 -128 -42 -191 -108 -88 12 -199 -86 60 269 -310 -35 -115 183 -83 -59 -132 -143 -207 -10 63 -60 11 31 83
6329 83 178 -142 157 80 115 1 171 -122 -108 86 84 90 -93 46 -189 -242 25 -184 30 97 134 3 116 59
6353E9j17j72Q2R6J50k13R5J4J10k11J39l02l7K51n4Q7j33n7P0j36O4K14o9n4
6377a24L3m7J26J18p6j47L60l87J30Q7j86k13K27M25n98M34j72Pk74L16q8L02
6399B53j80j99J87Pj59J54k61J60j34J87L32k05J45j5l62R6n0R8M2l6j38j06n4
6422b38L69K24k90p5J03J96l65K37k93K97J27k70m1q2O9N17m75Q3j97K3p5K37
6444H1J42l26J7M4PJ27p4q8K22k46L64l22Q2j98L9K72r1j85K27j98J50J03l66
6467b17K58j71N8N18m11lj21J18k77J41L29k39Q3j12K65j83k25O7M47n44N76k59
6489I8q1r0M1q7J16j13j78L72L6k63K10j25K06p1M7j58kN4m4J63n51M08Q0L4j44
6514d2L51l83L16j91K91k29j43R1J34r1J79j60j03J38q1j20N9K65r3r7Mj25j24
$$ plain form
6353 59 -58 -230 -148 -52 98 -115 -20 -6 104 -107 32 -270 -307 -56 -110 -23 -156 -213 -143 -279 -215 -1 -70 -124
6377 -124 -91 -138 -12 106 30 -117 243 -144 -14 73 -113 -326 -99 326 -272 162 -10 -3 -277 39 -49 253
6399 253 73 -126 61 68 -91 63 -198 -38 -172 15 347 142 287 272 -90 6 -44 54 96 60 -78 -184 -238
6422 -238 131 355 65 -10 93 289 -76 161 -132 165 292 22 -19 -101 -32 485 10 93 -104 -81 -156 81
6444 81 223 -103 -86 -42 -35 92 18 -70 152 -94 270 -52 30 -168 -129 143 52 -133 94 -104 46 149 -217
6467 -217 41 -130 -72 446 35 32 -89 29 -248 -107 222 -17 66 -46 219 36 -189 -122 325 -219 357 98
6489 98 17 -73 -32 -119 -3 -116 -294 78 114 -149 61 -64 142 71 118 -40 -42 12 -32 131 -420 -12 68 102 -42
6514 -42 309 -74 242 51 342 113 -30 61 195 104 283 123 20 158 77 -43 16 281 188 91 95 -30 -154
6537a54J58O5j7r5j80M67j4l26K36m36L54j73J56k79J18j07NJ78K05n6O6Kk10
6560c7L6K87k48K03j02k34Q7J80L48p68O0M04j90mJ98j66J3j41Q8k48K48M5M6
6583A05k14J35k13L81j67J4M5l01M72k68j06n7L30k92j00K41j3j80P0J87k89P26
6605E06p03j8N65m62J13q3J6j04o6K81O3m64J55L4q8J87mJ30L4k15K39l09J69
6628b4L8M20n28J34k41K76J56m12J06J76j49k9K73j53mR2k82K68j49M7r4k48L28
6651AJ62l8j80J73k6q6P7P2J32l13O6J48l76j09K07J32R1r3L35m21l34L87NN5
6675F7j32M3L96k81j68L70l00j15J95kRj47Q4j95K35k41K54o0R1K85l46NJ2K46
6699C05m32K59l4L7n6j46l2J14J03lk55k8K93O1l18M34l11j00Q7L1J20k08J28
$$ plain form
6537 -154 4 69 52 -43 -223 244 230 -96 140 -296 58 -115 41 -238 -120 -227 -222 -44 161 105 171 173 -37
6560 -37 -1 286 38 241 139 -95 -8 172 520 -248 -188 216 26 22 220 54 67 -74 14 -234 14 59 105
6583 105 -109 26 -187 194 27 41 86 -215 257 -11 -117 -174 156 -136 -236 5 -8 -188 -118 69 -220 506
6605 506 -197 -215 350 -112 1 -82 -66 -170 -236 45 108 -356 -201 -167 -255 -68 -72 58 92 -123 116 -193 -24
6628 -24 14 434 -94 40 -201 75 231 -181 -75 101 -48 -77 196 43 39 131 -151 117 -32 15 -79 -327 1
6651 1 163 125 -55 118 92 6 83 155 287 -26 40 188 -188 -297 -90 42 133 40 375 -46 -380 7 12 67
6675 67 -65 -22 374 93 -75 295 -5 -120 75 73 82 -65 19 -176 59 -182 72 12 103 388 42 47 59 305
6699 305 -127 132 98 135 79 -67 -99 15 118 115 -140 -168 125 186 -132 302 -9 -109 -22 9 129 -79 49
6722D9L19j73l1l50L05l2j6K08l45L43k69J74j60O4J09k07M50l26Oq4J60j44l1
6745A9No5JMp0Q8j18K58J5j40n7L3j80J48j44R8J92o4m2n5j20J46k06J37j23K36
6771dM8j71K06K5j35k69L43j9k48J80l6J98n1j96N4l2l6J28p0J76O4j60n6J66
6795A05l9k51K14J41j06j06J31M7K1jk66Q8J26j42ppj14j55L83l12K36q7K96L7
6819B32p6L3j33r6K46l36L34k56Q4m0l8K47k37J75O2j34k36L1M42j45k32J21J87
6842B35j94K30l19k24M26l9l15L29j27J30l91Q4J93r5J49k85K2J61r9K42k51r8
6864b36J71J00j86L04j92n4K87k01J4j10J80o9K09k31k22K34j8J41j36L30k44
6885G1j09l08J63L53o1k93K92j11K02r9N7j21r3q5j80J57K14L6J9k71J37Q7l46
$$ plain form
6722 49 368 195 164 -186 119 87 71 279 -66 277 8 182 22 86 195 -12 438 112 118 34 194 50 19
6745 19 24 -41 -40 -36 -106 -18 -136 122 137 -3 -60 -27 -207 -59 -203 -105 87 23 -19 -74 -194 -48 -254 -117 -240 -4
6771 -4 44 -127 79 104 -31 -300 43 24 -224 -44 -80 118 67 -129 -75 -107 -143 -15 -85 91 155 -5 -61 105
6795 105 66 -185 29 170 64 -42 89 136 157 156 -110 -22 104 -38 -45 -52 -166 -321 62 -250 -14 -101 195 232
6819 232 156 189 56 -40 206 -130 204 -52 32 -8 -46 201 -36 139 201 67 -169 -138 304 159 -73 48 235
6842 235 41 271 -48 -272 154 115 -200 129 2 132 -259 -175 18 -77 72 -213 -191 -30 -129 113 -138 -236
6864 -236 -65 35 -151 153 -39 -93 194 -7 7 -103 77 8 217 -14 -236 -2 -20 121 -15 315 71
6885 71 -38 -346 -183 170 109 -184 108 -3 199 100 157 36 -57 -142 -322 -165 49 85 104 -167 -30 57 -289
6908b89K11J9N1r8K16j34K2J84M7p03P55j42j13O5k14L82k18R2k64J90j76p1Q4
6931a04M2n3L61k61Om0k1K44m8l5N6M9j2O7l40J4M45j32m10K92M2j70l6j31K63
6956H8l87P54j19m37M20j90qk14K60k26k59O2J10J92J33j55J65j3l6r3j24K1Q8
6979C2j06p3k4K6J74K85l72j05j44K64J32l53L49j03j9L6j71J88O1k08J42j97
7001a86J91r0j29L16l8k34L2M8J67k04K0j5K39k4k41r5l6L82j51n9P4J18k45j76
7025c36K71P6K2J02j83j29K69o5Pj95L07l49M88m39J98M7J14j75k92J88R1J92
7047B09l06j6O0PJ64l20L85j02o9J02l1K07j58k42J72l47P9J65j57M17k66J74
7069A27k85jj2K53JJ00j63j89L78k98r5J31j14K07j0l88M79j71M5J52j74J42O3
$$ plain form
6908 -289 -78 -59 -8 -106 110 -24 -2 182 229 -474 281 139 26 91 -123 259 41 133 -131 59 -117 -188 -104
6931 -104 -62 -115 246 -15 -9 -49 -70 174 126 91 147 196 184 251 -89 -75 370 238 -172 120 162 -8 -44 -175 88
6956 88 -299 455 336 -101 319 129 121 -93 167 -59 -318 -256 -146 46 179 24 189 176 140 47 -77 -56 32
6979 32 -74 -147 -171 -145 29 314 -58 -163 -307 -43 89 -264 85 -18 -37 -1 -172 16 77 -131 11 -186
7001 -186 5 -85 -214 102 64 -170 -138 -90 77 -127 -107 -122 117 93 -148 -243 -279 103 -48 -107 -33 85 -160 -336
7025 -336 -65 11 33 135 -48 -177 92 27 34 -161 146 -203 285 -154 44 91 205 30 -262 -74 17 209
7047 209 -97 -113 -53 -46 118 -202 183 81 12 114 83 290 132 -110 62 -285 -206 -41 -198 219 -47 127
7069 127 -158 -159 -171 82 83 183 20 -169 209 -89 -184 -53 -167 40 30 -358 121 -50 -5 147 -27 115 178
7092A78l51Q6Q4j99L81r5j76j68L08L4O2P1l5n2j6j2j41J78k62PK87l17M88n24
7116a84P4R3j2J19k23J01j64J08J54k79J09k19N77k24J49k62m2K21J02k11K18
7137B05k26o6N7K4j13J92l8k51M91m51M53j28k36R6k43l0M4M17j6l41J41n6O7
7160hJ69j95j18J85l2K1k54L09j96K64j9o6J23k76j06J37j39J52n0L26l45L04
7182A86m73M50j60P%q5l3mq9J15K09l03M7K70k21R9Lpk19J47L1O2J5m07N83m66
7208b43L71p4j64L06m79L62k04L16m37L17O5k95J28J66K74n92K71k35J90j04j27
7229a88O5J91k47p4L9K46l17J65k5J16n0j9n5j9k4K4j28M11J25k20j30P9m6K15
7253A34j91O3L25l45J41j35q0R3L00j0k76Q2k8P9m56K58J74q0r6l0j18L10k15
$$ plain form
7092 178 -173 -87 -3 -202 179 84 -92 -260 48 82 144 215 180 128 112 100 -41 137 -125 -118 169 -148 340 -184
7116 -184 -110 -17 -29 90 -133 -32 -196 -88 66 -213 -104 -323 254 30 179 -83 -125 96 198 -13 205
7137 205 -21 -87 -30 -6 -119 73 35 -216 275 -176 277 149 -87 9 -234 -264 -220 197 181 -160 -19 -75 -8
7160 -8 161 -34 -152 33 1 22 -232 77 -119 145 126 60 183 -93 -199 -62 -201 -49 -99 227 -118 186
7182 186 -287 163 3 10 10 -75 -108 -112 -201 -86 123 -180 -133 137 -84 15 18 11 -208 -61 -30 32 47 -360 223 -243
7208 -243 128 54 -110 196 -283 79 -125 191 -246 71 136 -159 -31 135 409 -183 88 -147 43 -61 -188
7229 -188 -123 68 -179 -253 -214 32 -285 -120 -145 -29 -79 -98 -153 -172 -196 -172 -300 111 236 16 -114 -35 -81 134
7253 134 -57 6 331 -14 127 -8 -88 5 305 295 19 101 73 152 -304 -46 128 48 -48 -78 -196 114 -101
7276a01J26k51K05L4j7J71j31q0L0j12L5k46J04L93j06o8q5j34L97l33K17o6j94
7299b12J36NO9M43m88m8r9J97K02m10q5K69L9J22j50K55l03K82k72o5J81k41K05
7322C2J26j42J63j56q6J6j77K57M4j94j7J74O4j7j04O5j51J18L7K4R0L3j24l8
7346C7K6k44K55N7j49K09k34mOo3j18J62K37k66J42j82k9J98j44q5J82j64K33
7369F2l5k73K44j44J9l2L51l42N6J71l61J76m9J83j07J59m08K54p8j3N08m28Q5
7392bj62J63j73k5J49j55j3JM9P7j11J13Q4m0j55K85N8j05l15R0J04k07J74K56
7416A40l43K25J01k7l6k9J94R3j60j77q5k24K51J54m49K68K97r9j04MJ96k32L
7439c9L63n16OK0L04K5n6j49J71k51J58l22N72k59q5k80K19j42L53J31j64M5M6
$$ plain form
7276 -101 25 -226 -21 13 -4 167 36 -44 -14 -126 -91 -337 -233 160 54 -14 -99 -233 164 -169 48 -18 -212
7299 -212 -76 -71 -2 441 -47 -95 -194 3 205 -205 -290 -21 18 140 -10 245 -58 224 -48 -113 68 -173 32
7322 32 158 16 179 23 -63 -47 -224 33 77 -117 -134 40 104 87 -17 48 -103 15 52 76 166 199 75 37
7346 37 63 -181 74 131 -18 191 -43 -47 -41 -104 -222 -60 177 -89 53 -129 -158 40 -104 -189 -7 -171 62
7369 62 27 -246 -2 -146 -127 -159 192 -150 -94 77 -284 -108 -157 26 -81 78 -330 -76 -154 -167 341 -87 -2
7392 -2 -164 -1 -174 -199 -50 -205 -218 -217 -168 -91 -202 -89 -5 -45 -200 85 143 38 -277 -187 -83 -290 -116 140
7416 140 -203 22 123 96 60 31 225 318 158 -19 -104 -328 -77 77 -372 -104 193 94 -10 -6 190 -42 -39
7439 -39 324 -192 -186 -166 138 163 107 -42 129 -122 36 -286 286 27 -58 -338 -119 -261 92 223 59 104 150
7462A50o1J5j0qQ7k36j63K55j80nQ1K6p5M25O8m93L02O0k32n5k04M69k55j2j85
7487b36j07Q32n73m6J75j84J31k0J75J31j62N5k70o0J26J9K57k89Jj27O3J41k11
7510a79J29j92L21L8k96J1J98m6R3j07p0L73k49Nk48K8N18l79K61j69j83L8m1
7533a46k33M17k52J79J9j5J84j86J77k39K36J00l95n7K18J13M4l44K51j0J59l94
7555a74L72l81L38m8j84l70L74K57j68J80l09n1J83o2J85j36J82k0M3k04j39Q4
7577d8pK46k80R6J53j27J43j88M4J85k46K04j10n7N6k25K30j25K55k56j38J80
7599a5J01k5L4r1J88m4j00Q5m02L90J45j91k39J04K22k34L53m13k13K93O3O7J55
7622B33l46L52r6j02K0l51J90J94j37K02l63L7L08j17j61K69j75L17k84k34K98
$$ plain form
7462 150 89 104 94 86 173 -63 -226 29 -151 -156 -75 -49 -124 301 369 -124 178 238 6 -49 -253 216 -39 -51 -236
7487 -236 -343 489 -84 -130 45 -139 -8 -28 147 278 116 171 -99 -159 -33 -14 243 -46 -45 -172 -109 32 -179
7510 -179 -50 -242 79 117 -179 -168 30 -16 77 -30 -100 273 24 29 -219 -191 327 -52 209 40 -143 -105 -146
7533 -146 -379 38 -214 -35 -16 -31 153 -33 144 -95 141 241 -154 -211 7 120 164 -180 71 61 220 -174
7555 -174 198 -183 155 107 -77 -447 -73 184 16 196 -113 -164 19 -43 142 6 188 168 211 7 -132 -48
7577 -48 -55 191 -89 7 160 33 176 -12 32 217 -29 175 65 8 64 -161 69 -56 199 -57 -195 -15
7599 -15 86 61 95 4 192 148 48 133 -269 121 266 75 -164 -60 162 -72 281 -132 -345 -52 11 78 233
7622 233 -113 239 143 41 61 -290 -100 94 -43 159 -204 -167 141 24 -137 132 -43 274 -10 -244 54
7643E4Q0p9n5j00L21r0rL2M3l71J85k8qj01k00N34OO9m43r4L58l65K21O2o5j15
7669a58K43n7oQ5L9j87r2L81j85k42J6L20j88J42j87k05K84J58k43j90R9O2M2
7692f9M4n3J96k43J76k37L28k1k63K13K6o8J1N6Q6k49K07J26k02O7Rk15J58r2
7716iK18j26O8k59m3K12qj94N8J81J48m88L52k66J31N9n9oP7j24k2J82k32K55
7740A05N6m61M51K6j51OQ7j50l4m9J57N6O8j35k8J38k14k20J68k5O8J17l10M30
7764A56j77j3n2L09k34m0r2o0J05O7l1n1M4rJ16L65l73K02l14Q8m8j05l2K3l4
7789a90J52k97M41o7n6o1J19jk42j9K57R9l76K67j28N7r8J43k6%k81N98l60%N6
7814a3O8N2j0J0lL38n68J37k20K20J21N2k27k89M68L9l38j41Q2J79K54o3Q5l65
$$ plain form
7643 54 134 55 0 -100 221 131 122 154 197 -174 11 -17 -25 -126 -326 208 214 283 -160 -254 104 -261 -40 22 -43 -158
7669 -158 85 28 22 107 146 -41 -133 248 63 -179 -163 157 -31 111 -76 -281 3 161 -82 -272 -173 -111 -69
7692 -69 -25 -78 118 -125 51 -186 142 121 -142 71 97 29 40 96 182 -67 140 266 64 131 140 -75 83 -9
7716 -9 209 83 151 -108 -151 61 53 -141 -83 98 246 -242 110 -156 -25 34 -25 -31 46 -78 -100 82 -150 105
7740 105 161 -300 151 177 26 32 119 -31 -65 -114 43 99 167 32 4 142 -72 -292 -124 -149 -81 36 -274 156
7764 156 -21 -34 -86 223 -11 -51 -143 -203 -98 -31 -62 -113 -69 -78 38 403 30 232 -82 6 -42 -147 -179 -156 -190
7789 -190 -38 -335 106 39 -17 -78 41 40 -202 -221 36 135 -241 26 -102 -45 -143 0 -26 -26 -307 291 -69 -69 -13
7814 -13 55 107 97 107 104 442 -126 11 -209 11 132 184 -43 -332 136 175 -163 -304 -222 -43 211 148 233 -132
7838a32K09m14J25m7K33QJk14J75L52k52j85m3J49O7j88K48J98m03L48j57Q2p3
7861H7l98K25o0L10k86R2L32m09L17l56j09K26K44k53j49J52M0n2J30j22l46M82
7883I7r6l54L31R0K4j9K97p48K98J68Jk46N9M4r1J54k31P6L6rJ28m7j1J36k76
7908a89J20Kk7P5k79N07l25R4pj80J26k92K51L37m16J76j88Q0r4L11L2j00r8M55
7932C71l76l70K44K10j31j09Q2K51l7j90L28k59j14J35j12M82j83k35Q9J38m15
7953b01L30j38j53K09k70O1j51N34l47R2K04j37J38k42O6Q9j57j09K99j28J65
7974A54l29J02J44m05L03Q4j5P4q2M9k1l6j34L25k57J98k39Q9j57K06K03j59N3
7997A50k67L48m3k88J51m37K78J43j19l9J95j51Q3j74M8K99l4j16n9k12L93k38
$$ plain form
7838 -132 77 -337 -212 -259 -26 -18 -17 -231 -56 296 44 -141 -184 -35 32 -156 92 290 -113 235 78 160 87
7861 87 -311 -86 -146 164 -122 -30 302 -107 210 -146 -255 -29 215 -38 -187 -35 5 -47 83 -39 -385 97
7883 97 1 -353 -22 68 92 73 370 -378 -80 88 89 -157 -98 -54 -145 9 -222 -146 -110 -119 9 -38 -49 87 -189
7908 -189 -69 -67 -94 -19 -298 209 -116 -22 -29 -209 -83 -375 -124 213 -203 -27 -215 -135 -229 82 114 14 -84 371
7932 371 -5 -375 -131 79 -52 -161 -79 172 135 -55 273 14 -100 35 -77 405 222 -13 76 214 -201
7953 -201 129 -9 -162 47 -223 -162 -313 221 -126 -34 170 33 171 -71 -5 84 -73 -182 117 -11 154
7974 154 -175 -73 71 -334 -31 53 38 112 30 79 58 22 -112 213 -44 154 -85 4 -153 53 256 97 150
7997 150 -117 231 188 -100 51 -386 -108 35 -84 -123 72 -79 4 -170 -122 177 143 27 -32 -244 149 -89
8019h9rK5K13l8r4k38J49q2K52j87J95m80L54K7k22K05J10j78L3j11K56J4k13
8042a08K51mK7j85l54M50l09K46P8q9K04n5m54L76J38l43J76k54r9M82O8m37K04
8065Il7J12o8J02M1j81P1l59J50K30j97J46J65j23J20j36n2Pj03J97n7l01M9K76
8089F1q7J10L0j25l8n2K65j81J63j43m5M0P8R5M8k82j32K45j40n8J28o4j03L63
8113A76k88O7K09k9m58J47K49j12J26j14N2Q0j4N2l8J5N9r8j83J41k11K60o2j1
8137A5J35j03l78K45j4k61J42N7K71J13j07n63L75K1k66M03j50k8k11K74j75K71
8159F6n9j41J90J88p8l58K49n3n3L82m19K42j82K80j84p3k5j22j05N75m95K99
8181A24j16O3K2j2j27J51o0j83m0q9
$$ plain form
8019 -89 -98 -73 140 102 8 -230 -81 -163 89 -98 97 -383 -29 -2 -224 -19 91 -87 -54 -165 91 105 -108
8042 -108 143 139 166 -19 -373 77 -232 14 92 3 207 152 -302 74 212 -131 45 -209 -308 174 242 -195 9
8065 9 -28 84 16 118 159 -22 49 -310 -160 70 -127 19 184 61 181 45 -7 0 -103 94 37 -264 -215 61
8089 61 -26 84 114 -11 -49 -101 164 -17 146 3 -42 -2 76 171 219 -63 -195 50 -90 -148 -20 -84 -187 176
8113 176 -112 -45 164 135 -323 -176 73 -39 87 -27 25 105 91 143 105 120 179 81 -102 39 -172 88 26 15
8137 15 150 47 -331 -86 -100 -361 -219 -162 109 222 115 -448 -73 -52 -318 85 -65 -93 -304 -30 -205 66
8159 66 7 -134 56 244 166 -192 57 4 -49 333 -86 156 -26 254 70 -3 -28 -150 -255 320 -175 124
8181 124 8 71 93 81 -46 105 45 -138 -178 -267
8191b67
$$ Imaginary data points
##PAGE= N=2
##DATA TABLE= (X++(I..I)), XYDATA
0@%%%%QqQj6J6j6K4l8M6n6P0q4J00j18J36j60J91k22K55k94L40l88M44n08N74
29C04o48P31q21R22j032J152j286J431j590J764j955K165k398K656k940L257l613
46a901M012m465M985n586O292p136Q163r448J1113j3358J6571k1592L0596n1651
60c3405J87250J06184m05692l3322K40187Q7960k12029n4578J54607O9507j34238
71b7569m6695R3363N2031o4197j8119L0458j9113n5363L5059P8035J107o9912
83a0915j8773L4608J6499j9534r02J3976j1175l2407L342L9903J7442l2596k3647
96b4179K5399K5144k3466j7599L6038K0916n6722m7940M9612O0166l5931n2465
108d1027L9788M8762n0163n6116N3712O3155n0322o5055M1667N6028m1462m0133
$$ plain form
0 0 0 0 0 0 8 0 8 -8 8 -8 16 -22 24 -32 38 -46 54 -64 72 -88 103 -119 136 -158 182 -206 238 -270 304
29 304 -344 387 -434 488 -544 608 -678 753 -837 927 -1028 1137 -1261 1395 -1545 1712 -1901
46 -1901 2111 -2354 2631 -2955 3337 -3799 4364 -5084 6029 -7329 9242 -12350 18246 -33405
60 -33405 153845 260029 -145663 -178985 61202 149162 -62867 -117445 37162 106669 -27569
71 -27569 -74264 19099 71130 6933 -11186 19272 159 -55204 -20145 57890 58997 -10915
83 -10915 -29688 4920 21419 1885 983 14959 3784 -28623 -25281 14622 32064 -532 -24179
96 -24179 1220 26364 2898 -14701 21337 42253 -14469 -62409 -12797 47369 11438 -41027
108 -41027 -1239 47523 -2640 -58756 -5044 58111 7789 -57266 -15599 40429 -1033 -41166
120d1166N7902M1937o8601n5285N9078N3271n3617m5984N0227M0599n1067l5229
132d7935N6257M1864m8509m2069L6138L1850l4059k7928L2638K8043k8826k8750
144c1286K2229L0271j0691k2434N186J1590j5035j6584K1568L4522j0657m3010
156b4331k310M4617J3422m3785k2037L9447K3672m1026k9868M1959M1672k7799
168A3633m0851J5631K8121j2662j4009J8441N264k7053m808L0592M589k9139J908
181a0343L2576o301l7890N637M0728l936m1065J254L7807J301l0039M980K6806
194B1515j1331l0993J0317L2749o611l2213j67K7004N129j7089j45J5290o90j8453
208e688q092J1964J2909j617j1695m918N148P508R25j133j53n874q315J641J0521
$$ plain form
120 -41166 16736 58673 -9928 -65213 -6135 47136 -6481 -52465 -2238 38361 -12706 -47935
132 -47935 8322 50186 1677 -40392 -4254 27596 -6463 -34391 -1753 26290 -2536 -31286
144 -31286 -9057 21214 10523 -11911 -6725 4865 -10170 -26754 -5186 29336 18679 -24331
156 -24331 -26641 17976 31398 -12387 -34424 5023 28695 -12331 -42199 -240 41432 13633
168 13633 -27218 -11587 16534 3872 -10137 8304 13568 -13485 -18293 12299 16888 -12251 -10343
181 -10343 22233 15932 -21958 -16321 24407 20471 -20594 -19340 18467 19768 -10271 -5291 21515
194 21515 10184 -20809 -10492 22257 15646 -16567 -16734 10270 15399 -1690 -1835 13455 12765 -5688
208 -5688 -13780 -1816 11093 9476 -2219 -7137 -1989 5519 6444 5311 5158 -716 -9031 -7390 3131
223C131J552n801M592Q654r755j6418Q357J9478p836k4645L396K4062J810j6315
237e738K466J3589p572j7845O009J7496n057j3760O430J1587q649j0605R987J1140
251I478j0714j4007O758J1533k266n139N096L404p160m827L423L762P32O94k428
266a661n373o80O749J982n549j22O324p86o797R05O924N99m653l46M28k425K153
283b328P586j580j0194j288Q866L78p273L764J0337l740j2708L134J2862j194
297F622j1262J519Q698l827p832O474J0608o372j2201J071Q187J659m73M150J206
312H227p068l345L760K100k190P20K396k826k645N036M792m246n496l39L15r06
328a715M066N932j2m495M39R49m298k077M783J287p414j360R890M302q555l931
$$ plain form
223 3131 4683 -1118 3474 12128 2373 -14045 -5688 13790 5954 -18691 -15295 8767 10577 -5738
237 -5738 -3272 10317 2745 -15100 -9091 8405 3348 -10412 -3982 7605 -1044 -11649 -1662 9478
251 9478 -1236 -15243 -8485 3048 782 -4357 739 4143 -3017 -7844 -4421 -659 73 767 -1661
266 -1661 -7034 -7714 -965 1017 -4532 -4654 1670 884 -5913 -5008 1916 2515 -2138 -2484 -2056 -4481 -2328
283 -2328 5258 3678 -6516 -7804 1062 1440 -5833 -2069 8268 4528 -8180 -5046 7816 6622
297 6622 -4640 -3121 5577 1750 -6082 392 11000 4628 -7573 -6502 1685 3344 2871 7021 8227
312 8227 1159 -2186 1574 3674 1484 2204 4600 1774 -871 4165 8957 4711 -785 -1124 -809 -1715
328 -1715 2351 8283 8271 3776 4215 5164 866 -1211 3572 4859 -2555 -3915 5975 10277 1722 -2209
344b209N841P04q109K12J0834J777r837k937P227J583o226o40N661o54o305O12
360b466M180m21l704N45J738p74r8L303J813k224k404j282j437l77J444M38r66
377b692J448K057o89j520N28j263l637O55M697j41m556L099P111l086r246J472
393e763R327k918j0798K313J0461j948j0149M131J2229k676j1599J683R482l032
407G43q701L511P835m289o504M910O741m067n729M629L653n671m081N168M831
422B979k910k148M056J120m191j791L884O39l644j019L086K317k018k042R20L138
438B376Q82k718j289K553K178l003k344L325K401m376l676N109M189m720l184
453b297O168L387q340m646P600N269o366l658O555K984p116k189P609K194q452
$$ plain form
344 -2209 3632 4336 -3773 -3561 7273 9050 -787 -3724 3503 5086 -1140 -1780 3881 3227 -3078 -2466
360 -2466 1714 1293 -2411 -1866 -128 -902 -1000 2303 4116 1892 -512 -1794 -3231 -3608 -2164 -1726 -2692
377 -2692 -1244 813 124 -1396 -868 -2131 -5768 -5113 -416 -557 -5113 -2014 5097 2011 -7235 -5763
393 -5763 3564 646 -10152 -7839 2622 674 -9475 -5344 6885 4209 -7390 -5707 3775 743
407 743 -7958 -4447 3388 -901 -7405 -2495 4246 179 -5550 -921 2732 -2939 -7020 -1852 2979
422 2979 69 -2079 1977 3097 -1094 -2885 999 1638 -2006 -3025 61 2378 360 -1682 -762 2376
438 2376 3258 540 -749 1804 3982 979 -1365 1960 4361 -15 -3691 1418 5607 887 -2297
453 -2297 3871 7258 -1082 -5728 1872 7141 775 -2883 3672 6656 -460 -2649 4960 7154 -1298
468a298k988O034N18n860J218Q252J00o927j71O210r79p220p98O032m71n092L09
485c131O060J754l808k405J286k16j894p67J594L183o32j959K93K594r19m431
501c398q31L998M64l989K7M533k3n701J386N702j440o339K189P471k351q275K027
518d550P847l602q888M287R295k839q155M686P238o372q786O217R382n672q074
533g986N628Q275m353p085L200N493n417m672M594N429k931k629L485J983m629
548a615k579M302L133k036k475J251J446q41j399M56J245j30r21O75K430J000
564C942k795j314J475Q72k576k23M409J139l674j690M060Q12o131j338O587K770
580F325n629j971O131J964p000k143N923K777n778j747M922K41m777N14M828j493
$$ plain form
468 -1298 -4286 1748 2266 -3594 -2376 5876 5976 -951 -1122 5088 4109 -3111 -3909 2123 1652 -3440 -3131
485 -3131 2929 4683 875 -1530 -244 -460 -2354 -3121 -1527 1656 1024 -935 -642 1952 1033 -3398
501 -3398 -4229 -231 233 -3756 -3729 804 781 -4920 -3534 2168 728 -5611 -3422 4049 1698 -6577 -4550
518 -4550 3297 -305 -9193 -4906 4389 1550 -6605 -1919 5319 -1053 -9839 -3622 5760 88 -7986
533 -7986 -2358 5917 1564 -5521 -2321 3172 -2245 -6917 -2323 3106 175 -2454 1031 3014 -1615
548 -1615 -4194 108 3241 1205 -1270 -19 1427 586 -813 -357 888 758 -163 512 2942 3942
564 3942 1147 -167 1308 2180 -396 -619 3790 4929 1255 -435 3625 4437 -1694 -3032 3555 6325
580 6325 696 -1275 4856 6820 -180 -2323 3600 6377 599 -1148 3774 4015 -762 -248 4580 3087
596C087m730J815N229j947m508K504M457l881o064K796N407j208l189J345K556
611C669k242l078J043J488q76l6J957l13k346L72K220O7k950j326O58J447j8p10
629i74r10J639K118j691l830k28M128J781l522j299K545M82l018n03K228o33j610
646c297J768K396k936k793L325L458l732l796M134M014m209l673M019L641l912
661a593l073K982K021m129n68M528J180m723o10N637L56n985Q7O012O89n873k171
678e233M563J933k403n54K221n28r82O24Q82j307l24J934J022k320n91K623J454
695C014k265k299N56K106O99j599j129J244K145m59k313k03K773J202k654j251
711d33J854P49j732L7J312o23j483J952K207k705k819J894L242j923k766K495
$$ plain form
596 3087 -1643 172 5401 3454 -1054 1450 5907 2026 -4038 -1242 4165 2957 -232 1113 3669
611 3669 1427 -1651 -608 880 4 -32 1925 1612 -734 -362 1858 1925 -1025 -2351 -1693 -246 -264 -974
629 -974 -1884 -245 1873 182 -3648 -3876 252 2033 -1489 -2788 -243 239 -2779 -3282 -1054 -1687 -3297
646 -3297 -1529 867 -2069 -4862 -1537 1921 -1811 -5607 -1473 2541 -1668 -5341 -1322 2319 -1593
661 -1593 -4666 -1684 337 -3792 -4360 168 1348 -3375 -3985 1652 2008 -3977 -3890 2122 2811 -3062 -5233
678 -5233 -670 1263 -1140 -1694 527 -1 -983 -359 523 -784 -1108 826 1848 -472 -1063 1560 3014
695 3014 749 -1550 -994 1112 1811 212 -917 327 2472 2013 -300 -503 2270 3472 818 -433
711 -433 1421 2170 438 475 1787 1164 -319 1633 3840 1135 -1684 210 3452 1529 -1237 1258
727A258K273j694k107K414M39l355n67L840l37m730Q62N381j6n891n40N329M71
744C030n080J32M270P77m258j210K705j29j052M23K04j381L19K544m89l441j89
761b825K918O5j685k90K459J87j630m14m43q07O26J253m54r52Q04J146m80j186
779a708K27L24j157M93K059j15k497Q51L308j889m334J548M414j212m032J869
795a851L906j457l668R07L303j585j915J935J790j639n37K134n88l739N96M222
811A814M59l203N4L554k02l379m11K242p1j004J058J485j195o72J821N2k439o49
829f86J524Q87o17O66J86o48K49P14p55j793R18K686r97k595J089K693j394k517
847c90J052K235r58j081J547K47k529m81K750n2k673P77L347j459l569J247M246
$$ plain form
727 1258 3531 1837 -270 2144 2583 -772 -1339 2501 2164 -2566 -1704 3677 3661 -2230 -2770 2559 3030
744 3030 -2050 -1918 2352 3129 -1129 -2339 366 237 -815 -392 -188 -1569 -1250 1294 805 -2636 -2825
761 -2825 93 158 -1527 -1817 642 829 -801 -1215 -1658 -2465 -1839 -586 -1040 -1992 -1188 -42 -522 -1708
779 -1708 -1481 -1157 -2314 -1821 238 123 -2374 -1523 1785 -104 -4438 -2890 1524 312 -3720 -1851
795 -1851 2055 598 -3070 -2163 1140 -445 -2360 -425 1365 -274 -811 1323 735 -3004 -2408 1814
811 1814 2273 -930 -876 2678 2476 -903 -1314 928 857 -147 911 2396 1201 529 2350 2402 -37 -686
829 -686 838 1725 1108 1774 1960 1312 1561 2275 1520 -273 645 3331 2334 -261 828 3521 2127 -390
847 -390 662 2897 1939 858 2405 2652 123 -358 2392 2340 -333 444 3791 2332 -1237 10 4256
864D256k521m201J541L446r64k536K454J864l356k068K115J790k130j148J979
879E21N19j923r7K402j79k391L03P72j093j238J884J722j868j907J565J500r55
896d63p31L66O11r47p73N32K83n20K63K89n89K77P15k64j455K77J158q71p47J547
916a042P97j326r84K186P15j976r79J235J47j577J441J824m67k611J561J698p14
933g2j723R35J266j801j270J941J720j441o75K088M43k967o23K711L85j645l10
950a038J694K52j196K76J698n80j341K46Q35r51m95J584R45r76n82L64J75o01
968C09R30Q74j249p59M85R6o23P40J410p63j377N93J242j026j179J255O94j738
986h6o85K616J330j782j664J452P57k519p70K962M06k757o53K531J410k173p82
$$ plain form
864 4256 1735 -2466 -925 2521 1557 -979 1475 3339 -17 -2085 30 1820 -310 -1458 521
879 521 1040 -883 -980 1422 1243 -1148 -845 -73 -1166 -2404 -520 1202 -666 -2573 -1008 492 -463
896 -463 -1194 -828 -217 -1164 -1937 -1405 -1122 -1642 -1379 -1090 -1679 -1402 -687 -951 -2406 -2129 -971 -1842 -2589 -1042
916 -1042 -245 -1571 -2555 -369 346 -1630 -2609 -1374 -1227 -2804 -1363 461 -6 -2617 -1056 642 -72
933 -72 -1795 -860 406 -1395 -2665 -724 996 -445 -1120 968 1411 -1556 -2179 532 917 -728 -1038
950 -1038 656 908 -288 -12 1686 1106 -235 11 846 -105 -600 984 1929 953 371 735 910 309
968 309 1239 2113 864 105 590 686 63 803 2213 1450 73 666 1908 882 -297 958 1652 -86
986 -86 -771 1845 3175 1393 -271 1181 1938 -581 -1351 1611 2017 -740 -1393 1138 2548 375 -407
1003d07Q69k57j456J309J528j075j722L98J433n91r25Q12R49j636j429J311J414
1020E25m69r12l78M78N62n4N63j92q82j239q07P85J790N04q50m08P7M8n62N98
1040h23O94j013j067N51K201k19j528N00Q92j515j245Q50K257q46j217Q72O22
1057c4n08n59J686M79j851p06J936N59j537m81J693k45j929R9K743K39j588k72
1075b76J329M0k039P78J827m15p23L19M73k91p84O56L31r09o43R14Q43O6k49O65
1095A912M2q61m64Q6O20M18j07n63l08J99M60k57n53M86J93q82P3J439O1j689
1115C05j45N81Q62q17J2Q62j04k027k54J584K32r56P2P98p95r42J319J858j494
1134I51k042K12Q76k7j32J355K38k131j614J358J766r03j053J14O27j026L65J175
$$ plain form
1003 -407 462 205 -1251 58 1586 511 -1211 -813 620 29 -896 -84 865 -771 -2200 -889 525
1020 525 56 -856 -1234 -756 -194 -248 315 123 -759 -1998 -2805 -2020 -230 274 -576 -984 -907 -859 -1421 -823
1040 -823 -129 -1142 -2209 -1658 543 324 -1204 -704 188 -1327 -2572 -1722 535 -311 -1528 -656 -34
1057 -34 -542 -1101 585 1064 -787 -1493 443 1002 -535 -1016 677 432 -1497 -1398 1345 1584 -4 -276
1075 -276 1053 1093 -946 -168 1659 1244 521 840 1313 1022 238 894 1225 316 -327 587 1430 1496 1247 1912
1095 1912 1954 1093 629 715 1335 1753 1646 1083 775 974 1434 1177 624 1110 1303 421 494 1933 1994 305
1115 305 160 741 1603 786 798 1660 1556 -471 -725 859 1091 135 207 1005 210 -732 587 2445 951
1134 951 -1091 -879 -3 -30 -162 1193 1431 -700 -2314 -956 810 -93 -1146 -1032 -405 -1431 -1066 109
1152A09O30j073j172l11L71L57N47l0p60n44OM20R14L98p35j081p1J229m25O4
1172a157O64J2r95j059J225R28p26m74K92K70j357N35K057K95k006M7J495p1j755
1191a780M38K149j99k975J0K602J74j731O43J928p95j664M88J699q29j074K25
1208f91J698q94p55J260P46r52j279J029N76n21K4N20L43q12J11J090Q2m35n26
1227F14O6n24J62N67N57n89l64l82K30P96P14j96q54k15m6p66Q4J629P86j642
1247F27j553J047J913n09j971M23P18o41m07J122L43q5n40N00n28j655R20J760
1265A484r35k212l9K027J086j270p25M68J87p55N52L22r8m90M3k81j23M05J000
1284F46o74r46j83M85L87l36r7l0o62L45J195J30m63j3j38p87q00P11Q70j97O7
$$ plain form
1152 109 739 -334 -1506 -1817 -1446 -1089 -542 -572 -1332 -1876 -1870 -1450 -536 -138 -873 -1954 -2025 -796 -1221 -1157
1172 -1157 -493 -481 -1476 -2535 -1310 -382 -1108 -1582 -1290 -1020 -2377 -1842 215 510 -1496 -1449 46 -25 -1780
1191 -1780 -1342 807 608 -2367 -2357 245 419 -1312 -669 1259 464 -1200 -712 987 158 -916 -691
1208 -691 1007 113 -642 618 1364 412 -867 162 738 217 241 761 1104 292 403 1493 1575 1140 614
1227 614 680 156 318 885 1442 853 489 107 337 1133 1847 1651 797 582 536 -230 -146 1483 2269 627
1247 627 -926 121 2034 1525 -446 -23 695 54 -353 769 1112 1027 487 987 459 -1196 -276 1484
1265 1484 549 -1663 -1702 325 1411 141 -584 -116 71 -684 -132 190 92 -398 -355 -636 -759 -354 646
1284 646 -28 -974 -1157 -672 -285 -621 -718 -748 -1410 -1065 130 260 -203 -216 -354 -1141 -1941 -1230 -360 -557 -490
1305d90k06n21k4J139Q72j024j553J012J288m00j662Q98J713q77j895J040R60
1322B70N8q41K30L93q97R6J072P40j295j02J296M99j486L02R69p38j590L62J348
1341F86J89l66K02O14r63m24J408N18j027m21K61M50l1p04Q53j39j83p02J24N45
1361H90L40m9q57j48O14P80L1n34J1M05o12p72P98j91k41K60q18l7K41R51Q55
1382A917r95j348K07J449m35r57M64O81j059p37O62Q96r03Q4K40j72j439P13J499
1401G67j11j297l91J252N6j052R7O81n19p98K93J67j85l37P87K42q53k11J141
1420b71N54r77p16M10K21m2n83M70j97K21k55j1O1K27K74n13o45L81Q75J21j50
1441e45l21J84j52j85L33M74n03n02L35j08k59P59R76l51j084M9J276K64l27l43
$$ plain form
1305 -490 -696 -1217 -1241 -102 770 -254 -1807 -795 493 93 -1569 -671 1042 165 -1730 -690 270
1322 270 328 -513 -283 110 -787 -691 381 1121 -174 -276 1020 1519 33 335 1304 566 -1024 -662 686
1341 686 875 509 711 1325 362 -62 1346 1864 837 416 677 1127 1096 392 1245 1106 923 221 345 890
1361 890 1230 1181 324 176 790 1570 1601 1067 1078 1483 871 99 897 706 465 725 -93 -130 111 1062 1917
1382 1917 922 -426 -219 1230 795 -162 302 983 -76 -813 -151 745 -158 -74 166 -6 -1445 -732 767
1401 767 656 -641 -1032 220 276 -776 -679 2 -517 -1315 -1022 -855 -1040 -1377 -590 -348 -1201 -1412 -271
1420 -271 283 -694 -1410 -1000 -779 -821 -1404 -934 -1131 -910 -1165 -1176 -1115 -888 -614 -1127 -1772 -1391 -516 -395 -545
1441 -545 -866 -682 -834 -1019 -686 -212 -715 -1217 -882 -990 -1249 -490 486 135 -949 -900 376 640 313 -30
1461c0K96o37l98O88O68l64m96K15J8k11j13J160N12j086p74P06O23K55k19L41
1481A154o00m59k01L50M65K53m79J9J83j58L28L34L81o29n97j69P91L95m86m28
1501D47K70L22p21j12N43K15o13m18O34N13m44Q3J84j87p34J08J161k54j094n92
1521f89Q80o3m28J27Q53j29r26K88Q62l23o06k63O47p05r00Q82J060m53j089L06
1541f69L26n38K48N28K31n73n34O73R5k22%N95m70q21q4P74k2k85k0k80J29L64
1563e55N65K96n20k59m4m26q6N68M59p41r5N25J58j42K72M1j49p35L00Q00k22
1584A0k5N27P8q56k14O18O82j119m21N80L73k69Q8P87L31o33l98P18M23r24qJ89
1606E37m9n05J98O94j72l23P8J94k4M3K25j63l83K87J6P9K26M03k24r67o2J63
$$ plain form
1461 -30 266 -371 -769 -81 587 223 -273 -58 -40 -251 -364 796 1308 222 -552 154 777 1032 813 1154
1481 1154 554 95 -106 244 709 962 483 502 685 527 855 1189 1570 941 344 175 966 1361 875 447
1501 447 717 1039 318 206 749 964 351 -67 567 1080 636 719 903 716 -18 90 1251 997 -97 -689
1521 -689 191 128 -300 -173 680 551 -375 -87 775 452 -154 -417 230 -475 -1375 -493 567 114 -975 -669
1541 -669 -343 -881 -633 -105 126 -447 -981 -308 -213 -435 -435 160 -310 -1131 -1215 -441 -463 -748 -768 -1048 -919 -555
1563 -555 10 306 -214 -473 -517 -943 -1029 -461 -2 -743 -838 -313 -155 -297 -25 16 -133 -868 -568 232 10
1584 10 -15 512 590 -266 -480 138 820 -299 -720 -140 233 -36 52 839 1170 537 139 857 1280 356 348 537
1606 537 488 -17 181 875 703 380 458 652 628 671 896 733 350 637 653 732 958 1361 1137 170 108 271
1628B71L98l99j41M40K9l90O55M73n17pk80j66k59J8P69l09q68k98O68L43p33
1649c03L45N57m79p96K63R43m50r82O48Q98m64j042M52O70n77q58Q1J61O8Q9P85
1670IK6q12K78O68k88o60l35N06j50n46J4L51L20l29L41j21m19O65j5K3n20O3
1692i31M44k09L94l02K14p17Q9n9K28Q7k3ok05L1P58O50n42n46O42k27n72l4R23
1715H7j5r47J21Q09k39l24O80N10p16o05O53P26l5n02K34L53l83m12L49O61o17
1736C88o06M00k9q3N33M73m64l90M60N31l98l7N6n6k48p1J17O0l50l8M05N8l17
1759C94P77L27q61K7j7J4l68j15N76o1q39L90P84l98o75L01K42o28l22P94N84
1780I26l78p95M88K04m16l9Q78l04j233l31P85M28m46NL87j10o47M10O85j97r24
$$ plain form
1628 271 669 270 129 569 598 208 863 1336 819 812 532 366 107 125 894 585 -283 -581 87 430 -303
1649 -303 42 599 120 -676 -413 530 80 -902 -254 644 180 -862 -410 260 -317 -1175 -1094 -933 -865 -776 9
1670 9 35 -777 -499 169 -119 -779 -1114 -608 -758 -1304 -1290 -939 -619 -948 -607 -728 -1147 -482 -497 -474 -994 -931
1692 -931 -487 -696 -302 -604 -390 -1107 -1018 -1077 -849 -762 -785 -791 -996 -965 -207 443 -99 -645 -3 -230 -802 -836 87
1715 87 72 -875 -754 55 -184 -508 172 682 -34 -639 14 740 705 203 437 790 407 -5 344 1005 388
1736 388 -218 182 153 70 603 1076 612 222 682 1213 815 778 834 778 530 459 576 636 286 248 653 711 394
1759 394 1171 1498 637 664 647 661 293 178 754 693 -146 244 1028 630 -45 256 498 -130 -452 342 926
1780 926 548 -247 241 445 29 -10 868 564 -669 -1000 -215 213 -233 -228 159 49 -598 -188 497 300 -624
1801f24R8O4Q9l04M53K60l66m77J97L2J29K2Q9j97j61Q3L40J97k36K49q7j20l5
1824c05J14n90J15K21J36l91L06J24L51n18m6N46J41j28j44J44k25j67J0P09j08
1845B95q90R09O2r24J77R75O1o02k21M89N26k26k51P39l00j260k1N17O21k89N
1866C92K55j15k75O41N92q07l94J94J2m52k24Q10L38p13j61L40J65k35L46q0k51
1887C78l60K41L83Q8R4l52K46o06M8M27l53o34k4N71j18J13K14M49l93r7l98J96
1909A13r6l34K10m10k29N01M72Q3q97J25L74k90l16L80M30k03n96N6O78j78j84
1930c11J30l59p46J42J58O31k37j28L80k69m12M35O19j91p35j79M43N9N2q7K60
1951c45l68N5J11q9K24P9j38l29o8L52O06j90m50L25nk5R2M04o39k23K38J0j73
$$ plain form
1801 -624 -526 -462 -373 -677 -224 36 -330 -807 -610 -578 -449 -427 -338 -535 -696 -613 -273 -76 -312 -63 -150 -270 -305
1824 -305 -191 -781 -666 -445 -309 -700 -394 -270 81 -437 -483 63 204 76 -68 76 -149 -316 -306 403 295
1845 295 -595 314 376 -548 -371 604 665 63 -158 331 857 631 380 1119 819 -441 -462 55 676 387 392
1866 392 647 532 257 898 1490 683 289 483 495 43 -181 629 967 254 93 433 598 363 709 629 378
1887 378 18 259 642 730 824 472 718 112 160 587 234 -400 -424 147 29 142 356 805 412 315 -83 113
1909 113 17 -317 -107 -517 -746 -245 227 310 -587 -462 -88 -378 -694 -314 116 -87 -683 -627 51 -127 -311
1930 -311 -181 -540 -1286 -1144 -986 -355 -592 -720 -340 -609 -1021 -586 33 -158 -893 -1072 -629 -570 -518 -605 -345
1951 -345 -713 -658 -547 -636 -412 -333 -471 -800 -868 -516 90 -100 -550 -225 -230 -255 -163 241 -398 -621 -383 -373 -546
1974e46K44N40M66r27R9M59j20l26J17L11l56k48O1Q38P7m71j92N94n71%P18O8
1996H35n65J15N68k8k37n35Q55j86n03k93N66j4m65L55K87J03p00N45L69k64n58
2017B50R1M89n41j25M60J52k83j77R5J96o39K93K74k49o23N70J82J7k69O7k5l63
2039a58J64M09m48l40K97L92m14k54J94Q07n58n35M08J77k58j00L34n51k37Q2
2059e89P74j3p29P5P25j021k06N40O62n29l18M33K40k05l5J30k70o16M8O58k18
2080d64J17j11r0j48M2P73K32p44N7J19k86m19N54N56k27n92n4R44l06kJ57L55
2102D63o69l34P48j38k48K12N14l93l01L44L19m4p42K87L70m4m63M36N65o43j93
2123D6N20J91j28N5j29k47l33M23N6K34m92M00j2j50k22L29L7j73o4O4L91n31
$$ plain form
1974 -546 -302 238 704 -223 -124 335 215 -111 6 317 -39 -287 -226 612 689 218 26 620 49 49 767 835
1996 835 270 385 953 925 688 153 1008 822 319 26 592 578 113 468 755 858 158 703 1072 808 250
2017 250 341 830 289 164 624 776 493 316 411 607 -32 261 535 286 -337 233 415 432 163 230 205 -158
2039 -158 6 415 -33 -373 -76 316 -98 -352 -158 649 91 -444 -36 141 -117 -217 117 -434 -671 -589
2059 -589 185 172 -557 -482 243 -778 -984 -444 218 -311 -629 -196 44 -161 -196 -66 -336 -952 -904 -246 -464
2080 -464 -347 -458 -548 -696 -654 119 351 -393 -336 -217 -503 -922 -368 188 -39 -631 -685 259 -47 -49 108 463
2102 463 -206 -540 208 70 -178 34 548 155 -146 198 517 473 -269 18 388 344 -119 317 882 239 46
2123 46 566 757 629 684 555 308 -25 398 454 688 196 596 584 434 212 541 578 405 341 405 796 265
2145B65K36J80k33j18k82K65j61m5K86k8l13N8Q8K84l23M5M3m52l8K17L33l56
2167d9m31LL58R6j26J96R4m82m44M05M98m66J09OK6n07K31O34l59n93M26K0n2
2190d07m18M51K74n39M8L99ln35L03L94n58k66nK77K10j28J90j60L10m58L35M71
2212A85q28O4K14J77n43L48J6M08o81L10qJ06k86K07M26o15J34K53J27m43L33
2233i6L27r3k28O9R0r6r7rQ05p44m4N36j9j59M6M13J45n28k44K71K5j04K5O94
2257I85l24k70K52J04k86k28M19J52o3o41K98M00j60k67L46l18k34oM74k06M09
2278H36n98K59o4l55M84L1j85m43L51j40N04k22J44o83K20Q1O7l69J95R8k17k84
2300b90J67O03m00l38L68k74O1j12L10P7k37m96L99N9n30o6O46J33m27k83J50
$$ plain form
2145 265 501 681 448 330 48 313 152 107 393 365 52 110 198 482 159 204 247 -205 -243 -26 307 -49
2167 -49 -480 -477 -119 -23 -149 47 141 -341 -785 -380 118 -348 -239 -233 -207 -714 -483 151 -208 -801 -375 -355 -407
2190 -407 -825 -374 -100 -639 -591 -192 -195 -730 -427 -33 -591 -857 -862 -585 -375 -503 -313 -473 -163 -621 -286 185
2212 185 -643 -579 -365 -188 -731 -383 -367 41 -640 -330 -338 -232 -518 -311 115 -500 -366 -113 14 -429 -96
2233 -96 231 138 -90 -21 69 -27 -124 -133 672 -72 -116 420 401 242 288 701 846 318 74 345 370 266 291 985
2257 985 661 391 643 747 461 233 652 804 741 100 398 798 638 371 717 399 165 159 633 427 836
2278 836 238 497 433 78 562 593 408 -35 316 176 680 458 602 -81 139 220 287 -82 113 211 -6 -290
2300 -290 -123 480 80 -258 110 -164 -103 -215 95 172 -65 -561 -162 -103 -633 -699 -53 80 -347 -630 -480
2321d80L70j97%m0J02l67j53J051n46k42K03L10k47l51R9N27m65JQ2L82m23l4
2343d18K01m8K33l88J0L3J19%L73l20J41J08j48l19J45K39J36j85Q1K56M7l90
2365i4j33N03l00J7K1J86m06q0P54p4o09L69R5J4k24K40K04M1k1k63L29k68j46
2388A55p7Q22p78l4N87k7k82k89M35j21k39J44J28K2l01j4L85j52n44K94J65j10
2410A69L07k08J59k42mJ16K23l05n9l06J92k35Jo9L72j03J29l39q1K80K75n45
2432b73k44M56j26q2m64O68J18n50J03J03K85k94k99N55l34j81k77M19O7l11L74
2453b87M10o22q3n5M16l15k51Q29k79l33l04O59r4j92j57L09k0k06K94j20K73
2474a28m98L55J85J64o66M30R0r0Mj23K58m7j70J48L41l23Q0p2Q1L1L6J88k5R8
$$ plain form
2321 -480 -110 -307 -307 -347 -245 -612 -765 286 -260 -502 -299 11 -236 -587 -488 39 -426 -425 -343 39 -384 -418
2343 -418 -217 -265 -32 -420 -410 -377 -258 -258 115 -205 -64 44 -104 -423 -278 -39 97 -88 -7 249 296 -94
2365 -94 -227 276 -24 -7 14 200 -206 -286 468 394 -215 154 249 263 39 279 483 524 503 240 569 301 155
2388 155 78 900 122 88 675 648 366 77 512 391 152 296 424 446 145 131 516 364 -180 114 279 169
2410 169 476 268 427 185 181 297 520 215 156 -150 42 -193 -192 -261 111 8 137 -202 -283 -3 272 -273
2432 -273 -517 -61 -187 -269 -733 -65 53 -497 -394 -291 -6 -300 -599 -44 -378 -559 -836 -417 -350 -661 -287
2453 -287 123 -499 -582 -637 -221 -536 -787 42 -237 -570 -874 -215 -309 -501 -658 -349 -369 -575 -281 -401 -128
2474 -128 -626 -271 -86 78 -588 -158 -68 -158 -154 -277 -19 -66 -236 -88 253 -70 10 -62 19 50 86 274 249 347
2498C47k00L49l19m42O53j12J81l40O22m36P5k29K96j59j20J33Np9L16O5j96j63
2520B47P2L5J28k13P9L13k85k00K41L07l46P9K36K2n85K46N0p0j65j27J44J22
2542C30j51L37j84J58j62j66l0P9j79%O1j09J5N65k94n41M67K15l77k5j37K54
2564A26k88k10K15O50n42k04J32k5J4n00N55J7n54K12QJ98K01m03J38R9J21j55
2586a95Qk17R8o5L35l90M0J61j03o25Q46k1r5k12K09J36m14K50J41Rr2l08L28
2609a76j02j33n0J67J90q7L20N6l17p7J7K49r0k69R2l7L20O0M6j81PK17k60K51
2633B13Nr7L11j08l08K83l72J46M69k47k7j09J6j47K4N2L65o1j8K0J11j76k59
2656H6J76L%J4qn6J6k30J86K1L03l01l3K23j96Q0n5j24l48N60j78L4p3N0j08j58
$$ plain form
2498 347 147 496 177 -265 388 276 457 117 739 303 378 149 445 286 166 299 304 225 541 606 410 247
2520 247 319 354 482 269 348 661 376 176 417 724 378 457 693 715 130 376 426 356 191 64 208 330
2542 330 179 516 332 490 328 162 132 211 32 32 93 -16 -1 564 270 -271 196 411 34 9 -128 126
2564 126 -162 -372 -157 493 -49 -253 -121 -146 -132 -632 -77 -60 -614 -402 -394 -196 5 -398 -260 -161 -40 -195
2586 -195 -187 -404 -306 -371 -36 -426 -386 -225 -328 -953 -107 -128 -223 -435 -226 -90 -504 -254 -113 -104 -196 -504 -176
2609 -176 -278 -411 -461 -294 -104 -191 129 185 -132 -209 -192 57 -33 -302 -210 -247 73 133 179 -2 5 222 -38 213
2633 213 218 121 432 324 16 299 -73 73 542 295 268 159 175 28 52 104 469 408 390 410 521 345 86
2656 86 262 265 265 279 271 215 231 1 187 208 511 210 177 400 204 284 229 105 -243 317 139 173 100 150 42 -116
2682a16m0o6J71j26J14k8K08j16j22nR5J31m31j01K69L7j88N3J91k93M92k02k10
2705b83l5K0K4J32k69J90M9o2OL3j82k67J62K68l9j95j31J42K01k47L54m3K4n01
2729f49K5M90l12L96k72j65j35K55mL71j85k00J44M13m27J21M20p6m94L82L0J00
2751B28Rn4p6rK77m83K45j14J71Q9M2j57L56k25j09O8J7r4J59k37M28k55M21l62
2775C35q9J13Q9k89J61j33nL06K97n81J25L57k46Ln37L52K08m27o4O92l83n6j80
2798D8L98J40m60J42J65l0l86P3K79p9j18l05M13j66K04l12k09J91J79J2J06j14
2820A71k86J06J32l40R1J11r5j83j19J73K85l09J52n4Jj74J44LJ26Q0o10J17J83
2843b95LJ42j92m8K84j93k86K24m2J32j49K49Q3Q7j48j08j86J51o8J50k81J03
$$ plain form
2682 -116 -156 -222 -51 -177 -63 -91 117 1 -121 -126 -31 100 -331 -432 -163 -126 -314 -261 -70 -363 129 -73 -283
2705 -283 -318 -298 -274 -142 -411 -221 -172 -234 -228 -195 -377 -644 -482 -214 -253 -448 -579 -437 -236 -483 -129 -172 -148 -649
2729 -649 -624 -134 -446 -50 -322 -487 -622 -367 -371 0 -185 -385 -241 172 -255 -134 286 210 -284 98 128 228
2751 228 237 183 107 98 375 -108 137 23 194 283 325 168 524 299 190 258 275 181 340 103 531 276 697 335
2775 335 246 359 448 159 320 187 182 488 785 204 329 686 440 443 -94 258 466 39 -25 667 284 228 48
2798 48 446 586 126 268 433 403 17 90 369 290 172 -133 280 114 318 6 -203 -12 167 179 285 171
2820 171 -115 -9 123 -217 -126 -15 -110 -293 -412 -239 46 -263 -111 -165 -164 -338 -194 -191 -65 15 -595 -478 -295
2843 -295 -292 -150 -342 -390 -106 -299 -585 -361 -403 -271 -420 -171 -88 -1 -149 -257 -443 -292 -360 -210 -491 -388
2865c88K09k04J73J47n4P6j9M2J66j75k19N3K67j88j62J73M4K49l08J12L92n75
2887a89R8q7L34R9j84l8L2m2M78l92J04L6k13L37k25K78l09j10o7M87J3k23K09
2910D26j46k41J37k15p7M33J90o6j18j55n8M9nJ57r4J20R5j47k57R7M2P7o16K74
2934i8N05k94J9n33L98LL6k42L73j91JoJ15j72j0k05L89k86J55Qll12M79j03P8
2959A04n83M19k48K34j86k27J40N3L6MK75n87J54L04j33k61L35J7j58kj97M70
2981c7j26K47n00J41r3K09j15o1Rj04L09k01J55J59j59J92oj99NJ86j62N68n73
3004a56K3J79J7n9N5r5o3n3R5J86K62j01r9nK2K04m11K67j54L0k68L02K51o3P4
3029D40K8J2q5K5p7m3p1N4J29k7l24M68j66k5J1J13q3j22m2j45J77N5Q1J14J34
$$ plain form
2865 -388 -179 -383 -210 -63 -117 -41 -60 -18 148 -27 -246 -193 74 -114 -276 -103 -59 190 -118 -6 386 -189
2887 -189 -91 -178 156 255 71 33 65 23 501 109 213 249 36 373 148 426 117 7 -60 427 440 217 426
2910 426 280 39 176 -39 -116 317 507 441 323 168 110 159 154 311 217 337 432 285 28 125 167 244 -372 -98
2934 -98 407 113 132 -401 -3 0 36 -206 167 -24 -23 -29 86 -86 -96 -301 88 -198 -43 -35 -38 -350 129 26 104
2959 104 -479 -60 -308 -74 -260 -487 -347 -294 -258 -254 21 -566 -412 -108 -241 -502 -167 -150 -308 -310 -507 -37
2981 -37 -163 84 -416 -275 -368 -159 -274 -335 -326 -430 -121 -322 -167 -8 -167 25 19 -180 -175 11 -151 417 -156
3004 -156 -133 46 63 4 59 -36 -99 -152 -57 129 391 290 191 186 208 412 1 268 114 144 -124 178 429 366 440
3029 440 468 480 395 420 343 300 229 283 412 385 61 529 363 338 349 462 379 257 215 70 247 302 383 497 631
3054F31k17k8k73oM07m28o1O8k94J47K93M4j7r0k0J15Mk66K09k57K48j14k19r2
3078b16K71K09l21j9K1j63o4Q9J08m4l8L1m3N7k76J89j71K28j90J61r6M0r2j34
3102d63O22m25k3J09Rj78J4j07K65n8j59K72m4J3j91j15L47j29j74J25J07j21
3124c04J54J18N2j14j68Q8l10K58R5J27k43J63P1O9k00K55j02J9O8P7k46r0J87
3147B4J56l48J96K67o3j09J54l6J6m14Q9N00k66r5J77N7j84M5M8l75L22J46k36
3170G1j18O7R3j09R2J36n9L78m09L1K67m47L42j9j8m58L73K21q9j69p3j15l9L9
3194a2r4j2j7j51K17J19j44R7k45K94q4j44K16k36J08l8l2L5n3P1o9r5K29J2k08
3219b36P8K1k25M8j5J4R3j1N0N6j90mm0J24K0k51K66K15l95K44k6J13m11J28r4
$$ plain form
3054 631 414 386 113 107 514 86 25 93 -201 -54 239 283 266 176 156 271 275 9 218 -39 209 95 -124 -216
3078 -216 55 264 -57 -76 -55 -218 -282 -193 -85 -129 -167 -136 -179 -122 -398 -209 -380 -152 -342 -181 -277 -237 -329 -463
3102 -463 159 -266 -289 -180 -171 -349 -335 -442 -177 -235 -394 -122 -166 -153 -344 -459 -112 -241 -415 -290 -183 -304
3124 -304 -150 -32 20 -94 -262 -174 -484 -226 -131 -4 -247 -84 -13 56 -144 111 9 28 96 173 -73 -163 24
3147 24 180 -168 28 295 232 123 277 241 257 -157 -68 432 166 71 248 305 121 166 214 -161 161 307 71
3170 71 -47 20 113 4 96 232 173 551 142 173 440 -7 335 316 298 -160 213 434 345 176 103 -12 -51 -12
3194 -12 -106 -118 -135 -286 -69 50 -94 3 -242 52 -32 -176 40 -196 -88 -126 -158 -123 -176 -105 -174 -269 -40 -28 -236
3219 -236 -158 -137 -362 -314 -329 -315 -222 -233 -183 -127 -317 -321 -361 -237 -217 -468 -202 13 -382 -138 -164 -51 -462 -334 -428
3244d28J66R0KK27Q7j38j81R3k8J33J2k16r5K65j2J99n44M26K94k33K5j10r8K29
3268A65jj52J82J33k08L92n26J76k3L5P4l25L76k63J18J84L6J61O7l41O0J8r1
3291B47j48K78m8N6p2l92M93J27m73o6K91P6o3j10k69K67L34m80L40n4K34n05
3313F3k6K69lo0k28J54j64N88k82J66m50J4j46j24J02K1Lq4J09m7j10K74M8k89
3337b02N56l15Om8J21O3m16q4k3J43J06j52J4K89n20LK42K47L1j58j88J36m7J65
3361c1k02m40M46K3m53K78M3L09l00j79J73NJ69j35J15q3k94L23MO6O8L6L5L35
$$ plain form
3244 -428 -262 -172 -170 57 144 6 -175 -82 -110 23 35 -181 -276 -11 -23 176 -368 58 352 119 144 34 -64 165
3268 165 164 12 194 327 119 511 -15 161 138 173 247 -78 298 35 153 337 373 534 601 260 320 338 247
3291 247 99 377 329 385 313 -79 414 541 68 2 293 369 306 196 -73 194 528 48 388 334 568 63
3313 63 37 306 303 243 15 169 5 593 311 477 27 41 -105 -229 -127 -106 -103 -187 -78 -125 -235 39 87 -202
3337 -202 354 39 45 -3 118 181 -235 -319 -342 -199 -93 -245 -231 58 -462 -459 -217 30 61 -97 -285 -149 -196 -31
3361 -31 -233 -673 -227 -204 -657 -379 -336 -27 -327 -506 -333 -328 -159 -294 -179 -262 -556 -233 -229 -163 -95 -59 -24 311
$$ [...]
8191c5
##END NTUPLES=NMR FID
##END=
