##TITLE=1H_Costus-oil-G-f20-11-D
 CDCl3, 8 sc, 
 5.4.2019
##JCAMPDX= 6.0         $$ Bruker NMR JCAMP-DX V2.0
##DATA TYPE= NMR FID
##DATA CLASS= NTUPLES
##ORIGIN= UXNMR, Bruker Analytische Messtechnik GmbH
##OWNER= root
$$ XWIN-NMR		Version 3.5
$$ Fri Apr  5 14:04:03 2019 Russian Standard Time (UT+4h)  she@DPX200
##.OBSERVE FREQUENCY= 200.1316
##.OBSERVE NUCLEUS= ^1H
##.DELAY= (6, 6)
##.ACQUISITION MODE= SIMULTANEOUS
##.ACQUISITION SCHEME= undefined
##.AVERAGES= 8
##.DIGITISER RES= 18
##SPECTROMETER/DATA SYSTEM= spect
##.PULSE SEQUENCE= zg30
##.SOLVENT NAME= CDCl3
##.SHIFT REFERENCE= (INTERNAL, CDCl3, 0, 15.7039)
##AUDIT TRAIL= $$ (NUMBER, WHEN, WHO, WHERE, WHAT)
$$ ##TITLE= Audit trail, XWIN-NMR		Version 3.5
$$ ##JCAMPDX= 5.01
$$ ##ORIGIN= Bruker BioSpin GmbH
$$ ##OWNER= she
$$ F:/spectra/data/she/nmr/H-F/1/audita.txt
$$ ##AUDIT TRAIL=  $$ (NUMBER, WHEN, WHO, WHERE, WHAT)
(   1,<2019-04-05 14:03:04.35 +0400>,<she>,<DPX200>,
      <created by zg, POWCHK disabled, PULCHK disabled
       configuration hash MD5:
       00 E9 B6 7A A2 85 ED C7 34 08 36 98 17 FE 4E 26
       data hash MD5: 16K
       6D 36 60 57 C8 C0 7C 5E AB 22 00 79 6D EA B7 75>)
$$ ##END=
$$ 
$$ hash MD5
$$ 5D 3F C6 14 23 0D 70 4E 5C 6C 48 41 65 E3 CA CD
##$RELAX= 
##$RELAX= 
##$RELAX= 
##$RELAX= 
##$RELAX= 
##$RELAX= 
$$ Bruker specific parameters
$$ --------------------------
##$DU= <F:/spectra>
##$EXPNO= 1
##$NAME= <H-F>
##$PROCNO= 1
##$TYPE= <nmr>
##$USER= <she>
##$AMP= (0..31)
100 100 100 100 100 100 100 100 100 100 100 100 100 100 100 100 100 100 
100 100 100 100 100 100 100 100 100 100 100 100 100 100 
##$AQSEQ= 0
##$AQ_mod= 1
##$AUNM= <au_zg>
##$AUTOPOS= <>
##$BF1= 200.13
##$BF2= 200.13
##$BF3= 200.13
##$BF4= 200.13
##$BF5= 200.13
##$BF6= 200.13
##$BF7= 200.13
##$BF8= 200.13
##$BYTORDA= 1
##$CFDGTYP= 0
##$CFRGTYP= 5
##$CHEMSTR= <none>
##$CNST= (0..31)
1 1 145 1 1 1 1 1 1 1 1 1 1 1 1 1 1 1 1 1 1 1 1 1 1 1 1 1 1 1 1 1 
##$CPDPRG= <>
##$CPDPRG1= <>
##$CPDPRG2= <>
##$CPDPRG3= <>
##$CPDPRG4= <mlev>
##$CPDPRG5= <mlev>
##$CPDPRG6= <mlev>
##$CPDPRG7= <mlev>
##$CPDPRG8= <mlev>
##$CPDPRGB= <>
##$CPDPRGT= <>
##$D= (0..31)
0 1.2 0 0 0 0 0 0 0 0 0 0.03 0 0 0 0 0 0 0 0 0 0 0 0 0 0 0 0 0 0 0 0 
##$DATE= 1554458583
##$DBL= (0..7)
120 120 120 120 120 120 120 120 
##$DBP= (0..7)
150 150 150 150 150 150 150 150 
##$DBP07= 0
##$DBPNAM0= <>
##$DBPNAM1= <>
##$DBPNAM2= <>
##$DBPNAM3= <>
##$DBPNAM4= <>
##$DBPNAM5= <>
##$DBPNAM6= <>
##$DBPNAM7= <>
##$DBPOAL= (0..7)
0.5 0.5 0.5 0.5 0.5 0.5 0.5 0.5 
##$DBPOFFS= (0..7)
0 0 0 0 0 0 0 0 
##$DE= 6
##$DECBNUC= <off>
##$DECIM= 24
##$DECNUC= <off>
##$DECSTAT= 4
##$DIGMOD= 1
##$DIGTYP= 9
##$DL= (0..7)
0 120 120 120 120 120 120 120 
##$DP= (0..7)
150 150 150 150 150 150 150 150 
##$DP07= 0
##$DPNAME0= <>
##$DPNAME1= <>
##$DPNAME2= <>
##$DPNAME3= <>
##$DPNAME4= <>
##$DPNAME5= <>
##$DPNAME6= <>
##$DPNAME7= <>
##$DPOAL= (0..7)
0.5 0.5 0.5 0.5 0.5 0.5 0.5 0.5 
##$DPOFFS= (0..7)
0 0 0 0 0 0 0 0 
##$DQDMODE= 0
##$DR= 18
##$DS= 0
##$DSLIST= <SSSSSSSSSSSSSSS>
$$ [...]
##$SUBNAM2= <"">
##$SUBNAM3= <"">
##$SUBNAM4= <"">
##$SUBNAM5= <"">
##$SUBNAM6= <"">
##$SUBNAM7= <"">
##$SUBNAM8= <"">
##$SUBNAM9= <"">
##$SW= 24.9336934301222
##$SWIBOX= (0..15)
0 0 2 0 0 0 0 0 0 0 0 0 0 0 0 0 
##$SW_h= 4990.01996007984
##$TD= 16384
##$TD0= 1
##$TE= 0
##$TE2= 300
##$TE3= 300
##$TEG= 300
##$TL= (0..7)
0 120 120 120 120 120 120 120 
##$TP= (0..7)
150 150 150 150 150 150 150 150 
##$TP07= 0
##$TPNAME0= <>
##$TPNAME1= <>
##$TPNAME2= <>
##$TPNAME3= <>
##$TPNAME4= <>
##$TPNAME5= <>
##$TPNAME6= <>
##$TPNAME7= <>
##$TPOAL= (0..7)
0.5 0.5 0.5 0.5 0.5 0.5 0.5 0.5 
##$TPOFFS= (0..7)
0 0 0 0 0 0 0 0 
##$TUNHIN= 0
##$TUNHOUT= 0
##$TUNXOUT= 0
##$USERA1= <user>
##$USERA2= <user>
##$USERA3= <user>
##$USERA4= <user>
##$USERA5= <user>
##$V9= 5
##$VALIST= <valist>
##$VCLIST= <CCCCCCCCCCCCCCC>
##$VD= 0
##$VDLIST= <DDDDDDDDDDDDDDD>
##$VPLIST= <PPPPPPPPPPPPPPP>
##$VTLIST= <TTTTTTTTTTTTTTT>
##$WBST= 1024
##$WBSW= 4
##$XGAIN= (0..3)
0 0 0 0 
##$XL= 0
##$YL= 0
##$YMAX_a= 287669
##$YMIN_a= -469081
##$ZGOPTNS= <>
##$ZL1= 120
##$ZL2= 120
##$ZL3= 120
##$ZL4= 120
##$ABSF1= 10
##$ABSF2= 0
##$ABSG= 5
##$ABSL= 3
##$ALPHA= 0
##$AQORDER= 0
##$ASSFAC= 0
##$ASSFACI= 0
##$ASSFACX= 0
##$ASSWID= 0
##$AUNMP= <proc_1d>
##$AZFE= 0.1
##$AZFW= 0.1
##$BCFW= 1
##$BC_mod= 2
##$BYTORDP= 1
##$COROFFS= 0
##$CY= 11.3945322036743
##$DATMOD= 1
##$DC= 2
##$DFILT= <>
##$DTYPP= 0
##$F1P= 18.9103706918063
##$F2P= -1.10871071338519
##$FCOR= 0.5
##$FTSIZE= 0
##$FT_mod= 4
##$GAMMA= 1
##$GB= 0.15
##$INTBC= 1
##$INTSCL= 1
##$ISEN= 128
##$LB= 0.24
##$LEV0= 0
##$LPBIN= 0
##$MAXI= 10000
##$MC2= 0
##$MEAN= 0
##$ME_mod= 0
##$MI= 1.114404
##$NCOEF= 0
##$NC_proc= 0
##$NLEV= 6
##$NOISF1= 3.799351
##$NOISF2= 2.8
##$NSP= 1
##$NTH_PI= 0
##$NZP= 0
##$OFFSET= 15.70392
##$PC= 1
##$PHC0= -8870.179
##$PHC1= 37.60028
##$PH_mod= 1
##$PKNL= yes
##$PPARMOD= 0
##$PSCAL= 0
##$PSIGN= 0
##$REVERSE= no
##$SF= 200.130013532006
##$SI= 16384
##$SIGF1= 3
##$SIGF2= 2
##$SINO= 400
##$SIOLD= 16384
##$SREGLST= <1H.CDCl3>
##$SSB= 0
##$STSI= 0
##$STSR= 0
##$SW_p= 3612.71676300578
##$SYMM= 0
##$S_DEV= 0
##$TDeff= 0
##$TDoff= 0
##$TI= <>
##$TILT= no
##$TM1= 0
##$TM2= 0
##$TOPLEV= 0
##$USERP1= <user>
##$USERP2= <user>
##$USERP3= <user>
##$USERP4= <user>
##$USERP5= <user>
##$WDW= 1
##$XDIM= 8192
##$YMAX_p= 0
##$YMIN_p= 0
$$ End of Bruker specific parameters
$$ ---------------------------------
##NTUPLES= NMR FID
##VAR_NAME=  TIME,          FID/REAL,        FID/IMAG
##SYMBOL=    X,             R,               I
##VAR_TYPE=  INDEPENDENT,   DEPENDENT,       DEPENDENT
##VAR_FORM=  AFFN,          ASDF,            ASDF
##VAR_DIM=   8192,          8192,            8192
##UNITS=     SECONDS,       ARBITRARY UNITS, ARBITRARY UNITS
##FACTOR=    0.0002004,     1,               1
##FIRST=     0,             0,               0
##LAST=      1.6414764,     0,               0
##MIN=       0,             -469081,         0
##MAX=       1.6414764,     287669,          0
$$ Real data points
##PAGE= N=1
##DATA TABLE= (X++(R..R)), XYDATA
0 0 0 0 0 0 8 -8 8 -8 16 -16 24 -32 40 -48 56 -66 80 -96 115 -136 159 -184 215 -247 284 -327 372 -425
28 -425 481 -542 612 -686 771 -861 964 -1073 1193 -1326 1472 -1631 1805 -2000 2215 -2452
44 -2452 2717 -3012 3347 -3726 4162 -4666 5261 -5973 6842 -7934 9352 -11277 14054 -18426
58 -18426 26366 -45345 182822 2332 -412277 15502 213794 -65380 -203552 102739 160415
69 160415 -48121 -93356 46272 12820 -42007 11490 26348 -59710 -16164 81269 34370 -79358
81 -79358 -44094 31344 11222 -33384 4050 38857 13678 -19494 -5253 9313 -3659 -9325
93 -9325 21078 23472 -24910 -37351 18530 28973 -19619 -4487 56619 15075 -64317 -21254 50464
106 50464 206 -48542 12879 36091 -30673 -22596 41217 -3178 -62963 10379 61060 -27414
118 -27414 -51033 52906 47410 -70205 -47246 64074 24159 -64400 1755 76364 -335 -52678
130 -52678 23675 42877 -38957 -36610 43708 27307 -41426 -10661 46463 8039 -38379 -2331
142 -2331 25791 -11967 -24124 15943 17904 -23841 -20820 17720 9119 -25395 -6631 29601 76
155 76 -41850 -4961 47370 14740 -36391 -7982 29417 -7441 -34930 14311 43269 -269 -20114
168 -20114 13314 13801 -15499 -1613 20233 -8883 -24555 14935 25392 -14696 -12956 21995 1048
181 1048 -37527 -8229 29987 3741 -19461 7054 8595 -28707 -20893 20763 11782 -18022 2711
194 2711 26026 -5410 -26725 7199 24414 -8829 -20271 10606 17830 -5829 -4563 17673 8019
207 8019 -16359 -9364 10390 5859 -3739 4733 5456 -12631 -14172 4809 4429 -9385 100 15730
221 15730 -2761 -22956 -2748 16711 -4254 -20903 3186 19544 -3829 -17254 5262 16551
233 16551 -512 -6941 5494 7212 -1881 1042 6366 50 -3558 4963 6673 -2295 -404 8748
247 8748 2922 -9760 -4800 7879 2002 -9459 -3360 3673 -6959 -11078 2973 6990 -6536 -5967
261 -5967 8444 4304 -10470 -5503 4930 -3015 -7098 7171 11131 -1674 -2358 5759 -934 -5573
275 -5573 9207 14186 -2134 -7944 2906 1237 -6827 1803 9994 170 -5688 1216 483 -6222 -723
290 -723 3386 -5386 -8767 -625 824 -3604 -473 1406 -5494 -4412 5803 5236 -1461 812 1893
305 1893 -5832 -5552 4311 7492 5564 5952 2226 -5302 -3249 4385 3453 2633 6278 1427 -6954 -4991
321 -4991 -195 -4433 -3083 5886 3045 -6433 -1428 4209 -5760 -10069 130 331 -8085 -996 8499
336 8499 1281 -3361 5653 2325 -9478 -973 12229 2349 -6456 6201 9169 -6736 -5406 11007
350 11007 6794 -6976 -807 7967 -98 -2592 6722 1600 -10359 -5336 3054 -4226 -8063 3693
364 3693 7489 -3422 -6140 1673 1173 -6371 -6419 655 3115 101 -1660 507 3678 1116 -706 2867
380 2867 4251 -1492 -1191 5792 4689 -1703 1299 4847 -3306 -6249 3333 5060 -4253 -233 8215
395 8215 -2513 -10766 1275 4467 -11328 -10446 8265 4910 -10900 -1983 12466 -354 -12561
408 -12561 57 6834 -6663 -5813 10387 8553 -4155 -128 6322 -4340 -7474 7598 13329 1951
422 1951 -1918 3064 -1668 -7783 -974 7138 2406 -3968 -622 2262 -3455 -5142 927 3620 -4277
437 -4277 -7335 1119 3844 -6010 -8756 2521 5854 -3344 -1557 9157 3490 -9033 -2871 5293
451 5293 -2610 -3629 11610 12086 -5080 -4677 7129 -1480 -10701 6092 16900 -921 -10543 3628
465 3628 3308 -12288 -7116 8844 1881 -9407 913 8794 -3366 -9233 246 225 -7847 -1814 7394
480 7394 678 -5764 1501 6312 -1619 -4540 4826 6601 -1748 -2312 6914 6941 -5047 -6121 5647
495 5647 7245 -2327 -1473 7426 2248 -9359 -3166 7492 -470 -8433 1016 3847 -8712 -7977 6314
510 6314 3216 -8763 -762 8655 -4069 -11037 4502 9197 -7292 -7356 9091 5667 -7695 942
524 942 13156 1429 -9089 2017 9044 -304 -2344 5495 2757 -6642 -2826 4755 2593 -2702
538 -2702 964 2295 -4565 -6340 836 3278 -4098 -6766 466 1717 -4872 -3950 4516 2278 -5048
553 -5048 140 7584 -565 -7756 2312 7824 -3151 -5008 9442 8846 -6499 -3965 9517 4111
567 4111 -6880 604 7011 -2862 -5441 5212 2929 -8688 -4205 5365 -922 -7358 2901 7470
581 7470 -4742 -9943 -812 1881 -5506 -3187 5092 3590 -3067 -1641 2491 322 -1166 3269 5126
596 5126 322 -1371 3374 4038 -2807 -2697 5625 4915 -3800 -930 9064 3528 -8813 -4698 4376 -1439
612 -1439 -5817 3366 5505 -7361 -8617 1915 871 -5568 1382 7524 -1741 -7061 716 922 -6572
627 -6572 -330 9709 3863 -4404 2104 5373 -2698 -4077 5664 5969 -1256 -1004 3298 466 -2241
642 -2241 1368 1946 -3063 -2848 2501 2966 -2997 -4373 153 913 -4874 -5625 1941 4325 -3363 -6348
658 -6348 1552 3512 -2925 -2181 4259 1483 -3592 716 3965 -2147 -617 8856 5412 -5569 -334
673 -334 8101 374 -6177 4310 8824 -2913 -6191 3108 2030 -5680 -2066 3279 -2202 -3990 3241
688 3241 2038 -5931 -3954 1953 -2951 -5345 2579 5475 -2581 -3964 2996 2844 -3255 -1360 4100
703 4100 3771 469 337 2107 1194 -564 -692 2317 4207 1113 -509 859 -374 -3184 -339 3151
719 3151 -1674 -4681 849 1481 -5744 -4394 3924 1097 -5724 -1218 3974 -2935 -4603 3500 2673 -5162
735 -5162 -392 7265 322 -4313 5244 6695 -4965 -4436 6818 4915 -2929 1667 5872 -1737 -4612
750 -4612 2272 2332 -2979 658 3597 -3863 -5452 1970 1422 -5455 -3463 2797 157 -4507 -1683 1110
766 1110 417 -693 -1846 -1639 1555 3004 -211 -804 3425 2505 -2389 -339 3573 1986 1958 2840 -650
783 -650 -2769 2240 3296 -2896 -1172 4786 -310 -6442 492 4743 -3634 -5908 2761 902 -6908
798 -6908 -1555 5085 -2313 -6170 3013 3594 -6125 -2760 6579 1050 -5784 2502 7149 -1801 -4125
813 -4125 4255 5150 -1101 -631 2612 232 -670 2799 1653 -1207 362 444 -3103 -3037 1802 2441 -1087
830 -1087 -2874 -2202 -785 -820 -3091 -3687 871 3118 -1792 -3470 1331 2018 -2596 -1085 3386 972
846 972 -1015 2502 2809 -1416 696 5303 323 -3566 2793 5692 -1729 -2748 4014 1595 -5270 -947
862 -947 4469 -1153 -5878 -124 2732 -3301 -3707 1684 404 -3390 -1368 -681 -3254 -1781 3996 3061
878 3061 -1777 -986 1657 -545 -1589 2184 4638 1475 -369 1194 2213 384 -101 1001 849 -794
894 -794 244 2675 1726 -3292 -3220 1210 550 -4099 -3346 1978 508 -3067 -549 1610 -3149 -4350 902
911 902 2139 -1777 -372 2452 -411 -1941 3716 4712 -2639 -2819 3170 3365 -489 1780 4303 53
927 53 -2437 1351 2755 -1431 -1638 1052 297 -858 1340 1061 -3509 -4665 -795 1148 -1634 -2757
943 -2757 39 760 -1059 -1418 116 10 -2381 -1720 2850 3405 -153 -268 2757 903 -1988 1356 4607
960 4607 510 -753 3832 3316 -2992 -3061 2615 1335 -1959 1034 1882 -3708 -3549 3054 2588 -4024 -3794
977 -3794 -1177 -3370 -3021 2684 3435 -2137 -3367 -43 -47 -937 1691 2119 -1640 -1046 3144 3808 366
994 366 -1244 722 956 200 791 2646 3019 505 -1678 -820 466 -1679 -1904 971 473 -2312 -830
1011 -830 1497 -1967 -4593 815 1800 -4306 -3792 3507 2011 -3377 255 3766 -1280 -3418 3525 4266
1027 4266 -2264 -1079 5143 2513 -1921 1310 3778 -1697 -2283 3790 3294 -1118 -392 1605 -2033 -3350
1043 -3350 1008 1602 -2908 -2991 117 1025 -1242 -1642 -74 -1061 -2709 -2348 821 1999 578 -1013 519
1060 519 490 -1358 136 2986 1701 -679 1562 3742 111 -1488 1657 1390 -2754 -751 3588 -42
1076 -42 -2311 1721 2631 -3396 -3770 1256 -885 -4907 -750 3176 -770 -3479 199 684 -3201 -1222
1092 -1222 2789 -283 -2512 1318 3406 -278 -1101 2218 1536 -1710 -388 3544 3227 559 693 1734
1108 1734 863 -1602 -1100 705 1183 -1366 -905 1478 -29 -2422 -1213 352 -2026 -3320 -82 956
1124 956 -2172 -985 2325 -688 -3278 147 2423 -1312 -1070 4037 3122 -1895 10 3729 5 -2788
1140 -2788 2196 4384 110 -717 2796 1079 -2329 69 1790 -1687 -2746 420 618 -1870 -892 1129
1156 1129 -1526 -3299 -949 653 -1164 -1494 -317 519 -340 -537 -17 622 426 262 320 1829 1313 700
1174 700 1464 1854 -107 -840 883 785 -762 798 2901 423 -1669 -314 -217 -3359 -1484 1923 -791
1191 -791 -4175 -1065 1952 -1931 -3038 1346 801 -3356 -1867 2392 800 -1266 915 1722 -1444 -469
1207 -469 3221 2118 -146 1534 2741 212 -384 1730 1431 -413 -298 414 -115 -56 25 -340 192 97
1225 97 -1318 -2502 -1284 -447 -1121 -869 -101 -1675 -1345 265 138 -843 609 1495 -1469 -1007 2386 1619
1243 1619 -2015 116 3123 120 -1065 3162 3365 -1103 -369 2237 407 -1539 987 780 -2720 -1528
1259 -1528 1966 -560 -4010 -181 2114 -1659 -2749 427 162 -2753 -1704 239 -623 -949 1102 745
1275 745 -759 975 1570 -309 346 2134 1177 -480 103 982 827 1446 1151 -72 497 1507 -432
1292 -432 -1157 969 921 -2744 -2601 489 -149 -2634 -436 912 -1933 -2237 1364 174 -2670 -289 1624
1309 1624 -1815 -2178 2016 2188 -1275 693 3398 877 -1179 1642 3003 24 -36 2418 39 -2448
1325 -2448 710 1823 -548 -984 1745 827 -2168 -1236 574 -973 -2258 -1701 -1304 -1386 -828 -182 -304
1342 -304 -136 39 -569 65 313 484 486 390 -398 -213 1900 2330 178 -418 2025 1767 -844 306 2471
1361 2471 409 -1528 -498 822 -1524 -1479 594 -255 -1668 264 1163 -2334 -2542 618 95 -3005
1377 -3005 -1856 976 357 -1082 694 2226 -58 -835 918 1356 568 989 1182 -150 307 1745 1709
1394 1709 -493 -604 1249 1409 403 -152 770 24 -2441 -2325 510 580 -1933 -2338 -208 450 -699
1411 -699 -630 251 -1408 -1969 -456 191 -556 657 1903 27 -1470 1278 3266 -9 -1181 1734 2579
1428 2579 -509 -145 1979 988 -1018 -117 453 -782 -419 1454 474 -1802 -950 100 -1849 -2461 -309
1445 -309 300 -1415 -1775 259 705 -238 -799 -135 197 -420 -615 833 1792 659 287 1247 1204 249 698
1464 698 2319 792 -715 1087 2276 -356 -1351 1248 184 -2049 -545 2276 -353 -2173 425
1479 425 855 -2211 -2250 800 -625 -3382 -439 1620 -236 -766 1685 1076 -1800 -645 2087 475
1495 475 -926 673 1441 411 761 1544 744 -152 331 712 -115 275 512 -228 -918 -1059 -934 -800 -227
1514 -227 -781 -1258 259 -139 -2334 -1145 696 -134 -2570 -1051 753 -238 -299 2170 1625 -314 1033
1531 1033 1687 -476 -218 3048 1345 -1868 164 2920 797 -1809 749 2017 -1082 -1259 1029 85
1547 85 -1858 -402 -13 -1943 -1566 33 -580 -1482 -246 663 -19 -1326 -456 119 -52 -253 -181 254 807
1566 807 736 495 1663 1872 417 112 1345 635 -556 247 1310 139 -576 732 256 -1242 -400 786
1584 786 -762 -1767 147 293 -1991 -1816 534 -838 -2449 -504 1499 -276 -679 1669 798 -1276
1600 -1276 -225 1303 -276 -1101 1083 1995 590 536 1951 1054 -457 149 694 -43 93 159 -32 -943
1618 -943 -1119 -29 -446 -956 -1329 -1076 -20 -191 -898 -826 -690 -1692 -1770 -44 679 -19 -84 1378 565
1637 565 -165 1414 2028 -372 -779 1213 1210 -572 919 2733 1213 -902 364 1673 -684 -928 1341
1654 1341 271 -1866 -1150 0 -1016 -1586 -14 -112 -1302 -508 789 -24 -1093 -409 -318 -1321 -784
1671 -784 798 1298 998 696 1156 981 883 329 25 667 207 163 362 1194 490 -525 131 -113 -979 -532
1691 -532 251 -528 -1338 -19 -261 -2165 -1636 467 -567 -1904 180 1053 -615 -1177 901 597 -1772
1708 -1772 -702 1262 281 -248 2264 2032 18 151 1442 684 -440 535 1129 -566 -276 802 176
1725 176 -1039 -626 -137 -1048 -947 264 -101 -957 -878 -1050 -1300 -537 -704 -983 -258 477 156 228 922 879
1745 879 0 247 1235 -274 -189 2049 1630 71 704 1490 249 -821 1017 1522 -665 -876 587 -139
1763 -139 -1114 70 287 -1922 -1582 395 -267 -1260 100 696 -1156 -1677 -226 146 -1191 -273 1316
1780 1316 1080 212 1135 1382 591 99 704 298 42 373 546 377 724 724 -49 -578 77 51 -153 -533 -1289
1801 -1289 -1177 -388 -431 -1638 -831 31 -978 -1493 355 1250 -330 -1125 23 -264 -708 201 1055 363
1819 363 191 1158 1256 -166 1135 1951 383 -960 358 922 -408 -398 960 152 -1147 -604 98 -159
1837 -159 -667 -470 -579 -1229 -1331 -432 -636 -212 -385 -814 -823 303 737 719 -119 2 299 531 787 157 701
1858 701 906 675 202 1217 1721 15 -476 566 762 -886 -822 378 -288 -1287 -316 257 -579 -449 170
1877 170 -606 -1241 -527 41 -960 -664 381 -100 -1330 -15 1246 597 -185 724 731 -55 207 1270 731
1896 731 -45 62 519 250 629 965 531 -226 -223 -453 -113 -666 -724 -771 -384 -690 -951 -511 101 -346 -997
1917 -997 -296 380 -392 -246 999 390 -686 170 1318 345 248 1033 1435 353 833 1443 704 190 555
1936 555 464 -617 -89 1065 312 -729 -40 442 -835 -1203 -258 -607 -746 -647 -411 -620 -440 -380 -664 -627
1956 -627 418 719 -392 94 1013 213 -40 278 635 334 852 803 622 828 1327 332 -955 329 275
1975 275 -852 -164 481 227 -842 145 83 -1520 -1096 -16 -1048 -1764 188 662 -989 -1010 449 125
1993 125 -1138 -523 847 580 -354 824 1088 439 171 543 318 92 990 546 272 1000 736 -90 -694
2012 -694 -37 -126 -863 -563 -60 -250 -428 -663 -705 -482 -470 -722 -1295 -625 599 -350 -380 31 156 -107 276
2033 276 871 555 970 856 549 -71 1247 1523 291 -257 697 687 125 476 929 -87 -706 -452 -680
2052 -680 -889 -274 78 -902 -1253 -319 64 -760 -721 -198 -503 -782 200 724 90 -20 86 8 197 454 817
2073 817 750 1172 707 700 376 1049 189 93 302 214 -262 -197 282 -139 -399 283 -309 -1074 -957 -265 -588 -989
2095 -989 -497 114 -591 -529 -58 -190 -439 180 811 23 175 1262 571 -552 139 975 415 187 880 803
2115 803 230 87 298 -64 -291 197 -255 -764 -121 200 -102 -823 -697 -629 -1010 -559 -376 -743 -388 -174
2135 -174 -230 -617 611 777 117 -277 680 838 227 498 403 556 336 505 122 206 742 698 -298 75 981
2156 981 111 -1239 8 108 -1064 -931 -15 -451 -857 -381 -350 -754 -887 -106 -184 -691 411 371 -491 -302
2176 -302 679 552 125 205 1027 545 386 742 643 607 707 375 -385 196 930 -48 -660 -92 403 -247 -543
2197 -543 -137 -540 -649 -519 -540 -844 -273 334 -568 -530 -27 201 -698 -106 781 262 33 405 768 359 390
2218 390 1023 229 192 716 845 357 326 686 45 -590 124 99 -1093 -317 108 95 -760 -682 -133 -753 -770 -548
2240 -548 -901 -488 -337 215 -51 69 431 221 -222 301 517 336 446 757 706 578 1039 641 147 679
2260 679 453 215 413 749 -179 -600 -229 74 -464 -569 -392 -535 -788 -278 -21 -497 -851 -98 -176 -353
2280 -353 -54 67 360 -198 273 326 24 290 549 764 371 407 598 896 92 306 124 430 208 -297 -314
2301 -314 42 -135 -480 -202 -465 -807 -662 -511 -588 -781 -313 -185 -124 -184 93 -89 -328 56 566 -62 111
2322 111 680 561 298 336 961 363 253 513 471 274 342 226 175 -42 -40 -221 -459 -272 -242 -331 -641 -756 -179
2345 -179 -573 -772 -892 -770 -72 -193 -305 163 296 102 -90 47 625 132 718 635 592 57 803 770 435
2366 435 329 840 295 -171 262 541 -157 -437 -116 -175 -653 -464 69 -411 -646 -369 -112 -415 -199 191
2386 191 -696 -637 -17 250 -181 162 562 230 89 777 710 547 128 387 587 697 808 554 -95 153 297
2407 297 -161 -222 67 -89 -341 -878 -90 -176 -714 -490 -708 -907 -72 -39 -618 -546 418 -298 -338 83 1010 115
2429 115 -66 1175 476 19 684 1010 356 -161 592 868 -116 306 528 -48 -158 315 187 -292 -470 394
2449 394 -191 -1034 -344 -247 -760 -470 -412 -424 -562 37 182 -278 329 426 -241 -198 764 682 341 303 681 303
2471 303 275 499 183 -162 344 665 -96 -60 276 271 -805 -37 -123 -703 -802 -105 -92 -787 -278 -160 -513 -621
2493 -621 -228 48 -757 -64 623 54 -218 684 233 -179 -107 756 204 300 977 921 -6 -47 499 188 -137
2514 -137 142 146 -358 9 -98 -216 -375 -193 -376 -465 -518 -248 -643 -197 47 -371 -444 -347 101 224 405 481
2536 481 327 -226 107 744 411 342 871 296 16 352 916 649 -244 490 206 -52 -56 99 -278 -756 -435
2557 -435 -21 -456 -284 -202 -838 -885 -514 -52 -134 -457 33 -29 -53 -79 115 266 671 674 730 91 417 745 143
2580 143 436 653 234 293 239 320 301 54 -80 -669 -194 -209 -249 -625 -603 -530 -500 -992 -405 160 -379 -734 -191
2603 -191 65 -297 -252 -230 -283 17 137 171 196 664 765 496 140 315 573 -12 -184 357 468 -60 18 109
2625 109 -8 296 -397 -643 -715 -436 -322 -388 -517 -298 -660 -649 -885 -185 233 -95 6 288 374 73 54 361
2647 361 507 325 326 417 529 533 340 252 232 338 216 352 -1 -45 -53 -335 -172 -131 -109 -407 -88 -602 -479 -241
2671 -241 -571 -350 -495 -139 -493 -225 -201 144 -126 292 823 200 334 401 333 387 373 962 392 46 438 522
2693 522 -259 91 -3 -775 -107 -13 -68 -548 -445 -469 -784 -932 -250 -364 -663 -477 372 -361 -970 -175 156
2714 156 -110 128 365 176 20 773 591 344 94 619 369 41 420 385 -33 199 237 -243 -149 -15 350
2735 350 -475 -508 47 -459 -630 -363 -440 -997 -449 -159 -418 -287 53 74 -188 29 372 -178 121 584 648
2756 648 209 492 732 579 145 147 309 -1 362 319 232 -150 -13 -16 -739 -401 -141 -365 -684 -159 -112 -293
2778 -293 -603 -343 -504 -501 -121 66 105 -195 454 56 -280 347 451 183 -84 522 583 323 606 288 214 34
2800 34 163 -86 -243 32 77 -631 -468 66 -11 -657 -346 82 -550 -578 88 -273 -787 -485 -247 -368 -122
2821 -122 353 156 170 73 426 214 133 690 656 78 176 374 277 -144 241 452 -165 221 380 -110 -340 -1
2843 -1 -674 -454 -235 -27 -332 -193 -295 -475 -568 -83 145 -354 -529 -75 -50 -271 0 558 292 242 596 510
2865 510 425 626 378 -99 -124 255 396 -192 228 97 -301 -158 179 207 -247 24 -115 -607 -703 -201 -636
2886 -636 -944 -655 -177 126 -473 275 312 -176 -78 233 -100 191 514 309 -86 281 571 430 552 586 429
2907 429 262 -222 -82 4 -168 -136 68 -227 -443 -441 -195 -181 -189 -125 -107 -108 -505 -211 -201 -226 -167 -319 317 47 226
2932 226 351 477 -80 10 340 522 256 -98 337 98 -33 436 585 111 136 257 122 -472 -202 -222 -165
2953 -165 -329 -258 -566 -464 -266 -150 -613 -606 -62 -89 -60 -547 -69 323 -23 -84 238 360 692 132 645 545
2975 545 434 211 573 120 -82 290 114 249 128 234 51 -450 -144 -47 -492 -1113 -407 -93 -472 -650
2995 -650 -346 -117 -452 -184 -169 -239 -108 -104 141 356 -52 152 43 146 177 247 508 733 477 382 298 -75 155
3018 155 -71 -17 -262 -250 63 280 -131 92 124 -375 -760 -21 -280 -311 -354 30 -269 -154 -45 280 75 -317
3040 -317 437 361 128 340 770 243 140 424 547 46 507 514 294 153 77 -86 -55 -348 -448 -567 -522 -166
3062 -166 39 -306 -251 -412 -415 -100 -444 -362 79 -40 -322 -243 -74 57 -171 259 458 -240 281 526 247 103
3084 103 295 346 331 -148 87 293 395 107 515 -135 -518 -282 98 -185 -377 -332 -400 -107 -292 45 -32 -432
3106 -432 -149 -45 -11 23 -8 14 45 338 39 254 73 -91 464 381 519 531 367 65 143 -230 11 12 -113
3129 -113 275 37 -218 -349 -238 -224 -486 -452 -179 -216 -538 -436 260 -196 -521 -36 239 -167 -44 271 478
3150 478 153 405 311 255 13 788 361 42 147 626 385 -52 -76 2 -199 -341 -385 133 -274 -224 -115 -259
3172 -259 -471 -249 -377 -412 -464 60 -250 -422 170 6 281 -5 107 211 592 -79 350 410 262 286 -83
3193 -83 110 355 24 -88 23 126 212 -2 -257 -267 -461 -96 -105 -181 -239 -57 -275 -396 -139 -180 -286 -467 -51
3216 -51 -387 -343 -325 261 230 306 588 75 -65 351 554 255 -37 57 639 252 -144 -16 476 111 -102 -26
3238 -26 55 -300 66 -231 -634 -76 -393 -213 -338 37 -325 32 -174 -80 63 63 90 -193 -12 195 185 323
3260 323 568 279 204 191 405 247 243 521 84 184 -60 116 -58 -299 -238 72 -181 -468 -224 -250 -178 -127 -139
3283 -139 -289 -424 -259 -253 -331 -106 209 184 -34 -258 130 317 10 356 337 580 328 479 473 -100 179 285
3305 285 53 -34 90 -50 -165 -493 -112 -21 -303 -39 -423 -46 -564 -45 -135 -196 -430 -258 -161 -551 -103 177
3327 177 230 153 6 482 301 252 343 420 343 -346 -37 207 -45 70 444 166 88 -167 -289 -130 -421 -243
3349 -243 -368 -313 -688 -572 -323 -258 -235 -151 -26 -254 184 -146 -107 -173 200 312 77 94 388 559 165 478
3371 478 340 202 57 473 469 207 158 134 -167 -286 -137 75 -200 -236 -249 -307 -303 -418 -400 -252 -364 -530 142
3394 142 -32 -89 94 111 12 107 224 319 312 182 203 109 446 465 210 293 280 356 158 314 51 101 115 6 -263
3419 -263 46 78 -176 -403 -67 -53 -184 -244 -95 -308 -749 -53 -78 -312 -348 160 192 23 -125 284 431 446
3441 446 514 381 241 243 -33 184 -60 365 -8 -31 310 156 -103 -118 -83 5 -381 -364 1 -417 -397 -65 -359
3464 -359 -209 -29 -474 198 83 -196 -209 -60 -267 -129 230 385 384 168 -73 -23 242 389 310 231 105 207
3486 207 199 303 -246 -231 -280 -214 -18 -13 -252 -397 -531 -303 -418 -325 -169 254 -284 -78 -105 190 26 -132 149
3509 149 239 17 43 274 155 147 848 294 199 530 85 124 -34 332 91 -107 -418 -15 -62 76 -289 -168
3531 -168 -236 -118 -449 141 81 -314 -612 -49 102 10 126 51 240 -85 45 -79 379 62 183 388 -162
3552 -162 317 415 327 169 145 -185 0 -33 -28 -57 35 -219 -30 -94 -252 -434 -655 -208 -43 -148 -17 115 -205
3575 -205 105 -123 -345 -274 -154 165 354 92 371 406 -10 380 459 50 287 499 253 305 -181 58 273
3596 273 59 205 51 -602 -134 -113 -229 -240 -301 39 1 -179 -242 -231 -136 0 -145 -144 126 59 153 -20 259 125
3620 125 335 643 328 356 159 232 398 559 187 290 -178 14 46 86 -113 -249 -268 -346 -215 -221 -298 -563 -178
3643 -178 -323 -240 -384 -164 -160 -384 -108 268 -4 105 310 115 152 152 230 50 559 538 536 168 200 66 67 55 78
3668 78 -66 -105 -66 -267 -58 -62 -475 -309 -87 -438 -429 -279 -198 -298 20 -34 27 -469 49 203 242 174 350 372
3692 372 2 285 515 371 -89 202 -150 94 -26 52 0 170 -40 150 -15 -319 -27 -301 -69 -251 -175
3713 -175 41 -371 -137 -47 -310 -211 -186 -242 123 -5 -32 138 -57 189 115 486 84 172 276 374 28 340 332
3736 332 -79 102 120 -167 70 9 -185 -73 -504 -655 -72 -116 -167 -26 -210 -132 -342 -446 130 -91 -137 93
3758 93 72 229 -7 175 161 241 202 540 -38 246 411 515 105 44 77 -331 145 -29 127 169 -269 -101 84
3781 84 77 -508 83 -187 -142 40 -220 -315 -285 -327 -51 -5 -302 220 43 -68 120 217 166 141 257 361 25 158
3805 158 39 289 126 -60 262 122 -69 -168 -75 157 -541 -329 -57 -179 -351 -108 -331 -403 -339 -310 -266 -414
3827 -414 -177 143 207 -14 -285 -115 92 102 107 213 263 -322 305 257 59 -16 238 481 -70 -31 219 197 -90
3850 -90 133 -12 -355 -236 -414 -587 -400 -284 109 34 -37 -81 -339 -349 41 25 100 -188 -18 243 6 219
3872 219 238 432 141 154 152 262 70 193 367 -5 -69 86 -86 227 -187 -69 38 -247 -157 -19 -251 20
3894 20 -253 -83 -183 -103 -188 -12 8 -211 84 -146 77 33 186 236 190 339 332 175 267 514 290 149 171 -17
3918 -17 28 -60 -11 -191 -51 -312 -236 386 -249 -380 -280 -185 -54 -198 -147 188 -274 56 380 9 -225 -21
3940 -21 179 273 -172 72 39 197 228 62 -52 -21 223 9 -281 85 17 323 -201 -151 -140 -44 -147 -132 -137 -392
3964 -392 -69 -11 -277 -71 -189 -271 -34 -384 -217 147 -339 -65 18 95 80 91 433 52 295 250 84 89 -33
3987 -33 -148 390 -184 -29 -43 28 -201 -246 -9 -339 -111 -207 122 -289 -161 -193 -125 -123 -289 -112 181 107 -48
4010 -48 146 42 -369 137 330 348 -70 323 137 -232 -137 217 109 -1 215 405 -33 73 -221 -5 -129
4031 -129 -424 -463 -83 -63 -288 129 -486 -380 -99 -50 -138 -261 -204 159 -41 -97 258 -107 7 -74 132 2
4053 2 71 494 288 92 294 58 449 -62 363 36 -16 -159 17 214 -121 -341 330 -158 -354 -414 186 -14
4075 -14 -309 -481 -150 146 -312 -36 26 333 -116 128 -349 39 245 45 -132 295 218 187 -1 37 -11 443
4097 443 3 34 -71 160 -89 -296 -120 -47 -52 103 -202 -321 -403 -67 -149 -71 -201 -256 -56 -71 27 5 -264 -125
4121 -125 147 184 144 -5 396 477 138 428 157 303 139 171 147 194 -27 345 -16 -183 -354 84 -374 -505
4143 -505 -193 -249 88 -112 245 -76 -254 -32 155 98 -132 154 301 87 125 243 -97 90 204 528 65
4164 65 29 387 76 -7 437 -208 269 -65 96 -60 33 -235 139 -98 -337 -270 -127 -145 -96 157 -147 90
4186 90 10 -431 -174 11 80 -70 5 40 -264 379 119 212 183 368 459 -44 130 280 -55 -81 97 135 180 -51
4210 -51 95 122 6 -390 42 -20 -104 309 -12 -429 -228 -152 -238 -95 -328 -153 -7 11 98 224 277 86 153
4233 153 454 43 -71 359 269 197 110 36 132 90 21 -36 209 -222 -280 -66 -291 -236 -30 -67 31 -157 -164 105 -57
4258 -57 -71 -11 78 -73 208 78 -176 -138 222 247 -64 72 440 59 1 127 323 286 -44 -61 -210 30 -114
4281 -114 207 75 -164 -142 68 -182 -158 -327 81 -218 -281 -210 53 -146 -63 -112 58 -171 117 345 -99 -135
4303 -135 318 181 -50 414 -32 106 135 87 54 175 115 -116 141 -93 -208 112 -112 -141 -251 74 -69 -245
4325 -245 -276 -162 15 -84 -119 -7 -106 117 156 -23 -278 -279 166 40 99 222 207 -3 303 235 247 -74 138 164
4349 164 -143 -179 -43 -145 -95 -358 -213 -165 -221 -76 -115 -83 -379 -75 -332 -189 -289 -454 -99 -158 -140 -85 185
4372 185 -32 -28 85 -123 138 211 134 349 44 329 366 -81 298 15 -125 -40 3 80 178 -4 277 -206 -106
4395 -106 -137 -43 -137 -280 58 25 -92 -319 220 -56 -129 23 -58 1 -319 -254 184 262 -250 114 9 5 70 17
4419 17 121 32 -95 -51 -154 -34 223 -261 -189 -170 -90 52 -114 -133 -32 -167 -320 58 279 -298 170 -233
4441 -233 -38 -87 49 -178 -152 218 115 20 169 333 154 -28 -21 234 402 131 8 118 233 -177 -199 -185
4463 -185 126 -127 -143 -282 160 -110 91 56 -153 -223 -117 90 -311 15 -52 196 -83 -13 -212 69 146 -126
4485 -126 36 330 235 180 107 189 -295 -73 157 38 46 158 -189 -185 -242 -78 -294 -498 -48 -138 240 -136 -126 52
4509 52 -46 -62 27 -202 -332 -40 -141 -50 35 -203 169 85 224 168 -13 -93 256 12 -31 196 385 129 297
4532 297 114 33 69 140 177 -225 -43 -34 -272 -96 -68 -506 -388 163 -268 9 50 -2 97 -95 399 -158 -308
4555 -308 -245 189 -22 -178 662 97 -38 -21 -64 198 4 193 -10 -247 143 -105 210 -136 -134 -20 -174 -84
4577 -84 -42 139 66 -105 -180 -151 -172 67 -218 80 -32 208 204 -38 -54 183 -50 340 26 155 265 -135 -100
4600 -100 200 49 12 85 -20 6 -296 -84 -25 -50 -293 -134 -123 44 -100 112 -66 -152 -17 87 -8 211 77
4623 77 136 93 -59 288 37 -15 -80 45 115 109 219 231 182 -301 -234 -155 271 108 325 190 128 -141 -75 169 -129
4648 -129 -76 50 189 -40 -99 -234 -183 102 -76 -70 192 -153 305 145 406 -104 418 64 79 -25 314 128
4670 128 193 -38 156 -181 -12 -39 -142 4 103 -150 -66 -127 101 57 -48 146 -197 -14 -221 -92 -56 -118 -41
4693 -41 254 159 416 73 -5 -202 -124 -302 -44 569 218 81 315 119 -15 -16 290 207 -174 -303 110 23 -61
4716 -61 -170 -221 -276 -449 -74 216 -215 -271 -89 -396 -242 -92 -157 -77 -62 112 140 16 137 171 421 208 -149
4739 -149 174 -148 -156 -85 160 -13 -4 -64 -89 -34 5 -354 -91 219 -128 -183 -130 49 -228 -348 -294 36 112 -56
4763 -56 103 -118 -196 132 -27 -341 178 -78 -29 98 313 5 212 158 26 318 94 -93 22 90 -24 -6
4785 -6 -279 141 211 139 -164 72 30 -66 -69 -82 -303 -235 7 -248 -322 -228 -208 183 60 130 129 74 45 -66 77 -6
4811 -6 56 -29 -6 190 262 -4 235 -75 68 99 164 -52 -226 65 3 -215 -372 23 -297 -34 -312 24 46
4834 46 222 -225 135 56 106 -81 -364 136 105 -184 206 -61 171 18 26 180 -95 120 130 140 113 65 180
4857 180 -131 -7 -99 2 26 -28 -240 -121 75 -115 -38 355 96 -168 -246 -140 5 -58 -53 53 208 26 150
4880 150 55 137 205 -115 217 -14 176 257 57 122 -157 -281 238 -90 42 247 75 20 -167 6 -124 -33
4902 -33 -279 -192 -22 -108 -119 -186 29 -86 153 -124 -114 -69 89 26 -174 161 172 -82 -106 -13 -121 -46 303 -64
4926 -64 -53 -318 -40 -126 95 -395 -253 -131 -193 -22 -79 89 -161 -132 -152 -184 -119 52 212 75 -62 39 -68
4949 -68 -85 157 -165 82 -207 139 159 231 225 453 380 -53 163 28 104 -95 161 -248 -61 -175 -299 156 -158
4972 -158 -146 -141 112 -86 -177 171 -94 -178 -177 98 -51 109 156 81 122 213 89 -7 103 -4 316 146 73 69 351
4997 351 38 -54 278 -187 -73 -301 -61 -106 -238 -11 -313 -266 -7 -144 -148 -392 -293 -16 -60 5 226 192 -25
5020 -25 -6 140 -107 -86 78 10 -69 -282 212 -71 92 -152 35 232 -80 -40 -12 -115 -137 144 125 157 -428
5043 -428 -21 -109 -260 -20 45 -27 -209 -327 -70 -197 -421 166 92 -4 38 256 140 -130 98 299 94 -53
5065 -53 109 29 199 -97 -101 -66 -131 -32 286 -111 -156 -383 -28 -169 -372 -97 -80 -72 85 259 116 100 -95 48
5089 48 -203 -89 91 9 111 136 23 420 -175 207 13 15 136 -184 -93 267 -175 74 149 -81 -153 70 -158
5112 -158 -56 -66 56 14 139 -102 -159 -102 -87 -113 -37 -229 -140 136 -86 295 113 -77 -52 389 -69 189 241
5135 241 52 185 -8 114 -105 107 -225 -41 28 -120 69 235 -84 -258 -22 81 -526 -135 -152 39 -158
5156 -158 10 9 134 -6 -157 104 107 -31 -199 212 -47 -33 -80 127 -45 18 139 -43 231 -40 164 205 121
5179 121 145 84 231 22 -214 19 -282 20 -252 37 -85 -168 -126 60 -203 209 -42 -64 -7 41 207 -159
5201 -159 82 -100 92 197 -123 209 41 -217 227 53 229 193 45 -82 98 -158 -198 19 -82 194 -42
5222 -42 -138 -5 -179 -296 -43 72 22 -30 -13 -71 86 -220 -113 24 -154 -125 -154 130 289 156 90 333 66
5245 66 194 142 -10 246 -17 -88 118 -84 -19 -136 252 -121 269 -144 87 -143 32 163 -102 262 -162
5266 -162 -271 -115 197 -32 18 35 -67 -138 112 165 -18 484 142 80 194 38 39 217 -71 77 341 -89
5288 -89 -8 -203 -35 257 95 -63 21 -131 -50 164 -193 -180 100 30 -16 228 -104 90 95 -371 -33 6 244
5311 244 -36 10 -69 13 408 -23 -41 313 108 269 145 -38 -32 -166 132 -146 -108 -279 -169 -212 -170 -123 127
5334 127 37 -120 -331 -203 -388 -298 -17 -133 153 115 285 12 61 -91 54 110 -196 359 -168 367 -183 -55
5356 -55 53 97 307 55 51 -244 -118 -108 -97 -16 195 -20 153 276 97 53 -65 -475 63 254 -99 54 -96
5379 -96 -3 -34 416 -180 153 182 52 -95 158 179 359 152 -477 41 -237 250 35 -137 -27 119 123 124 34
5402 34 100 150 181 15 -416 -203 -161 109 -89 54 32 313 -114 212 132 -35 45 20 -42 65 74 29 304 68
5426 68 306 -127 -116 -89 -44 227 146 124 142 85 -153 -146 67 166 -142 -209 -151 -133 -102 -70 -54 -138 -127 137 -34 247
5452 247 -149 -144 -88 59 53 -32 -185 -12 154 -195 -47 -144 131 -160 105 268 -139 61 -20 29 -127 -310 308
5475 308 -170 -338 -80 31 -159 -381 67 -193 -121 95 -14 103 -150 298 -300 37 102 1 -47 39 197
5496 197 -96 -21 -51 417 157 7 -108 37 118 -54 94 -154 -111 -165 263 48 -35 -7 -321 -39 -30 78 -120
5519 -120 77 72 -69 -29 -47 -18 166 -326 206 -362 130 75 -41 216 58 116 226 176 215 120 -108 -37 187 69
5543 69 252 236 73 -176 -31 -33 17 -10 -178 43 178 54 110 60 87 70 -22 -84 -79 -258 -8 40 -182 -40 217
5568 217 152 -155 334 65 -67 -163 115 32 77 -121 311 323 29 89 140 42 -109 178 -80 -215 47 154 -98
5591 -98 -85 -226 -229 -181 0 259 -62 24 351 52 142 -15 56 163 107 350 163 32 -65 205 -104 41 48 -185
5615 -185 -21 -59 -46 38 -221 -41 -240 14 -248 -11 11 -45 -326 -54 -53 -49 -64 177 200 370 107 118 0 -100
5639 -100 110 437 -21 107 243 59 109 275 -107 2 -29 111 -98 -134 -178 -22 152 -137 -18 46 -69 37
5661 37 -108 45 -96 285 -307 -294 -292 -99 26 57 54 -106 161 -129 77 200 -159 50 -8 -40 359 -227 230
5684 230 161 -65 49 201 -54 218 -179 -205 -325 -112 60 44 41 -174 161 -199 -215 47 -190 -84 359 -93
5706 -93 49 -213 -123 26 12 166 -336 -10 128 206 -145 10 12 109 296 -120 107 52 -5 176 -11 264 -124
5729 -124 41 -119 84 -126 -11 56 -159 -40 -235 17 -118 346 63 267 76 360 315 -151 -212 9 -164
5750 -164 -128 165 88 14 -51 194 -48 -331 48 -141 170 -41 -275 -406 -24 -90 -54 -409 -89 38 12 141
5772 141 -12 311 60 -156 94 -136 -215 183 -130 -59 117 39 93 52 -72 211 -62 -29 -32 -338 -65 55 -56
5795 -56 307 -2 -56 -270 86 -25 -157 48 267 -255 -134 -216 112 173 -209 -38 76 -47 -50 366 -88 -5
5817 -5 21 400 80 -179 148 -102 -176 -1 -67 -65 -133 118 -221 -2 -219 -75 -285 -57 -80 19 -35 -238 129 -44
5841 -44 -71 -150 203 -326 -67 -164 79 29 -8 89 -138 155 220 341 -65 -52 -112 -91 160 47 -150 348 111 -63
5865 -63 -127 122 101 21 149 90 -28 -43 -140 161 -64 -35 68 -6 105 -8 -45 129 135 -257 -30 103 26 -242
5889 -242 -151 22 -137 -98 258 23 174 303 94 57 -148 146 128 9 156 -334 22 1 141 -83 5 68
5911 68 -20 53 83 -251 -161 14 -77 155 -112 161 -8 252 8 262 218 168 64 -194 217 -17 61 -171 141
5934 141 -29 118 -16 158 193 -247 59 -42 -166 -98 14 -274 21 -155 -407 -206 -262 -135 360 89 257
5955 257 95 -34 -156 -254 33 442 -88 -196 20 233 31 156 -150 89 20 -134 -324 379 -86 -135 143
5976 143 49 -147 162 -146 107 66 -200 70 45 182 -78 -325 -252 109 -340 -21 23 28 195 -66 24 -16 -85
5999 -85 73 174 139 -164 -71 125 73 156 55 -49 -56 -45 -37 -2 -54 250 217 136 -395 -11 -79 106 83 -196 -77
6024 -77 -103 -54 -329 107 333 -138 -133 -18 -319 109 -329 128 -206 27 22 90 6 -8 -7 72 45 111 -31 -111 -3
6049 -3 -297 357 50 45 -28 -63 442 -17 -210 -131 -193 -264 -72 -197 53 -362 -110 -203 194 46 108 24 145 52
6073 52 118 317 34 155 165 -194 -109 -18 -216 -63 -89 175 -198 -254 64 -137 -59 -47 -72 -53 -96 199 199 -140 -239
6098 -239 132 -68 -192 -89 -25 -378 -63 -40 6 19 318 -216 -121 -123 123 371 124 88 56 149 -72 79 88 192
6122 192 115 -109 -144 -73 -173 100 115 104 -202 -33 -147 -167 -131 -65 -91 46 56 -118 -68 -258 202 212 161 -215
6146 -215 52 114 75 174 230 1 -161 -63 -230 -182 85 -274 20 110 -256 -173 186 -144 213 103 266 35 -18
6169 -18 5 108 136 191 136 -158 -83 -166 196 235 45 198 373 -202 -119 -87 -373 386 54 102 82 103 -6 -256
6193 -256 -215 -65 80 246 157 16 5 -71 19 -15 -328 -42 -143 381 163 -192 151 -484 -15 16 95 -21 -3
6216 -3 -39 35 -125 196 -201 -26 -84 122 -36 256 6 -100 -9 159 129 -143 -58 -66 149 61 288 -1 123 -49
6240 -49 -187 139 -258 366 69 25 71 -127 50 -16 196 -43 243 56 -187 -96 51 -143 78 204 -51 -145
6262 -145 147 60 384 -111 -122 3 8 -101 -174 84 160 203 -125 213 -10 -202 17 -106 -40 -87 -19 77 132 156
6286 156 -185 113 22 43 -14 -121 345 -113 109 -33 -156 -8 -90 201 264 -42 29 139 274 -365 33 -136
6308 -136 -72 361 75 -35 -162 5 -109 -222 -201 -118 58 -123 88 6 -108 -37 121 205 -191 217 -42 73
6330 73 -128 300 16 -18 -20 228 71 -115 -375 266 299 -301 -33 148 -294 89 -140 95 234 -241 78 -406
6352 -406 -230 116 -218 -180 -22 -27 69 77 25 -116 -18 -69 66 -158 170 -39 -78 14 171 238 192 -14 90 -7 78
6377 78 -34 -112 -75 -104 -92 -233 -37 -146 6 -152 -1 -387 73 -60 218 -35 59 -3 -170 -6 203 -49
6399 -49 -107 -120 118 109 -168 -168 7 328 -310 -141 194 170 58 -223 207 3 -77 62 189 -14 -124 -271 133
6422 133 -134 -126 -113 -83 -151 -114 -78 5 171 225 -82 38 -7 61 -212 221 -38 -95 -155 -92 -108 215 99 131 -244
6447 -244 24 -198 119 -42 -221 -11 -83 9 64 -174 236 -11 -150 6 132 -14 -62 -267 -129 -202 -228 42
6469 42 162 310 -263 -32 -20 -25 360 75 -163 -134 -10 -18 90 -44 -11 235 89 -26 -150 195 -26 -78 -36
6492 -36 222 -102 -205 -37 318 214 58 -57 -146 -32 107 92 188 98 374 -100 -172 17 2 159 88 33 87
6515 87 -80 -40 -182 399 -26 252 227 -38 -34 -7 95 563 219 -215 -378 -119 158 -352 224 -207 -124 69
6537 69 -143 89 186 113 -191 389 115 140 121 -226 -156 -34 274 -166 -22 -215 84 -193 221 156 -42 241
6559 241 -189 -157 -46 123 -355 52 123 -55 -40 144 -251 -150 -120 -104 -87 38 123 131 133 37 3 -19 -141 291 91
6584 91 -332 -143 -106 48 14 294 18 -136 44 -100 -171 197 -163 40 -110 -154 -384 134 194 169 -208 69
6606 69 13 -207 -266 118 -55 -427 50 299 77 322 -113 88 311 41 432 180 81 -206 90 35 24 -160
6628 -160 110 -158 25 25 -193 71 127 94 61 209 -254 149 66 -78 30 -20 135 -118 -75 251 94 -379 32
6651 32 75 -215 128 101 102 -170 -209 -104 -323 -4 111 -54 7 207 -14 -142 -313 157 -201 152 205 -87 67
6674 67 -268 264 25 -201 -143 36 -193 146 -99 146 -83 -191 -193 97 102 -6 -4 171 -57 -16 55 -306 -49
6697 -49 137 -436 -206 90 31 -49 253 76 -418 -34 -66 260 -101 -139 -166 134 -18 216 -248 -306 -108 151
6719 151 177 -113 79 -97 -115 -20 -313 51 -96 131 -141 216 220 -70 327 323 -53 88 109 71 -4 -198 -152 96
6743 96 48 243 205 89 140 -328 -36 -60 12 -186 92 -264 -196 156 138 -74 8 239 -1 -166 0 102 46
6766 46 151 194 153 -8 29 -308 77 -12 -81 367 -122 120 -9 -88 -1 76 -52 -223 -167 -14 -14 -94 -80 -37 -6
6791 -6 44 -158 80 144 223 102 -65 -281 22 -136 -142 -99 170 -194 236 -93 50 137 -93 -34 151 149 -78 6
6815 6 142 -141 -99 -152 162 55 -163 222 144 -404 4 -308 158 -314 -62 236 -179 150 -164 118 85 64
6837 64 166 24 183 -17 -61 -24 -157 -204 -206 73 90 95 -139 -233 -319 78 -103 47 -27 -179 4 -150 -72 174
6861 174 -11 44 -71 252 111 -41 -74 53 98 194 10 173 39 108 59 -94 -27 143 118 -81 120 -48 -30
6884 -30 93 -95 -93 -85 -220 126 -112 -18 -204 189 -83 -284 -318 -45 109 -291 -45 125 -9 23 74 -161 -23
6907 -23 175 52 78 66 243 129 192 72 -25 101 91 238 40 -126 50 -122 -55 -62 85 -14 -12 -77 -268 -184 -267
6932 -267 -79 58 -193 -140 -159 -95 -344 -195 231 -78 1 -198 -94 106 -145 -279 58 -23 -203 -91 -47 -48 186
6955 186 54 253 -119 -129 -38 5 -45 171 192 -191 125 -72 113 68 144 -341 -212 102 -75 162 -62 -100 276
6978 276 -132 -122 -68 182 58 379 91 -131 -46 -154 243 -110 115 19 -89 -76 -307 34 132 126 -227 53 -254
7001 -254 139 -229 111 124 -43 105 2 -111 -166 -203 62 89 242 -127 94 133 -39 -88 -213 135 84 4 41
7024 41 181 39 150 148 60 98 -12 -73 8 88 -254 -136 -10 -350 -107 270 251 113 -307 -133 160 52 -224
7047 -224 259 -36 261 64 -124 -189 53 91 50 -70 97 178 -334 -46 -44 22 -6 -103 -97 -107 241 -76 80 -171
7071 -171 85 75 76 16 -75 48 -245 276 -180 -72 17 -11 -148 -97 232 -6 -128 -143 234 -37 11 -52 -192 104
7095 104 14 16 -17 -46 -184 76 -290 172 34 341 -50 -314 -2 383 109 105 47 -48 -139 -8 71 214 41 148
7119 148 205 323 -35 -113 173 72 87 55 254 43 291 182 -350 -309 -40 85 -52 46 -135 -298 253 60
7141 60 301 -100 177 124 -172 30 137 184 -150 -133 -84 -101 63 91 -15 -149 -40 442 53 92 116 -243 212
7164 212 153 27 222 188 14 242 -142 103 -67 -126 87 37 -113 89 188 38 -147 -92 25 -29 79 33 -114
7187 -114 -174 -27 222 63 347 -53 -75 187 263 20 -222 -352 220 81 94 124 -82 143 -215 257 -337 -200
7209 -200 -53 -109 -274 300 122 137 -230 -4 226 -271 -132 -105 -195 -86 197 102 -248 194 -190 -156 -312 280
7231 280 -23 -10 199 -76 -39 -89 165 -9 -196 -148 -69 -256 -31 -40 29 -92 279 26 -170 -253 98 -7 -449
7254 -449 -16 145 48 -115 -33 -166 151 23 -54 51 -118 238 15 333 127 35 191 -141 97 17 43 -13
7276 -13 157 -38 158 78 -79 -45 -325 -17 59 248 -41 24 66 -210 43 -20 289 98 -140 -18 329 307 -129
7299 -129 5 93 -13 163 272 158 114 50 80 243 -24 -29 -30 2 54 68 367 -51 -139 -301 -181 20 -92 -43
7323 -43 168 -150 -21 -183 12 192 -286 96 -92 34 -169 -254 -126 257 24 78 132 32 -260 328 179
7344 179 -26 71 -159 199 201 -6 15 -67 -64 90 122 107 -20 36 137 -39 -63 56 -72 -126 -341 29 133 -160
7368 -160 -348 40 219 -102 -25 -12 275 41 59 28 -71 131 4 435 142 131 226 146 134 271 -285 80 9
7391 9 231 -343 -90 -146 -253 -176 -103 218 111 -111 -7 -207 -113 -128 136 146 -118 108 411 -112 21 -77 332
7414 332 -92 -6 146 217 149 339 202 6 77 -208 -116 -121 -21 82 64 89 -152 -391 232 43 36 95 1 142
7438 142 -12 -268 -94 215 62 69 -110 96 58 187 67 -121 42 -77 -39 -61 -101 127 175 44 77 197 -87
7461 -87 52 -79 42 103 -38 151 -141 117 56 363 -21 -172 80 -50 -162 -98 307 38 -17 115 -100 -137
7483 -137 43 124 -155 239 124 326 11 89 -264 -226 194 -366 -121 -186 -227 174 55 -408 -218 2 -300 -96
7505 -96 -37 -146 -66 30 157 -111 -134 -33 100 11 49 -148 -152 100 50 33 63 117 150 -49 100 94 55 541 -63 -336
7531 -336 60 -21 -128 -147 61 -370 9 -58 -355 -246 -98 23 -198 45 -155 1 -59 -111 76 -223 -88 -109
7553 -109 -24 221 -201 332 -177 -192 -4 156 -46 -127 -216 -97 -148 -121 -201 26 -92 85 159 -188 -348 -205 74
7576 74 -118 -4 -96 -1 -174 248 -37 84 -53 39 77 -133 185 -82 41 201 -14 -23 -179 183 -60 275
7598 275 -128 57 196 -293 11 -83 44 38 -150 -149 -192 -220 -66 106 199 -106 89 204 -449 82 -226 253 -21
7621 -21 -7 -205 214 -9 -271 129 129 -213 -142 106 201 70 133 416 -35 77 24 -21 -96 -216 39 -276 -146
7644 -146 -183 -177 42 -251 1 121 -64 -136 169 -9 -87 161 287 -112 290 -13 -90 -2 -47 -50 142 143 313 221
7668 221 3 23 -41 -13 -57 -212 142 -61 178 12 -310 -224 106 100 250 -149 90 -343 -142 -107 -129 -148 119
7691 119 7 -79 62 -4 -68 -202 -75 -84 -270 85 156 165 53 1 100 190 203 64 -29 -47 131 -78 -124 -272 210
7716 210 0 -162 42 -45 28 -97 3 146 188 137 349 -140 81 13 79 -124 209 38 -211 194 76 95
7738 95 -49 95 253 31 99 201 137 -259 -228 87 276 -93 39 -137 -265 -177 -66 -81 -112 197 -23 -183
7760 -183 -162 156 -106 -189 42 -496 180 198 39 -141 101 -2 -87 -495 88 -180 141 -82 -137 -42 268 -301
7782 -301 75 -114 -111 48 -18 -129 -105 30 58 -215 -13 -41 -272 70 117 -219 -225 -246 -198 345 -204 -299 -323 -37
7806 -37 -322 -397 107 2 145 78 45 215 205 71 -11 247 63 5 181 -260 -46 -198 99 6 -336 -43 -299
7829 -299 -102 -93 -354 -83 191 168 -10 69 186 -16 -242 147 281 -60 38 102 117 -131 -114 212 313 146 -38
7852 -38 -34 -46 20 -11 164 138 -22 54 -177 -4 -31 399 -178 5 -10 -19 -327 -118 -71 222 -14 78 -352 -128 -137
7877 -137 -192 -323 -187 215 263 137 66 105 27 269 3 45 20 130 -217 22 268 149 -28 -361 99 -289
7899 -289 279 19 -57 295 -281 132 255 36 -258 -102 -2 148 317 -129 76 -65 -129 10 -230 198 -134
7920 -134 69 -80 49 345 197 -39 43 141 136 -248 -42 -74 27 -94 83 89 -133 -24 -124 -18 302 -405
7942 -405 -117 241 -135 -108 -96 -73 -36 255 103 215 -237 -77 -152 94 -58 -8 -147 -37 -6 282 -254 102
7964 102 -188 146 -209 -139 273 -72 -181 54 -76 122 -328 -207 22 44 -112 -171 -25 -95 54 137 -101 571
7986 571 222 73 -169 -55 -194 -10 -35 -347 -10 -96 -130 -212 204 119 142 -360 -93 12 30 -52 -76 3 130
8009 130 -87 -368 -221 -106 -177 44 -123 241 3 -336 -264 -166 -40 -311 -50 414 -37 63 -307 -6 121
8030 121 86 58 64 186 -101 176 154 74 -177 125 -169 -213 -225 5 -150 -124 226 11 -139 141 56 344 -199
8053 -199 172 -97 -212 -35 348 33 179 -90 -56 76 77 -69 64 46 192 295 65 28 -116 53 -339 24
8075 24 -376 -182 -9 90 -99 165 -183 -119 97 -180 184 -11 234 32 26 -101 -101 86 -41 12 52 -96 388
8098 388 86 299 251 -4 256 372 34 92 226 215 84 -188 50 37 -179 -73 170 69 -44 -124 -322 197
8120 197 -96 -75 -36 -170 -118 33 -349 95 292 -114 -57 14 44 159 -2 56 193 134 14 -36 237 63 174
8143 174 157 33 16 -75 236 -151 99 -353 361 -22 -252 71 -18 -100 -189 -18 -102 22 -229 195 -50 281
8165 281 -195 159 98 37 -234 180 65 160 -277 -34 8 124 72 -206 -92 88 146 79 110 -159 -405 204 -176
8188 -176 22 78 142
8191A42
$$ Imaginary data points
##PAGE= N=2
##DATA TABLE= (X++(I..I)), XYDATA
0 0 0 0 0 0 0 0 0 8 -8 8 -8 16 -16 16 -24 24 -32 40 -44 51 -61 72 -81 93 -106 122 -138 156 -177 200 -224
31 -224 251 -281 314 -350 389 -432 480 -533 589 -652 722 -800 884 -980 1089 -1214 1356
48 1356 -1521 1714 -1945 2228 -2582 3038 -3655 4530 -5872 8157 -12788 25764 -130590 -469081
62 -469081 -3310 287669 -32405 -204118 100216 184095 -75073 -135460 41233 42721 -47441
73 -47441 -2773 35251 -37066 -17298 72766 24081 -86417 -42160 55390 33284 -25041 4947
85 4947 40990 6846 -29592 -10716 12961 1646 -7801 13036 14939 -24614 -31579 23051 37400
98 37400 -14799 -15818 36108 4615 -67745 -23743 55699 10128 -50223 5863 42737 -22567
110 -22567 -30784 35137 9899 -51951 9170 66163 -15363 -54230 40825 49108 -62730 -47531
122 -47531 70614 40780 -59425 -6372 74311 -698 -66013 9690 45275 -33910 -40648 42048
134 42048 32314 -43097 -19603 42846 6495 -46066 -8247 29432 -6714 -25657 13363 19821
146 19821 -20823 -19782 21137 16305 -19876 -6264 28302 4315 -33534 403 48101 12217
158 12217 -41291 -12092 32851 2262 -28154 15599 42958 -5383 -32802 4153 14290 -17280
170 -17280 -10472 15553 -5798 -23741 11671 24858 -16013 -22031 14930 3516 -32564 -5555
182 -5555 34903 6505 -25601 -222 11716 -19021 -13411 28363 20751 -15646 -2103 23187 -3958
195 -3958 -26165 6981 26539 -6865 -21763 10959 21153 -6989 -10895 10903 4275 -19577 -10669
208 -10669 12751 7427 -7794 -2500 1742 -11848 -12055 8081 10311 -5955 -1631 12511 -2204
221 -2204 -19990 -408 20793 983 -17043 6372 23114 -845 -15807 7178 19399 -723
233 -723 -10106 3737 7365 -3570 -3030 3771 -1163 -5591 2095 4362 -4491 -4812 3327 -448 -11884
248 -11884 -6068 6946 1148 -10951 -4752 4998 -2214 -6885 5511 10268 -3543 -5790 8412 5898
262 5898 -9346 -4526 8981 3047 -3577 8297 11968 -2712 -6054 4357 1145 -5022 5333 9882
276 9882 -7245 -13427 676 3252 -5666 -137 7871 -2014 -10035 -1799 1219 -5324 -1969 3776 -3627
291 -3627 -6807 2662 6188 -385 661 3747 -1375 -877 7688 6698 -2194 -1246 1873 -2784 -2295 7208
307 7208 8824 2624 -120 -2455 -7330 -3985 4487 3447 -992 -51 -3055 -9873 -5868 1648 -591
322 -591 -1652 5484 3354 -6963 -3192 4386 -3265 -7722 3093 6444 -2256 1965 11046 3413 -4858
337 -4858 3459 3809 -6355 -441 12755 3218 -8623 2229 7688 -7041 -7745 8384 5450 -9982
351 -9982 -4888 6595 -835 -6578 1045 -631 -11356 -5873 5503 -69 -5429 4750 8541 -3657
365 -3657 -7147 1792 3150 -3878 -2621 5164 6887 1813 -719 2008 3945 1476 -1108 1437 3280
380 3280 -1668 -2434 3736 3034 -4467 -2926 2107 -3783 -7178 2306 5074 -4510 -3812 4499 -2857 -11568
396 -11568 -554 6638 -6742 -7272 10926 9018 -8362 -2376 12436 1324 -12348 695 11013
409 11013 -1815 -4000 11042 8749 -6658 -4211 5245 -1921 -5943 7201 11330 -3243 -8946 -1919
423 -1919 -2554 -7512 -718 7162 922 -6844 -3093 1203 -2949 -4639 1359 3466 -3161 -5662 2629
438 2629 6252 -2429 -5089 5959 9531 -547 -1851 7306 3163 -9189 -2763 8027 1953 -2545
452 -2545 8945 8714 -9489 -9939 4397 707 -9511 3793 13497 -4864 -16287 -401 4411 -9537
466 -9537 -6101 10552 4790 -8886 -355 8760 -3017 -10059 1254 5102 -2878 871 9633 3155
480 3155 -4807 2047 7714 -171 -4389 4434 6409 -2372 -4120 4371 3882 -6908 -7257 3993 6349
495 6349 -4200 -5178 3632 242 -10127 -4368 6960 -89 -9075 -384 5233 -5245 -5954 8164
509 8164 7005 -6522 -1871 9251 -1241 -9141 5417 11289 -4596 -6582 9795 7923 -6894
522 -6894 -1100 11470 513 -10940 355 8766 -1447 -6627 1873 833 -8018 -4143 5332 2239
536 2239 -4844 -2000 707 -4430 -5535 2034 4660 -2936 -5250 2274 4636 -1062 -1579 5883 4882
551 4882 -3485 -179 7277 386 -6845 2553 8899 -1559 -5513 7132 7047 -7963 -6728 7625 3295
566 3295 -9225 -2762 5160 -2999 -7803 2678 2820 -8540 -4669 6635 1421 -6345 1851 6947
580 6947 -4648 -9481 1802 6345 -1241 -727 7281 5064 -2922 -1458 3861 2395 -102 2700 4204
595 4204 -1019 -2881 1276 2276 -3762 -3697 3848 3637 -5238 -3635 5300 454 -10799 -5793 5527
610 5527 924 -5352 2050 5095 -6256 -8047 4427 5487 -2494 1632 7709 -1343 -7615 1602 4969
625 4969 -1940 1709 10262 3435 -6314 -697 5031 -2367 -4388 4631 5415 -3756 -4267 1221 -583 -3723
641 -3723 -358 821 -3220 -3356 1963 2089 -3890 -4738 624 1837 -2621 -2995 4016 5658 -1556 -4351
657 -4351 3473 5990 -803 -1677 4726 2699 -3122 494 4733 -160 -760 6332 2992 -7804 -3669
672 -3669 6393 -359 -7562 1424 6680 -4856 -9115 1931 2871 -5772 -3345 4045 -851 -3919 2009
687 2009 3056 -5078 -3144 3855 1354 -2594 4496 7059 -1427 -3551 3606 4304 -1784 -922 4789 3836
703 3836 -868 -1050 646 -181 -2027 -1348 1154 1889 -1502 -3705 -1818 -1351 -2794 -888 2031 -1500
719 -1500 -4863 254 2313 -3808 -2748 5034 3036 -4444 -888 5505 -124 -3344 4422 5246 -3092
734 -3092 -126 7481 1313 -4966 2811 5716 -5167 -5776 6261 5157 -5355 -2096 3429 -3102 -6579
749 -6579 1047 2492 -3670 -1702 2354 -3573 -5639 1899 2806 -3960 -2447 4226 1707 -3108 -333
764 -333 3447 1793 -76 337 757 2926 3701 361 -693 2538 1903 -2518 -1041 3575 1703 -1174
780 -1174 -297 -2033 -4016 555 2350 -3307 -3162 2781 -281 -6712 -634 4892 -2948 -5930 2852 3355
796 3355 -4775 -922 6586 55 -5490 3651 5750 -3564 -2032 7793 2800 -5291 1745 7105 -1958
811 -1958 -5232 3873 4702 -2608 -2780 1567 -333 -2399 348 203 -2903 -1888 -407 -2978 -2903 2026
827 2026 2302 -2134 -3493 -1062 480 467 -683 -638 2779 4030 -324 -2672 2240 3564 -661 -266 4371
844 4371 2271 -1581 1365 2537 -1618 -1152 3522 -155 -4908 890 3946 -3083 -5494 1807 1513 -5866
860 -5866 -2369 4144 -822 -6163 75 3842 -1841 -2973 2666 2131 -2438 -335 2235 -21 656 5120
876 5120 3672 -1979 -1332 2123 1249 -667 2468 3968 60 -2416 -410 972 -1321 -1798 -481 117
892 117 -1278 -1375 1012 -290 -4566 -3705 1055 1097 -3372 -1896 2925 2056 -1840 -453 2200 -1120 -2413
909 -2413 2985 4524 -235 70 3357 978 -1183 2929 3953 -2648 -3539 3120 3471 -1458 -947 2263
925 2263 -1435 -4246 -57 1523 -2659 -3361 222 149 -1952 -555 66 -3510 -3608 893 3061 -181 -1442
942 -1442 1102 2236 48 -402 1309 1799 49 583 3603 3711 -383 -1539 1821 789 -1951 605
958 605 3454 -252 -2540 1059 1223 -4422 -4260 2138 1024 -3410 -1088 934 -3000 -3485 3230 2790
974 2790 -3968 -3921 1147 546 -330 3842 4266 -1958 -2990 1433 2154 544 2428 3141 -622 -798 3065
991 3065 2805 -1470 -2643 -347 1015 -33 -495 713 522 -1914 -3729 -2186 -57 -846 -2061 899
1007 899 821 -2308 -1252 1787 -863 -2983 1783 3753 -2221 -2155 5191 3979 -2561 -216 4702 181
1023 181 -2865 3397 4854 -2014 -1893 4309 2227 -3783 -1246 2066 -1901 -3102 2664 2591 -3398 -2839
1039 -2839 150 -2306 -3638 1059 1857 -2642 -2901 1298 1824 -982 -1260 545 73 -833 365 2701
1055 2701 2898 937 -731 410 1263 176 472 2770 1677 -1596 91 2212 -1295 -3463 433 606
1071 606 -3131 -1734 2373 -10 -3584 -8 1446 -3886 -3977 1404 1121 -3335 -91 4553 543 -3500
1087 -3500 772 2467 -880 153 4095 1753 -1734 1463 3685 -362 -1687 1565 1532 -1584 -478
1102 -478 3081 1946 -1861 -1732 -256 -1214 -2523 -1899 401 308 -1815 -1286 628 -71 -2804 -1402 1038
1119 1038 -694 -1787 1298 2923 -331 -82 2869 701 -1953 1072 4063 69 -780 3914 2629
1134 2629 -2709 -1349 2805 44 -3410 1108 3781 -1222 -2851 594 -6 -3657 -1493 1030 -1779
1149 -1779 -3277 351 1485 -1499 -1031 1516 -511 -2470 -303 2185 584 -770 1221 1549 572 378
1165 378 1275 1534 1169 527 787 1693 763 -204 23 461 -1069 -2268 77 235 -1470 -513 1395 -1530
1183 -1530 -3669 -1298 -346 -2272 -1278 2436 262 -3659 115 3445 -128 -2029 2166 2516 -1733 -654
1199 -654 3776 2472 -958 650 1955 -349 -527 3126 1972 -1051 260 1557 -791 -2063 -325
1214 -325 225 -1812 -1648 -569 -388 -497 -460 -877 -1058 -604 -1909 -1873 -805 1013 -31 -159 678 -103 -188
1233 -188 1437 1944 -79 1077 1685 -173 -32 2620 1880 -2060 -197 2887 439 -1652 1264 2196
1249 2196 -2642 -2539 762 -297 -2884 -580 363 -2572 -1857 2141 -95 -3320 156 2929 -819 -2606
1265 -2606 1053 1545 -1487 -760 2143 1080 403 1860 1370 132 1129 1564 113 -420 999 519 -1298
1282 -1298 -684 593 276 -39 30 -1162 -1405 -292 -1204 -1791 -566 64 -2646 -2787 1066 575 -1627 -93
1300 -93 1855 -685 -1086 2124 1562 -1629 92 2657 259 -951 2661 3010 -642 -190 3130 447
1316 447 -2494 704 2029 -825 -1871 568 -698 -3071 -447 1541 -1209 -1917 525 27 -2626 -1767
1332 -1767 670 -123 -1962 -695 599 490 937 1332 1021 379 764 537 168 1104 1421 488 366 411 352
1351 352 1506 1926 -567 -1380 860 438 -1750 -851 1274 -459 -3003 -1489 533 -898 -1570 365
1367 365 29 -1120 137 679 -1446 -2212 1255 1515 -1455 -342 3227 2030 -539 1382 2856 185
1383 185 -862 1021 2075 432 154 297 -409 -756 770 542 -1631 -1495 237 597 -1197 -1571 -690
1400 -690 -1078 -2551 -1817 783 1283 -1182 -1596 1032 1618 -342 -661 587 -121 -686 720 2096 866
1417 866 1072 2280 410 -1270 1280 2936 -309 -1908 1053 1663 -1614 -1782 1134 550 -2384 -1153
1433 -1153 -20 -691 -789 558 -359 -2521 -1373 195 -1182 -1527 636 1731 -28 -544 1385 1893 436
1450 436 84 622 950 539 670 1212 1581 867 -134 530 756 -533 -237 872 -22 -1671 -287 580
1468 580 -1446 -2092 91 82 -2323 -714 1807 -278 -2766 -220 1232 -1735 -1953 1602 773 -1310 899
1485 899 3356 1099 -577 1325 1575 -1181 -105 2360 1195 -717 772 1606 -156 -304 382 -337
1501 -337 -1409 -495 -140 -957 -761 -409 -1031 -1745 -1056 -683 -509 166 32 -105 822 376 -1059 -658 1693
1520 1693 921 -1102 121 2531 1232 828 2035 1553 -684 76 1446 -552 -528 2069 934 -2549
1536 -2549 -596 2543 34 -2775 -493 1018 -1813 -2408 238 2 -2242 -984 359 -1053 -1267 720
1552 720 521 -410 368 1824 318 -458 431 730 124 133 672 1129 1268 812 646 845 608 -992 -1433 168
1572 168 158 -1431 -795 338 -636 -1478 -199 -67 -1544 -1450 387 -726 -1881 -169 958 -1316 -1323 1475
1590 1475 652 -1132 1004 2825 627 -456 1184 1277 -1036 -39 1296 585 -451 1245 1657 11
1606 11 -658 207 -172 -1853 -1267 -56 -889 -1364 -408 -509 -1042 -711 -47 -381 -623 -784 -38 361 658 -413
1626 -413 -99 424 105 324 1395 2059 1018 779 1512 1101 -108 495 1159 -230 -1091 761 1590 -1066
1644 -1066 -317 1537 -266 -2739 -1253 515 -1355 -1995 -71 49 -2490 -1485 507 58 -1050 646
1660 646 996 -764 -166 1619 811 -552 -12 777 -273 304 2016 2115 797 215 105 481 52 -599
1678 -599 -495 -10 -98 -687 -444 268 -216 -1276 -892 -911 -1182 -1104 -2 -486 -1085 -226 205 -1350 -1064 1601
1698 1601 1153 -434 763 2351 -116 -669 1706 1200 -1138 -770 2080 1351 -240 1384 1676 -1282
1714 -1282 -1264 736 -48 -1398 -504 211 -1022 -1146 584 -346 -1797 -999 -256 -523 -432 293 314 -616 -633
1733 -633 -243 -233 554 1053 441 1011 1584 983 584 1068 717 -373 22 814 -28 -144 1164 1260 -800 -775
1753 -775 442 -833 -1799 -184 666 -1432 -1737 -76 86 -1536 -403 115 -1456 -1260 1022 965 -671
1770 -671 -19 852 -560 -1135 975 1533 -131 533 1947 954 -34 345 819 -665 -785 -157 -104 -413 -43
1789 -43 435 -525 -272 -408 -1327 -1278 -469 -350 -188 -692 -1300 -984 224 -38 -528 17 1226 -74 -440 1147
1809 1147 2232 -19 -734 480 678 81 849 1801 391 -8 947 410 -692 -265 497 -584 -1813
1826 -1813 -362 431 -840 -1150 144 45 -1516 -996 655 -140 -900 -281 -484 -752 -215 526 623 384 707
1845 707 709 554 1277 1424 756 63 54 412 634 693 213 236 260 73 -382 328 347 -697 -1732 -1033 -115 -1429
1867 -1429 -1345 -15 -405 -860 -343 323 -79 -346 409 -377 -1130 56 1105 409 133 1096 839 -123 342
1886 342 1735 1045 -276 589 672 -297 -254 420 190 -763 -568 -72 -130 -142 244 -331 -1198 -1077 -725 -676 -690
1907 -690 -442 -145 65 223 -198 122 815 352 -404 304 1217 200 258 1468 1007 -272 38 1488 713
1926 713 -158 823 819 -450 -435 173 -470 -1163 -199 -132 -738 -795 319 -168 -1460 -724 -10 -1058 -959 109
1946 109 259 -315 157 684 167 148 477 281 -153 1170 1454 42 577 1242 331 162 550 707 -22 278
1966 278 280 72 21 4 -864 -1301 -971 -179 -934 -843 282 -41 -875 -429 -68 -884 -1021 176 -153 -492 1006
1987 1006 1454 -165 -770 975 1388 -338 218 1711 892 -333 702 1151 -33 -673 -50 124 -114
2004 -114 561 -67 -595 -499 -600 -1222 -1297 -789 -301 -726 -846 262 -18 -168 -225 -126 -161 -4 172 -115 766
2025 766 1500 652 59 698 1094 280 535 1108 685 246 684 231 -456 -64 275 -557 -933 189 526 -576
2045 -576 -449 74 -881 -1548 -758 -372 -898 -422 210 -102 -675 229 570 -156 81 888 494 117 901 1596
2065 1596 403 68 369 415 148 713 419 259 -62 160 -313 -366 116 -534 -1224 -641 -380 -506 -454 230
2085 230 -932 -1265 -174 -405 -1154 -638 546 185 -600 428 994 363 143 853 304 268 824 1097 446
2104 446 -70 1002 402 -692 117 1293 -104 -501 218 145 -667 -707 -584 -630 -1084 -223 -861 -811 -517 417
2124 417 87 -724 -274 -82 -156 -33 118 325 474 515 307 479 1189 1339 281 -30 601 1057 379 458 95
2145 95 -378 -182 -190 -393 -337 128 -55 -1349 -660 216 -627 -1335 -633 92 -383 -733 319 43 -310 -314 395
2166 395 53 -156 816 403 93 964 1114 71 191 1138 1184 48 252 554 501 -9 414 -9 -330 -256
2186 -256 -392 -683 -464 263 -203 -952 -532 53 -775 -808 -218 -66 -536 -305 200 -99 344 1123 375 -4
2206 -4 852 975 -66 195 970 801 56 666 662 -110 -115 523 224 -540 117 232 -667 -697 -190 -511 -1070 -406
2228 -406 -31 -739 -768 81 45 -896 -395 129 -346 -427 228 119 -135 864 983 399 260 927 688 7 721
2249 721 626 448 117 15 -86 34 225 -185 -578 -259 56 -535 -834 -46 -762 -1126 -536 101 -319 -879
2269 -879 -163 156 -341 -98 877 379 -43 412 537 197 289 620 439 190 584 988 359 -47 603 667 -68
2290 -68 -208 68 -170 -197 -409 -670 -429 -725 -457 -426 -13 -525 -703 -403 -512 -349 -174 -112 -76 46 521 322
2312 322 189 454 529 312 220 742 589 104 227 477 539 49 328 497 -139 -209 -21 -166 -211 -495 -564 -605
2334 -605 -1069 -395 -354 -778 -421 -253 -296 -245 -156 273 -31 352 22 491 576 648 419 704 832 370 421 452 642
2357 642 -62 92 732 396 -3 232 222 -402 -180 -1 -612 -972 -317 203 -539 -1145 -246 -16 -711 -603
2377 -603 -272 -283 -12 -358 515 376 -27 424 200 265 693 1011 462 207 903 432 60 677 801 265 -371
2398 -371 139 172 398 154 -509 -679 -451 -211 -621 -491 -286 -348 -902 -621 -40 -761 -38 -325 121 -118 358
2419 358 956 -85 -14 732 391 -364 624 1183 544 185 589 495 -134 46 489 -69 -899 192 175 -419
2439 -419 -527 241 -434 -1091 -389 163 -1012 -599 82 -208 -976 -3 141 -174 -186 353 686 239 582 527
2459 527 383 377 622 228 169 740 698 191 213 677 275 -462 354 -82 -645 -384 122 -593 -782 -91 210 -859
2481 -859 -727 151 -654 -519 -46 431 -459 -272 419 13 -206 389 571 209 682 912 429 238 734 710
2501 710 -181 242 633 414 110 256 401 -321 -421 -199 -670 -524 -177 -293 -616 -764 -100 -656 -654 -52 -294
2522 -294 -445 -60 142 411 107 370 390 -245 378 615 611 451 584 411 -102 212 1034 383 -99 215 28
2543 28 -442 -57 112 -188 -749 -145 -124 -618 -496 226 -510 -867 -240 -160 -308 -92 166 -104 -192 -135 269 282
2565 282 429 -42 158 298 345 728 512 352 171 -22 -81 -142 284 -353 81 -197 -333 -624 -20 -166 -702
2586 -702 -717 -95 -459 -625 -52 -79 -496 -495 42 211 -342 126 765 319 -56 241 508 293 526 737 360
2607 360 609 452 266 341 470 323 -122 -373 118 -386 -486 -704 -70 -49 -362 -683 -435 -429 -511 -500 -463 -472 -314
2630 -314 202 -132 -199 62 65 -42 228 568 918 276 177 739 489 254 82 121 453 223 3 76 200 -379
2652 -379 -84 -480 -262 -511 -155 -319 -368 -718 -386 -642 -474 -36 -402 15 -312 0 -259 224 311 327 21
2673 21 254 367 378 540 562 440 222 332 189 270 -63 360 -119 69 -34 -143 -57 182 -274 -605 -637 -204
2695 -204 -393 -210 -252 -336 -620 -416 -2 -344 -443 556 532 -54 -260 326 377 174 449 558 287 185 589 614
2717 614 193 -24 656 138 -298 416 67 -407 -21 -110 -408 -693 -233 -190 -595 -360 -404 -594 -331 68 -222
2738 -222 -619 -365 327 -164 26 353 339 17 632 474 317 579 736 294 -286 642 715 149 -142 199 2
2759 2 -652 -570 76 -527 -467 -33 -274 -993 -472 -144 -535 -406 -53 -166 -576 -133 98 -41 -160 270 207 -20
2781 -20 241 621 508 313 249 286 158 609 760 -61 3 386 484 90 135 230 -30 -577 -408 -372 -682 -496 -117
2804 -117 -714 -206 341 -143 -489 -401 198 142 55 443 85 -207 -5 -6 208 333 852 759 86 277 957 190
2826 190 -136 205 96 -202 39 213 -144 -431 -239 -337 -516 -91 -54 -392 -669 -608 -509 -932 -342 -225 66
2847 66 -117 -114 4 241 416 81 250 129 150 432 8 366 1033 386 390 268 468 5 -9 279 -498 -364
2869 -364 -180 -5 -357 -411 -426 -461 -481 -56 -212 -163 -367 -305 -453 -180 146 53 -441 557 376 272 50 326
2891 326 661 283 518 485 218 -69 269 114 505 136 262 199 -36 239 -46 -581 -616 -229 -618 -556 -416
2912 -416 -210 -574 -310 -583 -186 -363 -174 -155 -92 65 64 -123 273 470 227 619 345 538 694 321 585
2933 585 337 374 147 196 -52 -400 185 -79 -259 -105 2 -301 -245 -318 -443 -560 -472 -385 -188 -46 -19 -33 -97
2956 -97 82 136 -87 -171 -133 411 381 225 348 245 105 0 444 329 200 111 347 59 -23 -129 -72 -345 -373
2979 -373 50 -392 -273 -158 -495 -269 -405 -337 -541 -461 -531 -97 19 -27 -184 494 338 111 169 81 151 45
3001 45 65 302 249 22 -123 127 300 472 110 389 28 99 194 -240 -566 -453 -379 -643 -674 -187 -99 -123 -313
3024 -313 -365 -71 -231 -308 158 212 -167 284 405 224 175 420 588 198 381 297 252 116 130 546 93 -6 18
3047 18 191 63 -148 144 -195 -480 -402 -341 -508 -314 -347 -492 -137 90 -141 -286 151 -67 -327 -69 111
3068 111 203 198 283 347 498 459 204 384 440 510 16 50 266 244 -328 -65 53 -329 -594 -169 147 -175 -296
3091 -296 -399 -438 -482 -270 -305 -259 -277 42 202 93 58 226 238 -199 -70 227 191 576 497 405 -111 -39 291 88
3115 88 79 248 238 -86 -60 -13 -417 -338 -449 -148 -94 -280 -250 93 -356 -182 -390 -169 -262 -309 -59 -15 213 164
3139 164 156 730 408 242 225 459 364 159 358 270 65 223 212 -82 -287 204 386 -129 -188 -19 -181 -334
3161 -334 -53 -196 -210 -711 -288 109 -129 -42 -106 -302 -301 187 97 192 64 384 273 44 420 656 379 198
3183 198 149 323 382 215 78 -114 92 -129 -199 -106 -105 -384 -149 -368 -65 -352 -402 -301 -717 -816 -455 -192 -258
3206 -258 -229 240 -102 -308 49 81 139 48 343 344 155 631 379 613 147 301 501 151 -50 355 -102 -139
3228 -139 -70 44 -278 -360 -387 -141 -438 -262 -203 -99 -239 -87 -369 -410 -497 -454 -50 233 347 49 419 426 41
3251 41 600 221 221 341 351 324 323 299 178 155 -125 -74 -272 -113 -353 -109 -261 -377 -205 -46 23 -511 -404 -203
3275 -203 -229 -150 -3 -127 -270 -87 -197 -4 97 270 524 271 200 565 259 393 -85 225 119 19 -193
3296 -193 407 60 -87 -119 75 -201 -206 -361 -209 -502 -191 -453 -537 -457 -548 -451 -505 4 293 -40 -362 251 319
3319 319 -187 -47 343 292 370 214 262 384 438 292 339 -233 -57 290 35 -53 -119 98 -221 -244 -151 -40 -172
3342 -172 -89 94 -342 -164 -158 -290 41 -189 -86 -92 20 26 298 46 139 241 466 45 578 -45 472 371 83
3365 83 624 292 283 26 161 363 -263 -385 -54 -115 -380 -793 -104 -416 -127 -288 76 -80 -377 -102 194
3386 194 -124 -300 115 -64 -94 208 421 147 129 511 149 428 -112 213 241 3 78 135 141 -245 210 -426
3408 -426 -51 -16 43 -411 -368 -243 -292 -512 -333 -285 -342 -405 -269 -178 199 -110 -129 51 228 52 -94 81 536
3431 536 -22 239 324 325 36 141 341 260 174 119 147 255 -229 -30 38 -381 103 -187 -182 -773 -280 -55 -193
3454 -193 -144 -267 -270 -408 -105 -184 -233 124 176 133 -25 376 337 451 204 670 371 264 445 233 126 110 158
3477 158 81 -167 -44 -232 -62 9 -334 -352 -332 -146 -208 -536 -282 50 -347 -164 -226 -222 -96 -126 61 216 139
3500 139 344 378 401 270 576 139 247 98 87 131 152 339 106 -10 310 203 -498 37 -222 -2 -232 128
3522 128 137 -311 -415 -372 -124 -154 -261 -288 55 -123 -220 -88 360 -38 284 233 193 436 275 197 257 31 271
3545 271 340 426 305 128 77 -61 61 -141 -3 -235 -59 -67 -400 -321 -123 -18 -111 -302 -13 -68 -213 -61 -13
3568 -13 238 -210 122 -32 319 256 413 187 108 206 604 297 37 115 144 -36 -146 437 56 -219 -395 -75
3590 -75 5 -209 -447 -406 -239 -645 -152 -80 -168 14 -266 -46 -303 -90 167 -103 -171 578 62 143 3 372
3612 372 417 155 149 213 204 212 325 557 -24 -354 32 372 -329 -273 17 -343 -498 -247 13 -289 -284 -297 -207 -255 -248
3637 -248 78 41 -11 -224 -19 94 -73 226 408 382 110 448 186 152 374 167 100 17 -104 107 143 69 17
3660 17 22 -340 -60 -263 -132 -225 -325 -233 -503 -344 -181 -140 239 -577 192 72 -301 -126 86 119 -73 135
3682 135 289 257 92 119 546 407 224 349 297 -318 -44 147 -133 -249 -217 83 168 -380 -330 -444 -6 -460
3704 -460 -388 -237 -229 -256 6 -100 0 113 21 249 112 3 88 -39 211 403 186 86 80 256 331 47 257
3727 257 263 -120 16 239 13 15 -212 -126 -28 -286 -85 94 -96 -281 -129 -123 -662 -422 -6 258 130 -90 25
3750 25 -234 6 41 166 195 69 302 571 324 139 165 39 106 274 245 137 62 279 72 36 -445 -331 -447
3773 -447 -347 -578 -368 44 -187 -315 -160 -114 -114 -74 63 -186 17 70 -62 143 267 498 173 110 -23 414
3795 414 146 214 86 -83 268 -134 10 -5 -224 -73 64 -67 -141 -108 51 -346 -327 -207 -125 -97 -193 68 -263
3818 -263 -293 68 -89 158 248 70 290 272 134 502 113 253 229 280 101 226 426 0 -353 118 -38 145
3840 145 -350 -262 -288 -189 157 -91 -281 -204 -490 -223 -169 -274 -140 -342 -213 -268 133 27 10 213 19 301
3862 301 119 114 140 166 74 215 24 161 474 226 188 59 -77 -139 -153 -180 -60 131 -180 -215 -448 -225 -331
3885 -331 -237 -105 -201 -394 22 -238 -224 -7 -172 -28 -316 68 236 148 190 273 297 -123 -140 -33 323 165 192
3908 192 -250 30 -364 -173 -321 -2 -64 -283 -288 -162 -32 -441 -280 -198 -482 -359 -287 -72 -149 -17 41 138 -189
3931 -189 114 -23 -97 617 290 186 -64 313 261 198 78 -4 446 277 -76 128 138 -125 -6 -108 -200 90
3953 90 -338 -115 -64 -70 -411 -217 -256 57 15 -20 96 -78 304 -266 128 122 -253 89 143 265 429 165 226 336
3977 336 -39 -128 187 183 -166 -391 -22 29 -25 -216 112 -197 -402 -406 5 -96 -169 204 -16 -183 -133 -65 115
4000 115 -353 -244 30 65 193 119 -27 94 411 375 92 27 204 177 6 139 425 38 -121 -16 137 26
4022 26 -290 -167 -206 9 -109 -203 70 -374 -287 -251 -196 -128 -169 150 161 -214 212 -68 -228 -120 382 78 285
4045 285 290 283 306 214 376 231 79 -58 134 157 -456 -254 -400 61 -115 -115 29 -108 -364 -13 11 -346 141
4068 141 231 58 -112 -38 189 337 -58 181 -124 313 108 106 360 78 35 113 -5 238 221 334 142 249
4090 249 145 -205 19 -159 92 -358 -169 -124 -60 -37 53 -349 -229 -180 -328 -165 -68 -148 -28 107 -68 318
4112 318 -95 254 274 -12 89 202 14 94 250 115 52 318 -4 253 -26 -42 97 -60 -28 -129 -24 -323
4134 -323 -134 -220 -30 -384 -333 -29 -64 -233 -149 -72 58 -208 82 177 -43 293 84 129 152 -16 138 157 32
4157 32 -52 146 -8 77 95 163 -95 -13 -16 -137 184 -394 44 -158 -307 -340 -149 -330 -275 20 222 -187 86
4180 86 218 -205 98 9 297 121 130 117 117 -45 60 206 494 192 26 36 199 -54 4 153 -335 -353 -4
4203 -4 135 -298 -296 -370 14 -137 -19 -2 -124 199 90 108 -32 61 68 132 250 341 144 -119 82 88 33 37 392 476
4229 476 62 122 266 35 297 -142 -174 -12 48 -442 -53 -103 -216 -407 -238 -131 -157 -388 -219 22 -154 -129
4251 -129 -387 240 -190 126 86 -12 -64 249 192 191 -21 406 -16 72 171 393 388 -169 101 -107 -160 -172 162 -293
4275 -293 -104 -141 -65 -297 -178 -190 -9 -114 -184 -192 142 -49 132 -316 36 8 -277 326 -21 -133 -39 137 323
4298 323 168 256 449 -33 -210 115 194 143 120 36 -3 -346 -30 -105 -111 61 62 -10 -181 -118 199 117 -250 -288 -201
4323 -201 -106 103 -58 2 -50 66 319 209 106 588 380 -4 -63 293 -25 19 129 218 388 -190 -86 -365
4345 -365 -162 -140 -353 -25 -131 -332 109 148 -329 -47 139 -419 -147 -252 11 -138 0 69 222 -57 -270
4366 -270 53 220 185 -45 685 60 297 268 400 -66 90 43 234 250 -24 -127 -216 -121 -323 14 43 -212
4388 -212 -51 -124 -85 -233 -128 -262 86 3 138 -177 -98 158 9 80 -215 -9 6 83 382 264 56 155 98
4411 98 18 -95 297 20 164 -240 -50 -44 -78 -100 150 -148 -258 -360 -64 59 202 -170 -104 19 124 -144
4433 -144 134 2 58 348 118 162 44 133 -73 134 346 337 60 -113 193 -92 190 229 56 28 123 16 -340
4456 -340 -242 -356 -248 -113 -330 -127 -236 -171 -168 -71 -339 -170 -283 -172 -223 -158 200 242 239 332 384 322 129 214 -139
4481 -139 120 -261 8 239 174 -360 122 243 -135 -394 -16 -36 -471 -111 177 -96 -190 -473 234 102 -223
4502 -223 -33 63 17 -133 100 410 76 140 158 82 -40 27 218 230 186 321 -36 110 -199 -135 -128 -176 -161 190
4526 190 284 -10 -175 -452 64 -143 -327 49 -16 -334 -159 -217 163 -36 121 112 301 -188 316 259 50 222
4548 222 301 124 79 159 -101 -22 124 212 343 -190 -137 80 19 -30 172 -194 -120 -208 -103 -257 -165 -7 -103 -261
4572 -261 201 -89 -518 -46 -91 15 309 63 48 74 119 88 10 223 15 24 152 142 144 -76 164 144 -170 19
4596 19 3 -53 -401 -144 33 -287 -264 -101 -201 58 -241 26 72 131 -39 -81 -175 -84 -91 224 332 -107 -10 -225
4620 -225 230 -74 260 -272 95 179 -188 -35 184 249 -201 80 -109 -92 102 -477 -90 41 136 -118 -320
4641 -320 -461 -63 -321 -95 -90 -21 -69 175 57 -101 167 -99 262 17 122 72 189 156 198 95 24 43 210
4664 210 139 129 243 109 -210 -228 -140 -104 -73 -116 27 -64 -341 -217 -376 -404 -25 182 -37 49 238 -212 211
4687 211 80 105 73 -62 89 9 207 16 155 -254 134 98 -30 -17 66 -278 -114 -467 59 -75 66 92
4709 92 -249 -28 -363 68 -280 -348 262 314 24 -84 -116 190 186 19 131 5 209 154 138 246 80 -15 183
4732 183 20 82 71 19 1 82 -138 -24 -204 245 119 -154 -87 -256 -331 -25 -187 66 -184 -34 130 115 -268
4755 -268 -118 61 -284 -39 176 -211 171 345 164 -89 -58 -8 178 277 -5 -184 36 -215 -235 108 -31
4776 -31 -237 -28 -117 -40 -208 114 -130 -342 67 -422 2 23 -196 -143 73 280 -142 29 25 -91 -204 81
4798 81 172 89 133 123 223 -152 -277 182 73 224 37 -85 203 -4 -24 -7 -471 -127 -104 -93 -192 39 -228
4821 -228 -82 -420 39 -262 9 -56 301 -72 139 -86 -12 71 -277 175 60 119 -32 216 132 298 184 -224
4843 -224 158 -333 -247 -221 -86 -197 -141 -161 -158 71 -85 358 -210 -315 6 -113 -174 -271 -11 -191 -137 114 -29
4866 -29 -60 0 110 -104 90 338 167 -22 48 -87 -7 79 119 83 274 24 -81 151 -172 119 93 -45 -3
4889 -3 -261 -317 -126 154 -99 76 -136 -76 -70 -277 -3 -23 -127 226 111 -418 34 3 43 70 264 212 175 124
4913 124 57 -8 -155 96 -181 77 71 -144 -100 -126 -229 103 -24 -127 -49 -117 -80 -272 52 -12 -70 -140 -72 211
4937 211 -21 353 49 -158 413 149 159 11 140 122 115 99 3 -103 40 64 307 -142 -255 270 -57 -157
4959 -157 -117 -219 -65 -31 -263 14 -27 -63 -27 -21 192 73 -80 -20 -4 233 -174 -90 -139 -82 -23 157 196 221 212 176
4985 176 -157 28 295 86 23 -160 78 -333 17 -60 -45 -44 0 -83 -248 75 81 -212 -68 -197 61 -223 61
5008 61 -12 -189 -179 21 91 -8 -264 -10 294 208 -241 144 454 107 67 47 77 26 343 150 32 -186 -411
5031 -411 -51 -59 -114 179 -81 -72 -75 64 179 -31 79 -31 124 -131 228 -107 -206 136 46 31 -184 164 65 -152
5055 -152 150 -119 148 154 -26 162 339 52 160 -20 -87 -314 -227 45 -212 -25 64 -255 -188 82 -92 -165
5077 -165 -138 170 -22 -10 -81 -43 -116 -215 56 298 170 282 109 310 112 -107 -69 -129 361 -12 -39 202 0
5100 0 -65 45 -52 -191 -21 -201 -46 -75 -137 160 156 88 32 -85 55 33 10 -54 57 84 -4 -44 5 118 169 -319
5126 -319 238 171 149 -90 22 172 150 -25 205 -281 -220 -12 -129 -146 273 -246 287 -122 -421 -271 168 -437
5148 -437 -132 63 17 -182 15 -65 304 -187 -261 75 -177 -65 134 132 -68 64 11 -176 49 73 -140 -24
5170 -24 -106 150 -178 -104 79 -262 53 159 -379 -83 123 -38 38 22 -150 -35 -138 24 40 -257 -510 4
5192 4 -402 -136 210 -84 302 -149 96 -9 142 -71 378 -76 99 64 20 129 210 -275 -59 111 -32 -51
5214 -51 -314 14 5 22 92 -29 -256 47 -96 -156 61 103 -152 44 236 -108 59 -231 -41 67 -43 334
5236 334 86 130 -159 393 26 -193 197 22 120 109 72 -173 111 -1 243 -311 -132 -84 -114 -144 10 -72 -15
5259 -15 -199 -89 46 123 -136 -81 -20 -104 398 231 323 42 67 219 278 103 -264 60 77 122 212 51 -134 -102
5283 -102 161 -119 252 -15 -52 -299 -137 -42 -55 -87 -120 84 -23 322 86 150 205 -109 62 143 -206 63 251
5306 251 491 229 -70 115 231 -8 80 129 81 15 38 128 -142 66 -105 137 -80 -58 -243 -110 -265 -152
5328 -152 185 51 26 101 27 81 77 178 -62 -200 156 44 22 -177 -114 354 53 102 34 203 227 -129 203 82
5352 82 -97 12 -171 -46 -62 4 -81 178 50 51 260 -56 -129 -216 -15 188 -276 7 -44 304 -63 -85 -2 3
5376 3 244 -101 63 103 -43 36 176 -75 -1 -60 413 146 -98 -3 177 -151 -126 112 -115 -240 -118 106 -142
5399 -142 178 -23 -234 -74 -103 -285 -256 -399 -6 39 -75 -150 122 164 -58 96 -250 132 -161 153 -33 64
5421 64 5 -95 -106 -25 -166 208 -128 -299 77 90 -110 68 -16 -196 -202 -193 -179 -212 -101 -179 -45 16 141 283 -170
5446 -170 -61 100 -138 102 -54 -87 25 12 -163 -15 -117 -128 -156 17 -188 59 34 -46 86 109 -63 -323
5468 -323 -161 17 -215 31 -89 160 -251 63 -172 -121 -321 164 -110 258 -7 -168 140 188 -45 28 -53
5489 -53 -31 267 129 -122 -171 -92 39 61 -61 -41 106 -396 295 40 54 -295 -255 -92 -178 -36 120 -215 -355
5512 -355 69 43 209 1 -57 -56 -106 107 -135 50 109 351 67 16 -120 -251 451 -106 188 -55 97 57 -50
5535 -50 55 242 112 22 -146 22 -18 5 -202 -68 -101 60 -116 213 -107 -160 126 -160 -41 214 48 331
5557 331 2 -96 77 309 -6 65 65 -333 10 -119 25 114 174 58 -7 -38 -26 291 -153 -315 -111 24 198
5580 198 264 -82 171 104 187 55 68 12 -65 92 82 10 111 55 70 -146 326 168 326 189 6 -54 151 -11
5604 -11 -118 -24 26 -24 92 23 -209 119 126 43 34 281 -310 -300 35 -70 122 -103 33 -170 328 221 64 66
5628 66 203 1 125 -107 -43 253 -66 154 18 -270 -248 236 208 29 -6 158 -75 113 62 -189 22 154
5650 154 -401 -172 -298 22 -191 -81 0 9 -57 -191 -139 44 131 164 36 -83 -21 179 127 -27 -59 -320 89
5673 89 -62 241 -270 71 243 -213 -87 -93 -131 157 10 125 168 31 51 115 103 -92 -76 -83 15 -227 165 -77
5697 -77 -65 -56 80 -108 -190 -9 97 182 -183 217 -7 230 101 -70 -188 -1 -333 -72 179 -111 -53 -85 -121
5720 -121 -126 -68 -133 -246 -265 -97 172 99 -206 112 -134 185 -18 -224 -146 174 231 -5 -3 -56 92 -100 330 70
5744 70 168 -22 198 -184 11 28 136 333 103 -158 -171 49 115 216 66 -104 -130 -199 -64 -197 -45 17 -12
5767 -12 35 64 111 -77 43 -4 283 101 170 -95 -78 -68 42 448 80 -310 -154 223 60 -81 -137 -35 188
5790 188 -86 26 -142 -273 -7 79 487 27 -243 -90 -263 -2 -276 -166 144 -112 -129 -172 67 -84 -146
5811 -146 128 57 286 71 136 -9 -127 -196 430 -13 312 208 50 -96 -15 -84 87 -67 10 -94 -459 281
5833 281 -134 -194 246 77 1 -33 198 199 -2 90 174 -223 102 56 54 -282 5 127 179 -171 143 -6 -112 60
5857 60 8 -40 -45 -26 75 -37 -52 -33 -76 -451 111 91 98 -49 8 -124 -117 -382 252 -210 214 -183 -41 -217 303
5882 303 292 -201 112 -130 -194 -122 69 -39 -170 -150 252 224 -92 -88 127 -22 61 -102 -129 -201 -247 -233 -523 -1
5906 -1 117 -149 102 56 -105 -45 -35 -182 297 258 -237 -289 15 -69 22 134 -62 77 -65 -51 -91 -158 141 87
5930 87 28 200 34 -182 -51 3 -87 75 -4 96 -53 -55 -152 94 42 -63 3 311 -347 48 -110 -11 -28 -59
5954 -59 -135 215 404 -155 -35 -76 -78 88 -40 -328 -241 -129 -115 121 100 53 -147 -423 3 -155 -71 38 81 -253
5978 -253 -45 -286 108 -65 -267 28 -46 30 -222 104 13 110 9 13 82 159 -282 141 44 -137 -20 22 21 148
6002 148 -43 60 127 -52 182 -128 -12 284 225 88 237 -372 -219 -123 -224 318 -82 142 -146 -52 88
6023 88 28 204 222 330 23 -147 -133 -72 -319 -68 92 -35 318 -18 51 174 -134 -199 9 -270 121 170 30
6046 30 -237 -103 -119 -172 -83 -168 187 -187 65 70 -179 40 159 79 -87 95 -226 -53 32 -10 289 40 76 145
6070 145 -76 73 -196 158 85 0 100 -87 43 10 -136 92 121 98 -151 29 -248 -238 -31 140 112 -222
6092 -222 144 -155 -128 -148 -93 111 104 5 180 -150 -98 -270 -154 -18 84 -123 172 -102 47 106 -51 96 -92
6115 -92 114 -122 181 -241 -223 -224 -304 -328 251 131 399 -136 -257 211 85 -287 -45 516 230 329 36 -88
6137 -88 -140 -65 125 -57 -29 22 -84 428 -32 4 14 235 124 234 235 -70 89 -246 4 32 74 209 157 93
6161 93 20 222 -192 -22 328 187 -283 -5 -217 191 -104 226 133 -345 149 53 205 77 -262 38 -26 -155
6183 -155 302 -7 66 -58 -239 -155 174 -233 24 -119 -29 -34 -54 34 -51 133 -25 21 -87 242 -93 19 -114
6206 -114 321 120 29 -150 40 91 26 -210 185 -12 -56 54 77 -118 33 -84 -24 -204 8 64 -96 -14 63
6229 63 -340 -70 -30 46 2 22 21 -44 -159 -37 126 -30 136 139 41 -142 174 77 183 -3 -67 -106 90 138 136 114
6255 114 -62 -68 50 178 86 -299 30 82 -185 -158 -73 -10 -178 -47 -307 86 -155 244 -6 118 -114 80
6277 80 197 -12 181 222 141 45 73 192 -123 -65 180 260 -103 193 341 133 -111 125 -67 -45 -87 216 41
6300 41 103 -55 -239 -62 -136 59 131 381 -418 -41 140 222 70 -92 -298 160 -14 -218 -98 155 -75 98
6322 98 -25 -163 -184 106 80 -82 91 -45 205 -26 -48 43 119 -124 -53 -151 -49 -215 -16 -274 306 -314 -93
6345 -93 83 -111 -56 210 140 -213 -115 87 -25 -48 393 44 161 76 50 20 6 -111 219 -24 -122 -47 124 -171
6369 -171 -63 -91 -34 -83 -212 -20 -31 -231 364 -46 141 43 -35 -9 -278 -37 -114 -102 -166 77 -67 102 -485
6392 -485 -75 293 178 169 -50 -11 -98 -276 -188 -71 -218 -109 82 -28 11 -66 -7 145 -131 -54 141 -214 229
6415 229 -254 158 111 64 190 -117 134 -129 -334 -21 -232 -276 -127 118 134 19 322 -163 103 -266 -19
6436 -19 100 109 77 -16 66 -288 -230 -230 -181 -73 -220 -436 -266 61 -53 12 -144 -255 -25 -67 92 -77 160 240
6460 240 86 348 -241 -61 -57 196 121 -180 276 -299 -12 420 100 211 -87 -196 -74 63 -96 -103 189 75
6482 75 -235 -226 -107 -101 109 11 -371 -48 -144 -171 67 397 -14 -337 32 59 -194 21 128 129 69 -6 125 107 -169
6507 -169 -61 382 58 -161 -59 90 -177 114 184 88 -175 71 74 -71 304 185 -91 85 11 288 -77 178
6529 178 275 -303 245 38 -31 -58 226 175 298 45 -54 182 125 277 255 59 122 183 -315 164 18 -101 -131
6552 -131 205 -247 -115 -71 -15 -4 -95 -90 -20 35 55 -106 57 285 -282 190 -267 -21 -23 -54 58 64 -17 112 -202
6577 -202 362 -58 -142 140 129 16 170 105 359 -73 -238 95 0 75 -172 -75 -113 74 -68 49 -2 -179 -41
6600 -41 -28 -156 53 92 133 289 -296 -129 -68 7 -187 -51 29 94 -154 -333 -110 191 -140 487 144 0 -29
6623 -29 -85 -319 -237 130 159 -248 -69 92 -120 -3 317 27 -203 -33 44 19 415 -63 90 -184 44 124
6645 124 -80 -44 29 -178 -119 365 -159 51 347 -171 -79 -193 75 -49 269 71 279 124 -28 -53 -112 9
6667 9 144 66 118 43 307 92 199 149 114 26 -162 -115 -159 -46 207 15 -241 -378 40 -64 -8 2 32 8 214
6692 214 -579 -7 -100 -75 185 -179 -144 -162 112 77 -37 -74 -14 257 -134 102 -29 -142 15 59 -1 -266 67
6715 67 12 337 -6 90 3 176 -10 62 3 -157 132 244 -110 -37 -144 -186 7 -18 -25 -345 -195 -198 150 -251
6739 -251 28 -146 16 -47 62 -99 -95 -46 133 -320 -43 257 157 -121 65 160 -352 119 368 124 46 37 291
6762 291 -108 -95 174 -124 191 44 90 -196 -22 -303 87 -255 -174 -40 -221 -275 44 37 -216 44 30 -48 -99
6785 -99 118 209 131 -12 -42 -60 -8 -64 64 396 -31 100 73 -168 143 -9 120 -196 5 -110 245 34 162
6808 162 -278 -279 -182 -82 -65 -60 113 -189 28 -220 189 49 -140 11 -67 129 234 -130 36 109 194 -102 78
6831 78 175 37 229 -198 192 68 24 -20 90 97 -103 169 266 -113 -204 140 44 29 -87 4 -113 242 -122 100
6855 100 121 -58 148 185 -187 79 78 122 288 309 80 186 81 -84 -142 -16 -79 -133 -130 -98 -359 -355 -92 -74 -62
6880 -62 -91 79 69 163 -40 4 32 -65 16 160 -31 203 -119 -2 55 120 20 -208 -211 -21 432 224 94 171
6904 171 46 178 298 -139 71 -186 -133 24 112 -145 -110 81 257 117 52 -232 78 218 173 -280 108 156
6926 156 162 -99 344 -41 71 -33 76 160 -98 256 -61 -54 130 -57 -93 47 -131 27 -182 -37 -198 207
6948 207 -185 138 1 -153 -147 10 -20 -297 -250 -117 -20 -45 264 -81 -40 -72 -30 35 -135 5 -206 -62 86
6971 86 175 -202 16 -67 192 -1 225 26 -99 11 319 -100 190 73 205 175 336 -85 -342 -70 79
6992 79 -40 -44 -39 -95 90 -1 182 -226 -136 -139 73 -166 178 109 140 -18 -16 156 -23 176 -281 -17 -269 77 -51
7017 -51 393 8 236 149 -226 192 -102 -30 82 15 86 -77 453 -20 -34 161 -53 -27 -223 -99 -44 -153 -148
7040 -148 31 27 155 27 43 -60 143 -149 43 -307 329 78 -161 -87 -48 103 -85 -199 -355 24 50 -14
7062 -14 72 76 -73 357 72 246 12 -17 -69 -34 -167 -121 10 -168 19 -35 191 -19 207 -308 -161 -48 33
7085 33 -257 138 -186 -146 -135 205 -63 104 110 -133 358 27 -306 -23 -37 -50 204 2 -236 162 7 -31 0
7108 0 54 -39 -152 150 16 -40 -54 37 -47 58 -85 -221 238 -187 -525 -52 39 -12 -197 -53 -144 -76 -162 -103 -302
7133 -302 -18 -48 -181 -262 47 -107 141 -124 -71 -4 -417 -22 -173 -223 127 37 -5 -113 124 -102 -47 182 181
7156 181 175 166 -138 105 238 -80 -61 144 -124 -12 -168 -48 -256 86 -7 360 255 -128 -39 -272 -110 -380
7178 -380 200 95 83 -31 103 60 36 -251 92 91 4 107 247 137 4 88 -120 209 113 -207 106 -45 24
7201 24 -196 -67 -45 -102 -256 -190 -96 -258 124 -117 -1 69 -78 -12 126 -160 -61 -72 -417 61 124 -22 166
7224 166 93 -189 -19 57 -285 -52 9 -163 145 -80 335 -77 -162 -98 -238 -23 -58 157 -94 -109 -140 -196 -41
7247 -41 -156 76 266 -37 114 312 -19 197 172 10 -24 188 333 90 205 157 98 161 -116 -56 22 75 13
7270 13 76 401 112 -156 212 25 45 117 -138 61 -141 29 -226 79 240 158 197 -172 143 -12 127 36
7292 36 -258 165 22 -131 -53 -98 142 69 239 -72 72 -230 -147 -132 -23 6 257 -46 6 -108 -242 15 -117
7315 -117 -113 -128 393 -161 70 -150 112 -215 -144 111 286 96 -27 154 -9 -34 -123 425 81 -168 151 60
7337 60 54 153 42 -90 -36 386 -16 -160 110 15 56 342 -246 18 39 -4 -385 -285 0 164 -183 -32 -157
7360 -157 16 -97 -56 138 -4 -13 -159 96 48 186 129 -54 -173 16 -74 -95 -182 139 173 102 77 -207 -2 -95
7384 -95 -206 -244 135 -29 -98 -347 209 -172 -70 2 -164 -4 133 -27 -130 -72 52 286 -49 -82 313 252
7406 252 -252 -162 -118 105 -32 -28 23 -13 -8 -305 -78 128 -194 -45 -21 40 -42 -67 9 25 -260 -123 -117 -70 -188 -64
7432 -64 186 -327 211 66 55 -29 -20 -73 194 -215 -200 36 -69 -89 -123 69 -98 -13 -62 -66 395 -211 -217 -154 -251 -19
7458 -19 -349 -69 111 5 -67 168 81 114 -247 -13 -12 154 -163 144 12 -101 20 151 -72 -105 215 157 -55
7481 -55 181 -43 -58 28 -63 377 -158 -91 -31 118 247 -19 -328 -18 11 -40 -164 -60 -103 -153 222 4 284
7504 284 12 -137 87 203 106 200 -141 360 43 243 -73 108 122 -16 139 -49 94 -7 358 -173 85
7525 85 125 -47 0 93 -49 -265 -297 106 -93 -82 -300 94 -73 -122 207 -148 142 -280 -212 190 143 181 196 21
7549 21 -423 32 -151 -52 118 -169 -149 18 -62 0 116 -403 86 -220 -135 147 -265 152 -81 191 7 -54
7571 -54 -29 -50 -44 259 194 160 1 121 100 -151 -10 194 -40 -167 169 150 -70 271 6 118 -289 -339 -112
7594 -112 85 -142 -21 -52 -208 -372 13 3 -28 122 -28 175 74 182 117 -47 -7 -2 59 55 185 165 50 474
7618 474 149 -303 185 31 159 -69 37 72 -285 72 143 -8 -286 82 11 -83 -150 -116 380 146 -141 58
7640 58 349 -199 70 -179 62 -115 -19 162 244 -203 -107 -107 -71 119 -279 48 10 26 -145 -106 49 297 -16
7663 -16 -106 209 -181 -255 -55 70 325 37 -116 -5 125 64 -293 75 -133 103 139 84 80 -84 63 -182 192
7686 192 -114 52 120 -265 -8 -94 141 153 367 -49 289 319 -192 84 -211 78 102 -41 48 124 -12 -99 -89
7709 -89 224 -217 -162 -244 64 348 -143 -284 65 131 -109 141 -58 183 -61 253 -148 273 74 24 298 74
7731 74 426 176 -130 -143 145 72 29 -68 -163 -104 69 -123 -116 91 -50 141 64 -3 -157 95 57 35 188 111 50
7756 50 -210 243 21 49 -206 18 -261 282 227 -89 87 -114 79 160 24 340 215 -266 82 94 125 46
7778 46 28 39 23 109 -112 137 -122 140 -35 -82 -258 -234 34 37 50 -126 108 -349 -339 253 -133 5 -271 454
7802 454 65 23 380 38 191 136 -42 180 78 -162 -46 136 -8 -115 110 -119 51 167 -3 -43 -254
7823 -254 -134 -22 223 43 62 -206 -217 -220 61 137 -42 208 75 -140 33 57 78 86 -132 -133 -211 -124 29 -90
7847 -90 -73 -137 83 15 126 -153 -218 -220 117 -195 -264 116 -196 -139 212 278 -178 -23 -59 -1 -87 -262 157 29
7871 29 -35 -220 -104 -13 184 376 58 -252 10 126 284 71 32 -167 -63 -42 -97 208 -169 203 42 57
7893 57 37 -8 -109 214 -64 -185 -31 225 56 19 105 56 311 110 120 -82 155 68 -143 -216 192 20 -39
7916 -39 217 -261 23 40 -108 -138 -29 -116 163 218 103 26 65 -272 -232 152 -6 209 -120 93 -12 94 92
7939 92 235 2 378 298 153 -215 35 32 106 31 216 60 149 106 -130 -170 136 -78 42 164 -229 -146 5
7962 5 -196 -121 78 32 46 105 -17 31 -57 120 31 51 -176 -67 260 43 292 -182 46 48 -140 505 -164 -254
7986 -254 10 87 125 -87 50 193 148 48 -103 -169 180 91 64 -172 54 225 -227 206 122 -10 -326 -50
8008 -50 -110 258 92 156 100 115 93 343 8 -108 56 102 5 12 383 -32 -190 145 77 -16 -14 23 44 173 89 -21
8034 -21 265 20 54 -109 -98 -298 32 55 285 137 -146 -87 105 -63 109 407 -43 58 -133 -263 -50 60
8056 60 102 -19 -283 -129 108 -166 -49 165 168 114 -145 -161 -196 -121 -11 53 -189 129 -217 13 -202 -66 77
8079 77 -242 -56 -56 -285 -14 -168 211 54 -326 108 -247 254 109 -52 144 363 -125 -38 309 166 -304
8100 -304 -146 9 58 50 103 -223 -50 -44 -154 42 318 99 -139 283 0 1 209 314 94 -40 -170 109 -201
8123 -201 60 120 201 210 -174 -176 -137 -71 23 -6 42 -62 230 181 161 -145 197 103 -224 215 -97 -25 -115 97 -200
8148 -200 -183 149 206 -116 -27 242 106 255 305 189 -103 -86 -114 -7 8 8 -19 395 343 -106 35 -18 63 269
8172 269 -100 265 -86 25 -6 -68 86 -16 -30 0 2 268 -87 65 141 -35 142 36 -136
8191a36
##END NTUPLES=NMR FID
##END=
