##TITLE=1H_Costus-oil-G-f20-11-C
 CDCl3, 8 sc, 
 5.4.2019
##JCAMPDX= 6.0         $$ Bruker NMR JCAMP-DX V2.0
##DATA TYPE= NMR FID
##DATA CLASS= NTUPLES
##ORIGIN= UXNMR, Bruker Analytische Messtechnik GmbH
##OWNER= root
$$ XWIN-NMR		Version 3.5
$$ Fri Apr  5 14:10:09 2019 Russian Standard Time (UT+4h)  she@DPX200
##.OBSERVE FREQUENCY= 200.1316
##.OBSERVE NUCLEUS= ^1H
##.DELAY= (6, 6)
##.ACQUISITION MODE= SIMULTANEOUS
##.ACQUISITION SCHEME= undefined
##.AVERAGES= 8
##.DIGITISER RES= 18
##SPECTROMETER/DATA SYSTEM= spect
##.PULSE SEQUENCE= zg30
##.SOLVENT NAME= CDCl3
##.SHIFT REFERENCE= (INTERNAL, CDCl3, 0, 15.7039)
##AUDIT TRAIL= $$ (NUMBER, WHEN, WHO, WHERE, WHAT)
$$ ##TITLE= Audit trail, XWIN-NMR		Version 3.5
$$ ##JCAMPDX= 5.01
$$ ##ORIGIN= Bruker BioSpin GmbH
$$ ##OWNER= she
$$ F:/spectra/data/she/nmr/H-F/1/audita.txt
$$ ##AUDIT TRAIL=  $$ (NUMBER, WHEN, WHO, WHERE, WHAT)
(   1,<2019-04-05 14:08:18.09 +0400>,<she>,<DPX200>,
      <created by zg, POWCHK disabled, PULCHK disabled
       configuration hash MD5:
       00 E9 B6 7A A2 85 ED C7 34 08 36 98 17 FE 4E 26
       data hash MD5: 16K
       8F A0 9E 44 D8 70 74 B1 43 8F 0F 65 54 86 FB AC>)
$$ ##END=
$$ 
$$ hash MD5
$$ D5 24 77 71 BB BF 0C D4 B0 D7 B3 29 D5 0F 22 38
##$RELAX= 
##$RELAX= 
##$RELAX= 
##$RELAX= 
##$RELAX= 
##$RELAX= 
$$ Bruker specific parameters
$$ --------------------------
##$DU= <F:/spectra>
##$EXPNO= 1
##$NAME= <H-F>
##$PROCNO= 1
##$TYPE= <nmr>
##$USER= <she>
##$AMP= (0..31)
100 100 100 100 100 100 100 100 100 100 100 100 100 100 100 100 100 100 
100 100 100 100 100 100 100 100 100 100 100 100 100 100 
##$AQSEQ= 0
##$AQ_mod= 1
##$AUNM= <au_zg>
##$AUTOPOS= <>
##$BF1= 200.13
##$BF2= 200.13
##$BF3= 200.13
##$BF4= 200.13
##$BF5= 200.13
##$BF6= 200.13
##$BF7= 200.13
##$BF8= 200.13
##$BYTORDA= 1
##$CFDGTYP= 0
##$CFRGTYP= 5
##$CHEMSTR= <none>
##$CNST= (0..31)
1 1 145 1 1 1 1 1 1 1 1 1 1 1 1 1 1 1 1 1 1 1 1 1 1 1 1 1 1 1 1 1 
##$CPDPRG= <>
##$CPDPRG1= <>
##$CPDPRG2= <>
##$CPDPRG3= <>
##$CPDPRG4= <mlev>
##$CPDPRG5= <mlev>
##$CPDPRG6= <mlev>
##$CPDPRG7= <mlev>
##$CPDPRG8= <mlev>
##$CPDPRGB= <>
##$CPDPRGT= <>
##$D= (0..31)
0 1.2 0 0 0 0 0 0 0 0 0 0.03 0 0 0 0 0 0 0 0 0 0 0 0 0 0 0 0 0 0 0 0 
##$DATE= 1554458897
##$DBL= (0..7)
120 120 120 120 120 120 120 120 
##$DBP= (0..7)
150 150 150 150 150 150 150 150 
##$DBP07= 0
##$DBPNAM0= <>
##$DBPNAM1= <>
##$DBPNAM2= <>
##$DBPNAM3= <>
##$DBPNAM4= <>
##$DBPNAM5= <>
##$DBPNAM6= <>
##$DBPNAM7= <>
##$DBPOAL= (0..7)
0.5 0.5 0.5 0.5 0.5 0.5 0.5 0.5 
##$DBPOFFS= (0..7)
0 0 0 0 0 0 0 0 
##$DE= 6
##$DECBNUC= <off>
##$DECIM= 24
##$DECNUC= <off>
##$DECSTAT= 4
##$DIGMOD= 1
##$DIGTYP= 9
##$DL= (0..7)
0 120 120 120 120 120 120 120 
##$DP= (0..7)
150 150 150 150 150 150 150 150 
##$DP07= 0
##$DPNAME0= <>
##$DPNAME1= <>
##$DPNAME2= <>
##$DPNAME3= <>
##$DPNAME4= <>
##$DPNAME5= <>
##$DPNAME6= <>
##$DPNAME7= <>
##$DPOAL= (0..7)
0.5 0.5 0.5 0.5 0.5 0.5 0.5 0.5 
##$DPOFFS= (0..7)
0 0 0 0 0 0 0 0 
##$DQDMODE= 0
##$DR= 18
##$DS= 0
##$DSLIST= <SSSSSSSSSSSSSSS>
$$ [...]
##$SUBNAM2= <"">
##$SUBNAM3= <"">
##$SUBNAM4= <"">
##$SUBNAM5= <"">
##$SUBNAM6= <"">
##$SUBNAM7= <"">
##$SUBNAM8= <"">
##$SUBNAM9= <"">
##$SW= 24.9336934301222
##$SWIBOX= (0..15)
0 0 2 0 0 0 0 0 0 0 0 0 0 0 0 0 
##$SW_h= 4990.01996007984
##$TD= 16384
##$TD0= 1
##$TE= 0
##$TE2= 300
##$TE3= 300
##$TEG= 300
##$TL= (0..7)
0 120 120 120 120 120 120 120 
##$TP= (0..7)
150 150 150 150 150 150 150 150 
##$TP07= 0
##$TPNAME0= <>
##$TPNAME1= <>
##$TPNAME2= <>
##$TPNAME3= <>
##$TPNAME4= <>
##$TPNAME5= <>
##$TPNAME6= <>
##$TPNAME7= <>
##$TPOAL= (0..7)
0.5 0.5 0.5 0.5 0.5 0.5 0.5 0.5 
##$TPOFFS= (0..7)
0 0 0 0 0 0 0 0 
##$TUNHIN= 0
##$TUNHOUT= 0
##$TUNXOUT= 0
##$USERA1= <user>
##$USERA2= <user>
##$USERA3= <user>
##$USERA4= <user>
##$USERA5= <user>
##$V9= 5
##$VALIST= <valist>
##$VCLIST= <CCCCCCCCCCCCCCC>
##$VD= 0
##$VDLIST= <DDDDDDDDDDDDDDD>
##$VPLIST= <PPPPPPPPPPPPPPP>
##$VTLIST= <TTTTTTTTTTTTTTT>
##$WBST= 1024
##$WBSW= 4
##$XGAIN= (0..3)
0 0 0 0 
##$XL= 0
##$YL= 0
##$YMAX_a= 189164
##$YMIN_a= -308043
##$ZGOPTNS= <>
##$ZL1= 120
##$ZL2= 120
##$ZL3= 120
##$ZL4= 120
##$ABSF1= 10
##$ABSF2= 0
##$ABSG= 5
##$ABSL= 3
##$ALPHA= 0
##$AQORDER= 0
##$ASSFAC= 0
##$ASSFACI= 0
##$ASSFACX= 0
##$ASSWID= 0
##$AUNMP= <proc_1d>
##$AZFE= 0.1
##$AZFW= 0.1
##$BCFW= 1
##$BC_mod= 2
##$BYTORDP= 1
##$COROFFS= 0
##$CY= 11.3945322036743
##$DATMOD= 1
##$DC= 2
##$DFILT= <>
##$DTYPP= 0
##$F1P= 18.9103706918063
##$F2P= -1.10871071338519
##$FCOR= 0.5
##$FTSIZE= 0
##$FT_mod= 4
##$GAMMA= 1
##$GB= 0.15
##$INTBC= 1
##$INTSCL= 1
##$ISEN= 128
##$LB= 0.24
##$LEV0= 0
##$LPBIN= 0
##$MAXI= 10000
##$MC2= 0
##$MEAN= 0
##$ME_mod= 0
##$MI= 1.114404
##$NCOEF= 0
##$NC_proc= 0
##$NLEV= 6
##$NOISF1= 3.799351
##$NOISF2= 2.8
##$NSP= 1
##$NTH_PI= 0
##$NZP= 0
##$OFFSET= 15.70392
##$PC= 1
##$PHC0= -8868.834
##$PHC1= 37.60028
##$PH_mod= 1
##$PKNL= yes
##$PPARMOD= 0
##$PSCAL= 0
##$PSIGN= 0
##$REVERSE= no
##$SF= 200.130013532006
##$SI= 16384
##$SIGF1= 3
##$SIGF2= 2
##$SINO= 400
##$SIOLD= 16384
##$SREGLST= <1H.CDCl3>
##$SSB= 0
##$STSI= 0
##$STSR= 0
##$SW_p= 3612.71676300578
##$SYMM= 0
##$S_DEV= 0
##$TDeff= 0
##$TDoff= 0
##$TI= <>
##$TILT= no
##$TM1= 0
##$TM2= 0
##$TOPLEV= 0
##$USERP1= <user>
##$USERP2= <user>
##$USERP3= <user>
##$USERP4= <user>
##$USERP5= <user>
##$WDW= 1
##$XDIM= 8192
##$YMAX_p= 0
##$YMIN_p= 0
$$ End of Bruker specific parameters
$$ ---------------------------------
##NTUPLES= NMR FID
##VAR_NAME=  TIME,          FID/REAL,        FID/IMAG
##SYMBOL=    X,             R,               I
##VAR_TYPE=  INDEPENDENT,   DEPENDENT,       DEPENDENT
##VAR_FORM=  AFFN,          ASDF,            ASDF
##VAR_DIM=   8192,          8192,            8192
##UNITS=     SECONDS,       ARBITRARY UNITS, ARBITRARY UNITS
##FACTOR=    0.0002004,     1,               1
##FIRST=     0,             0,               0
##LAST=      1.6414764,     0,               0
##MIN=       0,             -308043,         0
##MAX=       1.6414764,     189164,          0
$$ Real data points
##PAGE= N=1
##DATA TABLE= (X++(R..R)), XYDATA
$$ [...]
$$ plain form
2437 241 -610 786 2100 -509 -1815 1372 2548 -1068 -2300 460 1217 -1365 -1723 278 198 -1243
2453 -1243 -934 -633 -284 -210 -504 -1636 -388 1442 464 -1461 -137 1257 312 -794 159 1675 1065
2470 1065 -156 -268 936 1904 640 -1020 350 1381 493 -1674 29 1567 211 -1801 -732 242
2486 242 -69 -510 -951 -1027 200 370 -953 -1616 583 1322 -1571 -1933 1337 2265 -831 -1171 1459 1291
2504 1291 -547 -72 1143 1267 516 30 -128 707 1098 468 -1132 -18 1245 -216 -1465 -862 953
2521 953 -453 -2110 -831 714 -332 -1147 -1488 -627 712 -254 -1542 -300 1490 362 -1553 122
2537 122 1810 1396 -581 -208 1147 1280 599 -83 -112 1119 1172 -290 -1005 1071 1748 -1171 -2005 969
2555 969 1198 -1184 -2117 149 618 -1470 -1680 190 504 -568 -638 -667 -103 772 -173 -1460 -206 1661
$$ packed form
2437B41q51J396J314k609j306L187J176l616j232K760P57k582l58K001q0j441
2453a243L09L01L49P4k94j132J248J830r78j925J324J394r45j106R53J516o10
2470A065j221j12J204R68j264j660J370J031q88k167J703J538j356k012J069R74
2486B42l11m41m41p6J227J70j323o63K199P39k893l62L270R28l096l40K630j68
2504A291j838M75J215J24p51m86j58Q35L91o30j600J114J263j461j249O03J815
2521I53j406j657J279J545j046q15l41Q61J339r66j288J242J790j128j915J675
2537A22J688m14j977L73J355J33o81o82k9J231N3j462p15K076O77k919q34K974
2555I69K29k382r33K266M69k088k10J870L14j072p0k9N64Q75r45j287J254J867
$$ plain form
2573 1661 560 -1219 266 2015 1344 -969 42 1658 1775 -147 -658 722 896 -261 -1084 258
2589 258 1434 -151 -1489 -702 730 4 -1613 -1129 -454 233 -534 -1112 -977 569 556 -1152 -692 1528
2607 1528 1542 -1355 -1434 1287 1860 -634 -503 1287 1460 171 -133 759 1106 806 -78 -647 51 1018 -318
2626 -318 -1688 -476 1035 -331 -1850 -398 1213 -6 -2094 -923 615 320 -1431 -1647 329 1182
2642 1182 -254 -991 378 2011 525 -966 319 1292 981 -142 -266 657 1123 703 -420 -193 1347
2659 1347 757 -937 -987 1012 931 -1858 -1724 717 659 -1939 -1022 262 527 -678 -1073 -253 364 311 -802
2678 -802 -1506 -251 1288 403 -786 736 2483 390 -1114 588 2286 904 -781 -686 1130 1437
2694 1437 -546 -1010 812 1071 -309 -1368 278 802 -345 -1638 -710 -90 -385 -688 -868 -135 903
$$ packed form
2573A661j101j779J485J749o71k313J011J616J17j922n11J380J74j157q23J342
2589B58J176j585j338P87J432p26j617M84O75O87p67n78J35J546j3j708M60K220
2607A528J4k897p9K721N73k494J31J790J73j289l04Q92L47l00q84n69O98R67j336
2626c18j370J212J511j366j519J452J611j219k088J171J538k95j751k16J976Q53
2642A182j436p37J369J633j486j491J285R73l11j123j24R23M66m20j123K27J540
2659A347n90j694n0J999q1k789J34K441n8k598R17J284K65j205l95Q20O17n3j113
2678h02p04J255J539q85j189J522J747k093j504J702J698j382j685R5J816L07
2694A437j983m64J822K59j380j059J646N24j147j293R28O20k95l03j80P33J038
$$ plain form
2711 903 608 -1231 -606 1344 823 -1384 -702 1857 1060 -817 -294 1971 1413 -47 64 1119 687
2728 687 403 -176 -400 425 902 -603 -1556 88 1018 -967 -1836 388 1176 -542 -1953 -680 487
2745 487 -696 -1539 -644 867 767 -124 -695 937 1338 95 -906 377 1449 458 -149 193 895 1364
2763 1364 200 -536 72 1432 485 -1669 -1237 1333 349 -2251 -995 1173 212 -2406 -1033 1032
2779 1032 80 -898 -501 56 -141 -211 -787 -942 345 1231 -161 -233 1393 2289 -45 -1259 731 1635
2797 1635 54 -1000 785 1197 285 -713 -361 798 883 -632 -1106 -9 768 -736 -1449 -622 262 -263
2815 -263 -1330 -552 800 723 38 -937 28 1482 158 -1521 -591 1433 563 -1506 450 2614 1048
2832 1048 -802 102 1093 366 -592 -188 -3 308 674 -292 -748 371 790 -991 -1832 461 1322 -1038
$$ packed form
2711I03k95j839O25J950n21k207O82K559p97j877N23K265n58j460J11J055m32
2728F87k84n79k24Q25M77j505r53J644R30j985q69K224P88j718j411J273J167
2745D87j183q43Q95J511j00q91n71J632M01j243j001J283J072r91o07L42P02M69
2763A364j164p36O08J360r47k154M32K570r84k600J256K168r61k618J373K065
2779A032r52r78L97N57j97p0n76j55J287Q86j392p2J626Q96k334j214J990R04
2797A635j581j054J785M12r12r98L52J159Q5j515m74J097P77j504p13Q27Q84n25
2815b63j067P78J352p7o85r75R65J454j324j679R30K024q70k069J956K164j566
2832A048j850R04R91p27r58M04J85L11L66r66m56J119M19j781q41K293Q61k360
$$ plain form
2850 -1038 -1896 -48 708 -1081 -1643 32 840 201 -432 -174 1262 1153 -70 -835 156 910 -97 -80
2868 -80 748 1867 855 -724 -40 653 633 -181 -1063 -444 1123 -68 -1691 -575 1056 -717 -2255
2885 -2255 -398 1335 22 -1585 -854 -41 -184 -690 -338 -83 246 595 -203 -528 1570 1885 -399 -1298
2903 -1298 1052 1474 -796 -1058 1633 1718 -104 -1021 830 1002 270 -876 -817 258 389 -500 -1342 -565
2921 -565 287 -770 -1926 -606 1209 787 -936 -526 340 681 -663 -1138 345 1592 428 -945 861
2938 861 2303 763 -900 323 1317 -101 -608 -88 347 278 -32 -481 -516 608 324 -1453 -1545 442
2956 442 802 -1354 -1767 409 883 -1560 -1210 693 631 -474 -438 431 865 567 -530 -651 228 1056 62
2975 62 -261 746 1958 779 -474 180 1004 241 -1423 -1016 274 644 -870 -1321 210 914 -594
$$ packed form
2850a038q58J848P56j789n62J675Q08o39o33K58J436j09j223p65R91P54j007J7
2868h0Q28J119j012j579O84O93k0q14q82O19J567j191j623J116J631j773j538
2885b255J857J733j313j607P31Q13j43n06L52K55L29L49p98l25K098L15k284q99
2903a298K350M22k270k62K691Q5j822r17J851J72p32j146N9J075J31q89q42P77
2921e65Q52j057j156J320J815m22j723M10Q66L41j344m75J483J247j164j373J806
2938H61J442j540j663J223R94j418n07N20M35o9l10m49l5J124k84j777r2J987
2956D42L60k156m13K176M74k443L50J903o2j105L6Q69M34k98j097j21Q79Q28r94
2975F2l23J007J212j179j253O54Q24p63j664M07J290L70j514m51J531P04j508
$$ plain form
2992 -594 -1726 -143 909 -518 -1608 -526 342 -29 -800 -649 150 619 694 -257 280 1331 1109 -795
3010 -795 -633 1102 1418 -700 -672 1762 1503 -878 -702 820 862 -440 -1336 -552 281 -87 -930 -1023 186
3029 186 -12 -597 -1447 -311 900 37 -1214 -538 1076 553 -1092 -1071 631 1273 -181 -305 1586 1967
3047 1967 76 -1011 624 1059 -191 -968 35 861 521 42 -431 25 473 -154 -1335 -914 883
3064 883 126 -1878 -1339 368 240 -1389 -1179 626 973 -855 -497 728 726 -82 -823 -212 437 465 -212
3083 -212 -215 1279 1313 394 -405 199 805 -225 -1379 -619 1204 816 -780 -708 646 924 -1157 -1546 136
3102 136 542 -604 -1520 -176 554 -390 -1147 -366 273 530 378 -207 319 1322 -8 -831 -116 1282
3120 1282 325 -861 -215 1887 1410 -251 -455 1054 437 -1228 -1330 42 257 -513 -737 -454 376 200
$$ packed form
2992e94j132J583J052j427j090J082Q68l71p71J51P99M69P5r51N37J051k22j904
3010g95J62J735L16k118K8K434k59k381J76J522M2j302q96P84Q33l68q43r3J209
3029A86j98n85q50J136J211q63j251O76J614n23j645K1J702O42j454j24J891L81
3047A967j891j087J635M35j250p77J003Q26l40m79m73M56M48o27j181M21J797
3064H83p57k004N39J707j28j629K10J805L47j828L58J225kq08p41O11O49K8o77
3083b12lJ494L4r19p99O04O06j030j154P60J823l88j596P2J354K78k081l89J682
3102A36M06j146r16J344P30r44p57P81O39K57j52n85N26J003j330q23P15J398
3120A282r57j186O46K102m77j661k04J509o17j665j02J372K15p70k24K83Q30j76
$$ plain form
3138 200 -1242 -1169 -144 578 -396 -1065 -115 727 -72 -1395 -243 1273 1097 -275 -441 1488 1718 -362
3156 -362 -614 459 1026 -141 -792 533 1273 441 -476 -187 579 293 -919 -1445 -898 289 -161 -1519
3174 -1519 -1049 979 477 -1695 -688 1036 252 -1145 -382 800 978 -452 -584 280 1107 443 -52
3191 -52 -49 1460 1196 199 -563 206 560 -591 -1087 43 857 538 -1381 -383 743 465 -1365 -1242 157
3210 157 323 -978 -1257 71 796 -656 -841 -66 509 368 -440 5 511 947 -59 -537 154 1144 472
3229 472 -698 410 1842 860 -837 -465 1233 475 -1566 -688 523 312 -492 -528 143 469 -55 -1226
3247 -1226 -858 -105 399 -812 -1368 200 1087 -376 -961 295 1370 238 -861 276 1583 1281 -280
3264 -280 -394 731 694 -717 -303 967 1053 93 -584 -142 228 -134 -1224 -1209 -303 530 -466 -848 -108 686
$$ packed form
3138B00j442P3J025P22r74o69R50Q42p99j323J152J516j76j372j66J929K30k080
3156c62k52J073N67j167o51J325P40q32r17K89P66k86j212n26N47J187m50j358
3174a519M70K028n02k172J007J724p84j397P63J182J78j430j32Q64Q27o64m95
3191e2LJ509k64r97p62P69L54j151m96J130Q14l19j919R98J126k78j830J23J399
3210A57J66j301k79J328P25j452j85P75N75j41q08M45N06M36j006m78O91R90o72
3229D72j170J108J432r82j697L72J698p58k041Q78J211k11q04l6O71L26n24j171
3247a226L68P53N04j211n56J568Q87j463n85J256J075j132j099J137J307l02j561
3264b80j14J125l7j411M14J270Q6r60o77M42L70l62j090J5R06Q33r96l82P40P94
$$ plain form
3284 686 -337 -1591 -284 1294 459 -1223 -363 688 501 -401 110 1105 1088 12 -152 825 1123 952
3302 952 -370 -345 575 851 -568 -1217 371 866 -243 -900 248 1119 -568 -1847 -1042 378 -213 -975
3320 -975 -790 381 519 -673 -596 403 813 187 -441 154 748 918 -90 -467 594 1118 -43 -247 924
3339 924 1872 534 -1196 -46 941 116 -1216 -796 269 -70 -919 -349 233 144 -651 -1262 -867 176
3357 176 221 -884 -720 504 764 -338 -957 441 1150 -564 -715 961 1745 338 -519 -190 743 371
3375 371 -532 157 779 814 106 -614 383 595 -182 -1243 -966 285 214 -642 -1078 307 425 -526 -1502 -341
3395 -341 829 -347 -1518 -242 1263 263 -560 88 923 780 -349 -197 648 1097 463 -312 -36 757
3413 757 830 -730 -856 682 1032 -228 -1102 302 719 -1229 -1713 -307 550 -344 -1438 -496 423 214
$$ packed form
3284F86j023j254J307J578q35j682Q60J051j87r02N11R95j7j076j64R77K98j71
3302I52j322K5R20K76j419o49J588M95j109o57J148Q71j687j279Q05J420n91p62
3320i75J85J171J38j192P7R99M10o26o28N95N94J70j008l77J061N24j161k04J171
3339I24R48j338j730J150R87q25j332M20J065l39q49N70N82q9p95o11L95J043
3357A76M5j105J64J224K60j102o19J398P09j714j51J676P84j407q57L29R33l72
3375C71r03O89O22L5p08p20R97K12p77j061K77J251p1q56m36J385J18r51r76J161
3395c41J170j176j171J276J505j000q23O48Q35j43j129J52Q45M49o34p75K76P93
3413G57P3j560j26J538L50j260q74J404M17j948m84J406Q57q94j094R42R19k09
$$ plain form
3431 214 -878 -608 453 540 -499 -569 85 1074 934 -493 -506 636 768 -96 -201 1371 1301 -145 -616
3450 -616 158 831 -550 -1251 -304 651 367 -605 -260 324 -34 -1014 -1000 -395 63 -310 -1410 -351 853
3469 853 1025 -669 -416 914 1182 -232 -377 815 1329 -246 -926 899 1210 2 -512 64 869 597
3487 597 -386 -26 441 243 -471 -1217 -466 635 37 -990 -458 790 329 -1227 -1033 413 844 -465
3505 -465 -1065 659 1045 -147 -620 35 1066 747 -375 263 774 546 -8 -205 140 871 1 -719 -470
3524 -470 859 632 -857 -626 1071 470 -1254 -1151 60 348 -834 -1130 -14 962 105 -856 -217 163
3542 163 219 -879 -602 583 1149 207 -539 201 1320 711 -503 -336 1321 921 -229 -609 723 712
3560 712 -795 -622 345 687 -239 -852 -398 490 16 -940 -909 -380 -57 -550 -1016 -128 628 531 -914 -286
$$ packed form
3431B14j092K70J061Q7j039p0O54R89j40j427j3J142J32q64j05J572p0j446m71
3450f16P74O73j381p01R47R55k84r72L45N84l58r80J4O05M58l73j100J059J204
3469H53J72j694K53J330K68j414j45J192N14j575o80J825L11j208n14N76Q05k72
3487E97r83L60M67j98p14p46P51J101n98j027N32J248m61j556J94J446M31j309
3505d65o00J724L86j192m73O55J031l19j122O38N11k28n54j97L45P31q70p20K49
3524d70J329k27j489K31J697o01j724J03J211K88j182k96J116R76q57r61O39L80
3542A63N6j098K77J185N66r42p46P40J119o09j214J67J657m00j150l80J332j1
3560G12j507J73R67L42r26o13M54Q88m74r56L1N29L23m93m66Q88P56r7j445O28
$$ plain form
3580 -286 957 539 -670 -624 1162 1132 -324 -387 863 931 -282 -757 617 663 221 -473 -184 289 130
3599 130 -377 -930 -308 471 -166 -836 -353 880 -38 -1263 -1096 144 -52 -1047 -852 970 987 -670 -301
3618 -301 484 1185 411 -374 -11 896 584 -38 -264 479 537 -182 -742 157 1122 217 -1136 -513 889 -78
3638 -78 -1437 -1005 219 59 -791 -803 264 615 -520 -924 -245 446 122 -518 -461 687 1180 79 104
3657 104 510 1070 230 -705 259 1064 496 -542 -299 841 464 -630 -852 337 373 -999 -722 268 440
3676 440 -276 -1381 -530 96 -94 -639 -649 38 640 9 -739 66 1024 15 -776 -139 1089 808 -423
3695 -423 19 1037 881 -354 90 699 717 3 -799 76 579 344 -641 -772 -78 233 -514 -717 42 501
3715 501 -268 -1508 -706 308 179 -1172 -266 704 473 -356 -330 1083 450 -222 -261 453 1073 172 -281
$$ packed form
3580b86J243m18j209M6J786l0j456o3J250O8j213m75J374M6m42o94K89M73j59
3599A30n07n53O22P79o37o70M83J233r18j225J67J240j96r95J95J822J7j657L69
3618c01P85P01p74p85L63R07l12o22k26P43N8p19n60Q99R65r05j353O23J402r67
3638g8j359M32J224j60q50j2J067L51j135m04O79O91l24o40N7J148M93j101K5
3657A04M06N60q40r35R64Q05n68j038K43J140l77j094k22J189L6j372K77R90J72
3676D40p16j105Q51O26j90n45j0O87O02o31p48Q05R58j009p91O37J228k81j231
3695d23M42J018j56j235M44O09J8p14q02Q75N03k35r85j31O94L11p47k03P59M59
3715E01p69j240Q02J014j29j351R06R70k31q29K6J413o33o72l9P14O20r01m53
$$ plain form
3734 -281 148 553 580 -560 -314 437 582 -357 -957 -3 870 -134 -1276 -894 318 -485 -1060 -755 236
3753 236 400 -787 -569 440 334 -265 -610 -205 690 700 381 -271 728 890 -283 -684 514 1230 416
3772 416 -832 83 1183 164 -335 -126 669 290 -616 -407 86 469 -579 -968 -423 74 -132 -1048 -470
3791 -470 86 90 -576 -826 -35 915 -185 -1128 321 1400 420 -447 -17 932 785 -731 -272 1099 695
3810 695 -451 -296 274 559 -56 -782 -359 -175 142 -523 -470 40 526 -663 -1317 17 833 -50 -1410
3829 -1410 15 1089 74 -598 29 1043 369 -647 -265 496 751 29 -59 59 1051 387 -405 -152
3847 -152 424 547 -263 -803 193 353 -664 -1314 -464 586 -258 -1473 -394 400 135 -740 -676 478 324
3866 324 -250 -585 219 957 307 -187 -47 908 991 -588 -408 955 1003 -530 -543 409 1255 -108 -996 136
$$ packed form
3734b81M29M05K7j140K46P51J45r39o00R54Q73j004j142L82J212q03n75L05R91
3753B36J64j187K18J009j06n99l45M05Q95J0l19o52R99J62j173m01J198P16q14
3772D16j248R15J100j019m99K09P95l79r06K09M93L83j048l89N45M97k06r16N78
3791d70N56Mo66k50P91R50j100r43J449J079r80q67M30R49j47j516M59J371m04
3810F95j146J55N70K85o15p26M23J84L17o65N3N10M86j189o54J334Q16q83j360
3829a410J425J074j015o72O27J014o74j016L82P61K55p22q8J18R92o64p92K53
3847a52N76J23q10n40R96J60j017o50Q50J050q44j215J079P94k65q75O4J154j54
3866C24n74l35Q04P38o50m94J40R55Q3j579J80J363M8j533j3R52Q46j363q88J132
$$ plain form
3886 136 512 30 -666 -223 513 -259 -686 -729 324 238 -451 -728 -347 731 306 -595 -383 403 712 -126
3906 -126 -636 830 1333 130 -500 473 1352 125 -675 306 806 433 -789 -398 517 306 -662 -817 -282
3925 -282 341 204 -959 -489 391 452 -644 -353 179 701 -580 -1021 387 1073 -53 -665 273 803 424
3944 424 -545 130 617 527 -157 -146 433 686 250 -501 -225 753 355 -472 -484 321 692 -472 -806 280
3964 280 520 -641 -582 -96 596 -200 -831 45 312 180 -439 -293 579 447 117 -395 -17 822 624 -351
3984 -351 -219 779 1074 -99 -383 959 740 -418 -930 435 999 -356 -873 -328 462 -48 -803 -473
4002 -473 81 57 -1093 -521 42 426 -125 -503 -233 712 454 -832 -518 728 855 -94 -308 817 996
4021 996 -198 -558 366 575 309 -326 -132 540 -20 -481 -490 324 604 -518 -991 -507 186 173 -1117 -656
$$ packed form
3886A36L76m82o96M43P36p72m27m3J053q6o89k77L81J078m25r01K12P86L09q38
3906a26n10J466N03j203o30R73Q79j227q00R81N00l73j222L91R15k11r68j55N35
3925b82O23j37j163M70Q80O1j096K91N32N22j281m41J408O86j126o12R38N30l79
3944D24r69O75M87r0o84J1N79K53m36p51K76R78l98q27j2Q05L71j164l34J086
3964B80K40j161N9M86O92p96o31Q76K67j32o19J46Q72j32l30n12L78Q39j98r75
3984c51J32R98K95j173k84J342k19j158n12J365N64j355n17N45P90n10p55L30
4002d73N54k4j150N72N63L84n51l78K70R45k58j286L14J246J27r49k14J125J79
4021I96j194l60R24K09k66o35J94O72n60m61rQ14K80j122m73M84O93j3j290M61
$$ plain form
4041 -656 519 603 -563 -868 514 557 -528 -495 434 1001 255 -552 380 401 373 -101 -22 470 796 33 -439
4062 -439 114 685 175 -892 -554 745 162 -930 -632 354 230 -1002 -792 161 496 -265 -962 -150 676
4081 676 -184 -519 -239 552 527 -305 -217 719 836 184 -453 197 1210 390 -369 -332 677 632 -631 -331
4101 -331 564 637 -791 -930 287 275 -671 -1010 -60 41 -570 -550 -655 15 247 -268 -666 -7 474 562 -268
4122 -268 -242 763 156 -615 64 954 414 -285 -340 681 915 33 -623 208 646 -35 -504 -378 424 220
4142 220 -753 -556 11 535 -75 -963 -232 490 69 -835 -454 831 186 -728 -277 604 1074 -477 -645
4161 -645 417 720 323 -556 360 577 631 -178 -121 447 502 -93 -770 -263 346 -28 -988 -401 688 -56
4181 -56 -1301 -693 569 332 -675 -749 71 470 -26 -575 -113 447 212 -231 -54 697 557 -289 -362 316
$$ packed form
4041f56J175Q4j166l05J382M3j085L3R29N67p46q07R32K1k8m74P9M92L26p63m72
4062d39N53N71n10j067L38J299n83j092K98R86j24j232K10R53L35p61o97Q12Q26
4081F76q60l35K80P91k5q32Q8R36J17o52o37O50J013q20p59L7J009m5j263L00
4101c31Q95P3j428j39J217j2r46l39R50J01o11K0j05O70K32n15l98O59M81Q8q30
4122b68K6J005o07p71O79Q90n40o99n5J021K34q82o56Q31M38o81m69J26Q02k04
4142B20r73J97N67N24o10q88P31P22m21r04L81J285o45r14M51Q81M70j551j68
4161f45J062L03l97q79R16K17N4q09N7N68N5n95o77N07O09l74r60N87J089p44
4181e6j245O08J262k37j007p4Q20L99m96n49M62N60k35m43J77P51j40q46p3O78
$$ plain form
4201 316 787 484 -508 161 941 270 -772 -256 800 242 -762 -666 527 398 -586 -776 35 -112 -140
4220 -140 -736 -430 248 67 -674 -447 153 671 1 -866 135 1012 275 -530 -4 1059 526 -480 282
4239 282 630 356 -383 -179 197 343 -573 -728 -211 324 -72 -331 -531 4 313 -704 -926 -26 541 -298
4259 -298 -1052 -437 423 127 -350 103 611 599 -277 -457 580 485 -43 -229 272 594 259 -121 -154 630 595
4280 595 -339 -475 446 296 -342 -668 -123 566 -322 -707 -408 456 -169 -918 -568 270 260 -645 -537 -99
4300 -99 863 -80 -198 -329 252 416 -374 4 838 739 -15 -621 199 818 166 -720 -68 844 211 -770 -114
4321 -114 515 112 -989 -753 152 457 -632 -753 -16 187 280 -477 -281 333 318 -608 -570 434 1051 218
4341 218 -506 220 888 72 -418 239 1157 452 -683 -339 497 325 -199 -598 -256 266 -17 -669 -643 385
$$ packed form
4201C16M71l03r92O69P80o71j042N16J056n58j004R6J193j29r84j90Q11j47k8
4220a40n96L06O78j81p41K27O00N18o70q67J001Q77p37q05N26J063n33j006P62
4239B82L48k74p39K04L76J46r16j55N17N35l96k59k00N35L09j017k22R00N67q39
4259b98p54O15Q60k96m77M53N08j2q76j80J037r5n28j86N01L22l35l80l3P84l5
4280E95r34j36R21j50o38l26N45O89q88l85K99Q64o25p49L50Q38j0r05J08M38
4300i9R62r43j18j31N81J64p90L78Q34r9p54o06Q20O19o52q86O52R12o33r81O56
4321a14O29m03j101K36R05L05j089j21P37K03R3p57J96O14j5r26L8J004O17q33
4341B18p24P26O68q16m90O57R18p05j135L44Q36j72n24l99L42N22k83o52K6J028
$$ plain form
4361 385 -109 -921 -815 -25 284 -573 -389 37 497 12 -591 152 908 312 -410 125 973 497 -355 -66
4381 -66 848 519 82 -209 340 585 334 -175 -452 182 646 -753 -780 168 763 -283 -592 -236 391 -428
4401 -428 -591 -317 345 -172 -678 -334 281 268 -133 -195 389 706 447 -536 15 550 197 -363 -375 532 589
4422 589 125 -858 306 641 -247 -889 -417 282 -266 -708 -478 446 144 -715 -510 172 230 -70 -207 -190
4442 -190 274 500 -364 -246 513 542 -276 -668 901 1235 145 -412 334 1087 86 -365 486 289 -59
4461 -59 -604 -321 274 297 106 -621 -133 307 39 -583 -626 551 133 -707 -432 600 437 -401 -549 481
4481 481 643 -178 -463 167 790 238 -345 206 625 549 -90 -125 48 596 136 -600 -53 453 156 -693 -709
4502 -709 244 285 -672 -774 197 391 -697 -1000 139 350 -224 -686 274 782 85 24 3 434 871 -42
$$ packed form
4361C85m94q12J06P90L09q57J84M26M60m85o03P43P56n96p22N35Q48m76q52K89
4381f6R14l29m37k91N49K45k51n09k77O34M64j399k7R48N95j046l09L56O27q19
4401d28j63K74O62n17n06L44O15j3m01o2N84L17k59r83N51N35l53n60j2R07N7
4422E89m64r83J164L35q88o42M72O99n48m42K30R24l02q59K05O82N8l00j37J7
4442a90M64K26q64J18P59K9q18l92J569L34j090n57P46P53j001m51Q51j97l48
4461e9n45K83N95K3j91p27M88M40k68o22m3J177m18q40K75J032j63q38j48J030
4481D81J62q21k85O30O23n52n83N51M19p6o39l5J73N48m60p36N47N06k97q49j6
4502g09R53M1r57j02R71J94j088l03J139K11n74m62R60N08o97o1k1M31M37r13
$$ plain form
4522 -42 -139 429 784 213 -447 113 833 597 -546 -287 692 698 -380 -626 164 139 -357 -559 -278 -44 94
4543 94 -638 -378 690 531 -454 -601 259 437 -7 -710 -18 749 567 33 -176 978 591 -110 -545 385
4563 385 812 -648 -529 176 554 -15 -619 -114 366 139 -179 -394 -84 320 -163 -1079 -431 264 -8 -811
4583 -811 -387 796 623 -585 -81 271 359 -383 -631 318 655 -47 -266 115 421 375 -372 -210 461 285
4603 285 202 -564 -20 211 -244 -523 -48 784 -162 -836 -299 295 439 -535 -895 229 231 -514 -242 474 454
4624 454 34 -117 -219 357 533 38 -104 196 556 140 -420 288 884 229 -501 -69 836 -11 -603 -645
4644 -645 263 102 -384 -819 76 157 49 -393 -118 300 150 -760 -807 162 117 -114 -350 -34 755 380 -305
4665 -305 219 669 436 -157 -425 492 656 -263 -403 396 286 -315 6 -47 452 -385 -291 -247 -86 303 -684
$$ packed form
4522d2r7N68L55n71o60N60P20k36j143K59R79Oj078k46P90k5m96k02K81K34J38
4543I4p32K60J068j59r85j47Q60J78m44p03O92P67j82n34k09J154l87p01m35R30
4563C85M27j460J19P05L78n69o04N05M80k27l18k15L10M04m83r16O48O95k72q03
4583h11M24J183j73j208N04L52Q8p42k48R49L37p02k19L81L06m6p47J62O71j76
4603B85q3p66N44K31m55k79M75Q32r46o74N37N94J44r74l60J124Kp45K72P16k0
4624D54m20j51j02N76J76m95j42L00L60m16n60P08N96o55p30M32R05q47n92m2
4644f45R08j61m86m35Q95Q1j08m42K75M18j50r10m7R69m5k31k36L16P89l75o85
4665c05N24M50k33n93k68R17J64r19j40P99j10o01L21n3M99q37R4M4J61L89r87
$$ plain form
4686 -684 -651 -351 260 -80 -503 -146 501 -215 -523 78 463 342 -368 118 556 430 -231 35 467 587
4706 587 336 -474 109 349 88 -367 -222 220 186 -292 -332 -29 324 -104 -1004 -382 185 -420 -963 -755 596
4727 596 119 -458 -424 259 431 -75 -205 288 411 202 -384 -134 607 505 -124 -342 368 646 -15 -454
4747 -454 102 611 -122 -637 -351 173 -50 -755 -707 10 353 -489 -721 -138 296 -325 -640 -301 452 51
4767 51 0 -237 526 584 210 -161 424 563 324 -336 184 749 130 -488 -117 769 340 -347 -306 494 -31
4788 -31 -76 -492 -106 -166 -21 -997 -330 275 466 -429 -628 124 661 -301 -576 133 285 -303 -354 264 543
4809 543 749 -206 273 409 824 254 39 37 453 25 -557 -158 395 -78 -211 -601 240 435 -537 -900 -142
4830 -142 269 -222 -747 -109 -83 -38 -718 -179 462 69 -532 -228 174 216 -265 -242 -54 538 580 422 -64 628
$$ packed form
4686f84L3L00O11l40m23L57O47p16l08O01L85j21p10M86M38j26o61K66M32J20
4706E87k51q10N83K40k61m55J45M42l4m78m0L03L53m28r00O22N67o05n43K08J351
4727E96m77n77L4O83J72n06j30M93J23k09n86K50P41j02o29k18P10K78o61m39
4747d54N56N09p33n15K86N24k23p05M8P17L43q42k32N83M34o21l15L39P53m01
4767E1n1k37P63N8l74l71N85J39k39o60N20N65o19o18L71Q86m29o87M1Q00n25
4788c1m5m16L86o0J45r76O67O05J91q95j99P52N37r62k75P09J52n88n1O18K79
4809E43K06r55M79J36M15n70k15kM16m28n82L99N53m73j33l90Q41J95r72l63P58
4830a42M11m91n25O38K6M5o80N39O41l93o01L04M02M2m81K3J88N92M2j58m86O92
$$ plain form
4852 628 659 -288 -801 67 544 -130 -743 506 384 -374 -689 -123 444 238 -268 -337 -50 103 -321 -1013
4872 -1013 70 428 128 -757 -222 350 190 -143 -157 468 504 -170 -262 280 676 229 -568 309 497 275
4892 275 -198 -67 318 23 -399 -385 -26 122 -198 -599 -318 340 291 47 -498 10 514 -292 -555 -110 571
4913 571 -128 -173 480 534 290 -62 288 738 458 -265 -23 433 640 -18 -268 210 383 36 -507 -519 429
4934 429 -24 -595 -524 -5 200 -397 -592 -398 441 -119 -236 -101 343 301 -76 -63 243 165 160 -247 184 659
4956 659 245 207 320 452 433 -95 -340 356 361 -331 -186 34 484 -302 -851 156 89 -75 -480 -468 374 -7
4978 -7 -444 -246 66 -66 -318 -439 -48 430 149 -94 -90 331 218 -271 -459 506 494 155 -30 427 571 128
5000 128 -651 -93 463 171 -669 -245 -45 -96 2 -126 -308 94 -187 -637 -187 544 194 -574 -312 372 576
$$ packed form
4852F28L1r47n13Q68M77o74o13J249j22p58l15N66N67k06n06o9K87J53m24o92
4872a013J083L58l00q85N35N72j60l33j4O25L6o74r2N42L96m47p97Q77J88k22
4892B75m73J31L85k95m22J4L59J48l20m01K81O58m9k44n45N08N04q06k63M45O81
4913E71o99m5O53N4k44l52L50M50k80p23K42M56K07o58k50M78J73l47n43j2R48
4934D29m53n71P1N19K05n97j95J94Q39n60j17J35M44m2l77J3L06p8nm07M31M75
4956F59m14l8J13J32j9n28k45O96No92J45K20M50p86n49J007o7j64m05J2Q42l81
4978gm37J98L12j32k52j21L91M78k81k43MM21j13m89j88R65j2l39j85M57J44m43
5000A28p79N58N56k92q40M24K00n1R8j28j82M02k81m50M50P31l50p68K62O84K04
$$ plain form
5021 576 -261 -87 536 438 -201 -198 521 476 273 -299 -206 418 142 44 -137 249 103 -86 -622 -326 195 -125
5043 -125 -505 -235 21 205 -104 -728 94 195 -151 -553 -17 948 -222 -383 84 585 -5 -175 -164 338
5063 338 345 381 -270 473 663 281 -236 -135 382 295 -559 -311 88 241 -356 -353 174 367 -295 -580 193 101
5085 101 -29 -554 -210 -51 194 -312 -290 229 362 -206 -561 302 362 161 -324 204 626 379 25 -13 349
5106 349 603 -286 -240 -74 187 -242 -77 47 415 370 -485 -449 -236 162 82 -261 -277 270 17 -713 -454 141
5128 141 599 -383 -235 601 388 18 -99 682 444 -35 -285 142 402 638 71 129 270 519 8 -734
5148 -734 59 134 -194 -668 -390 110 -5 -639 -701 188 -78 -582 -593 220 203 -248 -514 -33 453 -228 -253 66
5170 66 576 457 -106 -199 171 578 -45 -92 96 732 105 -685 -186 371 414 -702 -50 305 172 -357 -193
$$ packed form
5021E76q37J74O23r8o39LP19m5k03n72R3O24k76r8j81L86j46j89n36K96N21l20
5043a25l80K70K56J84l09o24Q22J01l46m02N36R65j170j61M67N01n90j70J1N02
5063C38PL6o51P43J90l82n17J01N17q7q54K48L99J53n97LN27J93o62k85P73r2
5085A01j30n25L44J59K45n06K2N19J33n68l55Q63O0k01m85N28M22k47l54l8L62
5106C49K54q89M6J66K61m29J65J24L68m5q55L6K13L98q0l43j6N47k53p30K59N95
5128A41M58r82J48Q36k13l70j17P81k38m79k50M27K60K36n67N8J41K49n11p42
5148g34P93P5l28m74K78N00j15o34o2Q89k66n04j1Q13j7m51k66M81M86o81k5L19
5170F6N10j19n63r3L70M07o23m7J88O36o27p90M99N57M3j116O52L55j33n29J64
$$ plain form
5191 -193 -177 -35 -40 -338 -256 146 487 -359 -214 255 476 -328 -579 180 518 -86 -351 330 602 47 -210
5212 -210 -187 475 93 -225 -257 351 218 12 -455 -56 294 -7 -404 -274 315 5 -565 -369 -33 51 -417
5233 -417 -442 133 311 -108 -477 142 499 431 -452 150 966 459 -334 -221 293 544 -156 -418 -92 539 326
5254 326 -276 -441 -12 337 -70 -758 363 425 -317 -888 -330 352 -136 -678 -7 4 66 -27 -175 443 269
5275 269 157 -326 266 280 288 -118 -157 435 337 -89 -257 236 318 -56 -299 109 217 -3 -848 -334 133 -112
5297 -112 -664 -60 132 -124 -405 -285 21 115 326 -442 76 366 420 -55 -514 340 338 -34 -514 335 432 37
5319 37 -352 138 113 338 -32 103 119 354 -470 -276 93 67 32 -547 62 222 -149 -357 45 296 263 -463
5341 -463 -399 300 310 -202 -339 346 559 81 -255 20 517 225 -338 -126 642 308 -183 -117 323 391 381 -184
$$ packed form
5191a93J6J42nk98Q2M02L41q46J45M69K21q04k51P59L38o04k65O81K72n55k57
5212b10K3O62l82l18l2O08j33k06m67L99L50l01l97J30N89l10n70J96L36Q4m68
5233d17k5N75J78m19l69O19L57o8q83O02Q16n07p93J13N14K51p00k62L26O31k13
5254C26o02j65M29L49m07o88J121O2p42n71N58O82m88n42O71J1O2r3j48O18j74
5275B69j12m83N92J4Qm06l9N92r8m26j68M93Q2l74k43M08J08k20q45N14M67k45
5297a12n52O04J92k56k81J20L06R4K11p68N18K90N4m75m59Q54kl72m80Q49R7l95
5319C7l89M90k5K25l70J35J6K35q24J94L69k6l5n79O09J60l71k08M02K51l3p26
5341d63O4O99J0n12j37O85K13m78l36K75M97k92n63K12P68l34m91O6M40O8j0n65
$$ plain form
5363 -184 -291 -133 107 -494 -569 -20 114 -102 -334 -167 -44 74 -654 -115 94 86 -143 -34 311 340 302 -328
5385 -328 273 292 213 -42 114 646 -34 -176 -87 167 252 9 -386 424 419 -126 -867 -405 497 -45 -701 -539
5407 -539 302 -176 -415 -424 83 77 -180 -379 -41 45 -67 -231 135 259 361 -336 -233 513 476 -12 -40 -35 505
5430 505 47 -299 -114 599 428 -531 -144 127 262 -457 -480 -270 223 -433 -375 -107 117 -11 -424 -80 272
5451 272 32 -396 -322 313 398 218 -404 176 605 117 -623 -71 389 -190 -13 -91 355 306 186 -362 153
5472 153 84 36 -557 -34 426 141 -440 -503 261 407 -245 -233 -176 228 -186 -691 180 556 519 -310 -324 298
5494 298 324 -43 -145 173 680 70 -253 -26 808 253 -288 36 265 376 -492 -458 -76 227 -324 -518 -188
5515 -188 -33 -161 -291 -188 200 97 -315 -253 207 -6 345 -468 -35 416 118 -193 -245 298 558 86 -157
$$ packed form
5363a84j07J58K40o01p5N49J34k16k32J67J23J18p28N39K09qk29J09L45K9l8o30
5385c28O01J9p9k55J56N32o80j42Q9K54Q5k43l95Q10nn45p41M62R02n42o56J62
5407e39Q41m78k39rN07ok57j99L38Q6j12j64L66J24J02o97J03P46l7m88k8NN40
5430E05m58l46J85P13j71r59L87K71J35p19k3K10M93o56N8K68K24j28m13L44L52
5451B72k40m28P4O35Q5j80o22N80M29m88p40N52M60n79J77p8M46m9j20n48N15
5472A53o9m8n93N23M60k85n81o3P64J46o52J2N7M04m14n05Q71L76l7q29j4O22
5494B98K6l67j02L18N07o10l23K27Q34n55n41L24K29J11q68L4L82L03n51j94L30
5515a88J55j28j30J03L88j03m12O2M60k13L51q13M33M51k98l11n2N43K60m72k43
$$ plain form
5536 -157 299 395 -56 -247 292 489 -374 -332 -332 -114 274 -499 -369 -34 359 -288 -401 -36 202 146 -577 -122
5558 -122 360 224 -43 -191 322 293 -225 -325 360 528 56 -165 -272 493 163 -210 1 15 -150 -360 -59
5579 -59 89 213 -96 -278 17 379 87 -611 1 265 16 -435 -243 282 -105 -275 -231 -20 502 -53 -155
5600 -155 322 489 497 73 -278 67 551 -179 -133 400 215 -194 -243 -146 327 311 -148 -96 -142 57 -160 -382 64
5623 64 153 -81 -291 -276 215 68 -179 -45 353 187 5 -113 386 349 151 -32 2 307 142 -361 -38 404
5645 404 164 -487 120 336 64 -37 -90 -98 104 -318 -486 -418 542 -85 -417 -332 -95 206 -147 -293 145 375
5667 375 -85 -424 -72 243 282 152 -12 161 109 -491 -41 310 481 -56 -538 234 224 -17 -125 103 174
5688 174 75 -401 -126 80 162 -169 -646 -29 186 -138 -496 -53 53 141 -519 -193 156 502 -165 -346 56
$$ packed form
5536a57M56R6m51j91N39J97q63M2%K18L88p73J30L35L93o47j13L65K38n6p23M55
5558a22M82j36k67j48N13k9n18j00O85J68m72k21j07P65l30l73K11J4j65k10L01
5579e9J48J24l09j82K95L62k92o98O12K64k49m51J92N25l87j70M4K11N22n55j02
5600a55M77J67Qm24l51L45M84p30M6N33j85m09m9R7M73j6m59N2m6J99k17k22M46
5623F4Q9k34k10J5M91j47k47J34L98j66j82j18M99l7j98j83L4L05j65n03L23M42
5645D04k40o51O07K16k72j01n3qK02m22j68O8R60o27l32Q5K37L01l53j46M38K30
5667C75m60l39L52L15L9j30j64J73n2o00M50L51J71n37m82P72j0k41j08K28P1
5688A74r9m76K75K06Q2l31m77O17K15l24l58M43J06Q8o60L26L49L46o67j81M02
$$ plain form
5709 56 553 270 -59 -93 417 355 154 -13 462 520 -149 -37 340 -36 -38 -393 -107 385 86 -443 -362 256
5731 256 227 -368 -376 242 150 -120 -347 -331 126 -172 -284 -157 252 131 -168 113 -124 697 199 -409 -2 287
5753 287 114 -177 -344 234 78 -268 -379 84 -77 -3 -409 -56 94 -80 -319 -569 92 -92 -430 -336 160
5774 160 250 -121 -211 353 348 -54 -211 46 460 -69 5 -42 253 510 121 -332 660 367 128 -244 -92 270
5796 270 -55 -248 -431 109 101 -435 -454 95 577 -83 -682 -55 159 -183 -332 138 233 238 -73 50 428 460
5818 460 150 31 8 628 11 -125 296 189 376 -46 -34 232 106 -192 -629 248 -65 117 -427 -199 109
5839 109 166 -399 -469 462 381 -397 -143 122 189 75 -310 -268 95 229 -56 -272 185 489 -28 -350 -30 481
5861 481 130 -363 113 413 76 -137 -261 132 -118 -250 -418 -76 258 37 -317 -302 -45 36 -205 -307 332
$$ packed form
5709E6M97k83l29l4N10o2k01j67M75N8o69J12L77l76kl55K86M92k99n29Q1O18
5731B56k9n95qO18r2k70k27J6M57k98j12J27M09j21k99K81k37Q21m98o08M07K89
5753B87j73k91j67N78j56l46j11M63j61P4m06L53J50j74k39k50O61j84l38R4M96
5774A60R0l71r0N64nm02j57K57M14n29P4m7K95K57l89m53R92k93k39l72J52L62
5796B70l25j93j83N40qn36j9N49M82o60n99O27K14l42j49M70R5Nl11J23L78L2
5818D60l10j19k3O20o17j36M21j07J87m22J2K66j26k98m37Q77l13J82n44K28L08
5839A09N7n65p0R31q1p78K54K65O7j14l85M2L63J34k85k16M57L04n17l22L20N11
5861D81l51m93M76L00l37k13j24L93k50j32j68L42L34k21l54J5K57Q1k41j02O39
$$ plain form
5882 332 65 -534 -342 280 107 -286 -359 183 394 170 -163 361 461 201 108 -342 199 165 86 -360 62
5903 62 204 -60 -556 74 89 131 -92 -376 39 -55 93 -238 110 449 -257 -537 158 235 90 -412 16 383
5925 383 86 -91 -496 180 470 -79 -289 -95 582 535 -489 213 349 283 -269 -161 125 331 -138 -165 221
5946 221 -29 -136 -644 -224 63 127 -354 -168 115 471 -95 -97 220 304 -117 -13 15 -11 737 -13 -273 357
5968 357 18 -131 -493 182 443 -337 -379 0 268 -105 -48 -207 31 7 -165 -476 -320 220 -124 -319 -157
5989 -157 78 59 -222 275 398 519 41 -91 172 358 157 -216 126 254 220 -229 -15 245 -62 -235 -197
6010 -197 205 -151 -434 -410 51 184 -154 -278 -68 139 -132 -431 -482 -85 152 -272 -159 -135 345 203 -291
6031 -291 140 367 -52 -157 74 617 230 209 33 297 349 119 -551 -11 140 163 -546 -56 654 -31 -216
$$ packed form
5882C32k67n99J92O22j73l93p3N42K11k24l33N24J00k60r3m50N41l4p9m46M22
5903F2J42k64m96O30J5M2k23k84M15r4J48l31L48L39p06k80O95P7j45n02M28L67
5925C83k97j77m05O76K90n49k10J94O77m7j024P02J36o6n52J08K86K06m69k7L86
5946B21k50j07n08M20K87O4m81J86K83L56n66kL17Q4m21J04K8k6P48p50k60O30
5968C57l39j49l62O75K61p80m2L79K68l73N7j59K38k4j72l11J56N40l44j95J62
5989a57K35j9k81M97J23J21m78j32K63J86k01l73L42J28l4m49K14K60l07j73L8
6010a97M02l56k83K4M61J33l38j24K10K07k71k99n1L97K37m24J13K4M80j42m94
6031b91M31K27m19j05K31N43l87k1j76K64N2k30o70N40J51K3p09M90P10o85j85
$$ plain form
6052 -216 74 -116 79 -249 -254 -81 37 143 -326 -188 172 75 -55 -302 134 296 9 65 199 181 202 -318
6074 -318 -117 129 340 -612 57 80 332 -57 -60 46 198 128 -569 -214 155 -13 -491 -122 31 26 95 -320
6096 -320 6 247 81 -508 -219 723 -168 -197 -130 80 87 -352 -204 286 376 51 -83 -52 -8 147 -91 -21 66
6119 66 237 49 -364 -31 133 12 -639 36 212 -117 -217 -43 132 93 -203 -154 363 395 -106 -394 156
6140 156 340 317 -267 312 248 -275 -55 58 103 354 -90 -257 -48 290 -77 -498 79 225 -129 -322 -152
6161 -152 -62 -168 -503 -334 284 140 -176 -191 -117 219 132 21 -352 262 104 6 -104 426 147 -119 -66 415
6183 415 262 14 -298 -111 268 194 -77 138 415 198 -79 2 88 128 -253 -663 -322 -144 57 -210 -123 -36
6205 -36 -72 191 -427 252 301 -259 -250 -48 412 144 81 -85 295 147 -259 -170 358 279 8 -208 151 24 -112
$$ packed form
6052b16K90j90J95l28nJ73J18J06m69J38L60r7j30k47M36J62k87N6J34j8K1n20
6074c18K01K46K11r52O69K3K52l89lJ06J52p0o97L55L69j68m78L69J53nO9m15
6096c20L26K41j66n89K89R42q91k9O7K10Pm39J48M90R0l25j34L1M4J55k38P0Q7
6119F6J71j88m13L33J64j21o51O75J76l29j00J74J75l9k96M9N17L2n01k88N50
6140A56J84k3n84N79o4n23K20J13M5K51m44j67K09L38l67m21N77J46l54j93J70
6161a52R0j06l35J69O18j44l16j5P4L36q7j11l73O14j58r8j10N30k79k66N3M81
6183D15j53k48l12J87L79p4k71K15K77k17k77Q1Q6M0l81m10L41J78K01k67Q7Q7
6205c6l6K63o18O79M9n60RK02M60k68o3j66L80j48m06Q9N28p9k71k16L59j27j36
$$ plain form
6228 -112 -314 -279 234 -130 -355 -431 -229 124 -209 -411 -51 140 43 348 -491 107 274 -393 -39 201 424
6249 424 -10 48 -12 391 87 46 -15 282 515 230 188 408 251 -227 -348 -242 219 -121 -613 -207 243 73
6271 73 -272 154 121 111 -319 -250 90 331 43 -417 224 368 32 -144 -55 253 275 -62 93 61 344 -53
6293 -53 -73 -70 58 88 -303 -184 249 166 -471 -132 -98 189 -139 -91 17 151 -145 -423 33 193 127 -122 -249
6316 -249 320 65 -82 -152 -9 326 319 20 -90 257 130 -42 -135 262 128 120 -177 124 160 42 -43 -47 143
6339 143 -211 -102 -351 152 -169 -569 -147 -264 57 -136 -159 292 300 313 63 -112 308 78 28 -88 166 227
6361 227 -75 -250 184 474 16 -111 -124 -4 245 -156 -237 -160 421 -136 -103 -18 116 -199 -252 -1 89 -156
6383 -156 -231 -152 73 263 -128 89 -35 359 8 -172 412 382 165 -35 97 322 221 -30 -54 319 271 -264
$$ packed form
6228a12k02L5N13l64k25p6K02L53l33k02L60J91r7L05q39N98J67o67L54K40K23
6249D24m34N8o0M03l04m1o1K97K33k85m2K20j57m78j21J06M61l40m92M06M50j70
6271G3l45M26l3j0m30O9L40K41k88m60O41J44l36j76Q9L08K2l37J55l2K83l97
6293e3k0LJ28L0l91J19M33q3o37L39L4K87l28M8J08J34k96k78M56J60o6k49j27
6316b49N69k55j47p0J43L35pk99j10L47j27j72r3L97j34qk97L01L6j18q5mJ90
6339A43l54J09k49N03l21m00M22j17L21j93k3M51QJ3k50j75M20k30n0j16K54O1
6361B27l02j75M34K90m58j27j3J20K49m01q1P7N81n57L3Q5J34l15n3K51R0k45
6383a56p5P9K25J90l91K17j24L94l51j80N84l0k17k00J32K25j01k51k4L73m8n35
$$ plain form
6405 -264 50 -87 -65 -271 -199 123 71 105 -500 -370 26 496 -280 -557 61 178 -23 -348 70 311 100
6426 100 89 -262 326 507 223 -476 181 384 -91 -43 416 432 179 -14 -40 -46 152 44 -220 -3 299 -227
6448 -227 -116 -182 194 -84 -271 -435 141 237 -47 -232 -165 656 90 -73 222 133 127 -150 -89 -9 307 -67 84
6471 84 344 101 208 -171 382 335 191 -195 -26 150 -8 -225 -76 0 212 -103 -142 -97 119 -235 -489 -132
6493 -132 158 36 -180 -191 153 224 20 -232 411 523 11 -382 -9 365 133 -342 -12 464 -90 196 -121
6514 -121 77 296 93 -375 -126 19 -31 66 128 22 134 -258 -109 -116 121 -237 -417 74 285 91 -388 -31
6536 -31 108 318 -362 -215 249 424 144 -247 146 210 -65 -447 243 400 -60 -376 -259 47 96 -148 -243
6557 -243 -223 127 -221 -329 -5 49 61 -377 -110 -61 413 -96 19 7 -104 -162 -214 -109 258 187 218 -91 377
$$ packed form
6405b64L14j37K2k06P2L22n2L4o05J30L96M70p76k77O18J17k01l25M18K41k11
6426A00j1l51N88J81k84o99O57K03m75M8M59J6k53j93k6oJ98j08k64K17L02n26
6448b27J11o6L76k78j87j64N76R6k84j85O7Q21n66j63K95q9ok77O1Q0L16l74J51
6471H4K60k43J07l79N53m7j44l86J69J76j58k17J49P6K12l15l9M5K16l54k54L57
6493a32K90j22k16j1L44P1k04k52O43J12n12l93L73L74k32m75L30M76n54K86l17
6514a21J98K19k03m68K49J45n0R7O2j06J12l92J49pK37l58j80M91K11j94m79L57
6536c1J39K10o80J47M64J75k80l91L93O4k75l82O90J57m60l16J17L06M9k44r5
6557b43K0L50l48j08L24N4J2m38K67M9M74n09J15j2j11n8n2J05L67p1L1l09M68
$$ plain form
6580 377 182 -245 15 112 182 -4 -233 113 210 -30 -359 -84 103 -229 -304 -125 -138 258 -210 -488 500 271
6602 271 57 -161 -121 351 180 129 39 169 127 36 -308 141 368 6 -546 -182 514 261 -140 -119 489 -55
6624 -55 96 -145 -204 105 62 -55 -28 -32 56 -60 -249 -3 283 -174 20 39 337 -81 -64 84 -86 133 -246
6647 -246 154 465 269 -230 -271 -59 305 -114 -188 355 281 -163 -310 8 144 251 71 -201 -159 122 111 -410
6669 -410 -86 -33 273 31 218 157 -62 -11 -419 234 123 231 -184 141 346 169 -194 -165 29 76 -21 -41
6691 -41 259 231 -381 -107 45 136 -442 -293 -105 177 -134 -261 -160 157 -122 -189 -382 -282 68 -339 -83
6712 -83 -130 99 -61 -37 121 313 203 -147 30 266 35 176 36 171 594 -11 -303 -71 376 -47 -504
6733 -504 38 -108 -69 -11 -127 50 289 -205 -401 -25 241 -108 -314 -124 -50 255 -83 -252 73 344 -15
$$ packed form
6580C77j95m27K60R7P0j86k29L46R7k40l29K75J87l32p5J79j3L96m68k78R88k29
6602B71k14k18M0M72j71n1r0J30m2r1l44M49K27l62n52L64O96k53m01K1O08n44
6624e5J51k41n9L09m3j17K7mQ8j16j89K46K86m57J94J9K98m18J7J48j70K19l79
6647b46M00L11j96m99m1K12L64m19p4N43p4m44j47L18J36J07j80k72M2K81j1n21
6669d10L24N3L06k42J87o1k19N1m08O53j11J08m15L25K05j77l63K9J94M7r7k0
6691d1L00k8o12K74J52R1n78J49J88K82l11j27J01L17k79o7j93J00L50m07K56
6712h3m7K29j60K4J58J92j10l50J77K36k31J41j40J35M23o05k92K32M47m23m57
6733e04N42j46L9N8j16J77K39m94j96L76K66l49k06J90P4L05l38j69L25K71l59
$$ plain form
6754 -15 41 -6 213 128 56 -284 218 417 -207 45 92 46 -230 -93 148 307 36 -259 -138 118 -247 -225 -195
6777 -195 43 57 -121 -562 384 245 -10 -80 -172 112 282 -20 19 219 371 36 -66 -91 337 -86 -138 -182
6799 -182 -61 102 -337 -87 170 91 -471 -319 -75 -159 -146 -153 224 503 21 -339 -220 340 196 -142 -357 260
6821 260 165 22 -276 80 1 -133 -199 -236 62 318 120 -544 314 111 -11 -60 166 375 -116 -211 -153 -169 -60
6844 -60 -362 -112 -80 -26 -214 -185 -355 170 -43 -587 -47 -54 112 -245 -420 -44 239 -262 -10 304 554 62
6866 62 -302 -220 204 92 2 34 250 0 -74 -134 -122 71 37 -355 -192 234 -109 -306 -339 196 204 -1 -310 -1
6890 -1 202 -50 -275 158 275 -47 6 65 156 196 -234 -7 401 4 82 -363 -45 139 14 -167 -123 104 104
6913 104 -264 -64 106 363 -107 -385 70 69 -194 -380 -357 230 20 -206 -195 5 130 -389 -139 -55 184 -37
$$ packed form
6754a5N6m7K19q5p2l40N02J99o24K52M7m6k76J37K41J59k71k95J21K56l65K2L0
6777a95K38J4j78m41R46j39k55p0r2K84J70l02L9K00J52l35j02k5M28m23n2m4
6799a82J21J63m39K50K57p9n62J52K44q4J3pL77K79m82l60J19N60j44l38k15O17
6821B60r5j43k98L56p9j34o6l7K98K56j98o64Q58k03j22m9K26K09m91r5N8j6J09
6844f0l02K50L2N4j88K9j70N25k13n44N40pJ66l57j75L76K83n01K52L14K50m92
6866F2l64Q2M24j12r0L2K16k50p4o0J2J93l4l92J63M26l43j97l3N35Qk05l09L09
6890aK03k52k25M33J17l22N3N9R1M0m30K27M08l97P8m45L18J84j25j81M4K27%
6913A04l68K00J70K57m70k78M55jk63j86K3N87k10k26J1K00J25n19K50Q4K39k21
$$ plain form
6935 -37 -189 278 71 105 -104 -213 164 90 -215 -72 247 148 39 -67 -5 343 -29 -216 -207 -155 -170 -276 -18
6958 -18 -190 175 -9 -414 202 271 -159 -215 -269 342 179 141 -148 141 142 -132 -67 99 443 -174 -120 -135 -164 315
6982 315 -71 -346 210 230 -88 -531 -133 -185 -160 -368 -271 179 -74 -82 -263 -67 154 -227 -222 321 301 -6 -305
7005 -305 128 -105 169 22 41 -17 505 138 -174 119 339 -60 -156 -128 437 63 -400 -117 12 -8 -495 -189
7027 -189 41 -166 -39 -103 -125 -51 -50 -126 -116 246 49 40 -262 195 150 61 165 27 392 29 -222 -123 308 -76
7051 -76 -329 -288 42 27 -34 -98 204 28 -313 -72 -286 -467 16 16 -193 -280 -107 -93 -323 -46 143 64 -253
7074 -253 -192 128 88 -95 -185 205 334 -21 -280 492 209 -168 -28 21 323 13 -100 -145 64 25 -369 -70
7096 -70 104 157 124 -102 148 -23 -332 -350 -251 197 56 -447 4 20 106 137 -137 226 151 -30 -92 -107 86 168
$$ packed form
6935c7j52M67k07L4k09j09L77p4l05J43L19r9j09j06O2L48l72j87RN2j5j06K58
6958a8j72L65j84m05O16O9m30n6n4O11j63l8k89K89Jk74O5J66L44o17N4j5k9M79
6982C15l86k75N56K0l18m43L98n2K5k08R7M50k53qj81J96K21l81NN43k0l07k99
7005c05M33k33K74j47J9n8N22l67l12K93K20l99r6K8N65l74m63K83J29k0m87L06
7027a89K30k07J27o4k2P4Jp6J0L62j97rl02M57m5q9J04j38L65l63k51R9M31l84
7051g6k53M1L30j5o1o4L02j76l41K41k14j81M83%k09q7J73J4k30K77J89p9l17
7074b53O1L20m0j83r0L90J29l55k59P72k83l77J40M9L02l10j13m5K09l9l94K99
7096g0J74N3l3k26K50j71l09j8R9M48j41n03M51J6Q6L1k74L63p5j81o2j5J93Q2
$$ plain form
7120 168 -101 236 17 215 -92 -236 148 63 59 -279 -229 283 79 -158 -23 27 177 -103 -185 -243 318 -33
7142 -33 -4 215 104 -385 -203 -156 292 -267 -399 -193 -28 -40 -68 -244 110 362 130 -205 -226 368 33 -23
7164 -23 -305 283 -51 -211 -327 188 414 -61 -104 178 274 -40 83 -307 291 178 -271 34 117 47 -309 -128
7186 -128 71 218 38 -258 -89 343 113 103 -212 224 -68 -140 4 196 424 7 138 54 255 -207 -263
7207 -263 -346 90 57 -327 -197 197 367 -132 -351 78 276 89 -418 -5 38 -24 -182 295 -116 229 -8
7228 -8 -1 194 -151 -106 -311 111 170 268 -79 -453 203 53 -118 -149 163 377 -470 -240 -22 122 -80 -273 -42
7251 -42 41 22 -93 -95 53 155 88 -135 46 381 317 -48 -232 -7 7 5 -78 152 252 -74 -317 159 116 125 -409
7276 -409 -153 -71 122 -497 -112 302 161 -109 -339 -67 160 261 -147 122 22 131 -196 -239 142 158 -93
$$ packed form
7120A68k69L37k19J98l07j44L84q5ml38N0N12k04k37J35N0J50k80q2n8N61l51
7142c3K9K19j11m89J82M7M48n59j32K06J65j2k8j76L54K52k32l35k1N94l35n6
7164b3k82N88l34j60j16N15K26m75m3K82R6l14J23l90N98j13m49L05Q3p0l56J81
7186a28J99J47j80k96J69M32k30j0l15M36k92p2J44J92K28m17J31q4K01m62n6
7207b63q3M36l3l84J30L94J70m99k19M29J98j87n07M13M3o2j58M77m11L45k37
7228hPJ95l45M5k05M22N9R8l47l74O56j50j71l1L12K14q47K30K18J44k02j93K31
7251d2Q3j9j15kJ48J02o7k23J81L35o4l65j84K25J4kq3K30J00l26k43M76m3Rn34
7276d09K56Q2J93o19L85M14j41k70k30K72K27J01m08K69j00J09l27m3L81J6k51
$$ plain form
7297 -93 -43 190 113 -283 74 -32 125 361 -119 -110 -92 138 -43 -86 161 252 -26 -153 -32 -79 69 215 52
7320 52 -34 126 -298 -202 6 375 24 -180 -29 178 131 173 95 -29 390 -109 -22 85 -135 130 -152 100
7342 100 111 192 -138 -290 -268 105 -92 -197 -217 168 -112 -276 -165 203 14 -320 -357 -272 41 -40 -292 -98
7364 -98 120 49 -344 -15 133 214 -150 -137 256 82 353 17 112 199 68 -83 183 230 -68 -104 -268 -148 -119
7387 -119 -78 -197 124 136 -402 -151 276 -34 -137 -117 38 91 93 -271 -133 152 262 450 -246 109 147 174 -363
7410 -363 -167 335 71 26 103 87 166 -97 3 16 246 -202 -177 -26 164 -5 -244 -65 140 94 -122 -68 -3
7433 -3 159 -56 -182 2 54 246 -184 239 270 -115 8 32 104 62 -2 -192 -127 0 -40 -99 70 -202 210 -67
7457 -67 -143 148 -51 -450 -277 -194 -285 181 -180 88 186 -33 -363 -35 316 -69 -122 -132 -6 428 -58 -324
$$ packed form
7297i3N0K33p7l96L57j06J57K36m80RJ8K30j81m3K47R1k78j27J21m7J48J46j63
7320E2q6J60m24R6K08L69l51k04J51K07m7M2p8j24M19m99Q7J07k20K65k82K52
7342A00J1Q1l30j52K2L73j97j05k0L85k80j64J11L68j89l34l7Q5L13q1k52J94
7364i8K18p1l93L29J48Q1l64J3L93j74K71l36R5Q7j31j51K66M7k98l6j64J20K9
7387a19M1j19L21J2n38K51M27l10j03K0J55N3Kl64J38K85J10J88o96L55L8K7n37
7410c63J96N02k64m5P7j6P9k63J00J3K30m48K5J51J90j69k39J79K05m6k16N4O5
7433cJ62k15j26J84N2J92m30M23L1l85J23K4P2m2o4j90O5J27m0n9J69k72M12k77
7457f7p6K91j99l99J73Q3r1M66l61K68R8k19l30L28L51l85n3j0J26M34m86k66
$$ plain form
7479 -324 51 333 321 120 -81 132 203 -114 -66 74 49 -133 -264 -307 -83 -100 -217 -161 401 60 -106 -90 -94
7502 -94 206 -35 15 397 281 -329 -228 113 -38 -79 -106 20 258 229 -251 30 -87 -25 54 54 73 98 -15 -403
7526 -403 -285 -40 613 81 20 198 -94 -187 -309 -84 -149 22 -254 98 145 203 -85 -570 273 105 68 -247
7548 -247 444 201 60 17 -284 490 176 -70 54 65 -113 158 90 50 -142 -39 -149 -285 60 316 -25
7569 -25 -570 20 254 -37 -63 -89 169 109 -168 -307 179 185 49 -152 121 193 -22 81 319 -48 -9 -240 -104
7592 -104 272 -183 186 -202 111 155 54 -61 9 68 40 -30 -400 244 189 -99 38 -18 256 -273 0 57 -152
7615 -152 45 134 119 144 195 -463 356 558 3 -46 -100 -160 32 -320 -387 229 208 -150 -317 -328 -21 -44 -165 -79
7639 -79 317 414 -98 -382 156 -20 -159 -268 226 125 96 6 -100 -105 77 -354 -344 242 43 272 0 357
$$ packed form
7479c24L75K82j2k01k01K13P1l17M8J40k5j82j31m3K24j7j17N6N62l41j66J6m
7502i4L00k41N0L82j16o10J01L41j51m1k7J26K38k9m80K81j17O2P9%J9K5j13l88
7526d03J18K45O53n32o1J78k92r3j22K25o5J71k76L52M7N8k88m85Q43j68l7l15
7548b47O91k43j41m3l01P74l14k46J24J1j78K71o8m0j92J03j10j36L45K56l41
7569b5n45N90K34k91k6k6K58o0k77j39M86Oj36k01K73P2k15J03K38l67L9k31J36
7592a04L76m55L69l88L13M4j01j15P0N9k8p0l70O44n5k88J37n6K74n29K73N7k09
7615a52J97Q9j5K5N1o58Q19K02n55m9n4o0J92l52o7O16k1l58j67j1L07k3j21Q6
7639g9L96R7n12k84N38j76j39j09M94j01k9r0j06nJ82m31J0N86j99K29k72L57
$$ plain form
7661 357 327 288 -74 -277 201 136 -155 -403 -100 157 -265 -83 -77 -1 21 -430 25 293 86 239 -694 74
7683 74 89 -62 12 123 206 102 -16 22 201 -29 10 95 334 133 -66 -375 281 142 -38 -404 199 380
7705 380 316 -155 189 -4 41 -79 -305 -64 31 -245 -257 132 538 -37 -124 96 -66 4 -23 131 156 66 -88
7728 -88 52 292 245 344 -7 -15 358 -66 98 -50 -90 117 21 -139 -38 157 186 -176 -190 100 57 -254 -102
7751 -102 -3 164 12 -34 -9 2 44 86 15 78 163 -218 15 179 88 -153 -27 222 356 398 -16 -7 -69 45 -102
7776 -102 -142 220 -37 -434 -305 230 -130 -323 -242 26 363 -119 96 -439 -55 -353 218 -49 294 203 -51
7797 -51 86 -78 346 -106 -185 -144 244 18 -14 -184 342 382 -193 84 193 -128 -18 -245 76 334 95 142
7819 142 -147 263 -137 -249 -22 69 72 142 -14 29 63 147 92 132 148 311 88 -184 162 3 268 369 1
$$ packed form
7661C57l0l9l62k03M78o5k91k48L03K57m22J82OP6K2m51M55K68k07J53r33P68
7683G4J5j51P4J11Q3j04j18L8J79k30L9Q5K39k01j99l09O56j39j80l66O03J81
7705C80o4m71L44j93M5j20k26K41R5k76j2L89M06n75q7K20j62P0k7J54K5r0j54
7728h8J40K40m7R9l51qL73m24J64j48m0K07r6j60J01J95K9l62j4K90m3l11J52
7751a02R9J67j52m6K5J1M2M2p1O3Q5l81K33J64r1k41J26K49J34M2m14Ro2J14j47
7776a02m0L62k57l97J29N35l60j93Q1K68L37m82K15n35L84k98N71k67L43r1k54
7797e1J37j64M24m52p9M1L88k26l2j70N26M0n75K77J09l21J10k27L21K58k39M7
7819A42k89M10m00j12K27R1LP0j56M3L4Q4n5M0J6J63k23k72L46j59K65J01l68
$$ plain form
7842 1 354 55 -106 -93 224 40 -22 -338 33 56 188 254 -27 64 4 -131 -160 210 186 165 -76 228 75 201
7866 201 -185 -126 -56 78 -15 -107 137 152 64 -4 421 244 39 -151 -90 57 194 -15 24 -44 -243 -433 -182
7889 -182 -299 -29 -142 -257 -13 105 -261 -222 169 -3 -135 -301 -267 78 154 59 -164 -12 200 60 -173
7910 -173 190 303 135 186 97 605 265 -174 332 -85 135 -174 -101 4 -162 -82 -257 333 23 -25 -78 -376
7932 -376 -82 38 -81 -174 -3 161 210 -8 321 260 238 177 -49 238 124 -267 -70 174 150 47 -111 47
7954 47 249 -92 -312 13 -192 155 171 -301 -86 87 -103 -107 4 -92 -172 -162 -9 33 -39 -300 -7 200 167
7977 167 -262 367 173 329 167 -16 -76 435 121 -78 -69 53 177 -86 45 -221 -213 -149 -171 50 117 -37 230
8000 230 -202 117 248 -411 109 219 171 133 -304 90 216 -272 201 168 169 153 314 -227 112 201 -147 -210 -140
$$ packed form
7842AL53k99j61J3L17j84o2l16L71K3J32O6k81R1o0j35k9L70k4k1k41L04j53J26
7866B01l86N9P0J34r3r2K44J5q8o8M25j77k05j90O1J47J37k09L9o8j99j90K51
7889a82j17K70j13j15K44J18l66L9L91j72j32j66L4L45P6r5k23J52K12j40k33
7910a73L63J13j68N1q9N08l40m39N06m17K20l09P3J05j66Q0j75N90l10m8n3k98
7932c76K94J20j19r3J71J64M9k18L29o1k2o1k26K87j14l91J97K44k4j03j58J58
7954D7K02l41k20L25k05L47J6m72K15J73j90mJ11r6q0J0J53M2p2k61K93K07l3
7977A67m29O29j94J56j62j83o0N11l14j99RJ22J24k63J31k66QO4k2K21O7j54K67
8000B30m32L19J31o59N20J10m8l8m37L94J26m88M73l3Jj6J61n41L39Q9l48o3P0
$$ plain form
8023 -140 32 299 -249 -102 144 -199 -149 -95 295 191 -133 224 104 14 -45 -158 -272 237 -69 -5 144 196
8045 196 -42 -55 -269 242 304 171 -103 337 109 221 2 -121 271 142 -30 -24 21 62 201 -262 -273 66
8067 66 51 -95 -320 76 -155 -449 -219 -13 271 -204 -111 -236 286 -6 -197 -75 60 63 -37 -18 392 126
8089 126 -99 -62 -10 124 123 -19 -90 217 42 -390 151 0 233 -37 -328 102 27 -151 12 259 171 20
8111 20 -92 -227 -254 145 -388 -41 49 9 368 47 260 419 237 -154 51 113 15 -65 31 18 182 -92 -206
8134 -206 -107 312 -152 -104 -213 130 274 15 -91 176 221 64 -135 -83 71 -134 -263 136 330 -114 -78 41
8156 41 -159 155 44 -306 -53 203 -30 -10 44 60 77 -80 149 211 212 -152 -152 69 242 -84 -243 -65 323
8179 323 -217 -75 -220 -45 -2 -234 -377 35 81 -128 -183 31
$$ packed form
8023a40J72K67n48J47K46l43N0N4L90j04l24L57j20r0n9j13j14N09l06O4J49N2
8045A96k38j3k14N11O2j33k74M40k28J12k19j23L92j29j72OM5M1J39m63j1L39
8067F6j5j46k25L96k31k94K30K06K84m75R3j25N22k92j91J22J35Lj00J9M10k66
8089A26k25L7N2J34jj42p1L07j75m32N41j51K33k70k91M30p5j78J63K47q8j51
8111B0j12j35k7L99n33L47R0m0L59l21K13J59j82l91K05O2r8q0R6j3J64k74j14
8134b06R9M19m64M8j09L43J44k59j06K67M5j57j99N2J54k05j29L99J94m44L6J19
8156D1k00L14j11l50K53K56k33K0N4J6J7j57K29O2Jl64%K21J73l26j59J78L88
8179C23n40J42j45J75M3k32j43M12M6k09n5K14
8191C1
$$ Imaginary data points
##PAGE= N=2
##DATA TABLE= (X++(I..I)), XYDATA
$$ plain form
0 0 0 0 0 0 0 0 0 6 -8 8 -8 8 -8 14 -16 16 -23 24 -31 36 -40 48 -55 62 -72 84 -94 107 -120 136 -153 172
32 172 -191 214 -237 265 -296 326 -363 401 -444 492 -543 604 -670 742 -826 923 -1036 1167
50 1167 -1325 1516 -1755 2065 -2481 3073 -3976 5512 -8620 17304 -87903 -308043 1561
63 1561 189164 -31564 -150195 65040 142511 -36212 -109433 10233 55664 -5408 -37855
74 -37855 -18274 11504 41234 15488 -45189 -37001 30151 28182 -19518 -5395 42982 30215 -19259
87 -19259 -30755 1396 27021 8791 -25330 -10446 26884 387 -48436 -5454 64480 30400
99 30400 -37477 -20319 13680 -15940 -33081 -807 9848 -1583 9684 8832 -11748 6361 20527
112 20527 -31469 -48334 35138 66396 -19313 -47403 27121 31354 -41953 -29157 42507 30795
$$ packed form
0@%%%%%%%Oj4J6j6J6j6K2l0L2l9M7n5O7p6Q8j03J17j34J56j78K01k27K56k89L25
32A72l63M05m51N02n61O22o89P64q45R36j035J147j274J412j568J749j959K203
50A167k492K841l271L820m546N554p049R488j4132K5924j05207k20140L09604
63A561J87603k20728j18631K15235P7471j78723p3221J19666M5431o1072l2447
74c7855J9581K9778K9730k5746o0677Q188O7152j969m7700J4123M8377j2767m9474
87a9259j1496L2151K5625j8230l4121J4884L7330k6497m8823M2982O9934l4080
99C0400o7877J7158L3999k9620j7141L2274J0655j1431J1267q52k0580J8109J4166
112B0527n1996j6865Q3472L1258q5709k8090P4524M233p3307J2796P1664j1712
$$ plain form
124 30795 -17973 -805 24931 1704 -12896 -3354 -13488 -15810 14163 16464 -18174 -13266 26398
137 26398 18461 -23801 -22062 10815 10466 -17426 -20659 6555 17327 -7615 -20097 12271 31065
150 31065 -7640 -31222 11218 34636 -10655 -28897 17164 26619 -18790 -20073 21464 17343 -13001
163 -13001 -2758 16186 5752 -365 3452 -12966 -17742 7662 8421 -22474 -14775 21840 13898
176 13898 -13760 131 15968 -8765 -22857 -2849 4091 -6528 1888 7960 -6974 -4371 19079
189 19079 10210 -16890 -3801 23165 9884 -14775 -4051 13488 2662 -14784 -8880 9212
201 9212 15580 3822 -6430 4436 13227 -5540 -23324 -6554 12220 -305 -15715 -7756 929
214 929 1612 5409 3991 -3883 3368 9176 -11945 -22312 7583 19913 -12656 -19407 20072 27066
$$ packed form
124C0795m8768J7168K5736k3227j4600R542j0134k322K9973K301l4638M908L9664
137B6398p937m2262J739L2877l49k7892l233K7214J0772k4942j2482L2368J8794
150C1065l8705k3582M2440K3418m5291j8242M6061R455m5409j283M1537m121l0344
163a3001J0243J8944j0434o117L817j6418m776K5404P59l0895P699L6615p942
176A3898k7658J3891J5837k4733j4092K0008O940j0619Q416O072j4934K603K3450
189A9079q869k7100J3089K6966j3281k4659J0724J7539j0826j7446N904J8092
201I212O368j1758j0252J0866Q791j8767j7784J6770J8774j2525j5410P959Q685
214I29O83L797j418p874P251N808k1121j0367K9895J2330l2569o751L9479O994
$$ plain form
228 27066 -9211 -14412 11807 11308 -5954 1146 12234 4135 -3332 -5492 -12756 -8570 9506 8595
242 8595 -4361 4512 15178 -3031 -19495 -7351 3518 -6023 -10353 -1524 2046 203 649 -1347
256 -1347 972 8732 4410 -7737 -1269 10996 611 -13596 -2256 11185 6642 1347 4139 2347
270 2347 1982 3698 -4299 -5633 14364 16164 -14807 -22709 4737 4871 -20491 -7796 24819 13931
284 13931 -13542 -4838 6066 -10019 -15178 -304 -548 -5515 7329 10686 -4220 -2000 11591
297 11591 793 -11361 5855 16461 -594 -7517 4986 3124 -7631 -473 8870 4786 2344
310 2344 2638 -5283 -5953 5537 3812 -8457 -4564 2286 -8787 -13706 913 7016 -492 1665 5943
325 5943 -1343 -3111 1230 -8398 -14090 2704 12185 -721 92 15363 6297 -10885 -911 11211
$$ packed form
228B7066l6277n201K6219m99j7262P100J1088q099p467k160p264M186J8076r11
242H595j2956Q873J0666j8209j6464J2144J0869r541m330Q829L570j843M46j996
256a347K319P760m322j2147O468J2265j0385j4207J1340J3441m543n295K792j792
270B347l65J716p997j334J9997J800l0971p902K7446J34k5362J2695L2615j0888
284A3931k7473Q704J0904j6085n159J4874k44m967J2844L357j4906K220J3591
297A1591j0798j2154J7216J0606j7055o923J2503j862j0755P158R343m084k442
310B344K94p921o70J1490j725j2269L893O850j1073m919J4619O103p508K157M278
325E943p286j768M341r628n692J6794R481j2906Q13J5271r066j7182R974J2122
$$ plain form
339 11211 -1624 -4736 10098 4567 -10410 -355 9830 -6122 -10773 8728 7539 -11071 -3658
352 -3658 13070 1382 -12135 -3253 -549 -12477 -8680 5222 3074 -1329 5315 5959 -433 1176
366 1176 -18 -8314 -5230 4944 2238 -1156 9141 9461 -5668 -4274 9723 5058 -4193 3334
380 3334 5601 -6600 -3974 5969 -3522 -11843 3740 9131 -7601 -7775 8086 2613 -9577 164
394 164 6339 -6714 -9382 -262 -6375 -9420 8354 13491 -3677 -237 16503 2797 -19298 -4818
408 -4818 12119 -1862 -8343 11320 14712 -3381 -5488 3504 -520 -3703 4200 5486 817 4128
422 4128 -758 -16194 -13427 4987 5254 -5338 1167 9481 -1456 -9887 -2090 2674 -978 -3432
436 -3432 -4999 -3797 6474 7806 -6401 -6880 11404 12098 -4709 -687 12498 495 -14991 -3788
$$ packed form
339A1211j2835l112J4834n531j4977J0055J0185j5952m651J9501j189j8610P413
352c658J6728j1688j3517Q882K704j1928L797J3902k148m403O644O44o392J609
366A176j194q296L084J0174k706l394J0297L20j5129J394J3997m665r251P527
380C334K267j2201K626R943r491q321J5583N391j6732j74J5861n473j2190R741
394A64O175j3053k668R120o113l045J7774N137j7168L440J6740j3706k2095J4480
408d818J6937j3981o481J9663L392j8093k107Q992m024l183P903J286m669L311
422D128m886j5436K767J8414K67j0592O505Q314j0937q431P797M764l652k454
436c432j567J202J0271J332j4207m79J8284O94j6807M022J3185j2003j5486J1203
$$ plain form
450 -3788 8706 3505 3795 7222 -3342 -9121 2772 1921 -9388 1518 16015 -1788 -19890 -3232
464 -3232 8318 -10440 -14695 6844 10068 -3758 -32 8652 -158 -8322 -4357 -4981 -2659 11344
478 11344 13005 -4404 -7052 7091 5325 -5766 2393 13103 2744 -8905 -4296 3923 4325 276
492 276 -6094 -5491 4893 4682 -8244 -5637 9513 2003 -15536 -5746 10363 -843 -12994 -2192
506 -2192 3369 -4372 1011 10526 3122 -2558 5640 -524 -13144 986 17092 -32 -12166 8970
520 8970 15874 -7572 -8725 14238 9115 -13739 -7906 9437 3969 -5787 -1884 -2078 -6616 -837
534 -837 2696 -4191 -2208 6792 486 -10425 -2604 7158 -232 -10161 -5668 3062 6009 4162 640
549 640 2760 7486 1326 -9519 -1996 11483 4336 -8052 -183 8594 -576 -4152 4610 3388 -4061
$$ packed form
450c788J2494n201K90L427j0564n779J1893q51j1309J0906J4497j7803j8102J6658
464c232J1550j8758m255K1539L224j3826L726Q684q810q164L965o24K322J4003
478A1344J661j7409k648J4143j766j1091Q159J0710j0359j1649M609Q219M02m049
492B76o370O03J0384k11j2926K607J5150p510j7539R790J6109j1206j2151J0802
506b192N561p741N383R515p404n680Q198o164j2620J4130J6106j7124j2134K1136
520H970O904k3446j153K2963n123k2854N833J7343n468r756L903j94m538N779
534h37L533o887J983R000o306j0911P821R762p390r929M493Q730K947j847l522
549F40K120M726o160j0845P523J3479p147j2388P869Q777r170l576Q762j222p449
$$ plain form
564 -4061 -88 2418 -5796 -3469 5337 -3087 -13008 1223 10519 -6908 -13369 6547 9435 -9141
578 -9141 -6233 12913 7205 -10147 -7146 3076 -399 -1690 3968 4881 4077 7205 2779 -6675 -2037
593 -2037 6758 568 -6519 1880 8731 1177 -7416 -4305 1374 2265 -740 -2976 372 4651 -2571
608 -2571 -11662 -4482 5934 221 -7002 -155 4530 -1672 -2514 3099 1373 -322 4738 1663 -5424
623 -5424 -28 6186 -3097 -7029 9287 14427 -1755 -5799 6117 2243 -11066 -4632 8944 4269
637 4269 -3704 -639 -622 -5234 -2151 1600 -3653 -2709 6373 3416 -8500 -5657 4167 -478 -9386 -2406
653 -2406 9284 6338 -2498 -3192 2791 4428 -216 -3199 2445 7404 771 -6150 -121 5986 1679
668 1679 -945 3358 3077 -1603 -1510 -1823 -4918 -1149 4526 -1221 -6843 1503 5017 -7766 -10239 4650
$$ packed form
564d061L973K506q214K327Q806q424r921J4231R296j7427o461J9916K888j8576
578i141K908J9146n708j7352L001J0222l475j291N658R13q04L128m426r454M638
593b037Q795o190p087Q399O851p554q593L111N679Q91l005k236L348M279p222
608b571r091P180J0416n713p223O847M685o202q42N613j726j695N060l075p087
623e424N396O214r283l932J6316N140j6182m044J1916l874j3309O434J3576m675
637D269p973L065J7m612L083L751n253R44R082k957j1916K843R824m645q908O980
653b406J1690k946q836o94N983J637m644k983N644M959o633o921O029O107m307
668A679k624M303k81m680R3l13l095L769N675n747n622Q346L514j2783k473J4889
$$ plain form
684 4650 5790 -6037 -2727 8229 1373 -9153 -3417 3146 27 1618 6810 2082 -222 5594
698 5594 2988 -6536 -1257 9118 2888 -6948 776 8512 -131 -7338 -1102 4254 969 -2898 -3247
713 -3247 -1382 2255 -1275 -7649 -3941 4095 553 -5953 -667 4505 -349 -3834 855 1993 1336
728 1336 2996 -283 -4593 2473 8626 -1121 -5549 8159 10396 -6548 -6527 9722 6400 -9923 -5082
743 -5082 7438 1185 -6240 238 2542 -3379 -1721 333 -6211 -3351 6374 776 -10262 -2068 8913
758 8913 -1500 -10074 1179 7929 -505 -3599 3134 5338 2452 -280 -3840 -1560 6535 5342 -3255
773 -3255 -708 7781 1573 -6776 -1016 5237 216 -2434 -183 -1441 -2022 1430 -2955 -7302 1751
788 1751 6551 -5048 -7871 5173 4695 -9262 -5276 7584 2727 -5791 1931 5814 -2749 -2675 4721
$$ packed form
684D650J140j1827L310J0956o856j0526N736O563l119J591N192m728k304N816
698E594k606r524N279J0375o230r836P724P736q643p207O236N356l285l867l49
713c247J865L637l530o374L708Q036l542o506N286N172m854l485M689J138o57
728A336J660l279m310P066O153r747m428J3708K237j6944K1J6249l322j6323M841
743e082J2520o253p425O478K304n921J658K054o544K860R725n598j1038Q194J0981
758H913j0413q574J1253O750q434l094O733K204k886k732l560K280Q095j193q597
773c255K547Q489o208q349N760O253n021k650K251j258n81L452m385m347R053
788A751M800j1599k823J3044m78j3957L986J2860m857q518P722L883q563P4P396
$$ plain form
803 4721 255 -636 8146 5193 -8186 -2301 10418 173 -10373 3008 11681 -1797 -8088 2566
817 2566 3899 -5454 -4764 1161 1209 503 -133 -5720 -5534 3238 1952 -5868 -1602 6286 291 -5292 1480
834 1480 2829 -2822 -886 4303 971 633 5314 233 -6012 3518 8523 -2262 -4337 8099 4712
849 4712 -9492 -4066 7871 1195 -6894 1490 4666 -4259 -3688 1241 -2749 -3400 4609 11 -9657
864 -9657 -676 9654 -2289 -10964 2008 8058 -3082 -4110 6941 4451 -4751 -1566 3602 2099
878 2099 3702 4831 -3018 -5333 4884 6602 -2733 -2258 4908 750 -6017 -1041 3958 116 -3567
893 -3567 -2830 -1929 919 2115 -4901 -6210 2574 3278 -7363 -4283 8176 3899 -8462 -2304 6965
908 6965 103 -3752 4158 5310 -1709 -386 2963 -997 1572 8507 1249 -9604 -488 9404 -27
$$ packed form
803D721m466q91Q782k953j3379N885J2719j0245j0546J3381Q673j3478o291J0654
817B566J333r353O90N925M8p06o36n587J86Q772j286p820M266P888n995n583O772
834A480J349n651J936N189l332l38M681n081o245R530N005j0785k075J2436l387
849D712j4204N426J1937o676q089Q384L176q925N71M929l990o51Q009m598r668
864i657Q981J0330j1943q675J2972O050j1140j028J1051k490r202L185N168j503
878B099J603J129p849k315J0217J718r335M75P166m158o767M976M999l842l683
893c567P37R01K848J196p016j309Q784P04j0641L080J2459m277j2361O158R269
908F965o862l855P910J152p019J323L349l960K569O935p258j0853R116R892r431
$$ plain form
923 -27 -6918 2813 4802 -6048 -5489 4290 2632 -4490 -3841 -2532 -2160 2845 3386 -5190 -6346 2447
939 2447 2072 -4056 338 6635 220 -4986 851 4177 1218 407 1293 -460 1989 4275 -957 -2697
955 -2697 4803 4051 -5422 -3315 6147 2367 -6303 -1307 2903 -3392 -5100 2196 1636 -3127 -658 -1079
971 -1079 -6374 -555 7877 235 -8809 -475 6956 -2157 -4661 6260 6071 -4124 -2741 5548 3920
986 3920 -102 794 -526 -1445 3627 4622 -2631 -2744 3182 361 -4393 114 4424 -1030 -5030 -1737
1002 -1737 -414 -1794 -914 -1223 -2029 1700 873 -4395 -2815 4726 1372 -5887 -599 6447 718 -3563
1018 -3563 2996 3572 -2185 -705 4057 2188 1247 4252 -145 -5899 1199 7050 -1774 -6540 2511
1033 2511 4168 -4566 -3784 3963 1309 -5284 -2470 966 -901 -1157 -185 -3360 -2559 3351 2424 -2963
$$ packed form
923b7o891R731J989j0850N59R779j658p122O49J309L72N005N41q576j156Q793
939B447l75o128M394O297o415n206N837L326k959q11Q86j753K449K286n232j740
955b697P500p52r473K107R462l780q670M996M210o295j708P296n60m763K469m21
971a079n295N819Q432p642r044Q334P431r113k504J0921j89j0195J383Q289j628
986C920m022Q96j320r19N072R95p253j13N926k821m754M507M310n454m000L293
1002a737J323j380Q80l09q06L729q27n268J580P541l354p259N288P046n729m281
1018c563O559N76n757J480M762j869r41L005m397n754P098N851q824m766R051
1033B511J657q734P82P747k654o593K814L436j867k56R72l175Q01N910r27n387
$$ plain form
1049 -2963 -626 3707 166 -3205 1387 3658 722 310 1677 736 786 1171 -1019 295 5003 2228
1065 2228 -4218 -910 4574 -620 -6095 -642 2576 -2643 -2539 2829 717 -3355 -908 -939 -4245 151
1081 151 4487 -2365 -6691 2310 6318 -2759 -4880 4517 4505 -2978 -1029 5094 2357 -852 812 926
1097 926 -254 2004 2186 -2271 -148 4557 1184 -3792 -888 2554 -1091 -4172 -1888 -177 -1249
1112 -1249 -1580 -1021 -580 1681 -320 -4667 -1275 3823 69 -5075 40 5027 -110 -2609 2597 3539
1128 3539 -788 160 2498 684 1953 4613 -300 -3813 2078 4723 -4661 -5485 4903 5908 -4550
1143 -4550 -4041 3797 1115 -5293 -3007 -157 -2147 -1753 233 -1757 -1764 2409 262 -3899 -256 4911
1159 4911 621 -3241 815 3753 173 -1495 1576 2660 2346 1063 -660 842 4751 1503 -3563
$$ packed form
1049b963K337M333l541l371M592K271k936m12J367r41N0L85k190J314M708k775
1065B228o446L308N484n194n475N453L218n219J04N368k112m072K447l1l306M396
1081A51M336o852m326R001M008r077k121R397j2p483J949O123k737l209J664J14
1097I26j180K258J82m457K123M705l373m976K904L442l645l081K284J711j072
1112a249l31N59M41K261k001m347L392N098l754n144N115M987n137k499N206R42
1128C539m327R48K338j814J269K660m913l513N891K645r384q24J0388J005j0458
1143d550N09P838k682o408K286K850j990L94J986j990pM173k147m161L643N167
1159D911m290l862M056K938l580j668L071J084l14j283j723J502L909l248n066
$$ plain form
1174 -3563 -101 4354 -2217 -6853 251 3622 -2744 -4377 1904 1894 -2210 -1004 -1129 -4653 -1509 2870
1190 2870 -1773 -3942 4195 5591 -5171 -4549 6970 5253 -4542 -1439 6783 2397 -2920 680 2462
1205 2462 -420 317 1808 -662 -14 3932 919 -4329 -523 3272 -2686 -5569 91 2223 -2965
1220 -2965 -3057 630 891 348 -307 -2302 -1897 1469 131 -3836 527 5228 -43 -3980 2418 5823
1236 5823 -396 -2362 2326 2707 1144 1855 -206 -2610 707 3171 -3188 -3469 5140 3917 -5946 -3482
1252 -3482 5639 1204 -7706 -3246 2423 -1827 -3684 1202 740 -2009 1317 2293 -2501 -1006 4004
1267 4004 -40 -4648 1308 5793 -385 -2780 2659 3848 -691 -722 1865 2224 1297 252 -1695 -1020
1283 -1020 1416 -1118 -4456 -294 3633 -1833 -4103 2305 3964 -2305 -3905 -1525 -1556 -1471 685 -1101
$$ packed form
1174c563L462M455o571m636P104L371o366j633O281j0m104J206j25l524L144M379
1190B870m643k169Q137J396j0762O22J1519j717r795L103Q222m386n317L600J782
1205B462k882P37J491k470O48L946l013n248L806L795n958k883N660K132n188
1220b965r2L687K61n43o55j995M05L366j338l967M363M701n271l937O398L405
1236E823o219j966M688L81j563P11k061k404L317K464o359k81Q609j223r863K464
1252c482R121m435q910M460N669m250j857M886m62k749L326R76m794J495N010
1267D004m044m608N956M485o178k395N439J189m539l1K587L59r27j045j947O75
1283a020K436k534l338M162L927n466k270O408J659o269j600K380l1Q5K156j786
$$ plain form
1299 -1101 -2404 1925 3179 -2367 -1448 6107 3141 -6115 -2037 6397 2543 -3674 321 3445 -549
1314 -549 -625 2941 847 -609 2863 1111 -3733 -579 3593 -2215 -6976 -288 3307 -2363 -3673 2579
1330 2579 3518 -2289 -3743 -513 76 -793 -983 -1670 -244 2697 766 -1092 2494 4310 -592 -3123
1346 -3123 1632 4359 1668 -857 -1038 -155 1158 1286 -1225 -728 2803 1107 -3966 -1701 4566 225
1362 225 -7385 -4110 2050 -608 -3643 -50 2287 -17 -540 303 -1158 -401 1667 -690 -3360 1523
1378 1523 4451 189 -1807 3504 4413 -1327 -2180 2978 3969 -256 -1617 -352 -30 581 -634 -1883
1394 -1883 -430 1262 -959 -2520 964 2589 -1683 -5010 -3120 -364 -253 -1128 -1312 112 2410 1541
1410 1541 -1000 -52 3412 1103 -4245 -950 4708 2276 -2302 351 3771 758 -1381 1479 2574
$$ packed form
1299a101j303M329J254n546R19P555k966r256M078Q434l854o217L995L124l994
1314e49p6L566k094j456L472j752m844L154M172n808m761O688L595n670j310O252
1330B579R39n807j454L230N89q69j90o87J426K941j931j858L586J816m902k531
1346c123M755K727k691k525j81Q83J313J28k511M97L531j696n073K265O267m341
1362B25p610L275O160k658l035L593K337k304n23Q43j461P57K068k357k670M883
1378A523K928m262j996N311R09n740q53N158R91m225j361J265L22O11j215j249
1394a883J453J692k221j561L484J625m272l327J890K756J11q75j84J424K298q69
1410A541k541R48L464k309n348L295N658k432m578K653L420l013k139K860J095
$$ plain form
1425 2574 282 171 311 -1914 -1050 978 -2220 -4583 -480 1568 -2071 -2206 2520 2670 -3168 -3776
1441 -3776 -159 380 -1826 -1796 16 1337 1568 1309 995 2385 2601 -852 -2601 1196 3522 836 -1719
1458 -1719 5 1966 1142 -339 -682 626 2021 -153 -3172 -960 2500 -679 -5726 -2708 1367
1473 1367 -822 -2473 784 2677 77 -1289 -528 -813 -139 575 -1408 -2564 1090 3885 915 -314
1489 -314 3740 3133 -1802 -1795 2738 3064 -1575 -1973 515 864 -23 -1051 -853 453 1448 -1109 -1710 1522
1507 1522 1938 -2788 -5122 -1320 274 -1561 -1558 199 1493 2075 888 -1206 20 3033 147 -4047
1523 -4047 -904 4603 1438 -2127 1491 4791 780 -1881 1480 2120 -233 -180 325 -1826 -686 1386
1539 1386 -1811 -3763 290 2019 -2428 -2598 2585 2224 -3535 -3795 317 -95 -2355 -1441 915 1533
$$ packed form
1425B574k292j11J40k225Q64K028l198k363M103K048l639j35M726J50n838o08
1441c776L617N39k206L0J812J321K31k59l14J390K16l453j749L797K326k686k555
1458a719J724J961q24j481l43J308J395k174l019K212L460l179n047L018M075
1473A367k189j651L257J893k600j366P61k85O74P14j983j156L654K795k970j229
1489c14M054o07m935PM533L26m639l98K488L49q87j028J98J306R95k557o01L232
1507A522M16m726k334L802J594j835LJ757J294N82j187k094J226L013k886m194
1523d047L143N507l165l565L618L300m011k661L361O40k353N3N05k151J140K072
1539A386l197j952M053J729m447j70N183l61n759k60M112m12k260R14K356O18
$$ plain form
1555 1533 1391 1176 723 1990 2265 -1343 -2524 1403 2604 -377 -684 2050 2446 156 -298 219 519
1572 519 1231 -354 -3136 -1144 1831 -1292 -4925 -1378 2384 -1463 -3689 1116 3551 -914 -2073
1587 -2073 255 -272 -1587 -647 -295 -1065 1744 3162 156 -266 4145 3381 -2524 -2047 2926 1550 -2268
1604 -2268 -954 2753 1228 -1501 -1029 838 865 -119 -1539 -2164 260 565 -2480 -3921 -350 765
1620 765 -1880 -1583 1796 2340 546 -177 -719 239 1405 -374 -3340 -229 4643 1453 -1563 2934
1636 2934 5512 -65 -2954 1186 2241 -1977 -2085 574 -512 -1121 778 -345 -2405 654 2189
1651 2189 -2359 -3330 2378 1909 -4605 -3869 2164 652 -3877 -711 3694 1943 -352 1275 1307 1126
1667 1126 973 -698 -2167 249 2830 213 -1175 2837 4040 -302 -1775 1012 1604 -790 -2164
$$ packed form
1555A533j42k15m53J267K75l608j181L927J201k981l07K734L96k290m54N17L00
1572E19P12j585k782J992K975l123l633L547L762l847k226M805K435m465j159
1587b073K328n27j315R40L52p70K809J418l006m22M411p64n905M77M973j376l818
1604b268J314L707j525k729M72J867K7r84j420o25K424L05l045j441L571J115
1620G65k645K97L379N44j794p23n42R58J166j779k966L111M872l190l016M497
1636B934K578n577k889M140J055m218j08K659j086o09J899j123k060L059J535
1651B189m548r71N708m69o514P36O033j512m529L166M405j751k295J627L2j81
1667A126j53j671j469K416K581k617j388M012J203m342j473K787N92k394j374
$$ plain form
1682 -2164 -1885 -571 981 -1132 -3499 -609 2285 -844 -3255 884 3489 -1223 -3449 177 978
1697 978 -1879 -1451 520 440 1493 3490 1302 -338 2883 2896 -2867 -2923 3117 2047 -3875 -1327 4486
1714 4486 1681 -2546 -810 2038 -157 -2108 -1042 -787 -238 135 -1892 -3749 124 1700 -1654 -2415
1730 -2415 2350 3289 -697 -1928 814 1175 -693 -1675 -1349 722 3137 1864 -210 2352 4030 -232
1746 -232 -3168 877 2835 -1736 -3039 1051 1213 -312 318 417 -1376 -551 456 -1851 -1918 1895 769
1763 769 -4713 -2856 2571 332 -4145 -176 4251 893 -2012 1704 2854 -667 -1314 -334 -400 573
1779 573 2369 1107 232 2435 3155 -883 -2021 1637 1591 -2662 -2991 141 1530 -303 -1325 -1275 -22
1796 -22 142 -1456 -1518 1313 1144 -2725 -3161 825 966 -1946 -1111 1341 1248 694 2059 2043 1219 1283 219
$$ packed form
1682b164K79J314J552k113k367K890K894l129k411M139K605m712k226L626Q01
1697I78k857M28J971q0J053J997k188j640L221J3n763n6O040j070n922K548N813
1714D486k805m227J736K848k195j951J066K55N49L73k027j857L873J576l354p61
1730b415M765R39l986j231K742L61j868r82L26K071K415j273k074K562J678m262
1746b32k936M045J958m571j303M090J62j525O30R9j793Q25J007k307o7L813j126
1763G69n482J857N427k239m477L969M427l358k905L716J150l521o47R80o6R73
1779E73J796j262q75K203P20m038j138L658m6m253l29L132J389j833j022N0J253
1796b2J64j598o2K831j69l869m36L986J41k912Q35K452r3n54J365j6q24O4j064
$$ plain form
1815 219 -1867 -985 2767 1100 -2565 822 4243 552 -2129 812 2185 -1702 -3323 -941 177
1830 177 -794 -1106 -1118 -1386 -453 305 -1356 -1306 1851 1716 -2416 -2259 1775 1742 -1327 -2046 456 2224 1908
1849 1908 899 1304 2551 2311 -1437 -1910 1308 1686 -1804 -1950 1149 1956 72 -222 176 -943 -1077
1866 -1077 -529 -2041 -1860 1212 -70 -3834 -1442 2655 672 -2670 134 3461 550 -1594 700
1881 700 2177 186 -832 -200 -315 1012 2879 1162 -43 2324 3006 -987 -2282 1015 1010 -2531 -3003
1898 -3003 739 1892 -281 -1012 -338 478 -412 -1804 -1624 297 412 -1846 -2048 532 1136 -822 -670
1915 -670 864 1225 1127 1329 651 509 1582 169 -2360 -877 2851 1043 -1711 1534 3851 -185 -2798
1932 -2798 519 1489 -2006 -3007 -586 76 -900 -170 -269 -700 -3 456 -1756 -1795 1657 981 -2526 -1458
$$ packed form
1815B19k086Q82L752j667l665L387L421l691k681K941J373l887j621K382J118
1830A77r71l12j2k68R33P58j661N0L157j35m132J57M034l3l069p19K502J768l16
1849A908j009M05J247k40l748m73L218L78l490j46L099Q07j884k94L98j119j34
1866a077N48j512J81L072j282l764K392M097j983l342K804L327k911k144K294
1881G00J477j991j018O32j15J327J867j717j205K367O82l993j295L297nl541m72
1898c003L742J153k173p31O74Q16q90j392J80J921J15k258k02K580O04j958J52
1915f70J534L61r8K02o78j42J073j413k529J483L728j808k754L245K317m036k613
1932b798L317R70l495j001K421O62r76P30r9m31O97M59k212l9L452o76l507J068
$$ plain form
1950 -1458 2380 981 -1653 -482 2022 1181 1185 945 988 1857 1489 -1547 -2176 1066 1681 -1579 -1527 2233
1968 2233 1900 -1195 -1036 978 -307 -1936 -1845 -1934 -936 767 -577 -2627 -130 2396 -1017 -3219 1552
1985 1552 3522 -1886 -3047 2066 2859 -1284 -1360 1497 843 169 1784 1386 1084 2240 1263 -2150 -1723
2002 -1723 1795 461 -3207 -1143 2487 746 -1240 -596 741 -404 -1287 -2251 -1800 155 463 -1445
2018 -1445 -1543 1577 1232 -1673 -557 2162 1106 -431 452 1472 1012 760 -71 -890 -143 2601 1075
2035 1075 -1254 1721 3938 -878 -3383 734 1885 -2643 -3314 236 781 -756 -686 260 -127 79 -237
2052 -237 -1899 -1629 1664 571 -2947 -1024 2686 855 -1780 59 2635 1033 -220 902 1254 1176
2068 1176 630 -877 -1399 1061 1315 -1458 -826 2345 1859 -1228 -1115 1046 -625 -2673 -1622 -1021 -743
$$ packed form
1950a458L838j399k634J171K504q41Mk40M3Q69l68l036o29L242O15l260N2L760
1968B233l33l095J59K014j285j629R1q9R98J703j344k050K497K526l413k202M771
1985A552J970n408j161N113P93m143p6K857o54o74J615l98l02J156r77l413M27
2002a723L518j334l668K064L630j741j986O44J337j145q83r64M51J955L08j908
2018a445r8L120l45k905J116K719j056j537Q83J020m60k52q31q19P47K744j526
2035A075k329K975K217m816k505M117J151m528o71L550N45j537P0R46l87K06l16
2052b37j662K70L293j093l518J923L710j831k635J839K576j602j253J122L52p8
2068A176n46j507n22K460K54k773O32L171m86l087J13K161j671k048J051O01K78
$$ plain form
2085 -743 111 -344 -1375 -30 2020 -732 -2541 812 2635 -1290 -2279 1535 2792 -802 -939 1281
2101 1281 1559 358 798 1381 427 1321 1115 -1555 -1940 1605 827 -3010 -1653 2306 1485 -1909 -1290
2118 -1290 1104 -133 -2559 -2120 -125 448 -284 -1586 -536 1621 1204 -1483 -903 1391 1116 -736
2134 -736 -239 1622 1238 -76 -441 692 1272 1360 179 -475 1428 1968 -1467 -2188 788 1056 -2584 -2551
2152 -2551 1042 1137 -1479 -1203 770 35 -1378 -968 -983 -1076 284 215 -1858 -366 2822 1377 -1757 -54
2170 -54 2823 837 -1713 796 2467 911 -914 -625 1235 1214 162 -1006 5 1648 502 -1409
2186 -1409 -849 952 -503 -2678 -1469 501 133 -1174 -1015 235 569 193 -1705 -1668 1179 1574 -1934
2203 -1934 -1695 2406 2110 -1543 -1530 2277 2140 -758 -227 2060 1339 -36 -24 -604 184 1139 86 -2343
$$ packed form
2085g43Q54m55j031J345K050k752j809L353J823l925r89L814J257l594j37K220
2101A281K78j201M40N83r54Q94k06k670l85L545p78l837J357L959q21l394O19
2118a290K394j237k426M39J995N73p32j302J050K157m17k687N80K294k75j852
2134g36M97J861l84j314l65J133N80Q8j181o54J903N40l435p21K976K68l640L3
2152b551L593R5k616K76J973p35j413M10j5r3J360o9k073J492L188j445l134J703
2170e4K877j986k550K509J671j556j825K89J860k1j052j168J011J643j146j911
2186a409N60J801j455k175J209J970l68j307J59J250L34l76j898L7K847L95l508
2203a934K39M101k96l653J3L807j37k898N31K287p21j375J2n80P88R55j053k429
$$ plain form
2221 -2343 -376 2435 574 -2511 -776 1626 -933 -3096 -1045 1152 -305 -1976 -818 725 841
2236 841 81 -1111 -8 1189 839 -825 395 1735 1491 -184 68 976 1422 348 -205 19 1723
2253 1723 1019 -1663 -1306 1491 892 -2431 -1701 1223 1026 -1822 -836 769 -541 -1811 -1155 -430 -378
2270 -378 14 135 -1312 457 2357 368 -1774 156 2489 630 -1141 1024 2519 573 -955 327
2286 327 1475 747 -376 -141 486 934 204 -1402 -349 499 -744 -2006 -1145 231 -269 -584 -592 102
2304 102 145 -239 -1694 -636 1096 417 -1803 -701 2503 1727 -1012 -181 1963 899 -860 263 1749
2321 1749 1146 160 130 -281 384 1171 -532 -1956 209 1616 -708 -2437 -80 1680 -1338 -2614 -572
2338 -572 1029 -530 -1346 144 925 283 -786 -405 366 1183 -340 -662 591 1897 1074 -89 -58 865
$$ packed form
2221b343J967K811j861l085J735K402k559k163K051K197j457j671J158J543J16
2236H41p60j192J103J197l50j664J220J340k44j675K52R08M46j074n53K24J704
2253A723p04k682L57K797n99l323P30K924j97k848R86J605j310j270O56P25N2
2270c78L92J21j447J769J900j989k142J930K333j859j771K165J495j946j528J282
2286C27J148p28j123K35O27M48p30j606J053Q48j243j262Q61J376n00l15qO94
2304A02M3l84j455J058J732o79k220J102L204p76k739Q31K144j064j759J123J486
2321A749o03r86l0m11O65P87j703j424K165J407k324j729K357J760l018j276K042
2338e72J601j559q16J490P81o42j069L81P71Q17j523l22J253J306q23j163L1R23
$$ plain form
2356 865 1416 -338 -138 797 1230 -137 -1235 -387 1698 129 -2652 -875 1665 -134 -2253 -535
2372 -535 1090 -489 -1978 -807 -200 141 124 -334 -1042 863 1843 28 -1495 1012 2269 -460 -1663
2389 -1663 1567 2886 17 -1028 1233 1454 -122 -795 502 741 257 -381 -820 -29 834 -349 -1846
2406 -1846 -984 771 16 -1668 -823 710 26 -1447 -952 380 1009 -108 -1557 30 1774 995 -1197
2423 -1197 -105 2281 701 -1329 298 2096 982 -425 -18 274 404 274 -250 -1380 -147 923
2439 923 -1073 -2188 734 1626 -1605 -2792 425 1400 -1218 -2094 470 577 -826 -892 539 984 660
2456 660 89 -620 579 1646 781 -854 173 1922 565 -536 417 1836 827 -566 -911 691
2472 691 1087 -207 -2029 -497 1004 -329 -1662 -722 1059 -255 -2168 -855 501 79 -916 -297
$$ packed form
2356H65N51j754K00R35M33j367j098Q48K085j569k781J777K540j799k119J718
2372e35J625j579j489J171O07L41j7m58p08J905R80j815j523K507J257k729j203
2389a663L230J319k869j045K261K21j576o73J297K39m84o38m39P91Q63j183j497
2406a846Q62J755p55j684Q45J533o84j473M95J332O29j117j449J587J744p79k192
2423a197J092K386j580k030J627J798j114j407M07K92J30j30n24j130J233J070
2439I23j996j115K922Q92l231j187L217R75k618q76K564J07j403o6J431M45l24
2456F60n71p09J199J067q65j635J027J749j357j101R53J419j009j393l45J602
2472F91L96j294j822J532J501j333j333R40J781j314j913J313J356m22r95O19
$$ plain form
2488 -297 -218 57 894 -96 -303 1111 2143 -390 -1080 2009 2864 -650 -1181 1758 1481 -532 -566 1081
2506 1081 844 -254 -526 -392 -8 453 -666 -1828 -1163 547 -268 -1951 -819 751 105 -1728 -432
2523 -432 1343 453 -834 -674 333 1461 319 -754 287 2046 929 -596 297 2222 1082 -569
2539 -569 -378 764 361 -102 -769 -241 379 347 -902 -1273 292 741 -1679 -2407 539 1438 -1753 -1951
2557 -1951 513 1063 -1229 -1065 740 1056 130 121 75 540 1206 374 -820 679 1888 724 -828 279
2575 279 2222 595 -1195 -663 1088 513 -1204 -1460 186 577 -1050 -1534 66 593 -484 -1624 -479
2592 -479 683 -107 -1393 -922 324 621 -10 -280 76 1623 1157 -472 -265 1535 1628 -1143 -1196 1695
2610 1695 1813 -782 -762 1572 1300 -730 -671 308 316 -713 -749 -1316 -489 539 -578 -1861 -430 1386
$$ packed form
2488b97P9K75Q37r90k07J414J032k533o90L089Q55l514n31K939k77k013l4J647
2506A081k37j098k72J34L84M61j119j162O65J710q15j683J132J570o46j833J296
2523d32J775q90j287J60J007J128j142j073J041J759j117j525Q93J925j140j651
2539e69J91J142m03m63o67N28O20l2j249l71J565M49k420p28K946Q99l191j98
2557a951K464N50k292J64J805L16r26rm6M65O66q32j194J499J209j164j552J107
2575B79J943j627j790N32J751n75j717k56J646L91j627m84J600N27j077j140J145
2592d79J162p90j286M71J246K97o31k70L56J547m66j629K07J800R3k771n3K891
2610A695J18k595K0K334k72k030N9R79Qj029l6n67Q27J028j117j283J431J816
$$ plain form
2628 1386 -56 -1355 -383 1502 113 -1631 -704 1105 1014 -767 -650 961 1853 841 -284 736
2644 736 1840 -63 -1268 -44 1483 339 -750 -688 691 904 -454 -1154 -639 766 217 -1915 -1490
2661 -1490 558 548 -2031 -1714 1054 785 -1274 -1028 1229 1131 -390 -318 432 335 377 -5 -460 568 1458
2680 1458 706 -382 681 2146 48 -1590 -317 1338 52 -1682 -877 813 419 -1333 -1247 275
2696 275 872 -1037 -1524 -123 652 -570 -1888 -628 698 281 -111 -128 768 1435 576 -854 -59 1381
2714 1381 901 -1129 -490 1705 1575 -773 -224 1801 988 -1151 -995 412 -200 -607 -921 -921 -221 186
2732 186 -843 -1774 71 944 -855 -1543 661 1491 -592 -1627 -28 1114 260 -450 601 1905 1682
2749 1682 233 -228 915 1436 -312 -1223 251 1300 261 -571 -154 749 336 -288 -837 -651 605
$$ packed form
2628A386j442j299R72J885j389j744R27J809r1j781J17J611Q92j012j125J020
2644G36J104j903j205J224J527j144j089O2J379K13j358p00N15J405n49k132M25
2661a490K048j0k579L17K768k69k059K46K257r8j521P2P50r7M2l82m55J028Q90
2680A458p52j088J063J465k098j638J273J655j286j734Q05J690l94j752Q6J522
2696B75N97j909m87J401P75j222j318J260J326m17l92j7Q96O67q59j430P95J440
2714A381m80k030O39K195j30k348N49K025q13k139J56J407o12m07l14%P00M07
2732A86j029r31J845Q73j799o88K204Q30k083j035J599J142q54p10J051J304k23
2749A682j449m61J143N21j748r11J474J049j039q32M17R03m13o24n49J86J256
$$ plain form
2766 605 -367 -1663 -1169 946 286 -2135 -912 1648 523 -1670 -397 2035 634 -1051 -378 648
2782 648 350 242 -14 254 1181 1513 408 -465 1230 1579 -734 -1957 279 1419 -784 -1494 135
2799 135 639 -552 -1574 -604 425 171 -1130 -1289 -18 918 -727 -1266 -559 810 166 -393 329 1379
2817 1379 1189 66 -677 238 1428 336 -1346 40 1978 841 -821 320 1895 203 -1830 -746
2833 -746 658 -29 -1316 -542 -296 -687 -17 -1021 -1096 217 582 -1191 -1430 889 1652 -965 -1677 564
2851 564 1386 -552 -575 1285 1807 769 -191 512 1120 650 -549 -1097 -143 1142 421 -321 679 1009
2869 1009 -124 -1202 -623 513 96 -902 -1448 -101 1033 -100 -1522 -227 893 25 -1858 32
2885 32 1949 340 -1365 -359 1108 479 174 446 684 1007 943 521 -282 1520 1763 -820 -2038 449
$$ packed form
2766F05r72j296M94K115o60k421J223K560j125k193J273K432j401j685O73J026
2782F48k98j08k56K68R27L32j105q73J695L49k313j223K236J140k203p10J629
2799A35N04j191j022R70J029k54j301j59J271R36j645n39P07J369o44n59P22J050
2817A379j90j123p43R15J190j092j682J386J938j137j662J141J575j692k033J084
2833g46J404o87j287P74K46l91O70j004p5J313L65j773k39K319P63k617p12K241
2851E64Q22j938k3J860N22j038r60P03O08m70j199n48R54J285p21p42J000L30
2869A009j133j078N79J136m17r98n46J347J134j133j422J295J120q68j883J890
2885C2J917j609j705J006J467o29l05K72K38L23o4m22q03J802K43k583j218K487
$$ plain form
2903 449 1442 -1009 -1533 835 1252 -881 -1515 179 282 -557 -1525 -1015 233 380 -402 -1164 -81 851
2921 851 18 -1064 285 1623 736 -695 -444 636 887 -287 -727 743 1807 485 -651 386
2937 386 1918 8 -1908 -505 1043 -217 -1424 -673 221 -111 -506 -451 -711 427 -296 -1363 -1221
2954 -1221 619 900 -1063 -1330 1224 1325 -612 -695 1254 1649 138 -182 732 999 281 -551 -133 440
2972 440 1155 368 -374 565 1139 -503 -1562 -786 310 -591 -1443 -1042 328 372 -661 -1066 133 957
2990 957 -622 -1337 676 1269 -367 -1160 -312 978 301 -329 265 981 1080 716 117 249 1234 589 -981
3009 -981 -1099 797 959 -953 -877 1176 1035 -1068 -1442 266 89 -1224 -1715 -199 482 129 -1010 -663
3027 -663 612 761 -102 -595 565 1660 451 -962 -79 1402 605 -809 -358 1164 1637 132 -11
$$ packed form
2903D49R93k451n24K368M17k133o34J694J03q39r68N10J248J47p82p62J083R32
2921H51q33j082J349J338q87j431K51J080K51j174m40J470J064j322j136J037
2937C86J532j910j916J403J548j260j207P51Q94l32l95N5k60J138p23j067J42
2954a221J840K81j963k67K554J01j937q3J949L95j511l20R14K67p18q32M18N73
2972D40P15p87p42R39N74j642j059P76J096r01q52M01J370M4j033m05J199Q24
2990I57j579p15K013N93j636p93Q48J290o77o30N94P16R9l64n99J32R85o45j570
3009i81j18J896J62j912P6K053j41k103l74J708j77j313m91J516O81l53j139L47
3027f63J275J49q63m93J160J095j209j413Q83J481p97j414M51J522M73j505j43
$$ plain form
3044 -11 908 1240 -750 -1440 -171 586 -346 -935 -180 739 338 -942 -1199 -354 89 -654 -1291 -706 796
3063 796 408 -1289 -646 1276 1128 -1061 -384 1523 1514 -390 -329 891 893 -184 -684 -29 930 682 -173
3082 -173 -213 889 686 -644 -1252 -511 260 -601 -1419 -391 1098 393 -1053 -1098 410 85 -1089 -1095 622
3101 622 1009 -169 -1025 389 1179 -242 -497 359 1205 1124 630 132 577 722 216 -1025 -155 1167 380
3120 380 -937 -490 1198 521 -993 -811 272 178 -1890 -1495 132 659 71 -643 -73 520 284 -852
3138 -852 -1070 468 965 162 -413 533 1097 322 -1006 134 1618 968 -315 -60 924 616 -1139 -1184
3156 -1184 247 357 -632 -1052 378 664 -288 -856 -546 23 -81 -628 -1219 -485 722 60 -881 177
3174 177 1359 501 -1229 -301 1474 1218 -477 -214 1166 891 -371 -674 -23 1033 347 -161 296 862
$$ packed form
3044a1R19L32j990o90J269P57r32n89P55R19m01j280k57Q45M43p43o37N85J502
3063G96l88j697O43J922j48k189O77J907rj904O1J220Kj077n00O55R59k48q55
3082a73m0J102k03j330o08P41P71q61q18J028J489p05j446m5J508l25j174oJ717
3101F22L87j178q56J414P90j421k55Q56Q46q1m94m98M45J45n06j241Q70J322p87
3120C80j317M47J688o77j514J82J083r4k068L95J627N27n88p14N70N93k36j136
3138h52k18J538M97q03n75R46N64p75j328J140J484o50j283K55R84l08j755m5
3156a184J431J10r89m20J430K86r52n68L10N69j04n47n91P34J207o62r41J058
3174A77J182q58j730R28J775k56j695K63J380k75j262l03O51J056o86n08M57N66
$$ plain form
3192 862 353 -863 -1315 -377 271 -799 -1528 -276 800 -273 -1161 -57 456 132 -1323 -1097 686
3209 686 684 -557 -838 722 845 -101 -739 407 1197 684 -27 170 708 1011 35 -766 -125 1107 378
3228 378 -846 26 1403 264 -1942 -1119 419 -356 -1237 -1261 769 167 -358 -431 158 260 -190 -589 -264
3247 -264 486 611 -339 -400 611 1137 256 -645 559 1379 164 -579 140 1489 594 -1206 -834 307
3265 307 328 -901 -689 566 716 -682 -1201 -515 223 -526 -1267 -689 316 952 -351 -749 176 1296
3283 1296 142 -1018 431 1759 654 -888 -46 1352 775 -502 -45 1082 371 -389 -243 342 993
3300 993 -330 -639 -1147 193 272 -1026 -1244 193 897 -616 -1250 -15 772 -644 -1835 -746 912
3317 912 508 -725 -187 1022 1008 -418 -299 672 1463 54 -341 256 891 539 -684 -460 140 611 -250
$$ packed form
3192H62n09j216m52R38O48j070p29J252J076j073q88J104N13l24j455K26J783
3209F86kj241k81J560J23r46o38J146P90n13p11J97N38L03r76q01O41J232p29
3228C78j224Q72J377j139k206Q23J538p75q81k4K030o02n25p3N89J02m50l99L25
3247b64P50J25r50o1J011N26q81r01J204Q20j215p43P19J349q95j800L72J141
3265C07K1j229K12J255J50j398n19O86P38p49p41N78J005O36j303l98R25J120
3283A296j154j160J449J328j105j542Q42J398n77j277M57J127p11p60J46N85O51
3300I93j323l09n08J340P9j298k18J437P04j513o34J235P87j416j191J089J658
3317I12m04j233N38J209j4j426J19R71P91j409l95N97O35l52j223K24O00M71q61
$$ plain form
3336 -250 -768 324 1144 -357 -1747 -497 466 -539 -1843 -719 829 160 -572 -444 146 237 -819
3353 -819 -771 -214 686 529 -363 17 1003 1164 -150 -609 941 1421 -81 -641 875 1376 -130 -908 -607
3372 -607 948 154 -961 -535 590 360 -725 -1109 -387 302 -587 -1465 -402 535 728 -478 -519 628
3390 628 660 -676 -1318 532 1264 -144 -774 193 1635 932 -720 -230 1062 182 -324 221 558 715
3408 715 -429 -1042 -926 219 261 -1138 -841 491 493 -799 -1301 85 151 -1063 -1555 144 885 -74 -620
3427 -620 240 1015 437 -214 -203 562 759 -22 -284 756 1081 552 -428 -125 709 623 -504 -685 583 830
3447 830 -772 -1245 43 464 -967 -1548 -116 640 6 -604 -73 224 -158 -708 -621 517 996 83 -511
3466 -511 123 1280 989 -448 -255 896 1000 -399 -662 904 1007 -568 -961 289 1020 -319 -924
$$ packed form
3336b50n18J092Q20j501j390J250R63j005j304J124J548o69p32J28N90R1j056
3353h19M8N57R00j57q92L80R86J61j314m59J550M80j502n60J516N01j506p78L01
3372f07J555p94j115M26J125k30j085l84P22O89q89q78J063R37J93j206m1J147
3390F28L2j336o42J850P32j408o30R67J442p03j652M90J292q80n06N45L37J57
3408G15j144o13J16J145M2j399K97J332Kj292n02J386O6j214m92J699P41r59n46
3427f20Q60P75n78o51J1P65J97p81k62J040L25n29r80L03Q34q6j127j81J268K47
3447H30j602m73J288M21j431n81J432P56o34o10N31K97l82n50Q7J138M79r13n94
3466e11O34J157k91j437J93J151J04j399k63J566J03j575l93J250P31j339o05
$$ plain form
3483 -924 -294 619 -104 -666 -450 276 -258 -983 -1094 -128 558 466 -469 -135 603 310 -890 -667 852 972
3503 972 -242 -616 940 1548 89 -629 623 1050 280 -656 -218 548 390 -505 -868 -218 515 73 -978
3522 -978 -314 686 400 -1046 -628 784 317 -1050 -1313 339 961 -449 -907 631 1208 -64 -450
3539 -450 -13 646 331 -3 182 674 637 139 -715 161 960 161 -717 -32 780 453 -947 -1096 215 278
3559 278 -857 -907 220 593 -590 -1269 -180 534 -23 -880 -380 320 403 -94 -299 759 1261 437 -423
3578 -423 291 956 611 -777 -464 1225 831 -743 -605 656 741 -638 -798 179 675 -342 -973 -937 216
3597 216 31 -960 -565 130 645 -46 -929 -484 806 317 -1069 -434 917 430 -464 -177 1078 1094 -111
3616 -111 -660 748 894 72 -801 149 549 146 -261 -932 -119 93 -714 -779 -94 723 -105 -1322 -394 315
$$ packed form
3483i24O30R13p23n62K16P26n34p25j11R66O86r2r35L34P38k93j200K23J519J20
3503I72j214l74J556O08j459p18J252M27p70r36M38P66j58q95l63O50P33m42j051
3522i78O64J000k86j446M18J412m67j367k63J652O22j410m58J538N77j272l86
3539d50M37O59l15l34J85M92l7m98q54Q76P99p99q78O85Q12l27j400j49J311O3
3559B78j135n0J127L73j183o79J089P14n57q57N00P00Q3m97k05J058N02q24q60
3578d23P14O65l45j388L13J689l94j574J38J261Q5j379j60R77M96j017o31L6J153
3597B16j85r91L95O95N15o91q83M45J290m89j386O35J351m87q94K87J255J6j205
3616a11n49J408J46q22q73R50M00m03m07o71Q13K12q07o5O85Q17q28j217R28P09
$$ plain form
3636 315 209 -1500 -966 764 503 -668 -517 1077 680 -282 -540 468 875 273 -312 -116 690 904
3654 904 164 -437 145 784 -262 -775 -57 809 250 -1214 -444 619 -110 -1085 -1026 285 603 -708 -648
3673 -648 524 606 -673 -862 -406 752 608 70 -52 783 859 -183 -517 129 795 364 -707 63 1171
3692 1171 741 -536 -517 792 409 -895 -695 110 516 -596 -1147 133 298 114 -1070 -696 -19 387
3710 387 -244 -687 386 909 -96 -1270 16 1265 517 -683 248 938 611 -411 -46 884 486 -484
3728 -484 -266 413 615 -32 -404 -182 312 9 -513 -708 298 531 -780 -1035 -104 553 9 -1029 -600
3747 -600 801 335 -532 128 772 426 -219 -386 930 607 321 -345 286 978 850 86 -289 482 516 -650
3767 -650 -651 217 877 -294 -1427 -195 698 -221 -1086 -529 491 -28 -1130 -1037 482 224 -422 -583 125
$$ packed form
3636C15j06j709N34J730k61j171J51J594l97r62k58J008M07o02n85J96Q06K14
3654I04p40o01N82O39j046n13P18Q66n59j464P70J063p29r75N9J311L18j311O0
3673f48J172Q2j279j89M56J158j44n38j22Q35P6j042l34O46O66m31j071P70J108
3692A171m30j277J9J309l83j304K00Q05M06j112n51J280J65j84j184L74O77M06
3710C87o31m43J073N23j005j174J286J249p48j200R31O90l27j022L65R30l98r70
3728d84K18O79K02o47l72K22M94l03n22j95J006K33j311k55R31O57n44j038M29
3747f00J401m66q67O60O44l46o45j67J316l23k86o66O31O92j28p64l75P71L4j166
3767f50jQ68O60j171j133J232Q93r19q65N57J020n19j102R3J519k58o46j61P08
$$ plain form
3786 125 491 636 -377 9 823 790 118 -456 612 820 -236 -645 110 999 235 -788 40 638 142
3805 142 -664 -247 497 85 -770 -826 -198 207 -419 -837 -553 346 326 -445 -605 190 657 -346 -1038 441
3825 441 1249 84 -810 157 1204 498 -480 100 1036 318 -441 -134 675 710 -250 -612 -14 496 -54 -594
3845 -594 -439 -43 335 -883 -990 -17 664 -696 -863 123 661 -307 -922 -54 904 289 -578 -6 729
3864 729 549 -76 -438 600 993 316 -498 -5 518 408 -428 -560 432 708 -557 -760 284 741 -419
3883 -419 -1254 -234 382 -297 -829 -134 520 89 -730 -523 156 680 -575 -243 126 744 732 -190 -213 1001
3903 1001 940 -363 -532 585 1172 -503 -646 46 1055 -127 -986 -221 582 -161 -573 -705 734 282
3921 282 -763 -812 -266 579 84 -829 -138 468 208 -170 -291 647 679 -244 -545 842 1316 -97 -652 357
$$ packed form
3786A25L66J45j013L86Q14l3o72n74J068K08j056m09P55Q89p64j023Q28N98m96
3805A42q06M17P44m12q55n6O28M05o26m18K84Q99k0p71j60P95M67j003o92J479
3825D41Q08j165q94R67J047p06r78N80R36p18p59L07Q09L5r60l62N98N10n50n40
3845e94J55L96L78j218j07R73O81j360j67R86N38r68o15Q68R58o15q67N72P35
3864G29j80o25l62J038L93o77q14M93N23j10q36j32R92K76j265k03J044M57j160
3883d19q35J020O16o79n32O95O54m31q19K07O79N24j255L32L69O18j2r22k3J214
3903A001o1j303j69J117N87j675j43O92J009j182q59P65Q03p43m12j32J439m52
3921B82j045m9N46Q45m95r13O91O06k60l78j21R38L2r23l01J387M74j413n55J009
$$ plain form
3941 357 979 282 -572 -29 580 327 -552 -473 104 450 -370 -880 -529 311 144 -797 -572 793 283 -1034
3961 -1034 -1076 414 720 -432 -952 390 1075 -159 -373 233 880 513 -287 81 749 690 182 -140 301
3980 301 812 211 -374 -234 660 823 -504 -838 315 585 -731 -1208 -55 658 -515 -956 -89 410
3998 410 -13 -500 -74 241 413 -366 -371 608 724 234 -282 -45 956 562 -322 -230 1079 812 -365 -396
4018 -396 553 691 -55 -611 89 607 -171 -461 -370 481 7 -730 -490 -87 146 -297 -508 -240 806 -54
4038 -54 -473 -354 674 502 -516 -511 804 918 13 -261 487 948 -352 -298 241 748 -149 -733 -420 398
4058 398 358 -306 -897 -151 341 -291 -856 -363 279 133 -997 -762 587 313 -309 -340 292 535 -280 -605
4078 -605 365 695 102 -117 33 542 746 -12 -214 434 709 186 -619 86 503 -151 -873 -543 465 213
$$ packed form
3941C57O22o97q54N43O09k53q79P9N77L46q20n10L51Q40j67r41K25J365n10j317
3961a034m2J490L06j152n20J342O85j234k14O06O47l67q00L68O68n9n08l22M41
3980C01N11o01n85J40Q94J63j327l34J153K70j316m77J153P13j173m41Q67M99
3998D10m23m87M26L15J72p79nR79J16m90n16K37J001l94q84R2J309k67j177l1
4018c96R49J38p46n56P00N18p78k90R1Q51m74p37K40M03K33m43k11K68J046q60
4038e4m19J19J028j72j018NJ315J14r05k74P48M61j300N4N39N07q97n84L13Q18
4058C98m0o64n91P46M92o32n65M93O42j46j130K35J349k74o22l1O32K43q15l25
4078f05R70L30n93k19J50N09K04p58k02O48K75n23q05P05M17o54p22L30J008k52
$$ plain form
4098 213 -677 -785 397 154 -770 -940 487 472 -222 -701 142 448 131 -495 -141 361 415 -87 -209 304
4118 304 1112 394 -652 125 1067 707 -386 -301 744 164 -552 -416 560 224 -547 -889 -259 463 -206
4137 -206 -623 -406 107 32 -479 -704 180 552 -221 -706 -286 633 364 -678 -243 753 285 -597 -170 837
4157 837 698 -133 -703 676 448 -16 -461 125 353 129 -273 -410 15 374 -154 -1029 -151 619 -203 -890
4177 -890 -275 604 53 -837 -225 854 560 -296 -314 462 470 129 -204 80 887 348 -286 -55 597 425 -334
4198 -334 -490 243 706 444 -644 -524 536 -132 -800 -357 454 -10 -778 -928 305 204 -507 -987 -92
4217 -92 441 -92 -248 59 497 448 274 -243 151 1009 -95 -756 488 936 312 -632 405 772 332 -518
4237 -518 -381 562 343 -737 -779 -12 272 -362 -606 -447 -99 211 -447 -405 364 437 -301 -694 334 777
$$ packed form
4098B13q90j08J182k43r24j70J427j5o94m79Q43L06l17o26L54N02N4n02j22N13
4118C04Q08p18j046P77R42l60j093Q5J045n80p16J36R76l36p71l42O30P22o69
4137b06m17K17N13p5n11k25Q84L72p73m85M20R19k69j042M35R96m68q82M27J007
4157H37j39q31n70J379k28m64m45N86K28k24m02j37M25L59n28q75Q78P70q22o87
4177h90O15Q79n51q90O12J079k94q56j8P76Ql41l33K84Q07n39o34K31O52j72p59
4198c34j56P33M63k62j088J20J060o68o68M43Q11m64p68j50J233j01p11m80Q95
4217i2N33n33j56L07M38m9j74n17L94Q58j104o61J244M48o24r44J037L67m40q50
4237e18J37R43k19j080m2P67K84o34k44J59L48L10o58M2P69P3p38l93J028M43
$$ plain form
4257 777 -284 -642 104 942 425 -393 10 645 662 -438 -259 715 621 -447 -559 -112 458 226 -495 -98
4277 -98 308 26 -640 -608 -225 520 -497 -1143 52 764 85 -837 45 609 108 -603 -287 597 317 -58
4297 -58 -191 763 643 364 -112 334 693 181 -374 -378 312 277 -728 -871 130 529 -232 -556 127 566 35
4318 35 -1109 -535 215 -35 -830 -427 274 361 -133 -351 394 692 441 -347 -430 585 443 -281 -201 542 749
4339 749 -34 -581 118 993 -21 -601 -157 530 -317 -813 -567 68 136 -639 -910 -242 170 -102 -674 -271
4359 -271 258 205 -819 -765 529 620 -120 -610 404 1239 276 -320 193 808 168 -320 85 653 348 -265
4379 -265 -506 253 384 -103 -179 29 236 163 -761 -544 212 -15 -786 -735 527 895 -362 -825 210 851
4399 851 -334 -674 372 579 592 -604 -111 603 480 15 -200 440 261 259 -411 29 402 315 -595 -615 349
$$ packed form
4257G77j061l58P46Q38n17q18M03O35J7j100J79R74r4j068j12M47N70k32p21L97
4277i8M06k82o66L2L83P45j017o46J195P12o79r22Q82N64n01p11L16Q84k80l75
4297e8j33R54j20k79m76M46L59n12n55mO90l5j005j43J001L99p61l24O83M39n31
4318C5j144N74P50k50p95M03P01Q7m94k18P45K98k51p88q3J015j42p24Q0P43K07
4339G49p83n47O99Q75j014n80M44O87q47m96K46O35O8p75k71O68M12k72n72M03
4359b71N29n3j024N4J294R1p40m90J014Q35r63n96N13O15o40m88M05N68l05o13
4379b65k41P59J31m87p6K08K07p3r24K17P56k27p71N1J262L68j257m63J035O41
4399H51j185l40J046K07J3j196M93P14j23m65k15O40j79ko70M40L73q7r10k0R64
$$ plain form
4420 349 448 -263 -442 265 497 -341 -1199 -146 141 -103 -749 -147 279 464 -446 -347 388 658 -99 181
4440 181 40 781 135 -79 61 829 1008 -332 -307 557 940 -324 -664 106 539 -319 -675 -242 -30 -425
4460 -425 -703 -197 176 430 -216 -653 -168 161 224 -644 -297 929 235 -251 -92 772 698 -363 -301 479
4480 479 973 -16 -126 192 509 188 -641 -14 313 297 -640 -587 -13 -15 -198 -806 -314 40 -79 -579 -450
4501 -450 416 530 -635 -686 423 904 -557 -729 254 638 104 19 451 615 478 35 -130 414 476 154
4521 154 -344 57 684 -72 -443 -233 494 -58 -652 -399 390 78 -699 -1087 17 211 -387 -534 177 615
4541 615 177 -88 -50 575 314 -151 -201 256 561 12 -256 80 602 416 -352 -190 600 498 -282 -916 312
4562 312 365 -195 -522 -10 -1 -268 -526 133 327 57 -545 -326 -29 -16 -293 -621 -37 639 98 -383 262
$$ packed form
4420C49R9p11j79P07K32q38q58J053K87k44o46O02M26J85r10R9P35K70p57K80
4440A81j41P41o46k14J40P68J79j340K5Q64L83j264l40P70M33q58l56M33K12l95
4460d25k78N06L73K54o46m37M85L29O3q68L47J226o94m86J59Q64p4j061O2P80
4480D79M94r89j10L18L17l21q29O27L27j6r37N3N74kj83o08M92L54j19n00J29
4501d50Q66J14j165n1J109M81j461j72R83L84n34q5M32J64j37m43j65N44O2l22
4521A54m98M01O27p56l71K10P27n52n94K53P89l12p77l88J104J94n98j47P11M38
4541F15m38k65L8O25k61m65n0M57L05n49k68L36N22j86p68J62P90j02p80o34J228
4562C12N3n60l27N12Rk67k58O59J94k70o02K19K97J3k77l28N84O76n41m81O45
$$ plain form
4583 262 700 327 -670 -416 560 495 -348 -447 349 767 -32 -313 60 665 -45 -336 -249 160 380 -462 -636
4604 -636 38 -37 -142 -609 -234 499 15 -791 -505 637 292 -525 -779 845 894 -128 -339 583 568 -34
4624 -34 41 -45 424 231 -252 -445 440 549 -158 -447 -187 266 -252 -740 -352 586 56 -609 -523 271 330 -457
4646 -457 -588 97 555 -16 -203 -70 545 -104 -342 -265 580 836 85 -6 307 862 469 -160 82 842 371
4667 371 -909 -608 524 114 -761 -532 361 609 -350 -541 -187 -58 -195 -660 -242 120 160 -255 -394 412
4687 412 693 130 -225 330 666 102 -439 200 759 168 -109 7 739 202 353 -432 373 560 -435 -502
4707 -502 -30 3 -206 -492 -412 82 80 -306 -374 -172 508 -36 -953 -40 743 185 -693 26 710 809 -541 -157
4729 -157 538 511 -150 -134 203 685 47 -180 43 279 461 54 -381 -10 563 -430 -701 -210 347 -49 -895
$$ packed form
4583B62M38l73r97K54R76o5q43r9P96M18p99k81L73O05p10k91Q7M09K20q42j74
4604f36O74p5j05m67L75P33m84q06K86J142l45q17k54J624M9j022k11R22j5o02
4624c4P5q6M69j93m83j93Q85J09p07k89K60M53n18m88L88R38n30o65Q6P94N9p87
4646d57j31O85M58n71j87J33O15o49k38P7Q45K56p51r1L13N55l93o29K42P60m71
4667C71j280L01J132m10q75K29Q93K48r59j91L54J29j37m65M18L62M0m15j39Q06
4687D12K81n63l55N55L36n64n41O39N59n91k77J16P32n37J51p85Q05J87r95o7
4707e02M72L3k09k86Q0M94kl86o8K02O80n44r17R13P83n58q78P19O84R9j350L84
4729a57O95k7o61J6L37M82o38k27K23K36J82m07m35L71N73r93k71M91N57l96q46
$$ plain form
4750 -895 -252 604 -32 -288 -500 223 308 -30 -255 -92 354 44 -308 261 382 301 -131 -164 699 608 86
4771 86 -351 -62 417 151 -686 -105 758 -9 -626 -560 497 -47 -563 -423 -162 227 -314 -269 -216 214 -97
4792 -97 -11 -34 579 379 -529 -384 682 692 72 -122 176 1007 470 -305 377 617 371 -174 9 192 63
4813 63 -337 -608 -349 421 214 -540 -178 87 88 -524 -683 123 168 -647 -484 -129 419 85 -426 56 816
4834 816 392 -95 217 894 502 -545 -314 84 341 37 51 59 525 410 -376 -174 167 197 -383 -782 31
4855 31 253 -596 -697 -43 532 -100 -673 -186 587 50 -498 -8 327 56 -36 -120 208 520 173 -117 135
4876 135 889 373 -484 -149 421 313 -292 -619 180 632 141 -559 117 324 -120 -771 -191 518 236 -975
4896 -975 -693 -328 221 -110 -440 -104 320 401 -319 -115 376 432 -304 -18 659 687 -68 -258 344 781 125
$$ packed form
4750h95O43Q56o36k56k12P23Q5l38k25J63M46l10l52N69J21q1m32l3Q63r1n22
4771H6m37K89M79k66q37N81Q63p67o17O6J057n44n16J40K61L89n41M5N3M30l11
4792i7Q6k3O13k00r08J45J066J0o20j94K98Q31n37p75O82K40k46n45J83J83j29
4813F3m00k71K59P70k07p54L62K65Jo12j59Q06M5q15J63L55N48l34n11M82P60
4834H16m24m87L12O77l92j047K31L98K57l04J4QM66j15p86K02L41L0n80l99Q13
4855C1K22q49j01O54N75o32n73M87P73n37n48M90L35k71r2q4L28L12l47k90K52
4876A35P54n16q57L35N70j08o05l27P99M52m91p00O76K07m44o51N80P09k82j211
4896i75K82L65N49l31l30L36M24Q1p20K04M91N6p36K86O77K8p55j90O02M37o56
$$ plain form
4917 125 -454 66 404 -25 -404 -391 220 167 63 -565 -141 265 -306 -421 -372 37 105 -516 -343 500 493 -739
4939 -739 -490 138 492 334 -233 603 891 419 -536 183 765 400 14 -218 222 234 20 111 -45 200 -178
4960 -178 -766 -595 262 253 -364 -423 129 85 -259 -581 183 414 -56 -649 -27 506 353 -238 -235 414 480 114
4982 114 229 402 337 19 -415 107 339 249 -250 -352 237 306 -380 -232 303 117 -338 -673 -227 263 79
5003 79 -501 -537 291 137 -283 -372 -65 264 78 -305 185 400 236 -283 -319 576 612 -127 -121 703 512 -358
$$ packed form
4917A25n79N20L38m29l79J3O11n3j04o28M24M06n71j15M9M09O8o21J73Q43pj232
4939g39K49O28L54j58n67Q36K88m72r55P19N82l65l86k32M40J2k14R1j56K45l78
4960a78n88J71Q57ro17n9N52m4l44l22P64K31m70n93O22N33j53n91LO49O6l66
4982A14J15J73o5l18m34N22K32r0m99j02N89O9o86J48N35j86m55l35M46M90j84
5003G9n80l6Q28j54m20q9L07L29j86l83M90K15j64n19l6Q95L6p39OQ24j91q70
$$ [...]
8191D35
##END NTUPLES=NMR FID
##END=
