##TITLE=1H_Costus-oil-G-f20-11-B
 CDCl3, 8 sc, 
 5.4.2019
##JCAMPDX= 6.0         $$ Bruker NMR JCAMP-DX V2.0
##DATA TYPE= NMR FID
##DATA CLASS= NTUPLES
##ORIGIN= UXNMR, Bruker Analytische Messtechnik GmbH
##OWNER= root
$$ XWIN-NMR		Version 3.5
$$ Fri Apr  5 14:21:57 2019 Russian Standard Time (UT+4h)  she@DPX200
##.OBSERVE FREQUENCY= 200.1316
##.OBSERVE NUCLEUS= ^1H
##.DELAY= (6, 6)
##.ACQUISITION MODE= SIMULTANEOUS
##.ACQUISITION SCHEME= undefined
##.AVERAGES= 8
##.DIGITISER RES= 18
##SPECTROMETER/DATA SYSTEM= spect
##.PULSE SEQUENCE= zg30
##.SOLVENT NAME= CDCl3
##.SHIFT REFERENCE= (INTERNAL, CDCl3, 0, 15.7039)
##AUDIT TRAIL= $$ (NUMBER, WHEN, WHO, WHERE, WHAT)
$$ ##TITLE= Audit trail, XWIN-NMR		Version 3.5
$$ ##JCAMPDX= 5.01
$$ ##ORIGIN= Bruker BioSpin GmbH
$$ ##OWNER= she
$$ F:/spectra/data/she/nmr/H-F/1/audita.txt
$$ ##AUDIT TRAIL=  $$ (NUMBER, WHEN, WHO, WHERE, WHAT)
(   1,<2019-04-05 14:20:50.17 +0400>,<she>,<DPX200>,
      <created by zg, POWCHK disabled, PULCHK disabled
       configuration hash MD5:
       00 E9 B6 7A A2 85 ED C7 34 08 36 98 17 FE 4E 26
       data hash MD5: 16K
       7E 98 DF 5A 27 C3 79 88 8B C7 B9 3E 8A D1 82 1D>)
$$ ##END=
$$ 
$$ hash MD5
$$ E3 31 F3 A1 AA 3E AB 2E 7F 34 90 C7 F3 F3 E9 07
##$RELAX= 
##$RELAX= 
##$RELAX= 
##$RELAX= 
##$RELAX= 
##$RELAX= 
$$ Bruker specific parameters
$$ --------------------------
##$DU= <F:/spectra>
##$EXPNO= 1
##$NAME= <H-F>
##$PROCNO= 1
##$TYPE= <nmr>
##$USER= <she>
##$AMP= (0..31)
100 100 100 100 100 100 100 100 100 100 100 100 100 100 100 100 100 100 
100 100 100 100 100 100 100 100 100 100 100 100 100 100 
##$AQSEQ= 0
##$AQ_mod= 1
##$AUNM= <au_zg>
##$AUTOPOS= <>
##$BF1= 200.13
##$BF2= 200.13
##$BF3= 200.13
##$BF4= 200.13
##$BF5= 200.13
##$BF6= 200.13
##$BF7= 200.13
##$BF8= 200.13
##$BYTORDA= 1
##$CFDGTYP= 0
##$CFRGTYP= 5
##$CHEMSTR= <none>
##$CNST= (0..31)
1 1 145 1 1 1 1 1 1 1 1 1 1 1 1 1 1 1 1 1 1 1 1 1 1 1 1 1 1 1 1 1 
##$CPDPRG= <>
##$CPDPRG1= <>
##$CPDPRG2= <>
##$CPDPRG3= <>
##$CPDPRG4= <mlev>
##$CPDPRG5= <mlev>
##$CPDPRG6= <mlev>
##$CPDPRG7= <mlev>
##$CPDPRG8= <mlev>
##$CPDPRGB= <>
##$CPDPRGT= <>
##$D= (0..31)
0 1.2 0 0 0 0 0 0 0 0 0 0.03 0 0 0 0 0 0 0 0 0 0 0 0 0 0 0 0 0 0 0 0 
##$DATE= 1554459649
##$DBL= (0..7)
120 120 120 120 120 120 120 120 
##$DBP= (0..7)
150 150 150 150 150 150 150 150 
##$DBP07= 0
##$DBPNAM0= <>
##$DBPNAM1= <>
##$DBPNAM2= <>
##$DBPNAM3= <>
##$DBPNAM4= <>
##$DBPNAM5= <>
##$DBPNAM6= <>
##$DBPNAM7= <>
##$DBPOAL= (0..7)
0.5 0.5 0.5 0.5 0.5 0.5 0.5 0.5 
##$DBPOFFS= (0..7)
0 0 0 0 0 0 0 0 
##$DE= 6
##$DECBNUC= <off>
##$DECIM= 24
##$DECNUC= <off>
##$DECSTAT= 4
##$DIGMOD= 1
##$DIGTYP= 9
##$DL= (0..7)
0 120 120 120 120 120 120 120 
##$DP= (0..7)
150 150 150 150 150 150 150 150 
##$DP07= 0
##$DPNAME0= <>
##$DPNAME1= <>
##$DPNAME2= <>
##$DPNAME3= <>
##$DPNAME4= <>
##$DPNAME5= <>
##$DPNAME6= <>
##$DPNAME7= <>
##$DPOAL= (0..7)
0.5 0.5 0.5 0.5 0.5 0.5 0.5 0.5 
##$DPOFFS= (0..7)
0 0 0 0 0 0 0 0 
##$DQDMODE= 0
##$DR= 18
##$DS= 0
##$DSLIST= <SSSSSSSSSSSSSSS>
$$ [...]
##$SUBNAM2= <"">
##$SUBNAM3= <"">
##$SUBNAM4= <"">
##$SUBNAM5= <"">
##$SUBNAM6= <"">
##$SUBNAM7= <"">
##$SUBNAM8= <"">
##$SUBNAM9= <"">
##$SW= 24.9336934301222
##$SWIBOX= (0..15)
0 0 2 0 0 0 0 0 0 0 0 0 0 0 0 0 
##$SW_h= 4990.01996007984
##$TD= 16384
##$TD0= 1
##$TE= 0
##$TE2= 300
##$TE3= 300
##$TEG= 300
##$TL= (0..7)
0 120 120 120 120 120 120 120 
##$TP= (0..7)
150 150 150 150 150 150 150 150 
##$TP07= 0
##$TPNAME0= <>
##$TPNAME1= <>
##$TPNAME2= <>
##$TPNAME3= <>
##$TPNAME4= <>
##$TPNAME5= <>
##$TPNAME6= <>
##$TPNAME7= <>
##$TPOAL= (0..7)
0.5 0.5 0.5 0.5 0.5 0.5 0.5 0.5 
##$TPOFFS= (0..7)
0 0 0 0 0 0 0 0 
##$TUNHIN= 0
##$TUNHOUT= 0
##$TUNXOUT= 0
##$USERA1= <user>
##$USERA2= <user>
##$USERA3= <user>
##$USERA4= <user>
##$USERA5= <user>
##$V9= 5
##$VALIST= <valist>
##$VCLIST= <CCCCCCCCCCCCCCC>
##$VD= 0
##$VDLIST= <DDDDDDDDDDDDDDD>
##$VPLIST= <PPPPPPPPPPPPPPP>
##$VTLIST= <TTTTTTTTTTTTTTT>
##$WBST= 1024
##$WBSW= 4
##$XGAIN= (0..3)
0 0 0 0 
##$XL= 0
##$YL= 0
##$YMAX_a= 205433
##$YMIN_a= -324718
##$ZGOPTNS= <>
##$ZL1= 120
##$ZL2= 120
##$ZL3= 120
##$ZL4= 120
##$ABSF1= 10
##$ABSF2= 0
##$ABSG= 5
##$ABSL= 3
##$ALPHA= 0
##$AQORDER= 0
##$ASSFAC= 0
##$ASSFACI= 0
##$ASSFACX= 0
##$ASSWID= 0
##$AUNMP= <proc_1d>
##$AZFE= 0.1
##$AZFW= 0.1
##$BCFW= 1
##$BC_mod= 2
##$BYTORDP= 1
##$COROFFS= 0
##$CY= 11.3945322036743
##$DATMOD= 1
##$DC= 2
##$DFILT= <>
##$DTYPP= 0
##$F1P= 18.9103706918063
##$F2P= -1.10871071338519
##$FCOR= 0.5
##$FTSIZE= 0
##$FT_mod= 4
##$GAMMA= 1
##$GB= 0.15
##$INTBC= 1
##$INTSCL= 1
##$ISEN= 128
##$LB= 0.24
##$LEV0= 0
##$LPBIN= 0
##$MAXI= 10000
##$MC2= 0
##$MEAN= 0
##$ME_mod= 0
##$MI= 1.114404
##$NCOEF= 0
##$NC_proc= 0
##$NLEV= 6
##$NOISF1= 3.799351
##$NOISF2= 2.8
##$NSP= 1
##$NTH_PI= 0
##$NZP= 0
##$OFFSET= 15.70392
##$PC= 1
##$PHC0= -8866.271
##$PHC1= 34.20028
##$PH_mod= 1
##$PKNL= yes
##$PPARMOD= 0
##$PSCAL= 0
##$PSIGN= 0
##$REVERSE= no
##$SF= 200.130013532006
##$SI= 16384
##$SIGF1= 3
##$SIGF2= 2
##$SINO= 400
##$SIOLD= 16384
##$SREGLST= <1H.CDCl3>
##$SSB= 0
##$STSI= 0
##$STSR= 0
##$SW_p= 3612.71676300578
##$SYMM= 0
##$S_DEV= 0
##$TDeff= 0
##$TDoff= 0
##$TI= <>
##$TILT= no
##$TM1= 0
##$TM2= 0
##$TOPLEV= 0
##$USERP1= <user>
##$USERP2= <user>
##$USERP3= <user>
##$USERP4= <user>
##$USERP5= <user>
##$WDW= 1
##$XDIM= 8192
##$YMAX_p= 0
##$YMIN_p= 0
$$ End of Bruker specific parameters
$$ ---------------------------------
##NTUPLES= NMR FID
##VAR_NAME=  TIME,          FID/REAL,        FID/IMAG
##SYMBOL=    X,             R,               I
##VAR_TYPE=  INDEPENDENT,   DEPENDENT,       DEPENDENT
##VAR_FORM=  AFFN,          ASDF,            ASDF
##VAR_DIM=   8192,          8192,            8192
##UNITS=     SECONDS,       ARBITRARY UNITS, ARBITRARY UNITS
##FACTOR=    0.0002004,     1,               1
##FIRST=     0,             0,               0
##LAST=      1.6414764,     0,               0
##MIN=       0,             -324718,         0
##MAX=       1.6414764,     205433,          0
$$ Real data points
##PAGE= N=1
##DATA TABLE= (X++(R..R)), XYDATA
0 0 0 0 0 0 8 -8 8 -8 8 -16 16 -24 24 -32 40 -48 56 -71 81 -96 113 -130 153 -177 201 -232 265 -304 344
29 344 -385 435 -489 552 -616 688 -767 851 -947 1050 -1164 1291 -1428 1580 -1749 1939
45 1939 -2150 2388 -2660 2972 -3331 3755 -4263 4883 -5662 6674 -8047 10030 -13150 18816
59 18816 -32388 133244 1819 -284898 28821 167248 -51752 -170091 54257 118806 -26822
70 -26822 -77069 31740 46237 -798 -26943 -32368 -28483 29490 38499 -19777 -38575 10361 5834
83 5834 -25749 -8577 18528 -1795 -8 27850 17786 -10559 5404 15066 -16984 -30670 424
96 424 18729 11155 6302 8556 18006 26392 -3208 -43051 -16340 30813 185 -44395 -783 44078
110 44078 -1045 -35170 5231 14861 -27547 -17625 23370 6735 -14585 13791 9015 -38961 -22216
123 -22216 32063 9601 -30831 10188 48834 10106 -14412 14103 7689 -29276 -16200 14130
135 14130 2776 -235 23672 12798 -17216 2934 26354 -9575 -38668 -5989 17630 -5621
147 -5621 -15001 5496 8107 -11440 -19476 -6327 14958 18062 -10609 -24484 12083 31978 -13296
160 -13296 -36952 9558 24566 -22625 -18816 43449 40796 -18327 -17824 21731 11544 -17072 -8188
173 -8188 1971 -6547 667 10531 662 3404 14556 -8821 -29383 4108 22623 -17435 -28519
186 -28519 14865 12990 -31806 -15234 29599 4998 -29795 6670 34750 -3989 -22948 11222
198 11222 17269 -13410 -13154 8662 7638 2466 8039 6045 5762 14902 2300 -19134 -1861 20657
212 20657 -6849 -30718 1603 23424 -6699 -18734 10042 12269 -14710 -12697 7314 1935 -8997
225 -8997 -6003 -6397 -6103 5422 4788 -7466 1343 15663 1202 -7685 13808 13951 -15254 -10518 18169
240 18169 5707 -18276 4936 25023 -2593 -15348 14463 18535 -12606 -13595 7517 1232 -14424
253 -14424 -8584 -2351 -5480 2028 5962 -5250 -1610 11266 -4556 -22972 -206 16583 -10771
266 -10771 -20808 13196 20042 -11592 -8690 20888 11160 -13463 1317 19127 2920 -9839 1214
279 1214 3046 -5643 -1527 3239 444 4280 7489 -3529 -4830 8559 -465 -22126 -10226 9920
293 9920 -7773 -21348 5631 19748 -5972 -12755 11138 9264 -12506 -8451 6779 1245 -4536
306 -4536 3595 2919 495 9037 6637 -6482 2625 17888 1701 -11042 9297 13921 -15592 -18732
320 -18732 10299 6417 -17272 -3188 20394 3798 -12852 2016 5990 -13381 -15989 -3207 -3896
333 -3896 -4384 6022 3713 -3625 6966 8935 -10770 -8732 14961 8369 -14739 -542 20793 1388
347 1388 -16485 5115 16092 -5163 -7529 13344 12922 -3342 -1781 2069 -6533 -8504 -4592 -7255
361 -7255 -4480 7019 2848 -5916 5871 11187 -11328 -18456 2980 4039 -16328 -7257 16528 6315
375 6315 -10208 4490 14827 -1817 -8478 4992 6925 678 5276 5144 -3959 -764 3887 -6924
389 -6924 -5681 13832 9773 -10824 189 19156 -1908 -23835 -4418 6774 -15886 -16370 13399
402 13399 13911 -9481 -3843 10911 -2131 -12835 642 4310 -7829 -3692 8029 3406 41
415 41 7941 3025 -6440 3084 10558 -885 -1131 13554 4788 -14946 -4963 11891 -2475 -14996
429 -14996 2781 12793 -1535 -3774 6772 2371 -10493 -10811 -8191 -6820 1462 4915 -4390 -2801
443 -2801 10047 3934 -8918 365 8807 -7250 -11147 9983 13321 -4427 -1552 11076 -857
456 -857 -10109 7295 14947 -1406 -4445 7251 2441 -6365 -117 166 -10390 -5560 4849 -2289
470 -2289 -4635 10926 7621 -15156 -11270 8670 -631 -17341 -3352 11077 -1393 -6979 8154
483 8154 10395 -2436 -3210 1633 -707 1956 8404 1942 -3350 5173 4603 -6751 -396 12054 1037
498 1037 -10038 5003 11775 -4979 -7773 4855 -2689 -17272 -4585 9918 -593 -6167 4533
511 4533 2550 -7466 -18 4996 -7279 -9079 3552 783 -5245 9923 14900 -6662 -10161 11505
525 11505 10692 -8733 -297 14254 -1574 -13380 6999 14899 -5760 -10004 5123 2380 -6500
538 -6500 3656 9228 -4396 -9248 -1333 -3061 -6838 -256 57 -8332 -1905 9223 1952 -5377 4737
553 4737 4080 -10870 -7002 9889 5772 -6081 1553 9954 1160 -2288 5852 5320 -1020 646 1401
568 1401 -866 2582 4907 -4057 -6476 3879 1328 -10027 -880 11875 -1312 -13455 67 6882
582 6882 -8153 -9490 4611 896 -10470 -1064 9882 2044 -1703 4935 -63 -7244 2734 8713
596 8713 -2778 -4033 8188 4255 -5188 5718 12205 -4446 -9646 6318 7428 -5773 -1369 7180
610 7180 -4873 -12558 1417 6768 -5717 -6140 2866 -931 -4466 3224 1967 -8114 -5559 1648
624 1648 -2830 -3098 7258 4681 -5992 932 11159 2143 -5976 3785 5272 -5477 -1448 10079
638 10079 3606 -5704 1508 5971 -1635 -1402 3730 -1819 -5819 2484 2091 -6918 -3333 3047 -5626
653 -5626 -9350 4703 6625 -8029 -5592 8588 1951 -9900 -879 6793 -4195 -5951 7281 7264
667 7264 -2668 1204 7544 1171 -1436 5002 1877 -5105 1994 6830 -2389 -3747 5124 997 -7981
682 -7981 575 7770 -3343 -9031 1694 2945 -6604 -3843 2714 -3666 -7464 974 4427 -1494 -127
697 -127 3597 -1904 -1988 4710 1535 -4846 1086 6369 -930 -532 9041 4614 -6121 87 8429 -385
713 -385 -5751 3428 3303 -5833 -1928 5196 -2459 -7566 1207 2084 -6279 -2057 4672 -4027 -8191 2385
729 2385 3679 -7963 -4107 6943 148 -6435 5597 9198 -4328 -4949 7895 4254 -5734 1151
743 1151 7751 -946 -3442 6553 5031 -3266 -302 3751 -2435 -2887 3905 -33 -6789 -754 3397
758 3397 -5221 -5606 3188 -34 -7684 -1348 5757 -2332 -5854 2628 1956 -4578 -943 4427 -269 -1430
774 -1430 4997 3675 -1410 2951 4781 -2774 -1382 6815 2145 -5798 1639 7278 -2665 -5608 5296
789 5296 3614 -8248 -3582 6049 -798 -7620 541 2793 -6249 -4208 3649 -726 -5414 1456 2687
804 2687 -4119 -790 5697 -398 -5007 3078 5390 -2736 -846 7357 3063 -3417 2279 5695 -1315
819 -1315 -2303 3886 1623 -3711 501 3075 -1976 -2586 1399 -1973 -4696 604 1225 -4863 -2223 2922
835 2922 -3002 -6403 2405 4270 -5486 -4012 5339 1738 -4638 2542 6405 -2083 -3295 5414 3844
850 3844 -2055 2538 5520 -2374 -1815 6874 2677 -5627 199 4922 -3585 -4853 5082 2344 -8463
865 -8463 -3558 4540 -2135 -7037 1002 2198 -5851 -3486 4447 326 -4548 1249 2286 -3141 -343
880 -343 5881 91 -3544 3885 4860 -2347 466 6969 1403 -4002 2380 4994 -2076 -1698 4045 323
896 323 -4616 269 2057 -2867 -2265 2160 -2376 -5428 189 1962 -3880 -2556 2625 -2716 -5359 2658
912 2658 4324 -3006 -2015 3935 718 -3250 4460 6480 -2776 -3232 4311 3435 -1063 3144 4554 -2499
928 -2499 -2680 4392 2373 -2728 318 501 -5585 -2808 5162 577 -6243 -1734 1668 -3707 -3105 4566
944 4566 791 -7252 -2263 3912 -728 -1949 3041 619 -4304 1357 6543 1312 -598 3604 1004
959 1004 -3171 2261 6141 -1396 -3351 3904 2831 -3218 931 5053 -2636 -5875 1123 1636 -5009
974 -5009 -2259 2490 -2924 -4877 1487 1475 -4287 -1157 3933 -2019 -4316 3713 3625 -4265 -958 5544
990 5544 43 -3953 4210 6825 -634 -1073 5298 1679 -3104 2470 3776 -3274 -3125 3168 1079 -2739
1006 -2739 2140 2995 -5252 -4981 2202 469 -5147 -1320 1099 -4554 -3376 3984 1977 -4555 -938
1021 -938 2597 -593 -451 5104 2145 -3685 -196 3449 132 796 4924 851 -3057 3134 6269 7
1037 7 -2681 1791 -1126 -5279 519 4232 -2099 -4560 1353 890 -3642 3 2007 -4272 -5561 1296
1053 1296 1490 -3406 -679 2794 -2158 -2265 3554 3141 -1538 1279 4977 -169 -1758 3706 2180 -3757
1069 -3757 -154 5273 369 -2179 3596 4228 -2163 -1767 2065 -2021 -5028 303 718 -3730 -1940 2112
1085 2112 -1691 -3652 1955 1552 -4760 -2579 3353 252 -3836 1020 3404 -2330 -1623 4129 3073
1100 3073 -842 2437 3567 -367 146 3318 -60 -3539 630 2521 -1788 -625 3971 642 -3941
1115 -3941 240 1910 -4051 -4467 602 -1377 -4648 -399 2606 -1537 -2959 1846 692 -2471 253
1130 253 2793 -1220 -1626 3314 1829 -2262 902 4020 -66 -682 4648 4111 -1480 57 2971 -1411
1146 -1411 -3819 974 631 -3268 -1251 3172 -149 -2521 341 358 -3903 -3108 618 -1943 -3275 480
1162 480 1120 -2038 129 2652 -414 -1871 2504 2999 -1082 709 3527 -72 -2175 1852 2540 -1571
1178 -1571 977 4793 884 -1026 2894 1503 -4679 -2392 1565 -2657 -5213 1852 3058 -3677 -2369
1193 -2369 3770 242 -6108 -1449 2285 -2859 -3671 2843 2420 -2397 176 3563 137 -794 3326 2944
1209 2944 -951 1091 3505 -694 -1836 1727 821 -2372 812 3953 207 -1382 2083 707 -4248
1224 -4248 -3066 324 -2808 -4424 66 1863 -1322 -913 1467 -769 -2205 183 -149 -2035 398
1239 398 2169 -698 -410 3225 1596 -1598 2156 4706 286 -980 3746 2687 -2771 -1116 2463
1254 2463 -1370 -3393 1269 2434 -1134 -305 2795 -1112 -4328 -1527 -444 -4574 -3235 1266 -40
1269 -40 -2175 1695 2873 -1335 -1590 1486 -234 -1943 1681 2666 -729 -517 3508 1109 -1856 1968
1285 1968 3724 -458 -189 3450 1087 -3286 -482 894 -3387 -3755 1278 772 -1998 1081 2687 -2031
1301 -2031 -3687 -332 -1493 -4204 -1082 1085 -1901 -537 4176 2717 -1785 607 3024 -1172 -1717
1316 -1717 3687 2401 -2298 487 3722 -257 -2126 2876 2707 -2391 118 4610 512 -3455 -739
1331 -739 -350 -5187 -3382 1149 -507 -2199 1152 1758 -1780 -897 1568 -2190 -4783 -526 1930 -957
1347 -957 194 4276 2136 -1014 1776 3523 -313 -268 2799 1099 -1582 1260 2340 -1603 -1844 866
1363 866 302 -869 1945 2440 -946 -1731 87 -2554 -5017 -1600 533 -3165 -2001 2793 2633 -746
1379 -746 1102 1256 -2236 -2447 870 474 -778 1613 2819 -291 277 4317 2426 -979 634 2010
1395 2010 -424 -162 3058 6 -4528 -1126 1149 -1567 -1336 2722 1479 -3022 -1037 2080 -1755
1410 -1755 -4231 -2071 -2034 -3168 718 3867 1125 -588 2764 2138 -2133 -145 2934 -451 -2690 1900
1426 1900 3163 283 962 2673 -303 -1409 2473 2605 -1663 -412 1529 -1660 -4238 -466 314 -3365
1442 -3365 -1770 2329 417 -1518 1581 1723 -3295 -3420 42 -1425 -3150 999 3508 82 610 3475
1458 3475 1847 -800 1535 1823 -1712 -1163 3183 1926 -1286 1352 1995 -1474 -1635 2873 1613 -2021
1474 -2021 -339 974 -2148 -2902 260 -1790 -4751 -812 1897 198 -389 2681 688 -3425 -1591
1489 -1591 1446 -1097 -2104 1013 1604 670 2733 4235 716 -856 1414 986 -922 1477 2291 -1029
1505 -1029 -2125 1470 1248 -1723 -601 1302 -750 -1556 1610 824 -2949 -2439 -1116 -2881 -2463 653
1521 653 992 -1298 1452 3647 441 -1089 1000 218 -2852 -862 2725 836 -450 2597 3235 326
1537 326 372 2127 -235 -1235 1160 1134 -1841 -1179 999 -1381 -3118 609 1147 -2429 -1806 2471 769
1554 769 -2706 -1260 -685 -3317 -2502 1031 666 -653 2179 3273 558 343 2726 93 -3256 -536
1570 -536 2705 337 59 2348 1900 -573 368 1751 -512 -1587 211 -75 -1583 -368 72 -2838
1586 -2838 -3207 202 -169 -1403 157 2129 -740 -1731 711 200 -3162 -2442 546 718 490 2647 2790
1603 2790 570 1364 2315 -142 -1161 553 258 -1529 875 3072 542 -1394 237 732 -1172 -215
1619 -215 598 -1590 -2195 290 -169 -2866 -1793 12 -1676 -1930 2274 2788 -678 -821 1499 -527 -2129
1636 -2129 -266 590 -1408 247 3823 2530 970 2092 1796 -1187 -844 1555 -481 -2303 311 1697
1652 1697 -1509 -1199 1850 -385 -3189 -340 2012 -970 -2244 10 -608 -3253 -1951 3 -1151
1667 -1151 -1181 1586 2219 647 1594 2035 -725 -2077 194 536 -1211 831 2824 1589 1273 2957 1503
1684 1503 -1591 -495 634 -1073 -2047 219 612 -1812 -787 675 -767 -2278 -220 380 -1092 -13
1700 -13 839 -1082 -2872 -159 -144 -1793 59 2470 1482 924 3167 2721 -494 -978 787 -844 -1745
1717 -1745 904 1914 -217 658 3003 657 -1482 234 -202 -2699 -1696 855 -450 -2798 -491
1732 -491 39 -1757 -2138 860 538 -1148 1121 1539 -868 -1181 198 -1069 -1847 1003 2561 880 1403
1749 1403 3335 2607 -236 321 680 -1511 -2231 628 675 -697 791 1398 -704 -1179 369 -721 -2446
1766 -2446 -1063 688 -1554 -1774 695 -422 -3010 -956 1423 24 -186 2033 2000 -264 -327 985
1782 985 -813 -1418 921 1084 26 2134 3918 1743 -783 933 283 -2427 -1503 675 -539 -1747
1798 -1747 395 978 -777 -848 470 -1154 -2666 -243 508 -1415 -787 941 -797 -2451 -19 1466
1814 1466 -520 72 2680 2109 221 1132 1328 -1056 -1634 455 629 568 1877 2256 92 124 1230 -210
1832 -210 -2368 -894 -2 -2030 -1868 1116 846 -1594 -1064 -179 -1048 -1011 155 213 -922 154 391 -962
1850 -962 -604 1279 654 -914 1149 3266 1437 559 1947 969 -1902 -1245 913 -23 -362 1113 1304
1867 1304 -292 718 920 -787 -2118 -853 -966 -2160 -377 1646 -1088 -1954 274 670 -1426 -696
1883 -696 1654 -42 -884 837 1227 -786 -153 578 -465 -135 2666 3133 246 904 2312 133 -1700
1900 -1700 51 542 -1639 -1366 904 1113 -16 523 119 -1790 -1765 -155 -1230 -2148 -226 558 -1707
1917 -1707 -849 1158 485 -1507 79 1594 355 78 1989 1174 -921 -150 861 -356 476 1939
1933 1939 1549 83 1255 1630 -693 -1120 -283 -846 -2202 -679 910 6 -783 59 62 -1431 -956 -345
1951 -345 -1385 -1072 451 -117 -733 532 1085 -780 -522 1578 1210 212 872 2427 127 -829 1093
1968 1093 395 -929 -166 1475 273 158 2049 987 -1165 -911 -425 -1928 -2389 -77 23 -1326 -518
1985 -518 1202 -341 -1529 -321 562 -1071 -711 723 322 -786 496 997 -604 107 1647 1066 -104
2002 -104 1741 2240 -232 -408 1101 -116 -1846 -442 1074 -131 -567 945 615 -1130 -589 -541 -1825
2019 -1825 -1812 -7 -539 -1585 -58 1179 -659 -1140 614 493 -1373 58 1809 508 -346 836
2035 836 727 -445 281 1720 448 221 1699 1262 -153 -80 164 -1143 -1839 -323 -139 -955 -197 1090
2053 1090 3 -1163 -147 -410 -1774 -1432 10 -643 -810 418 514 -226 493 1364 -159 -140 909 1188
2071 1188 324 304 1422 161 -655 431 940 145 452 1202 192 -35 871 13 -1963 -1366 -196 -1417
2089 -1417 -1693 424 811 -1294 -885 689 -137 -1883 -306 273 -968 -443 1352 911 -367 488 985
2106 985 95 266 1696 1399 -44 611 1649 -397 -622 667 -130 -1009 20 1389 81 -642 438
2123 438 -124 -1610 -1249 -395 -939 -1158 -140 267 -837 70 726 -508 -847 344 429 -815 535 1412
2141 1412 1005 -87 1011 1073 73 639 1545 687 287 849 582 -192 -373 229 -878 -1145 303 450
2159 450 -557 86 684 -1017 -2002 -309 -607 -1357 -1007 481 258 -535 926 1106 -749 -389 1102 396
2177 396 -167 607 1103 -93 67 1205 735 -459 146 1191 -9 199 1288 1 -1235 -350 161
2194 161 -1018 -1108 -27 -350 -1365 76 536 -622 -1506 -441 -644 -1003 -326 645 -482 111 1165 815
2212 815 -193 533 874 -80 388 1473 1185 -376 285 1114 81 -241 1002 -7 -818 207 928 -506
2230 -506 -1040 -9 -416 -1680 -681 152 -759 -1041 220 237 -720 -678 693 -403 -1439 317 960 -106
2248 -106 -9 1255 495 -55 757 623 -134 282 1219 599 -237 661 300 -656 -799 366 -314 -1078 -169 774
2268 774 -913 -1124 -99 -643 -1385 -437 -118 -342 -762 724 707 -378 181 655 -132 -650 707 784 203
2287 203 1039 933 281 415 1324 329 -283 439 875 50 -274 959 375 -1213 -800 45 -471 -796 -106
2306 -106 -39 -1085 -648 -111 -688 -1129 -180 -182 -755 126 744 256 -124 588 180 -43 390 1193 406 -71 1340
2327 1340 1125 169 294 965 239 -798 -24 602 -269 -203 189 -763 -1342 -116 -578 -947 -525 -45 -594
2346 -594 -926 58 208 -865 -631 361 -17 -244 670 1083 -175 -85 1198 891 16 787 889 -184 74
2365 74 892 297 106 508 59 -653 -296 1114 -142 -1110 -326 175 -847 -1105 50 -459 -1532 -784 222
2384 222 -446 -328 208 35 -569 33 900 32 -70 896 887 -91 644 1223 148 -131 859 623 124 423
2404 423 629 -39 -510 103 286 -916 -670 114 -798 -746 -306 -399 -729 -360 -35 -680 -521 257 -98 -749
2424 -749 330 896 82 -128 940 1113 94 88 1152 690 -243 732 886 147 163 588 171 -728 429
2443 429 403 -605 -350 130 -269 -1353 -478 -50 -1287 -1016 326 -103 -1121 -560 181 -367 -557 635
2461 635 184 -487 230 850 79 -55 500 481 183 815 886 429 -112 385 115 -142 51 248 -669 -670 178
2482 178 -330 -832 -403 -409 -832 -1061 -478 -87 -826 -785 -206 -79 -99 661 182 -473 204 659 100 -10 882
2503 882 410 -215 454 931 349 -240 589 753 44 341 153 35 -638 -449 -413 -613 -295 -423 -725 -699 19
2524 19 -314 -733 -193 -45 -562 -676 366 440 -355 -240 810 651 274 882 933 258 185 499 385 -81 381
2545 381 549 151 357 359 47 -739 60 94 -902 -676 -150 -542 -848 -347 -254 -827 -548 337 255 -746 -213
2566 -213 126 -157 -101 374 354 97 -32 789 643 611 698 701 -102 397 672 -4 -114 484 110 -252 -261 207 -227
2589 -227 -882 -174 -342 -660 -382 -114 -521 -837 -323 -133 -391 -46 -156 -178 -201 526 571 -208 94 511 46
2610 46 -306 750 779 97 367 851 726 287 211 122 -428 -311 -81 -211 -340 128 -116 -671 -273 -61 -624
2631 -624 -868 -378 -156 -681 -776 181 31 -745 -204 464 285 96 771 499 373 190 712 341 223 489
2651 489 88 363 265 825 -55 354 383 -111 -126 -403 -499 -727 -843 -200 -346 -792 -382 -194 -492 -182 356
2672 356 -13 -467 -503 48 -159 -137 166 329 130 760 1163 710 479 620 512 -228 91 350 -287 -422 186
2693 186 897 -106 93 387 -255 -299 -334 -226 -838 -916 -593 -633 -709 -29 148 -405 -81 459 225 -163 -81 568
2715 568 -102 -528 495 521 187 491 1189 682 127 400 214 293 -276 -306 -508 -423 -7 -277 -200 321 60
2736 60 -622 -840 -46 -221 -510 -675 -117 -419 -546 109 -75 100 445 154 261 595 442 389 -65 -179 489
2757 489 113 274 887 387 92 464 657 103 -530 -228 -363 -898 -502 242 -519 -682 -95 -92 -559 -325 -326
2778 -326 -713 -514 -305 8 -341 -93 198 28 -293 265 589 561 575 866 527 409 171 416 -31 -310 -29
2799 -29 411 318 536 334 -294 -652 -242 -965 -807 -551 -593 -310 -80 -193 -245 -364 -126 120 -437 -244 308
2820 308 363 -106 -220 539 121 29 656 578 199 501 578 422 -25 305 -10 -215 -495 -175 -245 176 159 -99
2842 -99 -112 -266 -163 -891 -912 -267 -210 -568 -345 207 149 -198 158 167 201 102 252 261 290 307 -83 11 398 474 249
2867 249 260 549 798 396 278 160 -563 -537 -331 -425 -401 -221 637 -19 -312 -180 -251 -643 -796 -391 -657 -542
2889 -542 199 192 -321 453 302 132 130 554 471 307 593 303 284 18 45 46 -111 55 709 483 180 -113 129
2912 129 -618 -1089 -617 -198 -724 -232 180 -124 -137 -590 -228 -682 -47 -368 -302 -240 194 161 145 395 184 360
2934 360 365 897 766 323 443 432 45 50 447 24 -92 131 287 265 41 117 -216 -921 -772 -832 -674 -368 -366
2957 -366 -38 -5 -93 359 278 -330 -179 -248 263 404 420 354 171 274 309 459 411 641 326 269 107 273 38
2980 38 -251 -772 -430 -470 -241 288 -131 119 -85 -344 -450 -888 -699 -563 -385 -303 -130 268 352 369 -2 180
3002 180 453 236 204 357 425 189 207 317 433 340 340 208 355 518 565 298 -299 -498 -606 -843 -369 -335 -122
3025 -122 130 250 -43 -250 -171 -499 -307 -974 -380 245 193 179 476 446 175 438 749 448 149 108 153 190
3047 190 411 329 109 1 -28 380 499 227 -77 -171 -422 -464 -540 -752 -746 -691 -485 -4 -28 255 -187 -205 -372
3070 -372 -215 -47 -190 22 61 210 657 458 344 521 535 12 143 411 295 29 38 -66 162 -277 -60
3091 -60 249 89 172 235 -178 -189 -221 -725 -873 -682 -408 -309 -235 221 290 38 702 6 -150 -80 -49 272 181 249
3115 249 385 122 418 612 189 146 140 214 197 -73 63 -316 -268 -491 -662 -386 19 -87 24 44 -120 -175 -813
3138 -813 -497 -429 -493 -334 77 313 186 81 518 660 90 57 405 116 282 460 441 158 352 392 123 156
3160 156 -25 166 -92 110 -198 -207 -659 -805 -236 -406 -386 -19 -79 -136 -9 174 118 -284 -376 -170 21 194
3182 194 619 637 559 200 193 453 398 186 -20 23 244 275 -177 -1 -45 -156 61 18 -114 -271 -468 -565 -557 -234
3206 -234 -645 -589 -517 -293 -183 145 96 339 45 -618 -259 -232 42 -135 229 615 204 357 852 529 92
3227 92 204 152 -98 -14 246 -118 -278 -161 -312 -54 222 66 -224 -205 -124 -244 -370 -614 -320 -440 -535 -220
3249 -220 -84 501 356 315 552 139 -338 327 91 -27 309 450 612 350 324 135 237 70 138 -80 -246
3270 -246 -106 -657 -446 86 -178 -395 -448 -130 -25 -162 244 -133 -372 -605 -443 -118 -79 -46 -151 353 572
3291 572 758 506 327 281 -106 -374 2 236 258 204 332 -58 -117 -126 75 36 -270 -466 -446 -264 -300 -426 -563
3314 -563 -375 -667 -118 -57 234 312 28 0 198 -279 -339 -239 -70 14 411 505 798 405 432 329 259 14 121
3337 121 -6 397 442 166 36 -9 -84 -342 -483 -108 -25 -150 -597 -179 -329 -837 -535 -193 -47 -115 133 372
3359 372 629 469 215 -134 -381 -285 -90 -152 261 695 297 445 433 110 133 -379 -176 -47 -12 -96 -231 54
3381 54 -326 -168 -386 -340 -660 -131 92 50 -645 -307 -254 -507 -572 -97 221 298 148 554 699 295 250 297 -127
3404 -127 -228 -165 246 410 361 225 -296 285 291 63 -390 -299 -79 -327 -650 -231 -100 -511 -183 -268 -164 81
3426 81 -250 137 219 -295 -310 -74 172 -157 -258 735 761 489 498 684 199 -117 -314 -25 124 245 365 321
3448 321 520 -87 -138 -188 -106 -399 -566 -558 -90 -375 -569 -459 -405 -169 -109 -314 109 446 373 -171 -1 170 149
3471 149 -132 201 484 308 216 727 685 245 66 225 259 -218 -112 21 -113 -44 -340 -260 -87 -467 -419 -365
3493 -365 -128 -236 -327 -482 -404 -177 -41 -334 293 327 110 190 -16 449 196 219 337 242 -181 402 642 335
3515 335 398 179 388 506 -161 -484 -291 -406 -393 -392 -123 -321 -157 -542 -499 -205 -184 -404 -76 -91 -66 -87 85
3538 85 132 -106 -97 43 116 253 168 465 803 481 159 153 245 139 404 16 352 73 -137 19 -285 -204 -419
3561 -419 -482 -336 -229 -7 -365 -181 -259 -1 -165 -35 -260 -319 -217 310 453 -339 95 518 67 303 374
3582 374 508 654 410 446 316 72 -65 -13 -233 109 -320 -14 -131 43 107 -211 -27 -281 -378 -560 -404
3603 -404 -81 -98 -194 104 90 -283 -165 -164 228 132 50 94 573 220 149 71 355 204 112 327 344 33 62 -107
3627 -107 -100 -49 -407 -18 -216 -221 -125 -261 -254 -262 -503 -183 -201 -87 -323 110 329 171 -53 40 132 342 17 143
3651 143 400 445 445 99 339 57 -10 330 239 466 -34 23 216 129 -341 -394 -446 -178 -410 -477 -418 113 -192 -235
3675 -235 -244 -322 49 -218 -74 -1 29 -133 -497 122 11 -35 434 276 463 344 273 517 500 126 21 -51 -199
3698 -199 -442 -3 245 85 194 -134 -39 -240 -164 -269 -123 -108 -44 -3 103 -184 -251 153 -192 147 84 83 349
3721 349 382 252 -26 52 375 209 93 304 492 617 328 302 226 27 -449 -252 -70 -37 122 -58 -45 -169
3743 -169 -242 -348 -310 -433 -340 -361 -48 -260 -214 181 -57 102 22 -104 573 101 372 237 52 415 279 216
3765 216 82 -19 -4 75 221 94 328 -318 -250 -68 -18 -78 37 98 -54 -46 -59 208 -150 -384 -308 -358 -128 -85
3789 -85 211 180 4 265 303 425 92 505 179 365 191 422 340 180 234 24 -120 -23 190 35 -189 14
3811 14 97 -410 -285 -361 -296 -418 -294 -43 -331 -190 -228 -41 42 -48 -47 -22 147 49 -79 20 270 82 336 194
3835 194 405 287 -135 442 199 -59 -88 -136 -122 -311 -14 -147 -253 -178 -179 -98 -200 -161 -320 -114 156 -342 -303
3858 -303 -334 114 -71 168 169 -162 400 161 368 513 392 395 387 205 139 53 218 391 276 29 -314 257 -173
3881 -173 -283 -33 -329 -80 -219 -355 -177 119 -163 -402 -509 -40 155 -315 92 -238 162 123 -130 140
3901 140 259 106 323 318 0 -6 257 473 365 -9 -13 388 -267 -188 -263 83 -263 -101 -134 -371 -123 -169 -247 -336
3925 -336 -135 -217 -632 -349 1 135 -172 -113 369 10 -183 138 267 -98 -87 402 373 276 40 102 355 372
3947 372 168 118 -58 281 -155 -81 -156 -89 143 -312 -171 -258 -416 -135 153 -577 -491 -190 -156 -110 -194 144 74
3970 74 269 185 240 318 356 309 291 181 248 169 58 -167 28 194 -104 -102 281 -191 -204 -128 -159 -418 -246 7 -431
3995 -431 -304 -113 -274 -196 -10 -10 -290 -76 86 -46 62 -150 148 250 146 265 253 306 390 345 287 78 227
4018 227 218 -70 -3 315 -123 151 199 76 -91 -349 -288 -506 -223 -241 -336 -206 -220 129 -206 -217 -149 -21 -115 13
4042 13 116 1 282 71 487 276 -255 183 256 128 92 34 296 -156 183 -75 103 -112 -155 -258 65 -271
4064 -271 36 -317 175 -206 -265 -74 73 -290 -322 -338 -218 22 75 33 121 -22 205 358 185 209 316 161
4086 161 306 169 162 75 198 161 248 137 -112 -29 90 -286 -229 -134 -298 -178 10 -283 -309 95 138 -327 -109
4109 -109 91 -309 -74 35 276 158 301 67 351 161 314 417 64 100 353 309 -59 392 184 -2 262
4130 262 395 11 -94 -2 -118 -39 -175 -296 -403 -274 -196 2 -129 -116 194 93 -119 -156 227 6 -36 -169
4152 -169 118 104 96 394 198 64 193 181 322 148 272 266 214 185 -219 -15 33 -97 -480 21 30 -107 -499 -166
4176 -166 -62 -190 -472 70 -237 -312 -370 252 86 58 501 189 29 -113 12 -69 -28 329 214 126 -26 -71
4198 -71 185 73 255 63 -161 -201 90 -86 -183 -101 -251 -338 -71 -87 -118 76 -294 -258 -49 -229 -294 -30 -188
4221 -188 267 255 17 94 -28 293 413 -40 162 3 214 281 224 41 279 68 -202 118 158 37 -162 -105
4243 -105 89 -239 -416 -283 -365 -280 253 -288 -166 106 17 -90 136 86 172 -145 -9 262 11 238 356 -65
4265 -65 328 278 93 308 509 1 -170 -323 -71 275 175 28 -54 -31 -178 -326 -137 -224 -59 -604 -82 -332
4287 -332 -510 313 -19 -132 291 202 -32 -319 140 8 162 -42 474 100 -77 367 388 151 -16 158 16
4308 16 -274 305 -192 -190 25 -27 1 -510 -178 -186 -434 -295 -174 -140 -528 -46 -11 19 -112 382 449 -239 81 -103
4332 -103 461 0 117 267 72 129 330 297 14 451 229 76 203 128 3 -126 -552 -58 -145 -168 78 -204
4354 -204 -325 -110 -338 -273 97 -68 -161 48 -34 -295 130 -242 165 23 232 356 346 210 210 279 177 -143
4376 -143 83 45 49 183 27 -110 85 -233 38 -101 -166 -596 -346 -451 -391 14 -229 -158 348 -25 -486 -6
4398 -6 -115 55 45 281 -37 -233 383 317 180 100 479 64 339 248 222 395 3 103 -160 -247 29 120 -189
4421 -189 -183 -35 -338 -144 -252 -224 -399 -326 -357 -127 -81 -141 -90 -48 181 51 -52 616 126 419 97 -64 239
4444 239 -9 276 38 130 478 76 27 233 15 -71 -117 -26 47 -144 -40 12 28 26 -165 300 -209 -93 -76 -82
4468 -82 -242 -177 -196 -16 223 91 12 192 382 114 335 206 138 258 227 192 -125 -47 129 -191 -70 -188 45
4491 45 -144 -77 -370 -95 -479 118 -211 -368 -97 113 -222 -328 -150 -333 -351 -83 116 72 15 233 184 103
4513 103 -120 469 162 237 248 245 258 284 144 -42 -49 49 -26 -127 263 104 -16 98 -106 -68 -225 -188 -257 -213 -311
4538 -311 -37 94 -8 -186 121 37 62 217 247 382 109 198 -87 141 338 271 -67 14 96 47 115 153 -85
4561 -85 -63 -125 -185 -262 48 -149 -95 -299 111 53 44 -297 51 27 -58 -99 -5 -230 -43 -82 204 -142 -22 57 -22
4586 -22 33 1 239 165 56 262 162 -79 71 -84 -29 -56 -150 -205 -88 201 -323 -122 -381 -72 -352 -293 295
4609 295 23 38 -315 -97 -31 -88 -148 488 -1 56 99 -206 207 243 429 42 30 233 149 167 1 65 133 -225
4633 -225 110 279 -201 182 -249 -135 -50 -458 -336 -324 -190 -203 414 36 205 -167 177 -208 80 -234 77
4654 77 -145 -86 -82 171 188 60 142 159 510 52 -71 -271 113 -60 -32 29 -212 199 -174 -382 -323 170 53
4677 53 0 -138 0 -465 -117 32 -154 -76 -150 349 103 14 -133 79 303 171 348 49 140 624 -102 154
4699 154 254 324 101 55 277 182 -301 39 -238 -18 -509 -291 -172 -303 -143 431 -168 -140 -238 -159 -174 -145 -162
4722 -162 -98 -140 263 399 298 485 -161 306 65 57 26 16 -127 35 -44 69 -142 -70 7 118 -7 -116 -222
4745 -222 -113 -133 -399 -38 -349 -116 39 -284 -63 -278 -45 44 -83 -54 31 23 -145 138 -49 142 111 218
4767 218 236 187 -9 141 360 168 -14 141 -44 -89 -66 -247 -113 -235 -87 -125 -87 -345 12 -324 -374 -372 -103
4790 -103 -202 28 -21 -62 -278 164 219 1 -152 66 343 99 461 101 278 133 451 70 -3 55 349 -212
4812 -212 -90 -51 -111 -115 -370 -131 -391 -327 128 -100 -381 145 -481 58 -105 -332 -76 -139 138 -104 69 16
4834 16 -1 -98 379 44 189 -14 111 -13 83 -155 2 129 -65 -116 218 285 -106 65 327 -215 -309 -411
4856 -411 -328 -203 -382 49 -180 -77 -21 14 -293 -242 501 -198 -102 54 81 301 184 446 336 423 297 326 32
4879 32 75 466 64 -47 49 241 -69 -148 119 84 -233 140 -311 -152 11 -31 -153 -406 -102 -148 -38 82
4901 82 107 -64 44 176 111 122 45 241 70 150 227 46 79 218 -56 303 -120 120 297 -146 -186 -177 19 -31
4925 -31 -251 -238 -349 -20 -83 -307 -53 -51 -199 -266 -163 74 -193 37 99 199 -81 265 378 185 -150 66
4947 66 194 303 60 214 208 125 270 75 -23 134 107 -8 -299 0 -189 -421 -213 136 -127 185 -235 208
4969 208 -226 65 -208 -37 -127 -144 103 -109 -6 48 173 -220 55 -217 -142 109 205 395 -192 333 166 -46
4991 -46 -152 -120 75 -245 -194 -163 71 -193 177 -234 -262 -112 -381 -38 87 -36 46 178 216 173 -159 -129 -100
5014 -100 -332 20 170 244 197 422 345 175 76 58 69 -147 37 48 -94 -164 -70 -161 321 -392 -265 -32 -211
5037 -211 -371 -60 -126 -329 -111 -114 -33 24 -124 69 -290 124 276 -103 -13 67 201 253 -81 323 210 33 54
5060 54 306 -64 -40 39 -39 85 -81 -475 -251 -82 -251 -538 138 -104 -162 -113 -276 118 -185 -224 -228 -129 48
5083 48 297 8 95 10 90 388 -189 464 120 57 -113 235 249 -73 145 139 99 -175 82 -51 -10 -30 77 -477
5107 -477 -210 -303 269 -496 -412 57 -177 -102 -25 -240 121 -17 -31 110 -184 148 200 31 115 439 222 13
5129 13 -69 -3 127 -63 117 -360 6 19 -22 -174 -68 -236 -85 -163 -41 13 -28 -201 -135 146 -24 -151 -73
5152 -73 -147 -53 -53 63 48 -24 -78 12 244 -84 219 242 205 141 127 113 124 47 193 61 276 -332 -150 -96 -210 121
5178 121 -206 287 -176 -60 103 114 -149 -10 -4 -147 -190 -67 164 34 35 261 -218 336 410 180 -4 -260
5200 -260 90 326 56 439 -47 25 266 173 -352 -79 -212 111 -51 -68 -21 50 -18 -112 39 -237 -212 -6 72
5223 72 173 122 -155 55 31 326 108 -62 42 226 99 -15 258 193 83 -25 109 -58 144 -1 11 42
5245 42 -305 1 -48 -136 -291 141 80 -42 230 -248 -99 -167 -79 273 123 79 -162 -53 186 101 -115 -91 50
5268 50 42 203 138 327 -94 131 165 -133 -19 82 -3 -100 -132 -14 -121 -102 129 -64 65 3 -231 -237 -163 -65 -195
5293 -195 -256 98 26 -105 -202 -27 -43 119 232 467 345 -45 120 -31 -26 -336 163 145 -205 -3 -17 1 -86
5316 -86 248 -117 -50 302 -136 -211 40 154 -16 -181 -9 -260 -46 -267 42 57 202 178 17 44 -319 49
5338 49 251 -38 27 97 198 132 3 106 -17 155 63 56 -119 232 214 -197 -150 -359 -263 -49 -196 51 -32 -4
5362 -4 -40 -298 104 39 -270 -306 43 -101 -23 227 -10 74 -357 64 174 324 361 268 99 183 79 -86 107
5385 107 -182 34 4 178 313 270 108 -197 150 36 -188 -143 -69 -303 153 -240 -15 22 56 1 -30 49 98
5408 98 323 -110 -158 -35 -35 -100 -192 -101 -56 153 -26 -58 -85 -126 243 130 -192 184 -1 -119 -264 55 31 47
5432 47 -71 -75 -247 -338 84 136 -228 28 274 -55 117 190 14 229 195 453 -58 167 -16 -22 -10 361 -30
5455 -30 37 108 210 176 -15 208 -83 74 -82 -58 -193 -13 -83 -47 -147 -137 -134 -281 -7 -91 33 -165 163 -56
5479 -56 -42 223 119 -48 20 33 175 12 -20 251 5 -147 347 40 84 -45 137 204 -217 2 29 16 -53
5502 -53 -142 -20 34 -186 -148 -48 -190 -357 -164 -100 -10 -129 -80 -197 98 222 310 -24 340 -105 81 306 -111
5525 -111 -267 -65 -138 88 -235 309 -136 -112 -134 -256 -229 -111 -185 187 -436 -78 109 -126 -63 -163 5 150
5547 150 153 9 34 -44 238 372 -68 301 157 277 327 60 -59 155 -190 252 223 -103 -213 256 38 -47
5569 -47 271 -73 12 -52 -175 -233 -140 268 -181 -339 -8 -279 -28 -149 -271 9 -152 91 -41 184 116 -36
5591 -36 117 249 -16 97 164 -47 -198 88 188 82 62 -360 -136 -186 -108 -361 136 33 -281 -151 -317 -51
5613 -51 75 -5 -196 -49 -241 91 -61 113 -52 -14 246 -195 283 -12 190 94 285 126 -222 276 41
5634 41 209 47 222 -7 -64 -70 -48 -81 -330 -9 -55 82 -174 190 145 97 326 44 -252 -63 -118 -154 -74 -83 87
5659 87 228 34 176 -94 -89 188 -213 -24 -53 -252 -43 -86 93 -98 4 100 287 40 -73 -58 -135 -121 -281
5682 -281 -220 -82 -6 -61 -91 -205 6 -78 -85 -170 45 62 102 166 -116 -32 159 243 183 -97 72 116 14 262 -169
5707 -169 104 260 -108 19 -43 -72 162 155 130 -23 -198 -348 38 167 -227 -168 -182 127 96 -204 -80 173 217
5730 217 74 217 -41 89 41 440 167 -109 93 383 157 149 264 -231 -157 85 -171 241 134 -8 -116
5751 -116 -242 -109 -238 -115 -301 -2 67 -11 -17 2 -195 166 85 420 -72 196 -146 147 125 190 90 -88 188
5774 188 173 94 -46 155 280 -164 322 99 -307 -157 -163 -354 -186 106 -135 -317 -338 182 0 148 159 -126
5796 -126 -90 152 -248 79 197 -12 62 122 29 -4 13 212 129 113 -185 -359 27 53 -7 44 77 13 -33 123 17
5821 17 -205 26 -14 50 -219 209 64 -132 -138 -318 25 4 31 -12 3 -18 -71 0 -77 89 81 -19 186 186 79 8
5847 8 135 -242 -153 60 184 -282 -161 256 -169 0 -159 -163 180 69 -104 -56 -23 -229 -172 -37 -273 144 -135
5870 -135 53 106 91 192 232 293 37 67 196 197 71 -135 131 305 36 194 -6 -94 -104 59 -112 -55 -88 -101
5894 -101 -228 147 -216 -149 -33 -19 238 -85 -114 34 -147 31 -123 164 111 -215 87 52 -14 179 237 58
5916 58 209 30 -79 98 -293 -46 152 9 447 -114 271 -203 -59 171 61 -10 145 21 149 -168 -183
5937 -183 -241 -145 201 -101 -39 -166 205 129 -5 -137 183 375 40 86 129 24 193 87 197 61 -96 24
5959 24 -266 14 177 -27 -176 -54 -100 53 184 -222 -15 -377 -37 -247 -38 -83 137 121 -290 36 131 152
5981 152 107 201 116 196 156 88 78 398 508 -72 45 83 -30 137 96 230 125 -152 -273 -31 -55 -285 164
6004 164 258 -312 39 -121 179 -165 31 -189 294 -76 -278 25 -51 102 41 242 163 -230 -75 157 164 -137
6026 -137 74 -188 193 -31 78 76 -140 130 -84 -22 -281 -138 -85 -104 -31 -264 -75 -84 -90 -71 85 80 61 -91 -150
6051 -150 198 9 136 -363 330 -37 248 -49 -70 144 -97 88 189 38 83 -123 260 -30 -67 1 -80 -76
6073 -76 -261 -109 -57 -253 -255 122 -350 -299 -85 -138 -23 -83 64 -42 118 182 75 195 -86 124 -145 -97 160
6096 160 3 217 178 -92 -71 485 -128 -179 84 -30 -99 -205 -154 -137 123 28 -182 -87 88 -325 -25 -193 -396
6119 -396 -228 -350 -94 86 202 48 -66 357 351 -48 180 -61 -94 213 -65 87 -111 -33 91 229 -41
6140 -41 -109 -67 -59 -261 -157 -184 -225 -44 48 40 50 -66 -292 135 -245 -183 -145 -69 -78 -141 48 65 35 177 74 104 208
6167 208 9 85 68 93 -256 13 33 58 -91 290 -133 212 -35 -92 -165 -60 24 70 67 -19 -378 -61 -99 -205
6191 -205 -65 47 112 -333 -187 -33 60 -53 53 -119 115 -81 -100 117 -289 214 -15 39 185 -176 -60
6212 -60 -226 29 166 169 -429 -80 -47 -220 104 -347 -213 -442 -41 -36 60 -103 -166 -129 401 -187 48 126 22
6235 22 1 -18 195 84 199 -181 -16 121 35 302 288 25 79 64 -241 -179 -213 -152 -75 -282 148 219 -339 -59
6259 -59 -59 -68 -50 46 122 -101 81 12 -110 -33 209 135 107 -30 -227 -149 131 150 123 -104 -319 184 311 -139 288
6284 288 74 160 149 -216 409 -113 355 178 -26 -217 -118 -100 176 -150 -56 33 218 -38 96 132 73 -51 -53
6307 -53 234 191 -221 116 348 469 -49 -29 426 -41 -260 -224 -63 -99 101 8 -128 -111 38 -240 -237 -336 -99
6330 -99 -23 25 110 -28 204 -119 -271 -45 55 78 272 -376 360 157 95 88 190 342 -110 111 200 10 -66
6353 -66 71 34 129 -182 -93 -86 63 146 -280 -179 -248 76 162 -384 -450 283 -216 -265 36 -252 151 126 8 -86
6377 -86 -169 -126 48 96 189 23 -319 60 -4 305 -55 320 21 -78 -33 211 -6 112 -159 124 -199 -409 33
6400 33 -234 -71 -126 -168 -106 -206 33 28 -177 72 11 74 146 65 31 370 64 148 50 -68 138 -128 6 -4 114
6425 114 86 -40 442 57 148 -109 -17 42 193 -237 -204 -133 87 -206 -62 77 -79 -161 -27 -358 -60 0 -284
6448 -284 155 36 149 53 53 102 124 86 -99 -148 277 -282 73 6 169 -67 128 20 -190 15 -97 -183 -180 59
6472 59 -79 -389 -252 -105 -172 -46 85 188 -94 -231 12 -60 122 214 46 -30 -119 -35 -92 -27 361 192 91
6495 91 -72 265 -233 -41 -159 -183 20 52 -299 -172 71 82 -141 -210 -154 -218 -138 287 -137 241 -52 194 282
6518 282 32 -20 22 -69 63 -27 246 -79 -62 155 52 81 113 11 61 366 -162 -195 247 82 -95 -101 90 -176
6542 -176 28 -74 42 -43 33 145 84 -64 111 -403 179 95 -107 -43 173 60 191 -330 72 426 -15 50
6564 50 130 -12 196 194 -242 226 19 115 -28 142 73 -78 -27 248 -173 85 48 34 -290 -260 129 57 -118 257
6588 257 -221 -234 103 96 117 37 -250 49 240 246 -34 -9 273 5 226 -242 -30 191 -82 -97 225 -224 85
6611 85 -86 31 -24 -54 92 -160 157 -56 67 136 -215 4 -213 -93 -63 60 16 31 -145 -68 307 -25 -62
6634 -62 -257 -216 -71 -12 68 46 -57 -149 -27 136 -112 198 135 104 -185 -168 -181 -411 -194 46 -21 -88 -191 -91
6658 -91 1 -366 -107 -183 -23 -77 112 184 61 217 203 -54 16 -48 -391 -90 -118 -334 103 -18 14 -112 208
6681 208 46 -96 -35 112 -64 -77 80 -87 177 -283 121 298 36 131 -29 285 127 -195 299 106 -45
6702 -45 -17 -106 88 8 120 321 426 -41 63 57 -210 -23 26 -62 -11 170 24 -51 15 -75 -103 -243 -19 -114 -60
6727 -60 -49 31 267 -197 256 183 69 60 311 106 274 -99 -134 251 215 516 -261 51 131 276 154 -13 104
6750 104 -162 84 -56 27 -79 290 -26 -127 25 -239 -139 -118 -171 3 113 10 -62 -102 -179 -56 -328 335
6772 335 178 -153 197 -191 168 56 114 64 -281 90 -272 134 -82 -81 111 3 25 125 57 -133 132 -60
6794 -60 -13 119 59 6 -49 -199 -64 7 140 136 -125 -63 147 -64 99 -20 -66 -81 44 -84 85 -20 102 -65
6818 -65 65 120 14 -79 216 -1 62 -122 -125 305 123 34 -27 -151 -110 -12 137 -74 294 -133 157 243 -109 -147
6842 -147 23 66 124 -139 246 -3 -56 159 113 -49 248 114 58 117 -138 -40 -145 66 88 -76 -147 -20 -88
6865 -88 -221 253 -42 -480 -55 -93 249 -33 -8 105 207 189 -318 -63 -104 166 -96 -157 19 161 11 341
6887 341 -35 117 -31 159 -138 61 -258 -67 -49 166 -115 -184 175 -24 -142 273 88 -155 -47 -157 44
6908 44 -126 140 -296 -66 62 305 -103 283 -155 185 31 -232 -97 -59 303 168 373 191 56 -139 15
6929 15 281 -44 134 15 198 278 -144 -164 -256 322 277 -34 -57 -259 -132 -158 95 346 -218 -203 -173 -157 -77 -72
6953 -72 -7 -146 123 89 222 183 108 336 221 -373 -9 128 -95 -90 130 79 19 -90 -136 -5 -68 95 65 128
6977 128 39 -135 -255 359 20 50 -298 -41 -23 -175 229 112 300 62 325 -16 35 91 263 123 -26 255
6999 255 -21 -146 107 -185 -166 192 119 -187 125 -353 -63 135 -137 -18 -248 20 -231 -2 -125 76 -121
7020 -121 359 184 -115 247 20 43 -97 227 -259 251 -144 162 -118 -38 173 130 -82 188 80 242 177
7041 177 -89 -67 -82 -29 13 212 287 156 -248 -33 -38 -164 111 46 -86 157 177 132 -119 145 52 -138 60 75
7065 75 59 24 110 91 152 371 -116 26 6 -104 298 57 -118 -15 228 155 -43 293 0 -347 266 -17 -430
7088 -430 161 183 7 195 217 265 74 -91 -1 18 -103 169 -343 186 176 -232 -288 -73 138 142 169 -135 253
7111 253 185 -139 -118 -315 4 16 -28 -64 -32 22 -285 -332 332 -14 -39 -211 -320 62 74 -191 -140 122 242 -190
7135 -190 28 -60 -78 -36 124 -56 176 -93 105 -20 -66 -120 -64 176 -103 -175 -51 -16 163 -24 -87 -245 132
7158 132 -267 -140 -16 -35 -121 -82 -75 -42 116 109 168 201 -208 18 -93 61 -309 170 135 16 251 -7 140 113
7182 113 53 -158 73 -284 83 69 174 -91 -55 -176 191 103 -149 71 -117 257 88 21 -149 26 -110 -70
7204 -70 118 411 -203 -52 -93 17 -238 162 -245 -107 -45 -260 -42 -90 37 -266 7 485 307 -205 130
7225 130 -15 7 153 -132 28 245 -242 -68 -26 -91 302 154 115 53 60 83 -201 -48 -10 -178 209 -66 73
7248 73 -22 21 211 231 -3 -13 -145 101 23 -74 -42 -98 -55 -184 -77 -32 59 18 -63 152 116 46 -85 8 5 87 -47
7275 -47 117 10 -186 -401 -3 -102 199 -64 138 273 -95 7 109 -76 -14 -147 183 31 323 290 107
7296 107 -163 -238 -190 161 16 189 89 24 -51 80 232 -123 66 -52 -2 -141 111 -227 19 57 -151 -64
7318 -64 -143 14 -177 -187 25 76 355 55 -54 -77 -71 -148 87 -107 166 -184 -40 -89 64 7 -76 247 358 49
7342 49 216 50 120 22 22 123 -148 55 122 -68 60 -159 -93 -126 180 134 -57 85 174 152 -290 9 -76 -242
7366 -242 4 -164 110 -118 -97 62 315 191 -206 265 -93 -147 -125 89 329 122 112 -124 20 -147 -93 -147
7388 -147 428 -142 -196 -217 -146 -498 -111 -40 -288 -50 5 56 4 -86 -146 190 -290 -205 71 19 265 178 158 -39
7412 -39 -176 -16 -77 -87 29 -34 -207 111 56 231 216 -486 57 194 139 281 316 -185 -147 -40 108 50 -69
7435 -69 -308 -102 -7 -206 -195 20 221 -121 -24 -378 -149 -121 -253 -268 15 -474 48 -15 -67 -108 -207 9 290
7458 290 35 -27 102 -1 -49 229 67 483 -40 123 -326 97 179 -148 132 -14 -308 78 -24 5 119
7479 119 118 95 167 -56 -30 123 -111 38 88 -311 127 230 80 -19 81 143 163 -83 23 -91 -50 -197 -39
7502 -39 71 99 -14 66 121 -186 -323 -186 194 9 3 147 -47 -242 25 -148 101 56 63 -150 -132 78 162 102
7526 102 164 -261 76 -5 160 170 -81 18 -43 31 -318 23 -84 -147 -116 23 -16 -113 -368 -241 -39 -183 55
7549 55 -330 -35 314 -202 -329 -394 -117 59 -7 92 -226 110 47 -3 128 -155 -181 -46 146 39 -326 136
7571 136 98 180 -393 -172 -89 -339 -153 485 202 -194 120 -170 198 52 -80 -24 87 -228 30 -157 42
7592 42 -79 61 75 332 -57 -128 -111 -72 44 125 -34 34 112 -250 -2 -218 175 -79 103 90 77 186 -186
7615 -186 -51 74 50 -123 -38 -204 -478 -92 317 1 -46 207 84 -278 152 -10 117 44 -111 -98 374 -93
7637 -93 -87 34 -20 -242 -288 -122 -68 180 43 231 32 165 -62 -364 -46 67 155 124 -116 -181 311 -157 192
7660 192 -150 69 -57 -15 219 -72 -130 146 -238 -29 246 162 181 -118 70 103 -127 -128 -276 -170 -137 39 111
7683 111 -172 -119 -233 76 -35 -186 -144 134 309 209 -40 5 -17 -171 -129 -47 57 20 -174 137 -12 -329
7705 -329 -121 -26 -409 -120 -266 -29 169 61 -203 60 242 -61 76 -246 -48 -133 89 -101 126 -16 -140
7726 -140 -154 -26 -56 -121 195 59 161 -59 55 -545 8 -67 -54 53 121 120 85 -42 -35 -200 58 194 334 -159
7750 -159 -287 324 35 309 295 -81 -227 -155 86 -6 73 13 41 -55 122 -71 110 29 226 131 71 -28 57 -62
7774 -62 45 -163 -29 442 140 -5 124 186 44 14 -154 285 29 -56 -153 -7 -40 238 -71 188 2 -149
7796 -149 -102 108 -83 -119 113 -97 -100 -375 157 -12 127 115 -155 -35 121 8 0 -92 112 172 104 -26 222
7819 222 -62 -114 329 282 25 -262 -19 5 11 -126 20 151 27 286 -43 -353 -49 188 104 -157 -306 9
7841 9 156 -1 56 196 2 -68 -371 18 -29 49 -90 -9 216 -56 108 51 -168 -44 -165 -20 30 -111 163
7864 163 -14 -208 -219 -180 -135 32 114 -287 -128 -273 189 -110 0 -60 13 -162 235 -76 -76 -6 -34 -208 -11
7887 -11 39 161 185 76 168 -6 -241 -67 -167 332 95 42 68 -42 83 207 -9 28 108 57 127 -59 -29 142
7911 142 96 93 35 -55 37 -68 -37 213 -185 -99 137 32 -229 120 77 -152 -291 -246 -33 -82 -208 298 240 -90
7935 -90 217 -236 52 14 41 -54 170 -5 165 2 78 -119 121 300 -242 285 -131 11 67 97 77 -228 -105
7958 -105 -62 -6 -102 4 82 -72 161 11 245 -203 171 -116 -174 -211 83 -18 18 30 317 -286 -469 239 -28
7981 -28 -193 -295 119 -71 166 336 -126 1 -13 -4 71 120 -74 241 -80 -101 360 226 90 -52 -38 -200 -32
8004 -32 -77 -241 -237 -130 198 262 -66 -137 -161 -76 -244 -75 -63 113 -194 80 -467 137 416 -93 -142 -67 -7 187
8028 187 369 141 -73 73 -47 173 -293 -227 -140 -99 92 32 320 114 -86 68 -138 -165 -46 -30 98 42
8050 42 123 -35 77 35 38 66 224 64 -196 102 286 -147 -260 -157 -66 -160 -76 52 17 -115 20 46 162 70
8074 70 -169 -73 -50 -46 -81 -92 19 -74 152 79 10 -155 -172 -152 135 98 -135 21 76 54 418 -417 91 186 -54
8099 -54 76 177 -72 80 -265 -66 450 90 167 87 118 2 348 68 -105 -57 30 -41 -67 -108 -12 -85 -18 -168
8123 -168 -166 64 -47 -201 -89 -44 276 -135 19 -95 325 -43 -189 -32 173 140 154 -76 58 76 -31 278
8145 278 -36 -84 45 -252 340 -43 56 322 -140 -295 -137 -109 255 197 -325 149 246 57 57 -142 147 -35
8167 -35 71 -284 -137 70 22 -264 104 71 94 351 -77 -147 70 -207 69 99 134 149 93 -47 -248 251 -163
8190 -163 28
8191B8
$$ Imaginary data points
##PAGE= N=2
##DATA TABLE= (X++(I..I)), XYDATA
0 0 0 0 0 0 0 0 0 8 -8 8 -8 8 -8 16 -16 17 -24 25 -32 38 -41 49 -57 65 -75 86 -98 111 -125 142 -159 177
32 177 -200 222 -248 274 -305 339 -375 417 -461 510 -564 624 -692 769 -857 957 -1072 1208
50 1208 -1372 1573 -1823 2146 -2579 3198 -4145 5759 -9029 18185 -93269 -324718 7678
63 7678 205433 -40032 -171187 61238 146277 -36940 -99442 29032 54975 -22273 -43959
74 -43959 -19650 -3669 35083 36871 -23516 -40653 15084 23624 -14225 -1489 30242 10379 -2840
87 -2840 19746 11087 -20906 -9409 8649 -15291 -24159 12045 30059 11181 -1706 722 2679
100 2679 2098 -19325 -43838 -13923 33286 7406 -37925 64 45431 -771 -42181 1124 23621
113 23621 -16425 -14085 29458 15587 -17764 4075 11756 -26413 -13481 41118 23019 -24113
125 -24113 7420 45478 1637 -34580 -3091 5271 -26930 -13817 23654 12871 -4546 11669
137 11669 5529 -24376 -10100 15859 -13044 -38644 -1430 27855 568 -15310 6154 11385
149 11385 -9109 -12452 5397 20434 15067 -10195 -20121 12272 29396 -11990 -33661 13444 34862
162 34862 -10230 -15323 38559 32143 -32271 -33622 15025 9704 -23846 -13238 7024 0 93 10493
176 10493 337 -5865 3406 -10003 -26097 3239 24199 -12158 -26980 16495 21856 -21560 -11178
189 -11178 35094 14387 -25560 5027 35451 -3653 -28628 7622 20012 -12167 -13887 13239
201 13239 13244 110 2871 2847 -2620 1602 -5798 -21957 -7011 16153 -5765 -28445 3262 27108
215 27108 -4455 -21774 7856 14312 -14194 -13609 10824 7098 -8415 -3207 3467 2938 9904 10504
229 10504 -2351 1971 14967 2200 -10506 6639 10360 -15455 -12933 16631 8562 -18047 457
242 457 22028 -4408 -22120 6160 13683 -17764 -20889 6050 3720 -14337 -6021 6401 2449
255 2449 4083 8085 -2315 -3642 7740 -2237 -17513 2808 21491 -2417 -15397 16055 24624
268 24624 -9151 -11613 18543 11121 -16620 -4903 16011 -657 -17533 -3463 4169 -5093 -3148
281 -3148 4036 500 -490 2730 -6303 -9593 2534 -1871 -18782 -7285 15539 2520 -13064 10115
295 10115 24201 -3297 -14683 9416 11556 -11774 -8307 11628 6923 -3332 4140 6147 368
308 368 4650 4016 -7549 -2168 11765 -1688 -16952 400 8937 -16127 -19481 11022 11933 -13519
322 -13519 -4060 18853 2435 -18796 -3948 6434 -10703 -12556 5560 8243 3287 9801 8053
335 8053 -1950 3390 7735 -8188 -7852 14284 10798 -13508 -3423 18545 874 -19118 1490
348 1490 16618 -5335 -11929 8603 8629 -11435 -11374 -2200 -7164 -9327 -518 768 749 8816 5539 -5424
364 -5424 1070 6956 -10632 -16368 6453 12649 -7406 -1899 20868 10450 -10752 993 13953
377 13953 -2644 -11572 4604 8813 -1939 -767 1707 -6868 -5177 2372 -3987 -5201 10232 7190
391 7190 -13833 -7403 11607 -5750 -26173 -4839 13979 -5262 -9483 17685 17855 -9787 -8200
404 -8200 10391 393 -12401 2060 10047 -2288 -1002 11301 6394 -1979 4226 2589 -7078 304
418 304 9367 -2017 -6612 5536 397 -17822 -7980 11510 -169 -14606 2785 14097 -2358
431 -2358 -10086 1965 -287 -12525 -9015 916 3159 7402 9257 277 -1417 9259 4929 -8921
445 -8921 -1078 9695 -2537 -8112 10789 14524 -6147 -7205 7257 -356 -10843 4267 12512
458 12512 -5076 -11455 1960 -69 -10531 -4256 1023 -7112 -3802 8089 2434 -4244 6813 4908
472 4908 -15103 -11264 11279 5581 -11938 795 17642 4246 -5787 7637 10505 -4703 -6684
485 -6684 2656 1752 941 5815 15 -6172 1159 3200 -6953 -3139 9102 -326 -12691 -185 8822
500 8822 -7709 -13166 1769 -144 -12701 -581 15218 3340 -6878 3538 4780 -5916 -1323
513 -1323 6548 -2984 -6370 7371 7654 -1425 7563 12299 -6937 -12142 9754 10842 -10075 -5894
527 -5894 10776 -1920 -15187 3489 13127 -8251 -14467 3737 4876 -6777 -345 6536 -6098
540 -6098 -11860 -478 1902 -3328 1823 4712 -2442 1432 11375 4059 -6007 1707 5052 -7235
554 -7235 -4227 12632 8373 -6097 -292 9533 654 -5945 2085 3627 -4693 -3818 158 -2096 -1272
569 -1272 1337 -5397 -7788 2232 3202 -7570 -1387 10346 -1341 -13961 -333 9944 -4779
582 -4779 -8258 7606 7248 -5412 1864 13209 3672 -4435 2479 1593 -5680 2281 9280 -1922 -5599
597 -5599 6732 4700 -6697 241 7628 -6373 -12691 3730 7453 -8174 -6448 4321 -3886 -11471
611 -11471 2424 9314 -3788 -6294 4822 2966 -3264 2280 3041 -5669 -3052 6219 3640 241
625 241 7785 6376 -5147 -276 10133 1017 -8705 362 5671 -4559 -3377 7842 2035 -9276
639 -9276 -1999 4707 -2694 -5108 1048 -1922 -6712 673 2313 -6220 -3585 4356 -1279 -5677 6508
654 6508 9351 -4866 -5252 9202 4502 -8867 -822 10182 104 -4641 7847 8551 -3568 -2233
668 -2233 5706 -170 -5065 1449 631 -6075 -772 5072 -3295 -6668 2066 491 -8167 -1792 6689
683 6689 -3272 -9508 1962 5212 -4599 -3750 4923 773 -3966 4068 7818 613 -756 3703 299
698 299 -1460 4333 3103 -4070 887 7003 -91 -2628 5035 2390 -8437 -3681 6281 -1430 -8743
713 -8743 181 2894 -5954 -4144 4491 -1229 -7487 930 4521 -3705 -2063 5653 -1163 -6656 3950
728 3950 7111 -4124 -2447 9204 4221 -4578 4406 8999 -4223 -6590 6725 5210 -6449 -1380
742 -1380 6776 -1109 -6090 3672 3386 -6081 -4083 1927 -2951 -5088 2262 236 -7016 -1448 4434
757 4434 -2807 -5298 4385 3260 -5384 45 7857 343 -4949 3200 5114 -2402 -87 6651 1980
772 1980 -1657 4237 3497 -2963 -14 3082 -3425 -3672 4434 1103 -7298 -1597 5361 -3569 -8030 2684
788 2684 3106 -8738 -4977 6279 630 -7628 352 4696 -3174 -3061 5260 2753 -3129 2317 4857
803 4857 -1427 -99 6227 1332 -4208 2828 6566 -1989 -2057 5574 2296 -5576 -767 4078 -2914 -5040
819 -5040 1631 596 -5472 -1496 2029 -3114 -4235 913 -693 -4016 850 2837 -2958 -1716 4165
834 4165 336 -3775 3777 6474 -2935 -3170 6690 4420 -3590 1745 6538 -1649 -3904 4416 4050 -3591
850 -3591 -601 3778 -2968 -4684 3602 1082 -7524 -2456 3842 -3000 -6110 3340 2419 -7880 -3830
865 -3830 6173 467 -6269 1621 5115 -2810 -1892 6698 2967 -3584 1626 4782 -940 -70 5836
880 5836 1360 -3548 2442 4688 -2590 -2156 4775 50 -6340 -46 3518 -3610 -4524 1965 -301 -6115
896 -6115 -1462 2642 -2406 -3153 1589 -744 -4408 1132 3667 -1661 -1827 3797 613 -2645 3948 6623
912 6623 -1698 -1973 4661 2679 -2828 3037 5377 -3506 -4740 3619 3657 -2824 -356 1935 -4330 -4879
928 -4879 2560 1274 -4994 -2839 -308 -4488 -2601 5307 1227 -6352 -1488 3772 -938 -1987 4701
943 4701 2415 -5244 -1296 6917 1872 -1517 3180 2294 -2586 1664 6663 740 -3382 1200 711 -4076
959 -4076 46 4362 -2331 -5339 1474 2231 -4510 -1783 3074 -3379 -7149 563 3034 -3781 -2365
974 -2365 3476 -91 -3762 2536 3481 -2246 -187 5144 565 -2790 4385 4991 -2666 -1473 5996 1676
990 1676 -4001 3313 6294 -2533 -4416 2920 371 -5575 -865 2720 -3754 -4703 2360 1393 -4155 -491
1006 -491 1584 -4985 -5013 3183 2315 -4015 -536 3358 -1334 -1331 5911 4397 -3385 -748 4675 1503 -462
1023 -462 3717 1947 -4329 -740 4470 1080 -797 2377 206 -4060 632 4225 -2743 -6067 -743
1038 -743 -861 -4789 -151 4553 -1540 -5063 1468 2200 -2810 -1476 2573 -2138 -4023 3171 4598 -1368
1054 -1368 105 4368 783 -1483 4287 4183 -1804 -256 3650 -612 -3561 2092 2143 -3926 -1680 4080
1070 4080 -68 -4110 1077 2474 -4567 -4688 951 -1492 -4410 311 2858 -1938 -1106 3413 455
1085 455 -2452 2340 3096 -2697 -1387 5012 2893 -2450 1738 4443 -617 -1335 4439 3070 -1856 90
1101 90 2463 -1686 -2784 1080 -1061 -4241 -414 2574 -1497 -2186 2357 -328 -5196 -1612 1370 -3254
1117 -3254 -4016 1921 1762 -2176 864 4773 175 -2150 2532 2765 -1264 767 3452 -255 -1631 3246
1133 3246 2456 -1988 139 3945 -75 -2058 2429 2318 -3995 -3358 880 -2001 -4968 184 2191 -2653
1149 -2653 -1580 3148 113 -3300 -359 601 -2982 -1783 2811 999 -1102 2716 3527 -403 708
1164 708 3685 636 -1555 2390 3180 -1434 -1091 2609 -21 -3228 1070 2351 -1641 -733 2820 -369
1180 -369 -3837 -529 -511 -5363 -3452 2431 -910 -3454 2654 4402 -2758 -3016 3969 1237 -5347 -628
1196 -628 4851 289 -1912 4038 4302 -1196 -88 3768 813 -1618 2359 2395 -2043 -1219 1873 -1299
1212 -1299 -3407 368 681 -2433 -300 3023 -833 -3841 -460 -433 -4988 -3111 1648 -128 -2447 1744
1228 1744 4069 -35 -416 1899 -16 -1670 748 1857 -316 1521 3198 585 -246 2798 1333
1243 1333 -2114 143 3500 -720 -3135 829 989 -4390 -3220 1287 -424 -3800 880 3312 -1562
1258 -1562 -1930 1139 -1638 -4936 -858 1509 -1556 -984 4007 2672 -262 2100 3264 -1077 -1265 2068
1274 2068 1295 -1218 1583 3236 -693 -987 2660 554 -2566 675 2427 -1767 -2711 1110 -907 -4756
1290 -4756 -1990 537 -2303 -2797 2257 2328 -1223 233 2044 -1942 -3714 287 983 -1660 694 4177
1306 4177 1149 633 4418 2849 -2175 -396 2492 -726 -2463 2822 2315 -2846 -1611 2673 -297
1321 -297 -3446 1272 1455 -3401 -2183 2685 -848 -5659 -1729 -79 -3191 -1931 3500 1865 -1112
1336 -1112 1301 2448 -1673 -1676 1635 -926 -3155 1590 4823 842 666 4295 1920 -1718 433 2441
1352 2441 -1282 -2237 1234 213 -3072 -518 1428 -1981 -2885 682 975 -1296 413 922 -2355 -3237
1368 -3237 -483 -1725 -3309 812 3051 115 20 4333 3294 -1188 -418 968 -1344 -1870 2345 2420
1384 2420 297 1952 2773 -278 -508 2668 444 -3154 -1522 989 -1489 -2114 750 -1342 -4916 -1497
1400 -1497 2590 -267 -1417 2055 1442 -3315 -1706 1531 -962 -3606 -205 2179 493 3262 5117
1415 5117 1339 -1240 1540 1632 -2264 -842 2693 173 -2321 1754 3293 -606 -1036 852 -1314 -2888
1431 -2888 415 1284 -3099 -2923 623 -1927 -4151 29 1851 -1219 -928 3481 1338 -1638 751 1421
1447 1421 -2950 -2768 1871 1872 -385 2677 5047 737 -262 2696 1049 -2346 -414 1243 -2063 -1732
1463 -1732 2592 1454 -2693 -988 1066 -2034 -2587 1429 848 -2993 -2405 292 -2215 -2427 526 -106
1479 -106 -2313 722 4593 1506 -289 1884 849 -3057 -1194 2856 920 -804 1895 3026 1214
1494 1214 1687 2222 -982 -2999 -195 215 -1966 -637 1188 -1740 -2911 504 992 -2507 -1564 1029
1510 1029 -688 -1842 848 730 -2641 -2488 422 -18 -234 3043 2804 767 1459 3312 178 -2029
1526 -2029 295 605 -1862 -85 3835 1897 -1092 1307 2330 -1452 -2377 143 -1174 -2365 -259
1541 -259 538 -2644 -2098 802 -1152 -2344 868 2156 -1365 -1408 2410 920 -2750 -1398 934 -619
1557 -619 -198 3686 3289 455 1815 3224 -276 -1018 854 -457 -3155 -95 3059 1067 -1299 703
1573 703 1148 -2029 -1492 671 -1755 -2980 -568 -13 -1925 -800 323 -1909 -2247 1690 2220 -170
1589 -170 883 2501 -450 -1536 737 1038 -1803 -537 2952 2901 1459 2552 1849 -1003 -896 22 -1341
1606 -1341 -2545 -78 428 -1220 -74 1927 -610 -2787 -966 238 -1416 -1237 6 -1351 -1939 391
1622 391 345 -1919 -582 1770 848 -62 3184 3233 -853 -1527 1191 62 -1763 748 2117 188 1081
1639 1081 3747 1792 -1301 -802 -349 -3039 -2176 158 -399 -2680 57 1695 -1171 -2113 825 -567
1655 -567 -2673 -536 2044 -276 -2067 203 930 -1431 -217 2144 1130 321 2777 2966 120 117 688
1672 688 -1190 -2479 719 1424 -440 561 2765 1020 -769 197 -947 -3529 -1961 -146 -1139 -2477
1688 -2477 376 937 -1512 -814 1053 -128 -1313 511 1767 -117 -151 1232 -688 -1745 748 1768
1704 1768 -84 1216 3372 1970 -79 1297 679 -2337 -2695 123 -672 -1218 953 2139 -529 -421
1720 -421 928 -1071 -3322 -1391 -164 -1877 -1540 1173 -166 -1899 -351 1301 -291 -439 1865 1776
1736 1776 -507 1027 1788 -608 -1291 935 501 -815 1770 3492 1166 114 1731 393 -2753 -2035
1752 -2035 -437 -1978 -2323 896 1192 -775 -345 506 -1225 -2165 -396 -416 -1944 -543 1192 -492 -718
1769 -718 1509 1018 -916 413 3007 1602 -254 1700 1812 -1041 -777 831 -341 -1090 1628 1974
1785 1974 463 943 2168 -645 -3203 -1456 -409 -3073 -1895 893 132 -1303 164 1182 -952
1800 -952 -1355 27 -581 -1765 827 1940 -377 -813 1343 257 -833 1409 2651 650 362 2250
1816 2250 1393 -1093 -586 475 -1451 -1738 423 1091 -124 1370 1322 -1250 -1983 -455 -1352 -3400 -1182
1833 -1182 576 -726 -852 1568 1496 -1509 -984 847 -52 -157 1102 1446 -330 562 1317 93 -131
1850 -131 2063 1578 -135 897 2745 459 -1490 -113 -368 -2722 -1711 1166 258 -886 659 1037
1866 1037 -1159 -1087 -72 -1970 -2433 -803 -129 -733 828 1832 1 -1215 1123 1457 -356 -181 2091
1883 2091 811 -686 847 1669 -30 -359 1238 656 118 2125 1951 -1076 -1524 305 -1015 -2984
1899 -2984 -717 438 -1302 -1193 1416 1125 -1169 -553 -266 -1769 -1918 521 4 -653 758 1770 -443
1916 -443 51 2291 1468 -788 779 2276 678 -528 1009 699 -1315 -770 696 145 88 1304 837
1933 837 -1018 -776 -226 -1699 -2601 -497 -591 -1886 -542 1716 52 -890 355 226 -989 -470 351
1950 351 -308 -256 1079 1087 286 981 1761 87 -339 1794 1805 -458 36 948 -494 -1546 -49 376 -935
1969 -935 -400 1079 4 -843 459 -397 -2456 -1831 -549 -1035 -1096 753 1464 -467 128 1675 335
1986 335 -1255 176 1223 -420 -286 1677 1002 -361 602 1419 -225 208 1845 568 -826 562
2002 562 854 -1791 -2026 -172 -481 -1965 -495 1240 -78 -860 327 204 -1725 -1407 -39 -951 -766
2019 -766 934 923 -453 1130 1944 17 -326 1205 1235 -568 59 1843 771 -792 567 1052 -831
2036 -831 -217 1006 395 -649 87 62 -1938 -1492 -545 -1642 -1656 -8 723 -378 -186 1105 95 -988
2054 -988 -480 -485 -946 -420 918 1073 356 1105 1106 129 564 1370 346 -393 972 1177 -505 -447 899 -687
2074 -687 -1298 -63 554 -19 -428 36 -596 -1202 -584 -802 -2349 -1188 268 97 -668 1305 1175 -722
2092 -722 -934 777 807 -1242 45 1430 750 208 2047 1463 -132 272 1101 -220 48 1232 628 -1177
2110 -1177 -194 612 -1171 -1505 -282 26 -1240 -359 856 -599 -1685 -471 -156 -1652 -1235 466 214
2127 214 -419 1230 1663 251 -123 931 -98 -497 887 1195 -19 374 1737 689 -704 86 738
2144 738 -434 -173 489 20 -810 -343 -41 -1085 -1079 -157 -612 -1225 157 704 -552 -473 227 -574 -1579
2163 -1579 -358 938 -455 -66 1752 1340 476 735 1007 -307 -508 1137 893 -226 423 800 45
2180 45 -827 577 -67 -997 -783 483 -495 -594 276 -625 -1498 -1257 130 -1083 -1083 553 513 -456 108 1060
2200 1060 -826 -789 -109 702 193 704 1456 925 229 1400 884 -279 59 811 -103 -118 1213 518 -1171
2219 -1171 -660 286 -370 -1120 275 -76 -1370 -517 465 -895 -1435 -495 -69 -920 -224 1336 599 -282
2237 -282 923 1220 -514 -321 941 246 -459 1009 1674 291 103 1274 605 -633 -120 631 -644
2254 -644 -531 34 4 -1038 -554 -155 -687 -1351 32 -86 -1097 -236 351 -632 -1091 -34 33 -882 460
2273 460 1319 255 210 907 895 -73 260 1032 463 12 1092 1187 534 285 464 -324 -347 330 -193 -1118 -736
2294 -736 154 -787 -1007 295 178 -1329 -913 -42 179 -422 265 372 -795 47 496 113 -230 651 1051
2313 1051 4 783 1491 249 -103 498 647 -367 176 1006 33 -870 316 496 -952 -558 156 -518
2331 -518 -1275 -467 22 -941 -755 -306 -696 -1114 -46 391 -932 -299 464 535 -472 539 1043 -130 -261
2350 -261 1001 723 147 655 1094 -88 -438 588 394 -487 40 474 -770 -914 213 213 -1006 -508 -102
2369 -102 -1005 -895 242 22 -1473 -386 233 -246 -729 324 512 -671 74 1024 551 -108 575 740
2387 740 -171 232 1019 547 178 466 670 -134 209 519 -155 -685 326 131 -824 -242 -90 -613 -1032 -264
2407 -264 -429 -760 -679 -99 45 -479 -36 214 171 361 641 35 184 1082 841 -193 381 1061 571 -485
2427 -485 596 1055 18 -329 298 110 -560 -153 319 -905 -736 -120 -464 -889 -242 -14 -839 -628 297
2446 297 -352 -643 -35 227 -349 -197 872 822 -373 221 1234 372 -77 1016 823 176 528 1008 303
2465 303 -114 460 314 -220 -139 563 -418 -1261 -47 -326 -846 -331 -96 -552 -632 80 190 -622 -495 0
2485 0 -162 -384 430 260 -197 -17 902 595 655 725 831 172 95 1109 300 -307 488 297 -315 46 414
2506 414 126 -881 84 403 -612 -733 -102 -423 -992 -679 -219 -383 -233 -431 -455 8 378 459 -57 62
2526 62 637 130 40 698 1005 278 492 938 655 -72 355 525 -319 -277 235 59 -513 -34 168 -92 -608
2547 -608 1 -505 -1100 -415 -430 -959 -743 290 -378 -555 111 244 -139 -324 811 619 -29 359 829 466
2567 466 117 607 825 98 236 746 794 -101 117 103 -518 -346 139 -300 -587 -257 -234 -865 -160 385 -470
2588 -470 -927 -596 -82 -584 -363 -137 -273 -479 153 474 425 686 948 464 289 873 768 35 149 633
2608 633 224 -247 329 914 -194 -239 35 239 -970 -760 -668 -705 -499 -609 -366 -562 -477 -179 -553 -324 143
2629 143 53 -700 125 10 -264 -296 561 479 286 327 753 630 218 738 766 -99 -304 98 71 24 385 -45
2651 -45 -383 -357 -66 -165 -683 -463 -468 -1061 -656 -138 -497 -521 -151 342 -300 136 465 49 -160 542 685 88
2673 88 289 648 528 351 298 600 564 367 572 324 -280 174 -250 -838 -693 -59 -532 -720 -41 96 -884
2694 -884 -666 -136 -284 -792 -825 -162 -435 -329 393 236 284 194 545 15 367 1021 289 116 693 817 102
2715 102 -336 389 665 -152 170 692 419 -758 -227 -205 -538 -849 -484 -596 -569 -246 -361 -545 -16 -144
2735 -144 -939 -553 200 66 -117 -156 219 439 242 521 833 390 433 586 672 471 220 -73 -341 -16 52
2756 52 -116 265 224 432 -368 -352 -171 -602 -991 -806 -264 -656 -267 240 -5 -12 104 466 -172 -174 339 177
2778 177 -287 327 728 344 131 590 485 425 882 862 274 43 360 -33 -487 -537 -75 -339 -591 71 40
2799 40 -277 -75 -136 -483 -650 -715 -662 -455 -310 330 154 90 570 423 169 429 353 -106 403 697 574 -168
2821 -168 314 368 505 -71 564 545 103 39 208 -265 -603 -613 -569 -635 -414 -28 362 -104 85 -166 -883 -468
2843 -468 -301 -461 -550 -22 157 341 594 565 670 195 53 701 289 625 569 73 277 6 295 -16 57
2864 57 87 -281 -167 78 -4 -592 -699 -883 -555 -809 -157 293 -49 -33 320 148 -443 -354 -53 74 -50 435
2886 435 587 457 550 457 401 694 546 181 168 418 426 -70 -261 186 18 -651 -346 451 -139 -371 189 -273
2908 -273 -624 -993 -695 -756 -969 -353 47 -46 274 291 424 13 393 48 -154 119 365 569 328 545 620
2929 620 246 108 478 398 232 439 107 -200 -407 -313 -585 -597 -95 -311 -112 -73 265 -31 -191 -497 -754
2950 -754 -760 -627 -136 -64 193 601 771 416 597 422 471 289 131 280 381 266 464 457 278 497 289 269
2972 269 -155 15 -287 -575 -479 -395 -837 -912 -685 -529 -120 157 275 103 -265 -474 -377 -572 -542 -362 165 397
2994 397 848 726 711 921 534 53 -37 168 520 -66 -81 296 143 -125 1 -310 -96 96 -171 -574 -145
3015 -145 -413 -787 -790 -588 -661 -128 -153 327 554 169 360 353 -182 -96 -132 10 -126 380 777 557 465 470 302 218
3039 218 173 151 -29 -208 -63 -65 4 -416 -160 -460 -532 233 223 -200 -140 -221 -799 -593 -903 -379 -262 -219 550
3062 550 681 682 732 467 -131 -577 24 181 33 304 350 418 491 574 250 216 65 409 -277 -271 166 -331 -684
3085 -684 -742 -225 -598 -560 11 98 -191 -202 39 -273 -816 -569 -487 -203 40 316 320 842 599 280 429 298
3107 298 149 -101 -222 -113 453 96 295 579 263 128 -246 -199 -249 -279 -224 -397 -646 -511 -442 -498 -368 -300
3129 -300 -119 43 423 304 136 -258 -132 -245 -179 219 296 306 545 697 421 16 522 412 -48 -146 34
3150 34 270 214 164 -179 -155 -187 -71 -229 -214 -592 -386 -620 -560 -503 -519 -817 -289 316 304 336 386 382 261 -157 -11
3175 -11 -82 -311 -174 533 598 557 681 343 298 293 -31 -201 -253 89 -265 -377 -40 31 -120 -418 -271 -270 -159 -77
3199 -77 -513 -50 -165 -499 -379 -270 8 -195 382 530 455 477 251 210 190 -88 39 30 228 40 769 434
3221 434 395 74 112 -117 -334 -562 -71 -233 -335 -255 -779 -266 -334 -157 -24 -365 -133 1 -114 211 -250
3242 -250 -200 -285 -214 342 419 565 566 701 524 359 373 35 -182 -215 58 244 144 109 188 -22 -320 -255 -704 -485
3266 -485 -279 -359 -367 -465 -453 -308 -193 -248 -45 -95 279 324 139 -140 88 -45 -105 -346 277 602 299 746 629
3289 629 639 321 -9 -140 -403 36 -376 -69 -92 214 77 11 21 -257 -230 -441 -254 -402 -303 -277 47 -174
3311 -174 -373 0 -10 155 275 354 401 233 59 276 -115 -212 -30 290 570 523 745 306 245 250 -423 -551 -265
3334 -265 -347 -293 -439 134 59 -274 -342 -508 -331 -604 -537 89 61 -367 -153 -89 76 79 66 422 696 607 317 564
3358 564 514 211 -9 33 -39 -225 53 117 571 412 -191 74 -46 -683 -680 -198 -453 2 -285 -413 -207 -260
3380 -260 -697 -508 90 -66 -33 -95 220 212 98 189 324 248 81 119 703 580 301 610 69 -156 -551 -163
3402 -163 -51 84 103 44 270 109 -135 -393 -575 -404 -578 -592 -291 167 -165 -285 74 33 -95 -258 272
3423 272 291 544 348 -143 406 135 -4 4 438 500 112 355 620 251 -15 -387 -193 -542 -483 -266 -22 -179
3445 -179 -205 -132 -52 -207 -500 -296 -239 -557 -513 28 -71 396 -238 -434 418 271 221 472 245 583 258 -41
3467 -41 261 335 -178 -186 111 387 82 36 33 -22 -400 -447 -276 -144 -288 -260 -164 -193 -235 -364 -600 -52 -353 -582
3491 -582 -188 186 -72 -69 119 207 68 230 649 353 340 376 265 329 474 -219 -25 -85 134 -91 192 21
3513 21 210 241 -138 -40 -419 -620 -189 -274 -370 -238 149 70 -37 12 -136 -151 248 53 104 74 404 147 111 252
3537 252 138 199 257 173 509 252 68 157 -233 -372 -309 66 -258 235 -781 -176 406 -281 -235 -469 -203 -430
3559 -430 -600 -96 -175 -273 89 -88 146 553 7 92 214 100 12 187 130 553 246 -23 299 309 23 281
3581 281 96 96 115 -385 -213 -427 -671 -331 -251 40 45 -167 -32 218 -320 -473 -525 -22 -49 -282 -12 571 154
3604 154 148 206 369 188 193 129 266 260 29 196 -45 -2 -267 -57 -123 341 -182 -48 84 -199 -386 -678 -320
3627 -320 -495 -529 152 358 -116 -384 47 160 -214 -219 71 145 326 242 34 546 453 212 94 259 251 204 -23
3650 -23 463 281 -14 -158 56 -40 -308 -20 -26 -10 -265 -277 -437 -190 -523 -551 -534 -49 -206 7 150 417 9
3673 9 -28 -2 103 52 275 390 206 260 47 278 146 133 197 453 76 511 99 -219 17 37 -244 -311 -20
3696 -20 -162 -255 -248 96 -101 -372 -274 -153 -295 -297 -386 29 412 74 97 -122 -17 51 170 106 473 395 230 120
3720 120 372 671 37 -49 270 18 -298 233 150 -145 102 113 -370 -528 -581 -325 73 -124 -183 10 -101 -95
3742 -95 -212 6 99 103 97 -101 217 418 529 -87 278 195 264 -22 292 16 44 -152 217 198 -128 -385 64
3765 64 -15 39 -165 -397 -172 -268 -487 -338 -237 -165 -339 191 110 -15 -209 -64 422 83 -36 24 112 195 174
3788 174 242 192 213 244 50 194 176 307 40 255 -276 -147 -327 114 -26 -550 -239 -188 -24 -249 -99 63
3810 63 -256 -718 -364 93 359 -141 198 -148 -214 159 -30 78 416 255 -30 158 239 305 309 106 128 130 -189
3833 -189 16 202 111 -134 5 -171 -513 -321 -395 -504 -126 -255 -133 -49 100 68 -203 -529 59 27 -201 192
3855 192 196 57 2 500 80 -258 238 643 109 250 164 128 264 158 -469 -295 -172 85 -121 -271 -125 -19
3877 -19 -476 -252 -249 -243 -276 -74 -95 -40 -375 121 427 -100 152 217 201 192 547 16 334 286 342 409 74 282 144
3902 144 91 133 156 -226 65 -86 -93 -424 -186 -22 -334 -359 -107 -158 -370 -239 -187 -89 -177 315 -64 98 58 -16
3926 -16 -319 197 240 185 133 194 258 659 278 537 503 -205 -17 134 213 -217 -72 -139 -91 -199 -307 -259 -206 -468
3950 -468 -305 -312 -250 -222 -238 -371 -412 -116 48 452 -30 138 -8 314 244 334 309 207 -11 -276 68 272 96
3973 96 652 -63 201 11 -175 -175 -224 -233 195 -296 -256 -414 228 -220 -197 -165 -307 -229 -165 -115 -237 -32 -24 28 70
3998 70 -272 100 89 202 -38 280 300 331 335 147 325 -30 105 13 155 -261 188 -129 -66 -440 -421 -190 -293
4021 -293 -201 -232 -174 -137 217 -362 32 -283 -330 42 -262 56 195 53 -183 230 378 368 156 253 44 -34 112
4044 112 102 29 77 218 -26 166 -42 -82 -62 -240 -31 -481 -214 -549 -103 -291 -259 -213 2 -99 -359 -388 103
4067 103 -21 -56 23 496 78 102 410 97 360 101 185 -269 225 224 288 -14 312 -55 86 -236 -1 -211
4089 -211 -405 66 37 -201 -186 -153 -402 -374 -40 -224 -111 8 -155 -170 152 29 -27 17 117 511 77 -74
4111 -74 161 302 85 334 478 240 -158 160 212 159 105 141 -286 -201 -185 -170 -171 -239 -41 26 -264 -5 -108 -124
4135 -124 -130 -4 -100 -114 -217 -40 183 249 204 253 -117 -6 117 69 20 32 542 55 -194 488 111 -122 -100 -217
4159 -217 -35 -96 -134 -119 -231 -15 -151 -200 224 369 -203 -408 -126 52 -403 -407 376 -124 69 128 143 322 -94
4182 -94 353 279 -75 339 294 115 340 431 -16 22 67 -36 159 -198 -115 79 -462 -263 179 -475 -666 -147
4204 -147 -44 -135 -28 -228 243 42 128 15 -194 -96 161 107 -30 400 129 269 240 235 99 -33 79 212
4226 212 94 -57 -118 -101 -150 166 -24 -618 169 -216 -298 -170 88 -344 -306 162 -242 -102 29 -80 296 -63
4248 -63 -120 62 -40 143 68 101 101 149 -44 8 244 182 -142 295 211 44 -160 -477 -146 -162 -176 -65 -142 93
4272 93 -378 57 -123 -106 -149 -140 -176 -309 -95 20 178 -2 330 178 -252 260 371 203 426 378 334 -112 64
4295 64 207 215 419 -22 -263 -152 175 -51 -98 -288 18 -408 -227 -320 -166 -129 -235 -70 -66 1 -246 -269 -434
4318 -434 133 43 -79 138 109 -66 78 5 311 440 177 356 -15 89 -35 196 -165 62 17 239 -127
4339 -127 121 64 -39 -189 -304 -233 -261 -440 -29 -282 -347 0 55 -112 -346 227 64 116 46 69 142 -85 140
4362 140 -1 122 155 227 471 487 364 137 193 -50 50 -341 -275 -197 -96 -54 -49 -72 -186 -71 -1 -226 -138 -321
4386 -321 110 42 -32 -38 -15 239 152 75 11 -51 218 -179 347 12 195 306 -89 -190 65 12 35 338 10 233
4410 233 -53 62 -640 -327 -244 -47 -186 -148 -21 -70 -102 156 110 -241 -211 300 -60 -138 68 -46 -157 116
4432 116 430 72 -8 527 402 255 -52 407 -109 -162 43 -23 -333 -43 133 10 -56 48 -439 -411 -435 -172
4454 -172 -648 -445 -222 -42 -142 -208 173 -332 68 -137 -134 -182 71 -33 248 105 16 -70 277 314 357 -170 -113
4477 -113 100 147 57 88 173 -37 -213 143 173 -108 -222 50 -26 -272 -217 60 71 -272 -18 -266 82 97 444
4500 444 160 60 -109 364 116 111 284 39 -42 52 208 64 320 256 -47 131 228 7 -336 -96 -179 -56
4522 -56 -336 -58 161 -373 -140 -264 -121 -234 -136 -156 -198 -41 -283 296 75 109 172 165 170 106 280 148 304 145
4546 145 -19 -103 263 240 -223 146 187 -297 -169 -56 -57 233 -20 -396 -285 -203 -253 -123 -107 103 -151 -127 357
4569 357 126 171 -55 61 234 74 130 182 535 81 254 249 77 -21 275 95 -150 -166 -38 -215 -25 93
4591 93 197 173 -324 -78 -205 -32 -141 -234 -171 -372 -20 -236 -112 267 361 -252 13 134 -86 -56 296 136
4613 136 -6 115 456 266 -144 390 309 179 213 118 149 4 -87 -52 -343 -437 16 -318 98 185 -42 -190 -225
4636 -225 -255 -260 -302 -27 61 -364 -115 251 19 154 348 -107 -252 81 513 37 -225 212 352 380 -38 229
4658 229 15 11 -101 5 -20 288 -111 13 -621 -414 -405 -287 13 169 242 -175 -89 -357 -159 -182 252 -67 260
4681 260 171 23 40 163 64 318 15 133 335 230 -65 289 172 3 -95 27 -56 255 93 31 -346 -273
4703 -273 -119 48 -102 -301 -300 -456 355 -145 -392 -3 121 13 -178 1 -164 -107 262 297 -203 372 281 248
4725 248 227 -38 178 66 79 23 194 -117 -31 -49 -237 -412 5 -65 -144 -329 81 -53 -638 -149 -162 -282 -34
4748 -34 -121 -18 154 212 59 129 81 -53 199 57 235 388 102 289 81 469 172 232 202 39 -167 202
4770 202 61 -12 -39 139 -450 -191 -94 178 200 -110 179 37 -231 -369 -330 -70 -74 29 93 -54 370 334 144
4793 144 0 361 -11 -238 -16 97 -99 104 -68 -7 28 -99 65 -187 -246 -112 -212 -160 95 -249 -33
4814 -33 -234 -21 121 -33 -111 -3 89 146 -68 -215 -4 164 93 -3 26 204 12 301 274 -14 245 -17 -194
4837 -194 209 -81 49 -142 -162 -202 -29 -84 -49 97 75 -72 -268 -175 9 -358 -55 -242 -40 -357 234 25
4859 25 101 256 310 -12 -9 321 -54 -17 -170 159 -27 -129 68 197 175 -19 72 -205 102 -100 -152 -48 53
4882 53 -61 90 -164 -370 181 -419 -117 -51 72 -51 22 -92 -178 121 231 -11 -112 30 146 241 67 -11
4904 -11 91 -30 400 374 -113 19 162 -106 -142 -184 -44 -283 -31 72 -131 141 -58 -176 23 -258 -8
4925 -8 -238 -117 13 179 21 77 126 211 -194 -10 260 242 -5 323 -2 -132 131 -7 -17 -184 48 221
4947 221 142 -16 224 -94 -129 -240 -77 48 -218 -351 -92 -396 -362 237 -387 -267 113 -267 -157 42 105
4968 105 127 -204 108 346 -44 188 513 209 343 259 225 284 -28 -49 -46 -50 168 -193 -200 199 106 17 -257 -101
4992 -101 -150 -276 117 -160 -89 136 256 -262 107 64 294 278 -48 232 35 70 174 379 -82 170 410 257
5014 257 73 -85 242 -52 76 228 98 -206 -61 -146 -342 -101 78 -117 -110 -230 108 -233 -439 -196 -23
5035 -23 80 -287 -164 42 163 145 252 -165 253 270 60 134 -32 99 113 16 95 90 -99 296 177 -218 -217 137
5059 137 -180 -335 -69 -112 -256 -103 -211 155 -214 -246 34 -329 -98 157 -101 -398 66 169 9 126 93
5080 93 319 9 124 353 224 33 390 84 12 183 156 -21 -324 -109 -70 81 -107 -51 -210 -430 162 176
5102 176 -116 -34 -64 -144 -91 48 23 -121 -38 -25 167 -7 68 284 181 129 222 167 16 281 198 85 -77 23
5126 23 -208 239 -211 -165 -329 63 -21 -221 -88 -288 45 -376 -490 -46 -19 -400 -45 27 6 195 273 163
5148 163 76 45 91 -219 84 164 -110 40 174 127 219 292 -105 -40 12 108 83 -139 -465 -216 -265 4 -310 -43
5172 -43 -88 -161 -214 -155 -160 -204 320 -213 -228 215 95 252 -145 -10 79 -81 174 20 240 292 255 48 -214 187
5196 187 7 -48 -29 147 10 90 -106 90 -24 -180 -37 -224 -384 -241 14 -21 -2 1 -133 -343 68 -295
5218 -295 -27 412 193 145 32 -59 142 163 290 516 177 -15 -102 198 46 -287 77 269 -427 -200 -96
5239 -96 -343 -166 -212 -184 -225 142 -128 210 -332 -198 -238 -162 68 307 86 -242 226 -93 -260 46 -21 36 68
5262 68 -28 52 29 184 266 -56 38 74 -198 -148 154 5 -256 -173 2 179 -108 -206 -267 -120 -325 -177 24 -229
5286 -229 -400 340 138 204 339 71 166 206 304 -103 -129 201 149 507 197 283 191 -132 -155 253 85 -202 79
5309 79 92 -14 38 -116 -12 -20 -126 39 -35 -134 76 -273 205 -51 -146 17 -237 248 -54 -68 63 78 -62
5332 -62 -164 173 58 -61 -17 -249 -220 -77 361 21 -81 -6 -64 -189 337 -25 -144 -193 11 -96 -237 -638
5354 -638 -29 -173 -2 40 -40 129 -73 -87 -169 -169 48 -18 5 163 412 11 16 147 356 -270 49 215 -30
5377 -30 -221 -87 258 -319 42 -441 -162 32 69 -134 82 -67 -246 223 -286 86 -222 125 -235 -19 161
5398 161 54 185 125 -102 250 83 144 6 304 260 -272 50 263 -91 106 247 177 -101 69 74 21 -352
5420 -352 -84 21 -142 18 -275 -75 -54 -50 9 -67 -408 242 -11 -21 178 -19 119 145 190 276 41 238 212
5443 212 200 35 45 -147 -12 -54 23 0 -93 -150 -188 190 -55 -197 -17 -300 22 -127 -6 334 -214 -40 -155
5466 -155 125 111 -120 136 212 13 -187 138 -60 -29 354 97 88 210 374 432 -101 65 246 126 107 149 138
5489 138 -80 -6 -357 -128 178 -133 -38 -180 -114 143 51 7 -167 -15 33 -294 174 -205 182 67 201 -212
5511 -212 121 222 174 -219 219 248 43 96 -208 17 -154 31 153 -70 -244 -118 155 -91 60 28 16 15
5533 15 115 58 -103 23 -16 -58 31 -24 119 141 277 385 138 41 -61 -19 137 398 6 227 140 331 -66
5556 -66 151 0 125 -2 32 -157 -92 -141 -103 -187 -201 -64 -71 67 -166 291 2 112 -112 154 155 166 -261 -300
5580 -300 247 233 243 151 53 -48 229 -172 -30 -32 132 -277 -58 84 86 164 -40 -66 33 -124 100 -3 -86 -41
5604 -41 -195 -106 14 -312 -241 -149 -114 64 79 -252 -27 -68 -93 255 159 118 182 -38 126 102 193 -92 81 -129
5628 -129 -141 281 9 -42 -4 -142 37 -59 -148 -389 -157 -185 -118 -8 -21 0 -114 76 -95 81 89 -140 35 -126
5652 -126 73 246 -189 357 196 -34 41 127 175 42 126 212 -87 -149 -207 -97 134 125 175 -262 309 -172 -38
5675 -38 58 -111 -306 -188 -103 172 -26 -81 -31 48 122 49 -116 354 438 17 -4 137 101 175 248 205 212 140 93 192
5701 192 -137 -266 55 -180 -257 61 13 95 -164 193 -48 -222 -38 1 -15 23 -302 -15 -37 34 -7 -27 13 4
5725 4 165 77 142 204 164 48 -49 -44 -188 -31 -193 119 110 -186 -73 194 77 -32 -449 -326 233 -170 -50 -98
5749 -98 -72 -9 -24 60 -179 145 -185 -227 -77 -93 18 43 -58 1 294 -2 150 212 279 161 -217 220 133 264
5773 264 -82 -63 -206 -153 -307 309 -30 -284 -162 17 -209 66 -173 -164 -205 283 70 -59 -35 -83 191 217 29
5796 29 -18 134 127 274 158 46 113 -234 57 110 137 -104 -173 185 181 274 -21 -178 -130 31 -202 42 -51 -7 -124
5821 -124 -240 16 -179 -51 -117 100 -6 109 255 172 3 387 229 264 -154 149 212 -176 133 158 -198 151
5843 151 330 -19 87 152 267 -14 49 -221 -212 -69 -93 -458 -264 48 -173 25 87 6 -95 -13 -162 -213 -113
5866 -113 352 -140 244 -38 208 221 -114 -231 495 83 196 93 219 67 -14 213 -213 -18 -88 -19 209
5887 209 31 -9 -133 -276 -262 57 -49 -54 -49 10 268 236 375 355 192 126 -45 -186 -291 7 283 205 48 67
5911 67 117 27 0 32 -212 130 28 -3 -91 -41 -157 -71 140 -167 103 -415 -193 -8 -168 172 -68 152 -27
5934 -27 82 187 -124 -79 103 -95 -167 286 -109 -337 187 359 79 234 399 44 50 34 -73 63 -277 -277 209
5957 209 26 -62 -130 2 280 -21 192 47 -162 73 -3 -44 -29 113 353 -11 47 -236 52 132 141 254 165
5980 165 12 139 327 23 265 194 174 183 132 -246 6 41 -28 -268 -371 -192 -226 -182 -100 -72 -270 159 -58 -297
6004 -297 -104 -147 -26 325 -314 100 325 104 -47 110 253 -8 30 -167 -184 205 169 33 -32 -75 69 -74
6026 -74 21 8 -336 257 -115 161 48 204 -35 -38 26 112 -169 219 195 180 -57 -145 278 -149 -133 -66 317 -42
6050 -42 72 76 -115 -184 376 83 -74 -140 134 108 -150 -36 -230 -196 64 -47 -221 -267 19 59 -226 -62 -133
6073 -133 -38 -38 124 48 -95 -70 77 -56 213 -155 44 85 355 80 189 187 236 532 122 216 76 -142 -97 311
6097 311 87 142 81 -163 -140 -383 120 106 -234 96 111 -83 44 -142 3 -445 -88 53 34 208 -323 283
6119 283 -82 192 52 146 284 -161 13 -327 -190 15 303 151 197 -140 -22 -10 -73 63 -320 -266 25 -146
6141 -146 -257 -6 -254 -100 -87 122 126 -173 -100 -37 205 -80 -10 -238 -17 86 77 332 -67 16 -453 -77 -17
6164 -17 -51 -190 73 171 -278 121 -133 -155 -136 -77 21 -57 -156 14 197 -92 24 -164 125 -237 164 35 -154
6187 -154 109 115 -182 -19 -237 101 30 242 -18 -133 283 84 115 100 246 -74 154 -43 174 106 -80 134
6209 134 -208 -8 84 126 -542 2 -316 -41 82 -271 158 -96 142 340 258 368 -47 336 93 116 127 -13
6231 -13 165 93 128 191 162 -79 -141 29 -45 45 69 -13 -24 -21 -123 -165 -136 16 120 25 25 -212 102 0 -37 -40 81
6258 81 -215 -279 70 175 71 152 296 160 -8 141 182 123 111 -322 63 196 -34 -100 340 -169 251 -166
6280 -166 -23 -230 9 130 -254 123 -129 -91 -152 -124 84 84 -129 9 -305 148 69 -38 93 -110 -76 -391
6302 -391 153 -189 -56 52 217 -92 0 199 57 -262 -420 23 -89 -299 -6 -169 -38 44 -153 -266 11
6323 11 141 -111 -82 128 -122 200 70 362 104 -33 20 -77 18 -54 -191 26 59 342 -18 -154 -92 70 -28
6346 -28 82 240 -136 -201 47 8 -392 -220 -144 229 -194 13 -17 113 115 -360 -176 136 127 -292 31 -18 43 -124
6370 -124 22 144 -4 93 59 99 -25 -138 469 -9 -366 -34 272 13 -339 81 300 -201 -30 48 -284
6391 -284 -132 164 -289 187 35 34 -93 4 92 -156 -252 205 -6 -121 237 29 -48 87 234 8 -89 208
6413 208 490 186 -362 65 -46 -43 -63 181 15 160 355 47 -17 -109 -22 131 44 -101 121 3 -447 -193
6435 -193 -68 183 125 -49 -19 115 -226 -31 -209 -149 -40 -160 59 224 47 69 5 -232 42 35 212 -110
6457 -110 -123 -140 174 -170 -84 -19 103 -51 -218 -104 -354 -298 -129 -173 -87 291 -11 -137 315 -56 -64 443 39
6480 39 111 100 44 -123 80 289 -63 261 -320 91 184 -117 -69 74 -81 81 189 195 -149 91 -176 -59 39
6503 39 22 -429 21 15 -230 -110 -614 175 -174 255 331 167 -17 -327 -20 20 113 163 -9 249 183 -68 -113
6526 -113 -243 -81 258 38 -3 111 129 -8 25 98 44 -81 -41 -168 -64 -58 -108 139 -422 83 -134 109 104 -295
6550 -295 69 33 -233 122 4 -69 105 249 235 -290 173 -8 313 -55 -103 -71 -78 77 150 -43 -96 -208 0
6573 0 -46 -247 361 -76 77 -3 -306 133 84 76 19 251 315 -99 150 -243 15 9 54 111 85 32 15 225 95
6598 95 -81 -39 -230 119 -212 -1 -181 -374 65 -131 -424 -2 -65 16 -177 193 47 122 -180 84 54 -96
6620 -96 -133 -121 369 1 -92 94 105 61 -311 -175 78 57 102 44 -1 33 30 69 -176 -82 47 252 100 -169 51
6645 51 -99 -183 8 1 29 -87 -263 -223 -159 105 198 246 72 -74 -179 -94 27 48 66 -15 103 -14 125 192 -43
6670 -43 -137 -100 -370 294 143 -142 -155 -149 47 -196 -29 106 -330 -244 182 -356 -239 83 22 90 236 270 54
6693 54 342 -14 -110 -160 -183 232 141 107 133 -124 2 253 215 144 54 109 -126 24 -126 117 23 -159 68 88
6717 88 -74 -43 -360 -237 328 -133 157 -169 143 210 180 -39 -195 35 91 82 90 371 -17 -116 223 33 0 -176
6741 -176 35 287 -184 -33 193 294 3 -271 -22 -140 -66 -59 -74 -26 -113 -142 -171 101 -42 -125 -15 -311 -32
6764 -32 203 173 28 160 289 281 -136 124 102 258 67 -131 -33 48 -141 99 -304 -3 48 -17 -20 140 57 5
6788 5 -297 -3 107 -279 76 82 117 -75 78 65 -26 120 -96 -17 34 26 -95 -65 131 -35 89 52 30 -21 285
6813 285 39 -52 70 76 -164 -49 -212 -149 192 172 126 -181 -118 -296 233 -35 -277 -211 -43 39 -15 213 -35
6836 -35 -48 71 369 -234 -35 134 216 -7 -202 42 -173 -3 93 214 66 50 -113 246 12 -116 -95 -161
6858 -161 131 -5 164 -170 -65 -71 279 344 -53 -27 43 140 -143 -342 -53 49 216 -106 43 69 6 216 39
6881 39 9 -17 -37 120 -341 -21 165 6 257 -175 -57 226 9 -15 189 78 49 -40 162 21 -48 137 100
6904 100 425 224 136 -160 -245 235 78 -94 -91 -68 94 219 41 159 -48 266 -226 -1 -144 40 -139 118
6926 118 168 -99 -213 38 202 109 89 -106 -165 -88 -2 -47 27 306 -47 -138 116 -35 189 -136 65 125 68 13
6950 13 -2 -134 -268 -8 -37 140 -9 108 -192 -270 -299 -99 18 10 -96 152 199 -37 22 -15 75 -418 -77 50
6974 50 -224 35 -161 91 -14 -17 -145 -162 -116 191 74 118 185 -21 -62 50 -82 -191 -61 -7 -152 -83 -111 -24
6998 -24 22 -54 195 -138 130 -14 -136 41 105 -41 63 263 -172 116 -192 -13 213 -100 -325 209 479
7019 479 316 186 332 -254 362 207 347 28 -140 27 -107 111 -39 -67 -53 -115 55 -60 -48 18 -45 218
7041 218 -180 -20 94 -296 212 16 -135 273 -29 100 116 169 93 89 75 27 -193 445 41 103 94 -105 237
7064 237 245 92 1 210 39 -98 153 12 -131 -220 -87 12 95 -4 86 193 -78 123 76 217 175 162 169 22
7088 22 66 -60 107 -18 183 178 -66 120 -165 -104 -85 -246 -224 6 -18 -19 54 49 138 -259 45 189 -62 206 18
7113 18 -53 -129 40 -45 57 -149 140 151 -5 -96 10 40 -124 -156 -50 38 -230 -230 19 69 241 206 73 364
7137 364 223 104 -27 -23 98 -123 -63 -160 -99 1 -93 -76 220 16 92 147 -124 -1 65 -365 -9 13 -217 426
7161 426 -92 47 -52 218 69 -52 62 -44 -332 175 -136 148 74 150 113 -10 -57 -107 -192 -163 21 -158 453
7184 453 -138 -69 161 -104 281 87 96 -21 -84 115 271 210 214 -60 -14 68 -60 10 57 183 204 442 -62 69
7208 69 60 298 157 -139 130 -48 -153 162 -78 -128 -47 -133 -137 144 -84 218 -194 -15 161 -42 -298 106 22
7231 22 -148 -149 -284 234 361 -58 -14 60 85 -187 10 118 86 60 25 311 -122 89 11 -217 3 70 -137 -47
7255 -47 189 -203 -65 -14 30 -14 251 142 -82 17 42 45 109 -42 156 -196 -166 -4 197 78 -149 127 40 -106
7279 -106 16 21 56 145 -304 133 97 -87 -263 -107 -194 -43 -144 -186 271 -53 -132 -68 199 267 -280 -140 134
7302 134 265 -127 171 -111 -26 -151 239 143 -164 -132 -15 -81 164 241 157 -44 -86 31 215 69 496 -218
7324 -218 -119 63 107 -198 -169 -67 26 183 -227 -130 149 71 -217 64 -245 152 75 191 77 -260 -113 -7
7346 -7 217 79 -75 19 -257 -69 158 143 -184 91 -98 -185 -69 -59 -231 38 133 36 -26 139 -222 -27 137
7369 137 -89 366 265 -70 -257 385 149 121 -150 47 -241 0 -189 40 -198 -40 -75 271 -111 114 39
7390 39 -74 -138 -16 66 -126 -61 -195 9 -241 196 -99 103 91 -230 -27 58 22 168 -54 -13 192 269 -158
7413 -158 -103 151 77 -89 -48 217 -151 -35 -189 110 115 10 28 -171 7 19 -258 82 -141 -177 128 148 159
7436 159 -215 158 -205 -36 -259 -133 -137 0 -233 -62 204 34 -54 131 -152 -390 148 5 4 3 -72 39 186
7459 186 -273 191 -75 98 53 43 260 -235 214 182 -296 95 40 63 188 106 -273 246 -75 49 -11 20 119
7482 119 -153 -409 165 213 -6 -228 50 167 303 312 -17 163 20 -22 91 -68 124 -21 72 4 -25 -70 -63
7505 -63 90 103 -39 111 -212 -284 32 -122 79 99 -110 -117 12 27 -66 -117 -53 166 -45 357 216 -217 -127 -32
7529 -32 -47 -107 245 -101 21 -37 -154 -88 -13 50 -118 45 -32 -225 -21 -47 385 -51 366 298 -160 26 -81
7552 -81 306 -90 -29 78 -147 23 103 -111 -64 -131 289 -173 156 -83 60 263 78 38 138 133 115 -162 72
7575 72 -11 -22 -165 109 -181 118 -1 -279 235 95 -12 57 124 65 -120 16 -29 -143 296 -39 -154 255
7597 255 -53 257 125 -57 90 31 279 67 -31 -143 -33 239 -74 -40 -71 11 33 37 -12 -216 62 -41 -191
7620 -191 -128 149 68 26 -145 163 -245 95 -115 -108 105 46 -60 -4 111 -241 -196 -12 -32 13 -53 -286 137 -16
7644 -16 102 102 -228 73 -206 -281 -170 43 48 -78 204 -160 165 -69 -145 190 385 -85 -212 104 -80 -56 114
7667 114 28 66 -215 89 -162 -125 -306 110 20 76 -93 181 58 -39 -104 57 -228 -115 40 144 -181 -61
7689 -61 8 77 300 -163 79 -118 -174 50 -40 64 34 327 46 67 33 246 129 0 -30 176 160 -70 40
7712 40 -154 -208 58 -111 61 -193 -62 5 80 -420 52 -56 31 -68 132 -66 -120 -117 158 -44 -69 24 87 -78
7736 -78 -19 293 6 -62 -223 198 -140 -290 155 -11 -102 -117 -11 403 -130 -201 103 -101 62 314 -92 -273
7758 -273 -160 7 191 -174 -178 -116 -198 -148 10 427 -74 -59 247 -45 -14 -2 -10 -20 141 -105 132 -5 -212 49
7782 49 65 6 46 -383 -114 -69 124 -107 170 20 7 -182 -109 89 122 223 106 -186 213 -137 102 123 48
7805 48 -7 11 -432 157 -84 -140 85 -62 -307 -170 144 70 92 -52 -79 -111 73 149 -55 -24 -121 -148 133 70
7829 70 55 135 -33 -108 -132 86 13 -227 47 -53 105 14 216 85 55 -105 -251 20 -192 322 -102 -100 68
7852 68 -39 73 -67 -194 -41 79 -19 -4 0 83 -127 53 66 -50 -25 312 -8 247 -382 -89 6 203 -181
7875 -181 -178 -133 -266 97 -378 -37 -193 37 -216 332 42 -115 -105 -1 67 -38 -63 -78 123 -151 147 -65
7897 -65 -66 100 -81 -141 -231 370 -250 -4 -122 8 -88 188 -218 -53 249 37 172 -50 -73 63 98 -267 -235
7920 -235 -121 110 -148 -45 -377 -151 -133 207 -302 -191 -88 49 186 206 -143 246 2 -53 8 0 163 252
7942 252 -171 -191 59 144 299 -51 17 -74 182 69 139 -55 -157 -198 -150 274 8 -126 155 -4 94 -112 -213
7965 -213 -7 231 43 142 -19 -33 52 30 158 -183 -139 -63 57 30 17 33 150 123 158 175 -15 199 -75 108
7989 108 -89 -156 146 -237 156 -51 -33 153 396 -94 147 82 -128 -52 -18 -53 -190 -107 105 159 116 307 121
8012 121 169 -68 200 98 28 168 32 -351 -115 256 52 -73 -18 28 -85 120 61 -103 -16 -309 -8 -98
8034 -98 92 -226 -52 73 -133 -177 -196 -117 -36 -113 -226 139 27 30 -64 -11 31 605 -261 -61 182 -34 -175 287
8058 287 83 180 -5 -164 21 -92 -15 150 -56 -331 -103 -26 103 328 239 45 -159 -97 272 78 -111 -118
8080 -118 113 -7 220 -301 -123 -138 105 54 155 4 104 58 76 515 -139 216 124 211 109 -35 -162 -328
8102 -328 -82 -76 -112 72 18 50 257 56 -304 -204 213 21 285 62 68 -227 -79 69 56 -115 160 308 44
8125 44 -141 -116 127 -24 21 208 371 -15 88 -264 -42 -273 -243 -162 58 -37 29 -271 -38 48 -107 -314 -154
8148 -154 56 48 -248 94 -156 -40 108 240 23 -126 84 310 -185 -38 -10 -126 -123 -246 78 14 -162 -148
8170 -148 -165 -11 -341 -112 -5 183 -165 -68 116 -160 45 388 -76 -224 -29 141 -128 -206 131 -121 54
8191E4
##END NTUPLES=NMR FID
##END=
