##TITLE=1H_Costus-oil-G-f20-11-A
 CDCl3, 8 sc, 
 5.4.2019
##JCAMPDX= 6.0         $$ Bruker NMR JCAMP-DX V2.0
##DATA TYPE= NMR FID
##DATA CLASS= NTUPLES
##ORIGIN= UXNMR, Bruker Analytische Messtechnik GmbH
##OWNER= root
$$ XWIN-NMR		Version 3.5
$$ Fri Apr  5 14:17:43 2019 Russian Standard Time (UT+4h)  she@DPX200
##.OBSERVE FREQUENCY= 200.1316
##.OBSERVE NUCLEUS= ^1H
##.DELAY= (6, 6)
##.ACQUISITION MODE= SIMULTANEOUS
##.ACQUISITION SCHEME= undefined
##.AVERAGES= 8
##.DIGITISER RES= 18
##SPECTROMETER/DATA SYSTEM= spect
##.PULSE SEQUENCE= zg30
##.SOLVENT NAME= CDCl3
##.SHIFT REFERENCE= (INTERNAL, CDCl3, 0, 15.7039)
##AUDIT TRAIL= $$ (NUMBER, WHEN, WHO, WHERE, WHAT)
$$ ##TITLE= Audit trail, XWIN-NMR		Version 3.5
$$ ##JCAMPDX= 5.01
$$ ##ORIGIN= Bruker BioSpin GmbH
$$ ##OWNER= she
$$ F:/spectra/data/she/nmr/H-F/1/audita.txt
$$ ##AUDIT TRAIL=  $$ (NUMBER, WHEN, WHO, WHERE, WHAT)
(   1,<2019-04-05 14:16:42.45 +0400>,<she>,<DPX200>,
      <created by zg, POWCHK disabled, PULCHK disabled
       configuration hash MD5:
       00 E9 B6 7A A2 85 ED C7 34 08 36 98 17 FE 4E 26
       data hash MD5: 16K
       C4 90 82 82 FA 71 EC 61 80 DC 6D 2D 98 73 26 AD>)
$$ ##END=
$$ 
$$ hash MD5
$$ 5A A7 89 12 A0 38 2A 43 05 FB 64 3A 67 88 14 55
##$RELAX= 
##$RELAX= 
##$RELAX= 
##$RELAX= 
##$RELAX= 
##$RELAX= 
$$ Bruker specific parameters
$$ --------------------------
##$DU= <F:/spectra>
##$EXPNO= 1
##$NAME= <H-F>
##$PROCNO= 1
##$TYPE= <nmr>
##$USER= <she>
##$AMP= (0..31)
100 100 100 100 100 100 100 100 100 100 100 100 100 100 100 100 100 100 
100 100 100 100 100 100 100 100 100 100 100 100 100 100 
##$AQSEQ= 0
##$AQ_mod= 1
##$AUNM= <au_zg>
##$AUTOPOS= <>
##$BF1= 200.13
##$BF2= 200.13
##$BF3= 200.13
##$BF4= 200.13
##$BF5= 200.13
##$BF6= 200.13
##$BF7= 200.13
##$BF8= 200.13
##$BYTORDA= 1
##$CFDGTYP= 0
##$CFRGTYP= 5
##$CHEMSTR= <none>
##$CNST= (0..31)
1 1 145 1 1 1 1 1 1 1 1 1 1 1 1 1 1 1 1 1 1 1 1 1 1 1 1 1 1 1 1 1 
##$CPDPRG= <>
##$CPDPRG1= <>
##$CPDPRG2= <>
##$CPDPRG3= <>
##$CPDPRG4= <mlev>
##$CPDPRG5= <mlev>
##$CPDPRG6= <mlev>
##$CPDPRG7= <mlev>
##$CPDPRG8= <mlev>
##$CPDPRGB= <>
##$CPDPRGT= <>
##$D= (0..31)
0 1.2 0 0 0 0 0 0 0 0 0 0.03 0 0 0 0 0 0 0 0 0 0 0 0 0 0 0 0 0 0 0 0 
##$DATE= 1554459401
##$DBL= (0..7)
120 120 120 120 120 120 120 120 
##$DBP= (0..7)
150 150 150 150 150 150 150 150 
##$DBP07= 0
##$DBPNAM0= <>
##$DBPNAM1= <>
##$DBPNAM2= <>
##$DBPNAM3= <>
##$DBPNAM4= <>
##$DBPNAM5= <>
##$DBPNAM6= <>
##$DBPNAM7= <>
##$DBPOAL= (0..7)
0.5 0.5 0.5 0.5 0.5 0.5 0.5 0.5 
##$DBPOFFS= (0..7)
0 0 0 0 0 0 0 0 
##$DE= 6
##$DECBNUC= <off>
##$DECIM= 24
##$DECNUC= <off>
##$DECSTAT= 4
##$DIGMOD= 1
##$DIGTYP= 9
##$DL= (0..7)
0 120 120 120 120 120 120 120 
##$DP= (0..7)
150 150 150 150 150 150 150 150 
##$DP07= 0
##$DPNAME0= <>
##$DPNAME1= <>
##$DPNAME2= <>
##$DPNAME3= <>
##$DPNAME4= <>
##$DPNAME5= <>
##$DPNAME6= <>
##$DPNAME7= <>
##$DPOAL= (0..7)
0.5 0.5 0.5 0.5 0.5 0.5 0.5 0.5 
##$DPOFFS= (0..7)
0 0 0 0 0 0 0 0 
##$DQDMODE= 0
##$DR= 18
##$DS= 0
##$DSLIST= <SSSSSSSSSSSSSSS>
$$ [...]
##$SUBNAM2= <"">
##$SUBNAM3= <"">
##$SUBNAM4= <"">
##$SUBNAM5= <"">
##$SUBNAM6= <"">
##$SUBNAM7= <"">
##$SUBNAM8= <"">
##$SUBNAM9= <"">
##$SW= 24.9336934301222
##$SWIBOX= (0..15)
0 0 2 0 0 0 0 0 0 0 0 0 0 0 0 0 
##$SW_h= 4990.01996007984
##$TD= 16384
##$TD0= 1
##$TE= 0
##$TE2= 300
##$TE3= 300
##$TEG= 300
##$TL= (0..7)
0 120 120 120 120 120 120 120 
##$TP= (0..7)
150 150 150 150 150 150 150 150 
##$TP07= 0
##$TPNAME0= <>
##$TPNAME1= <>
##$TPNAME2= <>
##$TPNAME3= <>
##$TPNAME4= <>
##$TPNAME5= <>
##$TPNAME6= <>
##$TPNAME7= <>
##$TPOAL= (0..7)
0.5 0.5 0.5 0.5 0.5 0.5 0.5 0.5 
##$TPOFFS= (0..7)
0 0 0 0 0 0 0 0 
##$TUNHIN= 0
##$TUNHOUT= 0
##$TUNXOUT= 0
##$USERA1= <user>
##$USERA2= <user>
##$USERA3= <user>
##$USERA4= <user>
##$USERA5= <user>
##$V9= 5
##$VALIST= <valist>
##$VCLIST= <CCCCCCCCCCCCCCC>
##$VD= 0
##$VDLIST= <DDDDDDDDDDDDDDD>
##$VPLIST= <PPPPPPPPPPPPPPP>
##$VTLIST= <TTTTTTTTTTTTTTT>
##$WBST= 1024
##$WBSW= 4
##$XGAIN= (0..3)
0 0 0 0 
##$XL= 0
##$YL= 0
##$YMAX_a= 230692
##$YMIN_a= -347618
##$ZGOPTNS= <>
##$ZL1= 120
##$ZL2= 120
##$ZL3= 120
##$ZL4= 120
##$ABSF1= 10
##$ABSF2= 0
##$ABSG= 5
##$ABSL= 3
##$ALPHA= 0
##$AQORDER= 0
##$ASSFAC= 0
##$ASSFACI= 0
##$ASSFACX= 0
##$ASSWID= 0
##$AUNMP= <proc_1d>
##$AZFE= 0.1
##$AZFW= 0.1
##$BCFW= 1
##$BC_mod= 2
##$BYTORDP= 1
##$COROFFS= 0
##$CY= 11.3945322036743
##$DATMOD= 1
##$DC= 2
##$DFILT= <>
##$DTYPP= 0
##$F1P= 18.9103706918063
##$F2P= -1.10871071338519
##$FCOR= 0.5
##$FTSIZE= 0
##$FT_mod= 4
##$GAMMA= 1
##$GB= 0.15
##$INTBC= 1
##$INTSCL= 1
##$ISEN= 128
##$LB= 0.24
##$LEV0= 0
##$LPBIN= 0
##$MAXI= 10000
##$MC2= 0
##$MEAN= 0
##$ME_mod= 0
##$MI= 1.114404
##$NCOEF= 0
##$NC_proc= 0
##$NLEV= 6
##$NOISF1= 3.799351
##$NOISF2= 2.8
##$NSP= 1
##$NTH_PI= 0
##$NZP= 0
##$OFFSET= 15.70392
##$PC= 1
##$PHC0= -8870.075
##$PHC1= 39.20028
##$PH_mod= 1
##$PKNL= yes
##$PPARMOD= 0
##$PSCAL= 0
##$PSIGN= 0
##$REVERSE= no
##$SF= 200.130013532006
##$SI= 16384
##$SIGF1= 3
##$SIGF2= 2
##$SINO= 400
##$SIOLD= 16384
##$SREGLST= <1H.CDCl3>
##$SSB= 0
##$STSI= 0
##$STSR= 0
##$SW_p= 3612.71676300578
##$SYMM= 0
##$S_DEV= 0
##$TDeff= 0
##$TDoff= 0
##$TI= <>
##$TILT= no
##$TM1= 0
##$TM2= 0
##$TOPLEV= 0
##$USERP1= <user>
##$USERP2= <user>
##$USERP3= <user>
##$USERP4= <user>
##$USERP5= <user>
##$WDW= 1
##$XDIM= 8192
##$YMAX_p= 0
##$YMIN_p= 0
$$ End of Bruker specific parameters
$$ ---------------------------------
##NTUPLES= NMR FID
##VAR_NAME=  TIME,          FID/REAL,        FID/IMAG
##SYMBOL=    X,             R,               I
##VAR_TYPE=  INDEPENDENT,   DEPENDENT,       DEPENDENT
##VAR_FORM=  AFFN,          ASDF,            ASDF
##VAR_DIM=   8192,          8192,            8192
##UNITS=     SECONDS,       ARBITRARY UNITS, ARBITRARY UNITS
##FACTOR=    0.0002004,     1,               1
##FIRST=     0,             0,               0
##LAST=      1.6414764,     0,               0
##MIN=       0,             -347618,         0
##MAX=       1.6414764,     230692,          0
$$ Real data points
##PAGE= N=1
##DATA TABLE= (X++(R..R)), XYDATA
0@%%%%Qj6J6j6J8k6L2m0N6o5P3r0J14j37J61j92K25k62L05l54M08m68N35o10O92
29C67p82Q84r95J116j251J399j559J736j929K141k377K636k919L230l576L961
45B082m392M874n419O044o765P606q605R815j1315J3234j5787J9373k4821L4180
59B0104n4580J74854j54008k98326L62703J38457k67347j14967K80913N7624j99343
70e3916m6450J54155J828q3271m453L3024j7805K5540K2460l9991l1513M9002
82H610J2311m5659m341M9018J361k6400O424J9067j2694j3492L058K927n329l16
96e455L103M938N696M365K215m357j9340r056K0416R676k6036p446L1268L114
110A3101l0577R267L1165k3339l5439L0047L4958k8516k0631L3488M088m2412
$$ y = [0, 0, 0, 0, 0, 8, -8, 8, -8, 10, -16, 16, -24, 32, -33, 40, -50, 64, -73, 88, -104, 121, -141, 164, -190, 218, -250, 285, -325, 367, -415, 469, -526, 590, -661, 738, -821, 915, -1014, 1127, -1250, 1386, -1533, 1697, -1879, 2082, -2310, 2564, -2855, 3189, -3576, 4030, -4575, 5240, -6075, 7159, -8628, 10745, -14076, 20104, -34476, 140378, -13630, -311956, 50747, 189204, -78143, -193110, 87803, 145427, -53916, -100366, 53789, 55617, -27654, -32107, 917, -16888, 8652, 31112, -8879, -40392, 8610, 20921, -24738, -29079, 19939, 21300, -5100, 1324, 20391, 7697, -5795, -2737, 190, -5139, -5455, -2352, 2586, 8282, 12647, 14862, 10505, -8835, -17891, 2525, 12201, -13835, -21281, 9987, 13101, -17476, -8209, 22956, -383, -35822, -5775, 29183, 667, -19964, 13524, 17612, -24800]
122b4800J708M0146q661l0116K4992L1946k4850k3831K1478O691k8803l197K6207
135H910J28j8186P691J5934p387j2368N266K366j0437j697J2125K777j1774l842
149a0494J2423L617j6396n390K4995R362k9882q036L9108Q447m6817j0695M5698
162A5940O601m3168L981M5551n868l9239O924K6900q716j4284O740l202q635J4009
176C534O419j8695M233K2237j9582k8628K9673L0883l4312k4180L5271Q884m1012
189b5275L852M6776r511m0263J7900L1904k4661k3116K9458J4923k7658p574K3684
202A0439M56j6400M369Q866n817j969L371n748J92J2985n261j9333O161J7898
216A0209r192j7097J0690J5303r807j1621Q877J1701n660j3740k300J3633J0006
$$ y = [-24800, -23092, 17054, 8393, -21723, 3269, 35215, 10365, -13466, 8012, 14703, -14100, -17297, 8910, 9038, -9148, -1457, 14477, 7090, -5278, -12, 2354, -8083, -9780, 2345, 5122, -6652, -10494, 1929, 5546, -10850, -16240, 8755, 18117, -11765, -19801, 19307, 27754, -19063, -29758, 15940, 22541, -20627, -16646, 28905, 23037, -16202, -9278, 17622, 8906, -5378, 1362, -1840, -10475, 3534, 9953, -8742, -4509, 17728, -1854, -30482, -809, 30074, -4238, -28418, 6853, 15737, -25275, -21423, 25353, 15842, -24421, -6521, 25383, 722, -22394, 7064, 21987, -5671, -13245, 10439, 10895, -5505, -1136, 7730, 1913, -56, 3315, -2433, -2241, 10744, 5483, -13850, -7689, 10209, 1017, -16080, -5390, 9913, 106, -11515, -2638, 9063, 3403, -10337, -12637, 996, 11002]
229A1002r718r423J2625Q040j7134p277J9939N925k0054r97J8648k260j5805P899
243A410J0673j3423q540J1814K751j0121K645Q080n046n086L305l264k117R395
257B476J826j0606K726J0501j0128j0274J4904Q908j7850l889K1677J985j8043
270e787K691J5701p582j2860P830Q076p479m321M243K03J417M906m618o267O353
285B506K011j2603j165J5559j168j6724L859J4840q211j2817J1688J1940r841
298a26o275J0039J791r984j23M181k283J171O707j824l247Q305J531j3886j430
313e453J4571k120j5457M509J3213q581j1408J0816Q524j0975l634R543p91p563
327d806L532K741q797j772P841j604k535J0497L504j1809j418J0680l826r084
$$ y = [11002, 1284, -8139, 4486, 12526, -4608, -11885, 8054, 13979, -6075, -7072, 11576, 9316, -6489, 1410, 12083, -1340, -9880, 1934, 4685, -5436, -2791, 5289, 243, -4843, -1538, -4802, -6919, 2476, 4302, -6304, -3578, 6923, -3205, -13479, 1425, 10333, -7517, -11406, 10271, 12256, -5787, -3096, 12605, 5023, -7837, -7, 8069, 590, -3731, 512, 715, 2132, 7038, 2420, -3847, 2506, 4517, -8086, -9251, 6308, 5140, -11584, -7725, 7115, -1096, -13913, -2225, 9715, -126, -6401, 3638, 5429, -4555, -4678, -497, -2780, -1609, 5098, 3274, 27, 8332, 9863, -4023, -5453, 9118, 6998, -8459, -3950, 9263, 682, -10726, 90, 8614, -2361, -5995, 3548, 2757, -4806, -1274, 1467, -7330, -9102, -1261, -2865, -5400, 5097, 8601, -3208, -4626, 6054, 2228, -6856]
341f856R725R273j2788q454J2249L989j0987R69J2421k425r236L047N630n036
355A521n751L82Q36j162M76J074L288K820l914l487M661J922p176j188N846j748
371a600n483O183N819m751L26O450n123o783Q692N110j1459J11J2889o369j5122
386a1110Q581J2351j2071o404J6854K522j6834L056J3835j1395j4713J0777P172
399B621j2632K339J7903m306j4562Q164P778j2989l379J6451j879j6123O410J4342
413A0138q078r725J1485N742j2119j499J2212m34q646K744L849q337l608O299
427B3J11m622L350O002j198k874k5l118l298J223J71r71L741M600l913m037N663
444H28N312m790m864K075K658o10N6K652K221j023o425m350N281P637k403l398
$$ y = [-6856, 2869, 12142, -646, -9100, 3149, 7138, -3849, -2880, 9541, 7116, -2120, 927, 6557, 1521, -4230, -3848, -3012, -4174, -3698, -2624, 664, 3484, -430, -3917, 744, 2666, -4510, -5698, 148, -1600, -7083, -900, 4919, 168, 494, 6944, 1821, -4962, 3730, 8840, -2619, -2508, 10381, 4012, -11110, -2529, 9822, -2249, -8653, 8201, 10723, -6111, -3055, 10780, -615, -15328, -4551, 2621, -10011, -7672, 10231, 5925, -8637, -473, 7305, -5684, -9063, 7388, 5509, -10614, -4204, 10138, 2060, -7665, 3820, 9562, -2557, -4056, 8156, 7722, -924, 1820, 5669, -2668, -6276, 23, 134, -4488, -1138, 4864, 3666, 792, 767, -2351, -5649, -4426, -4255, -5226, -1485, 3115, -798, -4835, 828, 6140, 1350, -3514, -1439, 1219, 609, 665, 3317, 5538, 4515, -1910, -6260, -979, 6658, 4255, 857]
460H57L116J153o846l015N164J88n575j54M294K55R7L359p43m933m01J264k582
477d502L2N384K07l998L241M688l292l990L824J438m109R64N274q72l582J282
493A989m55l957P82M744k877k335N454R72o594p0M451n210n150P156L327p857
509e630J090J0267l989r443Q177P399j2942n818J5117L228j2534L331J2532r265
523A520j0933J2292P962j3014k430J2283l740j0893R386R052j3672p054J3066
536C825p22j3108P955J3963j1330j2535J1926P836j4185m730J3768J699j0475
549f113K149R763k681o356Q41K555q05J886J600j721l12J909j0k119M71J497p46
566A808l095m32M560K450m830m481L993L164p035j710R667m0j1803Q77J0916k575
$$ y = [857, 3973, 5126, -1720, -4735, 429, 617, -4958, -5112, -818, -563, -466, 2893, 2150, -2783, -3184, -1920, -4502, -4470, 914, 1121, -2877, 364, 5052, 1760, -2230, 1594, 3032, -1077, -113, 5161, 4289, 707, 1989, 1534, -2423, -1641, 3103, 226, -2109, 3345, 4317, -2277, -2347, 2104, -3106, -8256, -1100, 2227, -5630, -4540, 5727, 1738, -7705, 472, 7871, -5071, -10889, 4228, 7456, -5078, -1747, 10785, 1520, -9413, 2879, 10841, -2173, -4603, 7680, 3940, -6953, 2433, 11485, -2187, -9241, 3825, 3103, -10005, -2050, 11913, 583, -11952, -26, 7810, -6375, -11105, 2663, 4362, -6113, -3964, 5799, 3118, -3238, -2397, 158, -647, 1239, 2839, 1118, 806, 2715, 2705, 586, 1057, 2554, 1808, -1287, -1719, 2841, 5291, 461, -4020, -27, 3137, -3898, -5608, 4059, 4019, -7784, -6907, 4009, 1434]
582A434q386N335O686q572m403R902K729o937K639O417p865n363R842L505r569
597b606O28R668l850p642O231N437q707m039O744k91n150M422L514q314l180J0035
613B900N73r037J565P756m736o806O405N801n975l330M787J737j704K91M01q91
629b63L333K160n260k007O113j007p626L157R495m582r626N926P829n960o108
644d426M670P02n407J831M271l119j450L966k988m493O812N255q998k764R942
659C804J173j1180J245J0353l982p475Q714O336r681l723J0267K17r377J531P135
674E357l914n093N485K489o096j948M840M81k654J624N7m444N72L548j788k404
690c888L124J597l164n56M720K27m838j16N217J201m065j463M208J566m893j163
$$ y = [1434, -6952, -1617, 5069, -3503, -7906, 1996, 4725, -2212, 427, 6844, -1021, -6384, 3458, 6963, -2606, -1978, 7690, 3840, -3802, 2429, 7866, -841, -4880, 1864, 1573, -3577, 845, 4359, -3955, -7135, 2900, 3473, -5564, -3999, 3757, -979, -7785, -1380, 4421, -1554, -4884, -97, 1640, -64, 227, 628, -263, 3070, 5230, -30, -2037, 4076, 3069, -4557, -1400, 8095, 3513, -6113, -187, 7642, 1682, -4426, 244, 946, -4461, -2630, 1641, -1478, -2928, 1038, -1950, -6443, 369, 5624, -3374, -6138, 3804, 4977, -6203, -4958, 5395, 1413, -6062, 2652, 8988, -693, -4416, 5851, 6068, -3309, -1778, 5357, 1443, -3650, 1835, 4324, -1772, -3720, 1120, 1601, -1053, 571, 628, -3816, -3244, 304, -1484, -3888, -764, 833, -2331, -2887, 1833, 2060, -2778, -2894, 2323, 3524, -541, -2004, 2204, 3770, -1123, -2286]
706b286O778J824p677j605Q264J04q900M01P692l226p073M934N002o494k908O553
722A383j97n669K878L754n170j550P101k375p622O178Q193p684n297J1429K096
737G448j2280R34J2038l792j0322N808P910p372m328Q118k13o862J864M726m726
752a049k135O379k048o789L023M502n084k221P204O96p363K779N912m769m017
767d980O643J606p226M75P871p81n336K214L780k627l210K556J676p89M74j485
783H61k456K233J845l779k094N010J964p011j808O804J456p211n16N855nn387
799d239P14N633n3m971M3M124R61j932n89J052P59o84q13J141J663j60k263k32
817A54J343j09j155k30P55L30j406m76O95K22j930p90K203P20k834n59M409q98
$$ y = [-2286, 4492, 6316, -1361, -2966, 5298, 5402, -3498, -3097, 4595, 1369, -5704, -770, 4232, -2262, -5170, 1383, 1186, -4483, -1605, 2149, -3021, -4571, 2530, 155, -7467, -1289, 6904, -780, -6077, 5352, 7448, -4832, -3898, 8140, 4348, -5974, -166, 7744, 372, -3956, 4162, 3949, -2913, -1049, 3677, -1049, -3184, 3195, 1147, -5642, -2619, 1883, -3201, -5422, 1782, 2478, -4885, -2106, 3806, -963, -4980, 1663, 3269, -3957, -3482, 4389, 3608, -1728, 486, 4266, 1639, -1571, 985, 2661, 1872, 2346, 861, -1595, 638, 2483, -1296, -3390, 1620, 3584, -3427, -5235, 1569, 3025, -4186, -4702, 1153, 1148, -4239, -3525, 2108, 2055, -2916, -2873, 1251, 2212, 280, -309, 743, 1502, 818, 5, 1146, 2809, 2649, 386, 154, 1497, 1388, 233, 3, 758, 1088, -318, -794, -99, 123, -1807, -2597, -394, 326, -2508, -3067, 1342, 444]
835D44n410J709O541k076o664M458O134m557m578O171L091o937r89P094j161m865
851a595L817K129o180M37O910l819o382O219L940r558j850J1157j858j1982M360
866d255J1429p516r232R520N956r762k635R671q8q141L331O236m148l236N738
881B868N5n364L296M461n225k289O001L14o651J056O470l498n617L826M167m714
897h44k721M415J252m649j374K795J157j251l85J222N7j525q16K016K472j459
913C62j450J138J208j195O13K024q96k793Q15K365k61j03K12j053j831J275N30
930I60j287O99J153k530l043L807K846m244k608M509O31m913J146M922j253m412
946c617J745L199j426K51J236j110j519K530O18j936J607K664l935k999N200K302
$$ y = [444, -4966, -3257, 3284, 1208, -5456, -998, 5136, 579, -3999, 2172, 5263, -1674, -2663, 4431, 3270, -1595, 2222, 4351, -1829, -1392, 5518, 1699, -4683, 1536, 5476, -4082, -5932, 5225, 3367, -8615, -4255, 7174, -342, -9574, -54, 5902, -3860, -6495, 3176, 3088, -5053, -1722, 4514, 366, -2870, 2868, 2923, -2441, 855, 5316, 91, -2198, 3803, 4117, -2534, -1478, 4992, 1494, -4123, -297, 3870, -844, -3565, 850, 2102, -2547, -3921, -1126, 31, -1220, -1605, -383, -326, -1851, -2667, -651, 1821, 362, -1088, 50, 1258, 63, 676, 2700, 1804, -989, -174, 2191, 1930, 1827, 2039, 986, -845, 430, 960, -327, 372, 1525, -1005, -4048, -241, 2605, -1639, -4247, 262, 893, -4020, -2874, 2048, 795, -3617, -1872, 1327, -99, 152, 1388, 278, -1241, 1289, 1907, -29, 1578, 4242, 307, -2692, 2508, 4810]
962D810o239j202N788J60n367J100M146l721m024K946K693k216m39J014q09p49
978b109K392n76k432J753K662k653j459M158P5m308J204N350j859m421L421L951
994E149m272l036M987K65n541M70N227j493m192J325K447j317j154J882j152k022
1010b427R82J038j547K43Q96j164q06M114J408m315p73M245M93l417L91K982j421
1027I22k452J334L618r2l062j506J981K702p81l324L22J530k304j694L062J608
1043A864m137j093L536R14k129R65O49k880n52K480k86j868K242K143k654j97
1059a003L799r10l373K584K864l777j546L423O8l376J905K446l237j926M027R95
1075B963l584l93K068k430k122L312N92k866l0K334j080n22L600p82l849J327
$$ y = [4810, -1429, -2631, 3157, 3317, -2050, -950, 3196, -525, -4549, -1603, 1090, -1126, -1565, -551, -1360, -2109, 283, -293, -2725, -972, 1690, -963, -2422, 1736, 1811, -2497, -1293, 4057, 2198, -2223, 1198, 5149, 877, -2159, 2828, 3093, -2448, -1978, 3249, 1756, -2436, -1111, 1336, 19, -1135, 747, -405, -2427, -1445, -407, -1954, -1711, -815, -1979, -2785, 1329, 2737, -1578, -2351, 1894, 2387, -1030, -639, 2343, 922, -1530, -196, 3422, 3330, 268, -1238, 743, 3445, 2664, -660, -338, 1192, -1112, -2806, 256, 1864, -2273, -3366, 170, 1084, -1045, -80, 569, -2311, -2863, -383, -669, -2537, -295, 1848, -806, -1003, 2796, 1886, -1487, 1097, 3961, 184, -1362, 2061, 2129, -1247, 658, 3104, -133, -2059, 1968, 2963, -621, -1014, 1054, -1376, -3498, -186, 406, -2460, -2490, -156, -1236, -1758, 1842, 1060, -2789, -1462]
1091a462L738k639k825L351J919k982n2L860j8k987M31K097r49q41N03o83r89
1108e28J626j86k282L96K690j299k502J749K171l151k640K831J933l038j400L161
1124d69J301j911k04J861M89j211M25K21l90Q26n43q29Q11K019n33k200J525J974
1142C162j951j983J153J501k391j399J793J87j711l7J621K13j749j71J469J36
1158a57j520K89J639p67k242J351L273j204k103J668K826k029j666K468J224l262
1174b12r55K935p57j737K063Q94k625J59K556k228l354L356K743n481j943O903
1190B317K24p659J283P372k712p101M134O316l779l669M374J461m616K29L836
1205B010r89k120L362Q94l854O57L755k621l129K820J952m432j61M323n65m042
$$ y = [-1462, 2276, -363, -3188, 163, 2082, -900, -952, 2908, 2890, -97, 334, 2431, 1482, 641, 1144, 461, -528, 1098, 912, -1370, -974, 1716, 417, -2085, -336, 1835, -1316, -3956, -1125, 808, -2230, -3630, -469, 832, -1079, -1283, 578, 1067, -144, 281, 502, 112, 938, 395, -434, 377, 2396, 1863, -337, 1188, 3162, 1211, -772, 381, 1882, -509, -1908, -115, 72, -1639, -1676, -55, 158, -1591, -1762, -293, -157, -1677, -1388, 251, -516, -2758, -1407, 1866, 662, -1441, 227, 3053, 1024, -642, 1826, 3050, -212, -1167, 1768, 1011, -726, 1337, 2231, -394, -235, 2321, 93, -3261, 95, 2838, -2643, -4586, 2317, 2541, -5118, -3835, 3537, 825, -6276, -2142, 4174, 395, -3274, 1100, 2561, -2055, -1826, 2010, 1021, -1099, 2263, 3157, -697, -40, 3715, 1094, -2035, 785, 2737, -1695, -1856, 2467, 1902, -2140]
1221b140J247K278l117j672L060P88k804R74K551j489j829J585M18j549J27K099
1237E27j80j70O26R31j240j09k59K30N63P05m57q52O38N48j575n71Q75L5n71j1
1257c17qR66L1j499j420O11R91k043l3K909P08k004N90J961j167j722J350J23
1275B7r51J107K079j561p59K517k32l085P67K864j532k851L312J507m039j768
1291b598L148P49m564P02M018n93j789J283Q17k701q96J317j161k65K258Q43k024
1308a456J375L917k073l570J699K571k999j127M153O29l980N0M077k263k607K799
1324A195J897l921n22M124n05n086M27L210k380k797L272K521k204L25K001q87
1340F70k449J638q8k560M67L621o57j465K466K335k724k029K425R37k983J60K011
$$ y = [-2140, -893, 1385, -1732, -3404, -344, 444, -2360, -1386, 1165, -324, -2153, -568, -150, -1699, -1572, 527, 347, 177, 803, 1734, 494, 385, 126, 356, 919, 1624, 1167, 315, 953, 1501, -74, -645, 230, 265, -306, -317, -325, 641, 672, -827, -2247, -1636, -645, -2688, -2721, 188, 896, -1108, -518, 1443, 276, -1446, -96, 27, -924, 183, 2262, 701, -58, 2459, 2227, -858, -91, 2773, 1241, -1610, 1702, 3209, -830, -2598, 550, 1299, -3265, -2563, 1455, 862, -927, 356, 1173, -1528, -2424, -1107, -2268, -2533, -275, 568, -1456, -81, 3836, 1763, -1807, -108, 2463, -536, -1663, 2490, 3119, -861, -811, 3266, 1003, -1604, 1195, 3092, -829, -1351, 2773, 2268, -2818, -2391, 819, -1561, -4358, -1086, 1435, -769, -444, 1557, 670, -1779, -141, -229, -2789, -2322, 1299, 642, -823, 1643, 3978, 1254, -775, 1650, 2587, -396, -236, 1775]
1357A775m43j768N66O45j151l83M66J021J90l54o33k27p10p02o38M2R2N34J193
1376d85R56M09Q52N5k199j204J232J038j249j82K295m12j070J276J533j838p22
1393B85J618p90k412J883K009l322k488K838R75k417K11L032o77k344J185J375
1409I61k655p40J515j539r06L683J704k691K88L644j416l206J566K434l249j897
1425b504L614J537l090M52K372j454j775J992Q68k772j20J779k027j341K124N96
1441B51l253J17L515n65j882J925K131k863j640J628N88j401L90K021r63L33J762
1458B094M8j748J265O67j957j743K404Q93k161n75J612r3j871J167J524j225j310
1475a009O42J83r09n8K16j253J54J423P10p09L93J251n12j039N91Q86m06j878
$$ y = [1775, 1332, -436, 130, 775, -376, -759, -293, 728, 918, 564, -69, -296, -1006, -1708, -2346, -2304, -2212, -1678, -485, 471, 880, 1732, 1787, -412, -1616, -384, 654, -595, -777, 1518, 1106, 36, 1312, 2845, 1007, 285, 1903, 1113, -1299, 584, 2593, -729, -3217, -379, 596, -1821, -1610, 1422, 745, -1599, -414, 961, -1694, -2434, -919, -2458, -3364, 319, 2023, -668, -380, 3264, 1848, -1358, 208, 2642, -607, -2504, 1110, 2647, -443, 9, 2381, 927, -848, 1144, 2012, -760, -880, 899, -1128, -2469, -345, 251, -3002, -2885, 630, 65, -1817, 108, 2239, -624, -2264, -636, -48, -1449, -1059, 962, -1, 332, 2094, 2142, 394, 1659, 2326, 369, -1374, 1030, 1923, -238, -813, 799, 706, -1165, 2, 1526, 301, -1009, -367, -184, -1093, -1151, -935, -2188, -2034, -611, 99, -610, -217, 1034, 522, -517, 74, 960, 554, -1324]
1493a324R27J696K26j052j68J489K5j362L63L97p77r66K09o8pQ45l47j102n27
1512a523J855M07j898p80K214k74k257N95K102j75k078J093J723m95o63J263j47
1529I62j124J283N81j539l88K315p38k360J553J721k187j244K762J06l160L52
1545a105K333j764k283K475J321l052m68L283r63k401J913J701k720j71L194J01
1561A394k794J542K157k301j024K419L21k548O77L069j580j677K060l44k669N70
1577g28K533j095k304J087J221j279j050J204m74q04Q35Q99j12j94N38r56q33
1594a512P96M92m17q5J251J217m56k54l19N41q26n77O14N14p33o96P43J835j191
1613I37j580O38J20n83M11J077j122j533P28K09j367N70J548m53j542J758K670
$$ y = [-1324, -397, 1299, 1525, 473, 305, 1794, 1819, 457, 820, 1217, 440, -526, -317, -385, -392, 453, 106, -996, -1523, 332, 739, -1159, -1939, 275, 1, -2256, -1661, 441, 266, -1812, -719, 1004, 509, -154, 1109, 962, -162, 1121, 1702, 163, -225, 2090, 1352, -1008, 545, 2266, 79, -1165, 1597, 1703, -1457, -1105, 1228, -536, -2819, -344, 977, -2075, -2543, 740, -223, -2624, -711, 990, -1730, -1901, 1293, 1394, -1400, 142, 2299, -2, -1026, 1393, 1714, -834, -157, 2912, 1332, -345, 1715, 1371, -1298, -728, 1805, 710, -1594, -507, 714, -565, -1615, -411, -885, -1689, -854, 45, -67, -261, 277, -679, -1512, -716, -224, -641, -726, 525, 1742, 1286, 1032, 713, 1254, 428, -149, 465, 979, 246, -450, 293, 2128, 937, -643, -5, 115, -468, -57, 1020, -102, -1635, -907, -698, -2065, -1495, 53, -400, -1942, -184, 2486]
1630B486j638k156J318O05j996l53K902j50j412J422K094j546j194J139m09j861
1646g49N72J512j258j553J900J223k753o36K648m18k749J727K231k058j678J049
1662i90O92j887J70J602J74n75J880J292j868j10J056j180k193J613J810j366
1678A20n78K144J223j525r88R08q09r84p2R8l3r0P6p99J81M86Q5m56J41J255K12
1699E95o50l33o57k28l45P16j57J350J037M20j14M18l61j638k11K20k70o25J109
1718B76N42k00L55L93j056o47Q80j123j316J331J099j941p43J918j36j952J141
1735a179J804j07r62J377Q0j120l31N50j356o14K527O89j592J362K605j659k180
1752a06P14J010k890j00J896l05p81J382K02j924K02J630j229j993J944J452k024
$$ y = [2486, 848, -1308, 10, 615, -1381, -1734, 1168, 1018, -394, 1028, 3122, 1576, 382, 1521, 1112, -749, -177, 1335, 77, -1476, 424, 1647, -1106, -1742, 906, 488, -2261, -534, 1697, -361, -2039, -990, -298, -2185, -2015, -413, -239, -814, 1066, 2358, 490, 380, 1436, 256, -1937, -324, 1486, 120, -458, 1686, 2909, 1384, 396, 1304, 495, -489, -561, -463, -496, -586, -510, -1309, -1128, -642, -557, -1013, -872, 383, 595, -55, -388, -1045, -1273, -1618, -902, -1059, 291, 1328, 1748, 1634, 2052, 1691, 53, -158, 62, -208, -833, 276, 818, 618, 973, 1366, 310, -337, 543, -580, -1896, -565, 534, -1407, -2150, -232, -368, -2320, -1179, 625, 518, -444, 933, 1013, -107, -438, 112, -1244, -1858, 669, 1358, -234, 1128, 3733, 2074, -106, 608, 1618, -1272, -1372, 524, 219, -562, 820, 1022, -902, -700, 930, -299, -2292, -348, 1104, -920]
1769i20p39K084p49k092P87K388n24q10J858P38j340l85N10o88j114R75J42k26
1787a05J282J345j349p88P30J1k006l86J627k10j430J34J558m15j288M17J00k67
1805a040K69Q54k12m06L37P6p81j4J106J25l66O58J120J85r56j23n72j72k67k88
1825d67P43O64m03l33O20j05r92o83P80m09r53L30J060J26q36k91L15l23M29N08
1845b20j69K57J036n71r90O11R43r22j059J429J339p22k58J392o98j742K61J198
1863A115j324l01J288m42j198O47J233j413j006R31m28q39J483O62j519o40K160
1880D09k02j708N13J760r40p58J930P44j571n1J205p17j096J927K82k178N59J869
1898A977j173j834J419Q00k031m02J706j71j184L11J269j862k82R61j20j179J117
$$ y = [-920, -1659, 425, -324, -2416, -1629, 759, 235, -575, 1283, 2021, 681, 296, 806, 118, -996, -21, 121, -105, 1177, 2522, 1173, 385, 1115, 1126, -880, -1266, 361, 151, -1279, -1145, 413, -2, -1290, -873, -773, -1040, -771, 83, -129, -535, -198, -122, -903, -917, 189, 314, -52, 606, 1726, 1911, 955, 832, 260, 88, -179, -467, 276, 940, 537, 204, 824, 719, -273, -956, -176, -585, -1538, -1208, -148, -22, -858, -1149, -834, -1157, -728, -220, -389, -132, 904, 333, -657, -46, 897, -25, -1084, 345, 1684, 962, 704, 2096, 1398, -344, -83, 1115, -209, -510, 778, 336, -862, -215, 1018, -395, -1401, -470, -898, -1737, -254, 408, -1111, -1751, 409, 207, -1501, -988, 772, -168, -926, 1004, 1748, 177, 126, 1331, 614, -482, 1445, 1727, -451, 108, 1977, 804, -1030, 389, 1189, -842, -1244, 462, 291, -893, -582, 687, -1175, -1457, -496, -616, -1795, -678]
1915f78J070r30n75J582Q75j740k69J312r5j055M73J690q32q52R5J175M3j106
1933A83M53r3k9l44j64j08j38j23m62L8M91M92o11m06n21J321q4j254j38J440
1953e7K6j154N95J407k29j469J534J249r97n74R80n87q89L82J009j412k16K106
1971A704l38j876O93J371j794j638J550R94j967q26K625L2k542O03K146r94r03
1988a160J470L01j631P55J214j550k91J658J00j673R97K430r51k207J370J397
2004B229k100j438J386J072k145J05K383n86k148J247Q04j702j80J004p76j212
2020b057J625J032j479k89J673k44j402P87J663r63j091J580K26j617M78J002
2036I24p96q11J958O27j511q3J845r30k195J34Q96m95j235J068J088j87j211L31
$$ y = [-678, 392, -538, -1113, 469, 1344, -396, -665, 647, 552, -503, -30, 1660, 828, -24, 71, 1246, 1289, 183, 636, 543, 514, 170, 6, -102, -240, -363, -825, -787, -296, 196, -415, -821, -1342, -21, -105, -1359, -1497, -57, -31, -1185, -590, 817, 588, -881, 653, 1902, 905, 331, 1311, 724, -165, 217, 1226, -186, -402, 1704, 1366, -510, 183, 1554, -240, -1878, -328, 666, -1301, -2127, 498, 530, -2012, -1409, 737, -257, -1160, 310, 611, -1020, -265, 949, -601, -892, 766, 866, -807, 190, 2620, 1669, -538, 832, 2229, 129, -1309, 77, 1149, -996, -891, 1492, 906, -1242, 5, 809, -893, -1073, -69, -845, -2057, -432, 600, -879, -1168, 505, 261, -1141, -354, 1309, 346, -745, 835, 1061, -556, -78, 924, 128, -683, 1275, 1902, 391, 308, 2153, 1223, -972, -838, 58, -437, -1672, -604, 484, 297, -914, -583]
2054e83M38k51m99k70K07N02m0L07M8K5k9K7K77j06P37N45p46k26J000l56j926
2075i19Q46O20k44l35J150J68j558l1J472j436j794J010J189j782o4K421l75k102
2093a764Q77J649j193j127J351O71j043Q8J314j78j651J412L40r71O13J507p04
2110A191j228J203O47k083q21J561K66j673K54K089p14j702N98R43j350r96J220
2127e95N3o36O24R55r37j88O63J17j052K12J663l03o15O65M41o87k66L96N1k00
2147C61J13M44j86pj25l46n81K47n13o49P01L22L28k90k93n5j28L2j49J39N3M85
2169i7j67l2M37K62q04k80J022M86p46M46P33m97l08R6l1n05J52K32j97J64N04
2190H70m78j049M51K79l85j201R45J49l95M97L15l06Pr3n77R2J296K6j078P36
$$ y = [-583, -145, -396, -895, -1165, -958, -456, -496, -189, -141, -116, -145, -118, 159, 53, 790, 1335, 589, 363, 1363, 1007, -919, -73, 547, 303, -32, 1118, 1286, -272, -303, 1169, -267, -2061, -1051, 138, -1644, -1708, 713, 338, -1764, -887, 762, -431, -1558, -207, 464, -579, -491, 823, 645, -1006, 406, 746, -225, 388, 1895, 1191, -37, 1166, 1813, -270, -1091, 470, 736, -937, -683, 1406, 692, -1010, -412, 531, -819, -1815, -595, -542, -1178, -554, 401, -536, -724, -61, 56, -996, -784, 879, 576, -39, 626, 1067, 380, 114, 510, 561, 361, 474, 918, 732, 725, 600, 254, -327, -80, -593, -1242, -541, -219, 109, -181, -474, -529, -657, -625, -774, -635, -582, -97, -264, -296, 141, 403, -401, -681, 341, 827, 81, 527, 1260, 763, 455, 551, 520, 15, 167, 399, 202, 366, 870, 392, -657, -206, 73, -312, -1513, -568, -419, -814, -317, -2, -308, -301, -394, -971, -879, 417, 443, -635, 101]
2210A01J382l74j534N58J283j055o64J406qo16n0Q46j014j74K45l68o83O92J116
2229A089j590n09J152O2j495j11J817j047p35J068J007j292j72J181o02p78R00
2246e5J398j320k30J389J55j407O08Q96j006r14J111L31j128K50L19k84l05K45
2264E3p1m18k13O61n84n95M89O37o45n69J019Rm87lJ033N7l07LnK20M1J19K34
2287F78k34n0J02J69M2l07N5o6j7k55K52k38l96J91n8k10n48P03K10p00j43O60
2309a60j77m39J81J88lJ9M24K63m83L50P13m04k68N20L00j172J63Q65N6p14L13
2330E35M55q06l52M07J2n69K58J11n92n60J006L76j222j25J283m85j169R56Q64
2349C83j068k85J476N1j180O70J005q20o57J148l1q42Q56N75j034o91J162K16
$$ y = [101, 1483, 1109, -425, 133, 1416, 361, -303, 1103, 1095, 479, 429, 1275, 261, 87, 332, -36, -719, -27, 1089, -501, -1010, 142, 204, -1291, -1402, 415, -632, -1367, -299, 708, -584, -756, 425, -177, -955, -55, 1343, 23, -207, 1182, 1337, -70, 538, 1434, 428, -486, 625, 956, -172, 78, 397, 113, -192, 53, -18, -436, -649, 12, -572, -1167, -678, -41, -686, -1255, -236, -227, -714, -717, 316, 373, 66, 69, 64, 284, 325, 444, 678, 444, 394, 496, 665, 707, 400, 455, 389, 372, 117, 369, 131, -265, -74, -132, -342, -890, -187, 23, -677, -820, -160, -337, -776, -595, -407, -410, -391, 33, 296, -187, 163, 876, 472, 204, 724, 1024, -148, 15, 880, 936, 222, 535, 990, 184, -168, 239, 251, -318, -60, 51, -541, -1101, -95, 281, -941, -1066, 217, -268, -1437, -481, 383, -685, -970, 506, 557, -623, 47, 1052, 232, -425, 723, 692, -150, 706, 1281, 247, -444, 718, 934]
2367I34j303q9J253l71j124K40J045j147m96J077j56q85M80P00p39o23J070J98
2385F4o82K26O16L0n14N52P73o28m43K65M00l04j00J49O47l29n12j57M15j2n47
2406i1L91j09m68rK39k62l44O14m36m51q0Q57j23n39K42J034p60m38P80N94o30
2427A1q1Q18j18n63L20O49q31o3R28k75j046M48R07j131n46P57M20j028l21R25
2447A80Rj300M95Q23j029r6Q13L02j191J41J140o32J41N23L38o84j51R12l43o53
2467b62P93N78n33l66O95M1o81Q3Q0k43l45K13l0n53K09J55o2m34r6N78J9n80
2489g41M44L03l83k13J23K12K03K7j80M79K77L09n63K58%%l50L23r0K99k62k02
2511B73L2j47m9l70M12m65j5J68k01Q0l78M7J0O8J83j31J08L04n31Q09k9q12P18
$$ y = [934, -369, -458, 795, 424, -700, -460, 585, -562, -1058, 19, -137, -1022, -542, 158, -581, -1204, -134, 64, -618, -392, 224, 254, -260, 292, 1065, 437, -6, 259, 659, 355, 255, 404, 1051, 722, 210, 53, 468, 456, -91, 300, 191, -277, -286, -47, -309, -653, -39, -475, -926, -1006, -149, -272, -811, -569, 465, -295, -733, 47, 641, 11, -70, 748, 630, 67, 387, 1036, 205, 142, 1070, 795, -251, 197, 1104, -27, -573, 184, 604, -424, -745, 180, 189, -1111, -616, 207, -822, -918, -105, 197, -994, -853, 287, -345, -204, 319, 657, -27, -178, 734, 391, -262, 531, 1109, 576, 210, 905, 946, 265, 348, 428, 185, -160, 53, 23, -530, -321, -166, -228, -662, -758, -180, -161, -741, -297, 6, -377, -590, -467, -255, -52, -25, -205, 274, 551, 860, 297, 555, 555, 555, 205, 528, 438, 737, 475, 273, 305, 158, 109, -261, 151, -314, -329, -161, -362, -282, -660, -613, -603, -535, -352, -483, -375, -71, -602, 207, 178, -634, 84]
2534H4L49m56K7L14L57m50j32N54K60p12M39j13n77M74L65q00o65Q28J09p55j80
2555f80R97n04q59K32J048p63m72L16J014n99j87O20l36J64O51l39k09r3M50p1
2575C80o68J213K89j020p8M20J28q63O5M76n59M0L03O8p27M71o82P0L80L93n47
2596d48n79L54N58k85j0L20M2J07K00J62Kj79m3k39K39J70J21KJ02M9q8o1m57
2619C9o0n4J06k79J62Okn05o8O07k49k04j31L27J94o74k42M79O67p62L0R67O3
2642D17k68l9K49L02r0l63O5m5o5K6j19M55J51k63l12J65j53Jl13Pn19J05K7J34
2666d45o0M64o4n93J34N31q5l85J75N18k17M1R8J47j7Q4L20j64J6L52l64r27O34
2689A93P19o31j168J325K72r18O6Q17l07r81p3N63m23n90N23J13k73O8O91j90
$$ y = [84, 433, -23, 4, 318, 675, 225, 93, 647, 907, 195, 634, 521, -56, 418, 783, -17, -682, 146, 255, -500, -680, 317, -187, -1046, -814, 234, -529, -1001, -685, 329, -270, -457, 163, -173, -9, 642, 303, 94, 1, 451, 380, -288, 925, 1214, 194, 116, 536, 664, -199, -134, 342, -217, -177, 126, 194, -533, -62, -744, -674, -294, 99, -448, -1027, -673, -115, -400, -410, -90, -48, 59, 259, 421, 423, 244, 201, -38, 201, 371, 492, 494, 596, 645, 557, 496, 39, -21, -75, 31, -248, -86, -80, -82, -587, -655, -48, -297, -501, -632, -305, -111, -785, -1027, -548, 119, -643, -613, 354, 417, 149, 110, 359, 661, 571, 208, 273, 228, 163, 189, 70, 525, 676, 413, 101, 266, 113, 114, -199, -192, -711, -606, -579, -445, -505, -41, -105, -698, -564, -33, -118, -503, -328, 190, -27, 14, 112, 259, 242, 326, 646, 482, 498, 850, 486, -441, 193, 912, 281, -887, 438, 710, -208, -142, 675, 368, -613, -686, -123, -546, -1136, -613, -500, -773, -705, -14, -204]
2709b04l21J163j52p24l53Q80K40o76O1Q55n21n86P45O67j73m43k98O91q86L84
2729C49j77q00K10J5K33o7q4M86p46j05Q70k05n09j13rM65J15j51M78K2j97P7
2751A57M78pK92o27K01j89j67L03L08l23l60M11J1n36K39K19l44n55m9P25q67
2772f80k26M17J86NN7N70r20N08j36J04j60lP19p46k72R05L83p65J06J063l65
2793G50q52N37J40l58m31J28L53m77K88L90m21l37L03j50l22o3N69m46o16O32
2813c83J56l89J97N93J60l75K53P9l43K4K57l7j92K89P07n87n33P67L2l32k77
2834F6M00j52m94J70K34l46L7l03M06l50j11L88j38k77K26k70k06J91J65J81m51
2855f34%Q29J56l10J07N27k46j82K59p9O4q00P68J80l98j19J53j36m87q7N14l02
$$ y = [-204, -525, 638, 486, -238, -591, 289, 529, -147, -86, 769, 248, -338, 407, 1074, 901, 458, 160, 851, -35, 349, 172, -628, -418, -403, -170, -237, -321, 165, -581, -686, 184, -21, -530, -643, -652, -187, -72, -223, 255, 277, 80, 157, 635, 628, 920, 293, 494, 305, 138, 441, 749, 426, 66, 477, 488, -48, 191, 410, 66, -489, -538, 187, -680, -906, -489, -303, -298, -241, 329, -591, -83, -219, -115, -275, -278, 441, -305, -577, 328, 711, -54, 52, 1115, 750, -102, 435, 575, 217, -214, -86, 267, -210, 78, 468, 47, -290, 13, -137, -459, -522, 47, -399, -1015, -383, -227, -616, -419, 174, 334, -41, 212, 291, -52, -28, 229, 192, 0, 289, 996, 409, -124, 643, 675, 343, 66, 466, 314, -180, -10, 224, -122, -85, -388, 18, -332, -443, -55, -193, -470, -244, -514, -720, -529, -364, -183, -634, -634, 195, 351, 41, 148, 675, 429, 247, 506, 427, 491, -309, 459, 639, 241, 122, 275, 139, -348, -435, 79, -223]
2877b23m75O47J58p58r2M20L4m44K04Q08l86n29Q75Q5l65l09L38J3n7M07k7k68
2899E6K95K55m63p3j49O18j16k67L12m5p24q5J90K34n59n0L11K07l8K13m64n8
2921d00J81k28j55L32J27n6K7M34M8j31n6k4J37j29M66j32P5j36O1m46j32K40
2943A03L6L02m97L17L97l21q13K1K57n31o4J8L0P17j80K5J22PP0j34O5J95L7L0
2967B09j16L95j07k94jL66j60J53p6K45l69K04m34k60k6l23L15k17O32K87n09
2988h6j12m1k40j67m51K56N60M5J84j14M18J69m45o3M7L48J22k45J82L30k04m99
3010fo7M95K26l14rK62L67q67k17k00K4q6n71K58O76k09l77O58qj92N7J00n27
3033e27k36Q33q2l49L98M83K30m84M54N3l68n0n3O8j53P9j66j01j12N3l0M09K00
$$ y = [-223, -698, -51, 107, -651, -743, -323, -289, -733, -529, 279, -107, -636, 239, 324, -41, -350, -12, 1, -56, 351, 324, 56, 351, 606, 143, 70, -79, 539, 423, 156, 468, 423, -301, -386, -196, 38, -521, -571, -260, -53, -91, 122, -342, -400, -219, -447, -602, -270, -143, -199, -172, 262, 310, 179, 123, 99, 236, 107, 573, 441, 516, 380, 441, -5, -137, 103, 139, 441, -56, 261, 658, 337, -476, -455, -198, -729, -793, -775, -745, -28, -208, -183, -61, -54, 16, -118, -53, 142, 179, 209, 93, 488, 381, 87, 86, 452, 292, 445, 369, 614, 245, 449, 15, -245, -271, -594, -279, -496, 136, 423, -86, -198, -239, -479, -646, -1097, -841, -281, -236, -52, -166, 252, 421, -24, -87, -40, 308, 430, 185, 367, 697, 493, -6, -73, 422, 648, 334, 325, 587, 954, 87, -130, -330, -306, -392, -963, -705, -29, -238, -615, 43, 35, -157, -100, 0, -527, -763, 70, -12, -361, 37, 520, 750, 266, 720, 773, 405, 355, 302, 370, 217, 296, 130, 29, -83, -30, -60, 349, 549]
3056E49m64m99J55p6j43p01J7N01P18l32L47K22j28p4k97L3R6J3j02K22L99J76
3078F32l97m6M65J49l88K34L2l34j90k86j2j0j49k45J28K64K14Rj57K8k72k56
3100e87n1k23L04K34j08O1N99Q9l58J43K17J40m40J64J60O9k0k95K03J9K75j58
3122D37o8M8K54l61m11j94L40l53p03N42M47j22l41J84L89k27j87k57M64k42K48
3143a13j0o4J91N96j86k46j47P21l65l68L16K92j98n83L76L17o27k61O80k98k29
3164b06PQ8l06j24K73j84k3N1K41m20Q0M71L08m61k59R04j44o23J26O00K97o35
3186F1M55n1J35m01K65l93J70L46k30k12m14M90q5l78k27N79l12r7n31O27J62
3207d1m56j33R37k31n69K80K80k24P5R2K77k83J96K85k73L6K92k52q8l57P73n78
$$ y = [549, 85, -414, -259, -335, -478, -1179, -1162, -661, 57, -275, 72, 294, 166, 92, -205, -172, -76, -63, -165, 57, 456, 632, 235, 189, 654, 803, 415, 649, 681, 347, 157, -129, -141, -151, -300, -545, -417, -153, 61, 70, -87, -59, -331, -587, -638, -861, -557, -323, -431, -370, 229, 318, -40, 103, 320, 460, 20, 184, 344, 413, 393, 98, 301, 320, 595, 437, 369, 417, 671, 310, -101, -295, 45, -308, -1011, -469, -22, -144, -485, -301, 88, -139, -326, -583, -119, -361, -113, -123, -187, 4, 600, 414, 168, 21, 742, 377, 9, 325, 617, 419, -164, 212, 529, -98, -359, 321, 23, -206, -199, -111, -417, -541, -268, -452, -475, -424, -183, -603, -523, -52, 256, -205, -464, 440, 296, -327, -201, 399, 696, 61, 516, 465, 600, 199, 464, 71, 241, 587, 357, 145, -269, 221, 136, -242, -469, 110, -202, -299, -830, -203, -41, -497, -630, 307, 76, -493, -213, 67, -157, -82, 10, 287, 4, 200, 485, 212, 248, 540, 288, 200, -157, 616, 38]
3229C8k29N17M25o29r07J004kk83k08K9J06j45k12mk39P54n03R3J71R1M56m2o77
3252c96L01N07j74j67K66p8j79J6L03l7k5N8j32J78k46l25K96N4k73m04q2J35
3274d04J88p9r9J93J26N2k86k10M0K55n18K26M28J85m1Q7J7M0J14j79P5j80M20
3297D50j53LJ28p1j47k63K49q4K84N9l46m2n62J76P1k05j59M96o18M20M12K68
3319C66j05l21k86K85l31j53M34M52l1J31L06k20K84n23k82jL60l18K8rK07j76
3341I7m60k7K23lk56K70L79j95n39O5K87l72k93o8O89K15J37K64R4o3k85%k84
3364a25LK62L20k35J60J19j02k73N3K62n52M7K9J9j11j06j62r0K9J57Q8k15N00
3387G7j63L77q04J02K71l30Pr3N81K47K54j56M17k17n23K93N3l01r2K12Q7r4J04
$$ y = [38, -191, 326, 751, 122, -785, 219, 217, -66, -274, -245, -139, -284, -496, -500, -739, 15, -488, -395, -224, -133, 323, 281, -396, -95, 412, 238, 71, 337, 259, 80, 96, 399, 362, 337, 395, 263, 441, 195, -130, 166, 220, -53, -457, -539, -404, -216, -295, -394, -201, -75, -23, -309, -519, -479, -224, -742, -516, -88, 97, 56, 143, 160, 200, 314, 135, 210, 30, 450, 297, 300, 428, 357, 210, -53, 196, 112, 396, 455, 109, 67, -495, -319, -248, -453, -612, -116, -734, -314, 98, 366, 261, -60, -346, -61, -392, -545, -111, 341, 310, 441, 747, 527, 811, 288, 6, 5, 365, 47, 75, 66, 273, 97, -363, -390, -167, -170, -426, -156, 223, 28, -511, -446, -159, -531, -824, -892, -203, 12, 149, 413, 507, 444, 159, 159, -125, -122, 140, 460, 225, 385, 504, 402, 129, 182, 444, -108, -61, -32, -13, -124, -230, -392, -482, -453, -296, -208, -423, 77, -86, 291, -513, -411, -140, -470, -463, -556, 25, 272, 526, 370, 787, 570, 47, 340, 393, 92, 0, 212, 299, 205, 309]
3410C09k45j52J03k7j05K14j59j08j70k65M67m61J56o48P78M60J49l99N00m5o04
3431b52r9K75P9k9j58O66P0R8q7j86J69n35M8J11k38J24j5j39K31m34OK06j67
3454b56K2Pk48N93l33k54l4J84J92k76K28M92P0m45K46J48J37o32J69JJ11k3J85
3477B84M5J43m40J64J76o58K06Q1K7p2l1j60J28q6m1k91R8J97J23k87J69J51J69
3500I5m28Q6K72M3N2j39J71K04j39K59j82l17k3K66j00o7L42l33K13j51j12k49
3522b37J83l96J78O13m74k66o9K50P3m66J00O05j38%j67L10L3J20r2j13L12j53
3544B06n7J19K09j7n6n19N26j53l11J54j82M45l76l76K52K35l07l92k5O84m34
3565c75k01K00K05J16m00l22N88j3j36M63J08J45m77M0K97RP9l88M59L8O7k60
$$ y = [309, 64, -88, 15, -12, -117, 97, -62, -170, -340, -605, -138, -599, -443, -1091, -313, 147, 296, -103, 397, 352, -252, -351, -76, 3, -26, -184, 482, 552, 650, 563, 377, 546, 11, 59, 170, -68, 56, 41, -98, 133, -301, -295, -89, -256, -234, -227, -475, 118, -215, -469, -503, -319, -127, -403, -175, 317, 387, -58, 188, 336, 473, -159, 10, 11, 122, 99, 284, 329, 472, 32, 196, 372, -286, -80, 1, 28, -44, -75, -235, -107, -193, -234, -525, -427, -230, -107, -394, -225, -74, 95, -333, -247, 25, 68, 120, -19, 152, 356, 217, 476, 294, -23, -46, 220, 120, 53, 395, 62, 275, 124, 12, -237, -54, -450, -272, 341, -133, -399, -468, -218, -145, -611, -511, 94, -44, -44, -211, 99, 132, 252, 160, 47, 359, 206, 149, 268, 477, 460, 404, -115, 411, 258, -53, 101, -81, 364, -12, -388, -136, 99, -208, -600, -625, 59, -375, -576, -376, -171, -55, -455, -777, -189, -202, -338, 125, 233, 378, -99, -59, 238, 247, 326, -62, 397, 435, 502, 242]
3587B42J93j37j95j48m67M72J30r1j65jK30k04l33L65j86k30m9K30j20J94R2k7
3609b05j84L83J55j99M52k17L9j47l29O03J73m8l42j39M27r3m47J93m9N2k9l08
3631b59k4R7rrk22L54m4m00p2K36L28m95J68L08J66l33K43L35K38l30j62K29P3
3654D16m51O0J86j67K49K9l0l55K24J65j99j34q1N8m79J52J13L34n48K23nJ66
3676g4m34L05j31M70P0m57J90j77L59j33l57N42K69K57l69N3N3J62o02k57M25
3697A64J0k99j87M79J11l06k22Q8Q8j52j04Q4k40L82l26N9J6J57K33l11j2L56
3719F8K23k88q9Q63l15o89J48L14K46j35J09J66J3n23j84J80j54L0J28j89L8N46
3741E06m54m39j16K90J6j07Q6k2J94j24K1K93l30J19n2L24Q8j82J21j29k06L02
$$ y = [242, 435, 298, 103, -45, -512, -40, 90, -1, -166, -167, 63, -141, -474, -109, -295, -525, -574, -344, -464, -270, -178, -205, -389, -6, 149, -50, 402, 185, 224, 77, -252, 351, 524, 476, 134, -5, 422, 329, -118, 75, 26, 78, 49, -259, -283, -186, -195, -204, -426, -72, -116, -516, -588, -352, -24, -519, -351, -43, 123, -210, 33, 368, 606, 276, 114, 343, 416, -35, 25, 211, 44, 293, 322, 292, -63, 161, 326, 127, -7, -88, -30, -509, -357, -244, 90, -458, -235, -240, -74, -508, -203, -334, 136, 206, -251, -61, -238, 121, -12, -369, 173, 442, 699, 330, 383, 436, 598, -4, -261, 164, 174, -125, -312, 167, 278, -28, -250, -162, -74, -226, -330, -246, -486, -104, -430, -371, -355, -198, 35, -276, -288, 68, 291, 3, -86, 777, 462, -227, -79, 235, 481, 346, 455, 621, 634, 111, -73, 107, -47, -17, 111, -78, -40, 506, 52, -387, -503, -213, -197, -304, -218, -240, -46, -170, -149, 144, -186, -67, -119, 205, 293, 111, 232, 103, -103, 199]
3763A99J27l08j90P26n8m52l3O62l99m73j00O18l92l64M97qk06l74N10J3j04j07
3785b16l08K05j17L98q9L45K5J8j29k79K38K69k30j9l6L84J43q46L35n7J19k38
3807h5K42N7k9Mk38m0j09j31j4J29J03J01n01K86L5j86j45K86N5K21j29J49K06
3830B67l9j8j16M8J72k2j46j22L69k88K1k12J11K04l42L6J40m1j30J77k61p7M5
3853b24J47l44j74O32O3j97J76L9k17K11l42J84K4J1N4N3L94l55J17r2M4K97m85
3876A6J26J5K00l24j80K22M3l33l16O11j98p0k15J20Q6J92j40q0j30K80j07LK53
3899G4l30K50K1q7J11L16J36m94J77o0M33m00l24N80k2m74N4J01P7k63K27m00
3921b97j05K90o5j28J07p3J43k7p5K68k12l68K84L94k67M1J28K12k18Q7L98j72
$$ y = [199, 326, 18, -172, 554, 496, 44, 11, 673, 274, -199, -299, 319, -73, -437, 60, 52, -154, -528, -18, -5, -109, -216, -524, -319, -436, -38, -127, 218, 243, 261, 132, -147, 91, 360, 130, 111, 75, 459, 602, -244, 91, 34, 153, -85, 157, 214, 185, 189, -49, -89, -198, -329, -343, -214, -111, -10, -511, -225, -190, -376, -521, -235, -180, 41, -88, 61, 267, 228, 210, 94, 142, 314, 292, 146, 24, 393, 105, 126, -86, 25, 229, -113, -77, 63, 22, -108, 69, -192, -269, -224, -77, -421, -595, 37, 100, -97, 79, 118, -99, 112, -230, -46, -22, -11, 43, 96, 490, 135, 252, 160, 204, 501, 16, 142, 157, 357, 33, -147, 75, 118, -215, -531, 80, -118, -188, -403, -283, -197, -5, -145, -225, -355, -75, -182, -179, 74, -256, -6, 15, -72, 39, 355, 491, -3, 174, 114, 547, 147, -177, 403, 381, -93, -39, 62, 139, -124, 103, -297, -402, -112, -177, -305, -198, -271, -128, -155, -230, 38, -174, -542, -258, 136, -131, -90, 38, 250, 32, 119, 517, 345]
3943C45j77l7rJ67j89J57l94K22L6n4j10j85K20k73r8M20k31k9l7J52k26K97k18
3966b51j4J65L2j61M7L7K16L51R3k62P9l5k61L46j50k0J82j53r3K12k26Pl30P9
3990a10L24k76k81k01M83r3k58J84RM8l03J88J14j0KM97p14L32R1K5K01K4k9k64
4014a7K18L4J87j46j04P8j52j92L0M15l97k3p9L02l19l4J06L15m31k99J02K06
4036b00k71K88J19p4j44M24R9j13r2j33M82l95j64O28J37l11j97L06p3R4k65P9
4058B24j11r1m2k84L08J30N0n81j57O70m0n8l73L07j46k13M87k74J39L2K2j56
4080a57r1M72l9p1J48K13l60j33K50J55k19k23K17k00K71o30k3N24p7m91M10m76
4102e30L00L4j02J62P8k11K29k15K70J32Nm63M99j80L17n27L28L17J16k79j92
$$ y = [345, 168, 131, 122, 289, 100, 257, -137, 85, 121, 67, -43, -228, -8, -281, -379, 41, -190, -219, -256, -104, -330, -33, -251, -265, -100, -68, -229, -182, -145, 71, 422, 515, 253, 332, 297, 36, 382, 232, 212, 394, 241, 148, 360, 134, 141, -189, -110, 214, -62, -343, -544, -61, -154, -412, -228, -219, -171, -474, -286, -172, -182, -180, 317, -397, -65, 26, 51, 252, 276, 247, -17, 201, 235, 422, 276, 172, 250, 98, -94, -64, 351, -46, -69, -148, 154, -165, -199, -93, 222, -209, -508, -406, -200, -471, -183, -64, -138, -282, 142, 241, 128, 36, -97, 385, -10, -174, 454, 591, 280, 83, 389, 316, 410, 145, 224, 113, 22, -20, -304, 4, 134, 184, -397, -554, 116, 76, 18, -355, -48, -194, -407, 80, -194, -55, -23, -1, -157, -248, 224, 185, 114, 262, 475, 115, -18, 232, 387, 168, -55, 162, -38, 233, -397, -420, 104, 27, -464, -54, -530, -230, -196, -298, -136, -58, -269, -40, -255, 15, 147, 152, -311, 188, 8, 325, -202, 126, 443, 559, 280, 88]
4123H8K54j13j22Q0p9j01R4j99n8J74q1m8j46K90j05r6n2k9j0r1J6K68J8M8RJ71
4149A80j69j26M67m09K32O4m20J76K11P2r7k12N76J33o94l55N45K09l75J22k85
4170a55J91j17j30j98L56j09J80m6N3k97L15n34K07J00L37k58K80j08P7pk61M39
4192C15m5J59r8k57j10K51k47n7L69K42n85J46l80M67k36m7j52K0J59r0j37pJ46
4215a74N6j32L09j23j69q9K60K26j06J12l5K28j06J30k13J57k41K7K8K38m3j32
4237B08m01L62k59o5K10l33M72j87k22J87j85m46K70K14N1J43P8j91j99J26J99
4258C2k24m1M50j50J91j1l8L39k96o9M38k60l02qp6J43j31L56m13j86K62K62m09
4281a41l98N59Kj41k0k4J73k20L63k58K67k81Q3jq4O1m5k37O49m2k66n5J71J04
$$ y = [88, 342, 229, 107, 187, 108, 7, 101, -98, -156, 18, -63, -111, -257, 33, -72, -168, -220, -249, -259, -350, -334, -66, -48, 0, 9, 180, 11, -115, 352, -57, 175, 239, -181, -5, 206, 278, 181, -31, 545, 678, -16, -371, 174, 383, 8, 130, -155, 36, -81, -211, -409, -53, -162, 18, -28, 25, -272, 43, -491, -284, -184, 153, -105, 175, 67, 144, 137, -124, 315, 270, 429, 331, 74, -36, 215, -32, -89, 280, 522, -63, 83, -297, 170, -66, -113, -265, -245, -86, -176, -313, -320, -174, -118, -250, 59, -64, -233, -322, -62, 164, 58, 170, 135, 363, 257, 387, 174, 331, 90, 117, 145, 383, 340, 208, -193, 169, -90, -155, 55, -278, 194, 7, -215, -28, -213, -659, -389, -175, -124, 19, 97, -94, -293, -167, 32, -192, -233, 217, 67, 258, 247, 209, 548, 252, 183, 621, 361, 59, 51, -25, 118, -13, 343, -70, -256, 6, 268, -141, -539, 20, 22, -119, -139, -163, 10, -210, 153, -105, 162, -119, -36, -37, -121, -60, -105, -342, 307, 265, -1, -56, 115, 219]
4305B19j52L44J3m58J02R1l46mM14n57N7K25Q0l6k63J00K21k88P7j79j2O3J90
4328i9o9K15l19M14l06L03K46n8n61R8M26p0k17J63j66L17j39q5JN7j41r8J94
4351A06o3j26j64q4K3R1l1J12J37N2l63QJ9o6K88J84k50L37p8q1l6K42J68k22
4375B03j28J61q2K0l36M8n4J39J0j56j7K07R9l37L3K76j56m55p0L40j52K02J3
4398a92L0J87J4j3J67O0k47N25o22J38K29K31m37J14J48k14R3J19R4k55l81J31
4420h1J15j08j46L98j98j33l84K86L8j74K48j27K85j66l35M07l0o3J06j30Q48
4441F56m80k34L90l31J52J65n51K61K18m73L71K34l75L6L84o30j1J97qj41J73
4462Cm52r7L40J18J45m41L07k68L70j8j7j28K36L3k59k4J93J12K08j58J08k36
$$ y = [219, 67, 411, 424, -34, 68, 159, -187, -191, 223, -334, -277, -52, 28, -8, -271, -171, 50, -238, -161, -340, -352, -289, -99, -168, 47, -272, 142, -164, 139, 385, 327, -234, -136, 290, 220, 3, 166, 0, 317, 178, 93, 94, 151, 10, -88, 106, 43, -83, -247, -331, -308, -217, -248, -136, 1, 53, -310, -302, -283, -349, -61, 123, -127, 210, 132, 51, 15, 257, 425, 203, 75, 236, 154, 174, -162, -114, -168, -29, -19, -175, -192, 15, 114, -223, -190, 86, -70, -525, -595, -255, -407, -205, -192, -162, 25, 39, 26, 193, 253, 6, 531, -91, 47, 276, 507, 70, 184, 332, 118, 211, 330, 424, 169, -212, -81, 34, -74, -220, 178, -20, -153, -537, -251, -213, -387, -139, -266, 19, -147, -482, -75, -105, -168, -62, -192, 656, 176, -58, 332, 1, 153, 318, -233, 28, 246, -227, 144, 378, 3, 39, 423, -207, -218, -21, -29, -170, 3, -449, -546, -206, -88, 57, -384, -77, -345, 25, 7, -10, -138, 98, 131, -128, -152, 41, 153, 361, 203, 311, 75]
4484G5k8m0K47N1l54n4N2J26o1l68J93J14j08P5p3m1M23l51J12O4Oj87K18J11
4508B02j37j94K59J10k32O9K5%J4P3j33R8j06Q4N0j54j24L92k10K0j6M57q13j3
4532b79L72j55k09l2J80j95P6j49K73J15l66J43M52r6k06Pl22M52J77k44Kq5L91
4555C02P0k60jJ20Q2j51r2j0Q8l06J18m5M5R6l59J10l4K30j44j89q5L13M0m7m60
4580e69O75J78l62K07J38j93J50j19K77k29r0LK66l84K13n5P9L8k58m7J64j10
4602b8Jl31J26M3O4J00l3j03n8j62K08J01k44K05J18m5o3J22j3j20j16P06j04
4625C74j88K70l83K61m74R1P4J89K9j12J41l24L4N4j95j75L53l13k9Q6K55k92
4647b74OJ30J69l18J94K34r1Q7k77L44l38L18J95o00M81j09K00m59K04K19N4o34
$$ y = [75, 47, 7, 254, 305, -49, -103, -51, 75, 14, -354, -161, -47, -155, -80, -153, -194, 229, -122, -10, 54, 60, -127, 91, 202, 65, -129, 130, 240, 8, 77, 102, 102, 116, 189, 56, 154, 48, 132, 182, 28, -96, 296, 86, 106, 90, 547, -266, -279, 93, -62, -271, -303, -123, -318, -242, -391, -118, -3, -369, -226, 226, 130, -76, -69, -391, 61, 238, -6, -4, -89, 302, 372, 112, 111, 231, 313, 162, 70, 60, 148, -158, -40, -85, -40, 56, -303, -193, -227, 3, -141, -330, -415, -102, -62, -109, -569, 106, 284, -78, 129, 267, 74, 224, 105, 382, 153, 63, 66, 332, -52, 161, 106, 185, 223, -35, -82, 82, -28, -27, -358, -232, -189, -125, -25, -58, -161, -219, -381, -173, -72, -316, -111, 7, -38, -101, 21, 8, -112, -228, 478, 374, 186, 456, 73, 334, -140, -49, 25, 214, 243, 131, 272, -52, -18, 36, -159, -334, 19, -294, -323, -237, 18, -274, -268, -138, 31, -287, -93, 141, 50, 137, -140, 204, -134, 184, 379, -221, 260, 151, 351, -108, 96, 315, 369, -265]
4669b65J87K8n4q5K06K31N8n31L2qJ52k13J15j98J01R0j7K58k1j87K04j82R6J65
4693A62m30M82j39K20l94P6j30Q0K91l75L89r8l87N36l28J50k46L1j56p9n7L95
4715gj01N8k38M02k0l23k6M09r9j83K78m8j11L92m37R6K00j31J55j4Kl5R9l67
4739d9O99q49J57k8p7N10n09J17K8m1q5P1m9J82m30Q3K68n3L60l59q9N4P2j9L5
4764am9k1P9mJ14K26k63O1OM3O8L7k81o4K43n98N6Q2K3L9k88L65M0k87K61Q3j34
4791a64R4j3r4M40n05L00Qk92j4N64l80P9Q1J40r0l43K07K33j86n3R2l14M53j84
4815E9k13L74j97j31l11J66LJ85L2o0J04Mj77k7n1L07k13J15J02j14J84l66M75
4838B50L4n8k79L00j12mL6j68j07K53J11J83m88L05N0k47M4k62M62p50J01K11
$$ y = [-265, -78, -50, -104, -189, 17, 248, 306, -225, -193, -201, -49, -262, -147, -345, -244, -154, -171, 87, 66, -121, 83, -99, -3, 162, -268, 214, 75, 295, -99, -23, -153, -73, 218, -157, 232, 134, -253, 283, -45, 105, -141, -110, -266, -345, -402, -7, -108, -50, -288, 114, 94, -229, -255, 154, 55, -128, 150, 102, -9, 383, -54, 42, 242, 111, 266, 252, 254, 219, 318, -49, 650, -199, -42, -70, -147, 363, -146, -29, -1, -42, -127, -56, -105, 77, -353, -270, -2, -55, 305, -54, -143, -89, -17, -36, -1, -50, -71, 8, 4, 118, 344, 81, 142, 148, 191, 259, 296, 15, -49, 194, -404, -348, -266, -243, -204, -492, -127, -87, -374, -113, -30, -164, -70, -83, -177, 263, -242, 58, 66, -226, -240, 324, -56, 23, 104, 244, 154, -189, 18, 251, 65, 12, 104, -210, 243, 59, -154, 220, 23, -108, -419, -253, -250, -65, -33, -93, 11, 15, -162, -189, -240, 67, -146, -31, 71, -43, 141, -225, 250, 284, 226, -53, 247, 135, 131, 167, -1, -108, 145, 256, 439, -49, 256, 306, 59, 103, -159, 303, -447, -346, -135]
4860a35m3J5J28N5k19J67J02r3K03%k83J48n8J42k24j92L04qL47l62L49P5k54
4883A64k88Q5k24L69j74j3j68J49J55j48n3K62n4m09J70m6J10K21l77M68j39Q8
4905A48q7J36j0J8k34q1K06P8l46K35j3k8N4j08j11L50P5k31J64l43K88j35j08
4928h3k85J71J54q3j5n4k0N6K94j12l21J10J14K00q3l1K85l58J26K60K0k19K1
4951A47k2k22Q4M4K07R6r2l23J94m28L57o6K11l44j47K74k28L27k52r4l1O04k39
4974E7k66K04l2n4K18M6K80m13J68k11L8m2M40k7l87J02P1l51K00K1o4j40k97
4997d39L97P8k36J12j06k18J26J56q6oK14j59M7j34O10k05n70K26K58K08k90K39
5019B22j37J67o8K18m98J11m10N31l55P2M26l09K25j28Ql43J41K22q6j66j32j6
$$ y = [-135, -178, -163, -35, 20, -199, -32, 70, -23, 180, 180, -103, 45, -13, 129, -95, -287, 17, 9, 356, -6, 343, 418, 164, -124, -39, -263, 106, -68, -81, -249, -100, 55, -93, -146, 116, 62, -347, -177, -223, -113, 108, -269, 199, 60, 148, 61, 197, 187, 205, -29, -110, 96, 174, -172, 63, 50, 22, 76, -32, -143, 207, 282, 51, 215, -128, 160, 25, -83, -368, -197, -43, -126, -141, -195, -215, -159, 135, 23, -298, -188, -74, 126, 43, 12, 297, -61, 65, 325, 345, 126, 147, 125, -97, -13, 31, 238, 334, 242, -81, 113, -315, 42, -24, 187, -157, -304, -30, -258, 69, -183, -277, -308, 296, 57, -209, -5, -37, -91, 127, 173, 453, 40, 208, -3, 35, -7, 433, 406, 19, 121, 192, -159, 41, 62, -2, -142, -439, -42, 36, -200, -88, -194, -412, -286, -130, -216, -222, -8, -167, -120, -254, 356, 151, -419, -193, 65, 273, -17, 222, 85, 252, 184, 402, -96, 15, -395, 136, -219, -147, 279, -30, 195, 67, 75, -268, -127, 95, 9, -157, -289, -305]
5041c05M98n37J04O0J85j90J9R5J31k13L76k05n6k0j82K81L7k0L27k61k2J14p7
5064A39J91j92J41j18j85m39O21n0l74j78L68J00r9k5J13j00K53k08K8k81J43
5085a52J82LK1M87k13n33L57J35j67j04K98j40j90L88j10l38N5K7m5r2L65k58
5107b4m38K68R3l1O8j69m0L93j24k88J60J49k17K20k5J54K56l23j69K91q4J8j1
5130A27r3K9M2j96k5L83K4q1l46J56k26O9K4J85k42J88l0j88K43N2m32L8J35J01
5154f3j1J11k62M26k33n5j46M80J6j13l45N57k32k74L09K0L0j63q8R3k02J85l0
5177A0j77j64K47Jl66L43O7j19o2m0n4L57k84J89n9m4K23j36J86j53L98J8m83
5200a02K00J41j89J81O7j73n4P8l16K13j52J70K3l67K73K25k14omok87j13L48
$$ y = [-305, 193, -344, -240, -180, 5, -185, -166, -71, 60, -153, 223, 18, -38, -58, -240, 41, 78, 58, 385, 124, 102, 216, 139, 330, 138, 279, 161, -24, -463, 158, 108, -266, -444, -76, 24, -75, -100, 13, -87, 166, -42, -14, -295, -152, 30, 33, 54, 541, 328, -205, 152, 287, 120, 16, 314, 174, -16, 372, 262, -76, -21, 6, -39, -131, 234, -24, -462, -194, -101, -132, -64, -233, -273, 120, -4, -292, -132, 17, -200, 20, -5, 149, 405, 82, -87, 204, 120, 138, 127, 34, 63, 105, -91, -116, 267, 291, 210, -136, 20, -206, -137, -113, 72, -170, 18, -12, -200, 43, 95, -337, -299, -164, -63, -74, 37, -225, 201, -32, -87, -233, 247, 263, 150, -195, 362, 130, -144, 165, 185, 215, 52, -36, 57, -145, 40, 10, -167, -331, -84, -83, -449, -106, -39, -158, -220, -260, -314, 43, -241, -52, -111, -155, 68, -68, 118, -35, 363, 381, -102, 98, 239, 50, 231, 298, 125, 71, 149, -167, 46, -106, 64, 87, -280, -7, 218, 4, -2, -6, -12, -299, -412, -64]
5223f4J68j61K17Kj37R4k1j0j89K31m04N32j11M1N%M2K19n28J45q1K28m32L90
5247A76j51k2l76N27k85j57J63j11J09j78K08Q6J71l88K83k55R0L1J24L04m84
5268a35K85o8k52L11k32J44R5j64L92k35j04P8qk9j3O0r3P8j2k35q7J66o7M59
5292C34k41q7q6o1J48l25L06K48k92l04K41K59j61k00L26L4j04R1N7j21j39J82
5314A05K5j08n6K16m63K3L24k03J22j14J22j11j9k65O83l51k68Q9LK95l81K99
5336c3jqp2M69m88M6J62K38k86J88J87o07N87j31r8l78L63O3m84K28j09K86J0
5359A32%r8p5k59J23J61J8j45k47N89k00k18J4J95K26n30L55k83L61r7p3L45o9
5382B25O8k60J17j01k91Q7N4L68no7l21J25J23pl35J31R2r9L2j20M1j60J15L94
$$ y = [-64, 104, -57, 160, 162, 25, 119, 98, 88, -101, 130, -274, 258, 147, 188, 193, 193, 235, 454, -74, 71, -10, 218, -214, 176, 25, 3, -373, 154, -131, -288, -125, -236, -127, -305, -97, -11, 160, -228, 55, -200, -110, -79, 45, 349, -135, 150, 82, -170, 141, -91, 53, 148, -16, 376, 141, 37, 115, 107, 78, 65, 125, 32, 110, 98, -137, -224, -58, -125, 334, 93, 6, -80, -141, 7, -318, -12, 236, -56, -360, -119, 140, -21, -221, 105, 139, 35, 126, 183, 62, -77, 105, 130, 22, -34, 182, -281, -258, 66, -137, -15, -129, -7, -118, -137, -402, 281, -70, -338, -249, -246, 49, -332, -33, -34, -42, -114, 355, -133, -87, 75, 313, 27, 215, 402, -205, 382, 251, 153, -225, 138, 201, -283, -55, -164, 122, 132, 132, 34, -41, -300, -177, -16, 2, -143, -390, 199, -1, -219, -205, -10, 216, -314, 41, -242, 119, 22, -51, 294, 225, 293, 33, 150, 49, -242, -155, -101, 267, 262, 195, -126, -1, 122, 115, -220, -89, 3, -96, -64, -184, -143, -303, -188, 206]
5406B06l49L25k8k85j00M87l71N8r0M40k49J34n7j99Q8kL15j20p5m07L06k13o5
5429b51P7J21Jk16N64l02l25K91J45k56l7K96j51J47r3M9N5J46j15j6j58J27M04
5452E03m36k89J54J85k31L2J64n5j94J64j12R7R9M6k28J07j94K64k12qJ45k68
5474b67k91K93L69J94l33j84K53k55K10O9j06R3Q5k6J46k28J58j74K07m1P3k54
5496iK20j76l3J35m0n5j6O4r4m10L46Rr8P3J81K7l02J22rk14K60K14k42l3J85
5521A05k45O6L91r1j03k29K96L5l50J00R4k53J16L01l37P9K31l05j16Q1j4O8m5
5544a25j86J29N23l70j14P2J20j18J97J79m45M17j70k79J37M7j5J44J05j75K00
5565B73n09K77L27l24l6l04N82m56N0L41k46r9O0P8j79q0J84k34Q4K07O2J20j60
$$ y = [206, -143, 182, 154, -131, -231, 256, -115, -57, -147, 293, 44, 178, 121, -78, 10, 8, 323, 203, 128, -279, 27, -186, -251, -174, -53, -52, -268, 296, -6, -331, -40, 105, -151, -188, 108, -43, 104, 11, 60, 115, 261, 146, 130, -28, 99, 503, 67, -222, -68, 117, -114, -82, 82, 27, -167, -3, -115, -18, 81, 127, -101, 6, -188, 76, -136, -144, 1, -267, -558, -265, 104, 298, -35, -219, 34, -221, -11, 58, -48, 45, 130, 104, 250, 22, 180, 6, 213, 172, 245, -9, 211, 35, 2, 137, 97, 42, 26, 90, -4, -414, -68, -59, -157, -84, 97, 124, -178, -56, -65, -279, -19, 195, -47, -80, 105, -140, -74, 317, 226, 123, -106, 190, 225, -125, -25, 69, -184, -68, 233, -104, -25, 206, -99, -215, -134, -148, -80, -125, -311, -182, 341, -29, -143, -71, 49, -69, 128, 307, -138, 279, 109, -170, -33, 14, -1, 143, 248, 73, 273, -236, 41, 368, 44, 8, -296, 286, -170, -120, 221, -25, -124, -64, 14, -165, -245, -61, -295, -211, -4, 58, 178, 18]
5588A8k02O57o91K38J27nj1k47L63m8M7r7k1l05J58J38J02k14O5j96Q6j25m0J82
5612b1q2K42l96k8J93J65j62j6k3J11J01J86m34P1K51J15m4r8l28J54L35j66M9
5635A75k08q9J74k47K57l93M44l33Q4R3Rj3j80L97k00J7j09n1K63l87M64k01m26
5658d60L59L20j89M8k58L71Q5j87O6%l34K28K51n39K71L7m11N04J70m49J62k54
5680b09J06J77l87L40m0l51J08P9J9m0r8M29l55J05J54k45L05p3nJ1J65k56R8
5703C7J35k32P7Q8j12MJ11R1j62j59L59l68K52L5j77k0K79j3m83M4K84l15J52
5726i3J57j35J13k87J85P3K71m16L15o9J36j21Q4O1j45q7j56J80l0J13O6j85J06
5749A36p2J39l21j7j53L16r2L66l88k0j65L84Lm21J42K76R5m26nK42k71L53J67
$$ y = [18, -184, 473, -218, 20, 147, 142, 131, -116, 247, 199, 246, 149, 128, -177, -19, 119, 221, 7, 72, -124, -38, -163, -203, -21, -103, 139, -257, -285, -92, 73, -89, -105, -128, -17, 84, 270, -164, -93, 158, 273, 229, 131, -197, -43, 292, 126, 175, -33, -122, 52, -195, 62, -331, 113, -220, -136, -43, -34, -47, -227, 170, -30, -13, -122, -173, 90, -297, 167, -34, -460, -101, 219, 30, 78, -180, 191, 276, 89, 155, 155, -179, 49, 300, -239, 32, 69, -342, 162, 332, -117, 45, -209, -103, 74, -313, 27, -13, -364, -256, -177, -158, -198, -296, 133, -222, -117, 37, -208, 97, 24, 19, 30, 195, -61, 37, 172, -60, 17, 105, -7, -3, 108, 199, 37, -122, 237, -131, 121, 156, -21, -41, 238, 225, -258, -214, 70, -245, -93, 64, -71, 42, -245, -60, 13, 284, -132, 183, 114, 250, 129, 213, 274, 129, 42, -114, 66, 36, 149, 215, 30, 136, 64, 203, -118, -135, -288, 28, -64, 302, -86, -106, -271, 113, 116, -305, -163, 113, 208, -218, -223, 19, -252, 101, 268]
5772B68l72K04N1J15n26L18J22k41K04l6P0o45M98P5j58j0J20l54M30k29k39L62
5794B7j15R7j7N0n9oK76nl24J67k12k27L34j40p0J21J84m0L45m87N75o26K80J07
5818B35Pm35l4L84N5k20l41J78j71K23j6O9p8J62l58M55R5q0k30J56k22L23k97
5841a40J6M28k82J58r0K18j43j6J87l62j78K11o9J20l63K56R4o9J40m9j29pJ70
5864A01k95L15k65Q1K3K21j37j64O9J38j29k32L46K64l86r3J63J70n6POk88L90
5887B49j67m4p6K22j49n3M3j92j10J62K47k37R8r5J70n1j35L82l15P2K07k07p4
5910e3L4M6Q4k08K67k7j34k3N2l2J6j50M47K2m19K21r3j49P9N0m3o0L8l09L47
5935CK05k53j98N60l16QJ91p9Jj29o7M6j51L70o0r7K12k10O6Jj0O4j22mK20L3
$$ y = [268, -104, 100, 151, 266, -260, 58, 180, -61, 143, 107, 177, -468, 30, 105, -53, -63, 57, -297, 133, -96, -335, 27, -88, 9, -8, 42, -17, -23, 253, 248, -76, 91, -121, -348, -14, -154, -224, -103, 81, 41, 386, -101, 474, -152, 128, 235, 242, -193, -227, 157, 212, -8, -349, -171, -342, -119, -135, -66, -144, 18, -340, 115, 210, 130, -100, 56, -166, 157, -140, -124, 304, 22, 180, 90, 308, 165, 149, 336, -26, -204, 7, -62, 58, -305, -49, 45, -24, 116, 67, -62, -69, 101, -194, 121, -144, -63, -40, 181, 44, -120, -51, 87, -42, -274, 72, 336, -50, -143, 20, 190, 134, 141, 147, -141, 249, 82, 38, -38, 184, 35, -18, 25, -167, -277, -115, 132, -105, -7, -102, 68, 17, -118, 264, -51, 21, 228, 21, -53, -19, 27, 111, -97, 170, 143, 9, -14, 38, 6, 22, -128, 319, 341, -78, 143, 50, -99, -20, 30, -13, -73, -35, -344, 3, 208, -45, -243, 317, 1, 9, 200, 121, 122, -7, -74, -28, -179, 191, 131, 34, 246, 36, 102, 103, 93, 157, 35, 31, 251, 284]
5961B84m53J94L56l20R5p0O2j23j21j4J30p6P3j65K01l87J13K35j32K42p4Rl06
5984b47j4J98J71j45L37Q4m74j74M05j24m2l7n8M0J9j90M83j02r9P0l18J34M0
6007d3O2k57L46m40L60l2J78M5j10k45L3LJ02j81m7K07J24l1mj18O9J16N3j35
6031E5J27j22k56K39M9r3p0P0j25L9K42l45R7j36K14n7l9N7k82K00J01Q3q1o5
6055i8j28K6K60P5j84J45J71n24M17k01j99K69K18L4m2j31L48n35J7J13k7J09
6077A33j08j3k59P4L87J62m14k15L84l33J75j17J50K9p3P0M0k54oM7K11N4P3P5
6101B72k15R2k34J4K54k86j97N24p5k95j42L30n1j5m9R5k19K13k73L86k32o4Q4
6124h3j9j42L50j87K65m28M58l67L60q6j00J04j9k20L13N2k63J59j30l91M80k07
$$ y = [284, -169, 25, 381, 61, 156, 86, 148, 25, -96, -110, 20, -56, 17, -148, 53, -334, -221, 14, -118, 124, 50, 59, -247, -261, -63, 108, -37, 300, 384, -90, -264, 141, 17, -25, -62, -120, -80, -61, -251, 232, 130, 31, 101, -217, -83, -43, 19, -238, 108, -332, 28, -4, 174, 219, 109, -136, -103, -100, 2, -179, -226, -19, 105, 74, 70, -48, 21, 137, 190, 55, 182, 60, -196, 43, 92, -1, -71, -1, -126, -87, 155, -190, -93, -229, -15, -72, -111, -54, -336, -136, -35, 48, -33, -98, -226, -200, 60, 135, -49, 96, 267, -257, 160, -41, -240, 29, 247, 281, 239, 108, 456, -79, -62, 51, 24, 133, 25, 12, -247, -173, 214, 376, -38, -253, 131, -202, -27, -144, 6, 35, -38, 32, 72, -182, -188, -141, 70, 124, 197, 272, 57, 149, -85, -71, 183, -103, -300, 224, 149, -146, -288, 42, -9, -24, -73, 22, -197, 16, -257, 129, -103, -167, -83, -102, -244, 106, -81, 184, -244, 214, -153, 207, 121, 21, 125, 106, -114, 199, 251, -12, 147, 17, -374, 106, -101]
6146a01J21l08J58N6k7K7J45l1m3P1k89K96k59O6r6M15k29j03J03jL69l05j22
6169h7L72j82l4m4J11k59L93l28q3J74J07j39M6l9m2j80J45J78j08j94r2J22L09
6192A46l37L99k38J57q0l6j79K48J12m4J81m47L65q5j27K09l27m1M71j69q2j65
6214f9O7m3N0M9R6l53J91j13K84k15lk0N9P4k50M10l45J54L28j01o1n63N72P7
6238B75k83N5K24n03N84j89q7J04R6m8k0n2jk57J09j53J2M9J67R9k97K83k05K2
6262a6M0J63j85o3j79K41L6n5j17L58j9N4m72J79m2j19K55Q6J22l87L68K1k56
6285A3J18k51P6K16m40L24k88J47P3l7o0K02j01j31L10l70Q7q9j0OJ20L95l26
6308a6M5jK3k23J78L47l20P7m04N75n10K53O1N8j14M8j7M7j37m6K98m42J81J6
$$ y = [-101, 20, -288, -130, -74, -101, -74, 71, 40, -3, 68, -221, 75, -184, -118, -214, 201, -28, -131, -28, -29, 340, 35, -87, 285, 103, 69, 25, 136, -123, 270, -58, -141, 33, 140, 1, 47, 8, -34, -214, -69, 109, 1, -193, -285, -163, 146, -191, 208, -30, 127, 47, 11, -168, 80, 192, 148, 329, -118, 247, 162, 35, 244, -83, -124, 347, 178, 96, -69, -2, -45, 5, 54, 150, -203, -12, -125, 159, -56, -59, -79, -20, 54, -196, 214, -131, 23, 351, 250, 189, -374, 198, 275, -8, 47, 271, -232, 352, 163, 76, 180, 276, 228, 208, 156, 155, -102, 7, -146, -134, -85, 82, 181, -116, 167, -38, -16, 24, 187, 2, -61, -240, 1, 37, -18, -135, 223, 204, 258, -214, -35, -77, -196, 59, 145, 267, -120, 248, 269, 13, 131, -120, -44, 172, -268, 56, -232, -85, -12, -49, -109, 93, -8, -139, 171, -199, -112, -201, -211, -205, -85, 310, -16, 29, 28, 51, -172, 6, 353, 33, 110, -294, 281, -229, 24, 85, 143, 29, 77, 60, 107, -30, -76, 222, -220, -39, -23]
6332b3l6j93L83j95k56J00J87J34l29J57j99J58J5J60k20J01N8J50k53P7L91m38
6354g1M01l47j9o8Q2nJ23j31Po7q8K64j14j71L46m6j00j76K28p1j84J68M9P2j65
6379h3J10J12l66K38m8m5K42k69J25K3o7K53j84l5J9L06m51K02q6j51n1R2k1K44
6403A09r6j10p4k06K39M7J87p4j39O0r6J53J90ORJ80m25O5M3k01K00j68K62j6
6427A45K25n17PM1l8M12l51P5m4q2J53p1J7k1j78K25k51L48j68K42k86J06J9J10
6451A18j13%L35k97k28J42K24m7J30m17L36J2J31j83l26J38q1k4L96o26L26K34
6473A80j90k96N65l51R4j75K99j13m6J04K4j20k06L34k10LJ77L73n43M2l4J00
6495A1J26Lm5j21L15l58J53O4j29qq3J47M3l49K51l11K37j68K62l7j53K53n8K2
$$ y = [-23, -59, -252, 131, -64, -320, -220, -33, 101, -228, -71, -270, -112, -97, 63, -157, -56, 2, 152, -101, -24, 367, -71, 330, -17, -36, -104, -22, -27, 96, -35, -28, -95, -183, 81, -33, -204, 142, 96, -4, -180, 48, -23, -207, -39, 10, 82, -83, 27, 139, -227, 11, -37, -82, 160, -109, 16, 39, -28, 225, 41, 6, 25, 331, -120, 82, -4, -155, -206, -114, -135, 109, 13, -97, -171, -377, -138, -91, 96, 22, -117, -57, -153, 0, 190, 196, 205, 385, -40, 25, 68, -133, 67, -101, 161, 145, 370, -147, -140, -99, -137, 275, -76, -1, -45, -127, 26, -45, -28, -49, -227, -2, -253, 95, -73, 169, -117, -11, 8, 118, 5, 5, 340, 43, -185, -43, 181, 134, 264, -153, 183, 195, 326, 143, -183, -45, -126, -150, 246, -380, -54, 180, -10, -306, 259, -92, 2, -173, 126, 13, -33, 71, 95, -25, -231, 103, -107, -104, 73, 446, -97, -55, -89, 11, 137, 140, 95, -26, 289, -69, 84, 148, 19, 11, -72, 75, 118, -231, 20, -291, -54, -222, 40, 3, -150, 103, 45, 67]
6519F7q5r4k42L89j45rK42n8J36n9j8j60R4p3R4J79k64K9J62m63L65k4k69J62
6543d4K50m25J44K60l11J02j67P7J84j91J27r0j79J94j27J27J62J63j73j25J80
6564A38k43K73j6J8k93L54j33j78L04j02l1l02K15j15L6n9N2k4K07k40J54%J44
6587A59p9J26k57p1l6N24o20k6L77M9k25N9l2k55N26k03J8j41L53j1l22L90m52
6610a49K78l58QK15p4L26m31J74nj38l0O9j05J83J04Pj19Q7q5j93J27L1R2j52
6634a38M6K06j06j7j23J10J67j58k18M50k20o8J71j17R6M8l95J89J9j2p7J83M7
6657H3j17K5oj77L29k52K35l35L42n2j54L15l06J79k16M7N04k00k00o3L7L09j34
6680A93j37j02K47l7q0k43L55m40K55J7p8j62Q6q0K39J3J76j01k03K93k70j53
$$ y = [67, -18, -112, -354, 35, -110, -119, 123, 65, 201, 142, 124, -36, 58, -15, 79, 258, -6, 23, 185, -278, 87, 63, -206, -44, 206, -219, -75, 185, -126, -24, -191, -114, 70, -121, 6, -84, -263, -69, -196, -69, 93, 256, 83, -42, 138, -105, 168, 152, 170, -123, 231, 98, -80, 224, 122, 91, -211, 4, -111, -75, -134, -82, -106, 101, -139, 15, 15, 159, 80, 206, -51, -122, -158, 366, -254, -280, 97, 146, -79, -20, -52, -307, 219, 16, 34, -107, 246, 235, -87, 303, -149, 129, -229, -221, -6, -80, 246, -185, -11, -16, -154, -184, -115, -220, -37, 67, 74, -45, 42, -43, -236, -109, -78, 14, -138, -92, 114, 8, -9, -132, -22, 145, -13, -231, 219, -1, -69, 102, -15, 81, 129, -266, -77, -58, -70, -147, 36, 83, -34, -9, -15, -192, 137, -115, 120, -215, 127, 75, -79, 236, -70, 109, -107, -60, 444, 244, 44, -19, 18, 327, 193, 56, -46, 201, 164, 84, -159, 196, -244, 11, 28, -50, -212, -126, -206, 33, 46, 222, 121, -82, 211, -59, -212]
6702b12J30J48N2N9Mn8Q9l41J49Q9O9j00j72r2L27q5j98J30j50K52q9J5j37J49
6726B8l2p7j74r3L32m11K64J59J80r1l01K43m8k2L17k24O1l14J98J90mj90q8K96
6750A99j79M5r6o0R7J30m15oJ26O9K99m96K05J69P7m78M17l50K15L31m84J56j53
6773a82n7K81J57j31j43j68J85j01J78N3K26l91J00l1M21l59l07P2K62p2n8K41
6795A76j51j35J43j50J61j17l05K16K21Q6j35K28k65j63J10M94k63j92J34k55
6815a62j6J58k5P7mk16O3QL24K54k83j20ok7k70J09l23P85k55j34R8k01L29k35
6839g2K77Kk29k58K99K33k14j35J82J7J06j68l25K62L0P6J32j41j14K94j48l53
6861b47K11K20n93M73k94J87O4k46M17j13Nj41j21j24L32q3L89l00k93Q9M80l5
$$ y = [-212, -82, 66, 118, 177, 181, 123, 212, -129, 20, 109, 178, 78, -94, -186, 141, 56, -142, -12, -162, 90, 1, 16, -121, 28, -4, -81, -255, -348, -16, -427, -163, -4, 176, 85, -216, 27, -21, -43, 274, 50, 111, -203, -5, 185, 181, -9, -97, 199, 20, 65, -31, -91, 6, 136, -279, -285, -159, -90, 209, -287, -82, 87, 164, -314, 103, -247, -32, 299, -185, -29, -182, -239, 42, 199, 68, -75, -243, -58, -159, 19, 72, 298, -93, 7, -24, 397, 38, -269, -197, 65, -7, -65, 176, 25, -110, 33, -117, 44, -73, -378, -162, 59, 145, 10, 238, -27, -190, -80, 414, 151, -41, 93, -162, -178, -20, -45, 32, 28, -188, -125, -117, 207, 461, 178, 58, 52, 25, -245, -136, -459, 326, 71, -63, 35, -166, 163, -72, 205, 207, -22, -280, 19, 252, 38, -97, 85, 102, 208, 40, -285, -23, 7, 83, 215, 74, -40, 254, 106, -247, -36, 184, -409, 64, -230, -43, 21, -225, 192, 79, 84, -57, -178, -302, 30, -53, 336, 36, -257, -168, 312, 277]
6883B77k32n8K47m27L38j26m8K57j43O2q1Q5%l37J59Lo9K16j65K62k62J11j20
6906e1K0j70K47j43J63k07O1o4J53J05J28m70j86L80M7j45p4J19K48J42J54m45
6928A2q8K91l60J88P5J7j44m8L09nl33j34M00j29k88J46K69o3l11N5K28j15k22
6951b50K01K54k46J05m66N17j53K73j22l2kJ81k12r4q6L8J38M7j85j13L46j90
6973e1l6N4R2j50O1R9m24J90J09J04j90R3r4M9o9Q0j20J50J29J27l54J80l5q1
6997h7L10j51r0K98j32k16l47N32j85N8k31J96Q6l77L15j31J10Q7j22J6k94M6
7019c09L60J65k96O2p4K79j91J69j12O1q7j01M02k53l1L1L3K17j96J46p1l98K6
7042a68J72K05k77J02k52K37j52J2O4Rj59J7M57k09j27j09m3R6p0M61j99j46J90
$$ y = [277, 45, -13, 234, -193, 145, 19, -29, 228, 85, 147, 66, 151, 151, -186, -27, -24, -93, 123, -42, 220, -42, 69, -51, -31, -201, 46, -97, 66, -141, -80, -144, 9, 114, 242, -228, -414, -34, 13, -132, -206, -87, 161, 303, 457, 12, -76, 215, -145, 43, 118, 135, -9, -57, 252, 247, -86, -220, 180, 51, -237, -91, 178, 115, -196, -141, 87, -28, -250, -49, 205, -41, 64, -402, 115, -38, 235, 113, 81, 79, 260, 48, -46, -132, -94, 44, 91, -94, -207, 139, -51, -87, -33, 59, -91, -30, 69, -355, -165, -56, 48, -142, -49, -143, -94, -163, -83, -203, -53, 76, 203, -151, 29, -6, -87, 223, 72, -18, 280, 148, -68, -415, 117, -68, -10, -241, -45, 41, -336, -21, -152, -42, 45, -77, -61, -355, -309, 51, 216, -80, -18, -92, 187, -4, 165, 53, 114, 27, -74, 328, 75, 44, 75, 108, 325, 129, 275, 204, -194, -168, 4, 209, -68, 34, -218, 19, -133, -121, -57, -48, -207, -190, 267, 58, -69, -178, -221, -125, -195, 266, 67, -79, 111]
7065A11j19j24L18j96j0M2l26N24l11J53p6m8J68k40J29Pk06J38O3j32J86J22
7087A73l6l11J69K82k60j17K27j37J04m46N25l04M5N5qL18l51J89k02P6N1K74
7109C16P2l44L0k71J78J32o9j05r8Q4j6J21J29m25L80j72kL4j62J98M4o0j23j37
7133b66J17K61J6k10N2J90J81j91l86L83J3J20l66K93k08J55k29P8J25j92r2J41
7155a5K88k53ln9J24j21o5j6K19n6P8k53K15l85L86K5Nj33m1k4L24l75M2rJ54
7180E2K62k78PK8N7l9j03L44k50j16L09j95p8P3J9j26j13j34N68k83j97K08L4
7203D9q2J94j56k31L78K5Qo4q6L12k10j90J65j64j60K32p2J39R4k09P9l24L48
7226G5K8j23J14k50K1mj54M13j5L0N3k93J26jm3K29k49L13l86O6K0l1Q1j41j69
$$ y = [111, -8, -132, 186, -10, -20, 22, -304, 220, -91, 62, -14, -62, 106, -134, -5, 2, -204, -66, -3, -135, 51, 173, 137, -174, -5, 277, 17, -100, 127, -10, 94, -352, 173, -131, -86, -31, -39, 279, -72, 117, -85, -9, 42, 316, 388, 44, 74, -197, -19, 113, 44, -61, -159, -75, -91, 30, 159, -266, 114, -58, -60, -26, -188, 10, 54, -6, -129, -266, -149, 112, 128, -82, -30, 160, 341, 150, -236, 147, 160, 280, -86, 207, -1, 154, -75, 3, 128, -64, -156, -15, 273, 20, 17, -42, 82, -39, -104, -120, 99, 43, 121, -132, 83, -302, 84, 109, 114, -19, -60, -84, 240, -135, -93, -102, 52, 314, 36, 43, 71, 128, 89, -14, 330, 80, -36, 273, 78, 0, 73, 92, -34, -147, -281, 287, 4, -193, 15, 49, -33, 161, 5, -226, 152, 177, 185, 121, 35, 347, 137, -53, 112, -52, -212, 20, -52, 87, 181, -28, 51, -273, 75, 103, -20, 94, -156, -135, -139, -293, 120, 105, 135, 188, -105, 21, 20, -23, 206, -43, 270, -116, -50, -30, -61, 20, -121, -290]
7251b90L63m3k80N17m67L06k16M02j50q1J15l21L00j88N5k18J53p3J58OJ79p7
7273A50m10M36l25L42l66j5QO7K25K0k71m1J09N2J38J78k39k02K63j96J03j79
7295a53j05K75j89k12J52J56J2j6J73o4j55L40p0k34P4k17L39q9j59J25Q4Q9k90
7318a34R7j15K11j09%P9Q8j48j1k43L09J63j39j75M0PK2K58k40j6r6j38J04J21
7342f5n8l15L07K01rj04J71o3K0M9k59N8L10l04J39Nk00oJ41J9k01L29j31J42
7366A76p1j13r6J03r6N8j82J40qO2K5O7l39J78j80J84J77pJ96k70k42K58K6M19
7390D65o80L36K17k58j53M47m92rK61k85k2j5J69J87J80l05J80n83J64qL63k30
7412g1l66M64m8m38M96m28J03M69k41j38J44J64o2LKj37L09k74K17l60Q0k0L58
$$ y = [-290, 73, 30, -250, 267, -200, 106, -110, 292, 142, 61, 176, -145, 155, -33, 22, -196, -43, -116, 42, 48, 227, 150, -260, 176, -149, 193, -173, -188, -180, -113, 112, 132, -139, -180, -71, -19, 119, 297, 58, -144, 119, -77, 26, -153, -258, 17, -172, -384, -232, -76, -64, -80, 93, 29, -126, 214, 144, -90, -16, -233, 106, 17, -142, -17, 67, 156, -134, -37, -152, 59, -50, -50, 29, 117, -31, -42, -285, 24, 187, 48, -127, -87, -80, -58, 200, -40, -56, -152, -290, -186, -65, -123, -438, -131, 70, 61, -43, 128, 65, 85, 134, -125, -67, 243, -61, 78, 83, -117, -123, 18, 37, -164, 165, 34, 176, 105, -8, -104, -1, -97, -39, -221, -81, -89, -27, -2, 65, -274, -96, -276, -92, 85, 78, 274, 4, -238, 20, 46, 465, -215, 121, 338, 80, -73, 374, -118, -127, 134, -151, -173, -188, -19, 168, 348, 43, 223, -360, -196, -204, 159, -71, -437, 27, -21, -459, 37, -391, -288, 181, -60, -198, -54, 110, 48, 51, 53, -84, 225, -49, 168, -192, -112, -132, 226]
7435B26l86N58k03k54l28M11N6m29M10R2l32J49K63o9r6k63L18j86J81r0J34j06
7457E6p5o4k26L01J18j7O2l64L24pl87J69J94K26m57M54k11q3J71j26J49m23K56
7480D0j63J15J22j90j62K06k02L35o7r9L9J42j7k03p4K62n8NP9j28r5K68K43n37
7504a39q8L05qq0r1R3p1K43j15J0QN0k41o0J75j1J07k04n2J68j75M04k71k52J67
7529a28m0P0q6M51k80m24L11J47j75J16L3M4j36O4o4N32n42J84k20J57j40N7P9
7552A0M8Q9k79j25J00K33j16m7K30n6qr2j58O3J53J38r8kj95L82k31L15k88o5
7576ARL26n73K94k39K35m2k06Q3j7J33L10k57o3J71m27J81JK01m00P6L03J88l42
7600e4M7M4k97L82j80L0L00k97K89m25J4k6r9K95m3l7QO4l99N11P9j18k00J58
$$ y = [226, -160, 398, 195, -59, -387, 24, 80, -349, 61, 153, -179, -30, 233, 164, 68, -195, 123, -63, 118, 28, 162, 56, -19, -83, -309, -8, 110, 93, 155, -209, 115, 108, -279, -110, 84, 310, -147, 307, 96, 13, 184, 58, 207, -216, 40, -123, -8, 114, -76, -238, -32, -234, 101, 34, -65, -26, 116, 99, -104, -178, 84, 26, 31, 110, -18, -113, 155, 398, -139, -227, 78, 70, -10, -101, -8, -79, 164, 49, 59, 67, 117, -124, -184, -9, -20, 87, -117, -169, -1, -176, 228, -43, -295, -128, -168, -98, -184, 267, -13, -437, -126, 21, -154, -38, -5, 39, -97, -33, -97, 435, -107, 77, -143, 14, -126, -69, 10, 58, 147, -132, -257, -157, 76, -40, -87, 143, 87, 79, -13, -171, -108, 45, 183, 85, 83, -112, 270, 39, 354, 66, 1, 10, 336, -237, 57, -182, 53, 11, -195, -112, -129, 4, 314, 57, -6, 165, -262, -81, -80, 121, -279, -203, 100, 288, -54, -7, 37, -260, 122, -58, -28, 272, -25, 264, -161, -147, -173, -272, 23, -20, -57, -49, 15, -384, 127, 206, 88, -112, 46]
7624D6k57J63P8j75j12J85M3K62l87J63K40n2j15n7j53p6O81n31J63O4l19M2j09
7647b13Q6M99k38k92K78j68j22L28q7j84J30K7q4J41l9j00J14k91K11L70l40j2
7669A4k54R3J08m2J13M5k06j08L08k2j16M74o76N56j86j72K84m16J21j09K87J1
7691A07oP5k86L48r6m36N31m13M77l05j29r1O7p1N7n4J76RJ72J73m66J86J8j83
7715a40L10r6kj07J22j13J9q0j12O5K7n8K55J4M8l29O4K76j63j05K69n8j55j4
7739f3KJ77r1M8j6j40J08K53k9m75L44K4k64J68Q2J11l64N2K34j35L02n02K77
7762A03k35k26K52P1J38k87J87J90k01j4o3M40l83n8k9J2j02J13J7J02k26L2K81
7785A14l45N23l00K09m10K02j14J89j01J92k16L4J18j26J53M6k4j82J77l56L62
$$ y = [46, -211, -48, 30, -145, -257, -72, -29, 233, -154, 9, 249, 197, 82, 25, -128, -204, 477, -54, 109, 173, -146, -104, -213, -127, 372, 134, -158, 120, -48, -170, 158, 71, -113, 17, 44, -40, 101, 62, -38, 76, -215, -4, 366, 26, 14, -240, -147, -39, -81, 32, 77, -129, -237, 71, 49, -67, 407, -269, 287, 101, -71, 213, -203, -82, -191, 96, 107, 101, 176, -110, 238, 142, -294, 237, -176, 301, -4, -133, -224, -157, -228, -171, -225, -49, -40, 132, 305, -161, 25, 43, -140, 170, 74, 72, -35, 87, -26, -7, -87, -199, -134, -107, -165, 90, 104, 152, -177, -113, 163, 0, -105, 164, 106, -49, -63, -61, 116, 25, 73, 57, -83, 25, 278, 249, -226, 118, 142, -122, 46, 128, 239, -125, -73, 161, 26, 328, -174, 103, -132, -358, -106, -35, 103, -184, 3, 193, -8, -22, -85, 355, -28, -86, -115, -103, -205, -92, -75, 27, -199, -167, 114, -231, 292, -8, 201, -209, -7, -121, 68, -33, 159, -57, -23, 95, -31, 122, 168, 144, -38, 139, -217, 145]
7806A45j97KQ2R6l23L33l4J12K5k20l56L53J33L8k39k83L20J66l19O6K59m59R3
7829b07n1M00l11J26M4K57l3k77K74j11r1M0l4k26M36m89L10l4r1K8kOo9L06j07
7854I4j88p6K44o7o0M39m37M6k5j55N3N2K35k14J10l9q0K35%o2n9o3K92l71k25
7879c21O64j69k32p9J03k29L25k11L66k71O9j18j43J37P6K95N0l58J23k1O1J7
7901A34j78Q2l9n9R0N6rJ15k10J4k2rL15k15K6L9l08P0Mpj99m2J32M00j88j14
7927a22o6L09j85J03Q0j32j9m5L07k78q8L44j62k21K22j99O1J58l13K12m31O27
7949A62k08M81p47L23O4r6j73K05J70k56J38k58L37kj13n9J21K2or9L6l53L52
7972D1J20l86L55j60J66j43r3J61j47l01N36j34K82m50M2m8J78K9Nk73Q6J12K23
$$ y = [145, -52, -50, 32, 128, -195, 138, 104, 216, 241, 21, -335, 18, 151, 189, -50, -333, -13, 153, -166, -100, 159, -300, -207, -258, 142, -169, -43, 1, 258, 225, -52, 222, 111, 20, 60, 26, -200, 236, -253, 57, 23, -68, -40, -42, -36, -105, 201, 94, -94, -170, 74, 7, -53, 386, -51, -5, -30, -185, -132, -80, 155, -59, 51, 12, -68, 167, 167, 105, 46, -17, 275, -96, -321, 343, 174, -58, -137, -34, -263, 62, -149, 217, -54, 15, -103, -246, -109, -33, 262, 312, -46, 77, 56, 117, 134, -44, 38, -1, -60, 30, 86, 77, 192, -18, -4, -26, -35, 280, 65, 91, 130, -178, -108, -104, -111, -310, -352, -220, 180, -8, -122, -188, 121, -64, 39, 119, -13, -32, -77, 230, -48, -136, 208, 46, -175, 47, -152, -91, 67, -246, -34, -465, 162, -46, 435, -312, 11, 75, -21, -194, 11, 181, -75, 63, -195, 142, 140, 27, -32, 89, 111, 105, 6, 42, -311, 41, 161, -225, 130, -30, 136, -7, -100, 61, -86, -387, 149, 15, 297, -153, -111, -159, 19, 48, 53, -220, -134, -22, 201]
7995B01j19L3r0k46P6J60k14J27J54n5j87K92l9j32J05k62n8K39J03p5oJ46k20
8018f7Q2J31l54J99K05p0j50OJ17o3q8K1j70L04J56k07k13P8J32Mn3m30N61k39
8042a08M3J11j07K06k54N8K83l86K24R7l06j40K77J50m01K01O1n6k7J44l5k2J18
8065A31J03k16r5J95j71j39Q9J42m1j7J05L7l26L22j7k64N24n21K34rj01L35j69
8088A31K31n04J47j26K2l0M15k4k06k0r8m8n8L94N0j59k69K8N6O6O8J0j27k32
8112b83P7J96R1l88K30l8J01P2K5q3p2k47N58l59N19l66k45J75Q5r8L3L3R8k38
8136a24M9J67k19K2M4j54J45j38L69L3n79M82j71O8k33L03m5j85M10l99K96l11
8158a70J33j32O6m4K97l17M74j90l18J46k13M86k52L34o11M24j99K02j25O6J8
$$ y = [201, 82, 115, 25, -221, -145, 15, -199, -72, 82, 27, -160, 132, 93, -39, 66, -196, -254, -15, 88, 13, 7, 153, -67, 15, 146, -208, -9, 196, 126, -24, -18, 99, 36, -52, -31, -201, 103, 259, 52, -161, -83, 49, 53, 0, -430, 131, -108, -65, 46, -61, 145, -109, -51, 232, -154, 70, 167, -139, -279, -2, 148, -253, -52, 9, -47, -74, 70, 35, 13, 131, 234, 18, -77, 118, -53, -192, -103, 39, -2, -19, 86, 123, -203, 119, 102, -162, 362, -159, 75, 66, -35, 300, 131, 362, -142, 5, -121, -99, -129, 286, 262, 56, 36, -62, -110, -168, 226, 276, 117, -152, -124, -68, -2, 66, 76, -51, -283, -206, -10, 81, -307, -77, -115, -14, 58, 83, 0, -72, -319, 239, -120, 399, 33, -212, -37, 48, -50, -17, 16, 114, -124, -75, 92, -127, -105, -61, -215, -70, -208, 161, 194, -385, 97, -74, -6, -239, 64, 19, -166, 244, -155, 141, -170, -37, -169, -103, -147, 150, -167, 307, 117, -201, -55, -268, 218, -34, 300, -311, 113, -86, 116, -9, 57, 75]
8179G5k95J76J13J44o5k8P5o65M20J9O5L5
$$ y = [75, -220, -44, 69, 213, 148, 120, 195, -470, -50, -31, 34, 69]
8191F9
$$ Imaginary data points
##PAGE= N=2
##DATA TABLE= (X++(I..I)), XYDATA
0@%%%%%%%Qj6J6j6J6k3L1l2M0m8N6o4P2q8J04j20J36j55J78k03K30k60K94l29
31a73L69m14M63n16N74o39P10p87Q69r62J065j179J307j449J607j786J992k231
49a180K509k839L239l734M363n196O357q080J0897j6267K9912j22341k45258L76531
63B8913K01779k93820j29451K85291P8194k38790n7702J79039J8310j16240l970
74d8447O0741p216J493J9543l3829l0112M7351K2260m5492p105M9915K076l8007
87f829K80K0744j2546j7289P534Q410l031J148M624M086K166k040m604p374j2878
102a7599k744K1088J0953k2299p671K9640O376l1011K795L0426j6420l2868K8027
115a307L7023l0064k8523K9582J1569l8388J11M3641l669l4527J7461L0115k7210
$$ y = [0, 0, 0, 0, 0, 0, 0, 0, 8, -8, 8, -8, 8, -15, 16, -16, 24, -24, 32, -32, 40, -48, 56, -64, 72, -83, 95, -108, 122, -138, 156, -173, 196, -218, 245, -271, 303, -336, 374, -413, 456, -506, 559, -620, 687, -762, 845, -941, 1051, -1180, 1329, -1510, 1729, -2005, 2358, -2838, 3519, -4561, 6336, -9931, 19981, -102360, -347618, 28913, 230692, -63128, -192579, 92712, 170906, -67884, -125586, 53453, 71763, -44477, -48447, 12294, 5078, 6571, 26114, -7715, -37827, 9524, 31784, -13708, -20813, 29102, 31178, -6829, -6549, 14195, 1649, -15640, -8106, 304, -2727, -1579, 3045, 7131, 9297, 7257, 2653, -4721, -17599, -20343, 745, 11698, -10601, -18272, 11368, 17744, -13267, -10472, 19954, 3534, -29334, -1307, 35716, 5652, -22871, 6711, 18280, -20108, -19997, 23644, 19975, -14552, 2909, 33024, 5814]
128E814l0694K0786J4402k4768l907K9236K650k2090L882J6609r036j5433N470
141g079P133p156q75J1851K579j1500l037J1968M402j3487l739K1168P345k7015
155g442r536L4108P576m3502r853M7280R704m3829q62M4248o043m4431N164L3191
169A5773q685k1644P528N955o995R675Q392j6720k035K0149j2011k5094K5269
182d43L0408l1982k8635L4578J7563l6874j045M5075o742m4264J3100L6097k1324
195E512k7712K7251J8836k9453j1363K5722L301k0173J941J2177n654n424M702
208c37j826k281R146k866j7087N627J9570p300j6879J0630J6317r865j3263R957
222d57J1282p785j2295K448J4099P672j1396j0510J0176Q360j4901q075J8834
$$ y = [5814, -24880, -4094, 10308, -14460, -18367, 10869, 13519, -8571, -4689, 11920, 2884, -12549, -7079, 54, -7102, -7977, 3874, 6453, -5047, -8084, 3884, 8286, -5201, -8940, 12228, 19573, -7442, -16978, 17130, 24706, -18796, -28649, 18631, 28335, -15494, -16356, 27892, 21849, -22582, -17418, 15773, 7088, -14556, -7028, -1073, -8068, 1607, 9999, -6721, -8756, 11393, -618, -25712, -443, 29965, -2017, -30652, 3926, 21489, -15385, -16430, 28645, 21903, -22361, -9261, 26836, 5512, -22200, 5051, 23887, -5566, -16929, 8793, 12094, -8079, -6138, 6039, 385, -5039, -337, -2163, -4444, 4702, 1836, -15251, -9624, 9946, 2646, -14233, -3603, 12714, 2849, -10414, -457, 10825, 3040, -9255, -6807, 7292, 14964, 3568, -6942, 3234, 11594, -3307, -11382, 7452]
235G452O801k0461l885J9720j451j7549M818J2282j1554r572J3473N801j1143
248e268N88Q895m643o552M427J646j782O708K414r935rJ0542o196j0456J3438
263C817J0053j6167o038J9796L023k0619j11J6312o136j4399P524J0666q101o180
277f560O300J978j287J755l328o336M941M402r592j618J5010P61j6658K784J6482
292I034n836j3187J0903J2594j0510r260R735K780j0045j031Q044p34n58M665
306F594j338n900M304J467j2111j851J4204o22j5278L197J4619o483j1809R850
320a157J0289j1301o125J0249J360r123K256N251o096j278R242J718m543N897
334F639K676j1781l171J1139r18r800O863Q991j1954q928J2637O011j1702p19
$$ y = [7452, 14253, -6208, -10093, 9627, 8176, -9373, -4555, 7727, -3827, -13399, 74, 5875, -5268, -4680, 4215, -428, -6980, -2553, -907, -2689, 4019, 6433, -3502, -3511, 7031, 835, -9621, 3817, 13870, -2297, -8335, 11461, 14484, -6135, -6246, 10066, 3930, -10469, -2945, 7721, -380, -6560, -260, 1718, 431, 2186, -1142, -7478, -2537, 1865, -7727, -9345, 5665, 6426, -10232, -7448, 9034, 3198, -9989, 914, 13508, 2998, -6262, 3473, 6253, -3792, -4823, 3221, 2487, 1929, 6594, 5256, -644, 3660, 5127, -6984, -8835, 5369, 4747, -10531, -7334, 7285, 802, -11007, -1157, 9132, -2169, -8294, 1955, 3315, -5808, -3552, 1699, -4397, -5675, 3567, 5285, 742, 6639, 9315, -2466, -5637, 5502, 4584, -5216, 1647, 10638, -1316, -10244, 2393, 8404, -3298, -4017]
348d017J1485k733j1679K123O873m729o092L112M005J2O66J877J611J325l776
363F3l783L694K644n731j597P145P35m936M199O116n113l164M909k994p521O722
379A388N851j0062l092J1618l503j4461P645J4481r973r017J4460L896j7820l49
393h938J4689p751j4093J2107J2157j0390j704J6285m008j7065N680J1381j0707
406b357n328J5406O25j6283M578J5828p570j2395R801P538j2467l648J2200j43
420E785j1124O43N669n943l482P967K833n404K440O175l630n069m29k60j758K550
436c037L149P4K761L466m411m499N163M476n810n274L530L921j270r00J608M92
452C439k905n175j188O302O572l538o113J420K064o349k269O078K232m892M93
$$ y = [-4017, 7468, 4735, -6944, -4821, 2052, -2677, -8769, -5657, -1652, -1640, -974, 903, 2514, 3839, 63, -3720, -26, 2618, -3113, -4710, 2435, 3170, -1766, 2433, 8549, 3436, 272, 5181, 2187, -5334, 1388, 7239, -2823, -5915, 5703, 2200, -12261, -4616, 9865, -108, -9125, 5335, 9231, -8589, -8938, 5751, -2000, -16093, -3986, 8171, -2219, -3923, 12362, 8354, -8711, -3031, 8350, -2357, -7685, 7721, 8346, -7937, -3359, 12469, 4899, -7496, 2305, 9843, -2624, -6272, 5928, 5785, -5339, -4696, 973, -4970, -8452, -485, 2348, -3056, -616, 5559, 1929, -3140, -3569, -3829, -5587, -3037, 112, 186, 2947, 6413, 2002, -2497, 2666, 7142, 1332, -3942, -412, 3509, 2239, 1339, 2947, 3439, 534, -4641, -5829, 473, 7045, 3507, -2606, -1186, 878, -5471, -7740, -1662, 570, -4322, -3829]
467c829N878L85j768J520p70m713k47L727j129K03M906N85m458J076M558m075
483A849m390L689K374l950n08N008j961n104Q05J374k777R77N010k116l841M107
499E46J451o516j294N979k396m474O822N603p297j263R512k332j0125N415Q452
514H083j0332o159J4600M879j3338p79J2049o636j1845J0601R411j2670n750J2765
528D879r40j2157O643R933j2656q259J3772L531j2541M719J3692j0158j3668J1830
542a380J0372j3143n177J4537L265j1512O86R784k698q416J636N104j118N27J184
557C651k258j917K124m3k766M4J796j006k698O03M249R12m724m202L974L960n215
574c516j725Q322O59r820K40J1357j066r643M018P779o974n331R912M088q816
$$ y = [-3829, 2049, 2434, 666, 2186, 1416, -3297, -3544, 183, -946, -743, 4163, 4748, 290, 1366, 5924, 1849, -2541, 1148, 3522, -428, -936, 4072, 2111, -2993, -2188, -814, -3591, -2614, 2396, 280, -3561, 546, 1997, -4519, -5813, 166, -2230, -6704, 118, 5721, -1576, -2839, 6673, 4341, -5784, -369, 8083, -2249, -8408, 6192, 11071, -2267, -3046, 9003, 2367, -9478, 1123, 10534, -2136, -7886, 4879, 3939, -8218, -1575, 8358, -4298, -12557, 1215, 4746, -7795, -3076, 10616, 458, -13210, -1380, 8992, -4151, -9328, 5209, 8474, -3038, -2352, 7432, 4734, -3682, -2046, 3058, 1940, 2467, 3651, 1393, -524, 1600, 1557, -1209, -1165, 631, -375, -3073, -2470, 1779, 2691, -2033, -6235, -2261, 1699, -3516, -5241, 3081, 3740, -6080, -5840, 5517, 4451, -5192, -1174, 6605, -369, -5700, 4212, 8300, -516]
589e16l59O414n644o092R086N017r861j830R511k379r200M455O575q398n173Q493
605I9J903n760K181M561o575l111R534J945r556N43Q671k586p202O005O206n867
621I91m745N565L032l425k54N81p16J361J363n089k453N777L38o826K161R045
637F706n029r555M920Q928o563p155N628K885m548J257M998k702k509L708o14
652C55l963N522M878q002l978R584J921j0687J00J1129k553q375N814O768r027
667e14n166R026J545r437J31Q234l046o051M626L501n853k511O055J471m094Q59
683a224Q53l269Q64L835n19k082K571K256l173j065M353P6m977R2N166P37m903
700d09j703M137J842m533j825N584J449p218k354P759K87q495k62Q667k117o955
$$ y = [-516, -875, 5539, -105, -6197, 2889, 7906, -1955, -3785, 5726, 3347, -5853, -1398, 5177, -3221, -8394, 99, 2002, -3758, -1577, 2984, -3591, -6702, 2832, 4777, -4779, -4236, 4435, 1849, -5353, 652, 6858, 991, -3754, 1811, 4843, 1418, 1164, 1745, 1029, 2390, 3753, -1336, -3789, 1988, 2326, -4500, -2339, 6706, 1677, -7878, -2958, 5970, -593, -7748, -2120, 765, -3783, -2526, 2472, -230, -2739, 969, 355, -3608, 1914, 6792, -1210, -5188, 4396, 6317, -4370, -4270, 6859, 4306, -4069, 1745, 8513, -514, -5680, 3346, 4891, -4546, -4415, 3819, 773, -5278, -652, 2849, -3004, -5515, 540, 2011, -2083, -1224, -371, -3640, -2776, 1059, 540, -1542, 1029, 3285, 112, -953, 3400, 3476, -1501, -1409, 3757, 4494, -409, -2112, 2025, 3867, -666, -2491, 3093, 4542, -2676, -5030, 2729, 3016, -5479, -5741, 2926, 809, -6146]
716f146M057O124n294l928N976K033o061J527N258m228k294O221J05p392M556
731E14Q447p303o605R338L508j2315q49J2280j917j2055M751R007p058n777P059
746A025K331q156P51O513l534l345N386Q1o896K614O109l692k797O165J231o742
762b956J326O638l747m894N702L288o997q44Q044m00p228J012M681l047l482L036
778A32K015k182m27r54j711J774K230k925k007M734J718o255j360O970J451p090
794c887j71O547P35n685Q81N642q68m958O07L998Q07k806j117J457O80j104r48
811a90J027J210j131k335m49J545K78j396j41J077k57r95n52J154K75r39k90K320
829B11P93k236o18L853k3m814J130O726j926o522L278O945m850n600N397L619
$$ y = [-6146, -2089, 4035, -1259, -5187, 789, 2822, -3239, -1712, 3546, -682, -2976, 3245, 3350, -4042, 514, 8961, 1658, -4947, 4391, 7899, -4416, -5265, 7015, 5098, -6957, -2206, 6801, -257, -6034, 1025, 3356, -4800, -4049, 2464, -1070, -4415, 971, 1052, -5844, -3230, 2879, -813, -3610, 2555, 3786, -2956, -1630, 5008, 1261, -3633, 2069, 5357, -1640, -2484, 5560, 5160, -2068, -1056, 3625, 578, -2904, 132, 2147, -35, -462, -1416, -3127, -1353, 877, -2048, -4055, 679, 2397, -3858, -5218, 1752, 3203, -3887, -4058, 2489, 3224, -2461, -1580, 4062, 3194, -1764, -1157, 2841, 3648, 842, -275, 1182, 1862, 758, -190, 837, 2047, 916, -1419, -1868, -323, -45, -1441, -1582, -505, -762, -1757, -2309, -1155, -880, -1819, -2109, 211, 1004, -1232, -1850, 2003, 1980, -2834, -1704, 5022, 3096, -3426, -148, 6797, 1947, -3653, 1744, 5363]
845E363o590j998O855j31o324K255L328n407r80O397j799o829M679N217q030l113
861g107J0612L46j1624L545J1560n540j0222Q698Q003r736m569J0118J731r500
875c685K362P376l922m729M985J234n601K140M378m479l654N142J533o615M39
890c096O057k710o092M142M860m677l317M554K296m761j082L611J935j777l82
905d39J413l88j008%K358R26r86j801P19J436j073n27J388r26k434M20K664l56
923A386j666j12n97j618J431J134j079j14J291j705k367L734L111m179k344M685
939I91J455m595O97N399j512m795J706M121j639j598J729r66j560J670J172k245
955C0K43K177l270k760M710K088n691j724N700M28n512O81M522k476l995L557
$$ y = [5363, -1227, -3225, 3630, 3499, -2825, -570, 2758, -2649, -3629, 2768, 969, -5860, -1181, 4036, -3994, -7107, 3505, 3851, -7773, -4228, 7332, 1792, -8430, 268, 8271, -1465, -6034, 4084, 5815, -3685, -1323, 6053, 2131, -2598, 2387, 3621, -1980, 160, 4538, 59, -3595, 1547, 3080, -3535, -3096, 2961, 251, -5841, -1699, 3161, -1516, -4833, -279, 2017, -2744, -3826, -215, 1720, -57, -439, 974, 586, -422, -422, 1936, 2862, 1876, 75, 794, 2230, 1157, 630, 2018, 1092, -1342, -922, 1742, 1386, -280, -392, -989, -2607, -1176, -42, -1121, -1235, 56, -1649, -4016, -282, 2829, -1350, -3694, 991, 2446, -2149, -1452, 3947, 2435, -2360, -654, 3467, 1828, 230, 1959, 993, -567, 1103, 2275, 30, 273, 2450, -820, -3580, 1130, 3218, -2473, -4197, 1503, 1931, -3581, -2900, 1622, -854, -4849, -1292]
971a292L823k799j556K040j72r08J977J74j971J182K625k343k089L628P64m090
987a007M73M815j714n285L181L311m001l496M032J604n197K93N224j391m710J518
1003b350L793j631k073J985J54k530J233K181j207j13J299k24j091L475J152m537
1019d84j277M708K09l608l82L295j389k487J816K906j478l442p55K357K186j830
1035C45l505K76K251j090j110K652J818l541j564M235J911l438J37J124j664l04
1051a467L073L01k439J493K282k297j119K965o33l554J783K542l519k377L505
1066E39J030l666J083L088k766k540L781J358m495n77K957j261j797L217J657
1081A608l002l9K871m97j069K177k02l622R98L793k296k673K834K735l028j481
$$ y = [-1292, 2531, -268, -1824, 216, 44, -864, 1113, 1287, -684, 498, 3123, 780, -1309, 2319, 3083, -1007, -534, 4281, 2567, -2718, 463, 3774, -227, -3723, 309, 1913, -3284, -2991, 2233, 842, -3868, -2350, 1443, -188, -2261, -276, -122, -2652, -1419, 762, -445, -558, 741, 517, -574, 2901, 4053, -484, -1761, 2947, 3156, -452, -834, 2461, 1072, -1415, 401, 3307, 1829, -1613, -2368, -11, 2175, 345, -3160, -2884, -633, -1723, -2833, -181, 1637, -1904, -3468, 767, 2678, -760, -623, 501, -1163, -1467, 1606, 1907, -532, 961, 3243, 946, -173, 2792, 2159, -1395, 388, 2930, -589, -2966, 539, 1569, -2097, -1014, 2074, -692, -3232, 549, 1907, -2588, -3165, -208, -1469, -3266, -49, 1608, -1394, -1433, 1438, 941, -128, 2049, 1847, -1775, -777, 3016, 720, -1953, 881, 3616, 588, -893]
1097h93L308K36l338k61K294j122j405K8R1m81J135M42j692K26K369j156k477
1114b696J870K080k526k538L251K238k404j274L934J056k721m37K048K25j603
1129E03m4J80J19k3l30m31N50J344q21k397J145J928k205k164J085J840k092j188
1147c001K375P71j714rJ994J11j811L12J596J56j880N08K097n58j782J198K909
1164C272j139k871J633K375j724k759K226R70l340q84L000j56k252J315J728k317
1180i23j012K494j690k779L057L197m525k145O510R04o588P5P754j670o906L450
1196g97O787l845n125L984K411m659n33M613m74l270K134J686l957n04L511j900
1212F2l696K805K697l334j341M353k68m405N90L325k122j448L005J603l056N31
$$ y = [-893, 2415, 2651, -687, -948, 1346, 224, -1181, -1153, -1062, -1543, -408, 34, -1658, -1432, 937, -219, -2696, -826, 1254, -1272, -3810, -559, 1679, -725, -1999, 1935, 2991, 270, -167, 1881, 2106, 503, 459, 639, 758, 735, 405, -26, 524, 1868, 1047, -1350, -205, 1723, -482, -2646, -1561, 279, -1813, -3001, -626, 145, -1569, -1578, 416, 527, -1284, -972, 624, 780, -1100, -592, 1505, 947, -835, 363, 3272, 2133, -738, 895, 3270, 1546, -1213, 1013, 1983, -1357, -2241, 759, 603, -1649, -334, 1394, -923, -1935, 559, -1131, -3910, -853, 2344, -2181, -4326, 2184, 3088, -3500, -3425, 4329, 2659, -4247, -797, 5990, 2145, -2980, 1004, 3415, -1244, -1777, 2836, 2362, -908, 1226, 2912, -1045, -1549, 1962, 62, -3634, -829, 1868, -1466, -2807, 1546, 1278, -3127, -2537, 788, -1334, -2782, 223, 1826, -1230, -699]
1228f99K519j182j983J542J278j713O6K151M94j284l8K39j117m98L29P8L75K99
1246H56k82j210L06J93j211m61J063O04l82o16P23K37j53j175r20J524J278j229
1264h55N45K318N48k396K25J452j283j527J111J263j001P19J297j138j683J547
1280A142P5k941L27L079j420k705K230J994l668k162L494J224l309Q03L985m80
1296A668l103Q22J130j841q99K250K04l73J862R73k168J36K966j997m109K069
1312d10L039k659j973L803P57m020l43L591j085l153K024K239l307j448L559N20
1328A134m986J19M407j228k135L120K588k308j022J896j112k224J342J227j794
1343i76K17L955o25k396J381J722k845k488K227J178k649m08K574l86j748l4J152
$$ y = [-699, 1820, 638, -1345, 197, 1475, -238, -172, 1979, 2473, 1189, 1151, 1390, 273, -225, 104, 182, 557, 856, 574, -636, -330, -137, -1348, -1809, -746, -142, -524, -1140, -417, -180, -333, -1508, -2428, -904, 374, -855, -310, 2008, 2556, 160, 385, 1837, 554, -973, 138, 1401, 400, 1119, 2416, 1278, -405, 1142, 1217, -1724, -1397, 1682, 262, -2443, -213, 1781, -1887, -4049, -555, 669, -2640, -1837, 2148, 1668, -1435, -613, 517, -1324, -2223, 27, 231, -142, 1720, 2693, 525, 661, 3627, 1630, -2479, -410, 2629, -30, -2003, 1800, 2557, -1463, -1806, 1785, 700, -2453, -429, 1810, -1497, -2945, 614, 1134, -3852, -3733, 674, -554, -2689, 431, 3019, 711, -311, 1585, 473, -1751, -409, 818, -976, -759, 3196, 2571, 175, 1556, 3278, 433, -2055, 172, 1350, -1299, -1707, 867, 481, -1267, -1301, -149]
1360a49p26n24Q33O36r0m13o27l20M4l32O32Q68M04O06J357P8m53l70p61j698
1380a005p40K002J396j239m55J924P0j849P34O96k089j323J708J47j979Q36K076
1397I10k220k112K545K168k546j91L317m31l118N60J789k027r44K212J47p02L097
1414B454J613l173q31K865r43m085J519K957k871k079L714J664l198q34K622j088
1430C06k280J404J352k683j81J675n66j827K712M50k406L62L728R7k932J451K131
1447B793l133k209K754J214j754N84K134m44j214J054J08k331M02O93j812j190
1463b351K666J204k522o80J780K57j911Q60J738r90j798N66R37r34K1O66j81O46
1481b6J165P26q10m37R95o27j200K8J405n42j411R64J388k6j524k83J362o42p21
$$ y = [-149, -875, -1399, -566, 70, -20, -433, -1060, -1380, -1336, -1668, -1036, -168, 236, 842, 2199, 2277, 1824, 1454, 693, -1005, -1745, 257, 1653, 414, -41, 1883, 1953, 104, 838, 1534, -555, -1878, -170, -23, -2002, -1166, 910, -1310, -3422, -877, 1291, -1255, -1446, 1871, 1440, -1678, -1118, 671, -1356, -2300, -88, 59, -643, 2454, 4067, 894, 63, 2928, 1985, -2100, -581, 2376, -495, -2574, 1140, 2804, -394, -1228, 1394, 306, -1974, -570, 782, -1901, -2082, -407, -973, -2800, -88, 362, -2044, -1682, 2046, 2143, -789, 662, 2793, -340, -2549, 205, 1419, -335, 249, 2383, 1939, 725, 1779, 1887, -444, -42, 651, -1161, -2351, 315, 1519, -1003, -1683, 97, 354, -1557, -697, 1041, 51, -1747, -1181, -244, -1178, -1157, -491, -672, -26, 1139, 1865, 1055, 618, 1613, 986, -214, -186, 1219, 677, -734, 230, 1618, 1592, 68, -215, 1147, 505, -216]
1500b16k61J97p02q58M88R37k60M21Q4r56m50J687J034k062o91K084M50k009N99
1519d84K236m32k001J010J893r89j106R82Q6j463O57R26j391r36J711l5k103O89
1537g50J801k006j304K485Q00l518J29L071r96k287K230K017k496j320L438k8
1553A266k717J450K337k342p35L447n19k860P96J957j593k050K690O25k692M82
1569d58K914j877k259J209Q66k567K59K590q55j932J158J769j737o71J447J33
1585a1q72J106R33l87o25N6k16n43P10J157n78l65J092O76n61j299m70L86k63
1604g4r00Q51N57q95o02J035R16j443j047L54J117p50j57J485j100j287Q52J306
1622B18j116P8J722J49j373J349K089k318k274J185J476j872o6K338K98j789Q59
$$ y = [-216, -477, -280, -982, -1840, -1352, -415, -675, -254, -170, -1126, -1576, 111, 1145, -917, -1608, 476, 926, -1083, -484, 1752, 1320, -681, 329, 2222, 1233, 127, 1109, 1195, -268, 389, 1315, -76, -1012, 699, 664, -1439, -750, 1051, -955, -2259, 226, 1026, -2492, -2363, 708, -288, -2575, -345, 1672, -824, -2144, 1294, 1266, -1451, -1, 2336, -6, -741, 2706, 2187, -673, 123, 2080, 487, -1563, 1127, 1752, -940, -458, 2456, 579, -1680, -471, 395, -2172, -1913, 677, -178, -2110, -952, 817, -920, -1591, -144, -11, -883, 223, 1156, 769, 144, 200, -16, -559, 151, 1308, 730, 365, 1457, 2133, 1572, 273, -197, 189, -74, -974, -123, 434, -461, -1063, -28, 888, -555, -1602, -1248, -131, -881, -1038, 447, -653, -1940, -1088, 218, -898, -820, 902, 1051, -322, 1027, 3116, 798, -1476, -291, 1185, -687, -753, 1585, 1883, 94, 953]
1639I53J708j875k276Q44L11j286J41K043j001j716K152J350k705j029K466L02
1655C82k110Q56K657j668k248J294J983j707l53K461L55r04J223L99k362r72J253
1672E39q38j691J902K113j186j065J929J69k439j520J300J73q76K26Q77l96o6
1689h49K81j53j20Q46K15n09O08O11j97q39m57K23j00L04R80L90N58R12n54j190
1709I60J38j290j105j12L09M00J66N04P08k92l93P7q70r67J041k61n90R48Q31
1728B02j170p50K024L60j407Q89K141r46q51N55M10j706n06Q42o02j12K376Q60
1746B609k054L21J618k276k334O23J862k160q57K538P23j663Q06M61j321l65J674
1763B05j44k092J790J875k115q64J658O57k193P56L044o70j420J395K25k073j132
$$ y = [953, 2661, 786, -1490, -646, -335, -1621, -1480, 563, -438, -2154, -2, 1348, -1357, -2386, 80, 382, -1728, -872, 1785, 117, -2131, -837, 1146, -561, -914, 1547, 1902, 998, 2221, 2620, 258, -714, 539, -299, -1990, -88, 2025, 839, -226, 1703, 1872, -567, -2087, -787, -614, -1490, -1264, -387, -783, -849, -568, -721, -841, 5, 220, -289, 319, 930, 733, -106, -563, -340, -440, -136, 844, 1234, 1792, 2704, 2150, 960, 1098, -192, -1297, -1409, -1100, -700, -534, -30, 678, 386, -7, 70, -800, -1767, -726, -987, -1577, -629, 202, -968, -1718, 306, 666, -741, 148, 2289, 1343, 492, 1047, 1457, -249, -755, 87, -515, -627, 1749, 2609, 555, 876, 2494, 218, -2116, -1493, 369, -1791, -2648, -110, 613, -1050, -244, 217, -1104, -1469, 205, 61, -2031, -241, 1634, -481, -1345, 313, 970, -1223, -467, 2577, 1907, 487, 1882, 2107, 34, -1098]
1780a098J277Qj340J098P30l66P47O23j732j687Q26Q26j712n29K348J38j301M72
1798f72R74J1j545P79M92K20j7Q01k34q26M33O7m32k80J277O16o62J61N46m13
1818A296q80j086k41J94J33l3R29J52n28o94M36o8n11q08P24O54k81p7R60K14
1838D85q89l96Q07P7K43O79p3k04K60j30p68j02J047k54j463J185J558j277p69
1857A6R37n90j937K69J530o91q32P11Q51j219L22O16n36j115R47O72o81R26P76
1876I72j275o39J994L89k075N82J577l66j441J566O92j848m35J189o03q92J289
1893F76K35j513l77J918q44j982Q87J779j933m73J719O85k209M84J229r08o45
1910a272J424L38q19L50J422r73p33J396N55j697m45J886m64j140L43J142n89
$$ y = [-1098, 179, 187, -1153, -55, 675, 309, 1056, 1679, -53, -1740, -914, -88, -1800, -2329, 19, 157, -1144, -672, 302, 313, -1232, -453, 39, 259, 242, 1043, 809, -17, 416, 483, 51, -229, 1048, 1664, 1002, 1163, 1709, 1296, 416, -670, -911, -717, -584, -617, 312, 464, -64, -758, -322, -390, -901, -1709, -985, -331, -612, -689, 271, 485, -404, -800, 7, 84, 327, 1006, 933, 729, 989, 859, 91, -11, 1036, 782, -681, 504, 2062, 785, 16, 953, 363, -1574, -1305, 225, -466, -1298, -587, 264, -955, -633, -17, -553, -1668, -721, -49, -730, 196, 972, -303, -942, 1052, 1441, -634, -52, 1525, 1159, -282, 1284, 1976, 128, -307, 882, 279, -613, 676, 911, -602, -979, 939, 95, -1887, -1000, 779, -1154, -1627, 92, 777, -1432, -948, 281, -627, -1272, 152, 490, -329, 21, 1443, 470, -263, 1133, 1688, -9, -454, 1432, 968, -172, 171, 1313, 724]
1927G24j361N46J190r67o74q1K71j7n51Q5P8K33Jk21J74N95K56m66n06K07R53
1948D69m40p29K01J410l1j134Q03J259n30j486P80J048r80j278J071P3j257K09
1966e42J090o69j063J744p7j728L99J194j395j456J856J668k217k05K284M19k033
1983g31k44K163p03j153R86Q29j159k31J285p37m72R26R08j752j08K323q57k686
2001a413P48J668j806j467J716J359j658m4J635m79j527L38J229j539l76J317
2017b99K91j437J477J709j700m58J940m9j726P77J399j016j435J270M31j592k47
2034f65J390k50r40J214Q10j739r30J293j20k336L28J924k73j031R45J019n34
2051A05q48J33P17k03o33M07M31M57N8j94p9L55k49K94L24o59P87j72r88J6N30
$$ y = [724, -637, -91, 1099, 132, -542, -623, -352, -369, -920, -835, -757, -524, -523, -744, -570, 25, 281, -185, -691, -484, 469, 29, -700, -499, 911, 880, -254, 549, 1808, 1278, -208, 572, 1620, 640, -638, 433, 506, -751, -542, 548, -121, -1184, 560, 483, -1245, -846, 348, -1047, -2503, -647, 1021, -1196, -1401, 883, 1302, -731, -975, 1188, 485, -668, 318, 1147, -12, -243, 1042, 305, -167, 759, 1667, -85, -193, 2130, 1273, -1413, -665, 1003, -803, -2270, -554, 805, -853, -897, 738, 259, -1268, -930, 299, -1240, -1616, -299, -8, -1445, 32, 1741, 41, -417, 1523, 1474, -252, 525, 1924, 908, -527, 743, 1174, -418, -665, 725, 475, -465, 749, 1559, -180, -1110, 183, 63, -2273, -1945, -21, -294, -1325, -380, 639, 105, -743, -610, 107, -96, -729, -322, 109, 566, 624, 430, 351, 706, 457, 751, 1075, 416, 1203, 1031, 43, 59, 589]
2072E89o13j299O22J355m50o63Q65K49j934m4J116r22j350J599J260j218k9K066
2090A199k41k268P69K150j017j724J622Q33j327l25J577n48j204R18L96l11m44
2107E5J174p28j301R18L13j732p38J853Q01j725K84J834n97j925M71R01p89q01
2125a732J588M47o37L92J241j084m37R63J11r25J6J474m31r31J32N95p98p56N09
2144b63Q95q29J39J86l34K7k51n78p1J81J73k16M18P87On05l97O93m85J02L63
2165D1j02L93L69oJ22K00j61o32j46O43L09p04O94oq10l77q2q7l5p9K23k11n4
2188d98L48k02q71K60M74r6o05J032K47k03M59jl87j35M77j92L14N79J0r99O36
2209F47R26m72j530N99P77o30q48J210L71j296m62N38k69r22Q65j84m94P02R81
$$ y = [589, -24, -1323, -701, 654, 204, -459, 406, 655, -1279, -1323, -207, -1129, -2479, -880, 380, -838, -867, 1199, 958, -1310, -541, 1609, 592, -1132, 490, 1323, -4, -329, 1248, 700, -504, 414, 810, 499, 55, 1229, 501, -800, 118, 431, -1301, -2039, -186, 615, -1110, -826, 1008, 411, -1514, -1043, -142, -931, -1732, -144, 303, -334, 58, 1299, 215, -222, 741, 852, -73, -57, 1417, 986, 55, 187, 782, -16, -772, -263, 632, -197, -58, 128, -206, -179, -430, -1008, -1079, -898, -725, -941, -523, 264, 270, -235, -632, 61, -424, -322, 41, -61, 332, 701, 695, 817, 1017, 856, 224, 78, 721, 1030, 326, 1020, 1014, 204, -173, -255, -342, -377, -456, -233, -444, -498, -150, -352, -1223, -963, -489, -585, -1190, -158, 89, -114, 345, 344, -43, -178, 299, 107, 421, 1000, 1010, 11, 647, 1573, 1101, -429, 170, 947, 317, -531, 679, 1050, -246, -708, -170, -439, -1361, -496, -680, -1174, -472, 509]
2228E09j288m88J261L37j322L14J644m57j393J262R68j077n82J242j21j030Q71
2245F50P42p82m91J161k35j639M10O85m10r92J010L35j068l66P06o2m72L00K42
2264b76p12M96O55m24l95L42O21l68l33P84L31k03l5M81j72m79K33j52O7k14J42
2285C89k55M23k12k62l4P0l90j85K8L2j04O24p28m53K80L04J00p4K18N17q33k7
2307e72P62K79n37k90R92l32R7O12Nn26J14J55m35n02P12K44j120p2P18N7q87
2328e26n3R86r86n63P46R3o41K12J050n78n86Q74K96r07k93J324L90j165L21J318
2348A312j142o09J021M30r53M00N89p20l97O03K26j165J13Q98r05p70P62Q48j485
2367i44j64J258j43j371P52J068p30o93Q37N18j175M96M79K8l80O41M48p91q6
$$ y = [509, -779, -1267, -6, 331, -991, -677, 967, 510, -883, 379, 1347, 270, -312, 930, 809, -221, 650, 1392, 610, 119, 1280, 1045, -594, -184, 501, 91, -901, 109, 444, -624, -990, -284, -346, -818, -518, -276, -988, -492, 163, -261, -656, -314, 307, -61, -394, 390, 721, 518, 483, 964, 792, 313, 546, 394, 461, 247, 389, 134, 557, 345, 83, 49, 119, -271, -456, -428, -396, -500, 124, -604, -1057, -777, -473, -373, -447, -229, 288, -545, -572, 190, 469, -68, -358, 634, 302, 399, 1011, 1016, 490, 604, 759, 324, -178, 534, 778, -342, -414, 304, 361, -526, -579, 407, -579, -1142, -396, -303, -944, -732, 318, -260, -846, 28, 324, -583, -876, 448, 838, -327, -6, 1312, 170, -439, 582, 1012, 59, 459, 1048, 328, -69, 534, 760, -405, -292, 606, -299, -1069, -307, 541, -944, -1108, 150, 7, -1364, -612, 456, -274, -967, -130, 388, -787, -291, 188, 216, -164, 477, 925, 134, 48]
2386D8P57l28n64O43M83l64n38L78k39j59p8P4O7n66J26q5j01J22j31n63P32n16
2408h02q7M36P9j52L03L82j58P3O55l43q36J046L21k59q84R89K89q10j79J019
2428A082k55r14N0O63r32k95P83q0j182L62J027o45q50R92L16p39m30Q79N11j336
2448i93M73P96l08n73J255k36n57L92N44k37k47K49K50o54r4O27K56j362M03P03
2468F87l34p88N84L2m50m03K41J35o36P4P46p64M27J65J16n06J62N23k70L56N6
2489A53K04J13n8j98K20Q6r1k26K66M42j28n63r5L02l76j00J3k22K02k90j24K06
2511b64K48m54J3l45K53j9j15L60M2j97K33K93r4J76J37L75k40j37J47K8l74P
2533G3N70r3j70k1P8m10m00M52L28r92L44K46m09m9J61k92m22O72K15p35O1J312
$$ y = [48, 805, 477, -87, 556, 1039, 675, 137, 515, 276, 117, 39, 113, 180, -386, -260, -345, -446, -324, -455, -1018, -286, -802, -889, -453, -374, -526, -223, 159, 1, 74, 729, 386, -450, 596, 917, 658, -226, 763, 1052, 242, 63, 1082, 827, -87, -37, 626, -306, -601, 182, 102, -1080, -718, 309, -336, -1186, -194, 122, -617, -1047, -168, 343, -993, -520, 276, -32, -605, 650, 414, -143, 249, 793, 556, 309, 558, 808, 154, 60, 687, 943, -419, -16, 687, 353, -435, 149, 181, -269, -672, -431, -296, -932, -858, -112, -876, -449, -284, -168, -674, -512, 11, -259, 97, 153, 357, 470, 412, 214, 434, 520, 429, 203, 469, 911, 783, 220, 125, 427, 51, -49, -36, -258, -56, -346, -470, -264, -16, -470, -457, -802, -549, -568, -683, -323, -281, -478, -245, 48, -46, 130, 267, 642, 402, 265, 412, 440, 66, 73, 643, 550, 380, 359, 437, 27, -373, 79, 407, -585, -241, 5, -404, -453, -292, -584, -1006, -334, -119, -854, -793, 519]
2555E19k72j066L16J275q46p19J096N87m95n05O60K31o87L70L70q35J6M00K16
2574F31p50O18l2q94m29J068Q9p99p0L51K3J23Ok62l67J14K63M1L5M94q8m83L60
2597D2P69l28l08J7K34J29k25K65J80l75k49K82J72l19J33j4j38o3l62l30q2l6
2619f06P6J00l07K61n4K65O2j78N19k9r12N25M68M81n04o5M88K77k77o65O91K27
2641H43k20k34J52R2o50l2PK56m26o4L52m1j22M0n02L32l86o4m9J28J82K7N74
2664A95m65K93P3L80o15K89K39k58k07k0L96k35J08K45M60p48O09J16q39j9N1
2685D8p6o25K17M82n38n18J062M88j257J02O26K6p41k59P85J4n28P26M40m08L47
2706D13J68j12m59P59J55n53n95J031l11p70K9J029k34p73M01L96n04m51K14j15
$$ y = [519, 247, -819, -503, 772, -74, -793, 303, 890, 395, -110, 550, 781, 94, 464, 834, -1, 15, 415, 631, -119, 499, 467, -427, -856, 212, 301, -498, -568, -217, -194, -71, -65, -327, -694, -580, -317, -276, -241, 253, 165, -318, 42, 811, 483, 175, 192, 426, 555, 330, 595, 775, 400, 151, 433, 605, 286, 419, 405, 267, 204, -158, -488, -570, -606, -530, -430, -737, -476, -530, -265, -203, -381, 138, 109, -803, -278, 190, 671, 167, 102, 590, 867, 590, -75, 616, 843, 623, 389, 541, 633, -17, -49, -42, 214, -212, -276, 76, 35, -87, -47, -549, -217, -603, -667, -716, -588, -406, -379, 195, -270, 23, 96, 476, -139, 150, 389, 131, -76, -96, 300, 65, 173, 418, 878, 130, 739, 855, 16, -3, 48, -28, -653, -436, 46, -492, -1010, 52, 540, -717, -615, 11, 37, -704, -963, -178, -164, -692, 34, 474, 66, 413, 581, 469, 10, 769, 924, 371, -224, 807, 496, -274, -245, 784, 550, -223, 178, 574, 70, -381, -167, -282]
2726b82l90j30M08k78j44O12J30j90J76j50M6Q5O6l9m30r2O95M39l04K80j09L67
2748G66n04L46lJ94l05o77J82j11J27j28K60l88K17L37k27p91J17K46k53l58M36
2769e17M95n43K15N90M11o43p2N26l04k16L99k3l54L07M64o00l52J118M4j097
2789a52K10O91k13j151K34M29n26k35L50N45m40j11J13N7m41M51L9l71j34N15
2809a40N0n52M77N80l74j75Q39N2o31q7M24j06k55J02j00J50j1N10n36n92N30
2830A55Q0n65m38N10K23m12k17O19k55l95M83Oj38Q7L52k15Q1J21l3k09L2N02
2852C74jj25J34P10l21l94l72P38l37m99Q4K13J1j63k70L58j85o64O17l82MM5
$$ y = [-282, -672, -802, -394, -672, -816, -204, -74, -264, -88, -238, -192, -107, -41, -80, -510, -602, 93, 532, 228, 508, 399, 766, 262, 608, 605, 799, 494, -183, -1, -112, 15, -113, 147, -241, -24, 313, 86, -705, -588, -342, -595, -953, -517, -22, -565, -350, 240, 651, 8, -64, 462, 158, -58, 341, 318, -36, 271, 735, 135, -217, 901, 945, -152, 58, 749, 536, -615, -381, 48, -478, -713, -363, 182, -258, -369, -256, -199, -640, -189, -150, -521, -655, -140, -90, -642, -165, 415, 41, -134, 705, 757, 126, 39, 463, 357, 102, 204, 104, 254, 243, 753, 217, -375, 155, 235, -330, -768, -258, -35, -447, -664, -45, -300, -695, -212, -206, -344, -257, 95, -120, -39, 82, 49, -160, -128, 374, 373, 248, 382, 1092, 771, 377, 5, 743, 406, -93, -9, 204, 215, 52, -218, 140, -45, -709, -92, -474, -470, -425]
$$ [...]
8191D3
##END NTUPLES=NMR FID
##END=
