##TITLE=1H_Costus-oil-G-SL73-f12
 CDCl3, 8 sc, 
 27.1.2020
##JCAMPDX= 6.0         $$ Bruker NMR JCAMP-DX V2.0
##DATA TYPE= NMR FID
##DATA CLASS= NTUPLES
##ORIGIN= UXNMR, Bruker Analytische Messtechnik GmbH
##OWNER= root
$$ XWIN-NMR		Version 3.5
$$ Mon Jan 27 15:39:06 2020 Russian Standard Time (UT+4h)  she@DPX200
##.OBSERVE FREQUENCY= 200.1315
##.OBSERVE NUCLEUS= ^1H
##.DELAY= (6, 6)
##.ACQUISITION MODE= SIMULTANEOUS
##.ACQUISITION SCHEME= undefined
##.AVERAGES= 8
##.DIGITISER RES= 18
##SPECTROMETER/DATA SYSTEM= spect
##.PULSE SEQUENCE= zg30
##.SOLVENT NAME= CDCl3
##.SHIFT REFERENCE= (INTERNAL, CDCl3, 0, 15.7039)
##AUDIT TRAIL= $$ (NUMBER, WHEN, WHO, WHERE, WHAT)
$$ ##TITLE= Audit trail, XWIN-NMR		Version 3.5
$$ ##JCAMPDX= 5.01
$$ ##ORIGIN= Bruker BioSpin GmbH
$$ ##OWNER= she
$$ F:/spectra/data/she/nmr/H-F/1/audita.txt
$$ ##AUDIT TRAIL=  $$ (NUMBER, WHEN, WHO, WHERE, WHAT)
(   1,<2020-01-27 15:35:22.09 +0400>,<she>,<DPX200>,
      <created by zg, POWCHK disabled, PULCHK disabled
       configuration hash MD5:
       00 E9 B6 7A A2 85 ED C7 34 08 36 98 17 FE 4E 26
       data hash MD5: 16K
       BD A7 C4 20 76 8B 3A F9 F2 F8 49 EF B4 73 21 5F>)
$$ ##END=
$$ 
$$ hash MD5
$$ 54 2C 99 EB A2 75 F1 56 51 46 82 79 84 65 73 25
##$RELAX= 
##$RELAX= 
##$RELAX= 
##$RELAX= 
##$RELAX= 
##$RELAX= 
$$ Bruker specific parameters
$$ --------------------------
##$DU= <F:/spectra>
##$EXPNO= 1
##$NAME= <H-F>
##$PROCNO= 1
##$TYPE= <nmr>
##$USER= <she>
##$AMP= (0..31)
100 100 100 100 100 100 100 100 100 100 100 100 100 100 100 100 100 100 
100 100 100 100 100 100 100 100 100 100 100 100 100 100 
##$AQSEQ= 0
##$AQ_mod= 1
##$AUNM= <au_zg>
##$AUTOPOS= <>
##$BF1= 200.13
##$BF2= 200.13
##$BF3= 200.13
##$BF4= 200.13
##$BF5= 200.13
##$BF6= 200.13
##$BF7= 200.13
##$BF8= 200.13
##$BYTORDA= 1
##$CFDGTYP= 0
##$CFRGTYP= 5
##$CHEMSTR= <none>
##$CNST= (0..31)
1 1 145 1 1 1 1 1 1 1 1 1 1 1 1 1 1 1 1 1 1 1 1 1 1 1 1 1 1 1 1 1 
##$CPDPRG= <>
##$CPDPRG1= <>
##$CPDPRG2= <>
##$CPDPRG3= <>
##$CPDPRG4= <mlev>
##$CPDPRG5= <mlev>
##$CPDPRG6= <mlev>
##$CPDPRG7= <mlev>
##$CPDPRG8= <mlev>
##$CPDPRGB= <>
##$CPDPRGT= <>
##$D= (0..31)
0 1.2 0 0 0 0 0 0 0 0.06 0 0.03 0 0 0 0 0.0002 0 0 0 0 0 0 0 0 0 0 0 0 
0 0 0 
##$DATE= 1580124921
##$DBL= (0..7)
120 120 120 120 120 120 120 120 
##$DBP= (0..7)
150 150 150 150 150 150 150 150 
##$DBP07= 0
##$DBPNAM0= <>
##$DBPNAM1= <>
##$DBPNAM2= <>
##$DBPNAM3= <>
##$DBPNAM4= <>
##$DBPNAM5= <>
##$DBPNAM6= <>
##$DBPNAM7= <>
##$DBPOAL= (0..7)
0.5 0.5 0.5 0.5 0.5 0.5 0.5 0.5 
##$DBPOFFS= (0..7)
0 0 0 0 0 0 0 0 
##$DE= 6
##$DECBNUC= <off>
##$DECIM= 24
##$DECNUC= <off>
##$DECSTAT= 4
##$DIGMOD= 1
##$DIGTYP= 9
##$DL= (0..7)
0 120 120 120 120 120 120 120 
##$DP= (0..7)
150 150 150 150 150 150 150 150 
##$DP07= 0
##$DPNAME0= <>
##$DPNAME1= <>
##$DPNAME2= <>
##$DPNAME3= <>
##$DPNAME4= <>
##$DPNAME5= <>
##$DPNAME6= <>
##$DPNAME7= <>
##$DPOAL= (0..7)
0.5 0.5 0.5 0.5 0.5 0.5 0.5 0.5 
##$DPOFFS= (0..7)
0 0 0 0 0 0 0 0 
##$DQDMODE= 0
##$DR= 18
##$DS= 0
$$ [...]
##$SUBNAM2= <"">
##$SUBNAM3= <"">
##$SUBNAM4= <"">
##$SUBNAM5= <"">
##$SUBNAM6= <"">
##$SUBNAM7= <"">
##$SUBNAM8= <"">
##$SUBNAM9= <"">
##$SW= 24.9337058887773
##$SWIBOX= (0..15)
0 0 2 0 0 0 0 0 0 0 0 0 0 0 0 0 
##$SW_h= 4990.01996007984
##$TD= 16384
##$TD0= 1
##$TE= 0
##$TE2= 300
##$TE3= 300
##$TEG= 300
##$TL= (0..7)
0 120 120 120 120 120 120 120 
##$TP= (0..7)
150 150 150 150 150 150 150 150 
##$TP07= 0
##$TPNAME0= <>
##$TPNAME1= <>
##$TPNAME2= <>
##$TPNAME3= <>
##$TPNAME4= <>
##$TPNAME5= <>
##$TPNAME6= <>
##$TPNAME7= <>
##$TPOAL= (0..7)
0.5 0.5 0.5 0.5 0.5 0.5 0.5 0.5 
##$TPOFFS= (0..7)
0 0 0 0 0 0 0 0 
##$TUNHIN= 0
##$TUNHOUT= 0
##$TUNXOUT= 0
##$USERA1= <user>
##$USERA2= <user>
##$USERA3= <user>
##$USERA4= <user>
##$USERA5= <user>
##$V9= 5
##$VALIST= <valist>
##$VCLIST= <CCCCCCCCCCCCCCC>
##$VD= 0
##$VDLIST= <DDDDDDDDDDDDDDD>
##$VPLIST= <PPPPPPPPPPPPPPP>
##$VTLIST= <TTTTTTTTTTTTTTT>
##$WBST= 1024
##$WBSW= 4
##$XGAIN= (0..3)
0 0 0 0 
##$XL= 0
##$YL= 0
##$YMAX_a= 307575
##$YMIN_a= -186020
##$ZGOPTNS= <>
##$ZL1= 120
##$ZL2= 120
##$ZL3= 120
##$ZL4= 120
##$ABSF1= 10
##$ABSF2= 0
##$ABSG= 5
##$ABSL= 3
##$ALPHA= 0
##$AQORDER= 0
##$ASSFAC= 0
##$ASSFACI= 0
##$ASSFACX= 0
##$ASSWID= 0
##$AUNMP= <proc_1d>
##$AZFE= 0.1
##$AZFW= 0.1
##$BCFW= 1
##$BC_mod= 2
##$BYTORDP= 1
##$COROFFS= 0
##$CY= 11.3945322036743
##$DATMOD= 1
##$DC= 2
##$DFILT= <>
##$DTYPP= 0
##$F1P= 16.9975609425685
##$F2P= -3.02152046262296
##$FCOR= 0.5
##$FTSIZE= 0
##$FT_mod= 4
##$GAMMA= 1
##$GB= 0.15
##$INTBC= 1
##$INTSCL= 1
##$ISEN= 128
##$LB= 0.24
##$LEV0= 0
##$LPBIN= 0
##$MAXI= 10000
##$MC2= 0
##$MEAN= 0
##$ME_mod= 0
##$MI= 1.114404
##$NCOEF= 0
##$NC_proc= 0
##$NLEV= 6
##$NOISF1= 3.799351
##$NOISF2= 2.8
##$NSP= 1
##$NTH_PI= 0
##$NZP= 0
##$OFFSET= 15.70392
##$PC= 1
##$PHC0= -9805.121
##$PHC1= 44.20081
##$PH_mod= 1
##$PKNL= yes
##$PPARMOD= 0
##$PSCAL= 0
##$PSIGN= 0
##$REVERSE= no
##$SF= 200.130013532006
##$SI= 16384
##$SIGF1= 3
##$SIGF2= 2
##$SINO= 400
##$SIOLD= 16384
##$SREGLST= <1H.CDCl3>
##$SSB= 0
##$STSI= 0
##$STSR= 0
##$SW_p= 3612.71676300578
##$SYMM= 0
##$S_DEV= 0
##$TDeff= 0
##$TDoff= 0
##$TI= <>
##$TILT= no
##$TM1= 0
##$TM2= 0
##$TOPLEV= 0
##$USERP1= <user>
##$USERP2= <user>
##$USERP3= <user>
##$USERP4= <user>
##$USERP5= <user>
##$WDW= 1
##$XDIM= 8192
##$YMAX_p= 0
##$YMIN_p= 0
$$ End of Bruker specific parameters
$$ ---------------------------------
##NTUPLES= NMR FID
##VAR_NAME=  TIME,          FID/REAL,        FID/IMAG
##SYMBOL=    X,             R,               I
##VAR_TYPE=  INDEPENDENT,   DEPENDENT,       DEPENDENT
##VAR_FORM=  AFFN,          ASDF,            ASDF
##VAR_DIM=   8192,          8192,            8192
##UNITS=     SECONDS,       ARBITRARY UNITS, ARBITRARY UNITS
##FACTOR=    0.0002004,     1,               1
##FIRST=     0,             0,               0
##LAST=      1.6414764,     0,               0
##MIN=       0,             -186020,         0
##MAX=       1.6414764,     307575,          0
$$ Real data points
##PAGE= N=1
##DATA TABLE= (X++(R..R)), XYDATA
0@%%%%%%%Pj5J6j6K4l2L2m0N6o6P4q8J07j28J49j75K02k31K67l06L49l96M48n05
$$ 0 0 0 0 0 0 0 0 7 -8 8 -8 16 -16 16 -24 32 -34 40 -48 59 -69 80 -95 107 -124 143 -163 186 -210 238 -267
31b67N70o41P17q03Q97j000J114j237J371j519J681j860K061k285K530k805L118
$$ -267 303 -338 379 -424 473 -527 587 -650 721 -798 883 -977 1084 -1201 1329 -1476 1642
48A642l474L884m362M928n606O439p496Q885j0805J3651j8351K7899p9561K13881
$$ 1642 -1832 2052 -2310 2618 -2988 3451 -4045 4840 -5965 7686 -10665 17234 -62327 151554
62A51554J19642l28593r6460K18554J26219k00761j38700J00211J27239n1844
$$ 151554 271196 -57397 -153857 64697 190916 -9845 -148545 -48334 78905 27061
72B7061q3032M80N5022L1559J1110l3287m1736J2907O0740l598o3687j4342O4205
$$ 27061 -55971 -55491 -469 31090 42200 8913 -32823 -19916 40824 37226 -26461 -40803 23402
85B3402K5459n6085m8262L4180N6069l245m7578n103N4348K9418n9849o7960K7844
$$ 23402 48861 -7224 -55486 -21306 34763 31518 -16060 -21163 33185 62603 2754 -65206 -37362
98c7362P1444o975n8674Q542O4003J412n6511q851M1898P646k8315q611M274p098
$$ -37362 34082 27107 -31567 -23025 40978 42390 -14121 -22972 18926 26572 -1743 -10354 -6080 -13178
112a3178J4337L1618j7701n1278J2983O0556j1449o6628J2918Q0123j152q1552
$$ -13178 1159 32777 15076 -36202 -23219 37337 25888 -40740 -27822 52301 51149 -30403
124c0403q741P1854R069p1911j8559O0148K3622m4444j9838L4723K1401k2663
$$ -30403 -39144 32710 41779 -30132 -48691 11457 35079 -9365 -29203 5520 26921 4258
136D258j7503J3366J2377o765j3597m417M594J0167O925m791j1502l965Q690J0718
$$ 4258 -13245 121 12498 5733 -7864 -12281 -7687 2480 9405 4614 -6888 -10853 -2163 8555
150H555m384j6188j257K1853Q367k8714j9643L0349L3384k5568m0044K1058M4539
$$ 8555 4171 -12017 -13274 8579 16946 -11768 -31411 -1062 32322 6754 -33290 -12232 32307
163C2307j6078m8446O663M3936k461l9794j152L3283N620k2092l370J6672O593
$$ 32307 16229 -32217 -25554 18382 15921 -23873 -25025 8258 13878 -8214 -11584 5088 11681
176A1681m557n075j3091q924J6799J8296j8441k4529K2522L4801j8881m3535J1604
$$ 11681 7124 2049 -11042 -19966 -3167 15129 -3312 -27841 -5319 29482 10601 -32934 -21330
189b1330M8729j69m7872j1394M2460K3346l1786l1745J7238L5264k392l5788j3495
$$ -21330 27399 27230 -20642 -32036 10424 33770 1984 -29761 -12523 22741 20349 -15439 -28934
202b8934K8764K5084j7136k9120P310L1659N109k8233j7229J7067K5938K434k2379
$$ -28934 -170 24914 7778 -21342 -14032 17627 22736 -5497 -22726 -5659 20279 22713 334
215C34j8719J1666K6436l808l7242j0325M4186K9273l7894m1305K8615M9729j6302
$$ 334 -18385 -6719 19717 15909 -21333 -31658 12528 41801 3907 -37398 -8783 40946 24644
228B4644n2100R37M5180J1154l2773j6066K0382J9519p040k1218j0060J1075J9465
$$ 24644 -27456 -26519 18661 29815 -2958 -19024 1358 20877 13837 -7381 -17441 -6366 13099
241A3099r61k1963n180K8116J5615k6180k5611J7368K9279q401k8675o86K4511
$$ 13099 12138 -9825 -15005 13111 28726 2546 -23065 -5697 23582 15181 -13494 -14180 10331
254A0331P735k0692j8004J1324K4230J283k4617j0631K2883K0185j7136k4286
$$ 10331 18066 -2626 -20630 -9306 14924 16207 -8410 -19041 3842 24027 6891 -17395
266a7395R378K2554o175k1881P54J8473N445o969o255m026j491N510L142j0987
$$ -17395 -8017 14537 8362 -13519 -12765 5708 11153 4184 -2071 -6097 -7588 -2078 1064 -9923
280i923j965K1840J1272k3812j7652K2339J8766k4411k3102K2066K4460j8961
$$ -9923 -11888 9952 21224 -2588 -20240 2099 20865 -3546 -26648 -4582 19878 917
292I17k5568J4529K5695o745k1092R25J3222L569o444n456N68Q506Q970r712j8388
$$ 917 -24651 -10122 15573 8828 -12264 -11339 1883 5452 -992 -6448 -5880 2626 11596 1884 -16504
307a6504K760K1594J951k0875l800K1595Q429j9421j5108J1541J7088j187j3220
$$ -16504 -13744 7850 9801 -11074 -14874 6721 15150 -4271 -19379 -7838 9250 8063 -5157
320e157n111J2038J4078p952k2066r96K4395O663k7447j4999K7450K3993j8533
$$ -5157 -10268 1770 15848 7896 -14170 -15166 9229 15892 -11555 -26554 896 24889 6356
333F356k4256J2250K2622m753j9563m589J0211R654J790r674j2800P859K2806
$$ 6356 -17900 -5650 16972 12219 -7344 -11933 -1722 7932 9722 48 -12752 -4893 17913
346A7913k739k9952n634L3392J4337l3129k2741K8155K8960j7049k8515R393K5761
$$ 17913 15174 -14778 -20412 12980 27317 -5812 -28553 -398 28562 11513 -17002 -7609 18152
359A8152j005k3297r371J3992J5358m531j8824n833J9568J6977j3884k1883P776
$$ 18152 17147 -6150 -15521 -1529 13829 9298 -9526 -15359 4209 21186 7302 -14581 -6805
372f805K4615j334k5365o757K0471J3687j2432j8612J340J7590J0016j3055j9026
$$ -6805 17810 16476 -8889 -15646 4825 18512 6080 -12532 -11192 6398 16414 3359 -15667
385a5667O294K5846J559k9382j1881K7677J9716k1485k2589J6517K4117r204k3685
$$ -15667 -9373 16473 18032 -11350 -23231 4446 24162 2677 -19912 -3395 20722 11518 -12167
398a2167o66J5181L629q031o730O72Q940J0857m651j6389K94J9440L493k4917
$$ -12167 -12833 2348 5977 -2054 -8784 -8112 828 11685 7034 -9355 -9061 10379 13872 -11045
412a1045j0909K3689J7421j9223j9765J4628K1692q846k3084r91J8279P890j0628
$$ -11045 -21954 1735 19156 -67 -19832 -5204 16488 7642 -15442 -16433 1846 9736 -892
425h92r445N982J2661k77j3795p166J1207J1435p344j3346L465J1528L2j0172
$$ -892 -10337 -4355 8306 8029 -5766 -12932 -1725 9710 2366 -10980 -7515 4013 4045 -6127
439f127k923P115N326j843n441j358P086P922o063j3766J898J5059o34j8637j386
$$ -6127 -9050 -1935 3391 1548 -3893 -5251 1835 9757 3694 -10072 -8174 6885 6251 -12386 -13772
454a3772K3405P902k1507j1806J7237J1265j5734j2123J2297J4520m908j0331
$$ -13772 9633 17535 -3972 -15778 1459 12724 -3010 -15133 -2836 11684 6776 -3555
466c555k14N785L198O3o778o823M951J1165l515j3719L328J9276K270k1365r398
$$ -3555 -3769 2016 5214 5277 -1501 -8324 -3373 7792 4277 -9442 -6114 13162 15432 -5933 -15331
481a5331J8016J4813j2467j6661O469J7741j24j9313q560J6897J7016r620k1661
$$ -15331 2685 17498 5031 -11630 -5161 12580 12456 -6857 -15417 1480 18496 8876 -12785
494a2785J515K2967M937k1083j0586J7326J4813r900j6592J874J3443O241o815
$$ -12785 -11270 11697 16634 -4449 -15035 2291 17104 7204 -9388 -7514 5929 12170 5355
507E355j2324k685J2472J0273j2271j8556J1737K7670m823l2090m792L2197J1326
$$ 5355 -6969 -9654 2818 13091 820 -17736 -5999 21671 16848 -15242 -20034 12163 23489
520B3489k8455j7074K3048J9223j6435k2207P708K0850L111j4090j0232M657J2197
$$ 23489 -4966 -22040 1008 20231 3796 -18411 -10703 10147 13258 -832 -11064 -6407 5790
533E790M159j2271j1223R613J7988m192k2317l675K1165J2390j7093j8834P874
$$ 5790 9949 -2322 -13545 -3932 14056 9864 -12453 -16128 5037 17427 334 -18500 -10626
546a0626K0416K06j9506p147J8615J6107j3042k2217M710K3388J705k1934o404
$$ -10626 9790 9996 -9510 -16657 1958 18065 5023 -17194 -12484 10904 12609 -9325 -15729
559a5729J8916Q930j5105j1977R849J1938k714p482k317K506N287L173p170r287
$$ -15729 3187 12117 -2988 -14965 -5116 6822 4108 -3374 -5691 -3185 2102 5275 -1895 -11182
573a1182O903J5653m731j9849J141K3048L656k2726j0106J9190J2593j4975j3088
$$ -11182 -4279 11374 6643 -13206 -12065 10983 14639 -8087 -18193 997 13590 -1385 -14473
586a4473J1509J4878m534j2707q97Q021L423m517n276J403O798K281o253n604
$$ -14473 -2964 11914 7380 -5327 -6224 1797 5220 703 -4573 -3170 3628 5909 -344 -5948
600e948M438P295k111q168J087P747K572n604n110L074O331m08r271l174J0704
$$ -5948 -1510 5785 3674 -4494 -3407 4340 6912 1308 -3802 -728 5603 5195 -4076 -7250 3454
615C454R670r584j3666O767J5468m993j9026J836K0229L366j6043n304J3585N806
$$ 3454 13124 3540 -10126 -3359 12109 7116 -11910 -10074 10155 13521 -2522 -7826 5759 11565
629A1565j0463q041L869O011J031j761k894k109O482N874q645j2193P423J6831
$$ 11565 1102 -6939 -3070 2941 3972 2211 -683 -2792 3690 9564 919 -11274 -3851 12980
643A2980m135j9239J50K1370M457k0361j0754J5470J4345r574j6742K623J7227
$$ 12980 8845 -10394 -10244 11126 15583 -4778 -15532 -62 14283 4709 -12033 -9410 7817
656G817M893j4089j1819P936J5549j150j6349m955J5062J0892j0800j4787K813
$$ 7817 12710 -1379 -13198 -5262 10287 9137 -7212 -12167 2895 13787 2987 -11800 -8987
669h987J3213L652j0827q107O396J3535K68j5607q160J4558J4446j1387k0134
$$ -8987 4226 7878 -2949 -11056 -4660 8875 9143 -6464 -14624 -66 14380 2993 -17141
682a7141O978K2975j369k2491l947K0690P403j6644j1179R829J2024k208r136
$$ -17141 -10163 12812 11443 -11048 -14995 5695 13098 -3546 -14725 -4896 7128 4920 -4216
695d216l488M875Q363O71j0873o969J0939J3162q941j7557M127J8927J854j8396
$$ -4216 -7704 -2829 5534 6205 -4668 -11637 -698 12464 3523 -14034 -9907 9020 10874 -7522
709g522n969J5529R845j0238j2155M386J2579J410j0849o350Q205J0353m718j2246
$$ -7522 -13491 2038 11883 1645 -10510 -6124 6455 7865 -2984 -9334 -1129 9224 4506 -7740
723g740J384J2344K083j0826n285Q655O283m398n894R50M563K402j660n370j348
$$ -7740 -6356 5988 8071 -2755 -8040 615 6898 2500 -3394 -2444 2119 4521 2861 -2509 -3857
738c857P590N944r129j0663P940J3475o350j4557M273J5946j380j4580r70J2179
$$ -3857 3733 9677 548 -10115 -2175 11300 4950 -9607 -5334 10612 9232 -5348 -6318 5861
752E861J717r661k855O694L005k051l057j02J287K991n04o185j667P621M116p677
$$ 5861 7578 -2083 -4938 1756 4761 2710 -347 -449 838 3829 3325 -2860 -4527 3094 7210 -467
768d67n303P679P800p243j0353L512J0343L88q367l684N931P496k948j1130k253
$$ -467 -5770 1909 9709 2466 -7887 -4375 5968 6356 -2011 -5695 236 7732 4784 -6346 -8599
783h599J1874P252j0481j1364Q638J4032n453j5552J310J4011K064j0984m749
$$ -8599 3275 10527 46 -11318 -2680 11352 5899 -9653 -8343 5668 7732 -3252 -8001
796h001O418O452m11n919n456K877R789n5j3208m439J6201J0153j5523j5848J2017
$$ -8001 -1583 4869 4458 -1461 -6917 -4040 5749 5694 -7514 -11953 4248 14401 -1122 -16970 -4953
811d953J8461p322j9812K164J8261M034j4122q369P667J0541j262j0820n255R147
$$ -4953 13508 6186 -13626 -11462 6799 10833 -3289 -11658 -3991 6550 5288 -5532 -10787 -1640
825a640J1801m840j5127r34J5289N792j2984r671R302J1748m024j1387q39R389
$$ -1640 10161 5321 -9806 -10740 4549 10341 -2643 -12314 -3012 8736 4712 -6675 -7514 1875
839A875N983o682j0237J418J3426M993j3004j0015J0861J3825q527j5661M462
$$ 1875 7858 1176 -9061 -7643 5783 10776 -2228 -12243 -1382 12443 3916 -11745 -7283
852g283J6709n8j4878l726J1655O168o150p649K41O750N882l001r949j571J1720
$$ -7283 9426 9368 -5510 -9236 2419 8587 2437 -5212 -4971 1779 7661 4660 -5289 -6860 4860
867D860N487j1941q936J0767J2222q169j3419N345J3366j764j1794k669Q193N006
$$ 4860 10347 -1594 -10530 237 12459 4290 -9129 -3784 9582 7818 -3976 -6645 1548 6554
881F554l820m935O12M686K237m515n637L192Q092j110q685j466Q360L630o925
$$ 6554 2734 -2201 -1589 3097 5334 819 -4818 -1626 6466 5356 -3329 -4795 3565 7195 270
896B70n235L772N792q79m458k180K763M540j252o582q18Q383L350r605o514Q807
$$ 270 -4965 -1193 4599 3720 -738 -2918 -155 4385 3133 -3449 -4267 4116 7466 -2139 -8653 154
912A54R524p037j0431M156R063l352q143K983Q579j39q069k499K858M370J184
$$ 154 9678 2641 -7790 -3634 5429 2077 -6066 -3083 5496 5357 -2712 -5211 -2353 2017 3201
927C201l722m084K019O716j328q418j181J0820L219j0767o921Q940R192m711j0497
$$ 3201 -521 -4605 -2586 4130 2802 -5616 -6797 4023 7242 -3525 -10446 -1506 7686 2975 -7522
942g522R34R853K961p260p415L828R566N25j0054m108R020P489q299j0192O156
$$ -7522 -6588 3265 6226 -1034 -8449 -4621 4945 5470 -4584 -8692 328 7817 -482 -10674 -4518
957d518J2224j569j1457k889Q098N646l615o456l92O142M111n526q365L909J2921
$$ -4518 7706 6137 -5320 -8209 -111 5535 1920 -4536 -4928 1214 5325 -201 -8566 -4657 8264
972H264K71j5571n753J4650J0605j0426j2409O537J3030k773j2511j927J0227
$$ 8264 8535 -7036 -12789 1861 12466 2040 -10369 -3832 9198 6425 -6086 -8013 2214
985B214O202n675r127L47R577N474q353q650M619J1697p41j2328l164J0462P012
$$ 2214 8416 2741 -6386 -6039 3538 9012 659 -7991 -3372 8325 7584 -4744 -7908 2554 9566
1000I566p188q845L213R194N70r092n198P937R236l415j2191j113J3065M885j1670
$$ 9566 2378 -6467 -3254 5940 6510 -2582 -7780 157 9393 5978 -6213 -7326 5739 10624 -1046
1015a046p459R075R592o777j0512K988R499J096o881m686K918N767J938n037n301
$$ -1046 -8505 570 10162 3385 -7127 -4139 5360 6456 -425 -5111 -2193 3574 5512 475 -4826
1030d826K692Q298q22r598j837J0772L548r936o433Q270P404n610p881K215P163
$$ -4826 -2134 6164 5342 -4256 -6093 4679 8227 -1709 -8142 128 7532 1922 -5959 -3744 3419
1045C419P54n917k920M661M858j970o215j131N697L019n472n049M664O472k452
$$ 3419 4173 -1744 -4664 -3 4855 2885 -3330 -4461 1236 4255 -1217 -6266 -1602 4870 2418
1060B418p045j65N537K531l466l377N31M199J855m220m043M204O850l089r289
$$ 2418 -4627 -4792 745 3276 -190 -3567 -3036 1163 3018 -1202 -5245 -1041 5809 2720 -6569
1075f569P2J0137J626r982l066R271N009q222n391N829O724l538o146L10M788
$$ -6569 -6497 3640 5266 -4716 -7782 1489 6498 -1724 -7115 -1286 5438 1900 -4246 -3936 852
1090H52J823k107l900j126N105M309m390p306K880R379l95j0396j649R533N077
$$ 852 2675 568 -3332 -4458 647 4956 566 -6740 -3860 5519 5124 -5272 -6921 2612 7689
1105G689p534p784M925R679j133r257l540P428N952n107p896K163R899J194r164
$$ 7689 155 -7629 -2704 6975 5842 -3415 -6955 473 6425 1318 -6578 -4415 5484 6678 -2486
1120b486l994Q301O425n149q309Q75P585K402n207n057K391P759R44q124n859
$$ -2486 -6480 1821 8246 3097 -5212 -4337 3248 5650 443 -4614 -2223 5536 6480 -1644 -7503
1135g503P065R862n007j1753J214J3626K432j2893n959J0671Q354o869r996K535
$$ -7503 -438 9424 4417 -7336 -6122 7504 9936 -2957 -8916 1755 10109 3240 -6756 -4221
1149d221Q262J885o599m440L701O684J0o982l832O381P182m109r160L18R152K255
$$ -4221 4041 5926 -673 -5113 -1412 5272 5282 -1700 -5532 849 8031 3922 -5238 -4920 4232 6487
1165F487q373n109O430P721l194q955n61Q179L853p041o484N056Q610j593r908
$$ 6487 -1886 -6995 -565 7156 3962 -4993 -5554 2625 6478 -563 -7047 -1991 6619 5026 -4882
1180d882q59Q505L319p126n496L984N606j009m586j359L067L782m53m722k072
$$ -4882 -5741 2764 6083 -1043 -6539 -2555 3051 2042 -2544 -3903 -836 2946 2493 -2229 -4301
1195d301M435M442m255p060K945P838j010q162j061Q464K146o896l175N412M346
$$ -4301 134 4576 321 -6739 -3794 4044 3034 -5128 -6189 2275 4421 -2475 -5650 -238 4108
1210D108m263m408J834M619Q16l830k426K560L667o52n040j391M317K885l519
$$ 4108 -155 -4563 -2729 1890 2706 -1124 -3550 -990 2677 2025 -3015 -4406 -89 2796 -723
1225g23m088K989N142m36m761j494L819L169k702m522M61N240J444n468l050M988
$$ -723 -4811 -1822 3320 2884 -1877 -3371 448 3617 915 -3607 -3146 2094 3538 -1930 -4980 8
1241HN700m774o369L050P847j139p474j299O937K935m858m135K263M442Q26m115
$$ 8 5708 934 -5435 -2385 5462 4323 -3151 -4450 2487 5422 564 -3571 -1308 3134 3960 -155
1257a55m150K631N944P8p245l008P679O177n039q463L262R023l87r339k734O819
$$ -155 -4305 -1674 4270 4348 -2897 -5905 1774 7951 2912 -5551 -2289 6734 6347 -2992 -5726 1093
1273A093N541n003o725K172P518J367o968m852N363P306k680q237m29Q119L224
$$ 1093 6634 1631 -5094 -2922 4596 5963 -1005 -5857 -494 6812 4132 -4105 -4534 3585 6809
1288F809o512n430M031O852j370p651k600O053N703l454p622k4R067L834q309
$$ 6809 297 -5133 -1102 5750 4380 -3271 -5871 182 5885 2431 -5191 -5215 3852 7686 -623
1303f23o638O496Q897m313j0175L87R135K513p779m440N431N548j746o008j627
$$ -623 -7261 -765 8132 3819 -6356 -5969 3166 5679 -2100 -6540 -1109 4439 2693 -3315 -4942
1318d942M735M355k086n986n18O491K812o175n100N112P094l146q896J87P675
$$ -4942 -207 4148 2062 -3924 -4442 2049 4861 -1314 -6414 -1302 5792 2646 -6250 -6063 1612
1333A612K848n837m561M128O168j405o472q62N924L586n400n629J835O521L84
$$ 1612 4460 -1377 -5938 -1810 4358 2953 -3519 -4381 1543 5129 -271 -5900 -4065 2456 2840
1348B840n845j872M773L564k399m401L22M409J358k551l604J493M459Q1m557j683
$$ 2840 -3005 -4877 -104 3460 1061 -3340 -3018 1391 2749 198 -3406 -1913 2546 2627 -1930 -3613
1364c613M662L445m453n160L350N187j310n234P76N340N85m395j988L835L161
$$ -3613 1049 4494 41 -5119 -1769 3418 2108 -3126 -2350 2990 3575 -820 -2808 1027 4188
1379D188k105m165q60L465J903k157k654J452M091l71m203j293M556L220l944
$$ 4188 2083 -2082 -2942 523 2426 269 -2385 -933 3158 2787 -1416 -2709 1847 5067 1123
1394A123m455J618N052J58m555j798M534L369l642n579J495N984J048n547l277
$$ 1123 -3332 -1714 3338 3496 -1059 -2857 1677 5046 1404 -4175 -2680 3304 4352 -1195 -4472
1409d472M660N697k834o162P52O673J145o318l953L786M676j487n038q19M965
$$ -4472 188 5885 3051 -3111 -2359 4314 5459 -859 -4812 -1026 3650 2163 -2875 -3694 1271
1424A271L486l225n341J035O832J512o703m668N129O072l155o689P62P390J463
$$ 1271 4757 1532 -3809 -2774 4058 5570 -1133 -5801 -672 5400 2245 -4444 -3682 3708 5171
1439E171p282m605N175O045j728o584o96O010L300m540n066K557O587j68p476
$$ 5171 -2111 -6716 -1541 4504 2776 -3808 -4504 1506 4806 266 -4800 -2243 4344 4176 -3300
1454c300l597N669N545l120o591Q04O836K164n406m600L704O752j293p468k333
$$ -3300 -6897 -1228 4317 1197 -5394 -4590 2246 4410 -996 -5596 -1892 4860 3567 -3901 -6234
1469f234O516M951m909o235L150O713j083o970j871O245L869l400m893J251N108
$$ -6234 282 5233 324 -5911 -2761 3952 2869 -4101 -5972 273 4142 742 -4151 -2900 2208
1484B208J241l954k934L217L917j462o181j082N739L456m465m718L350N380m03
$$ 2208 3449 -505 -3439 -222 3695 2233 -3948 -5030 709 4165 -300 -5018 -1668 3712 3309
1499C309n716j250N397K856l046n346Q63N380J025m359k457L682L541k695m370
$$ 3309 -2407 -3657 1740 4596 1550 -3796 -2933 2447 3472 -887 -3344 338 3879 1184 -3186
1514c186Q31M760O28l653j294K537K009p04k081k03J994J299k417l414J212M188
$$ -3186 -2355 2405 3033 -620 -1914 623 2632 1928 -153 -356 1638 2937 520 -2894 -1682 2506
1530B506L06m352j206M529K560l924l373L550M345k651n314Q27M733O99l639k221
$$ 2506 2812 -1540 -2746 1783 4343 419 -2954 596 4941 2290 -3024 -2197 2536 3235 -404 -2625
1546b625K735K874j219l161q07K718K381j792l382Q13M216O27l786k401L146L392
$$ -2625 110 2984 1765 -1396 -2203 515 2896 1104 -2278 -1465 2751 3378 -408 -2809 337 3729
1562C729k829m417K44N006J480m327l250L738M915k408n487J30O047K032n730
$$ 3729 900 -3517 -3273 1733 3213 -1114 -4364 -626 4289 1881 -3606 -3476 2571 4603 -1127
1577a127m373M005N551k060n767P7N154J526l325l801J279M935P05l973l730L261
$$ -1127 -5500 -1495 4056 1996 -3771 -3694 1460 2986 -339 -4140 -2861 2074 2779 -1194 -4924 -1663
1593a663N845j208o640r52O579K683o237n185M443O464k217o490J6O485K716m830
$$ -1663 4182 2974 -3666 -4618 1961 4644 -1593 -6778 -2335 4129 1912 -4578 -4562 1923 4639 -191
1609a91m224K740N163n91n222k406M026M253k032n389Q0N688K389m739m478L013
$$ -191 -4415 -1675 3488 2897 -2325 -4731 -705 3548 1516 -3873 -3793 1895 4284 -455 -4933 -1920
1625a920N519l25n597j887M793M929l527o081J346O628O63o909k914N754M192
$$ -1920 3599 3274 -2323 -4210 583 5512 1985 -4096 -2750 3878 4541 -2368 -5282 472 4664
1640D664m263m541K862M960n5m130j232K286K152r02k978j060K282L208j696l777
$$ 4664 401 -4140 -1278 3682 3627 -503 -1735 551 2703 1801 -1177 -2237 45 3253 1557 -2220
1656b220P3M934J641n279k966M753L760l130m956K051N024m0m385j324K883K458
$$ -2220 -2147 2787 4428 -851 -3817 936 4696 1566 -3390 -1339 3685 3645 -740 -2064 819 3277
1672C277k475k992Q72K680N26k557j199K474K081r31k690JK802K39k423j895J551
$$ 3277 802 -2190 -1318 1362 1888 -669 -1868 606 2687 1756 -934 -933 1869 2108 -315 -2210 -659
1689f59K049J02l109n99K937K040k429l586J975M221r14m783n35N212J510m364
$$ -659 1390 1492 -1617 -2216 721 2761 332 -3254 -1279 2942 2028 -2755 -3290 1922 3432 -932
1705i32k338L295K891k716l395N98K802O90k108j152J097K245Q76k598j740K290
$$ -932 -3270 25 2916 200 -3195 -2597 205 895 -1213 -2365 -1268 977 1853 -745 -2485 -195
1721a95K644j657m440J93M733J343m252k747L787L947k138m942K2N389J915m707
$$ -195 2449 792 -3648 -3455 1278 2621 -1631 -4378 -591 3356 1218 -3724 -3702 1687 3602 -1105
1737a105l869L433N437j435n597o79N267K395m267m322K525M367N5l854j720L250
$$ -1105 -4974 -1541 3896 2461 -3136 -3815 1452 3847 -420 -4742 -2217 2150 2205 -1649 -3369 -119
1753a19L792j157m795r55M891L029m688n173K722O520o92o796p40O563K594n474
$$ -119 3673 2516 -2279 -3234 1657 4686 -2 -5175 -2453 4067 3375 -3421 -4161 2402 4996 -478
1769d78l765L432N093j246n074r62L916L101j635m541KM243J636l617m024K453
$$ -478 -4243 -811 4282 3036 -2038 -3000 916 4017 2382 -2159 -2157 2086 3722 105 -3919 -1466
1785a466N289m16n259j460N141L240k918m902Q12N322R0m853k538M059L823k691
$$ -1466 3823 3407 -1852 -3312 1829 5069 2151 -2751 -1939 3383 3473 -1380 -3918 141 3964 1273
1801A273m570J488N159J16m461j738L384K670k103k984L17K506J534j619k646
$$ 1273 -3297 -1809 3350 3466 -995 -2733 651 3321 1218 -1766 -1449 1057 2591 972 -1674
1816a674J32L247M96l597k353L467M191k777m817J113N436R49n118j488L093K411
$$ -1674 -1542 1705 2201 -1396 -3749 -282 3909 1132 -3685 -2572 2864 3813 -1305 -2793 300 2711
1832B711k906k898J261K959K15k388j680K269J987o82k515j31K324J116k316j506
$$ 2711 -195 -3093 -1832 1127 1342 -1046 -2726 -457 1530 848 -1667 -1798 526 1642 -674 -2180
1848b180J395K049q53k159K2J818J067j918j865R09L148n0l093j266L581K228
$$ -2180 -785 1264 411 -1748 -1726 92 1159 -759 -2624 -1715 1433 1383 -1710 -2976 605 2833
1864B833k688l366K400L681j742m508K67M214J100l007j811J564K733k56k424
$$ 2833 145 -3221 -821 2860 1118 -3390 -3123 1091 2191 -816 -2627 -1063 1670 1414 -1010
1879a010p59J965J983j324l233k12M210J870l704l264K866L998j625m847L40M763
$$ -1010 -1769 196 2179 855 -2378 -2590 1620 3490 -214 -3478 -612 3386 1761 -3086 -2746 2017
1895B017J716m413k698K803M303m68m675q17L360K506l110l964J450M742M88m397
$$ 2017 3733 -680 -3378 -575 3728 3260 -1415 -2232 1128 3634 524 -3440 -1990 2752 3240 -1157
1911a157j838L396L209j476l784J56K999K080k849l469J391M592M81m781k566
$$ -1157 -2995 401 3610 2134 -1650 -1494 1505 3585 736 -2733 -1342 3250 3731 -1050 -3616
1926c616M341L451k807n101K024N052Pm678j772L661L282k098l597K87K862J511
$$ -3616 725 4176 1369 -3732 -1708 3344 3351 -1327 -3099 562 3844 1746 -1851 -1564 1298 2809
1942B809l164k716J300M276K60m585j366L587L103k600l181O74L596M94l777j973
$$ 2809 -355 -3071 -1771 2505 2765 -1820 -3186 401 3504 904 -2277 -1603 1993 2487 -1290 -3263
1958c263K623L530j251l671o37L480J845l717k196K215L444j488l438j16L889
$$ -3263 -640 2890 1639 -2032 -2669 811 2656 -1061 -3257 -1042 2402 914 -2524 -2640 1249
1973A249J152k676k053J423J619J62k269j183J528K300m12k929l80L384J650k932
$$ 1249 2401 -275 -2328 -905 714 876 -1393 -2576 -1048 1252 840 -2089 -2469 915 2565 -367
1989c67k626K410L065k075l372O52L567M10l176o61K427J184j473j867N70J795
$$ -367 -2993 -583 2482 407 -2965 -2313 1254 1664 -1512 -2173 254 1438 -35 -1902 -1332 463
2005D63J004k339j140J761K054q54k311j1K360M38k626q68J607J943l92k381j31
$$ 463 1467 -872 -2012 -251 1803 949 -1362 -1373 987 1425 -1201 -2069 -462 1481 1089 -1292 -1423
2022a423K386J598j775k885J336L154l62l748o26L985J660l179k890K453L326
$$ -1423 963 2561 786 -2099 -763 2391 2029 -1719 -2345 1640 3300 121 -2769 -316 3010
2037C010j423k988k10K539J239j681j901J189K305O68k330k125J216L345j073
$$ 3010 1587 -1401 -1611 928 2167 486 -1415 -226 2079 2747 417 -1708 -492 2853 1780
2052A780l802p77M194J915k854l049K133M226r78l981j328L514K410k264l958
$$ 1780 -2022 -2799 1395 3310 456 -2593 -460 3766 2788 -1193 -2521 993 3403 1139 -2819
2067b819J047L788J249m100k058K997L149j787m083O98L096J511k869j953J254
$$ -2819 -1772 2016 3265 -835 -2893 104 3253 1466 -2617 -1919 1177 2688 -181 -2134 -880
2082h80L083J04l099k152K258L819k258m475L61M778J785m833k531L900L931k530
$$ -880 2203 2307 -792 -2944 -686 3133 875 -3600 -3239 1539 3324 -1509 -4040 -140 3791 1261
2098A261m505P26M031L82k672j933J643K435l1k290j713J885K903j017l388n57
$$ 1261 -3244 -2518 1513 1895 -777 -2710 -1067 1368 1337 -953 -2666 -781 2122 1105 -2283 -2840
2114b840L480J742k722k501J675L449r18l294o26L076J185k184k525J829K904
$$ -2840 640 2382 -340 -2841 -1166 2283 1365 -1929 -2555 521 1706 -478 -3003 -1174 1730
2129A730j46l486j95L291J059k488j833J275K142q39j769L7J482R26p46j164k70
$$ 1730 1584 -1902 -2097 1194 2253 -235 -2068 -793 1349 510 -1259 -1222 260 1186 440 -724 -994
2146i94J586Q44j330j584Q14K336k45k626j83L063M68k539j244K079J586j722
$$ -994 592 1436 106 -1478 -664 1672 1427 -1199 -1382 1681 2149 -390 -1634 445 2031 309
2162C09j996J108K160j09k066j11J656Q06r58j435M86J373K8j325r35Q10K002
$$ 309 -1687 -579 1581 1472 -594 -705 951 1757 799 -636 -150 1223 1251 -74 -1009 -199 1803
2179A803l54k159n76K294J194j648j877R78K227j03k823r30K729K089k074k773
$$ 1803 1449 -710 -1286 1008 2202 554 -1323 -345 1882 1779 -1044 -1974 755 2844 770 -2003
2195b003J154L329n57l552o29L421J227k245j812J246K178p8k458o92J169J792
$$ -2003 -849 2480 1923 -1629 -2258 1163 2390 145 -1667 -421 1757 1679 -779 -1471 -302 1490
2211A490n37j958j321K603K376j937l720R84M449N4m401j497L876K504k817l312
$$ 1490 953 -1005 -2326 277 2653 716 -3004 -2020 2429 2483 -1918 -3415 461 2965 148 -3164
2227c164J297L747J81l412j800K526K598j375l045J18L089J304k582k398J750
$$ -3164 -1867 1880 2061 -1351 -3151 -625 1973 598 -2447 -2329 760 2064 -518 -2916 -1166
2242a166L069L3l268j547K415K547j223l478M9L683J554l419k908K545L848j169
$$ -1166 1903 1936 -1332 -2879 -464 2083 860 -2618 -2569 1114 2668 -751 -3659 -1114 2734 1565
2258A565m497J90L991J131l119k013K144K794q00k608n98J620J970r11j904p90
$$ 1565 -2932 -2742 1249 2380 -739 -2752 -608 2186 1386 -1222 -1820 -200 1770 859 -1045 -1835
2274a835K495J520j863k493J280L467p27l311m09K869J544k570j944J577K555
$$ -1835 660 2180 317 -2176 -896 2571 1844 -1467 -1876 993 2537 -33 -1977 -400 2155
2289B155p39k377k01K194J091j394j815O93J885n39j537k37J573P15j122j119
$$ 2155 1416 -961 -1162 1032 2123 729 -1086 -393 1492 953 -584 -821 752 1467 345 -774
2305g74K83J732K02j059q78M40J567n00j470n23J615J409j714j723J275K135j468
$$ -774 -491 1241 1443 384 -494 -54 1513 1013 -457 -980 635 2044 330 -1393 -118 2017 549
2322E49k150J318K028k72k330n25K367R02j753j191Q53Q57K81j611l06J079J287
$$ 549 -1601 -283 1745 1473 -857 -1382 985 1887 134 -1057 -204 653 934 -677 -983 96 1383
2339A383n63j892l53J777J433j788j902J076K157k44j999j043K347J941k006k585
$$ 1383 820 -1072 -1425 352 1785 -3 -1905 -829 1328 1084 -915 -1958 389 2330 324 -2261
2355b261Q12K949l08k848j027K884K010k001k857J350K751M1k797q52J568K067
$$ -2261 -1449 1500 1192 -1656 -2683 201 2211 210 -2647 -1297 1454 1495 -1302 -2154 -586 1481
2371A481q94k343m47K444J735j965k439L71L423R08l461j942L004K812k114l827
$$ 1481 587 -1756 -2203 241 1976 11 -2428 -2057 1366 2274 -1187 -3129 -125 2687 573 -3254
2387c254J480L861L78l470j912K417K573q12l064K67K567Q81j809k427Q65L164
$$ -3254 -1774 2087 2465 -1005 -2917 -500 2073 1261 -1803 -1536 1031 1912 103 -2324 -1459 1705
2403A705K83k988j533K200K824j353l241L41L435Q07k440k606J923K743l97l011
$$ 1705 1988 -1000 -2533 -333 2491 1138 -2103 -1762 1673 2480 40 -2566 -643 2100 1703 -1308
2419a308r20L507J403k332k426J249L259l89k934p69K236J345p04k412P38J093
$$ -1308 -2228 1279 2682 350 -2076 -827 2432 2043 -891 -1660 576 1921 1217 -1195 -457 636
2435F36J111j321j707Q61K052K92k331j376K347J531j387k240Q68K705o01k149
$$ 636 1747 426 -1281 -420 1632 1924 -407 -1783 564 2095 708 -1532 -664 2041 1440 -709
2451g09o66K345P05j425j423Q75J351j64j681N7J220N73p18j271N14J053K44j626
$$ -709 -1375 970 1675 250 -1173 -298 1053 889 -792 -735 485 1058 340 -931 -417 636 880 -746
2469g46k78J163O81o71j184M68J238O0j278p25R85J241n13j242m52K187j77j822
$$ -746 -1024 139 820 149 -1035 -567 671 731 -547 -1272 -287 954 441 -801 -1253 934 757 -1065
2487a065o45J663J564j668j702Q71K039l37j821k42J176J091q02j505K43J518
$$ -1065 -1710 -47 1517 -151 -1853 -982 1057 720 -1101 -1343 -167 924 122 -1383 -1140 378
2503C78O16j370j404Q62J821J43k291p58K029J708j750k191R32K457M28k413j408
$$ 378 994 -376 -1780 -918 903 1046 -1245 -2003 26 1734 -16 -2207 -1275 1182 1610 -803 -2211
2520b211K057K080j325k487L49K763P08k594j550J818K347r43l009J45K887R91
$$ -2211 -154 1926 601 -1886 -1537 1226 1934 -660 -2210 -392 1955 1012 -1997 -1852 1035 2026
2536B026j743j912P66K691l5k733j049J836K637j182k749n93L211J475k516k301
$$ 2026 283 -1629 -863 1828 1793 -940 -1989 -153 2484 1302 -1447 -2040 1171 2646 130 -2171
2552b171J555L285o52l432l50K930J405k417j713P40K731k37j995j299J511K070
$$ -2171 -616 2669 2017 -1415 -1765 1165 2570 153 -1560 -820 1911 1674 -321 -1620 -109 1961
2568A961j014j931m40K337J300j745k119J002K846l31k467j263K429J622j294
$$ 1961 947 -984 -1424 913 2213 468 -1651 -649 2197 1866 -601 -1864 565 2187 893
2583H93k196L04K260J98k102j095J849J727r73k321O19J784O01j956q01N98J508
$$ 893 -1303 -999 1261 1459 -643 -1738 111 1838 865 -1456 -837 947 1548 -408 -1209 -611 897
2600H97q1j267k35M48J236o71j248l0J560L22j583o52J150J861j498j728M65J735
$$ 897 816 -451 -686 -238 998 327 -921 -951 609 931 -652 -1304 -154 1707 209 -1519 -1054 681
2618F81m84j392j8J589K28j033q49O29J211p53j71j62L34N98l32j079M51Q08k07
$$ 681 197 -1195 -1213 376 604 -429 -1278 -649 562 -191 -362 -524 -190 408 76 -1003 -552 256 49
2637D9p23l17Q78M67n51n34L52J054j86j026q10J058J571l42k058J18K069o8k128
$$ 49 -674 -991 -113 354 -197 -731 -379 675 489 -537 -1347 -289 1282 940 -1118 -1000 1069 1001 -1127
2656a127r40K255J328j024j907O21K095j81j655q26J172J436o32j038o21J501
$$ -1127 -2067 188 1516 492 -1415 -794 1301 1120 -535 -1361 -189 1247 615 -423 -1044 457
2672D57J387j093k235M29K265O99k380j423K211K122j202k899O13K581J066k771
$$ 457 1844 751 -1484 -1055 1210 1909 -471 -1894 317 2439 1237 -1662 -1049 1532 2598 -173
2688a73j737J690K788j277k474k23K543R31j713j870P74K262L01k062j035J312
$$ -173 -1910 -220 2568 1291 -1183 -1406 1137 2068 355 -1515 -741 1521 1822 -240 -1275 37
2704C7K307j079k245o05K509J484k165k419J413K924l76k861q92K631K072k570
$$ 37 2344 1265 -980 -1585 924 2408 243 -2176 -763 2161 1785 -1076 -1968 663 2735 165
2720A65j879P64K476nk102j154J650J492p33j738l14J291J476j258j664N05K335
$$ 165 -1714 -950 1526 1521 -581 -1735 -85 1407 674 -1064 -1378 -87 1389 131 -1533 -1028 1307
2737A307M06k536j222K133J544j359j906M33K015J27j527j259J592J315m40j806
$$ 1307 1713 -823 -2045 88 1632 273 -1633 -1200 815 942 -585 -1844 -252 1063 623 -1183
2753a183j24J535O36j391m92O29R53l66r83j09L79N13J4q81Q8R33K09m67p96Q74
$$ -1183 -1307 228 864 -527 -1019 -390 563 197 -786 -895 -516 -3 11 -870 -782 151 360 -107 -903 -29
2773b9Q36n51j430K24J422N5j395l86J639N24j589l44R33Q27n56q90L63P26r9
$$ -29 807 256 -1174 -950 472 527 -868 -1254 385 909 -680 -1024 -91 736 180 -710 -347 379 280
2792B80o64R2L64R15n30n34n97O50Q54p09j194P74J293l85j281J3J521Q19q04
$$ 280 -384 -292 72 987 457 -77 -674 -24 830 121 -1073 -299 994 609 -672 -659 862 1681 877
2811H77j825M60J832L31k064q31J584J543j258k043P07K188O3j725q31J150J243
$$ 877 -948 -488 1344 1675 -389 -1220 364 1907 649 -1394 -687 1501 1564 -161 -992 158 1401
2828A401n13j637j02J791R89j356j394n2J942P82k208j517J890K095j032k420
$$ 1401 888 -749 -851 940 1929 573 -821 -873 1069 1851 -357 -1874 16 2111 1079 -1341
2844a341J01K852P81k615j393J373J927n29k653P7J810J360j652j715M29K388
$$ -1341 -1240 1612 2393 -222 -1615 -242 1685 1156 -1497 -1420 390 1750 98 -1617 -1188 1200
2860A200N60k161r37Q50J863m35k303j19K284J232j961j978P83K081j1k137j026
$$ 1200 1760 -401 -1338 -488 1375 940 -1363 -1482 802 2034 73 -1905 -1122 959 948 -1189 -2215
2877b215J935J962j264k375P42K355L82k172j295J614J300p76j777O3J660O63
$$ -2215 -280 1682 418 -1957 -1215 1140 1522 -650 -1945 -331 969 193 -1584 -1521 139 802
2893H02j027j140M42J771L9j234j123Q26J744m91j790o4J878N71j298j461J460
$$ 802 -225 -1365 -923 848 887 -347 -1470 -644 1100 609 -1181 -1245 633 1204 -94 -1555 -95
2910i5J267j036j485N58R54M32r18m04M49P09J08r45k05N61P44n55n63K6P45N9
$$ -95 1172 136 -1349 -791 163 595 -323 -727 -278 431 539 -406 -611 -50 694 139 -424 -398 347 406
2930D06n7n77N16L93l64p11M51O09Jp29j17R21M58j353o68Q72Q70p88p90L2J319
$$ 406 349 -228 288 681 317 -394 57 666 667 -62 -179 742 1200 -153 -821 51 921 133 -657 -625 694
2951F94j75o27O3N72Q67p06j024n2J005P8p18n29M87P47J57j073n53J165J111
$$ 694 519 -108 -45 527 1394 688 -336 -388 617 695 -23 -552 -65 682 839 -234 -787 378 1489
2970A489r00j922P15J764j22j354j008J338J755j264j821M43J502N43j790j084
$$ 1489 589 -1333 -618 1146 1024 -330 -1338 0 1755 491 -1330 -887 615 1158 -632 -1716
2986a716J009K070o05j831p0J775P52j339j437K43K034J26j680j409J552J627
$$ -1716 -707 1363 758 -1073 -1143 632 1384 45 -1392 -1149 885 1011 -669 -2078 -526 1101
3002A101o10j798k53K145J245j904k031J213K080j21k154q60K064J406j703j848
$$ 1101 491 -1307 -1560 585 1830 -74 -2105 -892 1188 1067 -1087 -1947 117 1523 -180 -2028
3018b028P47J955k5j637p96J271J722n27j745m21J900J149j492j696N71J850J66
$$ -2028 -1281 674 649 -988 -1784 -513 1209 682 -1063 -1484 416 1565 73 -1623 -1052 798 964
3035I64j831j269J744J512q49j366k63K192P05j420j520J118J441k45k052L93
$$ 964 -867 -2136 -392 1120 271 -1095 -1358 834 1539 119 -1401 -283 1158 913 -1139 -746
3051g46J006Q56j201p64M04J172M35j504l80M56J433l44j148J0J144J52p77j083
$$ -746 260 1116 -85 -849 -445 727 1162 -342 -722 -266 1167 823 -325 -315 829 981 204 -879
3069h79Q66R37q3j208j14J052M64p43n36K81Q56l8j024J6M04L17k67n84N88K39
$$ -879 -13 924 841 -367 -481 571 1035 292 -244 37 893 855 -169 -153 251 568 301 -283 305 544
3089E44k91l67K94K13K26p32j07L81K58J47m61r5K14K38m90j7J62L78m24o47J5
$$ 544 253 -114 180 393 619 -113 -220 161 419 566 105 10 224 462 -28 -45 117 495 71 -576 -561
3110e61R47M25j090p69J265J124p99j384N63J132j74j090q52J296O42m51j028
$$ -561 386 811 -279 -1048 217 1341 542 -842 -279 853 679 -411 -1263 33 675 224 -804
3127h04l12J683J64j003p83K01J242J88j317l71J183J167r07j927L81J294P11
$$ -804 -1116 567 731 -272 -1055 -854 388 576 -741 -1112 71 1238 331 -1596 -1215 79 790
3144G90j640j224J146J726k22j790j50J938P62j372j499O70K078m38j422j198
$$ 790 -850 -2074 -928 798 576 -1214 -1364 574 1336 -36 -1535 -865 1213 775 -647 -1845
3160a845J518J006l34j386k74J728R69j653j529Q28K187Q4k017l87J314J645j081
$$ -1845 -327 679 345 -1041 -1315 413 1382 -271 -1800 -972 1215 1299 -718 -1105 209 1854 773
3177G73k294M18K219m9j517j181J485J644l43j594l55J616Q02j387j303M06J673
$$ 773 -1521 -1103 1116 1067 -450 -1631 -146 1498 1155 -439 -794 822 1624 237 -1066 -660 1013
3194A013J75j091j119R93J338m82j622l30J834Q22j201j374O18J609k28j242n26
$$ 1013 1188 97 -1022 -29 1309 827 -795 -1125 709 1531 330 -1044 -426 1183 955 -287 -813
3211h13J553P64q50j172K31R00N3o26n53N36P88j52l81j64K07N31p73n63P0J165
$$ -813 740 1504 654 -518 -287 613 666 40 -513 23 811 659 278 114 321 852 79 -484 -414 751
3231G51k84k51o99N83M79l10o49O5J159m10q29j59O05J43k41r3P80j30n65n73
$$ 751 467 216 -483 100 579 269 -380 -315 844 434 -395 -554 51 194 -47 -140 640 510 -55 -628
3251f28O20Q4m74j84J24L70K15q7m81L98M70k82j87o30K82N59m9j069K86R52m4
$$ -628 -8 76 -398 -582 -458 -88 127 40 -441 -43 427 145 -42 -672 -390 169 120 -949 -663 289 245
3272B45o43p77Q01J243q47j150QJ767r4j104o63J335P71r80q26j67J106P38p70
$$ 245 -398 -1175 -374 869 22 -1128 -1120 647 553 -551 -1214 121 892 -88 -914 -1081 25 763 -7
3291gj288M36J105L54j030p41J343J051m66j469o51J711Q89j502j534J237J928
$$ -7 -1295 -859 246 600 -430 -1171 172 1223 757 -712 -1363 348 1237 -265 -1799 -562 1366
3308A366k60k017n56J672J350j389j301N07K008r8j597r68J350J195p66j159l98
$$ 1366 1106 -911 -1467 205 1555 166 -1135 -628 1380 1282 -315 -1283 67 1262 496 -663 -1061
3325a061J495J009j238j557J001J646K67j740q77J479J415r91j915R1J772M09
$$ -1061 434 1443 205 -1352 -351 1295 1562 -178 -1055 424 1839 848 -1067 -976 796 1205
3341A205j209j344J079J431k10j277l03J271Q05q57j579O57J027O31r36q61M29
$$ 1205 -4 -1348 -269 1162 952 -325 -628 643 1448 591 -988 -331 696 1327 391 -470 -41
3358d1J057j46j335l69J150Q13j160r02O3J934k16j089o06R91O93n72j365M29
$$ -41 1016 870 -465 -834 316 1129 -31 -933 -870 1064 848 -241 -847 144 837 265 -1100 -671
3376f71J012K01q77m15N57N38q6n05N3J43L20o4p47J25N50K76n94r4K12K18m99
$$ -671 341 542 -335 -750 -193 345 259 -246 -193 -50 270 206 -541 -416 134 410 -184 -278 -66 152 -347
3397c47K2P3O7K5k88J85M12j1k99m44Q37K8l95n99N15J52k01j85J50L11n2j71
$$ -347 -325 -252 -185 -160 -448 -263 149 138 -161 -605 232 260 -135 -734 -219 -67 -268 -453 -303 8 -44 -215
3419b15n89O89N70l25n02r6L48O39o77n58K79Q97J61j125n30R75R32p87j006L34
$$ -215 -804 -115 455 130 -372 -468 -120 519 -158 -716 -437 460 621 -504 -1034 -59 873 86 -920 -586
3439e86J446J35j308n21J050R39o19j139J70R40L60o68j325P29J091K01r03r78
$$ -586 860 995 -313 -834 216 1155 536 -603 -433 507 867 199 -1126 -397 694 895 -8 -986
3457i86J150R99k56j618k16J731O00r32j247M32J796n12j502o76J462J429j054
$$ -986 164 1163 907 -711 -927 804 1404 472 -775 -343 1453 941 -561 -1237 225 1654 600
3474F00j911L93K105K44j338q57P97J133k89j304m21J492K13m49j463N31J481
$$ 600 -1311 -918 1187 1431 93 -764 33 1166 877 -427 -848 644 857 408 -1055 -524 957
3491I57J26j071j095J144J309m10j740o0J306O79r63j643Q03J538k52j328j59
$$ 957 1083 12 -1083 61 1370 960 -780 -840 466 1145 182 -1461 -658 880 628 -700 -859
3508h59J044O21n59j161L57J067L39r47q06O18Q07n6q79l94M73Q02m36r73M3Q32
$$ -859 185 806 247 -914 -557 510 849 -98 -904 -286 521 465 -414 -808 -335 467 31 -942 -899 -67
3528f7P07p48o78L34J248n08r03j47R23K30o27n58M55L73J63o49K39j59J34J70
$$ -67 640 -108 -786 -452 796 288 -615 -762 161 391 -236 -794 -339 34 197 -452 -213 -372 -238 -68
3548f8k60J46j07M83k92j02j00J69n4J40k24L13k63r5K83J1J23j76JO11j52o31
$$ -68 -328 -182 -289 194 -98 -200 -300 -131 -185 -45 -269 44 -219 -314 -31 -20 103 -73 -72 539 387 -244
3570b44k44N02M79j17n78J45O03L32j013k70P03L42l64q17L29Q65J7m69m70L14
$$ -244 -488 14 493 376 -202 -57 546 878 -135 -405 298 640 276 -541 -212 653 670 201 -269 45
3590D5N46r5n30k05M05N74j78r15j32P98O42q77j008P87J405n82r01r68J704Q54
$$ 45 591 496 -34 -239 166 740 562 -353 -485 313 955 78 -930 -143 1262 680 -221 -1189 515 1369
3610A369j021j271J87J433K60j118n09R60Q37p92j190q8J467P32j184r79M10J363
$$ 1369 348 -923 -736 697 957 -161 -670 290 1127 335 -855 -943 524 1256 72 -907 -497 866
3628H66j83j216m22N39J333o85j134j81J644O66j188j394R19J671o03j437J74
$$ 866 683 -533 -955 -416 917 232 -902 -1083 561 1227 39 -1355 -436 1235 632 -805 -631
3645f31Q96N75r25q36L4J128L91j049o06N18Q17M6j168l80J310O86n21j442L66
$$ -631 265 840 -85 -921 -887 241 632 -417 -1023 -505 312 358 -810 -1190 120 806 285 -1157 -791
3664g91J335K18j177n85P93Q16m98j106L45P72J93p50j44K32N22P8o15k9L82N7
$$ -791 544 762 -415 -1000 -207 609 111 -995 -650 122 315 -435 -579 -347 175 253 -362 -391 -9 48
3684D8j48n69K01N97L75r7r13M0R10n9o40k4M71M04n89k49J50M72k64j08K10o4
$$ 48 -100 -669 -468 129 504 407 -506 -466 444 385 -255 -279 192 596 7 -242 -92 380 116 8 218 154
3706A54k75R1J64K04r3j09Q2K05m04k36N25r0Q1j93N3O4L1J68o5Rl23N03j67l10
$$ 154 -121 -30 134 338 245 136 218 423 19 -217 308 218 299 106 159 223 254 422 357 366 43 546 379 69
3730F9k19L87K34L1o62m9P41P2n88l66M50P81o46o23k70J070M69q21o12N92O84
$$ 69 -150 237 471 502 -160 -209 532 604 16 -350 100 881 235 -388 -658 412 881 60 -552 40 724
3751G24k02q45n67Q56P23o10n10m1P75N21o84j080N59J157J53j602o07J335R24
$$ 724 522 -323 -890 -34 689 79 -431 -472 303 824 140 -940 -381 776 929 -673 -1280 55 979
3770I79q83j078J47J558J3j142n05P10P97m64j059K6J125M47q66q49qJ680K85
$$ 979 96 -982 -835 723 736 -406 -911 -201 596 132 -927 -901 224 671 -195 -1044 -1052 628 913
3789I13j382o71M83R27P6j360J63Q49J013j285j128R29Q32K57j235m01J072O90
$$ 913 -469 -1140 -657 270 346 -1014 -851 -2 1011 -274 -1402 -473 359 616 -619 -1020 52 742
3807G42n32j104j63J594R0q91o62N79O49l08k46n05M05J367n26j099M7Q87P93
$$ 742 210 -894 -1057 537 627 -264 -926 -347 302 -6 -252 -757 -352 1015 489 -610 -563 324 1117
3826A117j183q34O79Q56l90r58QR43N26r74j15K03M77J87l65l19J49K07K46n38
$$ 1117 -66 -900 -221 635 245 -713 -705 238 764 -210 -325 -122 355 542 177 -142 7 214 460 -78
3846g8o8L90N20m59n05J18M36K71m26k60L69Q9k8j81L0J82N8l94O3K23k55k86
$$ -78 -146 244 764 305 -200 -82 354 625 199 -61 308 397 369 188 218 400 458 64 127 350 95 -191
3868a91L68L70l28P9l12M10Jq71L26O60l91j90j10N20J99j60k14k02J10N6J2j94
$$ -191 177 547 219 298 -14 396 397 -474 -148 512 121 -69 -179 341 540 380 166 -36 74 130 142 -52
3890e2l61L93O10o28j92k89Q50L2o82l13L17Q79n39r59J68J103j1m50n53M27O22
$$ -52 -413 -20 590 -38 -230 -519 331 363 -319 -632 -315 564 25 -934 -766 337 326 -124 -677 -250 372
3911C72m46n58j03O64L80j01p71N0P83R8o13n14L16P05j3o75o20N94J081m29j175
$$ 372 -74 -632 -735 -71 309 208 -563 -513 270 368 -245 -759 -443 262 249 -426 -1046 -452 629 200 -975
3932i75L74J094K90j127o11P76R86m13j319K71L30Q31k09j144M67N27N21r90q65
$$ -975 -601 493 783 -344 -955 -179 807 394 -925 -654 -324 507 298 -846 -379 148 669 -321 -1186
3951a186N97J323l0j209k17J214O20q60r58L18J007J96j317l36Q69P26l54r57
$$ -1186 -589 734 704 -505 -722 492 1112 252 -706 -388 619 815 -502 -838 31 757 403 -554
3969e54M28N80L85q94m20M67N67O2n84m40K89J245j015l39n7M88O80o58o58L66
$$ -554 -126 454 839 -55 -475 -8 559 621 37 -403 -114 1131 116 -223 -280 208 888 230 -428 -62
3989f2N75K28p00n71P99M68p34n81L61P47l9o01J04R3R0M8l23J61k12O92k96l47
$$ -62 513 741 41 -530 269 737 3 -578 -217 530 491 -110 -6 87 177 225 -98 63 -149 543 247 -100
4011a00j50J81M59k27m74K29J83J73l22j12L14k50J00k05q1J42K84j95p2k15N83
$$ -100 -250 -69 390 163 -311 -82 101 274 -48 -160 154 -96 4 -201 -282 -140 144 -51 -123 -338 245
4032B45l64J48J07j30k32K03J41m58j24l4O12j95m84P2O45mm03j89R3J03K68j28
$$ 245 -119 29 136 6 -226 -23 118 -340 -464 -498 114 -81 -565 -493 152 148 -255 -444 -351 -248 20 -108
4054a08o32k06Q48L08k78n47N29M87k99o71J2O64N58r36k41r6J167j98r12J13
$$ -108 -740 -946 -98 210 -68 -615 -86 401 102 -569 -557 107 665 -271 -512 -608 559 361 -551 -438
4074d38N50M05n52l83jN37P25p03q75L65P00L48r31m56P77P21k11j387K85Q33
$$ -438 112 517 -35 -418 -419 118 843 140 -735 -370 330 678 -253 -709 68 789 578 -809 -524 309
4094C09M57q37q50J105O40j12j029l18R04P31q95o43K96N21L02k71p96K38J116
$$ 309 766 -71 -921 184 824 712 -317 -635 269 1000 105 -538 -242 279 581 310 -486 -248 868
4113H68j46o73o31N24J009o28p44J74P55j3n74k72L24Q51n03n65p4P09K48m94
$$ 868 722 49 -582 -58 951 323 -421 -247 508 495 -79 -351 -27 824 321 -244 -318 391 639 145
4133A45l16J54L64R8n79k52L93M32j77m01r5N64R7n42l11L27M69Pm43m83N08M61
$$ 145 -171 -17 347 445 -134 -386 7 439 262 -139 -234 330 427 -115 -426 -99 370 377 -66 -549 -41 420
4155D20l86m72k2N98P1m64j37M9M82n58L3L52j29P5P2J49m66Q5K49K6j67n90N97
$$ 420 34 -438 -460 138 209 -255 -392 -343 139 -419 -386 -34 -163 -88 -16 133 -333 -248 1 27 -140 -730 -133
4178a33N69o84J11j48L18q3j18j07j36J55L11j2n05K71n3M83l02o9l51M38N28
$$ -133 436 -248 -137 -285 33 -50 -168 -275 -411 -256 55 43 -462 -191 -244 239 -63 -132 -483 -45 483
4199D83n54n03m5Q04L34n57n51O47M05m28l21P6M96jq1m08J40J90R2q5o95K83
$$ 483 -71 -574 -619 185 519 -38 -589 58 463 35 -286 -210 286 285 204 -204 -64 126 218 133 -562 -279
4221b79Q50nq93j40O89J013o22j099L43Q47J20o54m82N74M68m57o27j12R35L50
$$ -279 571 566 -327 -467 222 1235 613 -486 -143 704 824 170 -312 262 730 273 -354 -466 469 819
4241H19n38k60m07Q80M31j194O1K93Q88p96n47j08Q63M73o15q65M62P89J42j005
$$ 819 281 21 -386 494 925 -269 -208 85 973 177 -370 -478 385 858 243 -622 -160 629 771 -234
4261b34k89Q34L18j94j016J14J152j04q32K1Q3N68p2p17l4R5O24j4n44m60Q77
$$ -234 -523 311 629 435 -581 -467 685 581 -251 -230 -147 421 349 -368 -402 -307 317 303 -241 -701 176
4282A76O88o36j094N20R73j78j075J18P54N04j119k71M26j5J71k8j20m3K56O5
$$ 176 864 228 -866 -346 627 449 -626 -508 246 750 -369 -640 -214 -229 -58 -86 -206 -249 7 72
4302G2l07k77J73N51k25m3k07J58L16m60m61M07L74j31j60k12L02L02k31l49J6
$$ 72 -235 -512 -339 212 -13 -56 -263 -105 211 -249 -710 -303 71 -60 -220 -432 -130 172 -59 -408 -392
4323c92L27N1K2K5j78l2j99N66k54j16k56Q21k81n17M30k8K59m19k69K47O54m30
$$ -392 -65 -14 8 33 -145 -177 -376 190 -64 -180 -436 385 104 -413 17 -11 248 -171 -440 -193 461 31
4345C1r9Q5j14K52J31J15l71k08L71K34k35o11N23L84l03m87K01M99P6m94l21
$$ 31 -68 17 -97 155 286 401 30 -178 193 427 192 -419 104 488 185 -302 -101 398 474 -20 -341
4366c41M31L06j65q9k69O09l4J25q48J51M79J72o72r9k64Q80j94k74k80O87M39
$$ -341 90 396 231 142 -127 482 448 573 -275 -124 355 527 -145 -244 -508 372 178 -96 -376 311 750
4387G50k66q66Q2R59K35j072o01J079N61m88p01k49N40N00m05m26J20M75O5k24
$$ 750 484 -382 -300 659 894 -178 -779 300 861 373 -328 -577 -37 463 58 -368 -248 227 292 68
4407F8m91J52R74k11r78j48O26O41n61p04p7J108j98m94l84N31P97m02p54k78
$$ 68 -423 -271 703 492 -486 -634 -8 633 72 -632 -709 399 201 -293 -677 -146 651 249 -505 -783
4427g83J072J29n35m37J86M63J52o24k5J83L74p9p48L70L05L51j53p07n7Q74j34
$$ -783 289 418 -117 -554 -368 95 247 -377 -402 -219 155 76 -672 -302 3 354 201 -506 -563 311 177
4448A77l20p13Q61K92k83k28q3K75K67l73K0r8J75Q0oj91L19o6J2k43k37L99L80
$$ 177 -143 -856 5 297 14 -214 -297 -22 245 -128 -108 -206 -31 49 43 -148 171 105 117 -126 -363 36 416
4471D16k46n28J33M25J63k26l26K38M13l43n3L2j33N55o24j1J07M78m14k04L65
$$ 416 170 -358 -225 200 363 137 -189 49 462 119 66 98 -35 520 -104 -115 -8 470 56 -148 217
4492B17q5k48L66k16K27m53J77N14j97l31j66N44k60L1l58K23J14L20k91j8k51
$$ 217 132 -116 250 34 261 -192 -15 499 302 -29 -195 349 89 120 -238 -15 99 419 128 110 -141
4513a41N86J1j84m56L55L84k49o94M14L17K9k13n76N59M70j33p00l73O82J86k33
$$ -141 445 456 272 -184 171 555 306 -388 26 343 372 159 -417 142 612 479 -221 -594 88 274 41
4534D1k81K06L4N30n61m22M10K74L61q86j03L99K73j07n89l34R54L16q67k58J86
$$ 41 -240 -34 0 530 -31 -453 -43 231 592 -294 -397 2 275 168 -421 -755 199 515 -352 -610 -424
4555d24P93J07q97q1K54P40l54r26M92L27L5l02m25J84P52k18j86m22L63O19m69
$$ -424 369 476 -421 -502 -248 492 138 -788 -296 31 66 -236 -661 -477 275 57 -129 -551 -188 431 -38
4576c8o76R6R08n5p77l86M25Q71j01o94K22L43K00k24m06l59Q79K61q03l32N49
$$ -38 -714 -618 290 235 -542 -928 -503 368 267 -427 -205 138 338 114 -292 -651 228 489 -314 -646 -97
4597i7N62k0o75n01N75M64N0o27L77L1J72j99n40M17L79J35m72l55M53j67J75
$$ -97 465 445 -230 -731 -156 308 358 -269 108 139 311 112 -428 -11 368 503 31 -324 129 -38 137
4618A37l39j95J84O39k09%K4R9j77J69m45J65M62k48l41J5L78j59j24k10p5N98
$$ 137 -202 -397 -213 426 217 217 241 340 163 332 -113 52 514 266 -75 -60 318 159 35 -175 -250 348
4640C48P6j09j49j12K42J5l60K82l35L40J8j94o5l72O95l4j79Nj21L73j15k55
$$ 348 424 315 166 54 296 311 -49 233 -102 238 256 62 -3 -375 320 286 107 112 -9 364 249 -6
4662fp1j57Q55n74m48J55O47l18j29o1J08K53j02l34j74M54j16L32m56j85M57
$$ -6 -77 -234 621 47 -401 -246 401 83 -46 -107 1 254 152 -182 -356 98 -18 314 -142 -327 130
4683A30L66j018P5J14N44m96j96j39N24L95k81l14j52O27L1j9n60k7N04J5n95
$$ 130 496 -522 -447 -333 211 -285 -481 -620 -96 299 18 -296 -448 179 210 191 -369 -396 108 123 -472
4704d72k19P50L73m61m31J04K74K21j29k38J59K28K58q61k03N88O14o42m36J81
$$ -472 -691 59 432 -29 -460 -356 -82 139 10 -228 -69 159 417 -444 -647 -59 555 -87 -523 -342
4724c42N18J09l74j15J83K20J44l89l96L76L75J42o27k00M52L10n05k79J90O30
$$ -342 176 285 -89 -204 -21 199 343 -46 -442 -66 309 451 -176 -376 76 386 -119 -398 -208 422
4744D22k80m19P4L06N59l95l90J09J97L27l77k50k6Q14j0p53k9J70J66p8j85k88
$$ 422 142 -277 -203 103 662 267 -123 -14 183 510 133 -117 -143 671 661 -92 -121 49 215 137 -48 -336
4766c36N98J86p5j77n09N92L58n76k34J19L25j18l44J67K83N6j19o69Q13j55J42
$$ -336 262 448 373 196 -313 279 637 61 -173 -54 271 153 -191 -24 259 315 196 -473 340 185 327
4787C27l90j99j8N89p1r4m69K94L52n81pr9K85N22m50J74m94L44M28o09N6NJ17
$$ 327 -63 -262 -280 309 238 144 -325 -31 321 -260 -267 -366 -81 441 -9 165 -329 15 443 -166 -110 -105 12
4810A2N5k89k13kL22J30K1j04o6o6L42q55K57L54K26j98k56J71P35k57o14l88
$$ 12 67 -222 -435 -437 -115 15 36 -68 -134 -200 142 -713 -456 -102 124 -74 -330 -159 576 319 -295 -683
4832f83M82L27j59m22K18J96J54j93j45j38K94L86k55m71J10N76j34j45m88P72
$$ -683 -201 126 -33 -455 -237 -41 113 -80 -225 -363 -69 317 62 -409 -299 277 143 -2 -490 282
4852B82J21k63l53J62K74J9n02m05M98K31J97l46l27L73K30L04o41J55O5N23o62
$$ 282 403 140 -213 -51 223 242 -260 -665 -167 64 261 -85 -412 -39 191 495 -146 9 74 597 -65
4873f5q3Q5K60J19k41k42M22L35l00n60R4M60L52p22m95M99O73j71m04k43L80
$$ -65 -148 -63 197 316 75 -167 255 590 290 -270 -176 284 636 -86 -581 -82 591 420 16 -227 153
4894A53K27l8m89k4M81L40m27l14r1N12J12j19p37M02L95j22o09R3N96k57M31
$$ 153 380 342 -147 -171 310 650 223 -91 -182 330 442 323 -414 -12 383 261 -348 -255 341 84 515
4915E15r26O9L57p4L52n04j87N25J73J62p00L95K09k75k42k95O32J8J24n00p0
$$ 515 -411 -342 15 -59 293 -211 -398 127 300 462 -238 157 366 91 -151 -446 186 204 328 -172 -242
4936b42K70RK6l72M94q2m2m30LM74n6q1j64q5L7M03j42k70l22O33o5j33k62J0
$$ -242 28 37 63 -309 185 103 61 -369 -366 108 52 -29 -193 -278 -241 162 20 -250 -572 61 -4 -137 -399 -389
4960c89N45k97m47M95J30J7r3j25r0M75J34m79q0K6l7M72o4n29k13P59j27k87
$$ -389 156 -141 -588 -93 37 54 -39 -164 -254 221 355 -124 -204 -178 -215 257 193 -336 -549 210 83 -204
4982b04k0K64L92k42l75L2J61K52n56J33k07M55K35l47K2q0N58m14o1m2J95K37
$$ -204 -224 40 432 190 -185 -153 8 260 -296 -163 -370 85 320 -27 -5 -85 473 59 -2 -44 151 388
5004C88J36l16l34L74J61l27l98K16P01l13n93J43K67L64m02k15l6N67j05k27
$$ 388 524 208 -126 248 409 82 -316 -100 601 288 -305 -162 105 469 67 -148 -184 383 278 51
5024E1q6j04O37j4l52l79M04O00m54o20K56N44K46q11k11M18JJ69n13p0N97L13
$$ 51 -35 -139 498 484 132 -247 157 757 303 -317 -61 483 729 -82 -293 125 126 295 -218 -288 309 622
5046F22m23k64j21L30J70m65l70L40L32N8l20r1J10L82P9k47m74K13L77k59n16
$$ 622 199 -65 -186 144 314 -151 -521 -181 151 209 -111 -202 -92 290 369 122 -352 -139 238 -21 -537
5067e37L93P6M64n68j21L66J10l08j62k6M20j59l07J93j63M46j45K39n25M6L68
$$ -537 -144 -68 396 -172 -293 73 183 -125 -287 -313 107 -52 -359 -166 -329 117 -28 211 -314 -268 100
5088A00j85l60j74O04J22N5l45N8M86k52j96k60Q6M15n2k09j83N9K78o3J7r7K68
$$ 100 -85 -445 -619 -15 107 162 -183 -125 361 109 -87 -347 -261 154 102 -107 -290 -231 47 -16 1 -96 172
5111A72j69K36m20n2Q2K78q6n17L18L95J98o02J17N3J7J74j12j48K82K4k76rJ87
$$ 172 3 239 -181 -233 -151 127 41 -476 -158 237 435 -167 -50 3 20 194 82 -66 216 240 -36 -45 142
5134A42Q5p0o8k51K02K14m2J53r39N84L58n6l36O4M18k25p7m74J93N58o4m11J6
$$ 142 227 157 89 -162 40 254 212 365 -574 10 368 312 -24 40 458 233 156 -318 -125 433 369 -42 -26
5157b6o0M47Nl42m43M84L70k36n91L13K44p1K66n17J38K81L0m92j4M46L02m31
$$ -26 -86 361 366 24 -419 65 435 199 -392 -79 165 94 360 -157 -19 262 292 -200 -214 232 534 103
5179A03k73j13M45l6O4n75L41K71ql95J9L24J34l0o41O1K73L94o60o7j6M40R9
$$ 103 -170 -283 162 126 190 -385 -44 227 219 -176 -157 167 301 271 -370 -309 -36 358 -302 -369 -385 55 154
5202A54l48r4M19RJ34o11r9K65M34k90l53o7O00rk64k11N27j58J41l68l11M10
$$ 154 -194 -288 131 140 274 -337 -436 -171 263 -27 -380 -447 153 144 -120 -331 196 38 179 -189 -500 -90
5224i0K90j96l34kJ95N16n29k51L0N75j11m69L47k39M75j02m26K57K02j98K16
$$ -90 200 4 -330 -332 -137 379 -150 -401 -371 204 93 -376 -29 -268 207 105 -321 -64 138 -60 156
5245A56k64J36J43j26k05o0j47N30K14l88l33P03j83l19K05l00M60J23k77k65
$$ 156 -108 28 171 45 -160 -220 -367 163 377 -11 -344 359 176 -143 62 -238 222 345 68 -197
5265a97J34M19J02n52J82M8J77o5q1k16K81O8m75J62j43N14j71l53l0J40M12K08
$$ -197 -63 356 458 -94 88 136 313 248 167 -49 232 300 -175 -13 -156 358 187 -166 -196 -56 356 564
5287E64m19l37J74P05m59p72M92M44J14k41l27J59j15R6J0k42L63r4J21j46l42
$$ 564 145 -192 -18 687 228 -544 -52 392 506 265 -62 97 -18 78 88 -154 209 115 236 90 -252
5308b52M09J84l00m18L5O33j32m08L0N69p5p3l48j38J98N69m83l97K29P2N35m24
$$ -252 157 341 41 -377 -342 291 159 -249 -219 350 275 202 -146 -284 -86 483 0 -397 -168 -96 439 15
5330A5l00J78J32O2j66l68K05J72J74k96p0l3N07l05m16Q3Q74k26n76J57J11K23
$$ 15 -285 -107 25 87 -79 -447 -242 -70 104 -192 -262 -295 212 -93 -509 -426 448 222 -354 -197 -86 137
5352A37J26l74l4K02j5m0k04P7O5K67J41m18k6M22k66l31l1K28L00k93j38J94
$$ 137 263 -111 -145 57 42 2 -202 -125 -60 207 348 -70 -96 326 60 -271 -302 -74 226 -67 -205 -11
5374a1Q8P2j29m28M25K72J1l22P3J07K01k7l78j69J63K19j29l2L3k38O83l34k98
$$ -11 77 149 20 -408 17 289 300 -22 51 158 359 332 -46 -215 -52 167 38 6 39 -199 484 150 -148
5397a48k2P79j83m44j16K36O7j54j85K00j70N44j22m97j19N19J41l74Q4M12J64
$$ -148 -170 609 426 -18 -134 102 169 15 -170 30 -140 404 282 -215 -334 185 326 -48 36 448 612
5418F12m37l47m8L96n9o4k17L28j33J63k03o7j12M80n85N08l19L78k10r3l57J69
$$ 612 175 -172 -220 176 117 53 -164 164 31 194 -9 -76 -188 292 -293 215 -104 274 64 -29 -386 -217
5440b17N42k82J23l04K8m0L20k79l4l2N50j3m31k71L32K73l02m87M15P3L25n53
$$ -217 325 43 166 -138 -110 -150 170 -109 -143 -175 375 362 -69 -340 -8 265 -37 -524 -109 -36 289 -264
5462b64J6L13nQ4j67j62K14o8L00o12j00M52K12k74o0k04K25j36R1l05K50M17
$$ -264 -248 65 60 144 -23 -185 29 -39 261 -351 -451 1 213 -61 -121 -325 -100 -236 -145 -450 -200 217
5484B17k40J90l12K62K41m60m0L9j04M30m30l79L70K12n1pj04J54K00o5j38j57
$$ 217 -23 167 -145 117 358 -102 -142 -103 -207 223 -207 -586 -216 -4 -55 -62 -166 -12 188 123 -15 -172
5506a72M54l80J01j16j20O02Q4l38r5J39J92l29l57P4M11LL05o47J79J22J48o79
$$ -172 282 -98 3 -113 -233 369 453 115 20 159 351 22 -335 -261 150 153 458 -189 -10 112 260 -419
5528d19J32N57j24J48k55r8O84l14l2m86J9K11m7J12j25P0K00J61k59j66L23p7
$$ -419 -287 270 146 294 39 -59 625 311 279 -207 -188 23 -24 88 -37 33 233 394 135 -31 292 215
5550B15L10q06L98j6L4k81j01K34K69K32m64mKJ04k5l1k4J73J8j96k21K97k24
$$ 215 525 -281 117 101 135 -146 -247 -13 256 488 24 20 22 126 101 70 46 219 237 41 -180 117 -107
5573a07j7Q7j62l31M20O78j009M39l8K31J6j61l61M30K35k44j53j26L52k91k05
$$ -107 -124 -37 -199 -530 -110 568 -441 -2 -40 191 207 46 -315 115 350 106 -47 -173 179 -112 -317
5594c17K68m86M17K18k75j21J08L98j28n60K73K50k30L0l20K19M96j16m61j03
$$ -317 -49 -535 -118 100 -175 -296 -188 210 82 -478 -205 45 -185 -155 -475 -256 240 124 -337 -440
5614d40O16J5n4n82J21N40j22l57p2J43L06l11k60L28K21L07j12p28L13N5L17
$$ -440 176 191 137 -445 -324 216 94 -263 -335 -192 114 -197 -457 -129 92 399 287 -441 -128 -73 244
5635B44k76k87M93m3Q4n12M8M50j11K72k81k57J74L48l88r2j11P28j99M8j66j94
$$ 244 -32 -319 174 131 215 -297 -249 201 90 362 81 -176 -2 346 -42 -134 -245 483 284 332 166 -28
5657b8J26Ml01%N32n1k07J99l46K09P7J60n96K01L21p7k07j32K43j53K37l78J38
$$ -28 98 102 -199 -199 333 282 75 274 -72 137 214 374 -222 -21 300 223 16 -116 127 -26 211 -167 -29
5680b9j63M88j07l03j45J3K22K10m36K03K35J62o51L35J3J37J47n06J73o3M5J28
$$ -29 -192 296 189 -114 -259 -246 -24 186 -250 -47 188 350 -301 34 47 184 331 -175 -2 -65 -20 108
5702A08k29M1K98k50j2L9NQ8L44n03R8q2%J01k36J30k68N57q3n77M22J03J59p08
$$ 108 -121 -80 218 -32 -44 -5 0 88 432 -71 27 -55 -55 46 -190 -60 -328 229 146 -431 -9 94 253 -455
5726d55M6K08K74k72M1l7K85L52l86j47L00k56L40j60m46K25M4M40o59o2K77L96
$$ -455 -409 -201 73 -199 -158 -195 90 442 56 -91 209 -47 293 133 -313 -88 -44 396 -263 -325 -48 348
5748C48o71j24M13K47J79k94n05M68J03l62M2j05L16q0J22o5l53M34J01j32m0
$$ 348 -323 -447 -34 213 392 98 -407 61 164 -198 -156 -261 55 -25 97 32 -321 113 214 82 42
5769D2j60M38m90q5K75K7J20j0k13RK79j38N8j30j18L27L2m43J21L30J47j42l74
$$ 42 -118 320 -170 -255 20 47 167 157 -56 -47 232 94 152 22 -96 231 263 -180 -59 271 418 276 -98
5792i8Q6O8K15k84m4J37k0J56J2j31j35J27P7k25J02M4O6Jl00J50K48l16J48l55
$$ -98 -12 56 271 -13 -57 80 60 216 228 97 -38 89 166 -59 43 87 153 154 -146 4 252 -64 84 -271
5816b71M51k87L72j95j40j46L25J01l89K28Pk21K31l70J16L50J8J18l89J6K49
$$ -271 180 -107 265 70 -70 -216 109 210 -179 49 56 -165 66 -304 -188 162 180 298 -91 -75 174
5837A74r6k09k8m9O29j69m03K8R3L07m22j20j45L71K26k42k60k39P13l2l54J81
$$ 174 78 -131 -159 -208 421 252 -151 -123 -30 277 -145 -265 -410 -39 187 -55 -315 -554 159 127 -227 -46
5859d6M1M32n98k9J24J20Q3k11j87l11O94o0mm04J77K94K66n36L0J56L01m17k16
$$ -46 -5 427 -171 -200 -76 44 127 -84 -271 -582 112 52 48 -356 -179 115 381 -155 -125 31 332 -85 -301
5882c01K88K34rl12J2LL04j24J50p45M58J99k2l34J90L42k14j67k26L52K18j07
$$ -301 -13 221 212 -100 -88 -85 219 95 245 -500 -42 157 135 -199 -9 333 119 -48 -274 78 296 189
5904A89n44L9K40L11Jk49j36O8L65n58j20N40J35n8k74R8l3J77P8j45J18j08O7
$$ 189 -355 -316 -76 235 236 -13 -149 -81 284 -274 -394 146 281 223 -51 47 14 191 269 124 242 134 201
5927B01J2l43l5J83o8R0j66L77j42%r3k53M00J59j51m47k04O26K58k56n56j50
$$ 201 213 -130 -165 18 -50 40 -126 251 109 109 16 -237 163 322 171 -276 -480 146 404 148 -408 -558
5949e58R14j77m0m60O13k27L0j33k16K08J59k39o5q6L81j13o9J3m8K66J14l07
$$ -558 356 179 139 -321 292 65 95 -38 -254 -46 113 -126 -191 -277 104 -9 -78 -65 -113 153 267 -40
5971d0n6Q8r0j3j96L58j00o5K4n6J6K73r3q4l04R1M33l74k8j05N13k69K38l91
$$ -40 -96 -8 -98 -111 -307 51 -49 -114 -90 -146 -130 143 50 -34 -338 -247 186 -188 -216 -321 192 -77 161 -230
5995b30j0K73J46q9k93K34J52j84k55l58P50L26m93k11m0N57j72n7L3J27l12K10
$$ -230 -240 33 179 90 -203 31 183 -1 -256 -614 136 462 -31 -242 -282 275 103 46 79 206 -106 104
6017A04O0m43L14J43m93L19j26J29K7J10l57N11j60P4l84m4M43L5j00q1l03K67
$$ 104 164 -279 35 178 -315 4 -122 7 34 144 -213 298 138 212 -172 -216 227 262 162 81 -222 45
6039D5L22j33l92J69J61J82m46j25K94KL0N7j09j01L97k95j65k45N93p7K14n47
$$ 45 367 234 -158 11 172 354 -92 -217 77 79 109 166 57 -44 353 58 -107 -352 241 164 378 -169
6061a69L6L78j5l23Q8j74K44l5j50J05m0P3P8j65k07P92k3m79j71P1N38n84J25
$$ -169 -133 245 230 -93 -5 -179 65 30 -120 -15 -55 18 96 -69 -276 516 493 14 -157 -86 452 -132 -7
6084gj51L20k42K20q0P1r9J32m08K38j01J98J25l24L5m0K08m7k64K9j6K38j09
$$ -7 -158 162 -80 140 60 131 32 164 -244 -6 -107 91 216 -108 -73 -113 95 48 -216 -187 -203 35 -74
6107g4j48M6L06n2j09j99O1K18Kk89K63l3R9o4j68J69l1k1m9j95K5L48j53k84
$$ -74 -222 -176 130 78 -31 -230 -169 49 51 -238 25 -8 91 27 -141 28 -3 -24 -73 -268 -243 105 -48 -332
6131c32r2L95J91l05J44k03J78K20j40J2l55L58nK70m71j9K99l17J09k46J47K56
$$ -332 -424 -29 162 -143 1 -202 -24 196 56 68 -287 71 66 336 -135 -154 145 -172 -63 -309 -162 94
6153I4l4m9j24N6L0j88J45M6J48r7j69K60N0N4J77l88k21L84M7ol50K8K16J63
$$ 94 60 11 -113 -57 -27 -215 -70 -24 124 27 -142 118 168 222 399 11 -210 174 221 215 -135 -107 109 272
6177B72j47j6k87N01o1m50K1K25K05m8k20J77K67R4k85l14k8K15J45j16l68J60
$$ 272 125 109 -178 323 262 -188 -167 58 263 215 -5 172 439 533 248 -66 -94 121 266 150 -218 -58
6199e8N42j55m57J49q2O21m94l02K12K92m08m7p1lM61p1q9k87K73K20o9k29k8
$$ -58 484 329 -128 21 -61 560 66 -236 -24 268 -140 -187 -258 -261 200 129 40 -247 26 246 177 -52 -80
6222h0P7J01q6M8M0r5N5j59j59K72r6J28o20L03M38j28l26n3J2L7K97l59J40r
$$ -80 -3 98 12 60 100 5 60 -99 -258 14 -82 46 -574 -271 167 39 -287 -340 -328 -291 6 -353 -213 -222
6246b22N19j27m01k31N0N89j31j67r7K77j60K64n87K88J97J8pm88N64k54j76K15
$$ -222 297 170 -231 -462 -412 177 46 -121 -218 59 -101 163 -424 -136 61 79 72 -416 148 -106 -282 -67
6268f7j98J44J22K24n25J10jP9R5m31J71K34k60K63k41K94J78n6k34n7J26K72
$$ -67 -265 -121 1 225 -300 -190 -191 -112 -17 -448 -277 -43 -303 -40 -281 13 191 135 -99 -156 -30 242
6290B42O0l24J95N8M0m40K18k06L31l3r5Q3J51o3m18J33J78N0J00l30k75K63K83
$$ 242 302 -22 173 231 271 -169 49 -157 174 141 46 129 280 217 -201 -68 110 160 260 -70 -345 -82 201
6313B01r4j66n9K87P9j86k47K83K61j0l54m2l0K75O7k50j34j1K14K11l98j44M84
$$ 201 107 -59 -118 169 248 62 -185 98 359 349 -5 -47 -77 198 265 15 -119 -130 84 295 -103 -247 237
6336B37j94J12m92K44N95o55j25M23j27K35m09K4j31L69K6j76m05O30k36L15r1
$$ 237 43 155 -337 -93 502 -153 -278 145 18 253 -156 -132 -263 106 132 -44 -449 181 -55 260 169
6357A69m39%L16M4l60J41K39K67o92J66n0L9L98k43l17K29J14j0k83J40n6p9O3
$$ 169 -270 -270 46 90 -270 -129 110 377 -315 -149 -199 -160 238 -5 -322 -93 21 11 -272 -132 -188 -267 -204
6380b04o3P7l4M31j77P8k29L54j82k10j69M20J86j31o52O2L49L15m22J50m3K61
$$ -204 -267 -190 -224 207 30 108 -121 233 51 -159 -328 92 278 147 -505 -443 -94 221 -201 -51 -94 167
6402A67jj07l54j14L00J74l08J54P9k3O1j63J27K21r5J20k32k04L43r5p5j86J72
$$ 167 166 59 -295 -409 -109 65 -243 -89 -10 -33 28 -135 -8 213 118 238 6 -198 145 50 -25 -211 -39
6425c9j3Q7l29K75o1J86k42j18L71l4j17q2k2L45L8j25J61o79Q19k48j18Q4n09
$$ -39 -52 35 -294 -19 -80 106 -136 -254 117 83 -34 -116 -138 207 245 120 281 -398 421 173 55 139 -370
6448c70N23j5j65J09k30J25P8J13K4l24k1J4qN0K52j1l0k34k87J33N22k98j65
$$ -370 153 138 -27 82 -148 -23 55 168 192 -132 -153 -139 -147 -97 155 144 114 -120 -407 -274 248 -50 -215
6471b15K34J35k03J87j81pP7k42J82L6J70J14l43p6L68j32Q3l42j02J04K71j23
$$ -215 19 154 -49 138 -43 -50 27 -215 -33 3 173 287 -56 -132 236 104 187 -155 -257 -153 118 -5
6493en8n4O3K66l08m52Q5M28R0jl32M22M1m74K16l83O71l47j6L1k43L93J64j32
$$ -5 -63 -117 -54 212 -96 -548 -463 -35 55 54 -278 144 185 -289 -73 -456 215 -132 -148 -117 -360 33 197 65
6517F5j76j25K61N3j90J55j7M45m00p2l68N20p6Mj06J59L1k22J6l07K59K70n02
$$ 65 -111 -236 25 78 -112 43 26 471 71 -1 -369 151 75 79 -27 132 163 -59 -43 -350 -91 179 -323
6540c23M6M31L4L4l77Q2r3R4j5L43m59K85K62q2n72K13N04k96j71j3K21%M22j90
$$ -323 -277 154 188 222 -155 -73 -166 -72 -87 256 -203 82 344 262 -310 -97 407 111 -60 -73 148 148 570 380
6564C80m15j64L81q4j16l2L66j07j27k31LK33rl4k48P8J54j62m2Q7Oj4J18p9n4
$$ 380 -35 -199 182 98 -18 -50 316 209 82 -149 -146 87 78 44 -204 -126 28 -134 -176 -89 -83 -97 21 -58 -112
6589a12K19j65k07L00O1l3k9K0J81k30l70M05%j31k13L24PJ03l37N3K49k32K2
$$ -112 107 -58 -265 35 96 63 34 54 235 5 -365 40 40 -91 -304 20 27 130 -207 -154 95 -137 -115
6612a15L64k02J56l1m26J92J83k18O6p6k1M16n62J89k68J78L03m5j21k59L77J1
$$ -115 249 47 203 172 -254 -62 121 -97 -31 -107 -128 288 -274 -85 -353 -175 128 83 -38 -297 80 91
6634I1Q2m45J26J0M15m45K28N9L04m70j52R0O5K39k65k23K82L5l9J59l98L2K20
$$ 91 173 -272 -146 -136 279 -166 62 121 425 -45 -197 -107 -42 197 -68 -291 -9 26 -13 146 -252 -220 0
6657@j89K03k62O30k48k07O2K27J30k59j16NnQ6J09O7k35K5L16j47m13J82L26
$$ 0 -189 14 -248 382 134 -73 -11 216 346 87 -29 -24 -29 57 166 233 -2 23 339 192 -221 -39 287
6680B87l44j03K12j08J28J22k30q9J0L11j2m94J08J63L36n71J07K09K26k9k75
$$ 287 -57 -160 52 -56 72 194 -36 -125 -115 196 184 -310 -202 -39 297 -274 -167 42 268 239 -36
6701c6r5L92j02l41J46j89M65j48M8o1j72L12R4l59K42k37R7k16Q9L0J27n5j58
$$ -36 -131 261 159 -182 -36 -225 240 92 140 79 -93 219 313 -46 196 -41 56 -160 -71 -41 86 31 -127
6724a27K52L1j37q6j44L99k42K3j4l72M17K21J57n04p2J56J08k7r0L8j54K59j0
$$ -127 125 156 19 -67 -211 188 -54 -31 -45 -417 0 221 378 -126 -198 -42 66 39 -51 -13 -167 92 82
6747H2j89j35L22j7Lk64K92q6l9k74r3J92J49P4k36j40L82Q9k91K7m1J9M7J01
$$ 82 -107 -242 80 63 66 -198 94 8 -31 -305 -398 -206 -57 17 -219 -359 23 112 -179 -152 -193 -174 -127 -26
6771b6Q0p6K6J08n5m62M98m7N3l75oJ85k59M96n12K99R1J45l01j6l10M45K46k81
$$ -26 54 -22 4 112 57 -405 93 46 99 -276 -282 -97 -356 140 -372 -73 18 163 -138 -154 -464 -19 227 -54
6795e4k27J82N38o48M14j88j08J54R6p0k45M36k54L4m59J33N59k07j18l34L78
$$ -54 -281 -99 439 -209 205 17 -91 63 159 89 -156 280 26 60 -399 -266 293 86 -32 -366 12
6816A2J98p1l8M2J04j03r6l85p4P15l3k85k93L98J94O4j41n52N22J08j26n98N36
$$ 12 210 139 101 143 247 144 48 -337 -411 304 271 -14 -307 91 285 349 208 -344 178 286 160 -438 98
6839I8N5k19l8J40k3L23m6n15J59O8M14m48k55J90O1M25k62q3j04L44j02j06n35
$$ 98 153 -66 -104 36 13 336 290 -225 -66 2 416 -32 -287 -97 -36 389 127 44 -60 284 182 76 -459
6862d59P70j90k29j7RK27j67J85m20K68K07M8k82j14K00R9j75O3j4j45L47j34
$$ -459 311 121 -108 -125 -116 111 -56 129 -291 -23 184 232 -50 -164 36 135 -40 23 9 -136 211 77
6884G7k40J47K50p5j29p6j71K60O3j96O4P6k03L2l32K20J37p2K67l35j2J43K12
$$ 77 -163 -16 234 159 30 -46 -217 43 106 -90 -26 50 -153 -121 -453 -233 -96 -168 99 -236 -248 -105 107
6907A07J01m38J58L04o1k24L2J30J61l46L2l13K59R3P5j43j51M26j78jj5k5K18
$$ 107 208 -230 -72 232 171 -53 -21 109 270 -76 -44 -357 -98 -5 70 -73 -224 202 24 23 8 -17 201
6930B01j13r8j8K48Q0m71r7N4J50K00j94j55J48K04ork82O12L1j22m69k08M18
$$ 201 88 -10 -28 220 300 -171 -268 -214 -64 136 -58 -213 -65 139 133 124 -158 454 485 363 -106 -314 104
6953A04n9j9R8J36j9O8o09J63JM40j94j05J35j45L20l58j5k44M32J72l44l70L82
$$ 104 45 26 124 260 241 309 -300 -137 -136 304 110 5 140 -5 315 -43 -58 -302 130 302 -42 -412 -30
6976c0J22l58kJ13J27K53k75O4J88j5k64j42l02N18%Q2j54j25J12M34j63m01L7
$$ -30 92 -266 -268 -155 -28 225 -50 14 202 187 -77 -219 -521 -3 -3 79 -75 -200 -88 346 183 -218 -181
6999a81J12Nj13JK55l6J66k37Q0o8P9P1l53O8N9L68k16j10j9K78j30j94j4K58
$$ -181 -69 -64 -177 -176 79 43 209 -28 52 -16 63 134 -219 -151 -92 276 60 -50 -69 209 79 -115 -129 129
7023A29p1K80l22o8J53j48j11J49r9L78k28j69k74M73k6j59R5l7k04N09p3m29
$$ 129 58 338 16 -52 101 -47 -158 -9 -108 270 42 -127 -401 72 46 -113 -18 -55 -259 250 177 -252
7045b52J10J92q7J37k62J03K81p2j59j58K64m5N36p85L36j93R2j58O9j03J27l
$$ -252 -142 50 -37 100 -162 -59 222 150 -9 -167 97 52 588 -197 139 -54 38 -120 -51 -154 -27 -30
7067c0K3l50M63k43J33J00m52L12K1q6m8J58k23J70J64k0q6L16K08m69pk47K79
$$ -30 -7 -357 106 -137 -4 96 -356 -44 -23 -109 -157 1 -222 -52 112 92 6 322 530 61 54 -193 86
7090H6p9k55J42l2L70o6j23j96j23N03n5m68N68j91J86j70k20K95k65K64j48k12
$$ 86 7 -248 -106 -138 232 166 43 -153 -276 227 172 -296 272 81 267 97 -123 172 -93 171 23 -189
7112a89J29P8j5j87K04J06J22m4j69L0O9j94J35j60L14l0j56J83m33K39K89m73
$$ -189 -60 18 3 -184 20 126 248 204 35 65 134 -60 75 -85 229 199 43 226 -207 32 321 -152
7134a52J15l5p5J95l01K59J58J56l70j88k1L60j1k58j46K15J57j0m55K94O2J16
$$ -152 -37 -72 -147 48 -253 6 164 320 -50 -238 -259 101 90 -168 -314 -99 58 48 -407 -113 -51 65
7156F5J38m26P5MK90j97j90m6M81j03k94J55p7K4J49l05K27O1J87j73p6J51k12
$$ 65 203 -223 -148 -144 146 -51 -241 -287 194 91 -203 -48 -125 -101 48 -257 -30 31 218 45 -31 120 -92
7179i2J43p0l37K19j69L50jj73K7K07J18n99L53k52J8M31n0j40p0K89l34K11l5
$$ -92 51 -19 -356 -137 -306 44 43 -130 -103 104 222 -377 -24 -276 -258 173 123 -17 -87 202 -132 79 44
7202D4j21K23J31j66J43j57K10l75K74j90R9J30k94K14J15k84M8k2J64p0L6J0
$$ 44 -77 146 277 111 254 97 307 -68 206 16 115 245 -49 165 280 -4 44 22 186 116 152 162
7224A62k33M2J25J20k64l61M53l8r5M7n5K20m4O4l25J79N3j37M02l21k37M06o6
$$ 162 -71 -29 96 216 -48 -409 44 6 -89 -42 -97 123 79 143 -182 -3 50 -87 315 -6 -243 163 97
7247I7l52J16L70J01m07q5L0J57k5mj76P5L58m06Q0r1L04M9j48l96R4K66L27l55
$$ 97 -255 -139 231 332 -75 -160 -130 27 2 -2 -178 -103 255 -151 -71 -162 142 191 43 -353 -259 7 334 -21
7271b1j68N00j65J91l53j61K23K45k40k36o0N38k7l41j19L10k59l5J71k71L61
$$ -21 -189 311 146 337 -16 -177 46 291 51 -185 -245 293 266 -75 -194 116 -143 -178 -7 -278 83
7292H3K0j11nK4K32m7l33l48O40j39r4J5j92L44J14l87J24J62l3j54j45J31K66
$$ 83 103 -8 -13 11 243 196 -137 -485 155 16 -78 -63 -255 89 203 -184 -60 102 69 -85 -230 -99 167
7315A67j93K4k22l3M78k28M1j72J56K71l46P2m0J5K68%j34j88J14r1J68r3j44
$$ 167 -26 -2 -224 -257 221 -7 34 -138 18 289 -57 15 -25 -10 258 258 124 -64 50 -41 127 34 -110
7338a10R6J60k14J73K1m6j2k42P5J70j37nL16j01Rj46L8j24J6R0p2J53j54l1K30
$$ -110 -14 146 -68 105 126 80 68 -174 -99 71 -66 -71 245 144 153 7 45 -79 -63 27 -45 108 -46 -77 153
7363A53k07J44j48n0J02P1j86K70Q0J26n89L15j17r5J25J03l38K37J85n5j60j77
$$ 153 -54 90 -58 -108 -6 65 -121 149 229 355 -234 81 -36 -131 -6 97 -241 -4 181 126 -34 -211
7385b11K61J16l21L0R6J17J55j60k41m9M67o4l75m4Q6o7L03j00j87Q4J60q0k14
$$ -211 50 166 -155 -125 -29 88 243 83 -158 -207 260 196 -179 -223 -137 -204 99 -1 -188 -104 56 -24 -238
7408b38L6K22R1k47r1J54J90Q3l94K01l5L2j3j61o2M72k04K7k20q0L08j97mJ78
$$ -238 -202 20 111 -136 -227 -73 117 200 -194 7 -28 4 -9 -170 -232 240 36 63 -157 -237 71 -126 -130 48
7432D8M9R5J23o82K25K40k29K27j5o4J62k28l6K39j9J0k10k35L33J07J12k89l46
$$ 48 97 192 315 -367 -142 98 -131 96 81 17 179 -49 -85 154 135 145 -65 -300 33 140 252 -37 -383
7455c83O09l23M51j58j47O0P2j33o3l26O01K56o43L05m86M83L8j64j53K55J8j11
$$ -383 226 -97 354 196 49 109 181 48 -15 -341 260 516 -127 178 -308 175 213 49 -104 151 169 58
7477E8j44J73J31j44j19O5p1J37K84m64Nj57K05L39j99Pk48K83J4l39K81O0j68
$$ 58 -86 87 218 74 -45 20 -51 86 370 -94 -89 -246 -41 298 99 106 -142 141 155 -184 97 157 -11
7500a1L42n11K05k89L17j15l8J68q5P0j83K05J7j82J18o4J33J7r9n7J70m74N56
$$ -11 331 -180 25 -264 53 -62 -100 68 -17 53 -130 75 92 -90 28 -36 97 114 15 -42 128 -346 210
7523B10k43j0j08JK82r5Ml27K19J63j75j13M73k89k3r2J58j37K20j97j56J73j7
$$ 210 -33 -43 -151 -150 132 37 41 -286 -67 96 -79 -192 281 -8 -31 -123 35 -102 118 -79 -235 -62 -79
7546g9K58k16j25m9Q5J84N3j44Lj14P3R8m54N87k75K7q6q7L34R7M3l12J28q1J28
$$ -79 179 -37 -162 -211 -126 58 111 -33 -30 -144 -71 27 -427 160 -115 -88 -174 -261 73 170 213 -99 29 -52 76
7571G6k28k0L22P3k42n7J48k72L16jk52O0J35lJ60l24M0K91P5k54m9q6J46J43
$$ 76 -152 -172 150 223 -19 -76 72 -200 116 115 -137 -77 58 55 215 -109 -69 222 297 43 -6 -92 54 197
7595A97n7m80K23L39k44R3nQ0J40n43J80R0L11l10K1j41n9N37p44L43J63k22K92
$$ 197 140 -340 -117 222 -22 71 66 146 286 -257 -77 13 324 14 35 -106 -165 372 -372 -29 134 -88 204
7618B04l35j83J43M86l30R6j43J6L78n72M6N1K24L2k8j99J96k68K07J6j28K31
$$ 204 -131 -314 -171 315 -15 81 -62 -46 332 -240 -194 -143 81 113 85 -114 82 -186 21 37 -91 140
7640A40pJ8l04L70j61m6M6K16J43m26K75n12K99k52L37j98j90J17N16m22j29M19
$$ 140 133 151 -153 217 56 10 56 272 415 -11 264 -248 51 -201 136 -62 -252 -135 381 -41 -170 249
7662B49k35q0L23l57J13k94J62J27n8o6M1K1o5n9K70k34J79k30P0J97r0L9K2j47
$$ 249 14 -66 257 -100 13 -281 -119 8 -50 -116 -75 -54 -119 -178 92 -142 37 -193 -123 74 -16 23 45 -102
7686a02n6J33Ql3o1K9KK08l42Q1J95J16j62m2J58j73m4J29m4j58L63j45q2j8K13
$$ -102 -158 -25 -17 -50 -111 -82 -80 128 -214 -133 62 178 16 -26 132 -41 -85 44 0 -158 205 60 -22 -40 173
7711A73k84J35l13K29j34nK42j93L93k35K58j93j48J02J35j21k35l1L23O7q9j36
$$ 173 -111 24 -289 -60 -194 -199 43 -150 243 8 266 73 -75 27 162 41 -194 -225 98 165 76 -60
7733f0j36K57K11l11K07j82K10k04j85j80P85j85M8k09j47K30k53K80k92M2n9
$$ -60 -196 61 272 -39 168 -14 196 -8 -193 -373 412 227 275 66 -81 149 -104 176 -116 -74 -133
7754a33L84k97k76J20L65J14q9k44L33L3k05j46K96l54J37r1l1K0K51kl28o2O9
$$ -133 251 -46 -322 -202 163 277 188 -56 277 310 105 -41 255 -99 38 -53 -84 -64 187 185 -143 -205 -136
7777a36J16N1j07J4K7n0j27K10j16J70P3j24R3l41J91m3P6j7M00k59KQ4l67J40
$$ -136 -20 31 -76 -62 -35 -85 -212 -2 -118 52 125 1 94 -247 -56 -99 -23 -40 360 101 103 187 -180 -40
7801d0k13K01J07j69J40J90k44J82k82k9K20m37N56m10K5J16J0r3J73j48m2j83
$$ -40 -253 -52 55 -114 26 216 -28 154 -128 -157 63 -374 182 -228 -203 -87 -77 -170 3 -145 -187 -370
7823c70L08L08Jk38m4J76j5K28m81L33J12k18n6M8q1j19J19l17L40Qk35J73K9
$$ -370 -62 246 247 9 -35 141 126 354 -127 206 318 100 44 92 11 -108 11 -306 34 42 -193 -20 9
7846IQ4m8j00J11p6j81K77o9K86m15O2L47j61m9Q5P7j19L48o47J95J81r2l8j77
$$ 9 93 45 -55 56 -20 -201 76 7 293 -122 -60 287 126 77 162 239 120 468 -179 16 197 105 67 -110
7870a10Q2K47J56o52L7M10j38M2O3o5k59K07J59J40m32K72l48K89j63M3J17m6
$$ -110 -28 219 375 -277 -240 170 32 74 137 72 -187 20 179 319 -113 159 -189 100 -63 -20 97 51
7892E1k76J25J79qk91N3j26M42k8l63K70J19j05K32l29mO7K21l50l5L83k26K81
$$ 51 -225 -100 79 71 -220 -167 -293 149 121 -242 28 147 42 274 -55 -59 8 229 -121 -156 227 1 282
7915B82o83K38n5L87k27J96k56K49k21J52Q6rR1m71J19J45J37j13J99l34M8J5
$$ 282 -401 -163 -218 169 -58 138 -118 131 -90 62 148 139 230 -241 -122 23 160 47 246 -88 -40 -25
7937b5L24k95j28N5j8J46Ok85K78k92K61j59K72j45R4p3R8r5O7P6l72M4K09k34
$$ -25 299 4 -124 -69 -87 59 65 -220 58 -234 27 -132 140 -5 89 16 114 19 86 162 -210 -166 43 -191
7961a91l9L65k85R9r4J49R0j17J03j88RJ05p2k38K21J31L3m3N9q6P3q6m5K45j03
$$ -191 -230 135 -150 -51 -145 4 94 -23 80 -108 -99 6 -66 -304 -83 48 81 38 97 11 84 -2 -47 198 95
7986I5J95l43Q6qJ46l94M88j03J9j41l7J74j42P6r1N7j61K08p6j19l43L74K99
$$ 95 290 -53 33 25 171 -223 265 162 181 40 3 177 35 111 20 77 -84 124 48 -71 -414 -40 259
8009B59j22l9k22JJ11j7P5k20K54k41J00r6L49r3r3J64lk29J20J57m41L55j43
$$ 259 137 98 -124 -123 -12 -29 46 -174 80 -161 -61 -157 192 99 6 170 167 -62 58 215 -226 129 -14
8032a4j35K22j86j47J53Q5k55L02J0j08L36l38J49J71j31j07N4l37L59L7l9k46
$$ -14 -149 73 -113 -260 -107 -22 -277 25 35 -73 263 -75 74 245 114 7 61 -276 83 120 81 -165
8054a65J49L06l21K7k08J45K4N4k61J43J78J40m80J44M96l07J11k75J22q5j59
$$ -165 -16 290 -31 -4 -212 -67 -43 11 -250 -107 71 211 -269 -125 371 64 175 -100 22 -63 -222
8075b22L83j5J5j23R4k56K13p7NL1j39L7K72j9q7j31j17M61j35k89J90o2o5L77
$$ -222 161 146 161 38 132 -124 89 12 17 48 -91 -54 218 199 112 -19 -136 325 190 -99 91 29 -36 341
8099C41j54m03L3P6o9J66j56L00j33K65m91M11j4n3j0Q0j81J71k19k0j16K94Q2
$$ 341 187 -216 -183 -107 -176 -10 -166 134 1 266 -225 186 172 119 109 189 8 179 -40 -60 -176 118 200
8122B00N5r8l52K72q5J45l43j03L51j77j02N47k19j05K27j16j29M48n82L26k23
$$ 200 255 157 -195 77 -8 137 -206 -309 42 -135 -237 310 91 -14 213 97 -32 416 -166 160 -63
8143f3K64j75L7l17K82P3k44J52k0o4J85m2o0J55j7j32J16m54K56Q0j21k19r8
$$ -63 201 26 63 -254 28 101 -143 9 -11 -75 110 68 8 163 146 14 130 -324 -68 12 -109 -328 -426
8166d26M37J93l9k78mj09J83N6k10j23K91K59j85j4j40l2P4M3j51J2J31O1k08
$$ -426 11 204 165 -113 -117 -226 -43 13 -197 -320 -29 230 45 31 -109 -141 -67 -24 -175 -163 -32 29 -179
8189a79K6j03
$$ -179 -153 -256
8191b56
$$ Imaginary data points
##PAGE= N=2
##DATA TABLE= (X++(I..I)), XYDATA
0@%%%%OoQj6J6j6K4l3M1n1O0p3Q8j06J30j53J78k10K42k81L25l71M23m81N47o18
$$ 0 0 0 0 0 6 0 8 -8 8 -8 16 -17 24 -27 33 -40 48 -58 72 -81 97 -113 129 -152 173 -198 225 -256 291 -327
30c27O96p82Q77r81J095j222J360j511J677j860K061k279K522k796L099l435L815
$$ -327 369 -413 464 -517 578 -644 716 -795 882 -978 1083 -1196 1326 -1470 1629 -1806 2009
47B009m248M742n314N990o797P779r011J0608j2770J5878k0752K9553n0362J83857
$$ 2009 -2239 2503 -2811 3179 -3618 4161 -4850 5758 -7012 8866 -11886 17667 -32695 151162
61A51162J56413m05860q7735K37721J22253k28966j23855J43171J48289p7484
$$ 151162 307575 -98285 -186020 51701 173954 -55012 -178867 -35696 112593 35109
71C5109r6410K2360P7347J4729j8121m1096k7680J9527N4661j0979o1420p316
$$ 35109 -61301 -38941 38406 53135 35014 -6082 -33762 -14235 40426 29447 -31973 -39289
83c9289O5608J7801o0096l7845M9361N4414j5615n2692j974M6897J3899o2119
$$ -39289 26319 44120 -15976 -53821 -4460 49954 34339 -18353 -20327 26570 40469 -21650
95b1650m9729M5773P5367j2618o3518P503O0830o000o2470p375M8365P654l6303
$$ -21650 -71379 -25606 49761 37143 -26375 -18872 41958 35958 -26512 -33887 14478 22132 -14171
108a4171q495J6920K926O950J9531j7451m2985J5666N7261j1072o3235J3013P3763
$$ -14171 -22666 -5746 -2820 4130 23661 6210 -36775 -21109 36152 25080 -38155 -25142 48621
121D8621r341q3708n301P5317Q877p2213j2430O8087K3055n1155k1603L9719K0588
$$ 48621 39280 -44428 -49729 25588 34465 -37748 -50178 17909 40964 -10191 -31794 7925 28513
134B8513l0178j9919J6697J4177j0864j3215J664J0171R301J426q149j0572M78
$$ 28513 -1665 -21584 -4887 9290 -1574 -14789 -13125 -2954 6347 7773 -376 -10948 -10470
147a0470J1023P516o798j3087J240J9214M784k5406j3316L0647K7289k8557l7459
$$ -10470 553 8069 1271 -11816 -10576 8638 13422 -11984 -25300 5347 32636 4079 -33380
160c3380K2496M1900j8775m7560J1858M6829l528m1392J521L7757M461k7664m567
$$ -33380 -10884 31016 12241 -35319 -23461 23368 19840 -21552 -20031 17726 22187 -5477 -10044
173a0044J9612L633j2204p851n125j096J6637J4662j7102k0375K1267K9341k1084
$$ -10044 9568 13201 997 -6854 -11979 -13075 3562 18224 1122 -19253 2014 31355 10271
186A0271l9714J5855M6796o409m8665o100M5620J7833l7993k8568K4746L4214
$$ 10271 -29443 -13588 33208 26799 -21866 -27966 17654 35487 -2506 -31074 -6328 27886
198B7886j0371l5949n475L3480K0303k2309k7704J1822L0688j198l0924j1380
$$ 27886 17515 -18434 -23909 9571 29874 7565 -20139 -8317 22371 21173 -9751 -21131
210b1131K3870K1847p719k5754j2029J6779K2331p138l1588j437M1915K0236m2056
$$ -21131 2739 24586 16867 -8887 -20916 -4137 18194 11056 -20532 -21969 19946 40182 -1874
223a874l6302L3296M5655k3285n1776P959M9796N931l9372j4711K6776J7634j4817
$$ -1874 -38176 -4880 40775 17490 -34286 -26327 23469 29400 -9972 -24683 2093 19727 4910
236D910k1377j824J7001J6905n289k0376k205K4969R422k8517k1275K1694K8036
$$ 4910 -16467 -18291 -1290 15615 10326 -10050 -12255 12714 22136 -6381 -27656 -5962 22074
249B2074j3230k9589L437K6992M125k2789j2985J7223K1829m777k4628o347K3878
$$ 22074 8844 -20745 -17308 9684 13809 -8980 -21965 -4742 17087 12310 -12318 -18665 5213
262E213J5526k0245k3278J2319K3392p205k2168M061K0801K625j3710p031R89
$$ 5213 20739 494 -22784 -10465 12927 5722 -16446 -12385 8416 11041 -2669 -9700 -8711
275h711K106O018L647o887j393J6707N744k4343j5439K2117J8213k3184k0533
$$ -8711 -6605 -587 3060 -3827 -5220 11487 17231 -7112 -22551 -434 17779 -5405 -25938
288b5938K3514K4796k0467k4729J7510K5941j0716k4070L603J7609J777r685m149
$$ -25938 -2424 22372 1905 -22824 -5314 20627 9911 -14159 -10556 7053 8830 -855 -5004
301e004K821P264L594r820j4126O649K0873L52k0556k797K1379N524k1341j1485
$$ -5004 -2183 5081 8675 -1145 -15271 -8622 12251 12603 -7953 -10750 10629 16153 -5188 -16673
315a6673J6240J6806n981j5115j919J2050R188j1375j8259L446K3609M067k5445
$$ -16673 -433 16373 10392 -4723 -6642 5408 14596 3221 -15038 -11592 12017 16084 -9361
328i361r939K8541K0087k3142k4968J4806K3320q994k1903k26J5778P726m049
$$ -9361 -19300 9241 29328 6186 -18782 -3976 19344 10350 -11553 -11779 3999 11725 7676
341G676j0183p344Q827J7717n587k6674j709L2439J0432l4000j8657L1457K6544
$$ 7676 -2507 -9851 -1024 16693 11106 -15568 -17277 15162 25594 -8406 -27063 4394 30938
354C0938k2937k9644J2304K6858n539k5190m366J9231J3256r423j7236m1J9944
$$ 30938 8001 -21643 -9339 17519 11980 -13210 -17576 1655 14911 5488 -11748 -11789 8155
367H155J1438j7429k0049J0759K3264n145k5827k624K3265J0740j7431j6517O935
$$ 8155 19593 2164 -17885 -7126 16138 10993 -14834 -17458 5807 16547 -884 -17401 -10466
380a0466J8691N146j6004j4665R890K2813k708k8454o589K9112J6782k5020k1177
$$ -10466 8225 13371 -2633 -17298 -7408 15405 12697 -15757 -22346 6766 23548 -1472 -22649
393b2649J8407K2834j3000k5502M176J9716L064j1109m625N100R106M751p487
$$ -22649 -4242 18592 5592 -19910 -15734 3982 7046 -4063 -8688 -3588 5518 10269 2782
406B782j4069J818J7842Q55k2648o604K5131J4666k1022j9007J6953K0481j2389
$$ 2782 -11287 -9469 8373 9228 -13420 -20024 5107 19773 -1249 -20256 -3303 17178 4789
419D789k2327L991K1546N480j3900q689P820J0487l194j3630l938J3582R362r363
$$ 4789 -17538 -13547 7999 13479 -421 -9110 -1290 9197 6003 -7627 -11565 2017 11379 2016
433B016j2535M858J2882j151j0849q54Q739M874m482n314M94O059L526o807j1458
$$ 2016 -10519 -5661 7221 6070 -4779 -5633 3106 7980 3498 -1816 -1322 4737 8263 1456 -10002
448a0002L811J4761p89j6172N17K1807M286k3329j0922J9167J1955j6085j1295
$$ -10002 -6191 8570 7781 -8391 -7874 13933 18219 -5110 -16032 3135 15090 -995 -12290
461a2290J4470J4033q699j3429J867P585K083l299o059k657O003R888m127j1987
$$ -12290 2180 16213 7514 -5915 -4048 3537 5620 2321 -3738 -6395 -392 9496 5369 -6618
475f618L433J6649j268k1464n469K0072J2291j5506j6105R139J6957l596j8303
$$ -6618 -3185 13464 12196 -9268 -14737 5335 17626 2120 -13985 -4846 12111 8515 -9788
488i788l908J8468J3044j3471j9857N086K2738J942k2138q240J9049J3449j4367
$$ -9788 -13696 4772 17816 4345 -15512 -10426 12312 14254 -7884 -16124 2925 16374 2007
501B007j6137N865J5402K569j1305r360J780J2464P063j2077j3995J2311K3150
$$ 2007 -14130 -8265 7137 9706 -1599 -10959 -9179 3285 10348 -1729 -15724 -3413 19737
514A9737q798l0564n36L2507Q425l0778j4623K5771J8356k0019k0922J2886K1853
$$ 19737 10939 -19625 -20161 12346 20771 -10007 -24630 1141 19497 -522 -21444 -8558 13295
527A3295j721j8229p389R534J1697J12j2561p732J1328J4798p462k0506N82K2201
$$ 13295 11574 -6655 -14044 -4510 7187 7299 -5262 -12994 -1666 13132 5670 -14836 -14254 7947
541G947P886j9739j5976J2711K0753l816j9774l290J9478J1704j6375k0097R132
$$ 7947 15833 -3906 -19882 -7171 13582 9766 -10008 -13298 6180 17884 1509 -18588 -9456
554i456K3411j583k3070l945K0281Q046j6700j0790J3000J2571n792j0374JN357
$$ -9456 13955 12372 -10698 -14643 5638 13684 -3016 -13806 -806 11765 5973 -4401 -4400 957
568I57L683K50o583n901P337J2413n523j7742K745K1144J698k3692p182K1796
$$ 957 4640 4890 -1693 -7594 -257 12156 6633 -11109 -8364 12780 14478 -9214 -16396 5400
582E400J1306j6571j2476J3628J4041q147j4822J094J0655K765o318m483L013
$$ 5400 16706 135 -12341 1287 15328 7181 -7641 -6547 4108 6873 555 -3928 -915
595i15O244N40p160m130N791O569l468p250J765P976R96p147m482M208N512k096
$$ -915 5329 5869 -1291 -5421 370 6939 3471 -3779 -2014 5962 6958 -189 -4671 -463 5049 2953
611B953p678q63J0338O595j0855j2032P676J4656n527j7167L976J9894J163j8630
$$ 2953 -4725 -5588 4750 11345 490 -11542 -3866 10790 5263 -11904 -7928 11966 13129 -5501
625e501n049J4567N032j2944o929P775P499j338l203k357l98M397L680p600r095
$$ -5501 -10550 4017 9049 -3895 -10824 -3049 4450 3112 -91 -2448 -2846 1551 5231 -2369 -11464
640a1464Q290J4833o075j8067K384K0422J436k1287p602J8043J3127j2892j5759
$$ -11464 -3174 11659 5584 -12483 -10099 10323 11759 -9528 -17130 913 14040 1148 -14611
653a4611O486J6942J174j5861q612J1336J4140m397j6103j995J5658Q039j3455
$$ -14611 -8125 8817 9991 -5870 -14482 -3146 10994 6597 -9506 -11501 4157 12196 -1259
666a259j3456P067J4389J140j2034n874R095J1011l548j5211m537J5348J1624
$$ -1259 -14715 -7648 6741 7881 -4153 -10027 -932 10079 6531 -8680 -13217 2131 13755
679A3755j2615j7847R479K2440m162k3425j455K1842O055j8951r609J3953J1900
$$ 13755 1140 -16707 -7228 15212 11050 -12375 -13830 8012 14067 -4884 -14493 -540 11360
692A1360n436j0848j422P512O470k692r472m246J1391J0150j0273j5421O646J8796
$$ 11360 5924 -4924 -6346 1166 7636 4944 -4528 -8774 2617 12767 2494 -12927 -6281 12515
706A2515j083j8906l663J6633Q593j2962j1487P304J2388r73j1815m414J0096
$$ 12515 11432 -7474 -11137 5496 14089 1127 -10360 -3056 9332 8359 -3456 -7870 2226
719B226Q288o534j1546K771J2764P60j2461l241R974N953o574o661K768N270Q93
$$ 2226 10514 3980 -7566 -4795 7969 8729 -3732 -6973 3001 8954 2380 -4281 -1513 3757 4650
734D650l034m547J85O493L841r071q336Q931J2189p161j4199N432J5533l392j5181
$$ 4650 1616 -2931 -2746 3747 7588 -1483 -9819 -888 11301 4140 -10059 -4627 10906 7514 -7667
749g667m83J3547J698j0953k454Q049L272m647k981P81J704J481p45m982k9O866
$$ -7667 -8150 5397 7095 -3858 -6312 1737 5009 362 -2619 -1838 -134 1347 602 -4380 -4409 2457
765B457L010p519m947P920O198q033q962N621J0209j362r323k278P264N340m253
$$ 2457 5467 -2052 -6999 921 7119 -914 -9876 -4255 5954 4592 -4731 -7009 255 5595 1342
780A342r586M91J1812M929j1682r300R903J2640p302j5084L380J4890L89j2364
$$ 1342 -8244 -7753 4059 8988 -2694 -11994 -2091 10549 3247 -11837 -8457 6433 6822 -5542
794e542l373R302N699l653o473k667M729P526j278j1525j812J4797P311j6342
$$ -5542 -8915 387 6086 2433 -4040 -6707 -1978 5548 4270 -7255 -9067 5730 13041 -3301
808c301j3038J3720J7757r958j9000M556J9499J174j6199o662J0983R752m538
$$ -3301 -16339 -2619 15138 5180 -13820 -9264 10235 11409 -4790 -11452 -469 9283 4745
821D745j0802k182J0762Q482p255j3464K167J5180L615j4539p832J1671J0947
$$ 4745 -6057 -8239 2523 11005 3750 -9714 -7547 7633 11248 -3291 -11123 548 11495
834A1495o903j1464J414J0286L451q060p827M177J1901J907j3630p539J2182J2145
$$ 11495 4592 -6872 -5458 4828 8279 219 -7608 -3431 8470 10377 -3253 -10792 1390 13535
848A3535r816j5278O973J6328k638j5710k108J3521M957q992o947L226P675K651
$$ 13535 3719 -11559 -4586 11742 9104 -6606 -8714 4807 9764 772 -6175 -2949 4726 7377
862G377n147q202Q39J1213L198j2148p405J2052J0641r255j3529O498J3933l818
$$ 7377 2230 -5972 -5133 6080 9278 -2870 -10275 1777 12418 3163 -10366 -3868 10065 6247
876F247j3236n05J0312M206n797n629K262M706N65m831l736M017O787k293q416
$$ 6247 -6989 -7494 2818 7024 1227 -4402 -2140 2566 3131 -1700 -5436 -1419 5368 3075 -5341
891e341l5Q749K202p842m535N635N567k335n462r60M065L340k242n535M1P745
$$ -5341 -5376 3373 5575 -2267 -6802 -1167 4400 2065 -3397 -4357 -292 3048 806 -4729 -4688 3057
907C057K310r521n036R381Q127q026j0141N331R628l179q369L216Q652j655q617
$$ 3057 5367 -4154 -9190 191 8318 292 -9849 -4518 5110 1931 -6438 -3222 5430 3775 -4842
922d842j575N550M015j085l851k993K848N701j800p424L2R825J780j0491m986
$$ -4842 -6417 -867 3148 2063 -1788 -4781 -1933 3768 1968 -5456 -5424 4401 6181 -4310 -9296
937i296R954Q347o916r915K705J0125J149q527n246N830Q373j022j0301k604J0069
$$ -9296 658 9005 2089 -7826 -5121 5004 6153 -2374 -7620 -1790 6583 5561 -4740 -7344 2725
952B725N912r076q204P204J1430l756j2530q52R884N071o114o117J425O170K520
$$ 2725 8637 -439 -8643 -1439 9991 6235 -6295 -7147 2737 7808 1694 -4423 -2998 3172 5692
967E692n460o486N136J0464k077j4323l091J5104Q878j2488j1898Q733J2524m661
$$ 5692 232 -6254 -1118 9346 7269 -7054 -10145 4959 13837 1349 -10549 -1816 10708 6047
981F047j3365R76J1258M177p879p692K882R177K893q774p630O450J0618k781j2011
$$ 6047 -7318 -6342 4916 9093 1214 -6478 -3596 5581 8474 -300 -7930 -1480 9138 6357 -5654
996e654j517J1543N107r447p748N189R295j659r595k293Q529P298n872j1306J567
$$ -5654 -7171 4372 9479 32 -7716 -2527 6768 5109 -4486 -6779 1750 9048 3176 -8130 -6563
1011f563J2647K676j2000o738J0523Q429p954j0033N216J0004j158q830k607M939
$$ -6563 6084 8760 -3240 -9978 545 8974 1020 -9013 -3797 6207 5049 -3781 -6388 -1449
1025a449N475m89n025m059L739P075k140r295n6J0333K289j0251n408R237O872
$$ -1449 4026 3537 -1488 -5547 -1808 5267 3127 -6168 -6224 4109 6398 -3853 -9261 -24 6848
1040F848o606p838L926Q045j145o215k015N013M064l159n744J36N975K244n580
$$ 6848 242 -7596 -3670 4375 3230 -2985 -5000 13 4077 918 -4826 -4690 1285 3529 -2051
1055b051m102N419O037l939o844J255O372J230m761k704K397L558P38l702k749
$$ -2051 -6153 -734 5303 1364 -5480 -4225 2147 3377 -1384 -4088 -1691 1867 2605 -1097 -3846
1070c846L730N290l573q329J787R595J087r959k132R586M102q216n603P133N986
$$ -3846 -116 5174 1601 -6728 -4941 4654 5741 -4218 -6350 3236 7338 -878 -6481 652 6638
1085F638m824o558J980N558Q17l178l310P90M900K617n022n845M257Q066j635
$$ 6638 1814 -4744 -2764 2794 3611 433 -2877 -2087 2813 5430 408 -5437 -1180 6886 5251
1100E251r777j015J0087M108q973o667O690Q400l326r541j303Q555M690n893p266
$$ 5251 -4526 -5541 4546 8654 -319 -6986 -296 8104 4778 -4763 -6066 2489 7179 1286 -5980
1115e980M014R238r20r505k671Q871N294p161p653L171P990Q80o760l494M235
$$ -5980 -1966 7272 6352 -3153 -5824 3047 8341 1180 -6473 -3302 4688 5568 -1192 -4686 -451
1130d51O209r36q193l872Q222Q006o133j1172L351J2705M71j3522m103J1862O894
$$ -451 5758 4822 -3371 -7243 979 8985 2852 -8320 -4969 7736 8207 -5315 -9418 2444 9338
1145I338q907r478M704R665m29p691k981N386N307j635o780k333O479N622m958
$$ 9338 431 -9047 -4343 5322 4893 -2798 -5779 -393 4914 3279 -3501 -5834 645 6267 1309
1160A309q914K338R245J051r025l564P913O597n147q803J409Q934J987p718n348
$$ 1309 -7605 -5267 3978 5029 -3996 -7560 353 6950 1803 -7000 -5591 3343 5330 -2388 -7736
1175g736O563P526l114r764K37R320K261q283m744N961N927k172n131m42M143
$$ -7736 -1173 6353 3239 -6525 -6288 3032 5293 -2990 -7734 -1773 4154 1982 -3149 -3591 552
1190E52K638j892l902j047M533L215m598n544L732P417k335p848L25Q340J363
$$ 552 3190 1298 -2604 -3651 882 4097 -501 -6045 -2313 5104 2769 -5079 -4754 3586 4949
1205D949p023k851O276L785m668m787L106M874n85m227j710K679L491j449m495
$$ 4949 -2074 -4925 1351 5136 468 -4319 -1213 3661 3076 -1151 -2861 -182 3309 1860 -2635
1220b635m34M676J970l499k899L309M493j462n443p26M489K014l330l928J912
$$ -2635 -3069 1607 3577 78 -2821 488 4981 3519 -1924 -2650 1839 3853 523 -3405 -1493
1235a493M893M8m851k311N395M197n033n698L616P404j921p808J86P186K148o086
$$ -1493 3400 3448 -1403 -3714 1681 5878 845 -4853 -1237 6167 4246 -3562 -3376 3810 5958 -128
1251a28l894L435M183l13n111k055L456M816j275o075j771P701M743o466p579
$$ -128 -4022 -587 3596 3283 -1828 -3883 -427 4389 3114 -2961 -4732 2969 7712 1246 -6333
1266f333L872Q611j869r381j290Q521M065o260o131L601P499k82p654l134O341
$$ -6333 -2461 6150 4281 -5100 -6390 2131 6196 -64 -6195 -2594 4905 4623 -3031 -6165 176
1281A76N948l860p936J239P658J753o729m664N230N962k910p152o79O883M575
$$ 176 6124 2264 -5672 -4433 3225 4978 -1751 -6415 -1185 4777 1867 -5285 -5964 919 5494
1296E494m869o505J954Q216J745r206m920P274P601n471r738K435R623J330q060
$$ 5494 625 -5880 -3926 4290 6035 -3171 -8091 -817 6784 1313 -8425 -5990 3633 4963 -3097
1311c097l680O784N058l209n940j60M903L715l535n265O00O434K145p057m191
$$ -3097 -6777 7 5065 1856 -4084 -4244 659 4374 839 -4426 -3826 2608 4753 -2304 -6495
1326f495N621O732m296q069J456Q765J682p128l514N462N322k568o439o17O638
$$ -6495 -874 5858 1562 -6507 -5051 3714 5396 -1732 -5246 216 5538 2970 -3469 -4086 2552
1341B552J965n563m609L670O448p76o162j470O040K604l668m067J718M454J95
$$ 2552 4517 -1046 -5655 -1985 4463 3687 -2475 -3945 2095 4699 1031 -3036 -1318 3136 3331
1356C331l693k531K394M433j486m198j110M941K395m935l956L800N300j786n591
$$ 3331 -362 -2893 -499 3934 2448 -1750 -2860 2081 4476 -459 -4415 -615 4685 2899 -2692
1371b692J213N023K35m778j272L940K172k858m149P89L843J492k136k455J845
$$ -2692 -1479 3544 3779 -999 -2271 1669 3841 983 -3166 -2377 1466 2958 822 -1633 212
1386B12L207j152m218l28M617K364m991l826K744M793q68m541j372M533K501m221
$$ 212 3419 2267 -1951 -2279 2338 4702 -289 -4115 -1371 3422 2554 -1987 -3359 1174 3675 -546
1402e46m290K977N530L26o298k319N589M478m027o393J849O770l60o717k767N036
$$ -546 -4836 -1859 3671 3997 -2301 -4620 969 5447 1420 -4973 -3124 3646 3286 -3431 -6198 -1162
1418a162M787k455m728K48N351K086m185m670K150O127K05p271l007N893N728
$$ -1162 3625 1170 -3558 -3310 2041 4127 -58 -4728 -2578 3549 3754 -3517 -6524 -631 5097
1433E097m266o564J808P501K39p697k761O524N514l513o542P25O629J954n605
$$ 5097 831 -5733 -3925 3576 3815 -3882 -6643 -119 5395 1882 -4660 -3935 2694 4648 -957
1448i57m399L681N720j604o960j676O638M979m385n889K190O428R77o218l399
$$ -957 -5356 -1675 4045 2441 -4519 -6195 443 5422 1037 -4852 -2662 3766 4743 -1475 -4874
1463d874M638N587k640p501m54P354L731n901n439M241O376k170p167j48O796
$$ -4874 -236 5351 2711 -4790 -5244 2110 5841 -60 -5499 -1258 5118 2948 -4219 -4367 2429
1478B429L169m708m737K631N197J86n023j992L119L713k505n069J46O127K429
$$ 2429 5598 890 -3847 -1216 3981 4167 -856 -2848 271 3984 1479 -3590 -3444 2683 5112
1493E112m883m260L873N355j543n965o93N186K725m517m669K374N534K58n402
$$ 5112 229 -4031 -158 5197 3654 -2311 -3004 2182 4907 390 -4279 -1905 3629 3887 -1515
1508a515j720M409K885l355m020K425M533k55m177r30K933J607j693k279J24J793
$$ -1515 -3235 1174 4059 704 -3316 -891 3642 3387 -790 -1720 1213 2820 1127 -1152 -1028 765
1524G65Q02k593k157J843M062j94m080j097M491J878m589l130M141L680l487m894
$$ 765 1567 -1026 -3183 -1340 2722 2528 -1552 -2649 1842 3720 -869 -3999 142 3822 335 -4559
1540d559J618N344j57l981j516L158K394j917l466O24L176J727k503l184J748
$$ -4559 -2941 2403 2246 -1735 -3251 -93 2301 384 -3082 -2458 718 2445 -58 -3242 -1494
1555a494M031r5m585j414L605K348k928m183J587N119N89m355k206M158L988k867
$$ -1494 2537 2442 -2143 -3557 48 2396 -532 -4715 -3128 1991 2580 -1775 -3981 177 4165 1298
1571A298n481R85N970Q27o213l433N455M504k711n434Q54N479J244m495k823K847
$$ 1298 -4183 -3198 2772 3599 -2614 -6047 -592 3912 1201 -4233 -3379 2100 3344 -1151 -3974 -1127
1587a127L972J11m527k311L757M687k079o479o5O329K153o719l907N640O221l086
$$ -1127 2845 2956 -1571 -3882 -125 4562 2483 -3996 -4061 2268 4421 -2298 -6205 -565 5656 2570
1603B570o481J038O707J332n756l657L824M548j690n252r53N046L335l414m576
$$ 2570 -3911 -2873 3834 5166 -590 -4247 -423 4125 2435 -2817 -3770 1276 4611 1197 -3379
1618c379J248N891Q27n142l486L468N543j729n768o02N536L012m368n805K471
$$ -3379 -2131 3760 4587 -555 -4041 -573 4970 3241 -2527 -3129 2407 5419 1051 -4754 -2283
1633b283O777m84p274j437O726L196m333m472L482M862j470n112m47L008J676
$$ -2283 4494 4010 -3264 -4701 2025 5221 888 -3584 -102 4760 3290 -1822 -2269 739 2415
1648B415j739k619q0K560K344j890l557Q24M879M95n426k322N127L160l444m875
$$ 2415 676 -1943 -2023 537 2881 991 -2566 -1742 3137 3632 -1794 -4116 1011 4171 727 -4148
1664d148K773M869j023n011q02L492K036k860k468J329L397p6k397j092K507J661
$$ -4148 -1375 3494 2471 -2540 -3342 150 2186 -674 -3142 -1813 1584 1508 -889 -1981 526 2187
1680B187j683l057P98K542p3k524j219K238K212r87k687L05K543J762l214k560
$$ 2187 504 -2553 -1755 787 714 -1810 -3029 -791 1421 434 -2253 -1948 595 2357 -857 -3417
1696c417J862M336j486m462K49N341M76n138j933M277K422l315l060K208L225
$$ -3417 -1555 2781 1295 -3167 -2918 2423 2899 -2239 -4172 105 2527 -788 -3848 -1640 1585
1711A585j93k137q56J803J683k14k907j060K131K251k254l248J095M686O69m367
$$ 1585 1392 -745 -1601 202 1885 1671 -1236 -2296 -165 2086 -168 -3416 -2321 2365 3034 -1333
1727a333k152M190L243k697m469R15N060R86n336k848M485M745k034n758l6N159
$$ -1333 -3485 705 3948 1251 -3218 -2303 2757 3743 -1593 -4441 44 4789 2755 -3003 -3039 2120
1743B120J654m909k911L503M499j022m312q90L867K678k090m642R4M349K020m431
$$ 2120 3774 -1135 -4046 -543 3956 2934 -1378 -2268 1599 4277 2187 -2455 -2361 1988 4008 -423
1759d23m228L581O087j457o597J8O322J879n976l688M795M474k652n203K02M598
$$ -423 -4651 -1070 5017 3560 -3037 -3019 3303 5182 -794 -4482 313 4787 2135 -3068 -2866 1732
1775A732K286k884m092Q58M045R87l781l352L747M726j357n835k27N401K308m104
$$ 1732 4018 1134 -2958 -2100 1945 2932 -849 -4201 -454 4272 2915 -2920 -3147 2254 4562 458
1791D58m413J915M649j78n405r46M553L350l163m652K132M784l06n156j191M117
$$ 458 -3955 -2040 2609 2431 -2974 -3920 633 3983 820 -3832 -1700 3084 2778 -2378 -3569 548
1807E48K072k650l277J650K881M61k418k130R85L327j85l274j622L644L717l264
$$ 548 2620 -30 -3307 -1657 1224 1685 -733 -2863 -1878 1449 1264 -2010 -3632 12 3729 465
1823D65m274J848N169o79m841j596L890K212k913k952K154L439m24k559j199K149
$$ 465 -3809 -1961 3208 2529 -2312 -3908 -18 2194 -719 -3671 -1517 1922 1498 -1061 -2260 -111
1839a11K015j121k516J07K330Q37k424j213J760K022j229k106K91K331K47j924
$$ -111 1904 783 -1733 -1626 704 1541 -883 -2096 -336 1686 457 -1649 -1358 973 1220 -704
1855g04j240J325L082l67l185p24L414J840l215l181K359L417j855l958J060M490
$$ -704 -1944 -619 2463 2096 -1089 -1813 1601 3441 226 -2955 -596 2821 966 -2992 -1932 2558
1871B558O21l520j626K469K283j019k779J93J683J554j580k514M61L701Q66l966
$$ 2558 3179 -341 -1967 502 2785 1766 -1013 -820 863 2417 837 -1677 -1216 2485 3351 -615
1887f15k290L149L456k423m034P90M815P34m079k679L777L520j945m347m98M249
$$ -615 -2905 244 3700 1277 -2757 -1967 2848 3582 -497 -3176 601 4121 2176 -2171 -2669 1580
1903A580J443l432l239K605M537l77m732j318L641K834k200l718O36L479Q76l249
$$ 1580 3023 -409 -3648 -1043 3494 3117 -1615 -2933 708 3542 1342 -2376 -1740 1739 2615 -634
1919f34k606K187M097l59m525k094M472L060l567m141K518M971p37n559m89M409
$$ -634 -3240 -1053 3044 2685 -1840 -3934 538 3598 31 -4110 -1592 3379 2642 -2917 -3406 1003
1935A003K048k877l650Q53L608P49l317j701J880L729l94m329q06L993K316k779
$$ 1003 3051 174 -3476 -2623 985 1734 -1583 -3284 -1404 2325 1931 -2398 -3204 789 3105 326
1951C26l487J023M303m47m147r96L173K724j537l863K67L618J355l188k525L006
$$ 326 -3161 -2138 2165 1718 -2429 -3425 -252 2472 935 -2928 -2661 957 2312 -876 -3401 -395
1967c95L233k137l149O38L744J87l082j371J609J676n00j790p48K354J757p92
$$ -395 2838 701 -2448 -1810 1934 2121 -961 -2332 -723 953 453 -1337 -2085 269 2026 1234
1983A234k694n5L162J303l470k466K952K925k297l334J381L560o4l135o79K550
$$ 1234 -1460 -1515 1647 2950 -520 -2986 -34 2891 594 -2740 -1359 2201 2137 -998 -1677 873
1999H73J367k069j714J275K069N0k395p31J902J784j160k735M57K236M24k539
$$ 873 2240 171 -1543 -268 1801 1851 -544 -1275 627 2411 1251 -1484 -1027 1209 1633 -906
$$ [...]
8191B00
##END NTUPLES=NMR FID
##END=
